{"text_format":"1","workbook":"xlsx","n_sheets":7,"sheets":["COMMANDE","ENTREE","SORTIE","STOCK","Bilan marché 2016","1","2"],"not_rendered":{"charts":0,"images":0,"macros":1,"external_links":1,"defined_names":3,"comments":0,"pivot_tables":0},"unopened":[],"bounds":{"document_bytes":16777216,"sheet_cells":100000,"rows_first":2000,"rows_last":500,"rows_between":2000,"halvings":0,"cell_chars":16384,"cell_head_chars":4096},"cells_cut":0,"cells_raw":0,"read":"whole","date_system":"1900"}

{"sheet":"COMMANDE","index":0,"n_rows":31,"n_cols":5,"rows_kept":31,"cut":false,"hidden":false,"merged":[]}
[]
[{"$f":"IF(D7>E7,\"ATTENTION COMMANDE\",\"\")","v":"ATTENTION COMMANDE"}]
[]
[]
[]
["DATE","FOURNISSEUR","ARTICLE","QUANTITE BESEOIN","QUANTIE EN STOCK"]
[null,null,"pain",120,{"$f":"IF(C7=\"\",\"\",VLOOKUP(C7,STOCK!B:D,3,0))","v":0}]
[null,null,"salade verte",120,{"$f":"IF(C8=\"\",\"\",VLOOKUP(C8,STOCK!B:D,3,0))","v":0}]
[null,null,"celeris remoulade",15,{"$f":"IF(C9=\"\",\"\",VLOOKUP(C9,STOCK!B:D,3,0))","v":26}]
[null,null,"mayonnaise seaux",2,{"$f":"IF(C10=\"\",\"\",VLOOKUP(C10,STOCK!B:D,3,0))","v":2}]
[null,null,"huile de tournesol ",5,{"$f":"IF(C11=\"\",\"\",VLOOKUP(C11,STOCK!B:D,3,0))","v":30}]
[null,null,"huile de colza ",5,{"$f":"IF(C12=\"\",\"\",VLOOKUP(C12,STOCK!B:D,3,0))","v":45}]
[null,null,"moutarde seaux",1,{"$f":"IF(C13=\"\",\"\",VLOOKUP(C13,STOCK!B:D,3,0))","v":2}]
[null,null,"betteraves en dés",5,{"$f":"IF(C14=\"\",\"\",VLOOKUP(C14,STOCK!B:D,3,0))","v":27}]
[null,null,"ail frais",1,{"$f":"IF(C15=\"\",\"\",VLOOKUP(C15,STOCK!B:D,3,0))","v":2}]
[null,null,"persil botte",5,{"$f":"IF(C16=\"\",\"\",VLOOKUP(C16,STOCK!B:D,3,0))","v":0}]
[null,null,"pois chiches ",5,{"$f":"IF(C17=\"\",\"\",VLOOKUP(C17,STOCK!B:D,3,0))","v":9}]
[null,null,"poivrons lanieres ",2.5,{"$f":"IF(C18=\"\",\"\",VLOOKUP(C18,STOCK!B:D,3,0))","v":7.5}]
[null,null,"vinaigre balsamique ",2,{"$f":"IF(C19=\"\",\"\",VLOOKUP(C19,STOCK!B:D,3,0))","v":4}]
[null,null,"cordon bleu ","800 parts ",{"$f":"IF(C20=\"\",\"\",VLOOKUP(C20,STOCK!B:D,3,0))","v":100.62}]
[null,null,"petits pois carottes surgeles ",90,{"$f":"IF(C21=\"\",\"\",VLOOKUP(C21,STOCK!B:D,3,0))","v":90}]
[null,null,"oignon surgeles ",5,{"$f":"IF(C22=\"\",\"\",VLOOKUP(C22,STOCK!B:D,3,0))","v":10}]
[null,null,"vin blanc vrac ",4,{"$f":"IF(C23=\"\",\"\",VLOOKUP(C23,STOCK!B:D,3,0))","v":0}]
[null,null,"bouillon de legumes",1,{"$f":"IF(C24=\"\",\"\",VLOOKUP(C24,STOCK!B:D,3,0))","v":11}]
[null,null,"vinaigre",1,{"$f":"IF(C25=\"\",\"\",VLOOKUP(C25,STOCK!B:D,3,0))","v":14}]
[null,null,"bombel",480,{"$f":"IF(C26=\"\",\"\",VLOOKUP(C26,STOCK!B:D,3,0))","v":480}]
[null,null,"vache qui rit",80,{"$f":"IF(C27=\"\",\"\",VLOOKUP(C27,STOCK!B:D,3,0))","v":560}]
[null,null,"st moret ",240,{"$f":"IF(C28=\"\",\"\",VLOOKUP(C28,STOCK!B:D,3,0))","v":423}]
[null,null,"pomme ",400,{"$f":"IF(C29=\"\",\"\",VLOOKUP(C29,STOCK!B:D,3,0))","v":20}]
[null,null,"orange ",200,{"$f":"IF(C30=\"\",\"\",VLOOKUP(C30,STOCK!B:D,3,0))","v":0}]
[null,null,"banane",100,{"$f":"IF(C31=\"\",\"\",VLOOKUP(C31,STOCK!B:D,3,0))","v":0}]

{"sheet":"ENTREE","index":1,"n_rows":56,"n_cols":7,"rows_kept":56,"cut":false,"hidden":false,"merged":[]}
[]
[]
[]
[]
[]
[null,"DATE ","FOURNISSEUR","ARTICLE ","QUANTITE","STOCK","NOUVEAU STOCK ENTREE"]
[1,null,null,"mayonnaise seaux",2,{"$f":"IFERROR(VLOOKUP(D7,STOCK!B:D,3,0),\"\")","v":2}]
[2,null,null,"vache qui rit",80,{"$f":"IFERROR(VLOOKUP(D8,STOCK!B:D,3,0),\"\")","v":560}]
[3,null,null,"bombel",480,{"$f":"IFERROR(VLOOKUP(D9,STOCK!B:D,3,0),\"\")","v":480}]
[4,null,null,"st moret ",240,{"$f":"IFERROR(VLOOKUP(D10,STOCK!B:D,3,0),\"\")","v":423}]
[5,null,null,"cordon bleu",100,{"$f":"IFERROR(VLOOKUP(D11,STOCK!B:D,3,0),\"\")","v":""}]
[6,null,null,"steack haches",96,{"$f":"IFERROR(VLOOKUP(D12,STOCK!B:D,3,0),\"\")","v":""}]
[7,null,null,"feuillete hotdog",312,{"$f":"IFERROR(VLOOKUP(D13,STOCK!B:D,3,0),\"\")","v":""}]
[8,null,null,"feuillete fromage",495,{"$f":"IFERROR(VLOOKUP(D14,STOCK!B:D,3,0),\"\")","v":""}]
[9,null,null,"pomme de terre campagnarde",200,{"$f":"IFERROR(VLOOKUP(D15,STOCK!B:D,3,0),\"\")","v":""}]
[10,null,null,"oignon",10,{"$f":"IFERROR(VLOOKUP(D16,STOCK!B:D,3,0),\"\")","v":""}]
[11,null,null,"petits pois carottes",90,{"$f":"IFERROR(VLOOKUP(D17,STOCK!B:D,3,0),\"\")","v":""}]
[12,null,null,"poivron laniere",10,{"$f":"IFERROR(VLOOKUP(D18,STOCK!B:D,3,0),\"\")","v":""}]
[13,null,null,null,null,{"$f":"IFERROR(VLOOKUP(D19,STOCK!B:D,3,0),\"\")","v":""}]
[14,null,null,null,null,{"$f":"IFERROR(VLOOKUP(D20,STOCK!B:D,3,0),\"\")","v":""}]
[15,null,null,null,null,{"$f":"IFERROR(VLOOKUP(D21,STOCK!B:D,3,0),\"\")","v":""}]
[16,null,null,null,null,{"$f":"IFERROR(VLOOKUP(D22,STOCK!B:D,3,0),\"\")","v":""}]
[17,null,null,null,null,{"$f":"IFERROR(VLOOKUP(D23,STOCK!B:D,3,0),\"\")","v":""}]
[18,null,null,null,null,{"$f":"IFERROR(VLOOKUP(D24,STOCK!B:D,3,0),\"\")","v":""}]
[19,null,null,null,null,{"$f":"IFERROR(VLOOKUP(D25,STOCK!B:D,3,0),\"\")","v":""}]
[20,null,null,null,null,{"$f":"IFERROR(VLOOKUP(D26,STOCK!B:D,3,0),\"\")","v":""}]
[21,null,null,null,null,{"$f":"IFERROR(VLOOKUP(D27,STOCK!B:D,3,0),\"\")","v":""}]
[22,null,null,null,null,{"$f":"IFERROR(VLOOKUP(D28,STOCK!B:D,3,0),\"\")","v":""}]
[23,null,null,null,null,{"$f":"IFERROR(VLOOKUP(D29,STOCK!B:D,3,0),\"\")","v":""}]
[24,null,null,null,null,{"$f":"IFERROR(VLOOKUP(D30,STOCK!B:D,3,0),\"\")","v":""}]
[25,null,null,null,null,{"$f":"IFERROR(VLOOKUP(D31,STOCK!B:D,3,0),\"\")","v":""}]
[26,null,null,null,null,{"$f":"IFERROR(VLOOKUP(D32,STOCK!B:D,3,0),\"\")","v":""}]
[27,null,null,null,null,{"$f":"IFERROR(VLOOKUP(D33,STOCK!B:D,3,0),\"\")","v":""}]
[28,null,null,null,null,{"$f":"IFERROR(VLOOKUP(D34,STOCK!B:D,3,0),\"\")","v":""}]
[29,null,null,null,null,{"$f":"IFERROR(VLOOKUP(D35,STOCK!B:D,3,0),\"\")","v":""}]
[30,null,null,null,null,{"$f":"IFERROR(VLOOKUP(D36,STOCK!B:D,3,0),\"\")","v":""}]
[31,null,null,null,null,{"$f":"IFERROR(VLOOKUP(D37,STOCK!B:D,3,0),\"\")","v":""}]
[32,null,null,null,null,{"$f":"IFERROR(VLOOKUP(D38,STOCK!B:D,3,0),\"\")","v":""}]
[33,null,null,null,null,{"$f":"IFERROR(VLOOKUP(D39,STOCK!B:D,3,0),\"\")","v":""}]
[34,null,null,null,null,{"$f":"IFERROR(VLOOKUP(D40,STOCK!B:D,3,0),\"\")","v":""}]
[35,null,null,null,null,{"$f":"IFERROR(VLOOKUP(D41,STOCK!B:D,3,0),\"\")","v":""}]
[36,null,null,null,null,{"$f":"IFERROR(VLOOKUP(D42,STOCK!B:D,3,0),\"\")","v":""}]
[37,null,null,null,null,{"$f":"IFERROR(VLOOKUP(D43,STOCK!B:D,3,0),\"\")","v":""}]
[38,null,null,null,null,{"$f":"IFERROR(VLOOKUP(D44,STOCK!B:D,3,0),\"\")","v":""}]
[39,null,null,null,null,{"$f":"IFERROR(VLOOKUP(D45,STOCK!B:D,3,0),\"\")","v":""}]
[40,null,null,null,null,{"$f":"IFERROR(VLOOKUP(D46,STOCK!B:D,3,0),\"\")","v":""}]
[41,null,null,null,null,{"$f":"IFERROR(VLOOKUP(D47,STOCK!B:D,3,0),\"\")","v":""}]
[42,null,null,null,null,{"$f":"IFERROR(VLOOKUP(D48,STOCK!B:D,3,0),\"\")","v":""}]
[43,null,null,null,null,{"$f":"IFERROR(VLOOKUP(D49,STOCK!B:D,3,0),\"\")","v":""}]
[44,null,null,null,null,{"$f":"IFERROR(VLOOKUP(D50,STOCK!B:D,3,0),\"\")","v":""}]
[45,null,null,null,null,{"$f":"IFERROR(VLOOKUP(D51,STOCK!B:D,3,0),\"\")","v":""}]
[46,null,null,null,null,{"$f":"IFERROR(VLOOKUP(D52,STOCK!B:D,3,0),\"\")","v":""}]
[47,null,null,null,null,{"$f":"IFERROR(VLOOKUP(D53,STOCK!B:D,3,0),\"\")","v":""}]
[48,null,null,null,null,{"$f":"IFERROR(VLOOKUP(D54,STOCK!B:D,3,0),\"\")","v":""}]
[49,null,null,null,null,{"$f":"IFERROR(VLOOKUP(D55,STOCK!B:D,3,0),\"\")","v":""}]
[50,null,null,null,null,{"$f":"IFERROR(VLOOKUP(D56,STOCK!B:D,3,0),\"\")","v":""}]

{"sheet":"SORTIE","index":2,"n_rows":56,"n_cols":6,"rows_kept":56,"cut":false,"hidden":false,"merged":[]}
[]
[]
[]
[]
[]
[null,"DATE ","ARTICLE ","QUANTITE","STOCK","NOUVEAU STOCK SORTIE"]
[1]
[2]
[3]
[4]
[5]
[6]
[7]
[8]
[9]
[10]
[11]
[12]
[13]
[14]
[15]
[16]
[17]
[18]
[19]
[20]
[21]
[22]
[23]
[24]
[25]
[26]
[27]
[28]
[29]
[30]
[31]
[32]
[33]
[34]
[35]
[36]
[37]
[38]
[39]
[40]
[41]
[42]
[43]
[44]
[45]
[46]
[47]
[48]
[49]
[50]

{"sheet":"STOCK","index":3,"n_rows":401,"n_cols":11,"rows_kept":401,"cut":false,"hidden":false,"merged":[]}
[]
[]
[]
["inventaire au 18/12/15","ARTICLE","STOCK MINI","STOCK INITIAL","ENTREE ","NOUVEAU STOCK ENTREE","SORTIE","NOUVEAU STOCK SORTIE",null,null,"Liste exhaustive"]
[2.5,"ail surgeles",null,2.5,null,null,null,null,null,null,"ail surgeles"]
[0,"airelles",null,0,null,null,null,null,null,null,"abondance"]
[0,"basilic surgeles",null,0,null,null,null,null,null,null,"abricots"]
[0,"batonnet glace vanille",null,0,null,null,null,null,null,null,"abricots au sirop"]
[0,"batonnet glace chocolat",null,0,null,null,null,null,null,null,"ail frais"]
[0,"beignet de la mer",null,0,null,null,null,null,null,null,"airelles"]
[0,"beignet chocolat",null,0,null,null,null,null,null,null,"ananas"]
[0,"beignet framboise",null,0,null,null,null,null,null,null,"ananas traches entieres"]
[0,"beignet aux pommes",null,0,null,null,null,null,null,null,"ananas tranches brisees"]
[26,"bounty",null,26,null,null,null,null,null,null,"aneth"]
[0,"brochette de dinde",null,0,null,null,null,null,null,null,"artichauts"]
[0,"brocolis",null,0,null,null,null,null,null,null,"asperge"]
[5,"brunoise de legumes",null,5,null,null,null,null,null,null,"aubergine"]
[0,"ciboulette surgeles",null,0,null,null,null,null,null,null,"avocats"]
[0,"dos de cabillaud",null,0,null,null,null,null,null,null,"baie de genievre"]
[0,"cuisse de canette",null,0,null,null,null,null,null,null,"banane"]
[0,"cuisse de poulet",null,0,null,null,null,null,null,null,"basilic frais"]
[0,"carottes surgelees",null,0,null,null,null,null,null,null,"basilic surgeles"]
[0,"cèpes surgels",null,0,null,null,null,null,null,null,"batonnet glace chocolat"]
[0,"choux de bruxelles",null,0,null,null,null,null,null,null,"batonnet glace vanille"]
[0,"chaussons aux pommes",null,0,null,null,null,null,null,null,"beignet aux pommes"]
[10,"champignons surgeles",null,10,null,null,null,null,null,null,"beignet chocolat"]
[0,"choux fleur",null,0,null,null,null,null,null,null,"beignet de la mer"]
[0,"churros de pomme de terre",null,0,null,null,null,null,null,null,"beignet framboise"]
[24,"cone glacés chocolat",null,24,null,null,null,null,null,null,"betteraves en dés"]
[10,"cone glacés fraise",null,10,null,null,null,null,null,null,"beurre micro"]
[1,"cone glacés vanille",null,1,null,null,null,null,null,null,"beurre plaquette"]
[0.62,"cordon bleu ",null,100.62,null,null,null,null,null,null,"bierre"]
[0,"courgette surgeles ",null,0,null,null,null,null,null,null,"bigareau au sirop"]
[0,"crepe au chocolat ",null,0,null,null,null,null,null,null,"bisque de homard"]
[0,"crepe au fromage ",null,0,null,null,null,null,null,null,"blanquette de veau"]
[0,"crevettes decortiquees ",null,0,null,null,null,null,null,null,"blé"]
[0,"crumbel ",null,0,null,null,null,null,null,null,"bleu auvergne"]
[0,"crepe au sucre ",null,0,null,null,null,null,null,null,"bœuf braisé"]
[0,"doughut au chocolat ",null,0,null,null,null,null,null,null,"bombel"]
[12.5,"cuisse de poulet",null,12.5,null,null,null,null,null,null,"bouillon de legumes"]
[0,"crepe au jambon ",null,0,null,null,null,null,null,null,"bouillon de volaille"]
[0,"cube de colin ",null,0,null,null,null,null,null,null,"boulgour"]
[0,"dougnut simpson ",null,0,null,null,null,null,null,null,"bounty"]
[2.5,"echalotte surgeles ",null,2.5,null,null,null,null,null,null,"bourguignon"]
[0,"eclair au chocolat ",null,0,null,null,null,null,null,null,"boursin ail et+fines herbes"]
[0,"eclair vanille ",null,0,null,null,null,null,null,null,"brie "]
[0,"egrene de bœuf ",null,0,null,null,null,null,null,null,"brie portion "]
[12,"encornet surgeles",null,12,null,null,null,null,null,null,"brique de bleu"]
[0,"feuillete au fromage ",null,495,null,null,null,null,null,null,"brochette de dinde"]
[0,"feuillete hot dog ",null,312,null,null,null,null,null,null,"brocolis"]
[5,"filet de hoki ",null,5,null,null,null,null,null,null,"brownies"]
[0,"filet de lieu ",null,0,null,null,null,null,null,null,"brunoise de legumes"]
[0,"filet de lotte",null,0,null,null,null,null,null,null,"buche de chevre"]
[0,"filet de merlu ",null,0,null,null,null,null,null,null,"buche de pilat"]
[0,"flan patissier",null,0,null,null,null,null,null,null,"café"]
[30,"frites",null,30,null,null,null,null,null,null,"caille frais"]
[0,"fruits rouges surgeles ",null,0,null,null,null,null,null,null,"caillettes"]
[0,"gateaux collectifs",null,0,null,null,null,null,null,null,"camembert"]
[15,"haricos verts ",null,15,null,null,null,null,null,null,"camembert portion"]
[0,"haricots beurre surgeles ",null,0,null,null,null,null,null,null,"cantal"]
[0,"jeunes carottes ",null,0,null,null,null,null,null,null,"capres"]
[0,"keftas de volaille ",null,0,null,null,null,null,null,null,"carottes fraiche"]
[20,"legumes couscous surgeles ",null,20,null,null,null,null,null,null,"carottes rapees"]
[70,"mille feuille mini ",null,70,null,null,null,null,null,null,"carottes surgelees"]
[70,"mini croissant ",null,70,null,null,null,null,null,null,"carré frais"]
[0,"pain au chocolat ",null,0,null,null,null,null,null,null,"celeris remoulade"]
[14,"mini pain au raisin ",null,14,null,null,null,null,null,null,"cèpes surgels"]
[6,"moule entiere",null,6,null,null,null,null,null,null,"cerfeuil"]
[0,"navets surgeles ",null,0,null,null,null,null,null,null,"cerise"]
[0,"nems ",null,0,null,null,null,null,null,null,"cerises"]
[0,"nuggets de poulet ",null,0,null,null,null,null,null,null,"cerneau de noix"]
[0,"oignon surgeles ",null,10,null,null,null,null,null,null,"cervelas"]
[0,"pain",null,0,null,null,null,null,null,null,"champignon a la greque"]
[0,"pain kebab",null,0,null,null,null,null,null,null,"champignons entiers"]
[0,"palette a la diable ",null,0,null,null,null,null,null,null,"champignons pied et morceaux"]
[0,"pané de hoki ",null,0,null,null,null,null,null,null,"champignons surgeles"]
[36,"paris brest ",null,36,null,null,null,null,null,null,"chanteneige"]
[8,"pate feuilletées",null,8,null,null,null,null,null,null,"chapelure"]
[0,"pave de sumon ",null,0,null,null,null,null,null,null,"chaussons aux pommes"]
[0,"persil surgeles ",null,0,null,null,null,null,null,null,"chavroux"]
{"$rows_left_out":322}
{"sheet":"Bilan marché 2016","index":4,"n_rows":497,"n_cols":7,"rows_kept":497,"cut":false,"hidden":false,"merged":[[1,3,1,6],[0,0,0,6]]}
["Bilan marché 2016"]
[null,"fournisseur marché 2016","quantité soumissionné","GENERAL"]
["SURGELES",null,null,{"$f":"SUMIF('2'!$D$11,A3:A3,'2'!$E$11)","v":0},0,{"$f":"D3+E3","v":0},0]
["ail surgeles",null,null,{"$f":"SUMIF('2'!$D$11,#REF!,'2'!$E$11)","v":0},0,{"$f":"D4+E4","v":0},0]
["airelles",null,null,{"$f":"SUMIF('2'!$D$11,#REF!,'2'!$E$11)","v":0},30,30,0]
["basilic surgeles",null,null,{"$f":"SUMIF('2'!$D$11,#REF!,'2'!$E$11)","v":0},0,0,0]
["batonnet de glaces autres parfum","BRAIKE France",400,{"$f":"SUMIF('2'!$D$11,#REF!,'2'!$E$11)","v":0}]
["batonnet de la mer","BRAIKE France",150,{"$f":"SUMIF('2'!$D$11,#REF!,'2'!$E$11)","v":0},0,0,0]
["batonnet glace chocolat","BRAIKE France",400,{"$f":"SUMIF('2'!$D$11,#REF!,'2'!$E$11)","v":0},0,0,0]
["batonnet glace vanille","BRAIKE France",400,{"$f":"SUMIF('2'!$D$11,#REF!,'2'!$E$11)","v":0}]
["beignet aux fruits rouges","BRAIKE France",10,{"$f":"SUMIF('2'!$D$11,#REF!,'2'!$E$11)","v":0},0,0,0]
["beignet aux pommes","BRAIKE France",20,{"$f":"SUMIF('2'!$D$11,#REF!,'2'!$E$11)","v":0},0,0,0]
["beignet chocolat","BRAIKE France",50,{"$f":"SUMIF('2'!$D$11,#REF!,'2'!$E$11)","v":0},0,0,0]
["beignet de la mer",null,null,{"$f":"SUMIF('2'!$D$11,#REF!,'2'!$E$11)","v":0},0,0,0]
["boulette de bœuf","GEL 43",90,{"$f":"SUMIF('2'!$D$11,#REF!,'2'!$E$11)","v":0}]
["bounty","BRAIKE France",300,{"$f":"SUMIF('2'!$D$11,#REF!,'2'!$E$11)","v":0},0,0,0]
["brochette de dinde","GEL 43",140,{"$f":"SUMIF('2'!$D$11,#REF!,'2'!$E$11)","v":0},0,0,0]
["brochette de dinde a l orientale","GEL 43",140,{"$f":"SUMIF('2'!$D$11,#REF!,'2'!$E$11)","v":0}]
["brocolis",null,null,{"$f":"SUMIF('2'!$D$11,#REF!,'2'!$E$11)","v":0},0,0,0]
["browies surgeles","BRAIKE France",120,{"$f":"SUMIF('2'!$D$11,#REF!,'2'!$E$11)","v":0}]
["brunoise de legumes",null,null,{"$f":"SUMIF('2'!$D$11,#REF!,'2'!$E$11)","v":0},0,0,0]
["cafe liegeois","BRAIKE France",12,{"$f":"SUMIF('2'!$D$11,#REF!,'2'!$E$11)","v":0},0,0,0]
["carottes surgelees",null,null,{"$f":"SUMIF('2'!$D$11,#REF!,'2'!$E$11)","v":0},0,0,0]
["cèpes surgels",null,null,{"$f":"SUMIF('2'!$D$11,#REF!,'2'!$E$11)","v":0}]
["cervelas lard fromage","GEL 43",90,{"$f":"SUMIF('2'!$D$11,#REF!,'2'!$E$11)","v":0}]
["champignon forestiers","POMONA PASSION FRAIS",30,{"$f":"SUMIF('2'!$D$11,#REF!,'2'!$E$11)","v":0}]
["champignon miniature","POMONA PASSION FRAIS",70,{"$f":"SUMIF('2'!$D$11,#REF!,'2'!$E$11)","v":0},0,0,0]
["champignons surgeles (paris)","POMONA PASSION FRAIS",50,{"$f":"SUMIF('2'!$D$11,#REF!,'2'!$E$11)","v":0},0,0,0]
["chaussons aux pommes","BRAIKE France",65,{"$f":"SUMIF('2'!$D$11,#REF!,'2'!$E$11)","v":0}]
["chocolas liegeois","BRAIKE France",50,{"$f":"SUMIF('2'!$D$11,#REF!,'2'!$E$11)","v":0},0,0,0]
["choux de bruxelles",null,null,{"$f":"SUMIF('2'!$D$11,#REF!,'2'!$E$11)","v":0},0,0,0]
["choux fleur",null,null,{"$f":"SUMIF('2'!$D$11,#REF!,'2'!$E$11)","v":0}]
["churros de pomme de terre",null,null,{"$f":"SUMIF('2'!$D$11,#REF!,'2'!$E$11)","v":0},0,0,0]
["ciboulette surgeles",null,null,{"$f":"SUMIF('2'!$D$11,#REF!,'2'!$E$11)","v":0},0,0,0]
["cocktail de fruits de mer","POMONA PASSION FRAIS",null,{"$f":"SUMIF('2'!$D$11,#REF!,'2'!$E$11)","v":0},0,0,0]
["cone assorties","BRAIKE France",100,{"$f":"SUMIF('2'!$D$11,#REF!,'2'!$E$11)","v":0}]
["cone glacés chocolat","BRAIKE France",100,{"$f":"SUMIF('2'!$D$11,#REF!,'2'!$E$11)","v":0}]
["cone glacés fraise","BRAIKE France",100,{"$f":"SUMIF('2'!$D$11,#REF!,'2'!$E$11)","v":0},0,0,0]
["cone glacés vanille","BRAIKE France",100,{"$f":"SUMIF('2'!$D$11,#REF!,'2'!$E$11)","v":0},0,0,0]
["cookies","BRAIKE France",40,{"$f":"SUMIF('2'!$D$11,#REF!,'2'!$E$11)","v":0}]
["coquelet","GEL 43",90,{"$f":"SUMIF('2'!$D$11,#REF!,'2'!$E$11)","v":0},0,0,0]
["cordon bleu ","BRAIKE France",500,{"$f":"SUMIF('2'!$D$11,#REF!,'2'!$E$11)","v":0},0,0,0]
["courgette surgeles ","POMONA PASSION FRAIS",800,{"$f":"SUMIF('2'!$D$11,#REF!,'2'!$E$11)","v":0},0,0,0]
["crepe au chocolat ","BRAIKE France",40,{"$f":"SUMIF('2'!$D$11,#REF!,'2'!$E$11)","v":0}]
["crepe au fromage 150gr","BRAIKE France",200,{"$f":"SUMIF('2'!$D$11,#REF!,'2'!$E$11)","v":0},0,0,0]
["crepe au jambon 150gr","BRAIKE France",100,{"$f":"SUMIF('2'!$D$11,#REF!,'2'!$E$11)","v":0}]
["crepe au sucre ",null,null,{"$f":"SUMIF('2'!$D$11,#REF!,'2'!$E$11)","v":0},0,0,0]
["crevettes decortiquees ","POMONA PASSION FRAIS",50,{"$f":"SUMIF('2'!$D$11,#REF!,'2'!$E$11)","v":0},0,0,0]
["crevettes entieres","POMONA PASSION FRAIS",50,{"$f":"SUMIF('2'!$D$11,#REF!,'2'!$E$11)","v":0},0,0,0]
["croisillon ''Dubarry\"\"","BRAIKE France",60,{"$f":"SUMIF('2'!$D$11,#REF!,'2'!$E$11)","v":0},0,0,0]
["croisillon emmental","BRAIKE France",60,{"$f":"SUMIF('2'!$D$11,#REF!,'2'!$E$11)","v":0}]
["crumbel ",null,null,{"$f":"SUMIF('2'!$D$11,#REF!,'2'!$E$11)","v":0},0,0,0]
["cube de colin ","POMONA PASSION FRAIS",120,{"$f":"SUMIF('2'!$D$11,#REF!,'2'!$E$11)","v":0},0,0,0]
["cuisse de canette","GEL 43",150,{"$f":"SUMIF('2'!$D$11,#REF!,'2'!$E$11)","v":0}]
["cuisse de lapin","GEL 43",100,{"$f":"SUMIF('2'!$D$11,#REF!,'2'!$E$11)","v":0},0,0,0]
["cuisse de pintade","GEL 43",150,{"$f":"SUMIF('2'!$D$11,#REF!,'2'!$E$11)","v":0}]
["cuisse de poulet","GEL 43",1000,{"$f":"SUMIF('2'!$D$11,#REF!,'2'!$E$11)","v":0},0,0,0]
["cuisse de poulet","GEL 43",1000,{"$f":"SUMIF('2'!$D$11,#REF!,'2'!$E$11)","v":0},0,0,0]
["decoupe de cuisses de coq","GEL 43",150,{"$f":"SUMIF('2'!$D$11,#REF!,'2'!$E$11)","v":0}]
["dos de cabillaud",null,null,{"$f":"SUMIF('2'!$D$11,#REF!,'2'!$E$11)","v":0}]
["dos de colin ","POMONA PASSION FRAIS",400,{"$f":"SUMIF('2'!$D$11,#REF!,'2'!$E$11)","v":0},0,0,0]
["doughut au chocolat ","BRAIKE France",80,{"$f":"SUMIF('2'!$D$11,#REF!,'2'!$E$11)","v":0}]
["doughut au sucre","BRAIKE France",80,{"$f":"SUMIF('2'!$D$11,#REF!,'2'!$E$11)","v":0}]
["dougnut simpson ",null,null,{"$f":"SUMIF('2'!$D$11,#REF!,'2'!$E$11)","v":0},0,0,0]
["echalotte surgeles ",null,null,{"$f":"SUMIF('2'!$D$11,#REF!,'2'!$E$11)","v":0},0,0,0]
["eclair au chocolat ","BRAIKE France",100,{"$f":"SUMIF('2'!$D$11,#REF!,'2'!$E$11)","v":0}]
["éclair café","BRAIKE France",20,{"$f":"SUMIF('2'!$D$11,#REF!,'2'!$E$11)","v":0},0,0,0]
["eclair vanille ","BRAIKE France",40,{"$f":"SUMIF('2'!$D$11,#REF!,'2'!$E$11)","v":0},0,0,0]
["egrene de bœuf ","GEL 43",300,{"$f":"SUMIF('2'!$D$11,#REF!,'2'!$E$11)","v":0},0,0,0]
["encornet surgeles","POMONA PASSION FRAIS",350,{"$f":"SUMIF('2'!$D$11,#REF!,'2'!$E$11)","v":0},0,0,0]
["epinards branches","POMONA PASSION FRAIS",90,{"$f":"SUMIF('2'!$D$11,#REF!,'2'!$E$11)","v":0}]
["epinards hachés","POMONA PASSION FRAIS",300,{"$f":"SUMIF('2'!$D$11,#REF!,'2'!$E$11)","v":0}]
["escalope de dinde","GEL 43",600,{"$f":"SUMIF('2'!$D$11,#REF!,'2'!$E$11)","v":0}]
["escalope de dinde panées","BRAIKE France",350,{"$f":"SUMIF('2'!$D$11,#REF!,'2'!$E$11)","v":0}]
["feuillete au fromage ","BRAIKE France",250,{"$f":"SUMIF('2'!$D$11,#REF!,'2'!$E$11)","v":0},0,0,0]
["feuillete hot dog ",null,null,{"$f":"SUMIF('2'!$D$11,#REF!,'2'!$E$11)","v":0},0,0,0]
["filet de hoki ",null,null,{"$f":"SUMIF('2'!$D$11,#REF!,'2'!$E$11)","v":0}]
["filet de lieu ",null,null,{"$f":"SUMIF('2'!$D$11,#REF!,'2'!$E$11)","v":0},0,0,0]
["filet de lotte",null,null,{"$f":"SUMIF('2'!$D$11,#REF!,'2'!$E$11)","v":0},0,0,0]
["filet de merlu ",null,null,{"$f":"SUMIF('2'!$D$11,#REF!,'2'!$E$11)","v":0},0,0,0]
{"$rows_left_out":418}
{"sheet":"1","index":5,"n_rows":55,"n_cols":4,"rows_kept":55,"cut":false,"hidden":false,"merged":[[2,4,9,4]]}
[]
[]
[]
[]
[]
[]
[]
[]
[]
[]
[]
["st moret","FOURNISSEUR","ARTICLE","QUANTIE"]
[null,null,null,8]
[null,null,"œuf durs ",360]
[null,null,"tome blanche ",6.1820000000000004]
[null,null,"st paulin a la coupe ",1.796]
[null,null,"st moret ",360]
[null,null,"st marcelin ",16]
[null,null,"iles flottantes",800]
[null,null,"gruyere bloc ",3.105]
[null,null,"creme fraiche ",12]
[null,null,"camembert portion",384]
[null,null,"camembert",15]
[null,null,"buche de pilat",1]
[null,null,"brie ",2.4359999999999999]
[null,null,"beurre plaquette",10]
[null,null,"banane",18.5]
[null,null,"orange ",30.9]
[null,null,"pomme ",68]
[null,null,"persil botte",5]
[null,null,"ail frais",1.2]
[null,null,"salade verte",18]
[null,null,"huile de tournesol ",20]
[null,null,"huile de colza ",20]
[null,null,"huile d olive ",20]
[null,null,"macaroni",50]
[null,null,"vin blanc vrac ",40]
[null,null,"vin rouge vrac ",10]
["2016-01-04",null,"pain ",110]
["2016-01-03","davigel","poivrons lanieres ",10]
["2016-01-03","davigel","petits pois carottes surgeles ",90]
["2016-01-03","davigel","oignon surgeles ",10]
["2016-01-03","davigel","pommes de terre campagnardes",200]
["2016-01-03","davigel","feuillete au fromage ",495]
["2016-01-03","davigel","feuillete hot dog ",312]
["2016-01-03","braike France","steack hachés",96]
["2016-01-03","rpda miko","cordon bleu ",100]
["2016-01-03","broc marche","st moret ",240]
["2016-01-03","broc marche","bombel",480]
["2016-01-03","broc marche","vache qui rit",80]
["2016-01-03","broc marche","mayonnaise seaux",2]
["2016-01-14","AXIMA","RINCAGE FOUR (AXI RINCE)",2]
["2016-01-14","AXIMA","LAVAGE FOUR (AXI JET NET)",2]
["2016-01-05","PRODIM","SURFA CID",4]
["2016-01-05","PRODIM","SURFA GERME",8]

{"sheet":"2","index":6,"n_rows":11,"n_cols":5,"rows_kept":11,"cut":false,"hidden":false,"merged":[]}
[]
[]
[]
[]
[]
["DATE","AGENTS","CUISINE =1","ARTICLE","QUANTIE"]
[null,null,"CLASSE =2"]
[]
["2016-01-04",null,null,"pain ",106]
[null,null,null,"pain ",106]
["2016-01-04","severine",2,"DOSE LAVAGE",30]