{"text_format":"1","workbook":"xlsx","n_sheets":4,"sheets":["PV","Calculs","Synthèse","exemple"],"not_rendered":{"charts":0,"images":0,"macros":1,"external_links":0,"defined_names":78,"comments":0,"pivot_tables":0},"unopened":[],"bounds":{"document_bytes":16777216,"sheet_cells":100000,"rows_first":2000,"rows_last":500,"rows_between":2000,"halvings":0,"cell_chars":16384,"cell_head_chars":4096},"cells_cut":0,"cells_raw":0,"read":"whole","date_system":"1900"}

{"sheet":"PV","index":0,"n_rows":745,"n_cols":14,"rows_kept":745,"cut":false,"hidden":false,"merged":[]}
["RESULTATS","DE","MESURES"]
["Site","de","Douvrin"]
["DESIGNATION",":","CULASSE"]
["Type",":","DV5R"]
["Ligne",":","L3"]
["N°","Piece",":"]
["N°","Adaptateur",":",14]
["Opération",":",120]
["N°","Meteor",":",3]
["N°","Demande","ou","de","Commande",":"]
["METROLOGUE",":","Date","de","rédaction",":"]
["Nbre","de","pièces","mesurées",":"]
["Incertitude","de","mesure",":","U","=","±2.1","+","L","/",333,"Repère",":"]
["Equipement(s)","utilisé(s)",":","DEA","09-15-08","Logiciel",":","METROLOG","XG12"]
["DEMANDEUR",":","Service",":"]
["Tél",":"]
["Tél",":",8,3804]
["Le","classement","et","l'archivage"]
["de","ce","document","sont","à","la"]
["charge","du","demandeur."]
["Interprétation","des","écarts","dans","le","secteur","mécanique",":"]
["Les","cotes","mesurées","et","les","écarts","relevés","sont","donnés","par","rapport","au(x)","référentiel(s)","pièce."]
["RESPONSABLE",":","EVERLET.E","Visa","métrologue",":"]
["date","de","mod.",":","2015-10-12","13:06:56"]
["Version",":"]
["Indice","modif.",":","m00"]
["DVR-120-man.gm2"]
["XG","14.004","HF4"]
["2016-02-09","20:12:09"]
["(","Facultatif","pour","demande","DMB",")"]
[1,"/",11]
["Metrologic","Group","-","M8.1250.XG",14]
["\f"]
["NOMINAL","MESURE","TOL-","TOL+","ECART","TENDANCE"]
["Fraisage","finition","face","combustion."]
["Pour","info","coordonnées","des","points","de","palpage."]
["X+","de","LG01","vers","LG02"]
["Z+","de","LG01","vers","face","admission."]
["PLA_FACE_F","Planéité","planéité","face","combustion"]
["PLAN","0.000","0.019","0.030","0.019"]
["INFO_PT5","Distance","Sect.","+","extérieur","matière"]
["Y","0.000","0.008","0.008"]
["INFO_PT6","Distance","Sect.","+","extérieur","matière"]
["Y","0.000","0.009","0.009"]
["INFO_PT7","Distance","Sect.","+","extérieur","matière"]
["Y","0.000","0.009","0.009"]
["INFO_PT8","Distance","Sect.","+","extérieur","matière"]
["Y","0.000","0.012","0.012"]
["INFO_PT9","Distance","Sect.","+","extérieur","matière"]
["Y","0.000","0.012","0.012"]
["INFO_PT10","Distance","Sect.","+","extérieur","matière"]
["Y","0.000","0.007","0.007"]
["INFO_PT11","Distance","Sect.","+","extérieur","matière"]
["Y","0.000","0.006","0.006"]
["INFO_PT12","Distance","Sect.","+","extérieur","matière"]
["Y","0.000","0.005","0.005"]
["INFO_PT13","Distance","Sect.","+","extérieur","matière"]
["Y","0.000","0.004","0.004"]
["INFO_PT14","Distance","Sect.","+","extérieur","matière"]
["Y","0.000","0.002","0.002"]
["INFO_PT15","Distance","Sect.","+","extérieur","matière"]
["Y","0.000","0.002","0.002"]
["INFO_PT16","Distance","Sect.","+","extérieur","matière"]
["Y","0.000","0.002","0.002"]
["INFO_PT17","Distance","Sect.","+","extérieur","matière"]
["Y","0.000","0.004","0.004"]
["INFO_PT18","Distance","Sect.","+","extérieur","matière"]
["Y","0.000","0.001","0.001"]
["INFO_PT19","Distance","Sect.","+","extérieur","matière"]
["Y","0.000","-0.000","-0.000"]
["INFO_PT20","Distance","Sect.","+","extérieur","matière"]
["Y","0.000","0.000","0.000"]
["INFO_PT21","Distance","Sect.","+","extérieur","matière"]
["Y","0.000","0.001","0.001"]
["INFO_PT22","Distance","Sect.","+","extérieur","matière"]
["Y","0.000","0.006","0.006"]
["INFO_PT23","Distance","Sect.","+","extérieur","matière"]
["Y","0.000","0.008","0.008"]
["INFO_PT24","Distance","Sect.","+","extérieur","matière"]
["Y","0.000","0.002","0.002"]
["INFO_PT25","Distance","Sect.","+","extérieur","matière"]
["Y","0.000","0.002","0.002"]
["INFO_PT26","Distance","Sect.","+","extérieur","matière"]
["Y","0.000","-0.000","-0.000"]
["INFO_PT27","Distance","Sect.","+","extérieur","matière"]
["Y","0.000","0.000","0.000"]
["INFO_PT28","Distance","Sect.","+","extérieur","matière"]
["Y","0.000","-0.000","-0.000"]
["INFO_PT29","Distance","Sect.","+","extérieur","matière"]
["Y","0.000","0.000","0.000"]
["INFO_PT30","Distance","Sect.","+","extérieur","matière"]
["Y","0.000","0.003","0.003"]
["DESIGNATION",":"]
["Type",":"]
["N°","Piece",":"]
["N°","Adaptateur",":"]
["N°","Meteor",":"]
["CULASSE"]
["DV5R"]
[14]
[3]
["Ligne",":"]
["Opération",":"]
["L3"]
[120]
[2,"/",11]
["Metrologic","Group","-","M8.1250.XG",14]
["\f"]
["NOMINAL","MESURE","TOL-","TOL+","ECART","TENDANCE"]
["INFO_PT31","Distance","Sect.","+","extérieur","matière"]
["Y","0.000","0.002","0.002"]
["INFO_PT32","Distance","Sect.","+","extérieur","matière"]
["Y","0.000","-0.002","-0.002"]
["INFO_PT33","Distance","Sect.","+","extérieur","matière"]
["Y","0.000","-0.002","-0.002"]
["INFO_PT34","Distance","Sect.","+","extérieur","matière"]
["Y","0.000","-0.003","-0.003"]
["INFO_PT35","Distance","Sect.","+","extérieur","matière"]
["Y","0.000","-0.003","-0.003"]
["INFO_PT36","Distance","Sect.","+","extérieur","matière"]
["Y","0.000","0.001","0.001"]
["INFO_PT37","Distance","Sect.","+","extérieur","matière"]
["Y","0.000","0.001","0.001"]
["INFO_PT38","Distance","Sect.","+","extérieur","matière"]
["Y","0.000","-0.004","-0.004"]
["INFO_PT39","Distance","Sect.","+","extérieur","matière"]
["Y","0.000","-0.002","-0.002"]
["INFO_PT40","Distance","Sect.","+","extérieur","matière"]
["Y","0.000","-0.001","-0.001"]
["INFO_PT41","Distance","Sect.","+","extérieur","matière"]
["Y","0.000","-0.005","-0.005"]
["INFO_PT42","Distance","Sect.","+","extérieur","matière"]
["Y","0.000","-0.003","-0.003"]
["INFO_PT43","Distance","Sect.","+","extérieur","matière"]
["Y","0.000","-0.002","-0.002"]
["INFO_PT44","Distance","Sect.","+","extérieur","matière"]
["Y","0.000","-0.003","-0.003"]
["INFO_PT45","Distance","Sect.","+","extérieur","matière"]
["Y","0.000","0.000","0.000"]
["INFO_PT46","Distance","Sect.","+","extérieur","matière"]
["Y","0.000","-0.003","-0.003"]
["INFO_PT47","Distance","Sect.","+","extérieur","matière"]
["Y","0.000","-0.005","-0.005"]
["INFO_PT48","Distance","Sect.","+","extérieur","matière"]
["Y","0.000","-0.003","-0.003"]
["INFO_PT49","Distance","Sect.","+","extérieur","matière"]
["Y","0.000","-0.003","-0.003"]
["INFO_PT50","Distance","Sect.","+","extérieur","matière"]
["Y","0.000","-0.003","-0.003"]
["INFO_PT51","Distance","Sect.","+","extérieur","matière"]
["Y","0.000","-0.006","-0.006"]
["INFO_PT52","Distance","Sect.","+","extérieur","matière"]
["Y","0.000","-0.002","-0.002"]
["INFO_PT53","Distance","Sect.","+","extérieur","matière"]
["Y","0.000","-0.000","-0.000"]
["INFO_PT54","Distance","Sect.","+","extérieur","matière"]
["Y","0.000","0.005","0.005"]
["INFO_PT55","Distance","Sect.","+","extérieur","matière"]
["Y","0.000","-0.002","-0.002"]
["INFO_PT56","Distance","Sect.","+","extérieur","matière"]
["Y","0.000","-0.006","-0.006"]
["INFO_PT57","Distance","Sect.","+","extérieur","matière"]
["Y","0.000","-0.009","-0.009"]
["INFO_PT58","Distance","Sect.","+","extérieur","matière"]
["Y","0.000","-0.002","-0.002"]
["INFO_PT59","Distance","Sect.","+","extérieur","matière"]
["Y","0.000","-0.004","-0.004"]
["DESIGNATION",":"]
["Type",":"]
["N°","Piece",":"]
["N°","Adaptateur",":"]
["N°","Meteor",":"]
["CULASSE"]
["DV5R"]
[14]
[3]
["Ligne",":"]
["Opération",":"]
["L3"]
[120]
[3,"/",11]
["Metrologic","Group","-","M8.1250.XG",14]
["\f"]
["NOMINAL","MESURE","TOL-","TOL+","ECART","TENDANCE"]
["INFO_PT60","Distance","Sect.","+","extérieur","matière"]
["Y","0.000","-0.004","-0.004"]
["INFO_PT61","Distance","Sect.","+","extérieur","matière"]
["Y","0.000","-0.001","-0.001"]
["INFO_PT62","Distance","Sect.","+","extérieur","matière"]
["Y","0.000","0.000","0.000"]
["INFO_PT63","Distance","Sect.","+","extérieur","matière"]
["Y","0.000","-0.005","-0.005"]
["INFO_PT64","Distance","Sect.","+","extérieur","matière"]
["Y","0.000","-0.006","-0.006"]
["INFO_PT65","Distance","Sect.","+","extérieur","matière"]
["Y","0.000","-0.007","-0.007"]
["INFO_PT66","Distance","Sect.","+","extérieur","matière"]
["Y","0.000","-0.007","-0.007"]
["INFO_PT67","Distance","Sect.","+","extérieur","matière"]
["Y","0.000","-0.006","-0.006"]
["INFO_PT68","Distance","Sect.","+","extérieur","matière"]
["Y","0.000","-0.005","-0.005"]
["INFO_PT69","Distance","Sect.","+","extérieur","matière"]
["Y","0.000","-0.004","-0.004"]
["INFO_PT70","Distance","Sect.","+","extérieur","matière"]
["Y","0.000","-0.000","-0.000"]
["INFO_PT71","Distance","Sect.","+","extérieur","matière"]
["Y","0.000","0.003","0.003"]
["INFO_PT72","Distance","Sect.","+","extérieur","matière"]
["Y","0.000","-0.002","-0.002"]
["INFO_PT73","Distance","Sect.","+","extérieur","matière"]
["Y","0.000","-0.001","-0.001"]
["INFO_PT74","Distance","Sect.","+","extérieur","matière"]
["Y","0.000","-0.008","-0.008"]
["INFO_PT75","Distance","Sect.","+","extérieur","matière"]
["Y","0.000","-0.006","-0.006"]
["INFO_PT76","Distance","Sect.","+","extérieur","matière"]
["Y","0.000","-0.005","-0.005"]
["INFO_PT77","Distance","Sect.","+","extérieur","matière"]
["Y","0.000","0.008","0.008"]
["INFO_PT78","Distance","Sect.","+","extérieur","matière"]
["Y","0.000","0.001","0.001"]
["INFO_PT79","Distance","Sect.","+","extérieur","matière"]
["Y","0.000","-0.003","-0.003"]
["INFO_PT80","Distance","Sect.","+","extérieur","matière"]
["Y","0.000","-0.005","-0.005"]
["INFO_PT81","Distance","Sect.","+","extérieur","matière"]
["Y","0.000","-0.007","-0.007"]
["INFO_PT82","Distance","Sect.","+","extérieur","matière"]
["Y","0.000","0.000","0.000"]
["INFO_PT83","Distance","Sect.","+","extérieur","matière"]
["Y","0.000","0.001","0.001"]
["INFO_PT84","Distance","Sect.","+","extérieur","matière"]
["Y","0.000","-0.003","-0.003"]
["INFO_PT85","Distance","Sect.","+","extérieur","matière"]
["Y","0.000","0.002","0.002"]
["INFO_PT86","Distance","Sect.","+","extérieur","matière"]
["Y","0.000","0.003","0.003"]
["INFO_PT87","Distance","Sect.","+","extérieur","matière"]
["Y","0.000","-0.005","-0.005"]
["INFO_PT88","Distance","Sect.","+","extérieur","matière"]
["Y","0.000","-0.004","-0.004"]
["DESIGNATION",":"]
["Type",":"]
["N°","Piece",":"]
["N°","Adaptateur",":"]
["N°","Meteor",":"]
["CULASSE"]
["DV5R"]
[14]
[3]
["Ligne",":"]
["Opération",":"]
["L3"]
[120]
[4,"/",11]
["Metrologic","Group","-","M8.1250.XG",14]
["\f"]
["NOMINAL","MESURE","TOL-","TOL+","ECART","TENDANCE"]
["INFO_PT89","Distance","Sect.","+","extérieur","matière"]
["Y","0.000","-0.005","-0.005"]
["INFO_PT90","Distance","Sect.","+","extérieur","matière"]
["Y","0.000","-0.004","-0.004"]
["INFO_PT91","Distance","Sect.","+","extérieur","matière"]
["Y","0.000","-0.004","-0.004"]
["INFO_PT92","Distance","Sect.","+","extérieur","matière"]
["Y","0.000","-0.004","-0.004"]
["INFO_PT93","Distance","Sect.","+","extérieur","matière"]
["Y","0.000","0.001","0.001"]
["INFO_PT94","Distance","Sect.","+","extérieur","matière"]
["Y","0.000","0.002","0.002"]
["INFO_PT95","Distance","Sect.","+","extérieur","matière"]
["Y","0.000","-0.003","-0.003"]
["INFO_PT96","Distance","Sect.","+","extérieur","matière"]
["Y","0.000","-0.004","-0.004"]
["INFO_PT97","Distance","Sect.","+","extérieur","matière"]
["Y","0.000","-0.004","-0.004"]
["INFO_PT98","Distance","Sect.","+","extérieur","matière"]
["Y","0.000","0.005","0.005"]
["INFO_PT99","Distance","Sect.","+","extérieur","matière"]
["Y","0.000","-0.003","-0.003"]
["INFO_PT100","Distance","Sect.","+","extérieur","matière"]
["Y","0.000","-0.007","-0.007"]
["INFO_PT101","Distance","Sect.","+","extérieur","matière"]
["Y","0.000","0.005","0.005"]
["INFO_PT102","Distance","Sect.","+","extérieur","matière"]
["Y","0.000","-0.002","-0.002"]
["INFO_PT103","Distance","Sect.","+","extérieur","matière"]
["Y","0.000","-0.006","-0.006"]
["INFO_PT104","Distance","Sect.","+","extérieur","matière"]
["Y","0.000","-0.006","-0.006"]
["INFO_PT105","Distance","Sect.","+","extérieur","matière"]
["Y","0.000","-0.001","-0.001"]
["INFO_PT106","Distance","Sect.","+","extérieur","matière"]
["Y","0.000","-0.003","-0.003"]
["INFO_PT107","Distance","Sect.","+","extérieur","matière"]
["Y","0.000","-0.001","-0.001"]
["INFO_PT108","Distance","Sect.","+","extérieur","matière"]
["Y","0.000","-0.007","-0.007"]
["INFO_PT109","Distance","Sect.","+","extérieur","matière"]
["Y","0.000","-0.005","-0.005"]
["INFO_PT110","Distance","Sect.","+","extérieur","matière"]
["Y","0.000","0.002","0.002"]
["INFO_PT111","Distance","Sect.","+","extérieur","matière"]
["Y","0.000","0.001","0.001"]
["INFO_PT112","Distance","Sect.","+","extérieur","matière"]
["Y","0.000","-0.002","-0.002"]
["INFO_PT113","Distance","Sect.","+","extérieur","matière"]
["Y","0.000","-0.005","-0.005"]
["INFO_PT114","Distance","Sect.","+","extérieur","matière"]
["Y","0.000","-0.004","-0.004"]
["INFO_PT115","Distance","Sect.","+","extérieur","matière"]
["Y","0.000","-0.004","-0.004"]
["INFO_PT116","Distance","Sect.","+","extérieur","matière"]
["Y","0.000","-0.005","-0.005"]
["INFO_PT117","Distance","Sect.","+","extérieur","matière"]
["Y","0.000","-0.007","-0.007"]
["DESIGNATION",":"]
["Type",":"]
["N°","Piece",":"]
["N°","Adaptateur",":"]
["N°","Meteor",":"]
["CULASSE"]
["DV5R"]
[14]
[3]
["Ligne",":"]
["Opération",":"]
["L3"]
[120]
[5,"/",11]
["Metrologic","Group","-","M8.1250.XG",14]
["\f"]
["NOMINAL","MESURE","TOL-","TOL+","ECART","TENDANCE"]
["INFO_PT118","Distance","Sect.","+","extérieur","matière"]
["Y","0.000","-0.002","-0.002"]
["INFO_PT119","Distance","Sect.","+","extérieur","matière"]
["Y","0.000","-0.003","-0.003"]
["INFO_PT120","Distance","Sect.","+","extérieur","matière"]
["Y","0.000","-0.003","-0.003"]
["INFO_PT121","Distance","Sect.","+","extérieur","matière"]
["Y","0.000","-0.002","-0.002"]
["INFO_PT122","Distance","Sect.","+","extérieur","matière"]
["Y","0.000","-0.000","-0.000"]
["INFO_PT123","Distance","Sect.","+","extérieur","matière"]
["Y","0.000","-0.005","-0.005"]
["INFO_PT124","Distance","Sect.","+","extérieur","matière"]
["Y","0.000","-0.006","-0.006"]
["INFO_PT125","Distance","Sect.","+","extérieur","matière"]
["Y","0.000","-0.008","-0.008"]
["INFO_PT126","Distance","Sect.","+","extérieur","matière"]
["Y","0.000","-0.003","-0.003"]
["INFO_PT127","Distance","Sect.","+","extérieur","matière"]
["Y","0.000","0.002","0.002"]
["INFO_PT128","Distance","Sect.","+","extérieur","matière"]
["Y","0.000","0.002","0.002"]
["INFO_PT129","Distance","Sect.","+","extérieur","matière"]
["Y","0.000","-0.001","-0.001"]
["INFO_PT130","Distance","Sect.","+","extérieur","matière"]
["Y","0.000","-0.001","-0.001"]
["INFO_PT131","Distance","Sect.","+","extérieur","matière"]
["Y","0.000","-0.002","-0.002"]
["INFO_PT132","Distance","Sect.","+","extérieur","matière"]
["Y","0.000","0.002","0.002"]
["INFO_PT133","Distance","Sect.","+","extérieur","matière"]
["Y","0.000","-0.003","-0.003"]
["INFO_PT134","Distance","Sect.","+","extérieur","matière"]
["Y","0.000","-0.001","-0.001"]
["INFO_PT135","Distance","Sect.","+","extérieur","matière"]
["Y","0.000","-0.004","-0.004"]
["INFO_PT136","Distance","Sect.","+","extérieur","matière"]
["Y","0.000","0.003","0.003"]
["INFO_PT137","Distance","Sect.","+","extérieur","matière"]
["Y","0.000","-0.004","-0.004"]
["INFO_PT138","Distance","Sect.","+","extérieur","matière"]
["Y","0.000","0.001","0.001"]
["INFO_PT139","Distance","Sect.","+","extérieur","matière"]
["Y","0.000","-0.004","-0.004"]
["INFO_PT140","Distance","Sect.","+","extérieur","matière"]
["Y","0.000","-0.002","-0.002"]
["INFO_PT141","Distance","Sect.","+","extérieur","matière"]
["Y","0.000","0.001","0.001"]
["INFO_PT142","Distance","Sect.","+","extérieur","matière"]
["Y","0.000","0.001","0.001"]
["INFO_PT143","Distance","Sect.","+","extérieur","matière"]
["Y","0.000","0.008","0.008"]
["INFO_PT144","Distance","Sect.","+","extérieur","matière"]
["Y","0.000","0.009","0.009"]
["INFO_PT145","Distance","Sect.","+","extérieur","matière"]
["Y","0.000","0.003","0.003"]
["INFO_PT146","Distance","Sect.","+","extérieur","matière"]
["Y","0.000","0.002","0.002"]
["DESIGNATION",":"]
["Type",":"]
["N°","Piece",":"]
["N°","Adaptateur",":"]
["N°","Meteor",":"]
["CULASSE"]
["DV5R"]
[14]
{"$rows_left_out":346}
{"sheet":"Calculs","index":1,"n_rows":0,"n_cols":0,"rows_kept":0,"cut":false,"hidden":false,"merged":[]}

{"sheet":"Synthèse","index":2,"n_rows":4,"n_cols":5,"rows_kept":4,"cut":false,"hidden":false,"merged":[]}
[]
[null,{"$f":"\"Désignation : \"&PV!C3","v":"Désignation : CULASSE"},null,null,{"$f":"\"OP : \"&PV!C8&\".\"&PV!D9","v":"OP : 120.3"}]
[null,{"$f":"\"Type : \"&PV!C4","v":"Type : DV5R"},null,null,{"$f":"\"N° adaptateur : \"&PV!D7","v":"N° adaptateur : 14"}]
[null,{"$f":"\"Ligne : \"&PV!C5","v":"Ligne : L3"},null,null,{"$f":"\"Date : \"&TEXT(INDEX(PV!A:A,MATCH(\"Metrologic\",PV!A:A,0)-3,1),\"JJ/MM/AAAA\")","v":"Date : 09/02/2016"}]

{"sheet":"exemple","index":3,"n_rows":1,"n_cols":1,"rows_kept":1,"cut":false,"hidden":false,"merged":[]}
["aaaaaa"]