{"text_format":"1","workbook":"xlsx","n_sheets":42,"sheets":["Accueil","Liste_des_Enfants","Liste des Animateurs","Liste des Communes","Septembre","Octobre","Novembre","Décembre","Janvier","Février","Mars","Avril","Mai","Juin","Juillet","Août","Vacances de la Toussaint","Vacances d'Hivers","Vacances de Pâques","Vacances d'été","Emploi du Temps Toussaint","Emploi du Temps Hivers","Emploi du Temps Pâques","Emploi du Temps Juillet","Emploi du Temps Août","Camp 1","Camp 2","Camp 3","Appel Journalier 3-5 ans","Appel Journalier 6-8 ans","Appel Journalier 9-13 ans","Resto Toussaint","Resto Hivers","Resto Pâques","Resto Eté","Resto Mercredi","données","An","An1","1","LISTES","Couleurs"],"not_rendered":{"charts":0,"images":5,"macros":1,"external_links":0,"defined_names":15,"comments":2,"pivot_tables":0},"unopened":[],"bounds":{"document_bytes":16777216,"sheet_cells":100000,"rows_first":2000,"rows_last":500,"rows_between":2000,"halvings":0,"cell_chars":16384,"cell_head_chars":4096},"cells_cut":0,"cells_raw":0,"read":"whole","date_system":"1900"}

{"sheet":"Accueil","index":0,"n_rows":34,"n_cols":12,"rows_kept":34,"cut":false,"hidden":false,"merged":[[27,16,30,18]]}
[]
[]
[]
[]
[]
[]
[]
[]
[]
[]
[]
[]
[]
[]
[]
[]
[]
[null,null,2015,{"$f":"\" / \"&C18+1","v":" / 2016"}]
[]
[]
[]
[]
[]
[]
[]
[]
[]
[]
[]
[]
[]
[]
[]
[null,null,null,null,null,null,null,null,null,null,null,{"$f":"TODAY()","v":"2016-01-22"}]

{"sheet":"Liste_des_Enfants","index":1,"n_rows":202,"n_cols":173,"rows_kept":202,"cut":false,"hidden":false,"merged":[]}
["Nom","Prénom","Date de naissance","Age","Etablissement","Classe","Genre","N° Sécurité Sociale","N° MSA","N° Allocataire CAF","Dossier Complet ?","Civilité 1","Nom Rep Légal 1","Prénom Rep Légal 1","Adresse 1","Code Postal 1","Ville 1","Tel fixe 1","Tel Mob 1","E.Mail 1","Lien Parenté 1","Civilité 2","Nom Rep Légal 2","Prénom Rep Légal 2","Adresse 2","Code Postal 2","Ville 2","Tel Fixe 2","Tel Mobile 2","E Mail 2 ","Lien Parenté 2","Validation","Colonne1","Colonne2","Septembre","Octobre","Novembre","Décembre","Janvier","Février","Mars","Avril","Mai","Juin","Juillet","Vacances de la Toussaint","Vacances de Noël","Vacances d'Hivers","Vacances de Päques","Vacances d'été","Camp 1","Camp 2","Camp 3","Camp4","Autorisation1","Autorisation2","Autorisation3","Autorisation4","Autorisation5","Autorisation6","Autorisation7","Autorisation8","Autorisation9","Autorisation10","Remarque","Diphtérie","Diphtérie2","Date","Tétanos","Tétanos2","Date2","Poliomyélite","Poliomyélite2","Date3","DT polio","DT polio2","Date4","Tétracoq","Tétracoq2","Date5","BCG","BCG2","Date6","Hépatite B","Hépatite B2","Date7","Rubéole-","Rubéole-2","Date8","Coqueluche","Coqueluche2","Date9","Autres (préciser)","Autres (préciser)2","Date10","Allergies Médicamenteuses","Allergies Médicamenteuses1","asthme","asthme1","Précisez la cause","Végétarien","Végétalien","Sans Porc","Sans Aïl, Oignon, Echalote, Champignon","Allergies Alimentaires","Allergies Alimentaires2","Allergies Alimentaires3","Allergies Alimentaires4","Allergies Alimentaires5","Allergies Alimentaires6","Autres Allergies ","Autres Allergies 2","Autres Allergies 3","Autres Allergies 4","Autres Allergies 5","Autres Allergies 6","traitement médical ","traitement médical 2","RUBÉOLE   ","RUBÉOLE   2","VARICELLE   ","VARICELLE   2","ANGINE   ","ANGINE   2","SCARLATINE   ","SCARLATINE   2","COQUELUCHE   ","COQUELUCHE   2","ROUGEOLE   ","ROUGEOLE   2","OREILLONS   ","OREILLONS   2","OTITE     ","OTITE     2","RHUMATISME ","RHUMATISME 2","Difficultés de santé","Colonne40","Colonne41","Colonne42","Colonne43","Colonne44","Colonne45","Colonne46","Colonne47","Colonne48","Colonne49","Colonne50","Colonne51","Colonne52","Colonne53","Colonne54","Colonne55","Colonne56","Colonne57","Colonne58","Colonne59","Colonne60","Colonne61","Colonne62","Colonne63","Colonne64","Colonne65","Colonne66","Colonne67","Colonne68","Colonne69","Colonne70","Colonne71","Colonne72","Colonne73","Colonne74","Colonne75"]
["Agnoux","Arthur","12/01/2008","7","Rignac","","Garçon","","","","","","","","","","","","","","","","","","","","","","","","","","","",false,false,false,false,false,false,true,false,false,false,false,false,false,false,false,false,false,false,false,false,false,false,false,false,false,false,false,false,false,false,"",false,false,"",false,false,"",false,false,"",false,false,"",false,false,"",false,false,"",false,false,"",false,false,"",false,false,"",false,false,"",false,false,false,false,"",false,false,false,false,"","","","","","","","","","","","",false,false,false,false,false,false,false,false,false,false,false,false,false,false,false,false,false,false,false,false,""]
["Agnoux","Clémence","30/03/2011","4","","","Fille","","","","","","","","","","","","","","","","","","","","","","","","","","","",false,false,false,false,false,false,true,false,false,false,false,false,false,false,false,false,false,false,false,false,false,false,false,false,false,false,false,false,false,false,"",false,false,"",false,false,"",false,false,"",false,false,"",false,false,"",false,false,"",false,false,"",false,false,"",false,false,"",false,false,"",false,false,false,false,"",false,false,false,false,"","","","","","","","","","","","",false,false,false,false,false,false,false,false,false,false,false,false,false,false,false,false,false,false,false,false,""]
["Agnoux","Maxime","30/03/2011","4","","","Garçon","","","","","","","","","","","","","","","","","","","","","","","","","","","",false,false,false,false,false,false,true,false,false,false,false,false,false,false,false,false,false,false,false,false,false,false,false,false,false,false,false,false,false,false,"",false,false,"",false,false,"",false,false,"",false,false,"",false,false,"",false,false,"",false,false,"",false,false,"",false,false,"",false,false,"",false,false,false,false,"",false,false,false,false,"","","","","","","","","","","","",false,false,false,false,false,false,false,false,false,false,false,false,false,false,false,false,false,false,false,false,""]
["Albouy","Chloé","12/02/2004","11","","","","","","","","","","","","","","","","","","","","","","","","","","","","","","",true,false,false,false,false,false,false,false,false,false,false,false,false,false,false,false,false,false,false,false]
["Albouy","Emma","2004-02-12",{"$f":"IF(MONTH(TODAY())>MONTH(C6),YEAR(TODAY())-YEAR(C6),IF(MONTH(TODAY())<MONTH(C6),YEAR(TODAY())-YEAR(C6)-1,IF(DAY(TODAY())<DAY(C6),YEAR(TODAY())-YEAR(C6)-1,YEAR(TODAY())-YEAR(C6))))","v":11}]
["Amari","Naïm","08/12/2008","6","Rignac","","Garçon","","","","Oui","","","","","","","","","","","","","","","","","","","","","","","",false,true,true,true,true,false,false,false,false,false,false,false,false,false,false,false,false,false,false,false,false,false,false,false,false,false,false,false,false,false,"",false,false,"",false,false,"",false,false,"",false,false,"",false,false,"",false,false,"",false,false,"",false,false,"",false,false,"",false,false,"",false,false,false,false,"",false,false,false,false,"","","","","","","","","","","","",false,false,false,false,false,false,false,false,false,false,false,false,false,false,false,false,false,false,false,false,""]
["Amari","Ilyes","01/01/2012","3","Rignac","","Garçon","","","","Non","","","","","","","","","","","","","","","","","","","","","","","",false,false,true,true,true,false,false,false,false,false,false,false,false,false,false,false,false,false,false,false,false,false,false,false,false,false,false,false,false,false,"",false,false,"",false,false,"",false,false,"",false,false,"",false,false,"",false,false,"",false,false,"",false,false,"",false,false,"",false,false,"",false,false,false,false,"",false,false,false,false,"","","","","","","","","","","","",false,false,false,false,false,false,false,false,false,false,false,false,false,false,false,false,false,false,false,false,""]
["Andrieu","Célya","2007-02-07",{"$f":"IF(MONTH(TODAY())>MONTH(C9),YEAR(TODAY())-YEAR(C9),IF(MONTH(TODAY())<MONTH(C9),YEAR(TODAY())-YEAR(C9)-1,IF(DAY(TODAY())<DAY(C9),YEAR(TODAY())-YEAR(C9)-1,YEAR(TODAY())-YEAR(C9))))","v":8}]
["Andrieu","Océane","2004-09-06",{"$f":"IF(MONTH(TODAY())>MONTH(C10),YEAR(TODAY())-YEAR(C10),IF(MONTH(TODAY())<MONTH(C10),YEAR(TODAY())-YEAR(C10)-1,IF(DAY(TODAY())<DAY(C10),YEAR(TODAY())-YEAR(C10)-1,YEAR(TODAY())-YEAR(C10))))","v":11}]
["Antonna","Alexane","2007-01-01",{"$f":"IF(MONTH(TODAY())>MONTH(C11),YEAR(TODAY())-YEAR(C11),IF(MONTH(TODAY())<MONTH(C11),YEAR(TODAY())-YEAR(C11)-1,IF(DAY(TODAY())<DAY(C11),YEAR(TODAY())-YEAR(C11)-1,YEAR(TODAY())-YEAR(C11))))","v":9}]
["Antunes","Zoé","2008-08-28",{"$f":"IF(MONTH(TODAY())>MONTH(C12),YEAR(TODAY())-YEAR(C12),IF(MONTH(TODAY())<MONTH(C12),YEAR(TODAY())-YEAR(C12)-1,IF(DAY(TODAY())<DAY(C12),YEAR(TODAY())-YEAR(C12)-1,YEAR(TODAY())-YEAR(C12))))","v":7}]
["Araujo","Stan","2009-06-05",{"$f":"IF(MONTH(TODAY())>MONTH(C13),YEAR(TODAY())-YEAR(C13),IF(MONTH(TODAY())<MONTH(C13),YEAR(TODAY())-YEAR(C13)-1,IF(DAY(TODAY())<DAY(C13),YEAR(TODAY())-YEAR(C13)-1,YEAR(TODAY())-YEAR(C13))))","v":6}]
["Barba-A","Louise","22/03/2008","7","Rignac","","Fille","","","","","","","","","","","","","","","","","","","","","","","","","","","",true,true,true,true,true,false,false,false,false,false,false,false,false,false,false,false,false,false,false,false]
["Barrau","Joris","31/01/2011","4"]
["Barrau","Kélian","01/01/2009","6"]
["Barrau","Marie","11/05/2009","06","Rignac","","Fille","","","","Oui","","","","","","","","","","","","","","","","","","","","","","","",false,false,false,true,true,true,true,true,true,true,true,false,false,false,false,false,false,false,false,false,false,false,false,false,false,false,false,false,false,false,"",false,false,"",false,false,"",false,false,"",false,false,"",false,false,"",false,false,"",false,false,"",false,false,"",false,false,"",false,false,"",false,false,false,false,"",false,false,false,false,"Lait de vache","","","","","","","","","","","",false,false,false,false,false,false,false,false,false,false,false,false,false,false,false,false,false,false,false,false,""]
["Barreau","Emma","2004-11-29",{"$f":"IF(MONTH(TODAY())>MONTH(C18),YEAR(TODAY())-YEAR(C18),IF(MONTH(TODAY())<MONTH(C18),YEAR(TODAY())-YEAR(C18)-1,IF(DAY(TODAY())<DAY(C18),YEAR(TODAY())-YEAR(C18)-1,YEAR(TODAY())-YEAR(C18))))","v":11}]
["Barreau","Tom","05/04/2007","8","Rignac SJO","","Garçon","","","","Oui","","","","","","","","","","","","","","","","","","","","","","","",true,true,false,false,true,false,false,false,false,false,false,false,false,false,false,false,false,false,false,false,false,false,false,false,false,false,false,false,false,false,"",false,false,"",false,false,"",false,false,"",false,false,"",false,false,"",false,false,"",false,false,"",false,false,"",false,false,"",false,false,"",false,false,false,false,"",false,false,false,false,"","","","","","","","","","","","",false,false,false,false,false,false,false,false,false,false,false,false,false,false,false,false,false,false,false,false,""]
["Bayol","Maël","12/07/2011","4","Mayran","","Garçon","","","","Oui","","","","","","","","","","","","","","","","","","","","","","","",true,true,true,true,true,true,true,true,true,true,false,false,false,false,false,false,false,false,false,false,false,false,false,false,false,false,false,false,false,false,"",false,false,"",false,false,"",false,false,"",false,false,"",false,false,"",false,false,"",false,false,"",false,false,"",false,false,"",false,false,"",false,false,false,false,"",false,false,false,false,"","","","","","","","","","","","",false,false,false,false,false,false,false,false,false,false,false,false,false,false,false,false,false,false,false,false,""]
["Bayol-T","Diego","2010-08-18",{"$f":"IF(MONTH(TODAY())>MONTH(C21),YEAR(TODAY())-YEAR(C21),IF(MONTH(TODAY())<MONTH(C21),YEAR(TODAY())-YEAR(C21)-1,IF(DAY(TODAY())<DAY(C21),YEAR(TODAY())-YEAR(C21)-1,YEAR(TODAY())-YEAR(C21))))","v":5}]
["Bellonie","Milan","2004-05-30",11]
["Belredon","Louna","2008-03-28",7]
["Belredon","Théo","2003-12-02",12]
["Bessé","Archibald","2009-03-23",6]
["Bessé","Thibault","2005-03-12",10]
["Bibal","Nino","05/09/2011","5","","","Garçon","","","","","","","","","","","","","","","","","","","","","","","","","","","",false,false,false,false,false,false,false,false,false,false,false,false,false,false,false,false,false,false,false,false,false,false,false,false,false,false,false,false,false,false,"",false,false,"",false,false,"",false,false,"",false,false,"",false,false,"",false,false,"",false,false,"",false,false,"",false,false,"",false,false,"",false,false,false,false,"Intolérance aux fraises provoque de l'exzéma",false,false,false,false,"Fraise","","","","","","","","","","","",false,false,false,false,false,false,false,false,false,false,false,false,false,false,false,false,false,false,false,false,""]
["Bousquet","Eliane","12/12/2010","4","Goutrens","","Fille","","","","","","","","","","","","","","","","","","","","","","","","","","","",true,false,false,false,false,false,false,false,false,false,false,false,false,false,false,false,false,false,false,false]
["Boutet","Etienne","2007-03-02",{"$f":"IF(MONTH(TODAY())>MONTH(C29),YEAR(TODAY())-YEAR(C29),IF(MONTH(TODAY())<MONTH(C29),YEAR(TODAY())-YEAR(C29)-1,IF(DAY(TODAY())<DAY(C29),YEAR(TODAY())-YEAR(C29)-1,YEAR(TODAY())-YEAR(C29))))","v":8}]
["Brugel","Rémi","2003-09-28",{"$f":"IF(MONTH(TODAY())>MONTH(C30),YEAR(TODAY())-YEAR(C30),IF(MONTH(TODAY())<MONTH(C30),YEAR(TODAY())-YEAR(C30)-1,IF(DAY(TODAY())<DAY(C30),YEAR(TODAY())-YEAR(C30)-1,YEAR(TODAY())-YEAR(C30))))","v":12}]
["Brun","Charlotte","2004-07-14",{"$f":"IF(MONTH(TODAY())>MONTH(C31),YEAR(TODAY())-YEAR(C31),IF(MONTH(TODAY())<MONTH(C31),YEAR(TODAY())-YEAR(C31)-1,IF(DAY(TODAY())<DAY(C31),YEAR(TODAY())-YEAR(C31)-1,YEAR(TODAY())-YEAR(C31))))","v":11}]
["Brun","Raphaël","28/03/2007","8","Rignac SJO","","Garçon","","","","Oui","","","","","","","","","","","","","","","","","","","","","","","",true,true,true,true,true,true,true,true,true,true,true,false,false,false,false,false,false,false,false,false,false,false,false,false,false,false,false,false,false,false,"",false,false,"",false,false,"",false,false,"",false,false,"",false,false,"",false,false,"",false,false,"",false,false,"",false,false,"",false,false,"",false,false,false,false,"",false,false,false,false,"","","","","","","","","","","","",false,false,false,false,false,false,false,false,false,false,false,false,false,false,false,false,false,false,false,false,""]
["Cabantous","Agathe","2009-03-12",{"$f":"IF(MONTH(TODAY())>MONTH(C33),YEAR(TODAY())-YEAR(C33),IF(MONTH(TODAY())<MONTH(C33),YEAR(TODAY())-YEAR(C33)-1,IF(DAY(TODAY())<DAY(C33),YEAR(TODAY())-YEAR(C33)-1,YEAR(TODAY())-YEAR(C33))))","v":6}]
["Cabantous","Jules","2005-05-24",{"$f":"IF(MONTH(TODAY())>MONTH(C34),YEAR(TODAY())-YEAR(C34),IF(MONTH(TODAY())<MONTH(C34),YEAR(TODAY())-YEAR(C34)-1,IF(DAY(TODAY())<DAY(C34),YEAR(TODAY())-YEAR(C34)-1,YEAR(TODAY())-YEAR(C34))))","v":10}]
["Cabantous","Lucas","2007-11-09",{"$f":"IF(MONTH(TODAY())>MONTH(C35),YEAR(TODAY())-YEAR(C35),IF(MONTH(TODAY())<MONTH(C35),YEAR(TODAY())-YEAR(C35)-1,IF(DAY(TODAY())<DAY(C35),YEAR(TODAY())-YEAR(C35)-1,YEAR(TODAY())-YEAR(C35))))","v":8}]
["Cabantous","Thibault","2004-09-23",{"$f":"IF(MONTH(TODAY())>MONTH(C36),YEAR(TODAY())-YEAR(C36),IF(MONTH(TODAY())<MONTH(C36),YEAR(TODAY())-YEAR(C36)-1,IF(DAY(TODAY())<DAY(C36),YEAR(TODAY())-YEAR(C36)-1,YEAR(TODAY())-YEAR(C36))))","v":11}]
["Cabezon","Audrey","2005-07-19",{"$f":"IF(MONTH(TODAY())>MONTH(C37),YEAR(TODAY())-YEAR(C37),IF(MONTH(TODAY())<MONTH(C37),YEAR(TODAY())-YEAR(C37)-1,IF(DAY(TODAY())<DAY(C37),YEAR(TODAY())-YEAR(C37)-1,YEAR(TODAY())-YEAR(C37))))","v":10}]
["Capely","Loris","22/09/2009","6","Goutrens","","Garçon","","","","","","","","","","","","","","","","","","","","","","","","","","","",true,true,true,true,false,false,false,false,false,false,false,false,false,false,false,false,false,false,false,false]
["Capély","Loris","2009-09-22",{"$f":"IF(MONTH(TODAY())>MONTH(C39),YEAR(TODAY())-YEAR(C39),IF(MONTH(TODAY())<MONTH(C39),YEAR(TODAY())-YEAR(C39)-1,IF(DAY(TODAY())<DAY(C39),YEAR(TODAY())-YEAR(C39)-1,YEAR(TODAY())-YEAR(C39))))","v":6}]
["Caule","Arthur","2009-12-01",6]
["Caumes","Samuel","2004-02-23",11]
["Caumes","Shanie","2001-05-16",14]
["Cayre","Auxane","2006-07-25",9]
["Cayre","Joan","2009-04-15",6]
["Chantereau","Axelle","03/04/2008","7","Anglars","","","","","","","","","","","","","","","","","","","","","","","","","","","","","",false,false,true,false,false,false,false,false,false,false,false,false,false,false,false,false,false,false,false,false,false,false,false,false,false,false,false,false,false,false,"",null,null,null,null,null,null,null,null,null,null,null,null,null,null,null,null,null,null,null,null,null,null,null,null,null,null,null,null,null,null,false,false,"",false,false,"",false,false,"",null,null,null,null,null,null,null,null,null,null,null,"",false,false,"",false,false,"",false,false,"",false,false,false,false,"",false,false,false,false,"","","","","","","","","","","","",false,false,false,false,false,false,false,false,false,false,false,false,false,false,false,false,false,false,false,false,""]
["Chantereaux","Axelle","2008-04-03",{"$f":"IF(MONTH(TODAY())>MONTH(C46),YEAR(TODAY())-YEAR(C46),IF(MONTH(TODAY())<MONTH(C46),YEAR(TODAY())-YEAR(C46)-1,IF(DAY(TODAY())<DAY(C46),YEAR(TODAY())-YEAR(C46)-1,YEAR(TODAY())-YEAR(C46))))","v":7}]
["Chauvat","Heloïse","2005-01-26",{"$f":"IF(MONTH(TODAY())>MONTH(C47),YEAR(TODAY())-YEAR(C47),IF(MONTH(TODAY())<MONTH(C47),YEAR(TODAY())-YEAR(C47)-1,IF(DAY(TODAY())<DAY(C47),YEAR(TODAY())-YEAR(C47)-1,YEAR(TODAY())-YEAR(C47))))","v":10}]
["Cher","Axel","28/12/2004","10","Rodez","","Garçon","","","","Oui","","","","","","","","","","","","","","","","","","","","","","","",true,true,true,false,true,true,true,true,true,true,false,false,false,true,false,false,false,false,false,false,false,false,false,false,false,false,false,false,false,false,"",false,false,"",false,false,"",false,false,"",false,false,"",false,false,"",false,false,"",false,false,"",false,false,"",false,false,"",false,false,"",false,false,false,false,"",false,false,false,false,"","","","","","","","","","","","",false,false,false,false,false,false,false,false,false,false,false,false,false,false,false,false,false,false,false,false,""]
["Cher","Zélie","04/05/2010","5","Rignac SJO","","Fille","","","","Oui","","","","","","","","","","","","","","","","","","","","","","","",true,true,true,true,true,true,true,true,true,true,false,false,false,true,false,false,false,false,false,false,false,false,false,false,false,false,false,false,false,false,"",false,false,"",false,false,"",false,false,"",false,false,"",false,false,"",false,false,"",false,false,"",false,false,"",false,false,"",false,false,"",false,false,false,false,"",false,false,false,false,"","","","","","","","","","","","",false,false,false,false,false,false,false,false,false,false,false,false,false,false,false,false,false,false,false,false,""]
["Cledes","Tom","2009-03-13",{"$f":"IF(MONTH(TODAY())>MONTH(C50),YEAR(TODAY())-YEAR(C50),IF(MONTH(TODAY())<MONTH(C50),YEAR(TODAY())-YEAR(C50)-1,IF(DAY(TODAY())<DAY(C50),YEAR(TODAY())-YEAR(C50)-1,YEAR(TODAY())-YEAR(C50))))","v":6}]
["Coinon","Noé","2005-12-12",{"$f":"IF(MONTH(TODAY())>MONTH(C51),YEAR(TODAY())-YEAR(C51),IF(MONTH(TODAY())<MONTH(C51),YEAR(TODAY())-YEAR(C51)-1,IF(DAY(TODAY())<DAY(C51),YEAR(TODAY())-YEAR(C51)-1,YEAR(TODAY())-YEAR(C51))))","v":10}]
["Colinet","Laura","2008-09-02",{"$f":"IF(MONTH(TODAY())>MONTH(C52),YEAR(TODAY())-YEAR(C52),IF(MONTH(TODAY())<MONTH(C52),YEAR(TODAY())-YEAR(C52)-1,IF(DAY(TODAY())<DAY(C52),YEAR(TODAY())-YEAR(C52)-1,YEAR(TODAY())-YEAR(C52))))","v":7}]
["Colinet","Lisa","2011-06-05",{"$f":"IF(MONTH(TODAY())>MONTH(C53),YEAR(TODAY())-YEAR(C53),IF(MONTH(TODAY())<MONTH(C53),YEAR(TODAY())-YEAR(C53)-1,IF(DAY(TODAY())<DAY(C53),YEAR(TODAY())-YEAR(C53)-1,YEAR(TODAY())-YEAR(C53))))","v":4}]
["Conde","India","12/08/2011","4","Anglars","","Fille","","","","Oui","","","","","","","","","","","","","","","","","","","","","","","",true,true,true,true,true,true,true,true,true,true,false,false,false,false,false,false,false,false,false,false,false,false,false,false,false,false,false,false,false,false,"",false,false,"",false,false,"",false,false,"",false,false,"",false,false,"",false,false,"",false,false,"",false,false,"",false,false,"",false,false,"",false,false,false,false,"",false,false,false,false,"","","","","","","","","","","","",false,false,false,false,false,false,false,false,false,false,false,false,false,false,false,false,false,false,false,false,""]
["Conde","Leny","18/01/2009","6","Anglars","","Garçon","","","","","","","","","","","","","","","","","","","","","","","","","","","",true,true,true,true,true,true,true,true,true,true,true,false,false,false,false,false,false,false,false,false,false,false,false,false,false,false,false,false,false,false,"",false,false,"",false,false,"",false,false,"",false,false,"",false,false,"",false,false,"",false,false,"",false,false,"",false,false,"",false,false,"",false,false,false,false,"",false,false,false,false,"","","","","","","","","","","","",false,false,false,false,false,false,false,false,false,true,false,true,false,false,false,false,false,false,false,false,"","","","","","","","","","",false,false,false,false,false,false,false,false,false,false,false,false,false,false,false,false,false,false,false,false,""]
["Cortes","Lizéa","10/01/2012","3","Anglars","","Fille","","","","","","","","","","","","","","","","","","","","","","","","","","","",true,true,true,true,false,false,false,false,false,false,false,false,false,false,false,false,false,false,false,false]
["Couderc","Adrien","2006-02-28",{"$f":"IF(MONTH(TODAY())>MONTH(C57),YEAR(TODAY())-YEAR(C57),IF(MONTH(TODAY())<MONTH(C57),YEAR(TODAY())-YEAR(C57)-1,IF(DAY(TODAY())<DAY(C57),YEAR(TODAY())-YEAR(C57)-1,YEAR(TODAY())-YEAR(C57))))","v":9}]
["Couderc","Léo","01/01/2010","5","Mayran","","Garçon","","","","Oui","","","","","","","","","","","","","","","","","","","","","","","",false,false,false,true,false,false,false,false,false,false,false,false,false,false,false,false,false,false,false,false,false,false,false,false,false,false,false,false,false,false,"",false,false,"",false,false,"",false,false,"",false,false,"",false,false,"",false,false,"",false,false,"",false,false,"",false,false,"",false,false,"",false,false,false,false,"",false,false,false,false,"","","","","","","","","","","","",false,false,false,false,false,false,false,false,false,false,false,false,false,false,false,false,false,false,false,false,""]
["Couderc","Lucie","2008-02-13",{"$f":"IF(MONTH(TODAY())>MONTH(C59),YEAR(TODAY())-YEAR(C59),IF(MONTH(TODAY())<MONTH(C59),YEAR(TODAY())-YEAR(C59)-1,IF(DAY(TODAY())<DAY(C59),YEAR(TODAY())-YEAR(C59)-1,YEAR(TODAY())-YEAR(C59))))","v":7}]
["Couderc","Margaux","01/01/2010","5","Mayran","","Fille","","","","Oui","","","","","","","","","","","","","","","","","","","","","","","",false,false,false,true,false,false,false,false,false,false,false,false,false,false,false,false,false,false,false,false,false,false,false,false,false,false,false,false,false,false,"",false,false,"",false,false,"",false,false,"",false,false,"",false,false,"",false,false,"",false,false,"",false,false,"",false,false,"",false,false,"",false,false,false,false,"",false,false,false,false,"","","","","","","","","","","","",false,false,false,false,false,false,false,false,false,false,false,false,false,false,false,false,false,false,false,false,""]
["Couffignal","Eddy","07/08/2007","8","Rodez","","Garçon","","","","Oui","","","","","","","","","","","","","","","","","","","","","","","",true,true,true,true,true,true,false,false,false,false,false,false,false,false,false,false,false,false,false,false,false,false,false,false,false,false,false,false,false,false,"",false,false,"",false,false,"",false,false,"",false,false,"",false,false,"",false,false,"",false,false,"",false,false,"",false,false,"",false,false,"",false,false,false,false,"",false,false,false,false,"","","","","","","","","","","","",false,false,false,false,false,false,false,false,false,false,false,false,false,false,false,false,false,false,false,false,""]
["Couffignal","Sacha","10/04/2010","5","Mayran","","Garçon","","","","Oui","","","","","","","","","","","","","","","","","","","","","","","",true,true,true,true,true,true,false,false,false,false,false,false,false,false,false,false,false,false,false,false,false,false,false,false,false,false,false,false,false,false,"",false,false,"",false,false,"",false,false,"",false,false,"",false,false,"",false,false,"",false,false,"",false,false,"",false,false,"",false,false,"",false,false,false,false,"",false,false,false,false,"","","","","","","","","","","","",false,false,false,false,false,false,false,false,false,false,false,false,false,false,false,false,false,false,false,false,""]
["Courdesses","Elfie","2009-04-30",{"$f":"IF(MONTH(TODAY())>MONTH(C63),YEAR(TODAY())-YEAR(C63),IF(MONTH(TODAY())<MONTH(C63),YEAR(TODAY())-YEAR(C63)-1,IF(DAY(TODAY())<DAY(C63),YEAR(TODAY())-YEAR(C63)-1,YEAR(TODAY())-YEAR(C63))))","v":6}]
["Courdesses","Elona","2011-07-20",{"$f":"IF(MONTH(TODAY())>MONTH(C64),YEAR(TODAY())-YEAR(C64),IF(MONTH(TODAY())<MONTH(C64),YEAR(TODAY())-YEAR(C64)-1,IF(DAY(TODAY())<DAY(C64),YEAR(TODAY())-YEAR(C64)-1,YEAR(TODAY())-YEAR(C64))))","v":4}]
["Couronne","Julian","2006-12-24",{"$f":"IF(MONTH(TODAY())>MONTH(C65),YEAR(TODAY())-YEAR(C65),IF(MONTH(TODAY())<MONTH(C65),YEAR(TODAY())-YEAR(C65)-1,IF(DAY(TODAY())<DAY(C65),YEAR(TODAY())-YEAR(C65)-1,YEAR(TODAY())-YEAR(C65))))","v":9}]
["Couto-f","Zoé","31/10/2010","5","Rignac SJO","","Fille","","","","Oui","","","","","","","","","","","","","","","","","","","","","","","",false,true,true,true,true,true,true,true,true,true,false,false,false,false,false,false,false,false,false,false,false,false,false,false,false,false,false,false,false,false,"",false,false,"",false,false,"",false,false,"",false,false,"",false,false,"",false,false,"",false,false,"",false,false,"",false,false,"",false,false,"",false,false,false,false,"",false,false,false,false,"","","","","","","","","","","","",false,false,false,false,false,false,false,false,false,false,false,false,false,false,false,false,false,false,false,false,""]
["Cristol","Alexis","24/02/2011","4","Anglars","","Garçon","","","","Oui","","","","","","","","","","","","","","","","","","","","","","","",true,true,true,true,true,true,true,true,true,true,false,false,false,false,false,false,false,false,false,false,false,false,false,false,false,false,false,false,false,false,"",false,false,"",false,false,"",false,false,"",false,false,"",false,false,"",false,false,"",false,false,"",false,false,"",false,false,"",false,false,"",false,false,false,false,"",false,false,false,false,"","","","","","","","","","","","",false,false,false,false,false,false,false,false,false,false,false,false,false,false,false,false,false,false,false,false,""]
["Dalpeyrat","Zoé","2009-04-18",{"$f":"IF(MONTH(TODAY())>MONTH(C68),YEAR(TODAY())-YEAR(C68),IF(MONTH(TODAY())<MONTH(C68),YEAR(TODAY())-YEAR(C68)-1,IF(DAY(TODAY())<DAY(C68),YEAR(TODAY())-YEAR(C68)-1,YEAR(TODAY())-YEAR(C68))))","v":6}]
["Dardu-M","Robin","29/01/2009","6","","","","","","","","","","","","","","","","","","","","","","","","","","","","","","",false,false,false,false,false,false,false,false,false,false,false,false,false,false,false,false,false,false,false,false,false,false,false,false,false,false,false,false,false,false,"",false,false,"",false,false,"",false,false,"",false,false,"",false,false,"",false,false,"",false,false,"",false,false,"",false,false,"",false,false,"",false,false,false,false,"",false,false,false,false,"","","","","","","","","","","","",false,false,false,false,false,false,false,false,false,false,false,false,false,false,false,false,false,false,false,false,""]
["Dardu-M","Léo","2007-06-04",{"$f":"IF(MONTH(TODAY())>MONTH(C70),YEAR(TODAY())-YEAR(C70),IF(MONTH(TODAY())<MONTH(C70),YEAR(TODAY())-YEAR(C70)-1,IF(DAY(TODAY())<DAY(C70),YEAR(TODAY())-YEAR(C70)-1,YEAR(TODAY())-YEAR(C70))))","v":8}]
["Delabrousse-R","Maélyne","03/06/2012","3","Bournazel","","Fille","","","","Oui","","","","","","","","","","","","","","","","","","","","","","","",true,true,true,true,true,true,true,true,true,true,false,false,false,false,false,false,false,false,false,false,false,false,false,false,false,false,false,false,false,false,"",false,false,"",false,false,"",false,false,"",false,false,"",false,false,"",false,false,"",false,false,"",false,false,"",false,false,"",false,false,"",false,false,false,false,"",false,false,false,false,"","","","","","","","","","","","",false,false,false,false,false,false,false,false,false,false,false,false,false,false,false,false,false,false,false,false,""]
["Delforge","Célian","2009-07-03",{"$f":"IF(MONTH(TODAY())>MONTH(C72),YEAR(TODAY())-YEAR(C72),IF(MONTH(TODAY())<MONTH(C72),YEAR(TODAY())-YEAR(C72)-1,IF(DAY(TODAY())<DAY(C72),YEAR(TODAY())-YEAR(C72)-1,YEAR(TODAY())-YEAR(C72))))","v":6}]
["Delforge","Manon","2002-05-13",{"$f":"IF(MONTH(TODAY())>MONTH(C73),YEAR(TODAY())-YEAR(C73),IF(MONTH(TODAY())<MONTH(C73),YEAR(TODAY())-YEAR(C73)-1,IF(DAY(TODAY())<DAY(C73),YEAR(TODAY())-YEAR(C73)-1,YEAR(TODAY())-YEAR(C73))))","v":13}]
["Didyne","Lisa","2010-08-19",{"$f":"IF(MONTH(TODAY())>MONTH(C74),YEAR(TODAY())-YEAR(C74),IF(MONTH(TODAY())<MONTH(C74),YEAR(TODAY())-YEAR(C74)-1,IF(DAY(TODAY())<DAY(C74),YEAR(TODAY())-YEAR(C74)-1,YEAR(TODAY())-YEAR(C74))))","v":5}]
["Didyne","Lucas","2007-01-08",{"$f":"IF(MONTH(TODAY())>MONTH(C75),YEAR(TODAY())-YEAR(C75),IF(MONTH(TODAY())<MONTH(C75),YEAR(TODAY())-YEAR(C75)-1,IF(DAY(TODAY())<DAY(C75),YEAR(TODAY())-YEAR(C75)-1,YEAR(TODAY())-YEAR(C75))))","v":9}]
["Dulain","Alice","2011-11-05","04","","","Fille","","","","Oui","","","","","","","","","","","","","","","","","","","","","","","",false,false,false,false,false,false,false,false,false,false,false,false,false,true,false,false,false,false,false,false,false,false,false,false,false,false,false,false,false,false,"",false,false,"",false,false,"",false,false,"",false,false,"",false,false,"",false,false,"",false,false,"",false,false,"",false,false,"",false,false,"",false,false,false,false,"",false,false,false,false,"","","","","","","","","","","","",false,false,false,false,false,false,false,false,false,false,false,false,false,false,false,false,false,false,false,false,"PORTE DES LUNETTES"]
["Dulain","Mathieu","22/05/09","06","Goutrens","","Garçon","","","","Oui","","","","","","","","","","","","","","","","","","","","","",null,null,false,false,false,false,false,false,false,false,false,false,false,false,false,false,false,false,false,false,false,false,false,false,false,false,false,false,false,false,false,false,"",false,false,"",false,false,"",false,false,"",false,false,"",false,false,"",false,false,"",false,false,"",false,false,"",false,false,"",false,false,"",false,false,false,false,"",false,false,false,false,"","","","","","","","","","","","",false,false,false,false,false,false,false,false,false,false,false,false,false,false,false,false,false,false,false,false,"PORTE DES LUNETTES"]
["Dunet","Enora","03/05/2007","8","Rignac SJO","","Fille","","","","Oui","","","","","","","","","","","","","","","","","","","","","","","",true,true,true,true,true,true,true,true,true,true,false,false,false,false,false,false,false,false,false,false,false,false,false,false,false,false,false,false,false,false,"",false,false,"",false,false,"",false,false,"",false,false,"",false,false,"",false,false,"",false,false,"",false,false,"",false,false,"",false,false,"",false,false,false,false,"",false,false,false,false,"","","","","","","","","","","","",false,false,false,false,false,false,false,false,false,false,false,false,false,false,false,false,false,false,false,false,""]
["Dunet","Tom","12/06/2009","6","Rignac SJO","","Garçon","","","","","","","","","","","","","","","","","","","","","","","","","","","",true,true,true,true,true,true,true,true,true,true,false,false,false,false,false,false,false,false,false,false,false,false,false,false,false,false,false,false,false,false,"",false,false,"",false,false,"",false,false,"",false,false,"",false,false,"",false,false,"",false,false,"",false,false,"",false,false,"",false,false,"",false,false,false,false,"",false,false,false,false,"","","","","","","","","","","","",false,false,false,false,false,false,false,false,false,false,false,false,false,false,false,false,false,false,false,false,""]
["Dupont","Gabin","10/04/2009","6","Anglars","","Garçon","","","","Oui","","","","","","","","","","","","","","","","","","","","","","","",true,true,true,true,true,true,true,true,true,true,true,false,false,false,false,false,false,false,false,false,false,false,false,false,false,false,false,false,false,false,"",false,false,"",false,false,"",false,false,"",false,false,"",false,false,"",false,false,"",false,false,"",false,false,"",false,false,"",false,false,"",false,false,false,false,"",false,false,false,false,"","","","","","","","","","","","",false,false,false,false,false,false,false,false,false,false,false,false,false,false,false,false,false,false,false,false,""]
["Dupré Cazor","louis","15/11/2008","07","Mayran","","Garçon","","","","Oui","","","","","","","","","","","","","","","","","","","","","",null,null,false,false,false,false,false,false,false,false,false,false,false,false,false,false,false,false,false,false,false,false,false,false,false,false,false,false,false,false,false,false,"",false,false,"",false,false,"",false,false,"",false,false,"",false,false,"",false,false,"",false,false,"",false,false,"",false,false,"",false,false,"",false,false,false,false,"",false,false,false,false,"","","","","","","","","","","","",false,false,false,false,false,false,false,false,false,false,false,false,false,false,false,false,false,false,false,false,""]
["Dupré Cazor","Margaux","11/09/2010","05","Mayran","","Fille","","","","Oui","","","","","","","","","","","","","","","","","","","","","","","",false,false,false,true,false,false,false,false,false,false,false,false,false,false,false,false,false,false,false,false,false,false,false,false,false,false,false,false,false,false,"",false,false,"",false,false,"",false,false,"",false,false,"",false,false,"",false,false,"",false,false,"",false,false,"",false,false,"",false,false,"",false,false,false,false,"",false,false,false,false,"","","","","","","","","","","","",false,false,false,false,false,false,false,false,false,false,false,false,false,false,false,false,false,false,false,false,""]
["Dupre-C","Margot","11/09/2010","5","Mayran","","Fille","","","","","","","","","","","","","","","","","","","","","","","","","","","",false,true,false,false,false,false,false,false,false,false,false,false,false,false,false,false,false,false,false,false]
["Dupre-C","Louis","15/11/2008","7","Mayran","","Garçon","","","","","","","","","","","","","","","","","","","","","","","","","","","",true,true,false,false,false,false,false,false,false,false,false,false,false,false,false,false,false,false,false,false]
["Dupré-C","Margot","2010-09-11",{"$f":"IF(MONTH(TODAY())>MONTH(C85),YEAR(TODAY())-YEAR(C85),IF(MONTH(TODAY())<MONTH(C85),YEAR(TODAY())-YEAR(C85)-1,IF(DAY(TODAY())<DAY(C85),YEAR(TODAY())-YEAR(C85)-1,YEAR(TODAY())-YEAR(C85))))","v":5}]
["Elhadrati","Ilyes","31/12/2011","3","Mayran","","Garçon","","","","","","","","","","","","","","","","","","","","","","","","","","","",false,false,true,true,true,false,false,false,false,false,false,false,false,false,false,false,false,false,false,false,false,false,false,false,false,false,false,false,false,false,"",false,false,"",false,false,"",false,false,"",false,false,"",false,false,"",false,false,"",false,false,"",false,false,"",false,false,"",false,false,"",false,false,false,false,"",false,false,false,false,"","","","","","","","","","","","",false,false,false,false,false,false,false,false,false,false,false,false,false,false,false,false,false,false,false,false,""]
["Elhadrati","Nora","16/09/2006","9","Mayran","","Fille","","","","Oui","","","","","","","","","","","","","","","","","","","","","","","",false,false,true,true,true,false,false,false,false,false,false,false,false,false,false,false,false,false,false,false,false,false,false,false,false,false,false,false,false,false,"",false,false,"",false,false,"",false,false,"",false,false,"",false,false,"",false,false,"",false,false,"",false,false,"",false,false,"",false,false,"",false,false,false,false,"",false,false,true,false,"","","","","","","","","","","","",false,false,false,false,false,false,false,false,false,false,false,false,false,false,false,false,false,false,false,false,""]
["Elhadrati","Wacil","29/10/2009","6","Mayran","","Garçon","","","","Oui","","","","","","","","","","","","","","","","","","","","","","","",false,false,true,true,true,false,false,false,false,false,false,false,false,false,false,false,false,false,false,false,false,false,false,false,false,false,false,false,false,false,"",false,false,"",false,false,"",false,false,"",false,false,"",false,false,"",false,false,"",false,false,"",false,false,"",false,false,"",false,false,"",false,false,false,false,"",false,false,true,false,"","","","","","","","","","","","",false,false,false,false,false,false,false,false,false,false,false,false,false,false,false,false,false,false,false,false,""]
["Fabre","Maelly","17/05/2011","4","Mayran","","Fille","","","","","","","","","","","","","","","","","","","","","","","","","","","",true,true,true,false,false,false,false,false,false,false,false,false,false,false,false,false,false,false,false,false]
["Falip","Hermine","2008-02-16",{"$f":"IF(MONTH(TODAY())>MONTH(C90),YEAR(TODAY())-YEAR(C90),IF(MONTH(TODAY())<MONTH(C90),YEAR(TODAY())-YEAR(C90)-1,IF(DAY(TODAY())<DAY(C90),YEAR(TODAY())-YEAR(C90)-1,YEAR(TODAY())-YEAR(C90))))","v":7}]
["Farret-M","Jules","2009-08-13",{"$f":"IF(MONTH(TODAY())>MONTH(C91),YEAR(TODAY())-YEAR(C91),IF(MONTH(TODAY())<MONTH(C91),YEAR(TODAY())-YEAR(C91)-1,IF(DAY(TODAY())<DAY(C91),YEAR(TODAY())-YEAR(C91)-1,YEAR(TODAY())-YEAR(C91))))","v":6}]
["Faurie","Estelle","2006-09-25",{"$f":"IF(MONTH(TODAY())>MONTH(C92),YEAR(TODAY())-YEAR(C92),IF(MONTH(TODAY())<MONTH(C92),YEAR(TODAY())-YEAR(C92)-1,IF(DAY(TODAY())<DAY(C92),YEAR(TODAY())-YEAR(C92)-1,YEAR(TODAY())-YEAR(C92))))","v":9}]
["Fleck","Lina","25/04/2012","3","Rignac","","Fille","","","","","","","","","","","","","","","","","","","","","","","","","","","",false,true,false,false,false,false,false,false,false,false,false,false,false,false,false,false,false,false,false,false]
["Fleck","Nathan","09/03/2006","9","Rignac","","Garçon","","","","","","","","","","","","","","","","","","","","","","","","","","","",false,false,false,false,false,false,false,false,false,false,false,false,false,false,false,false,false,false,false,false]
["Flotte","Emma","20/03/2010","5","Goutrens","","Fille","","","","Oui","","","","","","","","","","","","","","","","","","","","","","","",true,true,true,true,true,true,true,true,true,true,false,false,false,false,false,false,false,false,false,false,false,false,false,false,false,false,false,false,false,false,"",false,false,"",false,false,"",false,false,"",false,false,"",false,false,"",false,false,"",false,false,"",false,false,"",false,false,"",false,false,"",false,false,false,false,"",false,false,false,false,"","","","","","","","","","","","",false,false,false,false,false,false,false,false,false,false,false,false,false,false,false,false,false,false,false,false,""]
["Flotte","Mathis","2006-03-28",{"$f":"IF(MONTH(TODAY())>MONTH(C96),YEAR(TODAY())-YEAR(C96),IF(MONTH(TODAY())<MONTH(C96),YEAR(TODAY())-YEAR(C96)-1,IF(DAY(TODAY())<DAY(C96),YEAR(TODAY())-YEAR(C96)-1,YEAR(TODAY())-YEAR(C96))))","v":9}]
["Fontaine","Aline","20/04/2009","06","Rignac","","Fille","","","","Oui","","","","","","","","","","","","","","","","","","","","","","","",false,false,false,false,true,false,false,false,false,false,false,false,false,false,false,false,false,false,false,false,false,false,false,false,false,false,false,false,false,false,"",false,false,"",false,false,"",false,false,"",false,false,"",false,false,"",false,false,"",false,false,"",false,false,"",false,false,"",false,false,"",false,false,false,false,"",false,false,false,false,"","","","","","","","","","","","",false,false,false,false,false,false,false,false,false,false,false,false,false,false,false,false,false,false,false,false,""]
["Fourestie","Charlotte","2005-01-05",{"$f":"IF(MONTH(TODAY())>MONTH(C98),YEAR(TODAY())-YEAR(C98),IF(MONTH(TODAY())<MONTH(C98),YEAR(TODAY())-YEAR(C98)-1,IF(DAY(TODAY())<DAY(C98),YEAR(TODAY())-YEAR(C98)-1,YEAR(TODAY())-YEAR(C98))))","v":11}]
["Fourmont","Mylena","15/01/2007","8","Escandolières","","Fille","","","","Oui","","","","","","","","","","","","","","","","","","","","","","","",false,true,true,true,true,true,false,false,false,false,false,false,false,false,false,false,false,false,false,false,false,false,false,false,false,false,false,false,false,false,"",false,false,"",false,false,"",false,false,"",false,false,"",false,false,"",false,false,"",false,false,"",false,false,"",false,false,"",false,false,"",false,false,false,false,"",false,false,false,false,"","","","","","","","","","","","",false,false,false,false,false,false,false,false,false,false,false,false,false,false,false,false,false,false,false,false,""]
["Fourmont","Noah","15/11/2009","6","Goutrens","","Garçon","","","","Oui","","","","","","","","","","","","","","","","","","","","","","","",true,true,true,true,true,true,false,false,false,false,false,false,false,false,false,false,false,false,false,false,false,false,false,false,false,false,false,false,false,false,"",false,false,"",false,false,"",false,false,"",false,false,"",false,false,"",false,false,"",false,false,"",false,false,"",false,false,"",false,false,"",false,false,false,false,"",false,false,false,false,"","","","","","","","","","","","",false,false,false,false,false,false,false,false,false,false,false,false,false,false,false,false,false,false,false,false,""]
["Fournié","Noah","2005-10-26",{"$f":"IF(MONTH(TODAY())>MONTH(C101),YEAR(TODAY())-YEAR(C101),IF(MONTH(TODAY())<MONTH(C101),YEAR(TODAY())-YEAR(C101)-1,IF(DAY(TODAY())<DAY(C101),YEAR(TODAY())-YEAR(C101)-1,YEAR(TODAY())-YEAR(C101))))","v":10}]
["Fournier","Farell","01/01/2011","4","Rignac SJO","","Garçon","","","","Oui","","","","","","","","","","","","","","","","","","","","","","","",true,true,true,true,true,true,true,true,true,true,false,false,false,false,false,false,false,false,false,false,false,false,false,false,false,false,false,false,false,false,"",false,false,"",false,false,"",false,false,"",false,false,"",false,false,"",false,false,"",false,false,"",false,false,"",false,false,"",false,false,"",false,false,false,false,"",false,false,false,false,"","","","","","","","","","","","",false,false,false,false,false,false,false,false,false,false,false,false,false,false,false,false,false,false,false,false,""]
["Galibert","Arthur","2007-11-17",{"$f":"IF(MONTH(TODAY())>MONTH(C103),YEAR(TODAY())-YEAR(C103),IF(MONTH(TODAY())<MONTH(C103),YEAR(TODAY())-YEAR(C103)-1,IF(DAY(TODAY())<DAY(C103),YEAR(TODAY())-YEAR(C103)-1,YEAR(TODAY())-YEAR(C103))))","v":8}]
["Gares","Eloïse","13/01/2006","9","Mayran","","Fille","","","","Oui","","","","","","","","","","","","","","","","","","","","","","","",true,true,true,true,true,true,true,true,true,true,true,false,false,false,false,false,false,false,false,false,false,false,false,false,false,false,false,false,false,false,"",false,false,"",false,false,"",false,false,"",false,false,"",false,false,"",false,false,"",false,false,"",false,false,"",false,false,"",false,false,"",false,false,false,false,"",false,false,false,false,"","","","","","","","","","","","",false,false,false,false,false,false,false,false,false,false,false,false,false,false,false,false,false,false,false,false,""]
["Gaubert","Elie","2006-02-14",{"$f":"IF(MONTH(TODAY())>MONTH(C105),YEAR(TODAY())-YEAR(C105),IF(MONTH(TODAY())<MONTH(C105),YEAR(TODAY())-YEAR(C105)-1,IF(DAY(TODAY())<DAY(C105),YEAR(TODAY())-YEAR(C105)-1,YEAR(TODAY())-YEAR(C105))))","v":9}]
["Gaubert","Etienne","2003-11-03",12]
["Gaubert","Inès","2007-10-22",8]
["Gayraud","Noé","2010-02-22",5]
["Gineste","Alice","2005-07-24",10]
["Gineste","Hugo","2004-06-05",11]
["Girard","Chloé","2004-03-22",11]
["Girard-Ruel","Ludmilla","11/05/2011","4","","","Fille","","","","","","","","","","","","","","","","","","","","","","","","","","","",false,false,false,false,false,false,false,false,false,false,false,false,false,false,false,false,false,false,false,false,false,false,false,false,false,false,false,false,false,false,"",false,false,"",false,false,"",false,false,"",false,false,"",false,false,"",false,false,"",false,false,"",false,false,"",false,false,"",false,false,"",false,false,false,false,"Appliquer uniquement sa crème solaire",false,false,false,false,"","","","","","","Maquillage","","","","","",false,false,false,false,false,false,false,false,false,false,false,false,false,false,false,false,false,false,false,false,""]
["Giraud","Charlie","2006-02-09",{"$f":"IF(MONTH(TODAY())>MONTH(C113),YEAR(TODAY())-YEAR(C113),IF(MONTH(TODAY())<MONTH(C113),YEAR(TODAY())-YEAR(C113)-1,IF(DAY(TODAY())<DAY(C113),YEAR(TODAY())-YEAR(C113)-1,YEAR(TODAY())-YEAR(C113))))","v":9}]
["Giraud","Loona","2006-02-09",{"$f":"IF(MONTH(TODAY())>MONTH(C114),YEAR(TODAY())-YEAR(C114),IF(MONTH(TODAY())<MONTH(C114),YEAR(TODAY())-YEAR(C114)-1,IF(DAY(TODAY())<DAY(C114),YEAR(TODAY())-YEAR(C114)-1,YEAR(TODAY())-YEAR(C114))))","v":9}]
["Hebrard","Noah","2008-05-15",{"$f":"IF(MONTH(TODAY())>MONTH(C115),YEAR(TODAY())-YEAR(C115),IF(MONTH(TODAY())<MONTH(C115),YEAR(TODAY())-YEAR(C115)-1,IF(DAY(TODAY())<DAY(C115),YEAR(TODAY())-YEAR(C115)-1,YEAR(TODAY())-YEAR(C115))))","v":7}]
["Heliez","Laurine","2007-08-07",{"$f":"IF(MONTH(TODAY())>MONTH(C116),YEAR(TODAY())-YEAR(C116),IF(MONTH(TODAY())<MONTH(C116),YEAR(TODAY())-YEAR(C116)-1,IF(DAY(TODAY())<DAY(C116),YEAR(TODAY())-YEAR(C116)-1,YEAR(TODAY())-YEAR(C116))))","v":8}]
["Hernandez","Mathis","2003-03-26",{"$f":"IF(MONTH(TODAY())>MONTH(C117),YEAR(TODAY())-YEAR(C117),IF(MONTH(TODAY())<MONTH(C117),YEAR(TODAY())-YEAR(C117)-1,IF(DAY(TODAY())<DAY(C117),YEAR(TODAY())-YEAR(C117)-1,YEAR(TODAY())-YEAR(C117))))","v":12}]
["Herrlé","Yoan","20/03/2006","9","Rignac SJO","","Garçon","","","","","","","","","","","","","","","","","","","","","","","","","","","",true,true,true,true,false,false,false,false,false,false,false,false,false,false,false,false,false,false,false,false]
["Hoyes","Rachelle","28/12/2008","6","Roussennac","","Fille","","","","Oui","","","","","","","","","","","","","","","","","","","","","","","",true,true,true,true,true,true,true,true,true,true,true,false,false,false,false,false,false,false,false,false,false,false,false,false,false,false,false,false,false,false,"",false,false,"",false,false,"",false,false,"",false,false,"",false,false,"",false,false,"",false,false,"",false,false,"",false,false,"",false,false,"",false,false,false,false,"",false,false,false,false,"","","","","","","","","","","","",false,false,false,false,false,false,false,false,false,false,false,false,false,false,false,false,false,false,false,false,""]
["Issalys","Jade","27/06/2007","8","Mayran","","Fille","","","","Oui","","","","","","","","","","","","","","","","","","","","","","","",true,true,true,true,false,false,false,false,false,false,false,false,false,false,false,false,false,false,false,false,false,false,false,false,false,false,false,false,false,false,"",false,false,"",false,false,"",false,false,"",false,false,"",false,false,"",false,false,"",false,false,"",false,false,"",false,false,"",false,false,"",false,false,false,false,"",false,false,false,false,"","","","","","","","","","","","",false,false,false,false,false,false,false,false,false,false,false,false,false,false,false,false,false,false,false,false,""]
["Issalys","Oscar","19/09/2010","5","Mayran","","Garçon","","","","","","","","","","","","","","","","","","","","","","","","","","","",true,true,true,true,false,false,false,false,false,false,false,false,false,false,false,false,false,false,false,false]
["Issanchou","Yanis","04/07/2010","5","","","Garçon","","","","","","","","","","","","","","","","","","","","","","","","","","","",false,false,false,false,false,false,false,false,false,false,false,false,false,false,false,false,false,false,false,false,false,false,false,false,false,false,false,false,false,false,"",false,false,"",false,false,"",false,false,"",false,false,"",false,false,"",false,false,"",false,false,"",false,false,"",false,false,"",false,false,"",false,false,false,false,"",false,false,false,false,"Lait de vache","Œufs","Arachides","Tous fruits à coques","","","","","","","","",false,false,false,false,false,false,false,false,false,false,false,false,false,false,false,false,false,false,false,false,""]
["Kervella","Anna","2010-01-04",{"$f":"IF(MONTH(TODAY())>MONTH(C123),YEAR(TODAY())-YEAR(C123),IF(MONTH(TODAY())<MONTH(C123),YEAR(TODAY())-YEAR(C123)-1,IF(DAY(TODAY())<DAY(C123),YEAR(TODAY())-YEAR(C123)-1,YEAR(TODAY())-YEAR(C123))))","v":6}]
["Lasserre","Baptiste","2005-09-25",10]
["Laval","Elléa","2010-07-13",5]
["Laval","Illona","2005-09-04",10]
["Lazuech","Mathéo","2011-04-30",4]
["Lefort","Milan","2005-05-09",10]
["Legouil","Méline","2010-06-01",5]
["Mahut","Sarah","11/07/2008","7","Rignac","","Fille","","","","Oui","","","","","","","","","","","","","","","","","","","","","","","",true,true,true,true,true,true,true,true,true,true,true,false,false,false,false,false,false,false,false,false,false,false,false,false,false,false,false,false,false,false,"",false,false,"",false,false,"",false,false,"",false,false,"",false,false,"",false,false,"",false,false,"",false,false,"",false,false,"",false,false,"",false,false,false,false,"",false,false,false,false,"","","","","","","","","","","","",false,false,false,false,false,false,false,false,false,false,false,false,false,false,false,false,false,false,false,false,""]
["Malrieu","Lorna","2005-08-09",{"$f":"IF(MONTH(TODAY())>MONTH(C131),YEAR(TODAY())-YEAR(C131),IF(MONTH(TODAY())<MONTH(C131),YEAR(TODAY())-YEAR(C131)-1,IF(DAY(TODAY())<DAY(C131),YEAR(TODAY())-YEAR(C131)-1,YEAR(TODAY())-YEAR(C131))))","v":10}]
["Margot","Tom","2008-12-12",{"$f":"IF(MONTH(TODAY())>MONTH(C132),YEAR(TODAY())-YEAR(C132),IF(MONTH(TODAY())<MONTH(C132),YEAR(TODAY())-YEAR(C132)-1,IF(DAY(TODAY())<DAY(C132),YEAR(TODAY())-YEAR(C132)-1,YEAR(TODAY())-YEAR(C132))))","v":7}]
["Marty","Laurine","2010-05-07",{"$f":"IF(MONTH(TODAY())>MONTH(C133),YEAR(TODAY())-YEAR(C133),IF(MONTH(TODAY())<MONTH(C133),YEAR(TODAY())-YEAR(C133)-1,IF(DAY(TODAY())<DAY(C133),YEAR(TODAY())-YEAR(C133)-1,YEAR(TODAY())-YEAR(C133))))","v":5}]
["Marty","Mattéo","2006-05-10",{"$f":"IF(MONTH(TODAY())>MONTH(C134),YEAR(TODAY())-YEAR(C134),IF(MONTH(TODAY())<MONTH(C134),YEAR(TODAY())-YEAR(C134)-1,IF(DAY(TODAY())<DAY(C134),YEAR(TODAY())-YEAR(C134)-1,YEAR(TODAY())-YEAR(C134))))","v":9}]
["Massip","Lali","14/06/2010","5","Rignac SJO","","Fille","","","","Oui","","","","","","","","","","","","","","","","","","","","","","","",true,true,true,true,true,true,true,true,true,true,false,false,false,false,false,false,false,false,false,false,false,false,false,false,false,false,false,false,false,false,"",false,false,"",false,false,"",false,false,"",false,false,"",false,false,"",false,false,"",false,false,"",false,false,"",false,false,"",false,false,"",false,false,false,false,"",false,false,false,false,"","","","","","","","","","","","",false,false,false,false,false,false,false,false,false,false,false,false,false,false,false,false,false,false,false,false,""]
["Massip","Lola","18/07/2007","8","Rignac SJO","","Fille","","","","Oui","","","","","","","","","","","","","","","","","","","","","","","",true,true,true,true,true,true,true,true,true,true,true,false,false,false,false,false,false,false,false,false,false,false,false,false,false,false,false,false,false,false,"",false,false,"",false,false,"",false,false,"",false,false,"",false,false,"",false,false,"",false,false,"",false,false,"",false,false,"",false,false,"",false,false,false,false,"",false,false,false,false,"","","","","","","","","","","","",false,false,false,false,false,false,false,false,false,false,false,false,false,false,false,false,false,false,false,false,""]
["Massip","Mattéo","11/04/2007","08","Goutrens","","Garçon","","","","","Mr","Massip","Laurent","Le Puech Redon","12390","Goutrens","0565639062","0761453307","","Père","Mme","Massip","Martine","La Capelle del Vergue","12390","Escandolières","","0771028382","","Mère","","","",false,false,true,false,false,false,false,false,false,false,false,false,false,false,false,false,false,false,false,false]
["Massip","Noah","12/10/2010","05","Goutrens","","Garçon","","","","","","","","","","","","","","","","","","","","","","","","","","","",false,false,true,false,false,false,false,false,false,false,false,false,false,false,false,false,false,false,false,false,false,false,false,false,false,false,false,false,false,false,"",false,false,"",false,false,"",false,false,"",false,false,"",false,false,"",false,false,"",false,false,"",false,false,"",false,false,"",false,false,"",false,false,true,false,"Asthme ocasionnel traitement par ventoline",false,false,false,false,"Lactose","","","","","","","","","","","",false,false,false,false,false,false,false,false,false,false,false,false,false,false,false,false,false,false,false,false,""]
["Maurel","Théo","2009-01-13",{"$f":"IF(MONTH(TODAY())>MONTH(C139),YEAR(TODAY())-YEAR(C139),IF(MONTH(TODAY())<MONTH(C139),YEAR(TODAY())-YEAR(C139)-1,IF(DAY(TODAY())<DAY(C139),YEAR(TODAY())-YEAR(C139)-1,YEAR(TODAY())-YEAR(C139))))","v":7}]
["Mayran-Vergnes","Pierre","20/01/2008","7","Mayran","","Garçon","","","","","","","","","","","","","","","","","","","","","","","","","","","",false,false,true,false,false,false,false,false,false,false,false,false,false,false,false,false,false,false,false,false]
["Mazard","Titouan","2004-12-11",{"$f":"IF(MONTH(TODAY())>MONTH(C141),YEAR(TODAY())-YEAR(C141),IF(MONTH(TODAY())<MONTH(C141),YEAR(TODAY())-YEAR(C141)-1,IF(DAY(TODAY())<DAY(C141),YEAR(TODAY())-YEAR(C141)-1,YEAR(TODAY())-YEAR(C141))))","v":11}]
["Mazars","Gwendoline","2010-05-04",{"$f":"IF(MONTH(TODAY())>MONTH(C142),YEAR(TODAY())-YEAR(C142),IF(MONTH(TODAY())<MONTH(C142),YEAR(TODAY())-YEAR(C142)-1,IF(DAY(TODAY())<DAY(C142),YEAR(TODAY())-YEAR(C142)-1,YEAR(TODAY())-YEAR(C142))))","v":5}]
["Mazars","Mahtéo","09/03/2007","8","Rignac SJO","","Garçon","","","","","","","","","","","","","","","","","","","","","","","","","","","",true,true,true,true,false,false,false,false,false,false,false,false,false,false,false,false,false,false,false,false,false,false,false,false,false,false,false,false,false,false,"",false,false,"",false,false,"",false,false,"",false,false,"",false,false,"",false,false,"",false,false,"",false,false,"",false,false,"",false,false,"",false,false,false,false,"",false,false,false,false,"","","","","","","","","","","","",false,false,false,false,false,false,false,false,false,false,false,false,false,false,false,false,false,false,false,false,""]
["Mazars","Nathan","2007-02-26",{"$f":"IF(MONTH(TODAY())>MONTH(C144),YEAR(TODAY())-YEAR(C144),IF(MONTH(TODAY())<MONTH(C144),YEAR(TODAY())-YEAR(C144)-1,IF(DAY(TODAY())<DAY(C144),YEAR(TODAY())-YEAR(C144)-1,YEAR(TODAY())-YEAR(C144))))","v":8}]
["Mazars","Océane","2002-04-23",{"$f":"IF(MONTH(TODAY())>MONTH(C145),YEAR(TODAY())-YEAR(C145),IF(MONTH(TODAY())<MONTH(C145),YEAR(TODAY())-YEAR(C145)-1,IF(DAY(TODAY())<DAY(C145),YEAR(TODAY())-YEAR(C145)-1,YEAR(TODAY())-YEAR(C145))))","v":13}]
["Mazars","Mathéo","09/03/2007","08","Rignac SJO","","Garçon","","","","Oui","","","","","","","","","","","","","","","","","","","","","",null,null,false,false,false,false,false,false,false,false,false,false,false,false,false,false,false,false,false,false,false,false,false,false,false,false,false,false,false,false,false,false,"",false,false,"",false,false,"",false,false,"",false,false,"",false,false,"",false,false,"",false,false,"",false,false,"",false,false,"",false,false,"",false,false,false,false,"",false,false,false,false,"","","","","","","","","","","","",false,false,false,false,false,false,false,false,false,false,false,false,false,false,false,false,false,false,false,false,""]
["Melle","Yanis","2009-07-10",{"$f":"IF(MONTH(TODAY())>MONTH(C147),YEAR(TODAY())-YEAR(C147),IF(MONTH(TODAY())<MONTH(C147),YEAR(TODAY())-YEAR(C147)-1,IF(DAY(TODAY())<DAY(C147),YEAR(TODAY())-YEAR(C147)-1,YEAR(TODAY())-YEAR(C147))))","v":6}]
["Mezy","Faustine","18/08/2005","10","Rignac","","Fille","","","","","","","","","","","","","","","","","","","","","","","","","","","",false,false,true,false,false,false,false,false,false,false,false,false,false,false,false,false,false,false,false,false]
["Miquel","Alicia","2008-10-29",{"$f":"IF(MONTH(TODAY())>MONTH(C149),YEAR(TODAY())-YEAR(C149),IF(MONTH(TODAY())<MONTH(C149),YEAR(TODAY())-YEAR(C149)-1,IF(DAY(TODAY())<DAY(C149),YEAR(TODAY())-YEAR(C149)-1,YEAR(TODAY())-YEAR(C149))))","v":7}]
["Miquel","Laurène","26/04/2011","4","Rignac","","Fille","","","","","","","","","","","","","","","","","","","","","","","","","","","",false,false,false,true,false,false,false,false,false,false,false,false,false,false,false,false,false,false,false,false,false,false,false,false,false,false,false,false,false,false,"",false,false,"",false,false,"",false,false,"",false,false,"",false,false,"",false,false,"",false,false,"",false,false,"",false,false,"",false,false,"",false,false,false,false,"",false,false,false,false,"","","","","","","Maquillage","","","","","",false,false,false,false,false,false,false,false,false,false,false,false,false,false,false,false,false,false,false,false,""]
["Miquel","Pierre","2004-12-28",{"$f":"IF(MONTH(TODAY())>MONTH(C151),YEAR(TODAY())-YEAR(C151),IF(MONTH(TODAY())<MONTH(C151),YEAR(TODAY())-YEAR(C151)-1,IF(DAY(TODAY())<DAY(C151),YEAR(TODAY())-YEAR(C151)-1,YEAR(TODAY())-YEAR(C151))))","v":11}]
["Miquel","Emeline","","","Rignac","","Fille","","","","Non","","","","","","","","","","","","","","","","","","","","","","","",false,false,false,true,false,false,false,false,false,false,false,false,false,false,false,false,false,false,false,false,false,false,false,false,false,false,false,false,false,false,"",false,false,"",false,false,"",false,false,"",false,false,"",false,false,"",false,false,"",false,false,"",false,false,"",false,false,"",false,false,"",false,false,false,false,"",false,false,false,false,"","","","","","","","","","","","",false,false,false,false,false,false,false,false,false,false,false,false,false,false,false,false,false,false,false,false,""]
["Mirabel","Jules","26/04/2010","5","Rignac SJO","","Garçon","","","","Oui","","","","","","","","","","","","","","","","","","","","","","","",true,true,true,true,true,true,true,true,true,true,true,false,false,false,false,false,false,false,false,false,false,false,false,false,false,false,false,false,false,false,"",false,false,"",false,false,"",false,false,"",false,false,"",false,false,"",false,false,"",false,false,"",false,false,"",false,false,"",false,false,"",false,false,false,false,"",false,false,false,false,"","","","","","","","","","","","",false,false,false,false,false,false,false,false,false,false,false,false,false,false,false,false,false,false,false,false,""]
["Miral","Adrien","2008-12-14",{"$f":"IF(MONTH(TODAY())>MONTH(C154),YEAR(TODAY())-YEAR(C154),IF(MONTH(TODAY())<MONTH(C154),YEAR(TODAY())-YEAR(C154)-1,IF(DAY(TODAY())<DAY(C154),YEAR(TODAY())-YEAR(C154)-1,YEAR(TODAY())-YEAR(C154))))","v":7}]
["Miral","Anaïs","2004-07-06",{"$f":"IF(MONTH(TODAY())>MONTH(C155),YEAR(TODAY())-YEAR(C155),IF(MONTH(TODAY())<MONTH(C155),YEAR(TODAY())-YEAR(C155)-1,IF(DAY(TODAY())<DAY(C155),YEAR(TODAY())-YEAR(C155)-1,YEAR(TODAY())-YEAR(C155))))","v":11}]
["Miral","Anthony","2006-02-15",{"$f":"IF(MONTH(TODAY())>MONTH(C156),YEAR(TODAY())-YEAR(C156),IF(MONTH(TODAY())<MONTH(C156),YEAR(TODAY())-YEAR(C156)-1,IF(DAY(TODAY())<DAY(C156),YEAR(TODAY())-YEAR(C156)-1,YEAR(TODAY())-YEAR(C156))))","v":9}]
["Molinier","Arthur","13/05/2012","3","Rignac","","Garçon","","","","","","","","","","","","","","","","","","","","","","","","","","","",false,true,true,true,false,false,false,false,false,false,false,false,false,false,false,false,false,false,false,false]
["Moulis","Nataël","12/08/2009","6","Auzits","","Garçon","","","","Oui","","","","","","","","","","","","","","","","","","","","","","","",true,true,true,true,true,true,true,true,true,true,false,false,false,false,false,false,false,false,false,false,false,false,false,false,false,false,false,false,false,false,"",false,false,"",false,false,"",false,false,"",false,false,"",false,false,"",false,false,"",false,false,"",false,false,"",false,false,"",false,false,"",false,false,false,false,"",false,false,false,false,"","","","","","","","","","","","",false,false,false,false,false,false,false,false,false,false,false,false,false,false,false,false,false,false,false,false,""]
["Mussard","Maélyne","02/09/2008","7","Rignac","","Fille","","","","","","","","","","","","","","","","","","","","","","","","","","","",false,true,false,false,false,false,false,false,false,false,false,false,false,false,false,false,false,false,false,false]
["Navarro","Amélie","2007-07-18",{"$f":"IF(MONTH(TODAY())>MONTH(C160),YEAR(TODAY())-YEAR(C160),IF(MONTH(TODAY())<MONTH(C160),YEAR(TODAY())-YEAR(C160)-1,IF(DAY(TODAY())<DAY(C160),YEAR(TODAY())-YEAR(C160)-1,YEAR(TODAY())-YEAR(C160))))","v":8}]
["Nedellec","Lucas","27/08/2010","5","Anglars St Félix","","Garçon","","","","Oui","","","","","","","","","","","","","","","","","","","","","","","",true,true,true,true,true,true,true,true,true,true,false,false,false,false,false,false,false,false,false,false,false,false,false,false,false,false,false,false,false,false,"",false,false,"",false,false,"",false,false,"",false,false,"",false,false,"",false,false,"",false,false,"",false,false,"",false,false,"",false,false,"",false,false,false,false,"",false,false,false,false,"","","","","","","","","","","","",false,false,false,false,false,false,false,false,false,false,false,false,false,false,false,false,false,false,false,false,""]
["Pascal","Léa","2010-09-01",{"$f":"IF(MONTH(TODAY())>MONTH(C162),YEAR(TODAY())-YEAR(C162),IF(MONTH(TODAY())<MONTH(C162),YEAR(TODAY())-YEAR(C162)-1,IF(DAY(TODAY())<DAY(C162),YEAR(TODAY())-YEAR(C162)-1,YEAR(TODAY())-YEAR(C162))))","v":5}]
["Pascal","Lisa","2007-10-22",{"$f":"IF(MONTH(TODAY())>MONTH(C163),YEAR(TODAY())-YEAR(C163),IF(MONTH(TODAY())<MONTH(C163),YEAR(TODAY())-YEAR(C163)-1,IF(DAY(TODAY())<DAY(C163),YEAR(TODAY())-YEAR(C163)-1,YEAR(TODAY())-YEAR(C163))))","v":8}]
["Pasquier","Chloé","19/10/2010","5","Mayran","","Fille","","","","Oui","","","","","","","","","","","","","","","","","","","","","","","",true,true,true,true,true,true,true,true,true,true,false,false,false,false,false,false,false,false,false,false,false,false,false,false,false,false,false,false,false,false,"",false,false,"",false,false,"",false,false,"",false,false,"",false,false,"",false,false,"",false,false,"",false,false,"",false,false,"",false,false,"",false,false,false,false,"",false,false,false,false,"","","","","","","","","","","","",false,false,false,false,false,false,false,false,false,false,false,false,false,false,false,false,false,false,false,false,""]
["Pasquier","Quentin","25/08/2008","7","Mayran","","Garçon","","","","Oui","","","","","","","","","","","","","","","","","","","","","","","",true,true,true,true,true,true,true,true,true,true,true,false,false,false,false,false,false,false,false,false,false,false,false,false,false,false,false,false,false,false,"",false,false,"",false,false,"",false,false,"",false,false,"",false,false,"",false,false,"",false,false,"",false,false,"",false,false,"",false,false,"",false,false,false,false,"",false,false,false,false,"","","","","","","","","","","","",false,false,false,false,false,false,false,false,false,false,false,false,false,false,false,false,false,false,false,false,"Particularité comportementale (saut d'humeur)"]
["Perrier","Angelot","21/12/2011","3","Goutrens","","Garçon","","","","","","","","","","","","","","","","","","","","","","","","","","","",true,false,true,true,false,false,false,false,false,false,false,false,false,false,false,false,false,false,false,false]
["Pingaud","Léa","02/01/2007",8,"Mayran","","Fille","","","","","","","","","","","","","","","","","","","","","","","","","","","",false,false,true,false,false,false,false,false,false,false,false,false,false,false,false,false,false,false,false,false]
["Pons","Laura","06/05/2010","5","Rignac SJO","","Fille","","","","","","","","","","","","","","","","","","","","","","","","","","","",true,true,true,true,false,false,false,false,false,false,false,false,false,false,false,false,false,false,false,false]
["Pons","Emma","06/05/2010","5","Anglars","","Fille","","","","Oui","","","","","","","","","","","","","","","","","","","","","","","",true,true,true,true,true,true,true,true,true,true,true,false,false,false,false,false,false,false,false,false,false,false,false,false,false,false,false,false,false,false,"",false,false,"",false,false,"",false,false,"",false,false,"",false,false,"",false,false,"",false,false,"",false,false,"",false,false,"",false,false,"",false,false,false,false,"",false,false,false,false,"","","","","","","","","","","","",false,false,false,false,false,false,false,false,false,false,false,false,false,false,false,false,false,false,false,false,""]
["Pougenq","Antonin","2006-05-03",{"$f":"IF(MONTH(TODAY())>MONTH(C170),YEAR(TODAY())-YEAR(C170),IF(MONTH(TODAY())<MONTH(C170),YEAR(TODAY())-YEAR(C170)-1,IF(DAY(TODAY())<DAY(C170),YEAR(TODAY())-YEAR(C170)-1,YEAR(TODAY())-YEAR(C170))))","v":9}]
["Pougenq","Nathan","2004-07-10",{"$f":"IF(MONTH(TODAY())>MONTH(C171),YEAR(TODAY())-YEAR(C171),IF(MONTH(TODAY())<MONTH(C171),YEAR(TODAY())-YEAR(C171)-1,IF(DAY(TODAY())<DAY(C171),YEAR(TODAY())-YEAR(C171)-1,YEAR(TODAY())-YEAR(C171))))","v":11}]
["Pouget","Antoine","2008-11-07",{"$f":"IF(MONTH(TODAY())>MONTH(C172),YEAR(TODAY())-YEAR(C172),IF(MONTH(TODAY())<MONTH(C172),YEAR(TODAY())-YEAR(C172)-1,IF(DAY(TODAY())<DAY(C172),YEAR(TODAY())-YEAR(C172)-1,YEAR(TODAY())-YEAR(C172))))","v":7}]
["Pouget","Augustin","2011-10-24",{"$f":"IF(MONTH(TODAY())>MONTH(C173),YEAR(TODAY())-YEAR(C173),IF(MONTH(TODAY())<MONTH(C173),YEAR(TODAY())-YEAR(C173)-1,IF(DAY(TODAY())<DAY(C173),YEAR(TODAY())-YEAR(C173)-1,YEAR(TODAY())-YEAR(C173))))","v":4}]
["Raynal","Laly","17/07/2010","5","","","Fille","","","","","","","","","","","","","","","","","","","","","","","","","","","",false,false,false,false,false,false,false,false,false,false,false,false,false,false,false,false,false,false,false,false,false,false,false,false,false,false,false,false,false,false,"",false,false,"",false,false,"",false,false,"",false,false,"",false,false,"",false,false,"",false,false,"",false,false,"",false,false,"",false,false,"",false,false,false,false,"Eviter lait et laitages Traces OK",false,false,false,false,"Lactose","","","","","","","","","","","",false,false,false,false,false,false,false,false,false,false,false,false,false,false,false,false,false,false,false,false,""]
["Raynal","Mahé","2007-07-04",{"$f":"IF(MONTH(TODAY())>MONTH(C175),YEAR(TODAY())-YEAR(C175),IF(MONTH(TODAY())<MONTH(C175),YEAR(TODAY())-YEAR(C175)-1,IF(DAY(TODAY())<DAY(C175),YEAR(TODAY())-YEAR(C175)-1,YEAR(TODAY())-YEAR(C175))))","v":8}]
["Rivière","Alice","2010-10-26",{"$f":"IF(MONTH(TODAY())>MONTH(C176),YEAR(TODAY())-YEAR(C176),IF(MONTH(TODAY())<MONTH(C176),YEAR(TODAY())-YEAR(C176)-1,IF(DAY(TODAY())<DAY(C176),YEAR(TODAY())-YEAR(C176)-1,YEAR(TODAY())-YEAR(C176))))","v":5}]
["Rivière","Jade","2008-08-13",{"$f":"IF(MONTH(TODAY())>MONTH(C177),YEAR(TODAY())-YEAR(C177),IF(MONTH(TODAY())<MONTH(C177),YEAR(TODAY())-YEAR(C177)-1,IF(DAY(TODAY())<DAY(C177),YEAR(TODAY())-YEAR(C177)-1,YEAR(TODAY())-YEAR(C177))))","v":7}]
["Rodriguez","Lenny","06/12/2006","8","Mayran","","Garçon","","","","","","","","","","","","","","","","","","","","","","","","","","","",true,false,false,false,false,false,false,false,false,false,false,false,false,false,false,false,false,false,false,false]
["Rodriguez","Mahé","01/01/2010","5","Mayran","","Fille","","","","","","","","","","","","","","","","","","","","","","","","","","","",true,false,false,false,false,false,false,false,false,false,false,false,false,false,false,false,false,false,false,false]
["Rossi-ferrari","Romane","17/12/2009","5","Mayran","","Fille","","","","","","","","","","","","","","","","","","","","","","","","","","","",true,true,true,true,false,false,false,false,false,false,false,false,false,false,false,false,false,false,false,false]
["Segond","Clara","2004-09-04",{"$f":"IF(MONTH(TODAY())>MONTH(C181),YEAR(TODAY())-YEAR(C181),IF(MONTH(TODAY())<MONTH(C181),YEAR(TODAY())-YEAR(C181)-1,IF(DAY(TODAY())<DAY(C181),YEAR(TODAY())-YEAR(C181)-1,YEAR(TODAY())-YEAR(C181))))","v":11}]
["Sicre","Matthias","2006-06-08",{"$f":"IF(MONTH(TODAY())>MONTH(C182),YEAR(TODAY())-YEAR(C182),IF(MONTH(TODAY())<MONTH(C182),YEAR(TODAY())-YEAR(C182)-1,IF(DAY(TODAY())<DAY(C182),YEAR(TODAY())-YEAR(C182)-1,YEAR(TODAY())-YEAR(C182))))","v":9}]
["Sirmain","Cindy","01/01/2003","12","","","Fille","","","","Non","","","","","","","","","","","","","","","","","","","","","","","",false,false,false,true,false,false,false,false,false,false,false,false,false,false,false,false,false,false,false,false,false,false,false,false,false,false,false,false,false,false,"",false,false,"",false,false,"",false,false,"",false,false,"",false,false,"",false,false,"",false,false,"",false,false,"",false,false,"",false,false,"",false,false,false,false,"",false,false,false,false,"","","","","","","","","","","","",false,false,false,false,false,false,false,false,false,false,false,false,false,false,false,false,false,false,false,false,""]
["Tennevin","Nathan","2006-11-01",{"$f":"IF(MONTH(TODAY())>MONTH(C184),YEAR(TODAY())-YEAR(C184),IF(MONTH(TODAY())<MONTH(C184),YEAR(TODAY())-YEAR(C184)-1,IF(DAY(TODAY())<DAY(C184),YEAR(TODAY())-YEAR(C184)-1,YEAR(TODAY())-YEAR(C184))))","v":9}]
["Thomas","Arnaud","2005-03-27",{"$f":"IF(MONTH(TODAY())>MONTH(C185),YEAR(TODAY())-YEAR(C185),IF(MONTH(TODAY())<MONTH(C185),YEAR(TODAY())-YEAR(C185)-1,IF(DAY(TODAY())<DAY(C185),YEAR(TODAY())-YEAR(C185)-1,YEAR(TODAY())-YEAR(C185))))","v":10}]
["Thomas","Julien","2007-06-04",{"$f":"IF(MONTH(TODAY())>MONTH(C186),YEAR(TODAY())-YEAR(C186),IF(MONTH(TODAY())<MONTH(C186),YEAR(TODAY())-YEAR(C186)-1,IF(DAY(TODAY())<DAY(C186),YEAR(TODAY())-YEAR(C186)-1,YEAR(TODAY())-YEAR(C186))))","v":8}]
["Thomas","Mathis","2005-03-15",{"$f":"IF(MONTH(TODAY())>MONTH(C187),YEAR(TODAY())-YEAR(C187),IF(MONTH(TODAY())<MONTH(C187),YEAR(TODAY())-YEAR(C187)-1,IF(DAY(TODAY())<DAY(C187),YEAR(TODAY())-YEAR(C187)-1,YEAR(TODAY())-YEAR(C187))))","v":10}]
["Thomas","Morgane","2002-12-28",{"$f":"IF(MONTH(TODAY())>MONTH(C188),YEAR(TODAY())-YEAR(C188),IF(MONTH(TODAY())<MONTH(C188),YEAR(TODAY())-YEAR(C188)-1,IF(DAY(TODAY())<DAY(C188),YEAR(TODAY())-YEAR(C188)-1,YEAR(TODAY())-YEAR(C188))))","v":13}]
["Tonoli","Rafaël","03/08/2009","06","Anglars St Félix","","Garçon","","","","","Mr","Tonoli","Guillaume","Le Valat","12200","Savensa","0565655298","0664241852","","Père","","","","","","","","","","","","","",true,false,false,true,false,false,false,false,false,false,false,false,false,false,false,false,false,false,false,false,false,false,false,false,false,false,false,false,false,false,"",false,false,"",false,false,"",false,false,"",false,false,"",false,false,"",false,false,"",false,false,"",false,false,"",false,false,"",false,false,"",false,false,false,false,"",false,false,false,false,"","","","","","","","","","","","",false,false,false,false,false,false,false,false,false,false,false,false,false,false,false,false,false,false,false,false,""]
["Tournier","Camille","26/08/2004","11","Rignac","","Fille","","","","","","","","","","","","","","","","","","","","","","","","","","","",true,false,false,false,false,false,false,false,false,false,false,false,false,false,false,false,false,false,false,false]
["Tournier","Laura","13/12/2009","5","Rignac","","Fille","","","","Oui","","","","","","","","","","","","","","","","","","","","","","","",true,true,true,true,true,true,true,true,true,true,false,false,false,false,false,false,false,false,false,false,false,false,false,false,false,false,false,false,false,false,"",false,false,"",false,false,"",false,false,"",false,false,"",false,false,"",false,false,"",false,false,"",false,false,"",false,false,"",false,false,"",false,false,false,false,"",false,false,false,false,"Céléri","","","","","","","","","","","",false,false,false,false,false,false,false,false,false,false,false,false,false,false,false,false,false,false,false,false,""]
["Trin","Julie","2008-04-04",{"$f":"IF(MONTH(TODAY())>MONTH(C192),YEAR(TODAY())-YEAR(C192),IF(MONTH(TODAY())<MONTH(C192),YEAR(TODAY())-YEAR(C192)-1,IF(DAY(TODAY())<DAY(C192),YEAR(TODAY())-YEAR(C192)-1,YEAR(TODAY())-YEAR(C192))))","v":7}]
["Uras","Hugo","2012-04-12",{"$f":"IF(MONTH(TODAY())>MONTH(C193),YEAR(TODAY())-YEAR(C193),IF(MONTH(TODAY())<MONTH(C193),YEAR(TODAY())-YEAR(C193)-1,IF(DAY(TODAY())<DAY(C193),YEAR(TODAY())-YEAR(C193)-1,YEAR(TODAY())-YEAR(C193))))","v":3}]
["Verfailly","Joy","10/04/2007","8","Rignac","","Fille","","","","Non PAI","","","","","","","","","","","","","","","","","","","","","","","",true,false,true,true,true,true,true,true,true,true,true,false,false,false,false,false,false,false,false,false,false,false,false,false,false,false,false,false,false,false,"",false,false,"",false,false,"",false,false,"",false,false,"",false,false,"",false,false,"",false,false,"",false,false,"",false,false,"",false,false,"",false,false,false,false,"",false,false,false,false,"","","","","","","","","","","","",false,false,false,false,false,false,false,false,false,false,false,false,false,false,false,false,false,false,false,false,""]
["Vialard","Gwenaelle","2006-12-01",{"$f":"IF(MONTH(TODAY())>MONTH(C195),YEAR(TODAY())-YEAR(C195),IF(MONTH(TODAY())<MONTH(C195),YEAR(TODAY())-YEAR(C195)-1,IF(DAY(TODAY())<DAY(C195),YEAR(TODAY())-YEAR(C195)-1,YEAR(TODAY())-YEAR(C195))))","v":9}]
["Vialard","Noëlie","2008-08-29",{"$f":"IF(MONTH(TODAY())>MONTH(C196),YEAR(TODAY())-YEAR(C196),IF(MONTH(TODAY())<MONTH(C196),YEAR(TODAY())-YEAR(C196)-1,IF(DAY(TODAY())<DAY(C196),YEAR(TODAY())-YEAR(C196)-1,YEAR(TODAY())-YEAR(C196))))","v":7}]
["Viargues","Charlotte","11/06/2011","04","Rignac SJO","","Fille","","","","","Mr","Viargues","Aurélien","Le Tronc","12390","Anglars Saint Félix","0565641330","0624124396","","Père","Mme","Viargues","Christelle","Le Tronc","12390","Anglars Saint Félix","","0613100761","","Mère","","","",false,false,true,true,false,false,false,false,false,false,false,false,false,false,false,false,false,false,false,false]
["Volpelier","Emma","18/02/2010","5","Rignac SJO","","Fille","","","","","","","","","","","","","","","","","","","","","","","","","","","",true,true,true,true,true,true,true,true,true,true,false,false,false,false,false,false,false,false,false,false]
["Volpelier","Lucie","2004-03-15",{"$f":"IF(MONTH(TODAY())>MONTH(C199),YEAR(TODAY())-YEAR(C199),IF(MONTH(TODAY())<MONTH(C199),YEAR(TODAY())-YEAR(C199)-1,IF(DAY(TODAY())<DAY(C199),YEAR(TODAY())-YEAR(C199)-1,YEAR(TODAY())-YEAR(C199))))","v":11}]
["Weber","Thomas","2010-11-06",{"$f":"IF(MONTH(TODAY())>MONTH(C200),YEAR(TODAY())-YEAR(C200),IF(MONTH(TODAY())<MONTH(C200),YEAR(TODAY())-YEAR(C200)-1,IF(DAY(TODAY())<DAY(C200),YEAR(TODAY())-YEAR(C200)-1,YEAR(TODAY())-YEAR(C200))))","v":5}]
["Witek","Agathe","2011-01-01",{"$f":"IF(MONTH(TODAY())>MONTH(C201),YEAR(TODAY())-YEAR(C201),IF(MONTH(TODAY())<MONTH(C201),YEAR(TODAY())-YEAR(C201)-1,IF(DAY(TODAY())<DAY(C201),YEAR(TODAY())-YEAR(C201)-1,YEAR(TODAY())-YEAR(C201))))","v":5}]
["Witek","Juliette","2008-08-11",{"$f":"IF(MONTH(TODAY())>MONTH(C202),YEAR(TODAY())-YEAR(C202),IF(MONTH(TODAY())<MONTH(C202),YEAR(TODAY())-YEAR(C202)-1,IF(DAY(TODAY())<DAY(C202),YEAR(TODAY())-YEAR(C202)-1,YEAR(TODAY())-YEAR(C202))))","v":7}]

{"sheet":"Liste des Animateurs","index":2,"n_rows":1,"n_cols":3,"rows_kept":1,"cut":false,"hidden":false,"merged":[]}
["Nom","Prénom","Date de Naissance"]

{"sheet":"Liste des Communes","index":3,"n_rows":11,"n_cols":1,"rows_kept":11,"cut":false,"hidden":false,"merged":[]}
["Commune"]
["Anglars"]
["Auzits"]
["Belcastel"]
["Bournazel"]
["Escandolières"]
["Goutrens"]
["Rignac SJO"]
["Roussennac"]
["Mayran"]
["Rignac"]

{"sheet":"Septembre","index":4,"n_rows":65,"n_cols":31,"rows_kept":65,"cut":false,"hidden":false,"merged":[[6,22,8,22],[6,15,8,15],[6,19,8,19],[6,20,8,20],[3,15,4,16],[3,17,4,17],[3,18,4,19],[2,0,2,4],[0,2,0,6],[3,3,8,3],[0,0,1,0],[3,20,4,20],[2,12,2,14],[2,15,2,16],[3,5,5,6],[3,7,5,8],[6,5,8,5],[2,6,2,8],[2,9,2,11],[3,9,4,10],[3,11,4,11],[3,12,4,13],[3,14,4,14],[3,30,8,30],[3,27,5,29],[6,29,8,29],[6,28,8,28],[62,0,62,4],[6,23,8,23],[6,24,8,24],[6,25,8,25],[6,27,8,27],[3,23,4,23],[6,26,8,26],[3,24,4,26],[6,9,8,9],[3,21,4,22],[6,21,8,21],[6,16,8,16],[63,0,63,4],[64,0,64,4],[6,6,8,6],[6,18,8,18],[6,7,8,7],[6,8,8,8],[6,10,8,10],[6,11,8,11],[3,4,8,4],[3,0,8,0],[3,1,8,1],[3,2,8,2],[6,12,8,12],[6,13,8,13],[6,14,8,14],[6,17,8,17],[3,31,9,31],[3,32,9,32],[3,33,9,33],[3,34,9,34],[3,35,9,35],[3,41,9,41],[3,42,9,42],[3,36,9,36],[3,37,9,37],[3,38,9,38],[3,39,9,39],[3,40,9,40]]}
["Pointage Couleur"]
[]
[null,null,null,null,null,null,"Mois de:",null,null,{"$f":"MID(CELL(\"filename\",J3),FIND(\"]\",CELL(\"filename\",J3))+1,32)","v":"Septembre"},null,null,"Année:",null,null,{"$f":"Accueil!C18","v":2015}]
["Nom","Prénom","Date de Naissance","Age","Etablissement","CAR",null,"REPAS",null,{"$f":"INDEX({\"dimanche\";\"lundi\";\"mardi\";\"Mercredi\";\"jeudi\";\"vendredi\";\"samedi\"},1+MOD(An!$I$4+3-2,7))","v":"Mercredi"},null,{"$f":"An!S29","v":"2015-09-02"},{"$f":"INDEX({\"dimanche\";\"lundi\";\"mardi\";\"Mercredi\";\"jeudi\";\"vendredi\";\"samedi\"},1+MOD(An!$I$4+3-2,7))","v":"Mercredi"},null,{"$f":"An!S30","v":"2015-09-09"},{"$f":"INDEX({\"dimanche\";\"lundi\";\"mardi\";\"Mercredi\";\"jeudi\";\"vendredi\";\"samedi\"},1+MOD(An!$I$4+3-2,7))","v":"Mercredi"},null,{"$f":"An!S31","v":"2015-09-16"},{"$f":"INDEX({\"dimanche\";\"lundi\";\"mardi\";\"Mercredi\";\"jeudi\";\"vendredi\";\"samedi\"},1+MOD(An!$I$4+3-2,7))","v":"Mercredi"},null,{"$f":"An!S32","v":"2015-09-23"},{"$f":"INDEX({\"dimanche\";\"lundi\";\"mardi\";\"Mercredi\";\"jeudi\";\"vendredi\";\"samedi\"},1+MOD(An!$I$4+3-2,7))","v":"Mercredi"},null,{"$f":"An!S33","v":"2015-09-30"},"Total",null,null,"Allergies et Régimes",null,null,"Remarques Importantes"]
[]
[]
[null,null,null,null,null,"Oui","Non","Oui","Non","Matin","Repas","Après - midi","Matin","Repas","Après - midi","Matin","Repas","Après - midi","Matin","Repas","Après - midi","Matin","Repas","Après - midi","1/2 journée","1/2 journée + Repas","Journée entière","Allergies Allimentaires","Autres Allergies","Régimes Alimentaires"]
[]
[]
["21","22","23","24","1","2","3","4","5","6","7","8","9","10","11","12","13","14","15","16","17","18","19","192","Colonne2","Colonne3","Colonne4","Colonne43","Colonne42","Colonne5","Colonne1"]
["Barba-A","Louise","22/03/2008",{"$f":"IF(MONTH(TODAY())>MONTH(C11),YEAR(TODAY())-YEAR(C11),IF(MONTH(TODAY())<MONTH(C11),YEAR(TODAY())-YEAR(C11)-1,IF(DAY(TODAY())<DAY(C11),YEAR(TODAY())-YEAR(C11)-1,YEAR(TODAY())-YEAR(C11))))","v":7},"Rignac",null,1,1,null,null,1,1,null,1,1,null,1,1,null,1,1,null,1,1]
["Barreau","Tom","05/04/2007",8,"Rignac SJO",null,1,1,null,1,1,1,1,1,1,1,1,1,null,null,null,1,1,1]
["Bayol","Maël","12/07/2011",4,"Mayran",1,null,1,null,null,1,1,null,1,1,null,1,1,null,1,1,null,1,1]
["Bousquet","Eliane","12/12/2010",5,"Goutrens",1,null,1,null,null,null,null,null,1,1]
["Brun","Raphaël","28/03/2007",8,"Rignac SJO",null,1,null,1,1,1,null,1,1,null,1,1,null,1,1]
["Capely","Loris","22/09/2009",6,"Goutrens",1,null,1,null,null,1,1,null,null,null,null,1,1]
["Cher","Zélie","04/05/2010",5,"Rignac SJO",null,1,null,1,null,null,null,null,null,1,null,null,null,1,1,1]
["Cher","Axel","28/12/2004",11,"Rodez",null,1,null,1,null,null,null,null,null,1,null,null,null,null,null,1]
["Conde","India","12/08/2011",4,"Anglars",1,null,1,null,null,1,1,null,1,1,null,1,1,null,1,1,null,1,1]
["Conde","Leny","18/01/2009",7,"Anglars",1,null,1,null,null,1,1,null,1,1,null,1,1,null,1,1,null,1,1]
["Cortes","Lizéa","10/01/2012",4,"Anglars",null,1,1,null,null,null,null,null,null,null,1,1,1]
["Couffignal","Sacha","10/04/2010",5,"Mayran",1,null,1,null,null,null,null,null,1,1,null,1,1,null,1,1,null,1,1]
["Couffignal","Eddy","07/08/2007",8,"Rodez",null,1,null,1,null,null,null,null,null,1,null,null,1,null,null,1,null,null,1]
["Couto-f","Zoé","31/10/2010",5,"Rignac SJO",1,null,1,null,1,1,1,1,1,1,null,null,null,1,1,1,1]
["Cristol","Alexis","24/02/2011",4,"Anglars",1,null,1,null,null,1,1,null,1,1,null,1,1,null,1,1,null,1,1]
["Delabrousse-R","Maélyne","03/06/2012",3,"Bournazel",1,null,1,null,null,1,1,null,1,1,null,1,1,null,1,1,null,1,1]
["Dunet","Tom","12/06/2009",6,"Rignac SJO",null,1,1,null,null,null,null,1,1,1,1,1,1,1,1,1]
["Dunet","Enora","03/05/2007",8,"Rignac SJO",null,1,1,null,null,null,null,1,1,1,1,1,1,1,1,1]
["Dupont","Gabin","10/04/2009",6,"Anglars",1,null,1,null,null,1,1,null,1,1,null,1,1,null,1,1,null,1,1]
["Dupre-C","Margot","11/09/2010",5,"Mayran",1,null,1,null,null,null,null,null,null,null,null,1,1,null,null,null,null,1,1]
["Dupre-C","Louis","15/11/2008",7,"Mayran",1,null,1,null,null,null,null,null,null,null,null,1,1,null,null,null,null,1,1]
["Fabre","Maelly","17/05/2011",4,"Mayran",1,null,1,null,null,null,null,null,null,null,null,1,1,null,1,1,null,1,1]
["Flotte","Emma","20/03/2010",5,"Goutrens",1,null,1,null,null,1,1,null,null,null,null,1,1]
["Fourmont","Noah","15/11/2009",6,"Goutrens",1,null,1,null,null,null,null,null,null,null,null,null,null,null,1,1,null,1,1]
["Fourmont","Mylena","15/01/2007",9,"Escandolières",1,null,1,null,null,null,null,null,null,null,null,null,null,null,1,1,null,1,1]
["Fournier","Farell","01/01/2011",5,"Rignac SJO",null,1,1,null,1,1,1,1,1,1,null,null,null,null,1,1,1,1,1]
["Gares","Eloïse","13/01/2006",10,"Mayran",1,null,1,null,null,1,1,null,1,1,null,1,1,null,1,1,null,1,1]
["Herrlé","Yoan","20/03/2006",9,"Rignac SJO",null,1,null,null,null,null,null,null,null,null,null,null,null,null,1,1]
["Hoyez","Rachelle","28/12/2008",7,"Roussennac",1,null,1,null,null,1,1,null,1,1,null,1,1,null,null,null,null,1,1]
["Issalys","Oscar","19/09/2010",5,"Mayran",1,null,1,null,null,1,1,null,null,null,null,1,1,null,null,null,null,1]
["Issalys","Jade","27/06/2007",8,"Mayran",1,null,1,null,null,1,1,null,null,null,null,1,1]
["Mahut","Sarah","11/07/2008",7,"Rignac",null,1,1,null,null,1,1,null,1,1,null,1,1,null,1,1,null,1,1]
["Massip","Lali","14/06/2010",{"$f":"IF(MONTH(TODAY())>MONTH(C43),YEAR(TODAY())-YEAR(C43),IF(MONTH(TODAY())<MONTH(C43),YEAR(TODAY())-YEAR(C43)-1,IF(DAY(TODAY())<DAY(C43),YEAR(TODAY())-YEAR(C43)-1,YEAR(TODAY())-YEAR(C43))))","v":5},"Rignac SJO",null,1,1,null,null,null,null,1,1,1,1,1,1,1,1,1,1,1,1]
["Massip","Lola","18/07/2007",8,"Rignac SJO",null,1,1,null,null,null,null,1,1,1,1,1,1,1,1,1,1,1,1]
["Mazars","Mahtéo","09/03/2007",8,"Rignac SJO",null,1,1,null,null,null,null,null,null,null,1,1,1,1,1,1]
["Mirabel","Jules","26/04/2010",5,"Rignac SJO",null,null,null,null,null,null,null,null,null,null,null,null,null,1]
["Molinier","Arthur","13/05/2012",3,"Rignac",null,1,1,null,null,null,null,null,null,null,null,1,1,null,1,1,null,1,1]
["Moulis","Nataël","12/08/2009",6,"Auzits",1,null,1,null,null,null,null,null,null,null,null,1,1]
["Nedellec","Lucas","27/08/2010",5,"Anglars St Félix",1,null,1,null,null,null,null,null,1,1,null,1,1,null,1,1,null,1,1]
["Pasquier","Chloé","19/10/2010",5,"Mayran",1,null,1,null,null,1,1,null,1,1,null,1,1,null,1,1,null,1,1]
["Pasquier","Quentin","25/08/2008",7,"Mayran",1,null,1,null,null,1,1,null,1,1,null,1,1,null,1,1,null,1,1]
["Perrier","Angelot","21/12/2011",4,"Goutrens",null,null,null,null,null,null,null,null,null,null,null,null,null,null,1,1,null,1,1]
["Pons","Laura","06/05/2010",5,"Rignac SJO",null,1,1,null,1,1,1,null,null,null,null,null,null,null,null,null,null,1,1]
["Pons","Emma","06/05/2010",5,"Anglars",1,null,1,null,null,1,1,null,1,1,null,1,1,null,1,1,null,1,1]
["Rodriguez","Mahé","01/01/2010",6,"Mayran",1,null,1,null,null,1,1,null,1,1,null,1,1,null,1,1,null,1,1]
["Rodriguez","Lenny","06/12/2006",9,"Mayran",1,null,1,null,null,1,1,null,1,1,null,1,1,null,1,1,null,1,1]
["Rossi-ferrari","Romane","17/12/2009",6,"Mayran",1,null,1,null,null,null,null,null,1,1,null,1,1]
["Tonoli","Rafaël","03/08/2009",6,"Anglars St Félix",1,null,1,null,null,null,null,null,1,1,null,null,null,null,null,null,null,1,1]
["Tournier","Laura","13/12/2009",6,"Rignac",null,1,1,null,null,null,null,null,1,1,null,1,1,null,1,1,null,1,1]
["Tournier","Camille","26/08/2004",11,"Rignac",null,1,1,null,null,null,null,null,1,1]
["Verfailly","Joy","10/04/2007",8,"Rignac",null,1,1,null,null,1,1,null,1,1,null,1,1,null,1,1,null,1,1]
["Volpelier","Emma","18/02/2010",5,"Rignac SJO",null,1,1,null,1,1,1,null,null,null,1,1,1,null,null,null,1,1,1]
["( Age sélectionné ) SOUS TOTAL JOURNALIER :",null,null,null,null,{"$f":"SUBTOTAL(109,F11:F62)","v":29},21,45,4,6,26,25,8,31,33,9,38,38,9,33,34,6,34,34]
["TOTAL : ",null,null,null,null,{"$f":"SUM(F11:F62)","v":29},21,45,4,6,26,25,8,31,33,9,38,38,9,33,34,6,34,34]
["DEMANDE DE RESERVATIONS : ",null,null,null,null,{"$f":"COUNTIF(F11:F62,\"0\")","v":0},0,0,0,0,0,0,0,0,0,0,0,0,0,0,0,0,0,0]

{"sheet":"Octobre","index":5,"n_rows":64,"n_cols":31,"rows_kept":64,"cut":false,"hidden":false,"merged":[[3,30,8,30],[6,28,8,28],[6,29,8,29],[3,24,4,26],[6,27,8,27],[3,27,5,29],[6,26,8,26],[3,2,8,2],[3,4,8,4],[3,5,5,6],[6,24,8,24],[6,25,8,25],[6,12,8,12],[6,13,8,13],[6,14,8,14],[6,15,8,15],[63,0,63,4],[62,0,62,4],[6,23,8,23],[3,17,4,17],[3,18,4,19],[3,20,4,20],[3,21,4,22],[3,23,4,23],[6,20,8,20],[6,21,8,21],[6,22,8,22],[3,0,8,0],[6,17,8,17],[6,18,8,18],[6,19,8,19],[6,11,8,11],[2,6,2,8],[2,12,2,14],[2,15,2,16],[2,9,2,11],[0,2,0,6],[2,0,2,4],[0,0,1,0],[0,1,1,1],[61,0,61,4],[3,11,4,11],[3,12,4,13],[3,14,4,14],[3,15,4,16],[3,1,8,1],[3,3,8,3],[6,16,8,16],[3,7,5,8],[3,9,4,10],[6,5,8,5],[6,6,8,6],[6,7,8,7],[6,8,8,8],[6,9,8,9],[6,10,8,10]]}
["Pointage Couleur"]
[]
[null,null,null,null,null,null,"Mois de:",null,null,{"$f":"MID(CELL(\"filename\",J3),FIND(\"]\",CELL(\"filename\",J3))+1,32)","v":"Octobre"},null,null,"Année:",null,null,{"$f":"Accueil!C18","v":2015}]
["Nom","Prénom","Date de Naissance","Age","Etablissement","CAR",null,"REPAS",null,{"$f":"INDEX({\"dimanche\";\"lundi\";\"mardi\";\"Mercredi\";\"jeudi\";\"vendredi\";\"samedi\"},1+MOD(An!$I$4+3-2,7))","v":"Mercredi"},null,{"$f":"An!C38","v":""},{"$f":"INDEX({\"dimanche\";\"lundi\";\"mardi\";\"Mercredi\";\"jeudi\";\"vendredi\";\"samedi\"},1+MOD(An!$I$4+3-2,7))","v":"Mercredi"},null,{"$f":"An!C39","v":"2015-10-07"},{"$f":"INDEX({\"dimanche\";\"lundi\";\"mardi\";\"Mercredi\";\"jeudi\";\"vendredi\";\"samedi\"},1+MOD(An!$I$4+3-2,7))","v":"Mercredi"},null,{"$f":"An!C40","v":"2015-10-14"},{"$f":"INDEX({\"dimanche\";\"lundi\";\"mardi\";\"Mercredi\";\"jeudi\";\"vendredi\";\"samedi\"},1+MOD(An!$I$4+3-2,7))","v":"Mercredi"},null,{"$f":"An!C41","v":"2015-10-21"},{"$f":"INDEX({\"dimanche\";\"lundi\";\"mardi\";\"Mercredi\";\"jeudi\";\"vendredi\";\"samedi\"},1+MOD(An!$I$4+3-2,7))","v":"Mercredi"},null,{"$f":"An!C42","v":"2015-10-28"},"Total",null,null,"Allergies et Régimes",null,null,"Remarques Importantes"]
[]
[]
[null,null,null,null,null,"Oui","Non","Oui","Non","Matin","Repas","Après - midi","Matin","Repas","Après - midi","Matin","Repas","Après - midi","Matin","Repas","Après - midi","Matin","Repas","Après - midi","1/2 journée","1/2 journée + Repas","Journée entière","Allergies Allimentaires","Autres Allergies","Régimes Alimentaires"]
[]
[]
["21","22","23","24","1","2","3","4","5","6","7","8","9","10","11","12","13","14","15","16","17","18","19","192","Colonne2","Colonne3","Colonne4","Colonne43","Colonne42","Colonne5","Colonne1"]
["Barba-A","Louise","2008-03-22",{"$f":"IF(MONTH(TODAY())>MONTH(C11),YEAR(TODAY())-YEAR(C11),IF(MONTH(TODAY())<MONTH(C11),YEAR(TODAY())-YEAR(C11)-1,IF(DAY(TODAY())<DAY(C11),YEAR(TODAY())-YEAR(C11)-1,YEAR(TODAY())-YEAR(C11))))","v":7},"Rignac",null,1,1,null,null,null,null,null,1,1]
["Barreau","Tom","2007-04-05",8,"Rignac SJO",null,1,1,null,null,null,null,1,1,1,1,1,1]
["Bayol","Maël","2011-07-12",4,"Mayran",1,null,1,null,null,null,null,null,1,1,null,1,1]
["Brun","Raphaël","2007-03-28",8,"Rignac SJO",null,1,1,null,null,null,null,1,1,null,1,1]
["Capely","Loris","2009-09-22",6,"Goutrens",1,null,1,null,null,null,null,null,1,1]
["Cher","Zélie","2010-05-04",5,"Rignac SJO",null,1,null,1,null,null,null,null,null,1]
["Cher","Axel","2004-12-28",11,"Rodez",null,null,null,null,null,null,null,null,null,1]
["Conde","India","2011-08-12",4,"Anglars",1,null,1,null,null,null,null,null,null,null,null,1,1]
["Condé","Leny","2009-01-18",7,"Anglars",1,null,1,null,null,null,null,null,null,null,null,1,1]
["Cortes","Lizéa","2012-01-10",4,"Anglars",null,null,null,null,null,null,null,1,1,1]
["Couffignal","Sacha","2010-04-10",5,"Mayran",1,null,1,null,null,null,null,null,1,1,null,1,1]
["Couffignal","Eddy","2007-08-07",8,"Rodez",null,1,null,1,null,null,null,null,null,1,null,null,1]
["Couto-F","Zoé","2010-10-31",5,"Rignac SJO",null,1,null,1,null,null,null,1,null,null,1]
["Cristol","Alexis","2011-02-24",4,"Anglars",1,null,1,null,null,null,null,null,1,1,null,1,1]
["Delabrousse-R","Maélyne","2012-06-03",3,"Bournazel",1,null,1,null,null,null,null,null,1,1,null,1,1]
["Dunet","Tom","2009-06-12",6,"Rignac SJO",null,1,1,null,null,null,null,1,1,1]
["Dunet","Enora","2007-05-03",8,"Rignac SJO",null,1,1,null,null,null,null,1,1,1]
["Dupont","Gabin","2009-04-10",6,"Anglars",1,null,1,null,null,null,null,null,1,1,null,1,1]
["Dupre-C","Louis","2008-11-15",7,"Mayran",1,null,1,null,null,null,null,null,null,null,null,1,1]
["Dupre-C","Margot","2010-09-11",5,"Mayran",null,null,null,null,null,null,null,null,null,null,null,1,1]
["Fabre","Maelly","2011-05-17",4,"Mayran",1,null,1]
["Fleck","Nathan","2006-03-09",9,"Rignac",null,1,1]
["Fleck","Lina","2012-04-25",3,"Rignac",null,1,1]
["Flotte","Emma","2010-03-20",5,"Goutrens",1,null,1,null,null,null,null,null,null,null,null,1,1]
["Fourmont","Mylena","2007-01-15",9,"Escandolières",1,null,1,null,null,null,null,null,1,1,null,1,1]
["Fourmont","Noah","2009-11-15",6,"Goutrens",1,null,1,null,null,null,null,null,1,1,null,1,1]
["Fournier","Farell","2011-01-25",4,"Rignac SJO",null,1,1,null,null,null,null,1,1,1,null,1,1]
["Gares","Eloïse","2006-01-13",10,"Mayran",1,null,1,null,null,null,null,null,1,1,null,1,1]
["Herrlé","Yoan","2006-03-20",9,"Rignac SJO",null,null,null,null,null,null,null,1,1]
["Hoyez","Rachelle","2008-12-28",7,"Roussennac",1,null,1,null,null,null,null,null,1,1,null,1,1]
["Issalys","Jade","2007-06-27",8,"Mayran",1,null,1,null,null,null,null,null,null,null,null,1,1]
["Issalys","Oscar","2010-09-19",{"$f":"IF(MONTH(TODAY())>MONTH(C42),YEAR(TODAY())-YEAR(C42),IF(MONTH(TODAY())<MONTH(C42),YEAR(TODAY())-YEAR(C42)-1,IF(DAY(TODAY())<DAY(C42),YEAR(TODAY())-YEAR(C42)-1,YEAR(TODAY())-YEAR(C42))))","v":5},"Mayran",1,null,1,null,null,null,null,null,null,null,null,1,1]
["Mahut","Sarah","2008-07-11",7,"Rignac",null,1,1,null,null,null,null,null,1,1,null,1,1]
["Massip","Lola","2007-07-18",8,"Rignac SJO",null,1,1,null,null,null,null,1,1,1,1,1,1]
["Massip","Lali","2010-06-14",5,"Rignac SJO",null,1,1,null,null,null,null,1,1,1,1,1,1]
["Mazars","Mathéo","2007-03-09",8,"Rignac SJO",null,null,null,null,null,null,null,1,1,1,1,1,1]
["Mirabel","jules","2010-04-26",5,"Rignac SJO",null,1,null,1,null,null,null,1,null,null,1]
["Molinier","Arthur","2012-05-13",3,"Rignac",null,1,1,null,null,null,null,null,1,1,null,1,1]
["Mouly","Nataël","2009-08-12",6,"Auzits",1,null,1,null,null,null,null,null,1,1,null,1,1]
["Mussard","Maélyne","2008-09-02",7,"Rignac",null,1,1,null,null,null,null,null,1,1]
["Nedellec","Lucas","2010-08-27",5,"Anglars",1,null,1,null,null,null,null,null,1,1]
["Pasquier","Chloé","2010-10-19",5,"Mayran",1,null,1,null,null,null,null,null,1,1,null,1,1]
["Pasquier","Quentin","2008-08-25",7,"Mayran",1,null,1,null,null,null,null,null,1,1,null,1,1]
["Perrier","Angelot","2011-12-21",4,"Goutrens",null,null,null,null,null,null,null,null,1,1,null,1,1]
["Pons","Emma","2010-05-06",5,"Anglars",1,null,1,null,null,null,null,null,1,1,null,1,1]
["Pons","Laura","2010-05-06",5,"Rignac SJO",null,null,null,null,null,null,null,null,null,null,null,1,1]
["Rossi-Ferrari","Romane","2009-12-17",6,"Mayran",1,null,1]
["Tournier","Laura","2009-12-13",6,"Rignac",null,1,1,null,null,null,null,null,1,1,null,1,1]
["Verfailly","Joy","2007-04-10",8,"Rignac",null,1,1,null,null,null,null,null,null,null,null,1,1]
["Volpelier","Emma","2010-02-18",5,"Rignac SJO",null,1,1,null,null,null,null,null,null,null,1,1,1]
[]
["( Age sélectionné ) SOUS TOTAL JOURNALIER :",null,null,null,null,{"$f":"SUBTOTAL(109,F11:F61)","v":23},20,39,4,0,0,0,12,31,32,8,33,33,0,0,0,0,0,0]
["TOTAL : ",null,null,null,null,{"$f":"SUM(F11:F61)","v":23},20,39,4,0,0,0,12,31,32,8,33,33,0,0,0,0,0,0]
["DEMANDE DE RESERVATIONS : ",null,null,null,null,{"$f":"COUNTIF(F11:F61,\"0\")","v":0},0,0,0,0,0,0,0,0,0,0,0,0,0,0,0,0,0,0]

{"sheet":"Novembre","index":6,"n_rows":71,"n_cols":31,"rows_kept":71,"cut":false,"hidden":false,"merged":[[3,30,8,30],[6,27,8,27],[6,28,8,28],[6,29,8,29],[3,27,5,29],[3,24,4,26],[6,26,8,26],[70,0,70,4],[6,24,8,24],[6,25,8,25],[3,23,4,23],[6,23,8,23],[3,12,4,13],[3,14,4,14],[3,15,4,16],[3,17,4,17],[3,18,4,19],[6,22,8,22],[6,19,8,19],[6,20,8,20],[6,21,8,21],[3,20,4,20],[3,21,4,22],[6,18,8,18],[2,6,2,8],[2,12,2,14],[2,15,2,16],[2,9,2,11],[3,5,5,6],[3,7,5,8],[3,9,4,10],[69,0,69,4],[3,2,8,2],[68,0,68,4],[6,6,8,6],[6,7,8,7],[6,5,8,5],[3,0,8,0],[3,1,8,1],[3,3,8,3],[3,4,8,4],[0,0,1,0],[0,1,1,1],[2,0,2,4],[6,16,8,16],[6,17,8,17],[6,13,8,13],[6,14,8,14],[6,15,8,15],[3,11,4,11],[6,11,8,11],[6,12,8,12],[6,8,8,8],[6,9,8,9],[6,10,8,10],[0,2,0,6]]}
["Pointage Couleur"]
[]
[null,null,null,null,null,null,"Mois de:",null,null,{"$f":"MID(CELL(\"filename\",J3),FIND(\"]\",CELL(\"filename\",J3))+1,32)","v":"Novembre"},null,null,"Année:",null,null,{"$f":"Accueil!C18","v":2015}]
["Nom","Prénom","Date de Naissance","Age","Etablissement","CAR",null,"REPAS",null,{"$f":"INDEX({\"dimanche\";\"lundi\";\"mardi\";\"Mercredi\";\"jeudi\";\"vendredi\";\"samedi\"},1+MOD(An!$I$4+3-2,7))","v":"Mercredi"},null,{"$f":"An!K39","v":"2015-11-04"},{"$f":"INDEX({\"dimanche\";\"lundi\";\"mardi\";\"Mercredi\";\"jeudi\";\"vendredi\";\"samedi\"},1+MOD(An!$I$4+3-2,7))","v":"Mercredi"},null,{"$f":"An!K40","v":"2015-11-11"},{"$f":"INDEX({\"dimanche\";\"lundi\";\"mardi\";\"Mercredi\";\"jeudi\";\"vendredi\";\"samedi\"},1+MOD(An!$I$4+3-2,7))","v":"Mercredi"},null,{"$f":"An!K41","v":"2015-11-18"},{"$f":"INDEX({\"dimanche\";\"lundi\";\"mardi\";\"Mercredi\";\"jeudi\";\"vendredi\";\"samedi\"},1+MOD(An!$I$4+3-2,7))","v":"Mercredi"},null,{"$f":"An!K42","v":"2015-11-25"},{"$f":"INDEX({\"dimanche\";\"lundi\";\"mardi\";\"Mercredi\";\"jeudi\";\"vendredi\";\"samedi\"},1+MOD(An!$I$4+3-2,7))","v":"Mercredi"},null,{"$f":"An!K43","v":""},"Total",null,null,"Allergies et Régimes",null,null,"Remarques Importantes"]
[]
[]
[null,null,null,null,null,"Oui","Non","Oui","Non","Matin","Repas","Après - midi","Matin","Repas","Après - midi","Matin","Repas","Après - midi","Matin","Repas","Après - midi","Matin","Repas","Après - midi","1/2 journée","1/2 journée + Repas","Journée entière","Allergies Allimentaires","Autres Allergies","Régimes Alimentaires"]
[]
[]
["21","22","23","24","1","2","3","4","5","6","7","8","9","10","11","12","13","14","15","16","17","18","19","192","Colonne2","Colonne3","Colonne4","Colonne43","Colonne42","Colonne5","Colonne1"]
["Chantereau","Axelle","2008-04-03",{"$f":"IF(MONTH(TODAY())>MONTH(C11),YEAR(TODAY())-YEAR(C11),IF(MONTH(TODAY())<MONTH(C11),YEAR(TODAY())-YEAR(C11)-1,IF(DAY(TODAY())<DAY(C11),YEAR(TODAY())-YEAR(C11)-1,YEAR(TODAY())-YEAR(C11))))","v":7},"Anglars",1,null,1,null,null,null,null,null,null,null,null,1,1]
["Conde","Leny","2009-01-18",7,"Anglars",1,null,1,null,null,1,1,null,null,null,null,1,1,null,1,1]
["Conde","India","2011-08-12",4,"Anglars",1,null,1,null,null,1,1,null,null,null,null,1,1,null,1,1]
["Cortes","Lizéa","2012-01-10",4,"Anglars",null,1,1,null,1,1,1,null,null,null,1,1,1]
["Cristol","Alexis","2011-02-24",4,"Anglars",1,null,1,null,null,1,1,null,null,null,null,1,1,null,1,1]
["Dupont","Gabin","2009-04-10",6,"Anglars",1,null,1]
["Nedellec","Lucas","2010-08-27",5,"Anglars",1,null,1,null,null,1,1,null,null,null,null,1,1,null,1,1]
["Pons","Emma","2010-05-06",5,"Anglars",1,null,1,null,null,1,1,null,null,null,null,1,1,null,1,1]
["Mouly","Nataël","2009-08-12",6,"Auzits",1,null,1,null,null,1,1,null,null,null,null,null,null,null,1,1]
["Delabrousse-R","Maélyne","2012-06-03",3,"Bournazel",1,null,1,null,null,1,1,null,null,null,null,1,1,null,1,1]
["Fourmont","Mylena","2007-01-15",9,"Escandolières",1,null,1,null,null,1,1,null,null,null,null,1,1,null,1,1]
["Capely","Loris","2009-09-22",6,"Goutrens",1,null,1,null,null,1,1]
["Flotte","Emma","2010-03-20",5,"Goutrens",1,null,1,null,null,null,null,null,null,null,null,null,null,null,1,1]
["Fourmont","Noah","2009-11-15",6,"Goutrens",1,null,1,null,null,1,1]
["Massip","Noah","12/10/2010",5,"Goutrens",1,null,1,null,null,null,null,null,null,null,null,1,1]
["Massip","Mattéo","11/04/2007",8,"Goutrens",1,null,1,null,null,null,null,null,null,null,null,1,1]
["Perrier","Angelot","2011-12-21",4,"Goutrens",1,null,1,null,null,1,1,null,null,null,null,1,1,null,1,1]
["Bayol","Maël","2011-07-12",4,"Mayran",1,null,1,null,null,1,1,null,null,null,null,1,1,null,1,1]
["Couffignal","Sacha","2010-04-10",5,"Mayran",1,null,1,null,null,1,1,null,null,null,null,1,1,null,1,1]
["Elhadrati","Ilyes","2011-12-31",4,"Mayran",1,null,1,null,null,1,1,null,null,null,null,1,1,null,1,1]
["Elhadrati","Wacil","2009-10-29",6,"Mayran",1,null,1,null,null,1,1,null,null,null,null,1,1]
["Elhadrati","Nora","2006-09-16",9,"Mayran",1,null,1,null,null,1,1,null,null,null,null,1,1,null,1,1]
["Fabre","Maelly","2011-05-17",4,"Mayran",1,null,1,null,null,null,null,null,null,null,null,1,1]
["Gares","Eloïse","2006-01-13",10,"Mayran",1,null,1,null,null,1,1,null,null,null,null,1,1,null,1,1]
["Issalys","Jade","2007-06-27",8,"Mayran",1,null,1,null,null,1,1,null,null,null,null,null,null,null,1,1]
["Issalys","Oscar","2010-09-19",5,"Mayran",1,null,1,null,null,1,1,null,null,null,null,null,null,null,1,1]
["Mayran-Vergnes","Pierre","20/01/2008",8,"Mayran",1,null,1,null,null,null,null,null,null,null,null,1,1]
["Pasquier","Quentin","2008-08-25",7,"Mayran",1,null,1,null,null,1,1,null,null,null,null,1,1,null,1,1]
["Pasquier","Chloé","2010-10-19",5,"Mayran",1,null,1,null,null,1,1,null,null,null,null,1,1,null,1,1]
["Pingaud","Léa","2007-01-02",9,"Mayran",1,null,1,null,null,1,1]
["Rossi-Ferrari","Romane","2009-12-17",6,"Mayran"]
["Amari","Naïm","2008-12-08",7,"Rignac",null,1,null,1,null,1,1]
["Amari","Ilyes","2012-01-01",{"$f":"IF(MONTH(TODAY())>MONTH(C43),YEAR(TODAY())-YEAR(C43),IF(MONTH(TODAY())<MONTH(C43),YEAR(TODAY())-YEAR(C43)-1,IF(DAY(TODAY())<DAY(C43),YEAR(TODAY())-YEAR(C43)-1,YEAR(TODAY())-YEAR(C43))))","v":4},"Rignac",null,1,1,null,null,1,1]
["Barba-A","Louise","2008-03-22",7,"Rignac",null,1,1,null,null,null,null,null,null,null,null,1,1,null,1,1]
["Mahut","Sarah","2008-07-11",7,"Rignac",null,1,1,null,null,1,1,null,null,null,null,1,1,null,1,1]
["Mezy","Faustine","18/08/2005",10,"Rignac",null,1,1,null,null,null,null,null,null,null,null,null,null,null,1,1]
["Molinier","Arthur","2012-05-13",3,"Rignac",null,1,1,null,null,1,1,null,null,null,null,1,1]
["Mussard","Maélyne","2008-09-02",7,"Rignac"]
["Tournier","Laura","2009-12-13",6,"Rignac",null,1,1,null,null,1,1,null,null,null,null,1,1,null,1,1]
["Verfailly","Joy","2007-04-10",8,"Rignac",null,1,1,null,null,1,1,null,null,null,null,1,1]
["Brun","Raphaël","2007-03-28",8,"Rignac SJO",null,1,1,null,null,null,null,null,null,null,1,1]
["Cher","Zélie","2010-05-04",5,"Rignac SJO",null,1,null,null,null,null,null,null,null,null,null,1,1]
["Couto-F","Zoé","2010-10-31",5,"Rignac SJO",null,1,null,1,1,null,null,null,null,null,1,null,null,1]
["Dunet","Tom","2009-06-12",6,"Rignac SJO",null,1,1,null,1,1,1,null,null,null,1,1,1]
["Dunet","Enora","2007-05-03",8,"Rignac SJO",null,1,1,null,1,1,1,null,null,null,1,1,1]
["Fournier","Farell","2011-01-25",4,"Rignac SJO",null,1,1,null,1,1,1,null,null,null,1,1,null,1,1,1]
["Herrlé","Yoan","2006-03-20",9,"Rignac SJO",null,1,1,null,1,1,null,null,null,null,1,1]
["Massip","Lali","2010-06-14",5,"Rignac SJO",null,1,1,null,1,1,1,null,null,null,1,1,1,1,1,1]
["Massip","Lola","2007-07-18",8,"Rignac SJO",null,1,1,null,1,1,1,null,null,null,1,1,1,1,1,1]
["Mazars","Mathéo","2007-03-09",8,"Rignac SJO",null,1,1,null,null,null,null,null,null,null,1,1,1,1,1,1]
["Mirabel","jules","2010-04-26",5,"Rignac SJO",null,1,null,1]
["Pons","Laura","2010-05-06",5,"Rignac SJO",null,1,1]
["Viargues","Charlotte","11/06/2011",4,"Rignac SJO",1,null,1,null,null,null,null,null,null,null,null,null,null,1,1,1]
["Volpelier","Emma","2010-02-18",5,"Rignac SJO",null,1,1,null,1,1]
["Cher","Axel","2004-12-28",11,"Rodez",null,1]
["Couffignal","Eddy","2007-08-07",8,"Rodez",null,1,null,1,null,null,1,null,null,null,null,null,1]
["Hoyez","Rachelle","2008-12-28",7,"Roussennac",1,null,1,null,null,1,1,null,null,null,null,1,1,null,1,1]
[]
["( Age sélectionné ) SOUS TOTAL JOURNALIER :",null,null,null,null,{"$f":"SUBTOTAL(109,F11:F68)","v":31},24,49,4,9,37,36,0,0,0,10,37,35,6,29,29,0,0,0]
["TOTAL : ",null,null,null,null,{"$f":"SUM(F11:F68)","v":31},24,49,4,9,37,36,0,0,0,10,37,35,6,29,29,0,0,{"$f":"SUM(AE11:AE68)","v":0}]
["DEMANDE DE RESERVATIONS : ",null,null,null,null,{"$f":"COUNTIF(F11:F68,\"0\")","v":0},0,0,0,0,0,0,0,0,0,0,0,0,0,0,0,0,0,0]

{"sheet":"Décembre","index":7,"n_rows":72,"n_cols":31,"rows_kept":72,"cut":false,"hidden":false,"merged":[[6,26,8,26],[3,24,4,26],[3,27,5,29],[3,30,8,30],[6,27,8,27],[6,28,8,28],[6,29,8,29],[6,25,8,25],[6,6,8,6],[6,7,8,7],[6,8,8,8],[3,17,4,17],[3,18,4,19],[2,6,2,8],[2,9,2,11],[0,2,0,6],[0,0,1,0],[0,1,1,1],[2,12,2,14],[2,15,2,16],[3,4,8,4],[3,5,5,6],[3,7,5,8],[3,9,4,10],[3,11,4,11],[3,12,4,13],[3,14,4,14],[3,15,4,16],[6,14,8,14],[6,15,8,15],[6,16,8,16],[6,12,8,12],[2,0,2,4],[3,3,8,3],[69,0,69,4],[70,0,70,4],[71,0,71,4],[6,23,8,23],[6,24,8,24],[6,21,8,21],[6,18,8,18],[6,19,8,19],[6,20,8,20],[3,0,8,0],[3,1,8,1],[3,2,8,2],[6,9,8,9],[6,10,8,10],[6,11,8,11],[6,5,8,5],[3,20,4,20],[3,21,4,22],[3,23,4,23],[6,17,8,17],[6,13,8,13],[6,22,8,22]]}
["Pointage Couleur"]
[]
[null,null,null,null,null,null,"Mois de:",null,null,{"$f":"MID(CELL(\"filename\",J3),FIND(\"]\",CELL(\"filename\",J3))+1,32)","v":"Décembre"},null,null,"Année:",null,null,{"$f":"Accueil!C18","v":2015}]
["Nom","Prénom","Date de Naissance","Age","Etablissement","CAR",null,"REPAS",null,{"$f":"INDEX({\"dimanche\";\"lundi\";\"mardi\";\"Mercredi\";\"jeudi\";\"vendredi\";\"samedi\"},1+MOD(An!$I$4+3-2,7))","v":"Mercredi"},null,{"$f":"An!S38","v":"2015-12-02"},{"$f":"INDEX({\"dimanche\";\"lundi\";\"mardi\";\"Mercredi\";\"jeudi\";\"vendredi\";\"samedi\"},1+MOD(An!$I$4+3-2,7))","v":"Mercredi"},null,{"$f":"An!S39","v":"2015-12-09"},{"$f":"INDEX({\"dimanche\";\"lundi\";\"mardi\";\"Mercredi\";\"jeudi\";\"vendredi\";\"samedi\"},1+MOD(An!$I$4+3-2,7))","v":"Mercredi"},null,{"$f":"An!S40","v":"2015-12-16"},{"$f":"INDEX({\"dimanche\";\"lundi\";\"mardi\";\"Mercredi\";\"jeudi\";\"vendredi\";\"samedi\"},1+MOD(An!$I$4+3-2,7))","v":"Mercredi"},null,{"$f":"An!S41","v":"2015-12-23"},{"$f":"INDEX({\"dimanche\";\"lundi\";\"mardi\";\"Mercredi\";\"jeudi\";\"vendredi\";\"samedi\"},1+MOD(An!$I$4+3-2,7))","v":"Mercredi"},null,{"$f":"An!S42","v":"2015-12-30"},"Total",null,null,"Allergies et Régimes",null,null,"Remarques Importantes"]
[]
[]
[null,null,null,null,null,"Oui","Non","Oui","Non","Matin","Repas","Après - midi","Matin","Repas","Après - midi","Matin","Repas","Après - midi","Matin","Repas","Après - midi","Matin","Repas","Après - midi","1/2 journée","1/2 journée + Repas","Journée entière","Allergies Allimentaires","Autres Allergies","Régimes Alimentaires"]
[]
[]
["21","22","23","24","1","2","3","4","5","6","7","8","9","10","11","12","13","14","15","16","17","18","19","192","Colonne2","Colonne3","Colonne4","Colonne43","Colonne42","Colonne5","Colonne1"]
["Amari","Ilyes","2012-01-01",{"$f":"IF(MONTH(TODAY())>MONTH(C11),YEAR(TODAY())-YEAR(C11),IF(MONTH(TODAY())<MONTH(C11),YEAR(TODAY())-YEAR(C11)-1,IF(DAY(TODAY())<DAY(C11),YEAR(TODAY())-YEAR(C11)-1,YEAR(TODAY())-YEAR(C11))))","v":4},"Rignac",null,1,1,null,null,1,1,null,1,1]
["Bayol","Maël","12/07/2011",{"$f":"IF(MONTH(TODAY())>MONTH(C12),YEAR(TODAY())-YEAR(C12),IF(MONTH(TODAY())<MONTH(C12),YEAR(TODAY())-YEAR(C12)-1,IF(DAY(TODAY())<DAY(C12),YEAR(TODAY())-YEAR(C12)-1,YEAR(TODAY())-YEAR(C12))))","v":4},"Mayran",1,null,1,null,null,1,1,null,1,1,null,1,1]
["Couderc","Margaux","01/01/2010",6,"Mayran",null,null,null,null,null,null,null,null,null,null,null,1,1]
["Amari","Naïm","2008-12-08",7,"Rignac",null,1,1,null,null,1,1,null,1,1]
["Barba-A","Louise","22/03/2008",7,"Rignac",null,1,1,null,null,1,1,null,1,1]
["Couderc","Léo","01/01/2010",6,"Mayran",null,null,null,null,null,null,null,null,null,null,null,1,1]
["Brun","Raphaël","28/03/2007",8,"Rignac SJO",null,1,null,1,1,null,null,1,1]
["Capely","Loris","2009-09-22",6,"Goutrens",null,null,null,null,null,null,null,null,1,1]
["Cher","Zélie","04/05/2010",5,"Rignac SJO",null,1,null,1]
["Conde","Leny","18/01/2009",7,"Anglars",1,null,1,null,null,1,1,null,"F","F",null,1,1]
["Conde","India","12/08/2011",4,"Anglars",1,null,1,null,null,1,1,null,"F","F",null,1,1]
["Cortes","Lizéa","10/01/2012",4,"Anglars",null,1,1,null,1,1,1,1,1,1]
["Couffignal","Sacha","2010-04-10",5,"Mayran",1,null,1,null,null,1,1,null,1,1,null,1,1]
["Elhadrati","Nora","16/09/2006",9,"Mayran",1,null,1,null,null,1,1,null,1,1,null,1,1,null,null,null,null,null,null,null,null,null,null,null,3]
["Couffignal","Eddy","2007-08-07",8,"Rodez",null,1,null,1,null,null,1,null,null,1,null,null,1]
["Elhadrati","Wacil","29/10/2009",6,"Mayran",1,null,1,null,null,1,1,null,1,1,null,1,1,null,null,null,null,null,null,null,null,null,null,null,3]
["Couto-f","Zoé","31/10/2010",5,"Rignac SJO",1,null,1,null,1,null,null,1]
["Cristol","Alexis","24/02/2011",4,"Anglars",1,null,1,null,null,1,1,null,1,1,null,1,1]
["Delabrousse-R","Maélyne","03/06/2012",3,"Bournazel",1,null,1,null,null,1,1,null,1,1,null,1,1]
["Dunet","Enora","2007-05-03",8,"Rignac SJO",null,1,1,null,1,1,1,null,null,null,1,1,1]
["Dunet","Tom","2009-06-12",6,"Rignac SJO",null,1,1,null,1,1,1,null,null,null,1,1,1]
["Dupont","Gabin","10/04/2009",6,"Anglars",1,null,1,null,null,1,1,null,1,1,null,1,1]
["Elhadrati","Ilyes","31/12/2011",4,"Mayran",1,null,1,null,null,1,1,null,1,1,null,1,1,null,null,null,null,null,null,null,null,null,null,null,3]
["Fabre","Maelly","17/05/2011",4,"Mayran"]
["Fabre","Maelly","17/05/2011",4,"Mayran"]
["Fabre","Maelly","2011-05-17",4,"Mayran",1,null,1,null,null,1,1,null,1,1,null,1,1]
["Flotte","Emma","2010-03-20",5,"Goutrens",1,null,1]
["Fourmont","Mylena","15/01/2007",9,"Escandolières",1,null,1,null,null,1,1,null,1,1,null,"F","F"]
["Fourmont","Noah","15/11/2009",6,"Goutrens",1,null,1,null,null,1,1,null,1,1,null,"F","F"]
["Fournier","Farell","01/01/2011",5,"Rignac SJO",null,1,1,null,1,1,1,null,null,null,1,1,1]
["Gares","Eloïse","13/01/2006",10,"Mayran",1,null,1,null,null,1,1,null,1,1,null,1,1]
["Herrlé","Yoan","2006-03-20",9,"Rignac SJO",null,1,1,null,1,1]
["Hoyes","Rachelle","28/12/2008",7,"Roussennac",1,null,1,null,null,1,1,null,1,1,null,1,1]
["Issalys","Jade","2007-06-27",{"$f":"IF(MONTH(TODAY())>MONTH(C44),YEAR(TODAY())-YEAR(C44),IF(MONTH(TODAY())<MONTH(C44),YEAR(TODAY())-YEAR(C44)-1,IF(DAY(TODAY())<DAY(C44),YEAR(TODAY())-YEAR(C44)-1,YEAR(TODAY())-YEAR(C44))))","v":8},"Mayran",1,null,1,null,null,null,null,null,1,1,null,1,1]
["Issalys","Oscar","2010-09-19",5,"Mayran",1,null,1,null,null,null,null,null,1,1,null,1,1]
["Mahut","Sarah","11/07/2008",7,"Rignac",null,1,1,null,null,1,1,null,1,1,null,1,1]
["Massip","Lola","18/07/2007",8,"Rignac SJO",null,1,1,null,1,1,1,1,1,1,1,1,1]
["Massip","Lali","14/06/2010",5,"Rignac SJO",null,1,1,null,1,1,1,1,1,1,1,1,1]
["Mazars","Mahtéo","09/03/2007",8,"Rignac SJO",null,1,null,1,null,null,null,1]
["Miquel","Emeline","",{"$error":"#VALUE!"},"Rignac",null,1]
["Miquel","Laurène","26/04/2011",4,"Rignac",null,null,null,null,null,null,null,null,0,0]
["Mirabel","Jules","26/04/2010",5,"Rignac SJO",null,1,null,1,1,null,null,null,null,null,1]
["Molinier","Arthur","2012-05-13",3,"Rignac",null,1,1]
["Mouly","Nataël","2009-08-12",6,"Auzits",1,null,1,null,null,null,null,null,1,1,null,1,1]
["Nedellec","Lucas","27/08/2010",5,"Anglars St Félix",1,null,1,null,null,1,1,null,1,1]
["Pasquier","Quentin","25/08/2008",7,"Mayran",1,null,1,null,null,1,1,null,1,1,null,1,1]
["Pasquier","Chloé","19/10/2010",5,"Mayran",1,null,1,null,null,1,1,null,1,1,null,"F","F"]
["Perrier","Angelot","2011-12-21",4,"Goutrens",1,null,1,null,null,1,1,null,1,1]
["Pons","Emma","06/05/2010",5,"Anglars",1,null,1,null,null,1,1,null,1,1,null,1,1]
["Pons","Laura","2010-05-06",5,"Rignac SJO",null,1,1,null,null,null,null,1,1,1]
["Rossi-Ferrari","Romane","2009-12-17",6,"Mayran",1,null,1]
["Sirmain","Cindy","01/01/2003",{"$f":"IF(MONTH(TODAY())>MONTH(C62),YEAR(TODAY())-YEAR(C62),IF(MONTH(TODAY())<MONTH(C62),YEAR(TODAY())-YEAR(C62)-1,IF(DAY(TODAY())<DAY(C62),YEAR(TODAY())-YEAR(C62)-1,YEAR(TODAY())-YEAR(C62))))","v":13},"",null,1,1,null,null,1,1,null,1,1]
["Tonoli","Rafaël","03/08/2009",6,"Anglars St Félix",1,null,1,null,null,null,null,null,1,1]
["Tournier","Laura","13/12/2009",6,"Rignac",null,1,1,null,null,1,1,null,1,1]
["Verfailly","Joy","10/04/2007",8,"Rignac",null,1,1,null,null,1,1,null,"F","F",null,"F","F"]
["Viargues","Charlotte","2011-06-11",4,"Rignac SJO",null,null,null,null,null,null,null,null,null,null,null,1,1]
["Volpelier","Emma","2010-02-18",5,"Rignac SJO",null,1,1,null,null,null,null,1,1,1]
[null,null,null,116]
[]
["( Age sélectionné ) SOUS TOTAL JOURNALIER :",null,null,null,null,{"$f":"SUBTOTAL(109,F11:F69)","v":27},23,44,5,10,34,34,8,35,35,6,27,28,0,0,0,0,0,0]
["TOTAL : ",null,null,null,null,{"$f":"SUM(F11:F69)","v":27},23,44,5,10,34,34,8,35,35,6,27,28,0,0,0,0,0,{"$f":"SUM(AE11:AE69)","v":0}]
["DEMANDE DE RESERVATIONS : ",null,null,null,null,{"$f":"COUNTIF(F11:F69,\"0\")","v":0},0,0,0,0,0,0,0,1,1,0,0,0,0,0,0,0,0,0]

{"sheet":"Janvier","index":8,"n_rows":70,"n_cols":31,"rows_kept":70,"cut":false,"hidden":false,"merged":[[6,10,8,10],[6,11,8,11],[6,5,8,5],[6,6,8,6],[6,7,8,7],[6,8,8,8],[2,6,2,8],[2,9,2,11],[0,2,0,6],[0,0,1,0],[0,1,1,1],[2,12,2,14],[2,15,2,16],[3,4,8,4],[3,5,5,6],[3,7,5,8],[3,9,4,10],[3,11,4,11],[3,12,4,13],[3,14,4,14],[3,15,4,16],[6,14,8,14],[6,15,8,15],[6,16,8,16],[6,12,8,12],[2,0,2,4],[3,3,8,3],[3,17,4,17],[3,18,4,19],[3,20,4,20],[3,21,4,22],[3,23,4,23],[64,0,64,4],[65,0,65,4],[66,0,66,4],[6,23,8,23],[6,24,8,24],[6,17,8,17],[6,13,8,13],[6,22,8,22],[6,21,8,21],[6,18,8,18],[6,19,8,19],[6,20,8,20],[3,0,8,0],[3,1,8,1],[3,2,8,2],[6,9,8,9],[6,26,8,26],[3,24,4,26],[3,27,5,29],[3,30,8,30],[6,27,8,27],[6,28,8,28],[6,29,8,29],[6,25,8,25]]}
["Pointage Couleur"]
[]
[null,null,null,null,null,null,"Mois de:",null,null,{"$f":"MID(CELL(\"filename\",J3),FIND(\"]\",CELL(\"filename\",J3))+1,32)","v":"Janvier"},null,null,"Année:",null,null,{"$f":"Accueil!C18+1","v":2016}]
["Nom","Prénom","Date de Naissance","Age","Etablissement","CAR",null,"REPAS",null,{"$f":"INDEX({\"dimanche\";\"lundi\";\"mardi\";\"Mercredi\";\"jeudi\";\"vendredi\";\"samedi\"},1+MOD(An!$I$4+3-2,7))","v":"Mercredi"},null,{"$f":"'An1'!C11","v":""},{"$f":"INDEX({\"dimanche\";\"lundi\";\"mardi\";\"Mercredi\";\"jeudi\";\"vendredi\";\"samedi\"},1+MOD(An!$I$4+3-2,7))","v":"Mercredi"},null,"1900-01-06",{"$f":"INDEX({\"dimanche\";\"lundi\";\"mardi\";\"Mercredi\";\"jeudi\";\"vendredi\";\"samedi\"},1+MOD(An!$I$4+3-2,7))","v":"Mercredi"},null,{"$f":"'An1'!C13","v":"2016-01-13"},{"$f":"INDEX({\"dimanche\";\"lundi\";\"mardi\";\"Mercredi\";\"jeudi\";\"vendredi\";\"samedi\"},1+MOD(An!$I$4+3-2,7))","v":"Mercredi"},null,{"$f":"'An1'!C14","v":"2016-01-20"},{"$f":"INDEX({\"dimanche\";\"lundi\";\"mardi\";\"Mercredi\";\"jeudi\";\"vendredi\";\"samedi\"},1+MOD(An!$I$4+3-2,7))","v":"Mercredi"},null,{"$f":"'An1'!C15","v":"2016-01-27"},"Total",null,null,"Allergies et Régimes",null,null,"Remarques Importantes"]
[]
[]
[null,null,null,null,null,"Oui","Non","Oui","Non","Matin","Repas","Après - midi","Matin","Repas","Après - midi","Matin","Repas","Après - midi","Matin","Repas","Après - midi","Matin","Repas","Après - midi","1/2 journée","1/2 journée + Repas","Journée entière","Allergies Allimentaires","Autres Allergies","Régimes Alimentaires"]
[]
[]
["21","22","23","24","1","2","3","4","5","6","7","8","9","10","11","12","13","14","15","16","17","18","19","192","Colonne2","Colonne3","Colonne4","Colonne43","Colonne42","Colonne5","Colonne1"]
["Amari","Naïm","08/12/2008",{"$f":"IF(MONTH(TODAY())>MONTH(C11),YEAR(TODAY())-YEAR(C11),IF(MONTH(TODAY())<MONTH(C11),YEAR(TODAY())-YEAR(C11)-1,IF(DAY(TODAY())<DAY(C11),YEAR(TODAY())-YEAR(C11)-1,YEAR(TODAY())-YEAR(C11))))","v":7},"Rignac",null,1,1,null,null,null,null,null,1,1,null,1,1,null,"A","A",null,1,1]
["Amari","Ilyes","01/01/2012",4,"Rignac",null,1,1,null,null,null,null,null,1,1,null,1,1,null,1,1,null,1,1]
["Barba-A","Louise","22/03/2008",7,"Rignac",null,1,1,null,null,null,null,null,null,null,null,1,1,null,1,1,null,1,1]
["Barrau","Marie","11/05/2009",6,"Rignac",null,1,null,1]
["Barreau","Tom","2007-04-05",8,"Rignac SJO",null,1,1,null,null,null,null,1,1,1,1,1,1,null,null,null,1,1,1]
["Bayol","Maël","12/07/2011",4,"Mayran",1,null,1,null,null,null,null,null,1,1,null,1,1,null,1,1,null,1,1]
["Brun","Raphaël","28/03/2007",8,"Rignac SJO",null,1,1,null,null,null,null,1,1,null,1,1,1,1]
["Capely","Loris","22/09/2009",6,"Goutrens",1,null,1,null,null,null,null,null,null,null,null,1,1]
["Cher","Zélie","04/05/2010",5,"Rignac SJO",null,1,1,null,null,null,null,null,null,null,null,null,null,null,null,"F"]
["Cher","Axel","28/12/2004",11,"Rodez",null,1,1,null,null,null,null,null,null,null,null,null,null,null,null,"F"]
["Conde","India","12/08/2011",4,"Anglars",1,null,1,null,null,null,null,null,1,1,null,1,1,null,1,1,null,1,1]
["Conde","Leny","18/01/2009",7,"Anglars",1,null,1,null,null,null,null,null,1,1,null,1,1,null,1,1,null,1,1]
["Cortes","Lizéa","10/01/2012",4,"Anglars",null,1,1,null,null,null,null,null,null,null,1,1,1,1,1,1,1,1,1]
["Couffignal","Sacha","10/04/2010",5,"Mayran",1,null,1,null,null,null,null,null,1,1,null,1,1,null,1,1,null,1,1]
["Couffignal","Eddy","07/08/2007",8,"Rodez",null,1,null,1,null,null,null,null,null,1,null,null,1,null,null,1,null,null,1]
["Couto-f","Zoé","31/10/2010",5,"Rignac SJO",null,1,null,1,null,null,null,1,null,null,1,null,null,1,null,null,1]
["Cristol","Alexis","24/02/2011",4,"Anglars",1,null,1,null,null,null,null,null,null,null,null,null,null,null,1,1,null,1,1]
["Delabrousse-R","Maélyne","2012-06-03",3,"Bournazel",1,null,1,null,null,null,null,null,1,1,null,1,1,null,1,1,null,1,1]
["Dunet","Tom","12/06/2009",6,"Rignac SJO",null,1,1,null,null,null,null,null,null,null,null,1,1,null,null,null,null,1,1]
["Dunet","Enora","03/05/2007",8,"Rignac SJO",null,1,1,null,null,null,null,null,null,null,null,1,1,null,null,null,null,1,1]
["Dupont","Gabin","10/04/2009",6,"Anglars",1,null,1,null,null,null,null,null,1,1,null,1,1,null,1,1,null,1,1]
["Elhadrati","Ilyes","31/12/2011",4,"Mayran",1,null,1,null,null,null,null,null,1,1,null,1,1,null,1,1,null,1,1,null,null,null,null,null,3]
["Elhadrati","Nora","16/09/2006",9,"Mayran",1,null,1,null,null,null,null,null,1,1,null,1,1,null,null,null,null,1,1,null,null,null,null,null,3]
["Elhadrati","Wacil","29/10/2009",6,"Mayran",1,null,1,null,null,null,null,null,1,1,null,1,1,null,1,1,null,1,1,null,null,null,null,null,3]
["Fabre","Maelly","17/05/2011",4,"Mayran",1,null,1,null,null,null,null,null,1,1,null,1,1,null,1,1,null,1,1]
["Farret-M","Jules","13/08/2009",6,"Rignac",null,1,1,null,null,null,null,null,null,null,null,null,null,null,1,1]
["Fleck","Nathan","09/03/2006",9,"Rignac",null,1,1,null,null,null,null,null,null,null,null,1,1,null,1,1,null,1,1]
["Fleck","Lina","25/04/2012",3,"Rignac",null,1,1,null,null,null,null,null,null,null,null,1,1,null,1,1,null,1,1]
["Flotte","Emma","20/03/2010",5,"Goutrens",1,null,1,null,null,null,null,null,1,1,null,null,null,null,1,1]
["Fontaine","Aline","20/04/2009",6,"Rignac",null,1,1,null,null,null,null,null,1,1,null,1,1,null,1,1,null,1,1]
["Fourmont","Mylena","15/01/2007",9,"Escandolières",1,null,1,null,null,null,null,null,1,1,null,1,1,null,1,1,null,1,1]
["Fourmont","Noah","15/11/2009",{"$f":"IF(MONTH(TODAY())>MONTH(C42),YEAR(TODAY())-YEAR(C42),IF(MONTH(TODAY())<MONTH(C42),YEAR(TODAY())-YEAR(C42)-1,IF(DAY(TODAY())<DAY(C42),YEAR(TODAY())-YEAR(C42)-1,YEAR(TODAY())-YEAR(C42))))","v":6},"Goutrens",1,null,1,null,null,null,null,null,1,1,null,1,1,null,1,1,null,1,1]
["Fournier","Farell","01/01/2011",5,"Rignac SJO",null,1,1,null,null,null,null,1,1,1,1,1,1,null,null,null,1,1,1]
["Gares","Eloïse","13/01/2006",10,"Mayran",1,null,1,null,null,null,null,null,1,1,null,1,1,null,null,null,null,1,1]
["Herrlé","Yoan","20/03/2006",9,"Rignac SJO",null,1,1,null,null,null,null,null,null,null,1,1,null,null,null,null,1,1]
["Hoyes","Rachelle","28/12/2008",7,"Roussennac",1,null,1,null,null,null,null,null,1,1,null,"F","F",null,null,null,null,1,1]
["Issalys","Oscar","19/09/2010",5,"Mayran",1,null,1,null,null,null,null,null,null,null,null,1,1,null,null,null,null,1,1]
["Issalys","Jade","27/06/2007",8,"Mayran",1,null,1,null,null,null,null,null,null,null,null,1,1,null,null,null,null,1,1]
["Mahut","Sarah","11/07/2008",7,"Rignac",null,1,1,null,null,null,null,null,1,1,null,1,1,null,1,1,null,1,1]
["Massip","Lola","18/07/2007",8,"Rignac SJO",null,1,1,null,null,null,null,1,1,1,1,1,1,1,1,1,1,1,1]
["Massip","Lali","14/06/2010",5,"Rignac SJO",null,1,1,null,null,null,null,1,1,1,1,1,1,1,1,1,1,1,1]
["Mirabel","Jules","26/04/2010",5,"Rignac SJO",null,1,1]
["Molinier","Arthur","13/05/2012",3,"Rignac",null,1,1,null,null,null,null,null,1,1,null,"F","F",null,1,1,null,1,1]
["Moulis","Nataël","12/08/2009",6,"Auzits",1,null,1,null,null,null,null,null,1,1,null,null,null,null,1,1,null,1,1]
["Mussard","Maélyne","02/09/2008",7,"Rignac",null,1,1,null,null,null,null,null,1,1]
["Nedellec","Lucas","27/08/2010",5,"Anglars St Félix",1,null,1,null,null,null,null,null,null,null,null,1,1,null,1,1]
["Pasquier","Quentin","25/08/2008",7,"Mayran",1,null,1,null,null,null,null,null,1,1,null,1,1,null,1,1,null,1,1]
["Pasquier","Chloé","19/10/2010",5,"Mayran",1,null,1,null,null,null,null,null,1,1,null,1,1,null,1,1,null,1,1]
["Pons","Emma","06/05/2010",5,"Anglars",1,null,1,null,null,null,null,null,1,1,null,1,1,null,1,1,null,1,1]
["Tonoli","Rafaël","03/08/2009",6,"Anglars St Félix",1,null,1,null,null,null,null,null,1,1]
["Tournier","Laura","13/12/2009",6,"Rignac",null,1,1,null,null,null,null,null,1,1,null,1,1,null,1,1,null,1,1]
["Verfailly","Joy","10/04/2007",8,"Rignac",null,1,1,null,null,null,null,null,null,null,null,1,1,null,1,1,null,0,0]
["Volpelier","Emma","18/02/2010",5,"Rignac SJO",null,1,1,null,null,null,null,1,1,1,1,1,1,null,null,null,1,1,1]
[]
["( Age sélectionné ) SOUS TOTAL JOURNALIER :",null,null,null,null,{"$f":"SUBTOTAL(109,F11:F64)","v":25},28,50,3,0,0,0,7,33,33,9,39,39,5,31,32,8,39,39]
["TOTAL : ",null,null,null,null,{"$f":"SUM(F11:F64)","v":25},28,50,3,0,0,0,7,33,33,9,39,39,5,31,32,8,39,39]
["DEMANDE DE RESERVATIONS : ",null,null,null,null,{"$f":"COUNTIF(F11:F64,\"0\")","v":0},0,0,0,0,0,0,0,0,0,0,0,0,0,0,0,0,1,1]
[]
[]
[null,null,null,null,null,null,null,0]

{"sheet":"Février","index":9,"n_rows":60,"n_cols":31,"rows_kept":60,"cut":false,"hidden":false,"merged":[[6,10,8,10],[6,11,8,11],[6,5,8,5],[6,6,8,6],[6,7,8,7],[6,8,8,8],[2,6,2,8],[2,9,2,11],[0,2,0,6],[0,0,1,0],[0,1,1,1],[2,12,2,14],[2,15,2,16],[3,4,8,4],[3,5,5,6],[3,7,5,8],[3,9,4,10],[3,11,4,11],[3,12,4,13],[3,14,4,14],[3,15,4,16],[6,14,8,14],[6,15,8,15],[6,16,8,16],[6,12,8,12],[2,0,2,4],[3,3,8,3],[3,17,4,17],[3,18,4,19],[3,20,4,20],[3,21,4,22],[3,23,4,23],[57,0,57,4],[58,0,58,4],[59,0,59,4],[6,23,8,23],[6,24,8,24],[6,17,8,17],[6,13,8,13],[6,22,8,22],[6,21,8,21],[6,18,8,18],[6,19,8,19],[6,20,8,20],[3,0,8,0],[3,1,8,1],[3,2,8,2],[6,9,8,9],[6,26,8,26],[3,24,4,26],[3,27,5,29],[3,30,8,30],[6,27,8,27],[6,28,8,28],[6,29,8,29],[6,25,8,25]]}
["Pointage Couleur"]
[]
[null,null,null,null,null,null,"Mois de:",null,null,{"$f":"MID(CELL(\"filename\",J3),FIND(\"]\",CELL(\"filename\",J3))+1,32)","v":"Février"},null,null,"Année:",null,null,{"$f":"Accueil!C18+1","v":2016}]
["Nom","Prénom","Date de Naissance","Age","Etablissement","CAR",null,"REPAS",null,{"$f":"INDEX({\"dimanche\";\"lundi\";\"mardi\";\"Mercredi\";\"jeudi\";\"vendredi\";\"samedi\"},1+MOD(An!$I$4+3-2,7))","v":"Mercredi"},null,{"$f":"'An1'!K11","v":"2016-02-03"},{"$f":"INDEX({\"dimanche\";\"lundi\";\"mardi\";\"Mercredi\";\"jeudi\";\"vendredi\";\"samedi\"},1+MOD(An!$I$4+3-2,7))","v":"Mercredi"},null,{"$f":"'An1'!K12","v":"2016-02-10"},{"$f":"INDEX({\"dimanche\";\"lundi\";\"mardi\";\"Mercredi\";\"jeudi\";\"vendredi\";\"samedi\"},1+MOD(An!$I$4+3-2,7))","v":"Mercredi"},null,{"$f":"'An1'!K13","v":"2016-02-17"},{"$f":"INDEX({\"dimanche\";\"lundi\";\"mardi\";\"Mercredi\";\"jeudi\";\"vendredi\";\"samedi\"},1+MOD(An!$I$4+3-2,7))","v":"Mercredi"},null,null,{"$f":"INDEX({\"dimanche\";\"lundi\";\"mardi\";\"Mercredi\";\"jeudi\";\"vendredi\";\"samedi\"},1+MOD(An!$I$4+3-2,7))","v":"Mercredi"},null,{"$f":"'An1'!K15","v":""},"Total",null,null,"Allergies et Régimes",null,null,"Remarques Importantes"]
[]
[]
[null,null,null,null,null,"Oui","Non","Oui","Non","Matin","Repas","Après - midi","Matin","Repas","Après - midi","Matin","Repas","Après - midi","Matin","Repas","Après - midi","Matin","Repas","Après - midi","1/2 journée","1/2 journée + Repas","Journée entière","Allergies Allimentaires","Autres Allergies","Régimes Alimentaires"]
[]
[]
["21","22","23","24","1","2","3","4","5","6","7","8","9","10","11","12","13","14","15","16","17","18","19","192","Colonne2","Colonne3","Colonne4","Colonne43","Colonne42","Colonne5","Colonne1"]
["Barba-A","Louise","22/03/2008",{"$f":"IF(MONTH(TODAY())>MONTH(C11),YEAR(TODAY())-YEAR(C11),IF(MONTH(TODAY())<MONTH(C11),YEAR(TODAY())-YEAR(C11)-1,IF(DAY(TODAY())<DAY(C11),YEAR(TODAY())-YEAR(C11)-1,YEAR(TODAY())-YEAR(C11))))","v":7},"Rignac",null,null,null,null,null,1,1,null,1,1,null,1,1]
["Barrau","Marie","11/05/2009",6,"Rignac"]
["Barreau","Tom","2007-04-05",8,"Rignac SJO",null,1,1,null,1,1,1,1,1,1,1,1,1]
["Bayol","Maël","12/07/2011",4,"Mayran",1,null,1,null,null,1,1,null,1,1,null,1,1]
["Brun","Raphaël","28/03/2007",8,"Rignac SJO",null,1,1,null,1,1,null,1,1,null,1,1]
["Cher","Zélie","04/05/2010",5,"Rignac SJO",null,1,null,1,null,null,1,null,null,null,null,null,1]
["Cher","Axel","28/12/2004",11,"Rodez",null,1,null,1,null,null,1,null,null,null,null,null,1]
["Conde","India","12/08/2011",4,"Anglars",1,null,1,null,null,1,1,null,1,1,null,1,1]
["Conde","Leny","18/01/2009",7,"Anglars",1,null,1,null,null,1,1,null,1,1,null,1,1]
["Couffignal","Sacha","10/04/2010",5,"Mayran",1,null,1,null,null,1,1,null,1,1]
["Couffignal","Eddy","07/08/2007",8,"Rodez",null,1,null,1,null,null,1,null,null,1]
["Couto-f","Zoé","31/10/2010",5,"Rignac SJO",null,1,null,1,1,null,null,1,null,null,1]
["Cristol","Alexis","24/02/2011",4,"Anglars",1,null,1,null,null,1,1,null,1,1,null,1,1]
["Delabrousse-R","Maélyne","03/06/2012",3,"Bournazel",1,null,1,null,null,1,1,null,1,1,null,1,1]
["Dunet","Tom","12/06/2009",6,"Rignac SJO",null,1,1,null,null,null,null,null,1,1]
["Dunet","Enora","03/05/2007",8,"Rignac SJO",null,1,1,null,null,null,null,null,1,1]
["Dupont","Gabin","10/04/2009",6,"Anglars",1,null,1,null,null,1,1,null,1,1,null,1,1]
["Elhadrati","Ilyes","31/12/2011",4,"Mayran",null,null,null,null,null,1,1,null,1,1,null,1,1,null,null,null,null,null,null,null,null,null,null,null,3]
["Elhadrati","Wacil","29/10/2009",6,"Mayran",null,null,null,null,null,1,1,null,1,1,null,1,1,null,null,null,null,null,null,null,null,null,null,null,3]
["Elhadrati","Nora","16/09/2006",9,"Mayran",null,null,null,null,null,1,1,null,1,1,null,1,1,null,null,null,null,null,null,null,null,null,null,null,3]
["Fabre","Maelly","17/05/2011",4,"Mayran",null,null,null,null,null,1,1,null,1,1,null,1,1]
["Fleck","Lina","25/04/2012",3,"Rignac",null,null,null,null,null,1,1,null,1,1,null,1,1]
["Fleck","Nathan","09/03/2006",9,"Rignac",null,null,null,null,null,1,1,null,1,1,null,1,1]
["Flotte","Emma","20/03/2010",5,"Goutrens",1,null,1,null,null,1,1,null,null,null,null,1,1]
["Fourmont","Noah","15/11/2009",6,"Goutrens",1,null,1,null,null,1,1,null,1,1,null,1,1]
["Fourmont","Mylena","15/01/2007",9,"Escandolières",1,null,1,null,null,1,1,null,1,1,null,1,1]
["Fournier","Farell","01/01/2011",5,"Rignac SJO",1,null,1,null,1,1,1,1,1,1,1,1,1]
["Gares","Eloïse","13/01/2006",10,"Mayran",1,null,1,null,null,1,1,null,1,1,null,1,1]
["Herrlé","Yoan","20/03/2006",9,"Rignac SJO",null,null,null,null,null,null,null,1,1]
["Hoyes","Rachelle","28/12/2008",7,"Roussennac",1,null,1,null,null,1,1,null,1,1,null,1,1]
["Issalys","Oscar","19/09/2010",5,"Mayran",1,null,1]
["Issalys","Jade","27/06/2007",8,"Mayran",1,null,1]
["Mahut","Sarah","11/07/2008",7,"Rignac",null,1,1,null,null,1,1,null,1,1,null,1,1]
["Massip","Lali","14/06/2010",5,"Rignac SJO",null,1,1,null,1,1,1,1,1,1,1,1,1]
["Massip","Lola","18/07/2007",8,"Rignac SJO",null,1,1,null,1,1,1,1,1,1,1,1,1]
["Mirabel","Jules","26/04/2010",5,"Rignac SJO",null,1,null,1]
["Molinier","Arthur","13/05/2012",3,"Rignac",null,null,null,null,null,1,1,null,1,1,null,1,1]
["Moulis","Nataël","12/08/2009",6,"Auzits",1,null,1,null,null,1,1,null,1,1,null,1,1]
["Nedellec","Lucas","27/08/2010",5,"Anglars St Félix",1,null,1,null,null,1,1,null,1,1,null,1,1]
["Pasquier","Chloé","19/10/2010",5,"Mayran",1,null,1,null,null,1,1,null,1,1,null,1,1]
["Pasquier","Quentin","25/08/2008",7,"Mayran",1,null,1,null,null,1,1,null,1,1,null,1,1]
["Pons","Laura","06/05/2010",5,"Rignac SJO",null,null,null,null,1,1,1,null,null,null,1,1,1]
["Pons","Emma","06/05/2010",5,"Anglars",1,null,1,null,null,1,1,null,1,1,null,1,1]
["Tournier","Laura","13/12/2009",6,"Rignac",null,1,1,null,null,1,1,null,1,1,null,1,1]
["Verfailly","Joy","10/04/2007",8,"Rignac",null,1,1,null,null,0,0,null,0,0,null,0,0]
["Volpelier","Emma","18/02/2010",5,"Rignac SJO",null,1,1,null,null,null,null,1,1,1]
[]
["( Age sélectionné ) SOUS TOTAL JOURNALIER :",null,null,null,null,{"$f":"SUBTOTAL(109,F11:F57)","v":20},15,30,5,7,33,35,8,35,34,7,32,33,0,0,0,0,0,0]
["TOTAL : ",null,null,null,null,{"$f":"SUM(F11:F57)","v":20},15,30,5,7,33,35,8,35,34,7,32,33,0,0,0,0,0,{"$f":"SUM(AE11:AE57)","v":0}]
["DEMANDE DE RESERVATIONS : ",null,null,null,null,{"$f":"COUNTIF(F11:F57,\"0\")","v":0},0,0,0,0,1,1,0,1,1,0,1,1,0,0,0,0,0,0]

{"sheet":"Mars","index":10,"n_rows":54,"n_cols":31,"rows_kept":54,"cut":false,"hidden":false,"merged":[[6,10,8,10],[6,11,8,11],[6,5,8,5],[6,6,8,6],[6,7,8,7],[6,8,8,8],[2,6,2,8],[2,9,2,11],[0,2,0,6],[0,0,1,0],[0,1,1,1],[2,12,2,14],[2,15,2,16],[3,4,8,4],[3,5,5,6],[3,7,5,8],[3,9,4,10],[3,11,4,11],[3,12,4,13],[3,14,4,14],[3,15,4,16],[6,14,8,14],[6,15,8,15],[6,16,8,16],[6,12,8,12],[2,0,2,4],[3,3,8,3],[3,17,4,17],[3,18,4,19],[3,20,4,20],[3,21,4,22],[3,23,4,23],[51,0,51,4],[52,0,52,4],[53,0,53,4],[6,23,8,23],[6,24,8,24],[6,17,8,17],[6,13,8,13],[6,22,8,22],[6,21,8,21],[6,18,8,18],[6,19,8,19],[6,20,8,20],[3,0,8,0],[3,1,8,1],[3,2,8,2],[6,9,8,9],[6,26,8,26],[3,24,4,26],[3,27,5,29],[3,30,8,30],[6,27,8,27],[6,28,8,28],[6,29,8,29],[6,25,8,25]]}
["Pointage Couleur"]
[]
[null,null,null,null,null,null,"Mois de:",null,null,{"$f":"MID(CELL(\"filename\",J3),FIND(\"]\",CELL(\"filename\",J3))+1,32)","v":"Mars"},null,null,"Année:",null,null,{"$f":"Accueil!C18+1","v":2016}]
["Nom","Prénom","Date de Naissance","Age","Etablissement","CAR",null,"REPAS",null,{"$f":"INDEX({\"dimanche\";\"lundi\";\"mardi\";\"Mercredi\";\"jeudi\";\"vendredi\";\"samedi\"},1+MOD(An!$I$4+3-2,7))","v":"Mercredi"},null,{"$f":"'An1'!S11","v":"2016-03-02"},{"$f":"INDEX({\"dimanche\";\"lundi\";\"mardi\";\"Mercredi\";\"jeudi\";\"vendredi\";\"samedi\"},1+MOD(An!$I$4+3-2,7))","v":"Mercredi"},null,{"$f":"'An1'!S12","v":"2016-03-09"},{"$f":"INDEX({\"dimanche\";\"lundi\";\"mardi\";\"Mercredi\";\"jeudi\";\"vendredi\";\"samedi\"},1+MOD(An!$I$4+3-2,7))","v":"Mercredi"},null,{"$f":"'An1'!S13","v":"2016-03-16"},{"$f":"INDEX({\"dimanche\";\"lundi\";\"mardi\";\"Mercredi\";\"jeudi\";\"vendredi\";\"samedi\"},1+MOD(An!$I$4+3-2,7))","v":"Mercredi"},null,{"$f":"'An1'!S14","v":"2016-03-23"},{"$f":"INDEX({\"dimanche\";\"lundi\";\"mardi\";\"Mercredi\";\"jeudi\";\"vendredi\";\"samedi\"},1+MOD(An!$I$4+3-2,7))","v":"Mercredi"},null,{"$f":"'An1'!S15","v":"2016-03-30"},"Total",null,null,"Allergies et Régimes",null,null,"Remarques Importantes"]
[]
[]
[null,null,null,null,null,"Oui","Non","Oui","Non","Matin","Repas","Après - midi","Matin","Repas","Après - midi","Matin","Repas","Après - midi","Matin","Repas","Après - midi","Matin","Repas","Après - midi","1/2 journée","1/2 journée + Repas","Journée entière","Allergies Allimentaires","Autres Allergies","Régimes Alimentaires"]
[]
[]
["21","22","23","24","1","2","3","4","5","6","7","8","9","10","11","12","13","14","15","16","17","18","19","192","Colonne2","Colonne3","Colonne4","Colonne43","Colonne42","Colonne5","Colonne1"]
["Agnoux","Arthur","12/01/2008",{"$f":"IF(MONTH(TODAY())>MONTH(C11),YEAR(TODAY())-YEAR(C11),IF(MONTH(TODAY())<MONTH(C11),YEAR(TODAY())-YEAR(C11)-1,IF(DAY(TODAY())<DAY(C11),YEAR(TODAY())-YEAR(C11)-1,YEAR(TODAY())-YEAR(C11))))","v":8},"Rignac",null,1,1,null,null,null,null,null,null,null,null,null,null,null,1,1]
["Agnoux","Maxime","30/03/2011",4,"Rignac",null,1,1,null,null,null,null,null,null,null,null,null,null,null,1,1]
["Agnoux","Clémence","30/03/2011",4,"Rignac",null,1,1,null,null,null,null,null,null,null,null,null,null,null,1,1]
["Barrau","Marie","11/05/2009",6,"Rignac"]
["Bayol","Maël","12/07/2011",4,"Mayran",1,null,1,null,null,1,1,null,1,1,null,1,1,null,1,1,null,1,1]
["Brun","Raphaël","28/03/2007",8,"Rignac SJO",null,1,1,null,null,null,null,1,1,null,1,1,null,1,1,null,1,1]
["Cher","Zélie","04/05/2010",5,"Rignac SJO",null,1,null,1,null,null,null,null,null,null,null,null,1,null,null,null,null,null,1]
["Cher","Axel","28/12/2004",11,"Rodez",null,1,null,1,null,null,null,null,null,null,null,null,1,null,null,null,null,null,1]
["Conde","India","12/08/2011",4,"Anglars",1,null,1,null,null,1,1,null,1,1,null,1,1,null,1,1,null,1,1]
["Conde","Leny","18/01/2009",7,"Anglars",1,null,1,null,null,1,1,null,1,1,null,1,1,null,1,1,null,1,1]
["Couffignal","Sacha","10/04/2010",5,"Mayran",null,null,null,null,null,1,1,null,null,null,null,1,1,null,1,1,null,1,1]
["Couffignal","Eddy","07/08/2007",8,"Rodez",null,null,null,null,null,null,1,null,null,null,null,null,1,null,null,1,null,null,1]
["Couto-f","Zoé","31/10/2010",5,"Rignac SJO",null,1,null,1,1,null,null,1,null,null,1,null,null,1,null,null,1]
["Cristol","Alexis","24/02/2011",4,"Anglars",1,null,1,null,null,null,null,null,1,1,null,1,1,null,1,1,null,1,1]
["Delabrousse-R","Maélyne","03/06/2012",3,"Bournazel",1,null,1,null,null,1,1,null,1,1,null,1,1,null,1,1,null,1,1]
["Dunet","Tom","12/06/2009",6,"Rignac SJO",null,1,1,null,null,null,null,null,1,1,null,null,null,null,1,1]
["Dunet","Enora","03/05/2007",8,"Rignac SJO",null,1,1,null,null,null,null,null,1,1,null,null,null,null,1,1]
["Dupont","Gabin","10/04/2009",6,"Anglars",1,null,1,null,null,1,1,null,1,1,null,1,1,null,1,1,null,1,1]
["Fabre","Maelly","17/05/2011",4,"Mayran",null,null,null,null,null,1,1,null,1,1,null,1,1,null,1,1,null,1,1]
["Flotte","Emma","20/03/2010",5,"Goutrens",1,null,1,null,null,null,null,null,null,null,null,1,1,null,null,null,null,1,1]
["Fournier","Farell","01/01/2011",5,"Rignac SJO",null,1,1,null,1,1,1,1,1,1,1,1,1,1,1,1,1,1,1]
["Gares","Eloïse","13/01/2006",10,"Mayran",1,null,1,null,null,1,1,null,1,1,null,1,1,null,1,1,null,1,1]
["Herrlé","Yoan","20/03/2006",9,"Rignac SJO",null,null,null,null,null,null,null,1,1,null,null,null,null,1,1]
["Hoyes","Rachelle","28/12/2008",7,"Roussennac",1,null,1,null,null,1,1,null,1,1,null,1,1,null,1,1,null,1,1]
["Issalys","Oscar","19/09/2010",5,"Mayran",1,null,1,null,null,null,null,null,null,null,null,null,null,null,1,1]
["Issalys","Jade","27/06/2007",8,"Mayran",1,null,1,null,null,null,null,null,null,null,null,null,null,null,1,1]
["Mahut","Sarah","11/07/2008",7,"Rignac",null,1,1,null,null,1,1,null,1,1,null,1,1,null,1,1,null,1,1]
["Massip","Lali","14/06/2010",5,"Rignac SJO",null,1,1,null,1,1,1,1,1,1,1,1,1,1,1,1,1,1,1]
["Massip","Lola","18/07/2007",8,"Rignac SJO",null,1,1,null,1,1,1,1,1,1,1,1,1,1,1,1,1,1,1]
["Mirabel","Jules","26/04/2010",5,"Rignac SJO",null,1,null,1]
["Molinier","Arthur","13/05/2012",3,"Rignac",null,null,null,null,null,1,1,null,1,1,null,1,1,null,1,1,null,1,1]
["Moulis","Nataël","12/08/2009",6,"Auzits",1,null,1,null,null,1,1,null,1,1,null,1,1,null,1,1,null,1,1]
["Nedellec","Lucas","27/08/2010",5,"Anglars St Félix",1,null,1,null,null,1,1,null,1,1,null,1,1,null,1,1,null,1,1]
["Pasquier","Chloé","19/10/2010",5,"Mayran",1,null,1,null,null,1,1,null,1,1,null,1,1,null,1,1,null,1,1]
["Pasquier","Quentin","25/08/2008",7,"Mayran",1,null,1,null,null,1,1,null,1,1,null,1,1,null,1,1,null,1,1]
["Pons","Laura","06/05/2010",5,"Rignac SJO",null,null,null,null,null,null,null,null,null,null,1,1,1,null,null,null,1,1,1]
["Pons","Emma","06/05/2010",5,"Anglars",1,null,1,null,null,1,1,null,1,1,null,1,1,null,1,1,null,1,1]
["Tournier","Laura","13/12/2009",6,"Rignac",null,1,1,null,null,1,1,null,1,1,null,1,1,null,1,1,null,1,1]
["Verfailly","Joy","10/04/2007",8,"Rignac",null,1,1,null,null,null,null,null,0,0,null,0,0,null,0,0,null,0,0]
["Volpelier","Emma","18/02/2010",5,"Rignac SJO",null,1,1,null,null,null,null,1,1,1,null,null,null,1,1,1]
[]
["( Age sélectionné ) SOUS TOTAL JOURNALIER :",null,null,null,null,{"$f":"SUBTOTAL(109,F11:F51)","v":16},17,29,4,4,20,21,7,25,23,6,24,26,7,31,30,6,24,26]
["TOTAL : ",null,null,null,null,{"$f":"SUM(F11:F51)","v":16},17,29,4,4,20,21,7,25,23,6,24,26,7,31,30,6,24,{"$f":"SUM(AE11:AE51)","v":0}]
["DEMANDE DE RESERVATIONS : ",null,null,null,null,{"$f":"COUNTIF(F11:F51,\"0\")","v":0},0,0,0,0,0,0,0,1,1,0,1,1,0,1,1,0,1,1]

{"sheet":"Avril","index":11,"n_rows":52,"n_cols":31,"rows_kept":52,"cut":false,"hidden":false,"merged":[[6,10,8,10],[6,11,8,11],[6,5,8,5],[6,6,8,6],[6,7,8,7],[6,8,8,8],[2,6,2,8],[2,9,2,11],[0,2,0,6],[0,0,1,0],[0,1,1,1],[2,12,2,14],[2,15,2,16],[3,4,8,4],[3,5,5,6],[3,7,5,8],[3,9,4,10],[3,11,4,11],[3,12,4,13],[3,14,4,14],[3,15,4,16],[6,14,8,14],[6,15,8,15],[6,16,8,16],[6,12,8,12],[2,0,2,4],[3,3,8,3],[3,17,4,17],[3,18,4,19],[3,20,4,20],[3,21,4,22],[3,23,4,23],[49,0,49,4],[50,0,50,4],[51,0,51,4],[6,23,8,23],[6,24,8,24],[6,17,8,17],[6,13,8,13],[6,22,8,22],[6,21,8,21],[6,18,8,18],[6,19,8,19],[6,20,8,20],[3,0,8,0],[3,1,8,1],[3,2,8,2],[6,9,8,9],[6,26,8,26],[3,24,4,26],[3,27,5,29],[3,30,8,30],[6,27,8,27],[6,28,8,28],[6,29,8,29],[6,25,8,25]]}
["Pointage Couleur"]
[]
[null,null,null,null,null,null,"Mois de:",null,null,{"$f":"MID(CELL(\"filename\",J3),FIND(\"]\",CELL(\"filename\",J3))+1,32)","v":"Avril"},null,null,"Année:",null,null,{"$f":"Accueil!C18+1","v":2016}]
["Nom","Prénom","Date de Naissance","Age","Etablissement","CAR",null,"REPAS",null,{"$f":"INDEX({\"dimanche\";\"lundi\";\"mardi\";\"Mercredi\";\"jeudi\";\"vendredi\";\"samedi\"},1+MOD(An!$I$4+3-2,7))","v":"Mercredi"},null,{"$f":"'An1'!C20","v":""},{"$f":"INDEX({\"dimanche\";\"lundi\";\"mardi\";\"Mercredi\";\"jeudi\";\"vendredi\";\"samedi\"},1+MOD(An!$I$4+3-2,7))","v":"Mercredi"},null,{"$f":"'An1'!C21","v":"2016-04-06"},{"$f":"INDEX({\"dimanche\";\"lundi\";\"mardi\";\"Mercredi\";\"jeudi\";\"vendredi\";\"samedi\"},1+MOD(An!$I$4+3-2,7))","v":"Mercredi"},null,{"$f":"'An1'!C22","v":"2016-04-13"},{"$f":"INDEX({\"dimanche\";\"lundi\";\"mardi\";\"Mercredi\";\"jeudi\";\"vendredi\";\"samedi\"},1+MOD(An!$I$4+3-2,7))","v":"Mercredi"},null,{"$f":"'An1'!C23","v":"2016-04-20"},{"$f":"INDEX({\"dimanche\";\"lundi\";\"mardi\";\"Mercredi\";\"jeudi\";\"vendredi\";\"samedi\"},1+MOD(An!$I$4+3-2,7))","v":"Mercredi"},null,{"$f":"'An1'!C24","v":"2016-04-27"},"Total",null,null,"Allergies et Régimes",null,null,"Remarques Importantes"]
[]
[]
[null,null,null,null,null,"Oui","Non","Oui","Non","Matin","Repas","Après - midi","Matin","Repas","Après - midi","Matin","Repas","Après - midi","Matin","Repas","Après - midi","Matin","Repas","Après - midi","1/2 journée","1/2 journée + Repas","Journée entière","Allergies Allimentaires","Autres Allergies","Régimes Alimentaires"]
[]
[]
["21","22","23","24","1","2","3","4","5","6","7","8","9","10","11","12","13","14","15","16","17","18","19","192","Colonne2","Colonne3","Colonne4","Colonne43","Colonne42","Colonne5","Colonne1"]
["Barrau","Marie","11/05/2009",{"$f":"IF(MONTH(TODAY())>MONTH(C11),YEAR(TODAY())-YEAR(C11),IF(MONTH(TODAY())<MONTH(C11),YEAR(TODAY())-YEAR(C11)-1,IF(DAY(TODAY())<DAY(C11),YEAR(TODAY())-YEAR(C11)-1,YEAR(TODAY())-YEAR(C11))))","v":6},"Rignac"]
["Bayol","Maël","12/07/2011",4,"Mayran",1,null,1,null,null,null,null,null,1,1,null,1,1,null,1,1]
["Brun","Raphaël","28/03/2007",8,"Rignac SJO",null,1,1,null,null,null,null,1,1,null,1,1,null,1,1]
["Cher","Zélie","04/05/2010",5,"Rignac SJO"]
["Cher","Axel","28/12/2004",11,"Rodez"]
["Conde","India","12/08/2011",4,"Anglars",1,null,1,null,null,null,null,null,1,1,null,1,1,null,1,1,null,1,1]
["Conde","Leny","18/01/2009",7,"Anglars",1,null,1,null,null,null,null,null,1,1,null,1,1,null,1,1,null,1,1]
["Couffignal","Sacha","10/04/2010",5,"Mayran",null,null,null,null,null,null,null,null,1,1,null,1,1]
["Couffignal","Eddy","07/08/2007",8,"Rodez",null,null,null,null,null,null,null,null,null,1,null,null,1]
["Couto-f","Zoé","31/10/2010",5,"Rignac SJO",null,1,null,1,null,null,null,1,null,null,1,null,null,1,null,null,1]
["Cristol","Alexis","24/02/2011",4,"Anglars",1,null,1,null,null,null,null,null,1,1,null,1,1]
["Delabrousse-R","Maélyne","03/06/2012",3,"Bournazel",1,null,1,null,null,null,null,null,1,1,null,1,1,null,1,1,null,1,1]
["Dunet","Tom","12/06/2009",6,"Rignac SJO",null,1,1,null,null,null,null,null,1,1]
["Dunet","Enora","03/05/2007",8,"Rignac SJO",null,1,1,null,null,null,null,null,1,1]
["Dupont","Gabin","10/04/2009",6,"Anglars",1,null,1,null,null,null,null,null,1,1,null,1,1,null,1,1,null,1,1]
["Fabre","Maelly","17/05/2011",4,"Mayran",null,null,null,null,null,null,null,null,1,1,null,1,1,null,1,1,null,1,1]
["Farret-M","Jules","13/08/2009",6,"",null,null,null,null,null,null,null,null,null,null,null,1,1]
["Flotte","Emma","20/03/2010",5,"Goutrens",1,null,1,null,null,null,null,null,null,null,null,1,1]
["Fournier","Farell","01/01/2011",5,"Rignac SJO",null,1,1,null,null,null,null,1,1,1,1,1,1,1,1,1,1,1,1]
["Gares","Eloïse","13/01/2006",10,"Mayran",1,null,1,null,null,null,null,null,1,1,null,1,1,null,1,1,null,1,1]
["Herrlé","Yoan","20/03/2006",9,"Rignac SJO",null,null,null,null,null,null,null,1,1]
["Hoyes","Rachelle","28/12/2008",7,"Roussennac",1,null,1,null,null,null,null,null,1,1,null,1,1,null,1,1,null,1,1]
["Issalys","Oscar","19/09/2010",5,"Mayran",1,null,1,null,null,null,null,null,1,1]
["Issalys","Jade","27/06/2007",8,"Mayran",1,null,1,null,null,null,null,null,1,1]
["Mahut","Sarah","11/07/2008",7,"Rignac",null,1,1,null,null,null,null,null,1,1,null,1,1,null,1,1,null,1,1]
["Massip","Lali","14/06/2010",5,"Rignac SJO",null,1,1,null,null,null,null,1,1,1,1,1,1,1,1,1,1,1,1]
["Massip","Lola","18/07/2007",8,"Rignac SJO",null,1,1,null,null,null,null,1,1,1,1,1,1,1,1,1,1,1,1]
["Mirabel","Jules","26/04/2010",5,"Rignac SJO",null,1,1]
["Molinier","Arthur","13/05/2012",3,"Rignac",null,null,null,null,null,null,null,null,1,1,null,1,1,null,1,1,null,1,1]
["Moulis","Nataël","12/08/2009",6,"Auzits",1,null,1,null,null,null,null,null,1,1,null,1,1,null,1,1,null,1,1]
["Nedellec","Lucas","27/08/2010",5,"Anglars St Félix",1,null,1,null,null,null,null,null,1,1,null,1,1,null,1,1,null,1,1]
["Pasquier","Chloé","19/10/2010",5,"Mayran",1,null,1,null,null,null,null,null,1,1,null,1,1,null,1,1,null,1,1]
["Pasquier","Quentin","25/08/2008",7,"Mayran",1,null,1,null,null,null,null,null,1,1,null,1,1,null,1,1,null,1,1]
["Pons","Laura","06/05/2010",5,"Rignac SJO",null,null,null,null,null,null,null,null,null,null,1,1,1]
["Pons","Emma","06/05/2010",5,"Anglars",1,null,1,null,null,null,null,null,1,1,null,1,1,null,1,1,null,1,1]
["Tournier","Laura","13/12/2009",6,"Rignac",null,1,1,null,null,null,null,null,1,1,null,1,1,null,1,1,null,1,1]
["Verfailly","Joy","10/04/2007",8,"Rignac",null,1,1,null,null,null,null,null,0,0,null,0,0,null,0,0,null,0,0]
["Volpelier","Emma","18/02/2010",5,"Rignac SJO",null,1,1,null,null,null,null,1,1,1]
[null,null,null,116]
["( Age sélectionné ) SOUS TOTAL JOURNALIER :",null,null,null,null,{"$f":"SUBTOTAL(109,F11:F49)","v":16},12,27,1,0,0,0,7,28,27,6,25,25,5,20,19,4,18,18]
["TOTAL : ",null,null,null,null,{"$f":"SUM(F11:F49)","v":16},12,27,1,0,0,0,7,28,27,6,25,25,5,20,19,4,18,{"$f":"SUM(AE11:AE49)","v":0}]
["DEMANDE DE RESERVATIONS : ",null,null,null,null,{"$f":"COUNTIF(F11:F49,\"0\")","v":0},0,0,0,0,0,0,0,1,1,0,1,1,0,1,1,0,1,1]

{"sheet":"Mai","index":12,"n_rows":48,"n_cols":31,"rows_kept":48,"cut":false,"hidden":false,"merged":[[6,10,8,10],[6,11,8,11],[6,5,8,5],[6,6,8,6],[6,7,8,7],[6,8,8,8],[2,6,2,8],[2,9,2,11],[0,2,0,6],[0,0,1,0],[0,1,1,1],[2,12,2,14],[2,15,2,16],[3,4,8,4],[3,5,5,6],[3,7,5,8],[3,9,4,10],[3,11,4,11],[3,12,4,13],[3,14,4,14],[3,15,4,16],[6,14,8,14],[6,15,8,15],[6,16,8,16],[6,12,8,12],[2,0,2,4],[3,3,8,3],[3,17,4,17],[3,18,4,19],[3,20,4,20],[3,21,4,22],[3,23,4,23],[45,0,45,4],[46,0,46,4],[47,0,47,4],[6,23,8,23],[6,24,8,24],[6,17,8,17],[6,13,8,13],[6,22,8,22],[6,21,8,21],[6,18,8,18],[6,19,8,19],[6,20,8,20],[3,0,8,0],[3,1,8,1],[3,2,8,2],[6,9,8,9],[6,26,8,26],[3,24,4,26],[3,27,5,29],[3,30,8,30],[6,27,8,27],[6,28,8,28],[6,29,8,29],[6,25,8,25]]}
["Pointage Couleur"]
[]
[null,null,null,null,null,null,"Mois de:",null,null,{"$f":"MID(CELL(\"filename\",J3),FIND(\"]\",CELL(\"filename\",J3))+1,32)","v":"Mai"},null,null,"Année:",null,null,{"$f":"Accueil!C18+1","v":2016}]
["Nom","Prénom","Date de Naissance","Age","Etablissement","CAR",null,"REPAS",null,{"$f":"INDEX({\"dimanche\";\"lundi\";\"mardi\";\"Mercredi\";\"jeudi\";\"vendredi\";\"samedi\"},1+MOD(An!$I$4+3-2,7))","v":"Mercredi"},null,{"$f":"'An1'!K20","v":""},{"$f":"INDEX({\"dimanche\";\"lundi\";\"mardi\";\"Mercredi\";\"jeudi\";\"vendredi\";\"samedi\"},1+MOD(An!$I$4+3-2,7))","v":"Mercredi"},null,{"$f":"'An1'!K21","v":"2016-05-04"},{"$f":"INDEX({\"dimanche\";\"lundi\";\"mardi\";\"Mercredi\";\"jeudi\";\"vendredi\";\"samedi\"},1+MOD(An!$I$4+3-2,7))","v":"Mercredi"},null,{"$f":"'An1'!K22","v":"2016-05-11"},{"$f":"INDEX({\"dimanche\";\"lundi\";\"mardi\";\"Mercredi\";\"jeudi\";\"vendredi\";\"samedi\"},1+MOD(An!$I$4+3-2,7))","v":"Mercredi"},null,{"$f":"'An1'!K23","v":"2016-05-18"},{"$f":"INDEX({\"dimanche\";\"lundi\";\"mardi\";\"Mercredi\";\"jeudi\";\"vendredi\";\"samedi\"},1+MOD(An!$I$4+3-2,7))","v":"Mercredi"},null,{"$f":"'An1'!K24","v":"2016-05-25"},"Total",null,null,"Allergies et Régimes",null,null,"Remarques Importantes"]
[]
[]
[null,null,null,null,null,"Oui","Non","Oui","Non","Matin","Repas","Après - midi","Matin","Repas","Après - midi","Matin","Repas","Après - midi","Matin","Repas","Après - midi","Matin","Repas","Après - midi","1/2 journée","1/2 journée + Repas","Journée entière","Allergies Allimentaires","Autres Allergies","Régimes Alimentaires"]
[]
[]
["21","22","23","24","1","2","3","4","5","6","7","8","9","10","11","12","13","14","15","16","17","18","19","192","Colonne2","Colonne3","Colonne4","Colonne43","Colonne42","Colonne5","Colonne1"]
["Barrau","Marie","11/05/2009",{"$f":"IF(MONTH(TODAY())>MONTH(C11),YEAR(TODAY())-YEAR(C11),IF(MONTH(TODAY())<MONTH(C11),YEAR(TODAY())-YEAR(C11)-1,IF(DAY(TODAY())<DAY(C11),YEAR(TODAY())-YEAR(C11)-1,YEAR(TODAY())-YEAR(C11))))","v":6},"Rignac"]
["Bayol","Maël","12/07/2011",4,"Mayran",1,null,1,null,null,null,null,null,1,1,null,1,1,null,1,1,null,1,1]
["Brun","Raphaël","28/03/2007",8,"Rignac SJO",null,1,1,null,null,null,null,null,null,null,1,1,null,1,1,null,1,1]
["Cher","Zélie","04/05/2010",5,"Rignac SJO",null,1,null,1]
["Cher","Axel","28/12/2004",11,"Rodez",null,1,null,1]
["Conde","India","12/08/2011",4,"Anglars",1,null,1,null,null,null,null,null,1,1,null,1,1,null,1,1,null,1,1]
["Conde","Leny","18/01/2009",7,"Anglars",1,null,1,null,null,null,null,null,1,1,null,1,1,null,1,1,null,1,1]
["Couto-f","Zoé","31/10/2010",5,"Rignac SJO",null,1,null,1,null,null,null,1,null,null,1,null,null,1,null,null,1]
["Cristol","Alexis","24/02/2011",4,"Anglars",1,null,1,null,null,null,null,null,1,1,null,1,1,null,1,1,null,1,1]
["Delabrousse-R","Maélyne","03/06/2012",3,"Bournazel",1,null,1,null,null,null,null,null,1,1,null,1,1,null,1,1,null,1,1]
["Dunet","Tom","12/06/2009",6,"Rignac SJO",null,1,1,null,null,null,null,null,1,1,null,null,null,null,1,1]
["Dunet","Enora","03/05/2007",8,"Rignac SJO",null,1,1,null,null,null,null,null,1,1,null,null,null,null,1,1]
["Dupont","Gabin","10/04/2009",6,"Anglars",1,null,1,null,null,null,null,null,1,1,null,1,1,null,1,1,null,1,1]
["Fabre","Maelly","17/05/2011",4,"Mayran",null,null,null,null,null,null,null,null,1,1,null,1,1,null,1,1,null,1,1]
["Flotte","Emma","20/03/2010",5,"Goutrens",1,null,1,null,null,null,null,null,null,null,null,1,1,null,null,null,null,1,1]
["Fournier","Farell","01/01/2011",5,"Rignac SJO",null,1,1,null,null,null,null,1,1,1,1,1,1,1,1,1,1,1,1]
["Gares","Eloïse","13/01/2006",10,"Mayran",1,null,1,null,null,null,null,null,1,1,null,1,1,null,1,1,null,1,1]
["Hoyes","Rachelle","28/12/2008",7,"Roussennac",1,null,1,null,null,null,null,null,1,1,null,1,1,null,1,1,null,1,1]
["Issalys","Oscar","19/09/2010",5,"Mayran",1,null,1,null,null,null,null,null,1,1,null,null,null,null,1,1]
["Issalys","Jade","27/06/2007",8,"Mayran",1,null,1,null,null,null,null,null,1,1,null,null,null,null,1,1]
["Mahut","Sarah","11/07/2008",7,"Rignac",null,1,1,null,null,null,null,null,1,1,null,1,1,null,1,1,null,1,1]
["Massip","Lali","14/06/2010",5,"Rignac SJO",null,1,1,null,null,null,null,1,1,1,1,1,1,1,1,1,1,1,1]
["Massip","Lola","18/07/2007",8,"Rignac SJO",null,1,1,null,null,null,null,1,1,1,1,1,1,1,1,1,1,1,1]
["Mirabel","Jules","26/04/2010",5,"Rignac SJO",null,1,null,1]
["Molinier","Arthur","13/05/2012",3,"Rignac",null,null,null,null,null,null,null,null,1,1,null,1,1,null,1,1,null,1,1]
["Moulis","Nataël","12/08/2009",6,"Auzits",1,null,1,null,null,null,null,null,1,1,null,1,1,null,1,1,null,1,1]
["Nedellec","Lucas","27/08/2010",5,"Anglars St Félix",1,null,1,null,null,null,null,null,1,1,null,1,1,null,1,1,null,1,1]
["Pasquier","Chloé","19/10/2010",5,"Mayran",1,null,1,null,null,null,null,null,1,1,null,1,1,null,1,1,null,1,1]
["Pasquier","Quentin","25/08/2008",7,"Mayran",1,null,1,null,null,null,null,null,1,1,null,1,1,null,1,1,null,1,1]
["Pons","Laura","06/05/2010",5,"Rignac SJO",null,null,null,null,null,null,null,null,null,null,1,1,1,null,null,null,1,1,1]
["Pons","Emma","06/05/2010",5,"Anglars",1,null,1,null,null,null,null,null,1,1,null,1,1,null,1,1,null,1,1]
["Tournier","Laura","13/12/2009",6,"Rignac",null,1,1,null,null,null,null,null,1,1,null,1,1,null,1,1,null,1,1]
["Verfailly","Joy","10/04/2007",8,"Rignac",null,1,1,null,null,null,null,null,0,0,null,0,0,null,0,0,null,0,0]
["Volpelier","Emma","18/02/2010",5,"Rignac SJO",null,1,1,null,null,null,null,1,1,1,null,null,null,1,1,1]
[]
["( Age sélectionné ) SOUS TOTAL JOURNALIER :",null,null,null,null,{"$f":"SUBTOTAL(109,F11:F45)","v":16},14,26,4,0,0,0,5,25,25,6,23,22,6,26,25,6,23,22]
["TOTAL : ",null,null,null,null,{"$f":"SUM(F11:F45)","v":16},14,26,4,0,0,0,5,25,25,6,23,22,6,26,25,6,23,{"$f":"SUM(AE11:AE45)","v":0}]
["DEMANDE DE RESERVATIONS : ",null,null,null,null,{"$f":"COUNTIF(F11:F45,\"0\")","v":0},0,0,0,0,0,0,0,1,1,0,1,1,0,1,1,0,1,1]

{"sheet":"Juin","index":13,"n_rows":48,"n_cols":31,"rows_kept":48,"cut":false,"hidden":false,"merged":[[6,10,8,10],[6,11,8,11],[6,5,8,5],[6,6,8,6],[6,7,8,7],[6,8,8,8],[2,6,2,8],[2,9,2,11],[0,2,0,6],[0,0,1,0],[0,1,1,1],[2,12,2,14],[2,15,2,16],[3,4,8,4],[3,5,5,6],[3,7,5,8],[3,9,4,10],[3,11,4,11],[3,12,4,13],[3,14,4,14],[3,15,4,16],[6,14,8,14],[6,15,8,15],[6,16,8,16],[6,12,8,12],[2,0,2,4],[3,3,8,3],[3,17,4,17],[3,18,4,19],[3,20,4,20],[3,21,4,22],[3,23,4,23],[45,0,45,4],[46,0,46,4],[47,0,47,4],[6,23,8,23],[6,24,8,24],[6,17,8,17],[6,13,8,13],[6,22,8,22],[6,21,8,21],[6,18,8,18],[6,19,8,19],[6,20,8,20],[3,0,8,0],[3,1,8,1],[3,2,8,2],[6,9,8,9],[6,26,8,26],[3,24,4,26],[3,27,5,29],[3,30,8,30],[6,27,8,27],[6,28,8,28],[6,29,8,29],[6,25,8,25]]}
["Pointage Couleur"]
[]
[null,null,null,null,null,null,"Mois de:",null,null,{"$f":"MID(CELL(\"filename\",J3),FIND(\"]\",CELL(\"filename\",J3))+1,32)","v":"Juin"},null,null,"Année:",null,null,{"$f":"Accueil!C18+1","v":2016}]
["Nom","Prénom","Date de Naissance","Age","Etablissement","CAR",null,"REPAS",null,{"$f":"INDEX({\"dimanche\";\"lundi\";\"mardi\";\"Mercredi\";\"jeudi\";\"vendredi\";\"samedi\"},1+MOD(An!$I$4+3-2,7))","v":"Mercredi"},null,{"$f":"'An1'!S20","v":"2016-06-01"},{"$f":"INDEX({\"dimanche\";\"lundi\";\"mardi\";\"Mercredi\";\"jeudi\";\"vendredi\";\"samedi\"},1+MOD(An!$I$4+3-2,7))","v":"Mercredi"},null,{"$f":"'An1'!S21","v":"2016-06-08"},{"$f":"INDEX({\"dimanche\";\"lundi\";\"mardi\";\"Mercredi\";\"jeudi\";\"vendredi\";\"samedi\"},1+MOD(An!$I$4+3-2,7))","v":"Mercredi"},null,{"$f":"'An1'!S22","v":"2016-06-15"},{"$f":"INDEX({\"dimanche\";\"lundi\";\"mardi\";\"Mercredi\";\"jeudi\";\"vendredi\";\"samedi\"},1+MOD(An!$I$4+3-2,7))","v":"Mercredi"},null,{"$f":"'An1'!S23","v":"2016-06-22"},{"$f":"INDEX({\"dimanche\";\"lundi\";\"mardi\";\"Mercredi\";\"jeudi\";\"vendredi\";\"samedi\"},1+MOD(An!$I$4+3-2,7))","v":"Mercredi"},null,"1900-01-29","Total",null,null,"Allergies et Régimes",null,null,"Remarques Importantes"]
[]
[]
[null,null,null,null,null,"Oui","Non","Oui","Non","Matin","Repas","Après - midi","Matin","Repas","Après - midi","Matin","Repas","Après - midi","Matin","Repas","Après - midi","Matin","Repas","Après - midi","1/2 journée","1/2 journée + Repas","Journée entière","Allergies Allimentaires","Autres Allergies","Régimes Alimentaires"]
[]
[]
["21","22","23","24","1","2","3","4","5","6","7","8","9","10","11","12","13","14","15","16","17","18","19","192","Colonne2","Colonne3","Colonne4","Colonne43","Colonne42","Colonne5","Colonne1"]
["Barrau","Marie","11/05/2009",{"$f":"IF(MONTH(TODAY())>MONTH(C11),YEAR(TODAY())-YEAR(C11),IF(MONTH(TODAY())<MONTH(C11),YEAR(TODAY())-YEAR(C11)-1,IF(DAY(TODAY())<DAY(C11),YEAR(TODAY())-YEAR(C11)-1,YEAR(TODAY())-YEAR(C11))))","v":6},"Rignac",null,1]
["Bayol","Maël","12/07/2011",null,"Mayran",1,null,1,null,null,1,1,null,1,1,null,1,1,null,1,1,null,1,1]
["Brun","Raphaël","28/03/2007",{"$f":"IF(MONTH(TODAY())>MONTH(C13),YEAR(TODAY())-YEAR(C13),IF(MONTH(TODAY())<MONTH(C13),YEAR(TODAY())-YEAR(C13)-1,IF(DAY(TODAY())<DAY(C13),YEAR(TODAY())-YEAR(C13)-1,YEAR(TODAY())-YEAR(C13))))","v":8},"Rignac SJO",null,1,1,null,1,1,null,1,1,null,1,1,null,1,1,null,1,1]
["Cher","Zélie","04/05/2010",null,"Rignac SJO"]
["Cher","Axel","28/12/2004",null,"Rodez"]
["Conde","India","12/08/2011",5,"Anglars",1,null,1,null,null,1,1,null,1,1,null,1,1,null,1,1,null,1,1]
["Conde","Leny","18/01/2009",{"$f":"IF(MONTH(TODAY())>MONTH(C17),YEAR(TODAY())-YEAR(C17),IF(MONTH(TODAY())<MONTH(C17),YEAR(TODAY())-YEAR(C17)-1,IF(DAY(TODAY())<DAY(C17),YEAR(TODAY())-YEAR(C17)-1,YEAR(TODAY())-YEAR(C17))))","v":7},"Anglars",1,null,1,null,null,1,1,null,1,1,null,1,1,null,1,1,null,1,1]
["Couto-f","Zoé","31/10/2010",null,"Rignac SJO",null,1,null,1,1,null,null,1,null,null,1,null,null,1,null,null,1]
["Cristol","Alexis","24/02/2011",null,"Anglars",1,null,1,null,null,1,1,null,1,1,null,1,1,null,1,1,null,1,1]
["Delabrousse-R","Maélyne","03/06/2012",null,"Bournazel",1,null,1,null,null,1,1,null,1,1,null,1,1,null,1,1,null,1,1]
["Dunet","Tom","12/06/2009",null,"Rignac SJO",null,1,1,null,null,1,1,null,null,null,null,1,1,null,null,null,null,1,1]
["Dunet","Enora","03/05/2007",null,"Rignac SJO",null,1,1,null,null,1,1,null,null,null,null,1,1,null,null,null,null,1,1]
["Dupont","Gabin","10/04/2009",{"$f":"IF(MONTH(TODAY())>MONTH(C23),YEAR(TODAY())-YEAR(C23),IF(MONTH(TODAY())<MONTH(C23),YEAR(TODAY())-YEAR(C23)-1,IF(DAY(TODAY())<DAY(C23),YEAR(TODAY())-YEAR(C23)-1,YEAR(TODAY())-YEAR(C23))))","v":6},"Anglars",1,null,1,null,null,1,1,null,1,1,null,1,1,null,1,1,null,1,1]
["Fabre","Maelly","17/05/2011",null,"Mayran",null,null,null,null,null,1,1,null,1,1,null,1,1,null,1,1,null,1,1]
["Flotte","Emma","20/03/2010",5,"Goutrens",1,null,1,null,null,null,null,null,1,1,null,null,null,null,1,1]
["Fournier","Farell","01/01/2011",null,"Rignac SJO",null,1,1,null,1,1,1,1,1,1,1,1,1,1,1,1,1,1,1]
["Gares","Eloïse","13/01/2006",{"$f":"IF(MONTH(TODAY())>MONTH(C27),YEAR(TODAY())-YEAR(C27),IF(MONTH(TODAY())<MONTH(C27),YEAR(TODAY())-YEAR(C27)-1,IF(DAY(TODAY())<DAY(C27),YEAR(TODAY())-YEAR(C27)-1,YEAR(TODAY())-YEAR(C27))))","v":10},"Mayran",1,null,1,null,null,1,1,null,1,1,null,1,1,null,1,1,null,1,1]
["Hoyes","Rachelle","28/12/2008",{"$f":"IF(MONTH(TODAY())>MONTH(C28),YEAR(TODAY())-YEAR(C28),IF(MONTH(TODAY())<MONTH(C28),YEAR(TODAY())-YEAR(C28)-1,IF(DAY(TODAY())<DAY(C28),YEAR(TODAY())-YEAR(C28)-1,YEAR(TODAY())-YEAR(C28))))","v":7},"Roussennac",1,null,1,null,null,1,1,null,1,1,null,1,1,null,1,1,null,1,1]
["Issalys","Oscar","19/09/2010",null,"Mayran",1,null,1,null,null,1,1,null,null,null,null,1,1,null,null,null,null,1,1]
["Issalys","Jade","27/06/2007",null,"Mayran",1,null,1,null,null,1,1,null,null,null,null,1,1,null,null,null,null,1,1]
["Mahut","Sarah","11/07/2008",{"$f":"IF(MONTH(TODAY())>MONTH(C31),YEAR(TODAY())-YEAR(C31),IF(MONTH(TODAY())<MONTH(C31),YEAR(TODAY())-YEAR(C31)-1,IF(DAY(TODAY())<DAY(C31),YEAR(TODAY())-YEAR(C31)-1,YEAR(TODAY())-YEAR(C31))))","v":7},"Rignac",null,1,1,null,null,1,1,null,1,1,null,1,1,null,1,1,null,1,1]
["Massip","Lali","14/06/2010",null,"Rignac SJO",null,1,1,null,1,1,1,1,1,1,1,1,1,1,1,1,1,1,1]
["Massip","Lola","18/07/2007",{"$f":"IF(MONTH(TODAY())>MONTH(C33),YEAR(TODAY())-YEAR(C33),IF(MONTH(TODAY())<MONTH(C33),YEAR(TODAY())-YEAR(C33)-1,IF(DAY(TODAY())<DAY(C33),YEAR(TODAY())-YEAR(C33)-1,YEAR(TODAY())-YEAR(C33))))","v":8},"Rignac SJO",null,1,1,null,1,1,1,1,1,1,1,1,1,1,1,1,1,1,1]
["Mirabel","Jules","26/04/2010",null,"Rignac SJO",null,1,null,1]
["Molinier","Arthur","13/05/2012",null,"Rignac",null,null,null,null,null,1,1,null,1,1,null,1,1,null,1,1,null,1,1]
["Moulis","Nataël","12/08/2009",null,"Auzits",1,null,1,null,null,1,1,null,1,1,null,1,1,null,1,1,null,1,1]
["Nedellec","Lucas","27/08/2010",null,"Anglars St Félix",1,null,1,null,null,1,1,null,1,1,null,1,1,null,1,1,null,1,1]
["Pasquier","Chloé","19/10/2010",null,"Mayran",1,null,1,null,null,1,1,null,1,1,null,1,1,null,1,1,null,1,1]
["Pasquier","Quentin","25/08/2008",{"$f":"IF(MONTH(TODAY())>MONTH(C39),YEAR(TODAY())-YEAR(C39),IF(MONTH(TODAY())<MONTH(C39),YEAR(TODAY())-YEAR(C39)-1,IF(DAY(TODAY())<DAY(C39),YEAR(TODAY())-YEAR(C39)-1,YEAR(TODAY())-YEAR(C39))))","v":7},"Mayran",1,null,1,null,null,1,1,null,1,1,null,1,1,null,1,1,null,1,1]
["Pons","Laura","06/05/2010",null,"Rignac SJO",null,null,null,null,null,null,null,null,null,null,null,null,null,1,1,1]
["Pons","Emma","06/05/2010",{"$f":"IF(MONTH(TODAY())>MONTH(C41),YEAR(TODAY())-YEAR(C41),IF(MONTH(TODAY())<MONTH(C41),YEAR(TODAY())-YEAR(C41)-1,IF(DAY(TODAY())<DAY(C41),YEAR(TODAY())-YEAR(C41)-1,YEAR(TODAY())-YEAR(C41))))","v":5},"Anglars",1,null,1,null,null,1,1,null,1,1,null,1,1,null,1,1,null,1,1]
["Tournier","Laura","13/12/2009",null,"Rignac",null,1,1,null,null,1,1,null,1,1,null,1,1,null,1,1,null,1,1]
["Verfailly","Joy","10/04/2007",{"$f":"IF(MONTH(TODAY())>MONTH(C43),YEAR(TODAY())-YEAR(C43),IF(MONTH(TODAY())<MONTH(C43),YEAR(TODAY())-YEAR(C43)-1,IF(DAY(TODAY())<DAY(C43),YEAR(TODAY())-YEAR(C43)-1,YEAR(TODAY())-YEAR(C43))))","v":8},"Rignac",null,1,1,null,null,0,0,null,0,0,null,0,0,null,0,0,null,0,0]
["Volpelier","Emma","18/02/2010",{"$f":"IF(MONTH(TODAY())>MONTH(C44),YEAR(TODAY())-YEAR(C44),IF(MONTH(TODAY())<MONTH(C44),YEAR(TODAY())-YEAR(C44)-1,IF(DAY(TODAY())<DAY(C44),YEAR(TODAY())-YEAR(C44)-1,YEAR(TODAY())-YEAR(C44))))","v":5},"Rignac SJO",null,1,1,null,1,1,1,null,null,null,1,1,1,null,null,null,1,1,1]
[]
["( Age sélectionné ) SOUS TOTAL JOURNALIER :",null,null,null,null,{"$f":"SUBTOTAL(109,F11:F45)","v":16},13,26,2,6,26,25,5,22,21,6,26,25,6,23,22,6,26,25]
["TOTAL : ",null,null,null,null,{"$f":"SUM(F11:F45)","v":16},13,26,2,6,26,25,5,22,21,6,26,25,6,23,22,6,26,{"$f":"SUM(AE11:AE45)","v":0}]
["DEMANDE DE RESERVATIONS : ",null,null,null,null,{"$f":"COUNTIF(F11:F45,\"0\")","v":0},0,0,0,0,1,1,0,1,1,0,1,1,0,1,1,0,1,1]

{"sheet":"Juillet","index":14,"n_rows":15,"n_cols":31,"rows_kept":15,"cut":false,"hidden":false,"merged":[[2,15,2,16],[3,12,4,13],[3,14,4,14],[3,15,4,16],[3,17,4,17],[0,2,0,6],[2,0,2,4],[0,0,1,0],[0,1,1,1],[2,12,2,14],[2,6,2,8],[2,9,2,11],[3,24,4,26],[3,27,5,29],[3,30,8,30],[3,5,5,6],[3,7,5,8],[3,9,4,10],[3,11,4,11],[6,7,8,7],[6,11,8,11],[6,5,8,5],[6,6,8,6],[6,10,8,10],[6,9,8,9],[6,8,8,8],[3,21,4,22],[3,23,4,23],[6,22,8,22],[6,21,8,21],[6,20,8,20],[14,0,14,4],[6,23,8,23],[3,0,8,0],[3,1,8,1],[3,2,8,2],[3,3,8,3],[3,4,8,4],[3,18,4,19],[3,20,4,20],[6,27,8,27],[6,28,8,28],[6,29,8,29],[12,0,12,4],[13,0,13,4],[6,25,8,25],[6,19,8,19],[6,18,8,18],[6,26,8,26],[6,24,8,24],[6,12,8,12],[6,17,8,17],[6,16,8,16],[6,15,8,15],[6,14,8,14],[6,13,8,13]]}
["Pointage Couleur"]
[]
[null,null,null,null,null,null,"Mois de:",null,null,{"$f":"MID(CELL(\"filename\",J3),FIND(\"]\",CELL(\"filename\",J3))+1,32)","v":"Juillet"},null,null,"Année:",null,null,{"$f":"Accueil!C18+1","v":2016}]
["Nom","Prénom","Date de Naissance","Age","Etablissement","CAR",null,"REPAS",null,{"$f":"INDEX({\"dimanche\";\"lundi\";\"mardi\";\"Mercredi\";\"jeudi\";\"vendredi\";\"samedi\"},1+MOD(An!$I$4+3-2,7))","v":"Mercredi"},null,{"$f":"'An1'!C38","v":""},{"$f":"INDEX({\"dimanche\";\"lundi\";\"mardi\";\"Mercredi\";\"jeudi\";\"vendredi\";\"samedi\"},1+MOD(An!$I$4+3-2,7))","v":"Mercredi"},null,{"$f":"'An1'!C39","v":"2016-10-05"},{"$f":"INDEX({\"dimanche\";\"lundi\";\"mardi\";\"Mercredi\";\"jeudi\";\"vendredi\";\"samedi\"},1+MOD(An!$I$4+3-2,7))","v":"Mercredi"},null,{"$f":"'An1'!C40","v":"2016-10-12"},{"$f":"INDEX({\"dimanche\";\"lundi\";\"mardi\";\"Mercredi\";\"jeudi\";\"vendredi\";\"samedi\"},1+MOD(An!$I$4+3-2,7))","v":"Mercredi"},null,{"$f":"'An1'!C41","v":"2016-10-19"},{"$f":"INDEX({\"dimanche\";\"lundi\";\"mardi\";\"Mercredi\";\"jeudi\";\"vendredi\";\"samedi\"},1+MOD(An!$I$4+3-2,7))","v":"Mercredi"},null,{"$f":"'An1'!C42","v":"2016-10-26"},"Total",null,null,"Allergies et Régimes",null,null,"Remarques Importantes"]
[]
[]
[null,null,null,null,null,"Oui","Non","Oui","Non","Matin","Repas","Après - midi","Matin","Repas","Après - midi","Matin","Repas","Après - midi","Matin","Repas","Après - midi","Matin","Repas","Après - midi","1/2 journée","1/2 journée + Repas","Journée entière","Allergies Allimentaires","Autres Allergies","Régimes Alimentaires"]
[]
[]
["21","22","23","24","1","2","3","4","5","6","7","8","9","10","11","12","13","14","15","16","17","18","19","192","Colonne2","Colonne3","Colonne4","Colonne43","Colonne42","Colonne5","Colonne1"]
["Mirabel","Jules","26/04/2010",{"$f":"IF(MONTH(TODAY())>MONTH(C11),YEAR(TODAY())-YEAR(C11),IF(MONTH(TODAY())<MONTH(C11),YEAR(TODAY())-YEAR(C11)-1,IF(DAY(TODAY())<DAY(C11),YEAR(TODAY())-YEAR(C11)-1,YEAR(TODAY())-YEAR(C11))))","v":5},"Rignac SJO"]
[]
["( Age sélectionné ) SOUS TOTAL JOURNALIER :",null,null,null,null,{"$f":"SUBTOTAL(109,F11:F12)","v":0},0,0,0,0,0,0,0,0,0,0,0,0,0,0,0,0,0,0]
["TOTAL : ",null,null,null,null,{"$f":"SUM(F11:F12)","v":0},0,0,0,0,0,0,0,0,0,0,0,0,0,0,0,0,0,{"$f":"SUM(AE11:AE12)","v":0}]
["DEMANDE DE RESERVATIONS : ",null,null,null,null,{"$f":"COUNTIF(F11:F12,\"0\")","v":0},0,0,0,0,0,0,0,0,0,0,0,0,0,0,0,0,0,0]

{"sheet":"Août","index":15,"n_rows":15,"n_cols":31,"rows_kept":15,"cut":false,"hidden":false,"merged":[[3,0,8,0],[3,1,8,1],[3,2,8,2],[6,5,8,5],[6,6,8,6],[3,3,8,3],[3,4,8,4],[3,5,5,6],[3,21,4,22],[6,13,8,13],[6,8,8,8],[6,9,8,9],[6,10,8,10],[3,7,5,8],[3,11,4,11],[6,11,8,11],[14,0,14,4],[3,23,4,23],[6,20,8,20],[6,21,8,21],[6,17,8,17],[6,18,8,18],[6,19,8,19],[3,17,4,17],[3,18,4,19],[6,14,8,14],[6,15,8,15],[6,16,8,16],[3,12,4,13],[3,14,4,14],[12,0,12,4],[13,0,13,4],[0,0,1,0],[0,1,1,1],[6,25,8,25],[0,2,0,6],[2,6,2,8],[2,9,2,11],[2,12,2,14],[2,15,2,16],[3,15,4,16],[6,12,8,12],[3,9,4,10],[6,22,8,22],[6,23,8,23],[6,24,8,24],[6,7,8,7],[3,20,4,20],[6,26,8,26],[3,24,4,26],[3,27,5,29],[3,30,8,30],[6,27,8,27],[6,28,8,28],[6,29,8,29]]}
["Pointage Couleur"]
[]
[null,null,null,null,null,null,"Mois de:",null,null,{"$f":"MID(CELL(\"filename\",J3),FIND(\"]\",CELL(\"filename\",J3))+1,32)","v":"Août"},null,null,"Année:",null,null,{"$f":"Accueil!C18+1","v":2016}]
["Nom","Prénom","Date de Naissance","Age","Etablissement","CAR",null,"REPAS",null,{"$f":"INDEX({\"dimanche\";\"lundi\";\"mardi\";\"Mercredi\";\"jeudi\";\"vendredi\";\"samedi\"},1+MOD(An!$I$4+3-2,7))","v":"Mercredi"},null,{"$f":"An!K29","v":""},{"$f":"INDEX({\"dimanche\";\"lundi\";\"mardi\";\"Mercredi\";\"jeudi\";\"vendredi\";\"samedi\"},1+MOD(An!$I$4+3-2,7))","v":"Mercredi"},null,{"$f":"An!K30","v":"2015-08-05"},{"$f":"INDEX({\"dimanche\";\"lundi\";\"mardi\";\"Mercredi\";\"jeudi\";\"vendredi\";\"samedi\"},1+MOD(An!$I$4+3-2,7))","v":"Mercredi"},null,{"$f":"An!K31","v":"2015-08-12"},{"$f":"INDEX({\"dimanche\";\"lundi\";\"mardi\";\"Mercredi\";\"jeudi\";\"vendredi\";\"samedi\"},1+MOD(An!$I$4+3-2,7))","v":"Mercredi"},null,{"$f":"An!K32","v":"2015-08-19"},{"$f":"INDEX({\"dimanche\";\"lundi\";\"mardi\";\"Mercredi\";\"jeudi\";\"vendredi\";\"samedi\"},1+MOD(An!$I$4+3-2,7))","v":"Mercredi"},null,{"$f":"An!K33","v":"2015-08-26"},"Total",null,null,"Allergies et Régimes",null,null,"Remarques Importantes"]
[]
[]
[null,null,null,null,null,"Oui","Non","Oui","Non","Matin","Repas","Après - midi","Matin","Repas","Après - midi","Matin","Repas","Après - midi","Matin","Repas","Après - midi","Matin","Repas","Après - midi","1/2 journée","1/2 journée + Repas","Journée entière","Allergies Allimentaires","Autres Allergies","Régimes Alimentaires"]
[]
[]
["21","22","23","24","1","2","3","4","5","6","7","8","9","10","11","12","13","14","15","16","17","18","19","192","Colonne2","Colonne3","Colonne4","Colonne43","Colonne42","Colonne5","Colonne1"]
[]
[]
["( Age sélectionné ) SOUS TOTAL JOURNALIER :",null,null,null,null,{"$f":"SUBTOTAL(109,F11:F12)","v":0},0,0,0,0,0,0,0,0,0,0,0,0,0,0,0,0,0,0]
["TOTAL : ",null,null,null,null,{"$f":"SUM(F11:F12)","v":0},0,0,0,0,0,0,0,0,0,0,0,0,0,0,0,0,0,{"$f":"SUM(AE11:AE12)","v":0}]
["DEMANDE DE RESERVATIONS : ",null,null,null,null,{"$f":"COUNTIF(F11:F12,\"0\")","v":0},0,0,0,0,0,0,0,0,0,0,0,0,0,0,0,0,0,0]

{"sheet":"Vacances de la Toussaint","index":16,"n_rows":105,"n_cols":20,"rows_kept":105,"cut":false,"hidden":false,"merged":[[111,0,111,2],[111,3,111,5],[111,6,111,8],[101,0,101,6],[104,0,104,6],[110,0,110,2],[110,3,110,4],[102,0,102,6],[103,0,103,6],[0,0,1,0],[0,3,0,9],[0,10,0,13],[0,15,0,18],[1,7,1,9],[1,12,1,14],[1,10,1,11],[1,15,1,16]]}
["Pointage Couleur",null,null,{"$f":"MID(CELL(\"filename\",J2),FIND(\"]\",CELL(\"filename\",J2))+1,32)& \" du :\"","v":"Vacances de la Toussaint du :"},null,null,null,null,null,null,{"$f":"données!B2","v":"2015-10-19"},null,null,null,"AU",{"$f":"données!C2","v":"2015-10-30"}]
[null,null,null,null,null,null,null,"Semaine :",null,null,{"$f":"WEEKNUM(K1)","v":43},null,"Semaine :",null,null,{"$f":"WEEKNUM(P1)","v":44}]
[null,null,null,null,null,null,null,"Lundi","Mardi","Mercredi","Jeudi","Vendredi","Lundi","Mardi","Mercredi","Jeudi","Vendredi"]
["Nom","Prénom","Date de Naissance","Age","Allergie Alimentaire","Autre Allergie","Régime Alimentaire","19-oct-15","20-oct-15","21-oct-15","22-oct-15","23-oct-15","26-oct-15","27-oct-15","28-oct-15","29-oct-15","30-oct-15","Absences","Absences Facturées","Total Global"]
["Andrieu","Célya","2007-02-07",{"$f":"IF(MONTH(TODAY())>MONTH(C5),YEAR(TODAY())-YEAR(C5),IF(MONTH(TODAY())<MONTH(C5),YEAR(TODAY())-YEAR(C5)-1,IF(DAY(TODAY())<DAY(C5),YEAR(TODAY())-YEAR(C5)-1,YEAR(TODAY())-YEAR(C5))))","v":8},null,null,null,null,null,null,null,null,null,1,null,1,null,{"$f":"(COUNTIF(Tableautoussaint[[#This Row],[19-oct-15]:[30-oct-15]],\"A\"))","v":0},{"$f":"(COUNTIF(Tableautoussaint[[#This Row],[19-oct-15]:[30-oct-15]],\"F\"))","v":0},{"$f":"SUM(Tableautoussaint[[#This Row],[19-oct-15]:[30-oct-15]])+(COUNTIF(Tableautoussaint[[#This Row],[19-oct-15]:[30-oct-15]],\"F\"))","v":2}]
["Antona","Alexane","2007-03-07",8,null,null,null,null,null,1,1,null,null,null,null,null,0,{"$f":"(COUNTIF(Tableautoussaint[[#This Row],[19-oct-15]:[30-oct-15]],\"A\"))","v":0},{"$f":"(COUNTIF(Tableautoussaint[[#This Row],[19-oct-15]:[30-oct-15]],\"F\"))","v":0},{"$f":"SUM(Tableautoussaint[[#This Row],[19-oct-15]:[30-oct-15]])+(COUNTIF(Tableautoussaint[[#This Row],[19-oct-15]:[30-oct-15]],\"F\"))","v":2}]
["Bayol","Maël","2011-07-12",4,null,null,null,null,null,null,null,null,null,1,1,1,0,{"$f":"(COUNTIF(Tableautoussaint[[#This Row],[19-oct-15]:[30-oct-15]],\"A\"))","v":0},{"$f":"(COUNTIF(Tableautoussaint[[#This Row],[19-oct-15]:[30-oct-15]],\"F\"))","v":0},{"$f":"SUM(Tableautoussaint[[#This Row],[19-oct-15]:[30-oct-15]])+(COUNTIF(Tableautoussaint[[#This Row],[19-oct-15]:[30-oct-15]],\"F\"))","v":3}]
["Belredon","Louna","2008-03-28",7,null,null,null,null,null,1,null,1,null,1,null,null,1,{"$f":"(COUNTIF(Tableautoussaint[[#This Row],[19-oct-15]:[30-oct-15]],\"A\"))","v":0},{"$f":"(COUNTIF(Tableautoussaint[[#This Row],[19-oct-15]:[30-oct-15]],\"F\"))","v":0},{"$f":"SUM(Tableautoussaint[[#This Row],[19-oct-15]:[30-oct-15]])+(COUNTIF(Tableautoussaint[[#This Row],[19-oct-15]:[30-oct-15]],\"F\"))","v":4}]
["Bessière","Flavie","2008-06-27",7,null,null,null,null,null,null,null,null,null,null,null,1,1,{"$f":"(COUNTIF(Tableautoussaint[[#This Row],[19-oct-15]:[30-oct-15]],\"A\"))","v":0},{"$f":"(COUNTIF(Tableautoussaint[[#This Row],[19-oct-15]:[30-oct-15]],\"F\"))","v":0},{"$f":"SUM(Tableautoussaint[[#This Row],[19-oct-15]:[30-oct-15]])+(COUNTIF(Tableautoussaint[[#This Row],[19-oct-15]:[30-oct-15]],\"F\"))","v":2}]
["Bousquet","Armand","2012-03-28",3,null,null,null,null,1,null,null,null,null,null,null,null,null,{"$f":"(COUNTIF(Tableautoussaint[[#This Row],[19-oct-15]:[30-oct-15]],\"A\"))","v":0},{"$f":"(COUNTIF(Tableautoussaint[[#This Row],[19-oct-15]:[30-oct-15]],\"F\"))","v":0},{"$f":"SUM(Tableautoussaint[[#This Row],[19-oct-15]:[30-oct-15]])+(COUNTIF(Tableautoussaint[[#This Row],[19-oct-15]:[30-oct-15]],\"F\"))","v":1}]
["Bousquet","Eliane","2010-12-12",5,null,null,null,null,null,1,null,null,null,null,null,null,1,{"$f":"(COUNTIF(Tableautoussaint[[#This Row],[19-oct-15]:[30-oct-15]],\"A\"))","v":0},{"$f":"(COUNTIF(Tableautoussaint[[#This Row],[19-oct-15]:[30-oct-15]],\"F\"))","v":0},{"$f":"SUM(Tableautoussaint[[#This Row],[19-oct-15]:[30-oct-15]])+(COUNTIF(Tableautoussaint[[#This Row],[19-oct-15]:[30-oct-15]],\"F\"))","v":2}]
["Bousquet","Paul","2009-07-07",6,null,null,1,null,1,null,null,null,null,null,null,null,null,{"$f":"(COUNTIF(Tableautoussaint[[#This Row],[19-oct-15]:[30-oct-15]],\"A\"))","v":0},{"$f":"(COUNTIF(Tableautoussaint[[#This Row],[19-oct-15]:[30-oct-15]],\"F\"))","v":0},{"$f":"SUM(Tableautoussaint[[#This Row],[19-oct-15]:[30-oct-15]])+(COUNTIF(Tableautoussaint[[#This Row],[19-oct-15]:[30-oct-15]],\"F\"))","v":1}]
["Boutary","Camille","2008-06-01",7,null,null,null,null,null,1,null,null,null,null,null,1,1,{"$f":"(COUNTIF(Tableautoussaint[[#This Row],[19-oct-15]:[30-oct-15]],\"A\"))","v":0},{"$f":"(COUNTIF(Tableautoussaint[[#This Row],[19-oct-15]:[30-oct-15]],\"F\"))","v":0},{"$f":"SUM(Tableautoussaint[[#This Row],[19-oct-15]:[30-oct-15]])+(COUNTIF(Tableautoussaint[[#This Row],[19-oct-15]:[30-oct-15]],\"F\"))","v":3}]
["Caprasse","Gabriel","2010-03-21",5,null,null,null,null,1,null,null,null,null,null,null,null,null,{"$f":"(COUNTIF(Tableautoussaint[[#This Row],[19-oct-15]:[30-oct-15]],\"A\"))","v":0},{"$f":"(COUNTIF(Tableautoussaint[[#This Row],[19-oct-15]:[30-oct-15]],\"F\"))","v":0},{"$f":"SUM(Tableautoussaint[[#This Row],[19-oct-15]:[30-oct-15]])+(COUNTIF(Tableautoussaint[[#This Row],[19-oct-15]:[30-oct-15]],\"F\"))","v":1}]
["Chamontin","Emile","2006-11-06",9,null,null,null,null,null,null,null,null,1,null,null,null,null,{"$f":"(COUNTIF(Tableautoussaint[[#This Row],[19-oct-15]:[30-oct-15]],\"A\"))","v":0},{"$f":"(COUNTIF(Tableautoussaint[[#This Row],[19-oct-15]:[30-oct-15]],\"F\"))","v":0},{"$f":"SUM(Tableautoussaint[[#This Row],[19-oct-15]:[30-oct-15]])+(COUNTIF(Tableautoussaint[[#This Row],[19-oct-15]:[30-oct-15]],\"F\"))","v":1}]
["Chamontin","Jeanne","2004-11-15",11,null,null,null,null,null,null,null,null,1,null,null,null,null,{"$f":"(COUNTIF(Tableautoussaint[[#This Row],[19-oct-15]:[30-oct-15]],\"A\"))","v":0},{"$f":"(COUNTIF(Tableautoussaint[[#This Row],[19-oct-15]:[30-oct-15]],\"F\"))","v":0},{"$f":"SUM(Tableautoussaint[[#This Row],[19-oct-15]:[30-oct-15]])+(COUNTIF(Tableautoussaint[[#This Row],[19-oct-15]:[30-oct-15]],\"F\"))","v":1}]
["Chantereau","Axelle","2008-04-03",7,null,null,null,null,null,null,1,null,1,null,null,null,null,{"$f":"(COUNTIF(Tableautoussaint[[#This Row],[19-oct-15]:[30-oct-15]],\"A\"))","v":0},{"$f":"(COUNTIF(Tableautoussaint[[#This Row],[19-oct-15]:[30-oct-15]],\"F\"))","v":0},{"$f":"SUM(Tableautoussaint[[#This Row],[19-oct-15]:[30-oct-15]])+(COUNTIF(Tableautoussaint[[#This Row],[19-oct-15]:[30-oct-15]],\"F\"))","v":2}]
["Cher","Axel","2004-12-26",11,null,null,1,1,null,1,1,null,1,1,1,1,1,{"$f":"(COUNTIF(Tableautoussaint[[#This Row],[19-oct-15]:[30-oct-15]],\"A\"))","v":0},{"$f":"(COUNTIF(Tableautoussaint[[#This Row],[19-oct-15]:[30-oct-15]],\"F\"))","v":0},{"$f":"SUM(Tableautoussaint[[#This Row],[19-oct-15]:[30-oct-15]])+(COUNTIF(Tableautoussaint[[#This Row],[19-oct-15]:[30-oct-15]],\"F\"))","v":8}]
["Cher","Zélie","2010-05-04",5,null,null,null,1,1,null,1,null,1,1,1,1,1,{"$f":"(COUNTIF(Tableautoussaint[[#This Row],[19-oct-15]:[30-oct-15]],\"A\"))","v":0},{"$f":"(COUNTIF(Tableautoussaint[[#This Row],[19-oct-15]:[30-oct-15]],\"F\"))","v":0},{"$f":"SUM(Tableautoussaint[[#This Row],[19-oct-15]:[30-oct-15]])+(COUNTIF(Tableautoussaint[[#This Row],[19-oct-15]:[30-oct-15]],\"F\"))","v":8}]
["Cledes","Tom","2005-03-13",10,null,null,null,null,null,1,null,null,null,1,1,1,1,{"$f":"(COUNTIF(Tableautoussaint[[#This Row],[19-oct-15]:[30-oct-15]],\"A\"))","v":0},{"$f":"(COUNTIF(Tableautoussaint[[#This Row],[19-oct-15]:[30-oct-15]],\"F\"))","v":0},{"$f":"SUM(Tableautoussaint[[#This Row],[19-oct-15]:[30-oct-15]])+(COUNTIF(Tableautoussaint[[#This Row],[19-oct-15]:[30-oct-15]],\"F\"))","v":5}]
["Conde","India","2011-08-12",4,null,null,null,null,1,null,1,1,null,null,null,null,null,{"$f":"(COUNTIF(Tableautoussaint[[#This Row],[19-oct-15]:[30-oct-15]],\"A\"))","v":0},{"$f":"(COUNTIF(Tableautoussaint[[#This Row],[19-oct-15]:[30-oct-15]],\"F\"))","v":0},{"$f":"SUM(Tableautoussaint[[#This Row],[19-oct-15]:[30-oct-15]])+(COUNTIF(Tableautoussaint[[#This Row],[19-oct-15]:[30-oct-15]],\"F\"))","v":3}]
["Conde","Lenny","2009-01-18",7,null,null,null,null,1,null,1,1,null,null,null,null,null,{"$f":"(COUNTIF(Tableautoussaint[[#This Row],[19-oct-15]:[30-oct-15]],\"A\"))","v":0},{"$f":"(COUNTIF(Tableautoussaint[[#This Row],[19-oct-15]:[30-oct-15]],\"F\"))","v":0},{"$f":"SUM(Tableautoussaint[[#This Row],[19-oct-15]:[30-oct-15]])+(COUNTIF(Tableautoussaint[[#This Row],[19-oct-15]:[30-oct-15]],\"F\"))","v":3}]
["Cortes","Lizéa","2012-01-10",4,null,null,null,1,1,1,null,null,null,null,null,1,1,{"$f":"(COUNTIF(Tableautoussaint[[#This Row],[19-oct-15]:[30-oct-15]],\"A\"))","v":0},{"$f":"(COUNTIF(Tableautoussaint[[#This Row],[19-oct-15]:[30-oct-15]],\"F\"))","v":0},{"$f":"SUM(Tableautoussaint[[#This Row],[19-oct-15]:[30-oct-15]])+(COUNTIF(Tableautoussaint[[#This Row],[19-oct-15]:[30-oct-15]],\"F\"))","v":5}]
["Couderc","Adrien","2006-02-28",9,null,null,null,null,1,null,null,null,null,1,null,null,null,{"$f":"(COUNTIF(Tableautoussaint[[#This Row],[19-oct-15]:[30-oct-15]],\"A\"))","v":0},{"$f":"(COUNTIF(Tableautoussaint[[#This Row],[19-oct-15]:[30-oct-15]],\"F\"))","v":0},{"$f":"SUM(Tableautoussaint[[#This Row],[19-oct-15]:[30-oct-15]])+(COUNTIF(Tableautoussaint[[#This Row],[19-oct-15]:[30-oct-15]],\"F\"))","v":2}]
["Couderc","Léo","2010-12-02",5,null,null,null,null,null,null,1,null,null,null,null,null,null,{"$f":"(COUNTIF(Tableautoussaint[[#This Row],[19-oct-15]:[30-oct-15]],\"A\"))","v":0},{"$f":"(COUNTIF(Tableautoussaint[[#This Row],[19-oct-15]:[30-oct-15]],\"F\"))","v":0},{"$f":"SUM(Tableautoussaint[[#This Row],[19-oct-15]:[30-oct-15]])+(COUNTIF(Tableautoussaint[[#This Row],[19-oct-15]:[30-oct-15]],\"F\"))","v":1}]
["Couderc","Lucie","2008-02-13",7,null,null,null,null,1,null,null,null,null,1,null,null,null,{"$f":"(COUNTIF(Tableautoussaint[[#This Row],[19-oct-15]:[30-oct-15]],\"A\"))","v":0},{"$f":"(COUNTIF(Tableautoussaint[[#This Row],[19-oct-15]:[30-oct-15]],\"F\"))","v":0},{"$f":"SUM(Tableautoussaint[[#This Row],[19-oct-15]:[30-oct-15]])+(COUNTIF(Tableautoussaint[[#This Row],[19-oct-15]:[30-oct-15]],\"F\"))","v":2}]
["Couderc","Margaux","2010-12-02",5,null,null,null,null,null,null,1,null,null,null,null,null,null,{"$f":"(COUNTIF(Tableautoussaint[[#This Row],[19-oct-15]:[30-oct-15]],\"A\"))","v":0},{"$f":"(COUNTIF(Tableautoussaint[[#This Row],[19-oct-15]:[30-oct-15]],\"F\"))","v":0},{"$f":"SUM(Tableautoussaint[[#This Row],[19-oct-15]:[30-oct-15]])+(COUNTIF(Tableautoussaint[[#This Row],[19-oct-15]:[30-oct-15]],\"F\"))","v":1}]
["Couffignal","Eddy","2007-08-07",8,null,null,null,1,null,1,1,1,1,null,1,1,1,{"$f":"(COUNTIF(Tableautoussaint[[#This Row],[19-oct-15]:[30-oct-15]],\"A\"))","v":0},{"$f":"(COUNTIF(Tableautoussaint[[#This Row],[19-oct-15]:[30-oct-15]],\"F\"))","v":0},{"$f":"SUM(Tableautoussaint[[#This Row],[19-oct-15]:[30-oct-15]])+(COUNTIF(Tableautoussaint[[#This Row],[19-oct-15]:[30-oct-15]],\"F\"))","v":8}]
["Couffignal","Sacha","2010-04-10",5,null,null,null,1,null,1,1,1,1,null,1,1,1,{"$f":"(COUNTIF(Tableautoussaint[[#This Row],[19-oct-15]:[30-oct-15]],\"A\"))","v":0},{"$f":"(COUNTIF(Tableautoussaint[[#This Row],[19-oct-15]:[30-oct-15]],\"F\"))","v":0},{"$f":"SUM(Tableautoussaint[[#This Row],[19-oct-15]:[30-oct-15]])+(COUNTIF(Tableautoussaint[[#This Row],[19-oct-15]:[30-oct-15]],\"F\"))","v":8}]
["Couto-F","Zoé","2010-10-31",5,null,null,null,1,1,1,1,1,1,1,1,1,1,{"$f":"(COUNTIF(Tableautoussaint[[#This Row],[19-oct-15]:[30-oct-15]],\"A\"))","v":0},{"$f":"(COUNTIF(Tableautoussaint[[#This Row],[19-oct-15]:[30-oct-15]],\"F\"))","v":0},{"$f":"SUM(Tableautoussaint[[#This Row],[19-oct-15]:[30-oct-15]])+(COUNTIF(Tableautoussaint[[#This Row],[19-oct-15]:[30-oct-15]],\"F\"))","v":10}]
["Dalpeyra","Zoé","2009-04-18",6,null,null,null,null,null,null,null,1,null,null,null,null,null,{"$f":"(COUNTIF(Tableautoussaint[[#This Row],[19-oct-15]:[30-oct-15]],\"A\"))","v":0},{"$f":"(COUNTIF(Tableautoussaint[[#This Row],[19-oct-15]:[30-oct-15]],\"F\"))","v":0},{"$f":"SUM(Tableautoussaint[[#This Row],[19-oct-15]:[30-oct-15]])+(COUNTIF(Tableautoussaint[[#This Row],[19-oct-15]:[30-oct-15]],\"F\"))","v":1}]
["Dardun.M","Léo","2007-06-04",8,null,null,null,null,null,1,null,null,null,null,null,null,null,{"$f":"(COUNTIF(Tableautoussaint[[#This Row],[19-oct-15]:[30-oct-15]],\"A\"))","v":0},{"$f":"(COUNTIF(Tableautoussaint[[#This Row],[19-oct-15]:[30-oct-15]],\"F\"))","v":0},{"$f":"SUM(Tableautoussaint[[#This Row],[19-oct-15]:[30-oct-15]])+(COUNTIF(Tableautoussaint[[#This Row],[19-oct-15]:[30-oct-15]],\"F\"))","v":1}]
["Dardun.M","Robin","2009-01-29",6,null,null,null,null,null,1,null,null,null,null,null,null,null,{"$f":"(COUNTIF(Tableautoussaint[[#This Row],[19-oct-15]:[30-oct-15]],\"A\"))","v":0},{"$f":"(COUNTIF(Tableautoussaint[[#This Row],[19-oct-15]:[30-oct-15]],\"F\"))","v":0},{"$f":"SUM(Tableautoussaint[[#This Row],[19-oct-15]:[30-oct-15]])+(COUNTIF(Tableautoussaint[[#This Row],[19-oct-15]:[30-oct-15]],\"F\"))","v":1}]
["Delabrousse-R","Maélyne","2012-06-03",3,null,null,null,1,1,null,1,1,null,null,null,null,null,{"$f":"(COUNTIF(Tableautoussaint[[#This Row],[19-oct-15]:[30-oct-15]],\"A\"))","v":0},{"$f":"(COUNTIF(Tableautoussaint[[#This Row],[19-oct-15]:[30-oct-15]],\"F\"))","v":0},{"$f":"SUM(Tableautoussaint[[#This Row],[19-oct-15]:[30-oct-15]])+(COUNTIF(Tableautoussaint[[#This Row],[19-oct-15]:[30-oct-15]],\"F\"))","v":4}]
["Didyne","Lisa","2010-08-19",5,null,null,null,null,null,null,null,1,null,null,null,null,1,{"$f":"(COUNTIF(Tableautoussaint[[#This Row],[19-oct-15]:[30-oct-15]],\"A\"))","v":0},{"$f":"(COUNTIF(Tableautoussaint[[#This Row],[19-oct-15]:[30-oct-15]],\"F\"))","v":0},{"$f":"SUM(Tableautoussaint[[#This Row],[19-oct-15]:[30-oct-15]])+(COUNTIF(Tableautoussaint[[#This Row],[19-oct-15]:[30-oct-15]],\"F\"))","v":2}]
["Didyne","Lucas","2007-01-08",9,null,null,null,null,null,null,null,1,null,null,null,null,1,{"$f":"(COUNTIF(Tableautoussaint[[#This Row],[19-oct-15]:[30-oct-15]],\"A\"))","v":0},{"$f":"(COUNTIF(Tableautoussaint[[#This Row],[19-oct-15]:[30-oct-15]],\"F\"))","v":0},{"$f":"SUM(Tableautoussaint[[#This Row],[19-oct-15]:[30-oct-15]])+(COUNTIF(Tableautoussaint[[#This Row],[19-oct-15]:[30-oct-15]],\"F\"))","v":2}]
["Dunet","Enora","2007-05-03",{"$f":"IF(MONTH(TODAY())>MONTH(C37),YEAR(TODAY())-YEAR(C37),IF(MONTH(TODAY())<MONTH(C37),YEAR(TODAY())-YEAR(C37)-1,IF(DAY(TODAY())<DAY(C37),YEAR(TODAY())-YEAR(C37)-1,YEAR(TODAY())-YEAR(C37))))","v":8},null,null,null,null,1,null,1,null,null,null,null,null,null,{"$f":"(COUNTIF(Tableautoussaint[[#This Row],[19-oct-15]:[30-oct-15]],\"A\"))","v":0},{"$f":"(COUNTIF(Tableautoussaint[[#This Row],[19-oct-15]:[30-oct-15]],\"F\"))","v":0},{"$f":"SUM(Tableautoussaint[[#This Row],[19-oct-15]:[30-oct-15]])+(COUNTIF(Tableautoussaint[[#This Row],[19-oct-15]:[30-oct-15]],\"F\"))","v":2}]
["Dunet","Tom","2009-06-12",6,null,null,null,null,1,null,1,null,null,null,null,null,null,{"$f":"(COUNTIF(Tableautoussaint[[#This Row],[19-oct-15]:[30-oct-15]],\"A\"))","v":0},{"$f":"(COUNTIF(Tableautoussaint[[#This Row],[19-oct-15]:[30-oct-15]],\"F\"))","v":0},{"$f":"SUM(Tableautoussaint[[#This Row],[19-oct-15]:[30-oct-15]])+(COUNTIF(Tableautoussaint[[#This Row],[19-oct-15]:[30-oct-15]],\"F\"))","v":2}]
["Dupre-C","Louis","2008-11-15",7,null,null,null,null,null,null,null,null,1,1,null,1,null,{"$f":"(COUNTIF(Tableautoussaint[[#This Row],[19-oct-15]:[30-oct-15]],\"A\"))","v":0},{"$f":"(COUNTIF(Tableautoussaint[[#This Row],[19-oct-15]:[30-oct-15]],\"F\"))","v":0},{"$f":"SUM(Tableautoussaint[[#This Row],[19-oct-15]:[30-oct-15]])+(COUNTIF(Tableautoussaint[[#This Row],[19-oct-15]:[30-oct-15]],\"F\"))","v":3}]
["Dupré-C","Margot","2010-09-11",5,null,null,null,null,null,null,null,null,1,1,null,1,null,{"$f":"(COUNTIF(Tableautoussaint[[#This Row],[19-oct-15]:[30-oct-15]],\"A\"))","v":0},{"$f":"(COUNTIF(Tableautoussaint[[#This Row],[19-oct-15]:[30-oct-15]],\"F\"))","v":0},{"$f":"SUM(Tableautoussaint[[#This Row],[19-oct-15]:[30-oct-15]])+(COUNTIF(Tableautoussaint[[#This Row],[19-oct-15]:[30-oct-15]],\"F\"))","v":3}]
["Elhadrati","Ilyes","2011-12-31",4,null,null,null,null,1,null,1,null,1,null,1,1,null,{"$f":"(COUNTIF(Tableautoussaint[[#This Row],[19-oct-15]:[30-oct-15]],\"A\"))","v":0},{"$f":"(COUNTIF(Tableautoussaint[[#This Row],[19-oct-15]:[30-oct-15]],\"F\"))","v":0},{"$f":"SUM(Tableautoussaint[[#This Row],[19-oct-15]:[30-oct-15]])+(COUNTIF(Tableautoussaint[[#This Row],[19-oct-15]:[30-oct-15]],\"F\"))","v":5}]
["Elhadrati","Nora","2006-09-16",9,null,null,null,null,1,null,null,null,null,null,null,null,null,{"$f":"(COUNTIF(Tableautoussaint[[#This Row],[19-oct-15]:[30-oct-15]],\"A\"))","v":0},{"$f":"(COUNTIF(Tableautoussaint[[#This Row],[19-oct-15]:[30-oct-15]],\"F\"))","v":0},{"$f":"SUM(Tableautoussaint[[#This Row],[19-oct-15]:[30-oct-15]])+(COUNTIF(Tableautoussaint[[#This Row],[19-oct-15]:[30-oct-15]],\"F\"))","v":1}]
["Elhadrati","Wacil","2009-10-29",6,null,null,null,null,1,null,1,null,1,null,1,1,null,{"$f":"(COUNTIF(Tableautoussaint[[#This Row],[19-oct-15]:[30-oct-15]],\"A\"))","v":0},{"$f":"(COUNTIF(Tableautoussaint[[#This Row],[19-oct-15]:[30-oct-15]],\"F\"))","v":0},{"$f":"SUM(Tableautoussaint[[#This Row],[19-oct-15]:[30-oct-15]])+(COUNTIF(Tableautoussaint[[#This Row],[19-oct-15]:[30-oct-15]],\"F\"))","v":5}]
["Fabre","Maelly","2011-05-17",4,null,null,null,1,1,1,null,1,1,null,null,null,null,{"$f":"(COUNTIF(Tableautoussaint[[#This Row],[19-oct-15]:[30-oct-15]],\"A\"))","v":0},{"$f":"(COUNTIF(Tableautoussaint[[#This Row],[19-oct-15]:[30-oct-15]],\"F\"))","v":0},{"$f":"SUM(Tableautoussaint[[#This Row],[19-oct-15]:[30-oct-15]])+(COUNTIF(Tableautoussaint[[#This Row],[19-oct-15]:[30-oct-15]],\"F\"))","v":5}]
["Farret-M","Jules","2009-08-13",6,null,null,null,null,null,1,null,1,1,1,null,1,1,{"$f":"(COUNTIF(Tableautoussaint[[#This Row],[19-oct-15]:[30-oct-15]],\"A\"))","v":0},{"$f":"(COUNTIF(Tableautoussaint[[#This Row],[19-oct-15]:[30-oct-15]],\"F\"))","v":0},{"$f":"SUM(Tableautoussaint[[#This Row],[19-oct-15]:[30-oct-15]])+(COUNTIF(Tableautoussaint[[#This Row],[19-oct-15]:[30-oct-15]],\"F\"))","v":6}]
["Ferrera","Zélie","2007-12-12",8,null,null,null,null,null,null,null,null,null,null,null,null,1,{"$f":"(COUNTIF(Tableautoussaint[[#This Row],[19-oct-15]:[30-oct-15]],\"A\"))","v":0},{"$f":"(COUNTIF(Tableautoussaint[[#This Row],[19-oct-15]:[30-oct-15]],\"F\"))","v":0},{"$f":"SUM(Tableautoussaint[[#This Row],[19-oct-15]:[30-oct-15]])+(COUNTIF(Tableautoussaint[[#This Row],[19-oct-15]:[30-oct-15]],\"F\"))","v":1}]
["Flotte","Emma","2010-02-20",5,null,null,null,null,null,null,null,null,1,1,null,null,null,{"$f":"(COUNTIF(Tableautoussaint[[#This Row],[19-oct-15]:[30-oct-15]],\"A\"))","v":0},{"$f":"(COUNTIF(Tableautoussaint[[#This Row],[19-oct-15]:[30-oct-15]],\"F\"))","v":0},{"$f":"SUM(Tableautoussaint[[#This Row],[19-oct-15]:[30-oct-15]])+(COUNTIF(Tableautoussaint[[#This Row],[19-oct-15]:[30-oct-15]],\"F\"))","v":2}]
["Fourmont","Mylena","2007-01-15",9,null,null,null,1,1,null,1,null,null,null,null,null,null,{"$f":"(COUNTIF(Tableautoussaint[[#This Row],[19-oct-15]:[30-oct-15]],\"A\"))","v":0},{"$f":"(COUNTIF(Tableautoussaint[[#This Row],[19-oct-15]:[30-oct-15]],\"F\"))","v":0},{"$f":"SUM(Tableautoussaint[[#This Row],[19-oct-15]:[30-oct-15]])+(COUNTIF(Tableautoussaint[[#This Row],[19-oct-15]:[30-oct-15]],\"F\"))","v":3}]
["Fourmont","Noah","2009-11-15",6,null,null,null,1,1,null,1,null,null,null,null,null,null,{"$f":"(COUNTIF(Tableautoussaint[[#This Row],[19-oct-15]:[30-oct-15]],\"A\"))","v":0},{"$f":"(COUNTIF(Tableautoussaint[[#This Row],[19-oct-15]:[30-oct-15]],\"F\"))","v":0},{"$f":"SUM(Tableautoussaint[[#This Row],[19-oct-15]:[30-oct-15]])+(COUNTIF(Tableautoussaint[[#This Row],[19-oct-15]:[30-oct-15]],\"F\"))","v":3}]
["Fournier","Farell","2011-01-25",4,null,null,null,null,null,null,null,null,1,null,1,1,null,{"$f":"(COUNTIF(Tableautoussaint[[#This Row],[19-oct-15]:[30-oct-15]],\"A\"))","v":0},{"$f":"(COUNTIF(Tableautoussaint[[#This Row],[19-oct-15]:[30-oct-15]],\"F\"))","v":0},{"$f":"SUM(Tableautoussaint[[#This Row],[19-oct-15]:[30-oct-15]])+(COUNTIF(Tableautoussaint[[#This Row],[19-oct-15]:[30-oct-15]],\"F\"))","v":3}]
["Garcia","Laly","2007-10-27",8,null,null,null,1,null,null,null,1,null,null,null,null,null,{"$f":"(COUNTIF(Tableautoussaint[[#This Row],[19-oct-15]:[30-oct-15]],\"A\"))","v":0},{"$f":"(COUNTIF(Tableautoussaint[[#This Row],[19-oct-15]:[30-oct-15]],\"F\"))","v":0},{"$f":"SUM(Tableautoussaint[[#This Row],[19-oct-15]:[30-oct-15]])+(COUNTIF(Tableautoussaint[[#This Row],[19-oct-15]:[30-oct-15]],\"F\"))","v":2}]
["Garcia","Zéline","2010-08-27",5,null,null,null,1,null,null,null,1,null,null,null,null,null,{"$f":"(COUNTIF(Tableautoussaint[[#This Row],[19-oct-15]:[30-oct-15]],\"A\"))","v":0},{"$f":"(COUNTIF(Tableautoussaint[[#This Row],[19-oct-15]:[30-oct-15]],\"F\"))","v":0},{"$f":"SUM(Tableautoussaint[[#This Row],[19-oct-15]:[30-oct-15]])+(COUNTIF(Tableautoussaint[[#This Row],[19-oct-15]:[30-oct-15]],\"F\"))","v":2}]
["Gasq","Emma","2011-08-11",4,null,null,null,null,1,null,null,null,null,null,null,null,null,{"$f":"(COUNTIF(Tableautoussaint[[#This Row],[19-oct-15]:[30-oct-15]],\"A\"))","v":0},{"$f":"(COUNTIF(Tableautoussaint[[#This Row],[19-oct-15]:[30-oct-15]],\"F\"))","v":0},{"$f":"SUM(Tableautoussaint[[#This Row],[19-oct-15]:[30-oct-15]])+(COUNTIF(Tableautoussaint[[#This Row],[19-oct-15]:[30-oct-15]],\"F\"))","v":1}]
["Gasq","Mathéo","2011-10-12",4,null,null,null,null,1,null,null,null,null,null,null,null,null,{"$f":"(COUNTIF(Tableautoussaint[[#This Row],[19-oct-15]:[30-oct-15]],\"A\"))","v":0},{"$f":"(COUNTIF(Tableautoussaint[[#This Row],[19-oct-15]:[30-oct-15]],\"F\"))","v":0},{"$f":"SUM(Tableautoussaint[[#This Row],[19-oct-15]:[30-oct-15]])+(COUNTIF(Tableautoussaint[[#This Row],[19-oct-15]:[30-oct-15]],\"F\"))","v":1}]
["Gaubert","Ines","2007-10-22",8,null,null,null,null,null,null,null,null,null,null,null,1,null,{"$f":"(COUNTIF(Tableautoussaint[[#This Row],[19-oct-15]:[30-oct-15]],\"A\"))","v":0},{"$f":"(COUNTIF(Tableautoussaint[[#This Row],[19-oct-15]:[30-oct-15]],\"F\"))","v":0},{"$f":"SUM(Tableautoussaint[[#This Row],[19-oct-15]:[30-oct-15]])+(COUNTIF(Tableautoussaint[[#This Row],[19-oct-15]:[30-oct-15]],\"F\"))","v":1}]
["Gayraud","Noé","2010-02-22",5,null,null,null,1,null,null,null,null,null,null,null,null,null,{"$f":"(COUNTIF(Tableautoussaint[[#This Row],[19-oct-15]:[30-oct-15]],\"A\"))","v":0},{"$f":"(COUNTIF(Tableautoussaint[[#This Row],[19-oct-15]:[30-oct-15]],\"F\"))","v":0},{"$f":"SUM(Tableautoussaint[[#This Row],[19-oct-15]:[30-oct-15]])+(COUNTIF(Tableautoussaint[[#This Row],[19-oct-15]:[30-oct-15]],\"F\"))","v":1}]
["Ginisty","Amélia","2010-04-21",5,null,null,null,1,1,1,1,1,null,null,null,null,null,{"$f":"(COUNTIF(Tableautoussaint[[#This Row],[19-oct-15]:[30-oct-15]],\"A\"))","v":0},{"$f":"(COUNTIF(Tableautoussaint[[#This Row],[19-oct-15]:[30-oct-15]],\"F\"))","v":0},{"$f":"SUM(Tableautoussaint[[#This Row],[19-oct-15]:[30-oct-15]])+(COUNTIF(Tableautoussaint[[#This Row],[19-oct-15]:[30-oct-15]],\"F\"))","v":5}]
["Girard","Ludmila","2011-05-11",4,null,null,null,null,null,null,1,null,null,1,null,1,null,{"$f":"(COUNTIF(Tableautoussaint[[#This Row],[19-oct-15]:[30-oct-15]],\"A\"))","v":0},{"$f":"(COUNTIF(Tableautoussaint[[#This Row],[19-oct-15]:[30-oct-15]],\"F\"))","v":0},{"$f":"SUM(Tableautoussaint[[#This Row],[19-oct-15]:[30-oct-15]])+(COUNTIF(Tableautoussaint[[#This Row],[19-oct-15]:[30-oct-15]],\"F\"))","v":3}]
["Giraud","Charly","2006-02-09",9,null,null,null,null,null,null,null,null,1,1,1,null,null,{"$f":"(COUNTIF(Tableautoussaint[[#This Row],[19-oct-15]:[30-oct-15]],\"A\"))","v":0},{"$f":"(COUNTIF(Tableautoussaint[[#This Row],[19-oct-15]:[30-oct-15]],\"F\"))","v":0},{"$f":"SUM(Tableautoussaint[[#This Row],[19-oct-15]:[30-oct-15]])+(COUNTIF(Tableautoussaint[[#This Row],[19-oct-15]:[30-oct-15]],\"F\"))","v":3}]
["Giraud","Louna","2006-02-09",9,null,null,null,null,null,null,null,null,1,1,1,null,null,{"$f":"(COUNTIF(Tableautoussaint[[#This Row],[19-oct-15]:[30-oct-15]],\"A\"))","v":0},{"$f":"(COUNTIF(Tableautoussaint[[#This Row],[19-oct-15]:[30-oct-15]],\"F\"))","v":0},{"$f":"SUM(Tableautoussaint[[#This Row],[19-oct-15]:[30-oct-15]])+(COUNTIF(Tableautoussaint[[#This Row],[19-oct-15]:[30-oct-15]],\"F\"))","v":3}]
["Issalys","Jade","2007-06-27",8,null,null,null,null,1,null,null,1,null,null,null,null,null,{"$f":"(COUNTIF(Tableautoussaint[[#This Row],[19-oct-15]:[30-oct-15]],\"A\"))","v":0},{"$f":"(COUNTIF(Tableautoussaint[[#This Row],[19-oct-15]:[30-oct-15]],\"F\"))","v":0},{"$f":"SUM(Tableautoussaint[[#This Row],[19-oct-15]:[30-oct-15]])+(COUNTIF(Tableautoussaint[[#This Row],[19-oct-15]:[30-oct-15]],\"F\"))","v":2}]
["Issalys","Oscar","2010-09-19",5,null,null,null,null,1,null,null,1,null,null,null,null,null,{"$f":"(COUNTIF(Tableautoussaint[[#This Row],[19-oct-15]:[30-oct-15]],\"A\"))","v":0},{"$f":"(COUNTIF(Tableautoussaint[[#This Row],[19-oct-15]:[30-oct-15]],\"F\"))","v":0},{"$f":"SUM(Tableautoussaint[[#This Row],[19-oct-15]:[30-oct-15]])+(COUNTIF(Tableautoussaint[[#This Row],[19-oct-15]:[30-oct-15]],\"F\"))","v":2}]
["Issanchou","Yanis","2010-07-04",5,1,null,null,null,null,null,1,null,1,null,null,null,0,{"$f":"(COUNTIF(Tableautoussaint[[#This Row],[19-oct-15]:[30-oct-15]],\"A\"))","v":0},{"$f":"(COUNTIF(Tableautoussaint[[#This Row],[19-oct-15]:[30-oct-15]],\"F\"))","v":0},{"$f":"SUM(Tableautoussaint[[#This Row],[19-oct-15]:[30-oct-15]])+(COUNTIF(Tableautoussaint[[#This Row],[19-oct-15]:[30-oct-15]],\"F\"))","v":2}]
["Lazuech","Mathéo","2011-04-30",4,null,null,null,null,1,null,null,1,null,null,null,1,1,{"$f":"(COUNTIF(Tableautoussaint[[#This Row],[19-oct-15]:[30-oct-15]],\"A\"))","v":0},{"$f":"(COUNTIF(Tableautoussaint[[#This Row],[19-oct-15]:[30-oct-15]],\"F\"))","v":0},{"$f":"SUM(Tableautoussaint[[#This Row],[19-oct-15]:[30-oct-15]])+(COUNTIF(Tableautoussaint[[#This Row],[19-oct-15]:[30-oct-15]],\"F\"))","v":4}]
["Linères","Camille","2011-11-08",4,null,null,null,null,1,null,null,null,null,null,null,null,null,{"$f":"(COUNTIF(Tableautoussaint[[#This Row],[19-oct-15]:[30-oct-15]],\"A\"))","v":0},{"$f":"(COUNTIF(Tableautoussaint[[#This Row],[19-oct-15]:[30-oct-15]],\"F\"))","v":0},{"$f":"SUM(Tableautoussaint[[#This Row],[19-oct-15]:[30-oct-15]])+(COUNTIF(Tableautoussaint[[#This Row],[19-oct-15]:[30-oct-15]],\"F\"))","v":1}]
["Margot","Tom","2008-12-12",7,null,null,null,null,null,null,null,1,1,1,null,null,null,{"$f":"(COUNTIF(Tableautoussaint[[#This Row],[19-oct-15]:[30-oct-15]],\"A\"))","v":0},{"$f":"(COUNTIF(Tableautoussaint[[#This Row],[19-oct-15]:[30-oct-15]],\"F\"))","v":0},{"$f":"SUM(Tableautoussaint[[#This Row],[19-oct-15]:[30-oct-15]])+(COUNTIF(Tableautoussaint[[#This Row],[19-oct-15]:[30-oct-15]],\"F\"))","v":3}]
["Marty","Laurine","2010-05-07",5,null,null,null,null,null,1,null,1,null,null,null,null,null,{"$f":"(COUNTIF(Tableautoussaint[[#This Row],[19-oct-15]:[30-oct-15]],\"A\"))","v":0},{"$f":"(COUNTIF(Tableautoussaint[[#This Row],[19-oct-15]:[30-oct-15]],\"F\"))","v":0},{"$f":"SUM(Tableautoussaint[[#This Row],[19-oct-15]:[30-oct-15]])+(COUNTIF(Tableautoussaint[[#This Row],[19-oct-15]:[30-oct-15]],\"F\"))","v":2}]
["Marty","Mathéo","2006-05-10",9,null,null,null,null,null,1,null,1,null,null,null,null,null,{"$f":"(COUNTIF(Tableautoussaint[[#This Row],[19-oct-15]:[30-oct-15]],\"A\"))","v":0},{"$f":"(COUNTIF(Tableautoussaint[[#This Row],[19-oct-15]:[30-oct-15]],\"F\"))","v":0},{"$f":"SUM(Tableautoussaint[[#This Row],[19-oct-15]:[30-oct-15]])+(COUNTIF(Tableautoussaint[[#This Row],[19-oct-15]:[30-oct-15]],\"F\"))","v":2}]
["Maurel","Théo","2009-01-13",{"$f":"IF(MONTH(TODAY())>MONTH(C69),YEAR(TODAY())-YEAR(C69),IF(MONTH(TODAY())<MONTH(C69),YEAR(TODAY())-YEAR(C69)-1,IF(DAY(TODAY())<DAY(C69),YEAR(TODAY())-YEAR(C69)-1,YEAR(TODAY())-YEAR(C69))))","v":7},null,null,null,null,null,null,null,1,1,1,null,1,1,{"$f":"(COUNTIF(Tableautoussaint[[#This Row],[19-oct-15]:[30-oct-15]],\"A\"))","v":0},{"$f":"(COUNTIF(Tableautoussaint[[#This Row],[19-oct-15]:[30-oct-15]],\"F\"))","v":0},{"$f":"SUM(Tableautoussaint[[#This Row],[19-oct-15]:[30-oct-15]])+(COUNTIF(Tableautoussaint[[#This Row],[19-oct-15]:[30-oct-15]],\"F\"))","v":5}]
["Mazars","Gwendoline","2010-05-04",5,null,null,null,1,1,1,null,1,null,null,null,1,null,{"$f":"(COUNTIF(Tableautoussaint[[#This Row],[19-oct-15]:[30-oct-15]],\"A\"))","v":0},{"$f":"(COUNTIF(Tableautoussaint[[#This Row],[19-oct-15]:[30-oct-15]],\"F\"))","v":0},{"$f":"SUM(Tableautoussaint[[#This Row],[19-oct-15]:[30-oct-15]])+(COUNTIF(Tableautoussaint[[#This Row],[19-oct-15]:[30-oct-15]],\"F\"))","v":5}]
["Mazars","Mathéo","2007-03-09",8,null,null,null,1,1,null,1,null,null,null,null,1,1,{"$f":"(COUNTIF(Tableautoussaint[[#This Row],[19-oct-15]:[30-oct-15]],\"A\"))","v":0},{"$f":"(COUNTIF(Tableautoussaint[[#This Row],[19-oct-15]:[30-oct-15]],\"F\"))","v":0},{"$f":"SUM(Tableautoussaint[[#This Row],[19-oct-15]:[30-oct-15]])+(COUNTIF(Tableautoussaint[[#This Row],[19-oct-15]:[30-oct-15]],\"F\"))","v":5}]
["Mazars","Nathan","2007-02-26",8,null,null,null,null,null,null,null,null,null,null,null,1,1,{"$f":"(COUNTIF(Tableautoussaint[[#This Row],[19-oct-15]:[30-oct-15]],\"A\"))","v":0},{"$f":"(COUNTIF(Tableautoussaint[[#This Row],[19-oct-15]:[30-oct-15]],\"F\"))","v":0},{"$f":"SUM(Tableautoussaint[[#This Row],[19-oct-15]:[30-oct-15]])+(COUNTIF(Tableautoussaint[[#This Row],[19-oct-15]:[30-oct-15]],\"F\"))","v":2}]
["Mazars","Titouan","2004-12-12",11,null,null,null,1,1,null,null,null,1,1,null,1,null,{"$f":"(COUNTIF(Tableautoussaint[[#This Row],[19-oct-15]:[30-oct-15]],\"A\"))","v":0},{"$f":"(COUNTIF(Tableautoussaint[[#This Row],[19-oct-15]:[30-oct-15]],\"F\"))","v":0},{"$f":"SUM(Tableautoussaint[[#This Row],[19-oct-15]:[30-oct-15]])+(COUNTIF(Tableautoussaint[[#This Row],[19-oct-15]:[30-oct-15]],\"F\"))","v":5}]
["Melle","Yanis","2009-07-10",6,null,null,null,null,1,null,1,null,null,1,null,null,null,{"$f":"(COUNTIF(Tableautoussaint[[#This Row],[19-oct-15]:[30-oct-15]],\"A\"))","v":0},{"$f":"(COUNTIF(Tableautoussaint[[#This Row],[19-oct-15]:[30-oct-15]],\"F\"))","v":0},{"$f":"SUM(Tableautoussaint[[#This Row],[19-oct-15]:[30-oct-15]])+(COUNTIF(Tableautoussaint[[#This Row],[19-oct-15]:[30-oct-15]],\"F\"))","v":3}]
["Mezy","Faustine","2005-08-18",10,null,null,null,null,1,1,null,null,null,null,null,null,1,{"$f":"(COUNTIF(Tableautoussaint[[#This Row],[19-oct-15]:[30-oct-15]],\"A\"))","v":0},{"$f":"(COUNTIF(Tableautoussaint[[#This Row],[19-oct-15]:[30-oct-15]],\"F\"))","v":0},{"$f":"SUM(Tableautoussaint[[#This Row],[19-oct-15]:[30-oct-15]])+(COUNTIF(Tableautoussaint[[#This Row],[19-oct-15]:[30-oct-15]],\"F\"))","v":3}]
["Miquel","Alicia","2008-10-29",7,null,null,null,null,null,null,null,null,null,1,null,1,1,{"$f":"(COUNTIF(Tableautoussaint[[#This Row],[19-oct-15]:[30-oct-15]],\"A\"))","v":0},{"$f":"(COUNTIF(Tableautoussaint[[#This Row],[19-oct-15]:[30-oct-15]],\"F\"))","v":0},{"$f":"SUM(Tableautoussaint[[#This Row],[19-oct-15]:[30-oct-15]])+(COUNTIF(Tableautoussaint[[#This Row],[19-oct-15]:[30-oct-15]],\"F\"))","v":3}]
["Mirabel","Jules","2010-04-26",5,null,null,null,null,null,null,null,null,1,null,null,null,null,{"$f":"(COUNTIF(Tableautoussaint[[#This Row],[19-oct-15]:[30-oct-15]],\"A\"))","v":0},{"$f":"(COUNTIF(Tableautoussaint[[#This Row],[19-oct-15]:[30-oct-15]],\"F\"))","v":0},{"$f":"SUM(Tableautoussaint[[#This Row],[19-oct-15]:[30-oct-15]])+(COUNTIF(Tableautoussaint[[#This Row],[19-oct-15]:[30-oct-15]],\"F\"))","v":1}]
["Molinier","Arthur","2012-05-13",3,null,null,null,1,1,null,null,null,1,1,1,1,null,{"$f":"(COUNTIF(Tableautoussaint[[#This Row],[19-oct-15]:[30-oct-15]],\"A\"))","v":0},{"$f":"(COUNTIF(Tableautoussaint[[#This Row],[19-oct-15]:[30-oct-15]],\"F\"))","v":0},{"$f":"SUM(Tableautoussaint[[#This Row],[19-oct-15]:[30-oct-15]])+(COUNTIF(Tableautoussaint[[#This Row],[19-oct-15]:[30-oct-15]],\"F\"))","v":6}]
["Navarro","Amélie","2007-07-18",8,null,null,null,null,null,null,null,1,1,null,null,1,0,{"$f":"(COUNTIF(Tableautoussaint[[#This Row],[19-oct-15]:[30-oct-15]],\"A\"))","v":0},{"$f":"(COUNTIF(Tableautoussaint[[#This Row],[19-oct-15]:[30-oct-15]],\"F\"))","v":0},{"$f":"SUM(Tableautoussaint[[#This Row],[19-oct-15]:[30-oct-15]])+(COUNTIF(Tableautoussaint[[#This Row],[19-oct-15]:[30-oct-15]],\"F\"))","v":3}]
["Neyer","Rose","2010-04-12",5,null,null,null,null,null,null,null,null,null,null,null,null,0,{"$f":"(COUNTIF(Tableautoussaint[[#This Row],[19-oct-15]:[30-oct-15]],\"A\"))","v":0},{"$f":"(COUNTIF(Tableautoussaint[[#This Row],[19-oct-15]:[30-oct-15]],\"F\"))","v":0},{"$f":"SUM(Tableautoussaint[[#This Row],[19-oct-15]:[30-oct-15]])+(COUNTIF(Tableautoussaint[[#This Row],[19-oct-15]:[30-oct-15]],\"F\"))","v":0}]
["Neyer","Zélie","2007-08-20",8,null,null,null,null,null,null,null,null,null,null,"F",null,null,{"$f":"(COUNTIF(Tableautoussaint[[#This Row],[19-oct-15]:[30-oct-15]],\"A\"))","v":0},{"$f":"(COUNTIF(Tableautoussaint[[#This Row],[19-oct-15]:[30-oct-15]],\"F\"))","v":1},{"$f":"SUM(Tableautoussaint[[#This Row],[19-oct-15]:[30-oct-15]])+(COUNTIF(Tableautoussaint[[#This Row],[19-oct-15]:[30-oct-15]],\"F\"))","v":1}]
["Perrier","Angelo","2011-12-21",4,null,null,null,1,1,1,1,1,null,null,null,null,null,{"$f":"(COUNTIF(Tableautoussaint[[#This Row],[19-oct-15]:[30-oct-15]],\"A\"))","v":0},{"$f":"(COUNTIF(Tableautoussaint[[#This Row],[19-oct-15]:[30-oct-15]],\"F\"))","v":0},{"$f":"SUM(Tableautoussaint[[#This Row],[19-oct-15]:[30-oct-15]])+(COUNTIF(Tableautoussaint[[#This Row],[19-oct-15]:[30-oct-15]],\"F\"))","v":5}]
["Pialhoux","Gaël","2005-11-15",10,null,null,null,null,1,1,null,null,null,null,null,null,null,{"$f":"(COUNTIF(Tableautoussaint[[#This Row],[19-oct-15]:[30-oct-15]],\"A\"))","v":0},{"$f":"(COUNTIF(Tableautoussaint[[#This Row],[19-oct-15]:[30-oct-15]],\"F\"))","v":0},{"$f":"SUM(Tableautoussaint[[#This Row],[19-oct-15]:[30-oct-15]])+(COUNTIF(Tableautoussaint[[#This Row],[19-oct-15]:[30-oct-15]],\"F\"))","v":2}]
["Portal","Léa","2007-12-04",8,null,null,null,null,null,null,null,null,null,null,null,1,null,{"$f":"(COUNTIF(Tableautoussaint[[#This Row],[19-oct-15]:[30-oct-15]],\"A\"))","v":0},{"$f":"(COUNTIF(Tableautoussaint[[#This Row],[19-oct-15]:[30-oct-15]],\"F\"))","v":0},{"$f":"SUM(Tableautoussaint[[#This Row],[19-oct-15]:[30-oct-15]])+(COUNTIF(Tableautoussaint[[#This Row],[19-oct-15]:[30-oct-15]],\"F\"))","v":1}]
["Portal","Théo","2006-04-22",9,null,null,null,null,null,null,null,null,null,null,null,1,null,{"$f":"(COUNTIF(Tableautoussaint[[#This Row],[19-oct-15]:[30-oct-15]],\"A\"))","v":0},{"$f":"(COUNTIF(Tableautoussaint[[#This Row],[19-oct-15]:[30-oct-15]],\"F\"))","v":0},{"$f":"SUM(Tableautoussaint[[#This Row],[19-oct-15]:[30-oct-15]])+(COUNTIF(Tableautoussaint[[#This Row],[19-oct-15]:[30-oct-15]],\"F\"))","v":1}]
["Raynal","Laly","2010-07-17",5,null,null,null,1,null,null,null,1,null,null,null,null,1,{"$f":"(COUNTIF(Tableautoussaint[[#This Row],[19-oct-15]:[30-oct-15]],\"A\"))","v":0},{"$f":"(COUNTIF(Tableautoussaint[[#This Row],[19-oct-15]:[30-oct-15]],\"F\"))","v":0},{"$f":"SUM(Tableautoussaint[[#This Row],[19-oct-15]:[30-oct-15]])+(COUNTIF(Tableautoussaint[[#This Row],[19-oct-15]:[30-oct-15]],\"F\"))","v":3}]
["Raynal","Mahé","2007-07-04",8,1,1,null,1,null,null,null,1,null,null,null,null,"F",{"$f":"(COUNTIF(Tableautoussaint[[#This Row],[19-oct-15]:[30-oct-15]],\"A\"))","v":0},{"$f":"(COUNTIF(Tableautoussaint[[#This Row],[19-oct-15]:[30-oct-15]],\"F\"))","v":1},{"$f":"SUM(Tableautoussaint[[#This Row],[19-oct-15]:[30-oct-15]])+(COUNTIF(Tableautoussaint[[#This Row],[19-oct-15]:[30-oct-15]],\"F\"))","v":3}]
["Rivière","Alice","2010-10-26",5,null,null,null,null,null,null,1,null,null,1,null,1,null,{"$f":"(COUNTIF(Tableautoussaint[[#This Row],[19-oct-15]:[30-oct-15]],\"A\"))","v":0},{"$f":"(COUNTIF(Tableautoussaint[[#This Row],[19-oct-15]:[30-oct-15]],\"F\"))","v":0},{"$f":"SUM(Tableautoussaint[[#This Row],[19-oct-15]:[30-oct-15]])+(COUNTIF(Tableautoussaint[[#This Row],[19-oct-15]:[30-oct-15]],\"F\"))","v":3}]
["Rossignol","Klara","2012-05-15",3,null,null,null,1,null,null,null,null,1,null,1,null,0,{"$f":"(COUNTIF(Tableautoussaint[[#This Row],[19-oct-15]:[30-oct-15]],\"A\"))","v":0},{"$f":"(COUNTIF(Tableautoussaint[[#This Row],[19-oct-15]:[30-oct-15]],\"F\"))","v":0},{"$f":"SUM(Tableautoussaint[[#This Row],[19-oct-15]:[30-oct-15]])+(COUNTIF(Tableautoussaint[[#This Row],[19-oct-15]:[30-oct-15]],\"F\"))","v":3}]
["Savickis","Julians","2008-07-24",7,null,null,null,null,null,null,null,null,null,null,null,null,null,{"$f":"(COUNTIF(Tableautoussaint[[#This Row],[19-oct-15]:[30-oct-15]],\"A\"))","v":0},{"$f":"(COUNTIF(Tableautoussaint[[#This Row],[19-oct-15]:[30-oct-15]],\"F\"))","v":0},{"$f":"SUM(Tableautoussaint[[#This Row],[19-oct-15]:[30-oct-15]])+(COUNTIF(Tableautoussaint[[#This Row],[19-oct-15]:[30-oct-15]],\"F\"))","v":0}]
["Sicre","Mathias","2006-06-08",9,null,null,null,null,null,1,null,1,1,1,null,1,1,{"$f":"(COUNTIF(Tableautoussaint[[#This Row],[19-oct-15]:[30-oct-15]],\"A\"))","v":0},{"$f":"(COUNTIF(Tableautoussaint[[#This Row],[19-oct-15]:[30-oct-15]],\"F\"))","v":0},{"$f":"SUM(Tableautoussaint[[#This Row],[19-oct-15]:[30-oct-15]])+(COUNTIF(Tableautoussaint[[#This Row],[19-oct-15]:[30-oct-15]],\"F\"))","v":6}]
["Sicre","Samuel","2012-09-21",3,null,null,null,null,null,1,null,1,1,1,null,1,1,{"$f":"(COUNTIF(Tableautoussaint[[#This Row],[19-oct-15]:[30-oct-15]],\"A\"))","v":0},{"$f":"(COUNTIF(Tableautoussaint[[#This Row],[19-oct-15]:[30-oct-15]],\"F\"))","v":0},{"$f":"SUM(Tableautoussaint[[#This Row],[19-oct-15]:[30-oct-15]])+(COUNTIF(Tableautoussaint[[#This Row],[19-oct-15]:[30-oct-15]],\"F\"))","v":6}]
["Tennevin","Nathan","2006-11-01",9,null,null,null,1,1,null,null,1,null,null,null,null,null,{"$f":"(COUNTIF(Tableautoussaint[[#This Row],[19-oct-15]:[30-oct-15]],\"A\"))","v":0},{"$f":"(COUNTIF(Tableautoussaint[[#This Row],[19-oct-15]:[30-oct-15]],\"F\"))","v":0},{"$f":"SUM(Tableautoussaint[[#This Row],[19-oct-15]:[30-oct-15]])+(COUNTIF(Tableautoussaint[[#This Row],[19-oct-15]:[30-oct-15]],\"F\"))","v":3}]
["Tournier","Camille","2004-08-26",11,null,null,null,1,1,1,null,1,null,null,null,null,null,{"$f":"(COUNTIF(Tableautoussaint[[#This Row],[19-oct-15]:[30-oct-15]],\"A\"))","v":0},{"$f":"(COUNTIF(Tableautoussaint[[#This Row],[19-oct-15]:[30-oct-15]],\"F\"))","v":0},{"$f":"SUM(Tableautoussaint[[#This Row],[19-oct-15]:[30-oct-15]])+(COUNTIF(Tableautoussaint[[#This Row],[19-oct-15]:[30-oct-15]],\"F\"))","v":4}]
["Tournier","Laura","2009-12-13",6,null,null,null,null,null,null,null,null,null,null,null,null,null,{"$f":"(COUNTIF(Tableautoussaint[[#This Row],[19-oct-15]:[30-oct-15]],\"A\"))","v":0},{"$f":"(COUNTIF(Tableautoussaint[[#This Row],[19-oct-15]:[30-oct-15]],\"F\"))","v":0},{"$f":"SUM(Tableautoussaint[[#This Row],[19-oct-15]:[30-oct-15]])+(COUNTIF(Tableautoussaint[[#This Row],[19-oct-15]:[30-oct-15]],\"F\"))","v":0}]
["Trin","Julie","2008-04-04",7,null,null,null,null,null,null,null,null,null,null,null,1,1,{"$f":"(COUNTIF(Tableautoussaint[[#This Row],[19-oct-15]:[30-oct-15]],\"A\"))","v":0},{"$f":"(COUNTIF(Tableautoussaint[[#This Row],[19-oct-15]:[30-oct-15]],\"F\"))","v":0},{"$f":"SUM(Tableautoussaint[[#This Row],[19-oct-15]:[30-oct-15]])+(COUNTIF(Tableautoussaint[[#This Row],[19-oct-15]:[30-oct-15]],\"F\"))","v":2}]
["Uras","Hugo","2012-04-12",3,null,null,null,null,null,null,null,null,null,1,"F",1,1,{"$f":"(COUNTIF(Tableautoussaint[[#This Row],[19-oct-15]:[30-oct-15]],\"A\"))","v":0},{"$f":"(COUNTIF(Tableautoussaint[[#This Row],[19-oct-15]:[30-oct-15]],\"F\"))","v":1},{"$f":"SUM(Tableautoussaint[[#This Row],[19-oct-15]:[30-oct-15]])+(COUNTIF(Tableautoussaint[[#This Row],[19-oct-15]:[30-oct-15]],\"F\"))","v":4}]
["Verfaillie","Joy","2007-04-10",8,null,null,null,null,null,null,null,null,1,1,1,null,null,{"$f":"(COUNTIF(Tableautoussaint[[#This Row],[19-oct-15]:[30-oct-15]],\"A\"))","v":0},{"$f":"(COUNTIF(Tableautoussaint[[#This Row],[19-oct-15]:[30-oct-15]],\"F\"))","v":0},{"$f":"SUM(Tableautoussaint[[#This Row],[19-oct-15]:[30-oct-15]])+(COUNTIF(Tableautoussaint[[#This Row],[19-oct-15]:[30-oct-15]],\"F\"))","v":3}]
["Weber","Thomas","2010-11-06",5,null,null,null,null,null,null,null,null,null,1,null,1,null,{"$f":"(COUNTIF(Tableautoussaint[[#This Row],[19-oct-15]:[30-oct-15]],\"A\"))","v":0},{"$f":"(COUNTIF(Tableautoussaint[[#This Row],[19-oct-15]:[30-oct-15]],\"F\"))","v":0},{"$f":"SUM(Tableautoussaint[[#This Row],[19-oct-15]:[30-oct-15]])+(COUNTIF(Tableautoussaint[[#This Row],[19-oct-15]:[30-oct-15]],\"F\"))","v":2}]
[null,null,null,116,null,null,null,null,null,null,null,null,null,null,null,null,null,{"$f":"(COUNTIF(Tableautoussaint[[#This Row],[19-oct-15]:[30-oct-15]],\"A\"))","v":0},{"$f":"(COUNTIF(Tableautoussaint[[#This Row],[19-oct-15]:[30-oct-15]],\"F\"))","v":0},{"$f":"SUM(Tableautoussaint[[#This Row],[19-oct-15]:[30-oct-15]])+(COUNTIF(Tableautoussaint[[#This Row],[19-oct-15]:[30-oct-15]],\"F\"))","v":0}]
[null,null,null,null,null,null,null,null,null,null,null,null,null,null,null,null,null,{"$f":"(COUNTIF(Tableautoussaint[[#This Row],[19-oct-15]:[30-oct-15]],\"A\"))","v":0},{"$f":"(COUNTIF(Tableautoussaint[[#This Row],[19-oct-15]:[30-oct-15]],\"F\"))","v":0},{"$f":"SUM(Tableautoussaint[[#This Row],[19-oct-15]:[30-oct-15]])+(COUNTIF(Tableautoussaint[[#This Row],[19-oct-15]:[30-oct-15]],\"F\"))","v":0}]
["( Age sélectionné ) SOUS TOTAL JOURNALIER",null,null,null,null,null,null,{"$f":"SUBTOTAL(109,H5:H101)","v":24},36,24,25,31,29,28,15,36,26,0,3,277]
["TOTAL JOURNALIER",null,null,null,null,null,null,{"$f":"SUMIF(H5:H101,\"1\")+COUNTIF(H5:H101,\"F\")","v":24},36,24,25,31,29,28,17,36,27,{"$f":"SUM(R5:R101)","v":0},{"$f":"SUM(S5:S101)","v":3},{"$f":"SUM(T5:T101)","v":277}]
["Abscences",null,null,null,null,null,null,{"$f":"(COUNTIF(H5:H101,\"A\")+COUNTIF(H5:H101,\"F\"))","v":0},0,0,0,0,0,0,2,0,1]
[" DEMANDE DE RESERVATIONS",null,null,null,null,null,null,{"$f":"COUNTIF(H5:H101,\"0\")","v":0},0,0,0,0,0,0,0,0,6]

{"sheet":"Vacances d'Hivers","index":17,"n_rows":22,"n_cols":20,"rows_kept":22,"cut":false,"hidden":false,"merged":[[0,10,0,13],[0,15,0,18],[1,7,1,9],[1,10,1,11],[1,12,1,14],[1,15,1,16],[18,0,18,6],[19,0,19,6],[20,0,20,6],[21,0,21,6],[0,3,0,9],[0,0,1,0],[27,0,27,2],[27,3,27,4],[28,0,28,2],[28,3,28,5],[28,6,28,8]]}
["Pointage Couleur",null,null,{"$f":"MID(CELL(\"filename\",J2),FIND(\"]\",CELL(\"filename\",J2))+1,32)& \" du :\"","v":"Vacances d'Hivers du :"},null,null,null,null,null,null,{"$f":"données!B4","v":"2016-02-22"},null,null,null,"AU",{"$f":"données!C4","v":"2016-03-04"}]
[null,null,null,null,null,null,null,"Semaine :",null,null,{"$f":"WEEKNUM(K1)","v":9},null,"Semaine :",null,null,{"$f":"WEEKNUM(P1)","v":10}]
[null,null,null,null,null,null,null,"Lundi","Mardi","Mercredi","Jeudi","Vendredi","Lundi","Mardi","Mercredi","Jeudi","Vendredi"]
["Nom","Prénom","Date de Naissance","Age","Allergie Alimentaire","Autre Allergie","Régime Alimentaire","22-févr-16","23-févr-16","24-févr-16","25-févr-16","26-févr-16","29-févr-16","01-mars-16","02-mars-16","03-mars-16","04-mars-16","Absences","Absences Facturées","Total Global"]
["Cher","Zélie","04/05/2010",{"$f":"IF(MONTH(TODAY())>MONTH(C5),YEAR(TODAY())-YEAR(C5),IF(MONTH(TODAY())<MONTH(C5),YEAR(TODAY())-YEAR(C5)-1,IF(DAY(TODAY())<DAY(C5),YEAR(TODAY())-YEAR(C5)-1,YEAR(TODAY())-YEAR(C5))))","v":5},null,null,null,1,1,1,1,1,1,1,1,1,1,{"$f":"(COUNTIF(Tableauhivers[[#This Row],[22-févr-16]:[04-mars-16]],\"A\"))","v":0},{"$f":"(COUNTIF(Tableauhivers[[#This Row],[22-févr-16]:[04-mars-16]],\"F\"))","v":0},{"$f":"SUM(Tableauhivers[[#This Row],[22-févr-16]:[04-mars-16]])+(COUNTIF(Tableauhivers[[#This Row],[22-févr-16]:[04-mars-16]],\"F\"))","v":10}]
["Cher","Axel","28/12/2004",11,null,null,null,1,1,1,1,1,1,1,1,1,1,{"$f":"(COUNTIF(Tableauhivers[[#This Row],[22-févr-16]:[04-mars-16]],\"A\"))","v":0},{"$f":"(COUNTIF(Tableauhivers[[#This Row],[22-févr-16]:[04-mars-16]],\"F\"))","v":0},{"$f":"SUM(Tableauhivers[[#This Row],[22-févr-16]:[04-mars-16]])+(COUNTIF(Tableauhivers[[#This Row],[22-févr-16]:[04-mars-16]],\"F\"))","v":10}]
["Couffignal","Sacha","10/04/2010",5,null,null,null,1,null,1,1,1,null,null,null,null,null,{"$f":"(COUNTIF(Tableauhivers[[#This Row],[22-févr-16]:[04-mars-16]],\"A\"))","v":0},{"$f":"(COUNTIF(Tableauhivers[[#This Row],[22-févr-16]:[04-mars-16]],\"F\"))","v":0},{"$f":"SUM(Tableauhivers[[#This Row],[22-févr-16]:[04-mars-16]])+(COUNTIF(Tableauhivers[[#This Row],[22-févr-16]:[04-mars-16]],\"F\"))","v":4}]
["Couffignal","Eddy","07/08/2007",8,null,null,null,1,null,1,1,1,null,null,null,null,null,{"$f":"(COUNTIF(Tableauhivers[[#This Row],[22-févr-16]:[04-mars-16]],\"A\"))","v":0},{"$f":"(COUNTIF(Tableauhivers[[#This Row],[22-févr-16]:[04-mars-16]],\"F\"))","v":0},{"$f":"SUM(Tableauhivers[[#This Row],[22-févr-16]:[04-mars-16]])+(COUNTIF(Tableauhivers[[#This Row],[22-févr-16]:[04-mars-16]],\"F\"))","v":4}]
["Couto-f","Zoé","31/10/2010",5,null,null,null,1,1,1,1,1,1,1,1,1,1,{"$f":"(COUNTIF(Tableauhivers[[#This Row],[22-févr-16]:[04-mars-16]],\"A\"))","v":0},{"$f":"(COUNTIF(Tableauhivers[[#This Row],[22-févr-16]:[04-mars-16]],\"F\"))","v":0},{"$f":"SUM(Tableauhivers[[#This Row],[22-févr-16]:[04-mars-16]])+(COUNTIF(Tableauhivers[[#This Row],[22-févr-16]:[04-mars-16]],\"F\"))","v":10}]
["Dardu-M","Léo","04/06/2007",8,null,null,null,1,1,1,1,1,null,null,null,null,null,{"$f":"(COUNTIF(Tableauhivers[[#This Row],[22-févr-16]:[04-mars-16]],\"A\"))","v":0},{"$f":"(COUNTIF(Tableauhivers[[#This Row],[22-févr-16]:[04-mars-16]],\"F\"))","v":0},{"$f":"SUM(Tableauhivers[[#This Row],[22-févr-16]:[04-mars-16]])+(COUNTIF(Tableauhivers[[#This Row],[22-févr-16]:[04-mars-16]],\"F\"))","v":5}]
["Dardu-M","Robin","29/01/2009",6,null,null,null,1,1,1,1,1,null,null,null,null,null,{"$f":"(COUNTIF(Tableauhivers[[#This Row],[22-févr-16]:[04-mars-16]],\"A\"))","v":0},{"$f":"(COUNTIF(Tableauhivers[[#This Row],[22-févr-16]:[04-mars-16]],\"F\"))","v":0},{"$f":"SUM(Tableauhivers[[#This Row],[22-févr-16]:[04-mars-16]])+(COUNTIF(Tableauhivers[[#This Row],[22-févr-16]:[04-mars-16]],\"F\"))","v":5}]
["Dulain","Alice","05/11/11",4,null,null,null,1,1,1,1,1,null,null,null,null,null,{"$f":"(COUNTIF(Tableauhivers[[#This Row],[22-févr-16]:[04-mars-16]],\"A\"))","v":0},{"$f":"(COUNTIF(Tableauhivers[[#This Row],[22-févr-16]:[04-mars-16]],\"F\"))","v":0},{"$f":"SUM(Tableauhivers[[#This Row],[22-févr-16]:[04-mars-16]])+(COUNTIF(Tableauhivers[[#This Row],[22-févr-16]:[04-mars-16]],\"F\"))","v":5}]
["Dulain ","Mathieu","22/05/09",6,null,null,null,1,1,1,1,1,null,null,null,null,null,{"$f":"(COUNTIF(Tableauhivers[[#This Row],[22-févr-16]:[04-mars-16]],\"A\"))","v":0},{"$f":"(COUNTIF(Tableauhivers[[#This Row],[22-févr-16]:[04-mars-16]],\"F\"))","v":0},{"$f":"SUM(Tableauhivers[[#This Row],[22-févr-16]:[04-mars-16]])+(COUNTIF(Tableauhivers[[#This Row],[22-févr-16]:[04-mars-16]],\"F\"))","v":5}]
["Dunet","Tom","12/06/2009",6,null,null,null,null,null,1,null,null,null,null,null,null,null,{"$f":"(COUNTIF(Tableauhivers[[#This Row],[22-févr-16]:[04-mars-16]],\"A\"))","v":0},{"$f":"(COUNTIF(Tableauhivers[[#This Row],[22-févr-16]:[04-mars-16]],\"F\"))","v":0},{"$f":"SUM(Tableauhivers[[#This Row],[22-févr-16]:[04-mars-16]])+(COUNTIF(Tableauhivers[[#This Row],[22-févr-16]:[04-mars-16]],\"F\"))","v":1}]
["Dunet","Enora","03/05/2007",8,null,null,null,null,null,1,null,null,null,null,null,null,null,{"$f":"(COUNTIF(Tableauhivers[[#This Row],[22-févr-16]:[04-mars-16]],\"A\"))","v":0},{"$f":"(COUNTIF(Tableauhivers[[#This Row],[22-févr-16]:[04-mars-16]],\"F\"))","v":0},{"$f":"SUM(Tableauhivers[[#This Row],[22-févr-16]:[04-mars-16]])+(COUNTIF(Tableauhivers[[#This Row],[22-févr-16]:[04-mars-16]],\"F\"))","v":1}]
["Miquel","Laurène","26/04/2011",4,null,null,null,1,1,1,1,1,null,null,null,null,null,{"$f":"(COUNTIF(Tableauhivers[[#This Row],[22-févr-16]:[04-mars-16]],\"A\"))","v":0},{"$f":"(COUNTIF(Tableauhivers[[#This Row],[22-févr-16]:[04-mars-16]],\"F\"))","v":0},{"$f":"SUM(Tableauhivers[[#This Row],[22-févr-16]:[04-mars-16]])+(COUNTIF(Tableauhivers[[#This Row],[22-févr-16]:[04-mars-16]],\"F\"))","v":5}]
["Miquel","Emeline","",{"$error":"#VALUE!"},null,null,null,1,1,1,1,1,null,null,null,null,null,{"$f":"(COUNTIF(Tableauhivers[[#This Row],[22-févr-16]:[04-mars-16]],\"A\"))","v":0},{"$f":"(COUNTIF(Tableauhivers[[#This Row],[22-févr-16]:[04-mars-16]],\"F\"))","v":0},{"$f":"SUM(Tableauhivers[[#This Row],[22-févr-16]:[04-mars-16]])+(COUNTIF(Tableauhivers[[#This Row],[22-févr-16]:[04-mars-16]],\"F\"))","v":5}]
[null,null,null,116,null,null,null,null,null,null,null,null,null,null,null,null,null,{"$f":"(COUNTIF(Tableauhivers[[#This Row],[22-févr-16]:[04-mars-16]],\"A\"))","v":0},{"$f":"(COUNTIF(Tableauhivers[[#This Row],[22-févr-16]:[04-mars-16]],\"F\"))","v":0},{"$f":"SUM(Tableauhivers[[#This Row],[22-févr-16]:[04-mars-16]])+(COUNTIF(Tableauhivers[[#This Row],[22-févr-16]:[04-mars-16]],\"F\"))","v":0}]
["( Age sélectionné ) SOUS TOTAL JOURNALIER",null,null,null,null,null,null,{"$f":"SUBTOTAL(109,H5:H18)","v":11},9,13,11,11,3,3,3,3,3,0,0,70]
["TOTAL JOURNALIER",null,null,null,null,null,null,{"$f":"SUMIF(H5:H18,\"1\")+COUNTIF(H5:H18,\"F\")","v":11},9,13,11,11,3,3,3,3,3,{"$f":"SUM(R5:R18)","v":0},{"$f":"SUM(S5:S18)","v":0},{"$f":"SUM(T5:T18)","v":70}]
["Abscences",null,null,null,null,null,null,{"$f":"(COUNTIF(H5:H18,\"A\")+COUNTIF(H5:H18,\"F\"))","v":0},0,0,0,0,0,0,0,0,0]
[" DEMANDE DE RESERVATIONS",null,null,null,null,null,null,{"$f":"COUNTIF(H5:H18,\"0\")","v":0},0,0,0,0,0,0,0,0,0]

{"sheet":"Vacances de Pâques","index":18,"n_rows":10,"n_cols":20,"rows_kept":10,"cut":false,"hidden":false,"merged":[[0,10,0,13],[0,15,0,18],[1,7,1,9],[1,10,1,11],[1,12,1,14],[1,15,1,16],[6,0,6,6],[7,0,7,6],[8,0,8,6],[9,0,9,6],[0,3,0,9],[0,0,1,0],[15,0,15,2],[16,0,16,2],[15,3,15,4],[16,3,16,5],[16,6,16,8]]}
["Pointage Couleur",null,null,{"$f":"MID(CELL(\"filename\",J2),FIND(\"]\",CELL(\"filename\",J2))+1,32)& \" du :\"","v":"Vacances de Pâques du :"},null,null,null,null,null,null,{"$f":"données!B5","v":"2016-04-18"},null,null,null,"AU",{"$f":"données!C5","v":"2016-04-29"}]
[null,null,null,null,null,null,null,"Semaine :",null,null,{"$f":"WEEKNUM(K1)","v":17},null,"Semaine :",null,null,{"$f":"WEEKNUM(P1)","v":18}]
[null,null,null,null,null,null,null,"Lundi","Mardi","Mercredi","Jeudi","Vendredi","Lundi","Mardi","Mercredi","Jeudi","Vendredi"]
["Nom","Prénom","Date de Naissance","Age","Allergie Alimentaire","Autre Allergie","Remarques","18-avr-16","19-avr-16","20-avr-16","21-avr-16","22-avr-16","25-avr-16","26-avr-16","27-avr-16","28-avr-16","29-avr-16","Absences","Absences Facturées","Total Global"]
[null,null,null,{"$f":"IF(MONTH(TODAY())>MONTH(C5),YEAR(TODAY())-YEAR(C5),IF(MONTH(TODAY())<MONTH(C5),YEAR(TODAY())-YEAR(C5)-1,IF(DAY(TODAY())<DAY(C5),YEAR(TODAY())-YEAR(C5)-1,YEAR(TODAY())-YEAR(C5))))","v":116},null,null,null,null,null,null,null,null,null,null,null,null,null,{"$f":"(COUNTIF(Tableaupaques[[#This Row],[18-avr-16]:[29-avr-16]],\"A\"))","v":0},{"$f":"(COUNTIF(Tableaupaques[[#This Row],[18-avr-16]:[29-avr-16]],\"F\"))","v":0},{"$f":"SUM(Tableaupaques[[#This Row],[18-avr-16]:[29-avr-16]])+(COUNTIF(Tableaupaques[[#This Row],[18-avr-16]:[29-avr-16]],\"F\"))","v":0}]
[null,null,null,{"$f":"IF(MONTH(TODAY())>MONTH(C6),YEAR(TODAY())-YEAR(C6),IF(MONTH(TODAY())<MONTH(C6),YEAR(TODAY())-YEAR(C6)-1,IF(DAY(TODAY())<DAY(C6),YEAR(TODAY())-YEAR(C6)-1,YEAR(TODAY())-YEAR(C6))))","v":116},null,null,null,null,null,null,null,null,null,null,null,null,null,{"$f":"(COUNTIF(Tableaupaques[[#This Row],[18-avr-16]:[29-avr-16]],\"A\"))","v":0},{"$f":"(COUNTIF(Tableaupaques[[#This Row],[18-avr-16]:[29-avr-16]],\"F\"))","v":0},{"$f":"SUM(Tableaupaques[[#This Row],[18-avr-16]:[29-avr-16]])+(COUNTIF(Tableaupaques[[#This Row],[18-avr-16]:[29-avr-16]],\"F\"))","v":0}]
["( Age sélectionné ) SOUS TOTAL JOURNALIER",null,null,null,null,null,null,{"$f":"SUBTOTAL(109,H5:H6)","v":0},0,0,0,0,0,0,0,0,0,0,0,0]
["TOTAL JOURNALIER",null,null,null,null,null,null,{"$f":"SUMIF(H5:H6,\"1\")+COUNTIF(H5:H6,\"F\")","v":0},0,0,0,0,0,0,0,0,0,{"$f":"SUM(R5:R6)","v":0},{"$f":"SUM(S5:S6)","v":0},{"$f":"SUM(T5:T6)","v":0}]
["Abscences",null,null,null,null,null,null,{"$f":"(COUNTIF(H5:H6,\"A\")+COUNTIF(H5:H6,\"F\"))","v":0},0,0,0,0,0,0,0,0,0]
[" DEMANDE DE RESERVATIONS",null,null,null,null,null,null,{"$f":"COUNTIF(H5:H6,\"0\")","v":0},0,0,0,0,0,0,0,0,0]

{"sheet":"Vacances d'été","index":19,"n_rows":12,"n_cols":42,"rows_kept":12,"cut":false,"hidden":false,"merged":[[1,35,1,36],[1,10,1,11],[1,15,1,16],[1,20,1,21],[1,25,1,26],[1,30,1,31],[1,12,1,14],[1,17,1,19],[1,22,1,24],[1,27,1,29],[6,0,6,6],[7,0,7,6],[1,32,1,34],[0,5,0,15],[1,7,1,9],[0,16,0,21],[0,23,0,28],[0,0,1,0],[21,0,21,2],[21,3,21,5],[9,0,9,6],[8,0,8,6],[10,0,10,6],[11,0,11,6],[20,0,20,2],[20,3,20,4]]}
["Pointage Couleur",null,null,null,null,{"$f":"MID(CELL(\"filename\",J2),FIND(\"]\",CELL(\"filename\",J2))+1,32)& \" du :\"","v":"Vacances d'été du :"},null,null,null,null,null,null,null,null,null,null,{"$f":"données!B6","v":"2016-07-11"},null,null,null,null,null,"AU",{"$f":"données!C6","v":"2016-08-12"}]
[null,null,null,null,null,null,null,"Semaine :",null,null,{"$f":"WEEKNUM(Q1)","v":29},null,"Semaine :",null,null,{"$f":"WEEKNUM(Q1)+1","v":30},null,"Semaine :",null,null,{"$f":"WEEKNUM(Q1)+2","v":31},null,"Semaine :",null,null,{"$f":"WEEKNUM(Q1)+3","v":32},null,"Semaine :",null,null,{"$f":"WEEKNUM(Q1)+4","v":33},null,"Semaine :",null,null,{"$f":"WEEKNUM(Q1)+5","v":34}]
[null,null,null,null,null,null,null,"Lundi","Mardi","Mercredi","Jeudi","Vendredi","Lundi","Mardi","Mercredi","Jeudi","Vendredi","Lundi","Mardi","Mercredi","Jeudi","Vendredi","Lundi","Mardi","Mercredi","Jeudi","Vendredi","Lundi","Mardi","Mercredi","Jeudi","Vendredi","Lundi","Mardi","Mercredi","Jeudi","Vendredi"]
["Nom","Prénom","Date de Naissance","Age","Allergie Alimentaire","Autre Allergie","Régime Alimentaire","11-juil","12-juil","13-juil","14-juil","15-juil","18-juil","19-juil","20-juil","21-juil","22-juil","25-juil","26-juil","27-juil","28-juil","29-juil","01-août","02-août","03-août","04-août","05-août","08-août","09-août","10-août","11-août","12-août","15-août","16-août","17-août","18-août","19-août","Absences","Abscences Facturées","Total Juillet","Total Août","Total Global"]
[null,null,null,null,null,null,null,null,null,null,null,null,null,null,null,null,null,null,null,null,null,null,null,null,null,null,null,null,null,null,null,null,null,null,null,null,null,{"$f":"(COUNTIF(Tableauété[[#This Row],[11-juil]:[19-août]],\"A\"))+(COUNTIF(Tableauété[[#This Row],[11-juil]:[19-août]],\"F\"))","v":0},{"$f":"(COUNTIF(Tableauété[[#This Row],[11-juil]:[19-août]],\"F\"))","v":0},{"$f":"SUM(Tableauété[[#This Row],[11-juil]:[29-juil]])+Tableauété[[#This Row],[Abscences Facturées]]","v":0},{"$f":"SUM(Tableauété[[#This Row],[01-août]:[19-août]])+Tableauété[[#This Row],[Abscences Facturées]]","v":0},{"$f":"SUM(Tableauété[[#This Row],[Total Juillet]:[Total Août]])","v":0}]
[null,null,null,null,null,null,null,null,null,null,null,null,null,null,null,null,null,null,null,null,null,null,null,null,null,null,null,null,null,null,null,null,null,null,null,null,null,{"$f":"(COUNTIF(Tableauété[[#This Row],[11-juil]:[19-août]],\"A\"))+(COUNTIF(Tableauété[[#This Row],[11-juil]:[19-août]],\"F\"))","v":0},{"$f":"(COUNTIF(Tableauété[[#This Row],[11-juil]:[19-août]],\"F\"))","v":0},{"$f":"SUM(Tableauété[[#This Row],[11-juil]:[29-juil]])+Tableauété[[#This Row],[Abscences Facturées]]","v":0},{"$f":"SUM(Tableauété[[#This Row],[01-août]:[19-août]])+Tableauété[[#This Row],[Abscences Facturées]]","v":0},{"$f":"SUM(Tableauété[[#This Row],[Total Juillet]:[Total Août]])","v":0}]
[]
[]
["( Age sélectionné ) SOUS TOTAL JOURNALIER",null,null,null,null,null,null,{"$f":"SUBTOTAL(109,H5:H6)","v":0},0,0,0,0,0,0,0,0,0,0,0,0,0,0,0,0,0,0,0,0,0,0,0,0,0,0,0,0,0,0,0,0,0,0]
["TOTAL JOURNALIER",null,null,null,null,null,null,{"$f":"SUMIF(H5:H6,\"1\")+COUNTIF(H5:H6,\"F\")","v":0},0,0,0,0,0,0,0,0,0,0,0,0,0,0,0,0,0,0,0,0,0,0,0,0,0,0,0,0,0,{"$f":"SUM(AL5:AL6)","v":0},{"$f":"SUM(AM5:AM6)","v":0},{"$f":"SUM(AN5:AN6)","v":0},{"$f":"SUM(AO5:AO6)","v":0},{"$f":"SUM(AP5:AP6)","v":0}]
["ABSENCES",null,null,null,null,null,null,{"$f":"(COUNTIF(H5:H6,\"A\")+COUNTIF(H5:H6,\"F\"))","v":0},0,0,0,0,0,0,0,0,0,0,0,0,0,0,0,0,0,0,0,0,0,0,0,0,0,0,0,0,0]
[" DEMANDE DE RESERVATIONS",null,null,null,null,null,null,{"$f":"COUNTIF(H5:H6,\"0\")","v":0},0,0,0,0,0,0,0,0,0,0,0,0,0,0,0,0,0,0,0,0,0,0,0,0,0,0,0,0,0]

{"sheet":"Emploi du Temps Toussaint","index":20,"n_rows":0,"n_cols":0,"rows_kept":0,"cut":false,"hidden":false,"merged":[]}

{"sheet":"Emploi du Temps Hivers","index":21,"n_rows":13,"n_cols":19,"rows_kept":13,"cut":false,"hidden":false,"merged":[[0,2,0,8],[0,9,0,12],[0,14,0,17],[1,6,1,8],[1,9,1,10],[1,11,1,13],[1,14,1,15],[18,1,18,15],[19,1,19,16],[6,0,6,5],[8,0,8,5],[11,0,11,5],[12,0,12,5],[10,0,10,5],[7,0,7,5],[9,0,9,5]]}
[null,null,{"$f":"MID(CELL(\"filename\",I2),FIND(\"]\",CELL(\"filename\",I2))+1,32)& \" du :\"","v":"Emploi du Temps Hivers du :"},null,null,null,null,null,null,{"$f":"données!B4","v":"2016-02-22"},null,null,null,"AU",{"$f":"données!C4","v":"2016-03-04"}]
[null,null,null,null,null,null,"Semaine :",null,null,{"$f":"WEEKNUM(J1)","v":9},null,"Semaine :",null,null,{"$f":"WEEKNUM(O1)","v":10}]
[null,null,null,null,null,{"$f":"J1-2","v":"2016-02-20"},"Lundi","Mardi","Mercredi","Jeudi","Vendredi","Lundi","Mardi","Mercredi","Jeudi","Vendredi"]
["Nom","Prénom","Diplomes","De 3 à 5 ans","De 6 à 14 ans","Journée de Préparation","22-févr-16","23-févr-16","24-févr-16","25-févr-16","26-févr-16","29-févr-16","01-mars-16","02-mars-16","03-mars-16","04-mars-16","Absences","Congés","Total Global"]
[null,null,null,false,false,false,null,null,null,null,null,null,null,null,null,null,{"$f":"(COUNTIF(Tableau632410[[#This Row],[22-févr-16]:[04-mars-16]],\"A\"))","v":0},{"$f":"(COUNTIF(Tableau632410[[#This Row],[22-févr-16]:[04-mars-16]],\"C\"))","v":0},{"$f":"(COUNTIF(Tableau632410[[#This Row],[22-févr-16]:[04-mars-16]],1))+(COUNTIF(Tableau632410[[#This Row],[Journée de Préparation]],\"VRAI\"))","v":0}]
[null,null,null,false,false,false,null,null,null,null,null,null,null,null,null,null,{"$f":"(COUNTIF(Tableau632410[[#This Row],[22-févr-16]:[04-mars-16]],\"A\"))","v":0},{"$f":"(COUNTIF(Tableau632410[[#This Row],[22-févr-16]:[04-mars-16]],\"C\"))","v":0},{"$f":"(COUNTIF(Tableau632410[[#This Row],[22-févr-16]:[04-mars-16]],1))+(COUNTIF(Tableau632410[[#This Row],[Journée de Préparation]],\"VRAI\"))","v":0}]
["Total Animateurs De 3 à 5 ans :",null,null,null,null,null,{"$f":"SUMIFS(Tableau632410[22-févr-16],Tableau632410[De 3 à 5 ans],\"=VRAI\")","v":0},{"$f":"SUMIFS(Tableau632410[23-févr-16],Tableau632410[De 3 à 5 ans],\"=VRAI\")","v":0},{"$f":"SUMIFS(Tableau632410[24-févr-16],Tableau632410[De 3 à 5 ans],\"=VRAI\")","v":0},{"$f":"SUMIFS(Tableau632410[25-févr-16],Tableau632410[De 3 à 5 ans],\"=VRAI\")","v":0},{"$f":"SUMIFS(Tableau632410[26-févr-16],Tableau632410[De 3 à 5 ans],\"=VRAI\")","v":0},{"$f":"SUMIFS(Tableau632410[29-févr-16],Tableau632410[De 3 à 5 ans],\"=VRAI\")","v":0},{"$f":"SUMIFS(Tableau632410[01-mars-16],Tableau632410[De 3 à 5 ans],\"=VRAI\")","v":0},{"$f":"SUMIFS(Tableau632410[02-mars-16],Tableau632410[De 3 à 5 ans],\"=VRAI\")","v":0},{"$f":"SUMIFS(Tableau632410[03-mars-16],Tableau632410[De 3 à 5 ans],\"=VRAI\")","v":0},{"$f":"SUMIFS(Tableau632410[04-mars-16],Tableau632410[De 3 à 5 ans],\"=VRAI\")","v":0}]
["Présences Enfants De 3 à 5 ans :",null,null,null,null,null,{"$f":"SUMIFS(Tableauhivers[22-févr-16],Tableauhivers[Age],\"<6\")","v":5},{"$f":"SUMIFS(Tableauhivers[23-févr-16],Tableauhivers[Age],\"<6\")","v":4},{"$f":"SUMIFS(Tableauhivers[24-févr-16],Tableauhivers[Age],\"<6\")","v":5},{"$f":"SUMIFS(Tableauhivers[25-févr-16],Tableauhivers[Age],\"<6\")","v":5},{"$f":"SUMIFS(Tableauhivers[26-févr-16],Tableauhivers[Age],\"<6\")","v":5},{"$f":"SUMIFS(Tableauhivers[29-févr-16],Tableauhivers[Age],\"<6\")","v":2},{"$f":"SUMIFS(Tableauhivers[01-mars-16],Tableauhivers[Age],\"<6\")","v":2},{"$f":"SUMIFS(Tableauhivers[02-mars-16],Tableauhivers[Age],\"<6\")","v":2},{"$f":"SUMIFS(Tableauhivers[03-mars-16],Tableauhivers[Age],\"<6\")","v":2},{"$f":"SUMIFS(Tableauhivers[04-mars-16],Tableauhivers[Age],\"<6\")","v":2}]
["Total Animateurs De 6 à 14 ans :",null,null,null,null,null,{"$f":"SUMIFS(Tableau632410[22-févr-16],Tableau632410[De 6 à 14 ans],\"=VRAI\")","v":0},{"$f":"SUMIFS(Tableau632410[23-févr-16],Tableau632410[De 6 à 14 ans],\"=VRAI\")","v":0},{"$f":"SUMIFS(Tableau632410[24-févr-16],Tableau632410[De 6 à 14 ans],\"=VRAI\")","v":0},{"$f":"SUMIFS(Tableau632410[25-févr-16],Tableau632410[De 6 à 14 ans],\"=VRAI\")","v":0},{"$f":"SUMIFS(Tableau632410[26-févr-16],Tableau632410[De 6 à 14 ans],\"=VRAI\")","v":0},{"$f":"SUMIFS(Tableau632410[29-févr-16],Tableau632410[De 6 à 14 ans],\"=VRAI\")","v":0},{"$f":"SUMIFS(Tableau632410[01-mars-16],Tableau632410[De 6 à 14 ans],\"=VRAI\")","v":0},{"$f":"SUMIFS(Tableau632410[02-mars-16],Tableau632410[De 6 à 14 ans],\"=VRAI\")","v":0},{"$f":"SUMIFS(Tableau632410[03-mars-16],Tableau632410[De 6 à 14 ans],\"=VRAI\")","v":0},{"$f":"SUMIFS(Tableau632410[04-mars-16],Tableau632410[De 6 à 14 ans],\"=VRAI\")","v":0}]
["Présences Enfants De 6 à 14 ans :",null,null,null,null,null,{"$f":"SUMIFS(Tableauhivers[22-févr-16],Tableauhivers[Age],\">=6\")","v":5},{"$f":"SUMIFS(Tableauhivers[23-févr-16],Tableauhivers[Age],\">=6\")","v":4},{"$f":"SUMIFS(Tableauhivers[24-févr-16],Tableauhivers[Age],\">=6\")","v":7},{"$f":"SUMIFS(Tableauhivers[25-févr-16],Tableauhivers[Age],\">=6\")","v":5},{"$f":"SUMIFS(Tableauhivers[26-févr-16],Tableauhivers[Age],\">=6\")","v":5},{"$f":"SUMIFS(Tableauhivers[29-févr-16],Tableauhivers[Age],\">=6\")","v":1},{"$f":"SUMIFS(Tableauhivers[01-mars-16],Tableauhivers[Age],\">=6\")","v":1},{"$f":"SUMIFS(Tableauhivers[02-mars-16],Tableauhivers[Age],\">=6\")","v":1},{"$f":"SUMIFS(Tableauhivers[03-mars-16],Tableauhivers[Age],\">=6\")","v":1},{"$f":"SUMIFS(Tableauhivers[04-mars-16],Tableauhivers[Age],\">=6\")","v":1}]
["TOTAL ANIMATEURS",null,null,null,null,null,{"$f":"SUM(Tableau632410[22-févr-16])","v":0},{"$f":"SUM(Tableau632410[23-févr-16])","v":0},{"$f":"SUM(Tableau632410[24-févr-16])","v":0},{"$f":"SUM(Tableau632410[25-févr-16])","v":0},{"$f":"SUM(Tableau632410[26-févr-16])","v":0},{"$f":"SUM(Tableau632410[29-févr-16])","v":0},{"$f":"SUM(Tableau632410[01-mars-16])","v":0},{"$f":"SUM(Tableau632410[02-mars-16])","v":0},{"$f":"SUM(Tableau632410[03-mars-16])","v":0},{"$f":"SUM(Tableau632410[04-mars-16])","v":0}]
["Abscences",null,null,null,null,null,{"$f":"COUNTIF(G5:G6,\"A\")","v":0},0,0,0,0,0,0,0,0,0]
["Congés",null,null,null,null,null,{"$f":"COUNTIF(G5:G6,\"C\")","v":0},0,0,0,0,0,0,0,0,0]

{"sheet":"Emploi du Temps Pâques","index":22,"n_rows":0,"n_cols":0,"rows_kept":0,"cut":false,"hidden":false,"merged":[]}

{"sheet":"Emploi du Temps Juillet","index":23,"n_rows":0,"n_cols":0,"rows_kept":0,"cut":false,"hidden":false,"merged":[]}

{"sheet":"Emploi du Temps Août","index":24,"n_rows":0,"n_cols":0,"rows_kept":0,"cut":false,"hidden":false,"merged":[]}

{"sheet":"Camp 1","index":25,"n_rows":0,"n_cols":0,"rows_kept":0,"cut":false,"hidden":false,"merged":[]}

{"sheet":"Camp 2","index":26,"n_rows":0,"n_cols":0,"rows_kept":0,"cut":false,"hidden":false,"merged":[]}

{"sheet":"Camp 3","index":27,"n_rows":0,"n_cols":0,"rows_kept":0,"cut":false,"hidden":false,"merged":[]}

{"sheet":"Appel Journalier 3-5 ans","index":28,"n_rows":6,"n_cols":7,"rows_kept":6,"cut":false,"hidden":false,"merged":[[0,0,0,6]]}
["Appel Journalier 3-5 ans du 11 juillet 2016"]
[]
["Nom","Prénom","Date de Naissance","Age","Allergie Alimentaire","Autre Allergie","Remarque"]
[]
["Totaux","Présent",0]
[null,"Total Enfant",0]

{"sheet":"Appel Journalier 6-8 ans","index":29,"n_rows":6,"n_cols":7,"rows_kept":6,"cut":false,"hidden":false,"merged":[[0,0,0,6]]}
["Appel Journalier 6-8 ans du 11 juillet 2016"]
[]
["Nom","Prénom","Date de Naissance","Age","Allergie Alimentaire","Autre Allergie","Remarque"]
[]
["Totaux","Présent",0]
[null,"Total Enfant",0]

{"sheet":"Appel Journalier 9-13 ans","index":30,"n_rows":6,"n_cols":7,"rows_kept":6,"cut":false,"hidden":false,"merged":[[0,0,0,6]]}
["Appel Journalier 9-13 ans du 11 juillet 2016"]
[]
["Nom","Prénom","Date de Naissance","Age","Allergie Alimentaire","Autre Allergie","Remarque"]
[]
["Totaux","Présent",0]
[null,"Total Enfant",0]

{"sheet":"Resto Toussaint","index":31,"n_rows":23,"n_cols":12,"rows_kept":23,"cut":false,"hidden":false,"merged":[[16,16,17,16],[0,0,0,16],[16,9,17,9],[16,10,17,10],[16,11,17,11],[16,12,17,12],[16,13,17,13],[16,14,17,14],[15,0,15,8],[15,9,15,16],[16,0,17,0],[16,1,17,1],[16,2,16,3],[16,4,17,4],[16,5,17,5],[16,6,17,6],[16,7,17,7],[16,8,17,8],[5,14,6,14],[5,15,6,15],[16,15,17,15],[13,9,13,10],[13,0,13,3],[5,8,6,8],[5,9,6,9],[5,10,6,10],[5,11,6,11],[5,2,5,3],[5,0,6,0],[5,4,6,4],[5,5,6,5],[5,6,6,6],[5,7,6,7],[4,0,4,8],[4,9,4,16],[5,16,6,16],[5,1,6,1],[2,0,2,3],[5,12,6,12],[5,13,6,13],[2,9,2,10]]}
["Prévisionnel Resto. ALSH « Les Alzouzous » (06-77-26-01-97)"]
[]
["Semaine n°",null,null,null,{"$f":"WEEKNUM(G3)","v":43},"Du",{"$f":"données!B2","v":"2015-10-19"},"au",{"$f":"G3+4","v":"2015-10-23"},{"$f":"Accueil!C18+1","v":2016}]
[]
["EFFECTIFS",null,null,null,null,null,null,null,null,"ALLERGIES ET REGIMES"]
["JOURS","DATES","Pique Niques ?",null,"Moins de 6 ans","Plus de\n6 ans","Adultes","Total Pique niques","Total Repas","Vétarien","Sans Porc","Sans Aïl Oignon Echalote Champignon"]
[null,null,"Moins de\n 6 ans","Plus de \n6 ans"]
["LUNDI",{"$f":"G3","v":"2015-10-19"},false,false,{"$f":"SUMIFS(Tableautoussaint[19-oct-15],Tableautoussaint[Age],\"<6\")","v":14},{"$f":"SUMIFS(Tableautoussaint[19-oct-15],Tableautoussaint[Age],\">=6\")","v":10},null,{"$f":"SUMIFS(E8,C8,\"vrai\")+SUMIFS(F8,D8,\"vrai\")+G8","v":0},{"$f":"G8+F8+E8-H8","v":24},{"$f":"SUMPRODUCT((Tableautoussaint[19-oct-15]=1)*(#REF!=1)*(#REF!))","v":{"$error":"#REF!"}},{"$f":"SUMPRODUCT((Tableautoussaint[19-oct-15]=1)*(#REF!=1)*(#REF!))","v":{"$error":"#REF!"}},{"$f":"SUMPRODUCT((Tableautoussaint[19-oct-15]=1)*(#REF!=1)*(#REF!))","v":{"$error":"#REF!"}}]
["MARDI",{"$f":"B8+1","v":"2015-10-20"},false,false,{"$f":"SUMIFS(Tableautoussaint[20-oct-15],Tableautoussaint[Age],\"<6\")","v":18},{"$f":"SUMIFS(Tableautoussaint[20-oct-15],Tableautoussaint[Age],\">=6\")","v":18},null,{"$f":"SUMIFS(E9,C9,\"vrai\")+SUMIFS(F9,D9,\"vrai\")+G9","v":0},{"$f":"G9+F9+E9-H9","v":36},{"$f":"SUMPRODUCT((Tableautoussaint[20-oct-15]=1)*(#REF!=1)*(#REF!))","v":{"$error":"#REF!"}},{"$f":"SUMPRODUCT((Tableautoussaint[20-oct-15]=1)*(#REF!=1)*(#REF!))","v":{"$error":"#REF!"}},{"$f":"SUMPRODUCT((Tableautoussaint[20-oct-15]=1)*(#REF!=1)*(#REF!))","v":{"$error":"#REF!"}}]
["MERCREDI",{"$f":"B9+1","v":"2015-10-21"},false,false,{"$f":"SUMIFS(Tableautoussaint[21-oct-15],Tableautoussaint[Age],\"<6\")","v":10},{"$f":"SUMIFS(Tableautoussaint[21-oct-15],Tableautoussaint[Age],\">=6\")","v":14},null,{"$f":"SUMIFS(E10,C10,\"vrai\")+SUMIFS(F10,D10,\"vrai\")+G10","v":0},{"$f":"G10+F10+E10-H10","v":24},{"$f":"SUMPRODUCT((Tableautoussaint[21-oct-15]=1)*(#REF!=1)*(#REF!))","v":{"$error":"#REF!"}},{"$f":"SUMPRODUCT((Tableautoussaint[21-oct-15]=1)*(#REF!=1)*(#REF!))","v":{"$error":"#REF!"}},{"$f":"SUMPRODUCT((Tableautoussaint[21-oct-15]=1)*(#REF!=1)*(#REF!))","v":{"$error":"#REF!"}}]
["JEUDI",{"$f":"B10+1","v":"2015-10-22"},false,false,{"$f":"SUMIFS(Tableautoussaint[22-oct-15],Tableautoussaint[Age],\"<6\")","v":13},{"$f":"SUMIFS(Tableautoussaint[22-oct-15],Tableautoussaint[Age],\">=6\")","v":12},null,{"$f":"SUMIFS(E11,C11,\"vrai\")+SUMIFS(F11,D11,\"vrai\")+G11","v":0},{"$f":"G11+F11+E11-H11","v":25},{"$f":"SUMPRODUCT((Tableautoussaint[22-oct-15]=1)*(#REF!=1)*(#REF!))","v":{"$error":"#REF!"}},{"$f":"SUMPRODUCT((Tableautoussaint[22-oct-15]=1)*(#REF!=1)*(#REF!))","v":{"$error":"#REF!"}},{"$f":"SUMPRODUCT((Tableautoussaint[22-oct-15]=1)*(#REF!=1)*(#REF!))","v":{"$error":"#REF!"}}]
["VENDREDI",{"$f":"B11+1","v":"2015-10-23"},false,false,{"$f":"SUMIFS(Tableautoussaint[23-oct-15],Tableautoussaint[Age],\"<6\")","v":15},{"$f":"SUMIFS(Tableautoussaint[23-oct-15],Tableautoussaint[Age],\">=6\")","v":16},null,{"$f":"SUMIFS(E12,C12,\"vrai\")+SUMIFS(F12,D12,\"vrai\")+G12","v":0},{"$f":"G12+F12+E12-H12","v":31},{"$f":"SUMPRODUCT((Tableautoussaint[23-oct-15]=1)*(#REF!=1)*(#REF!))","v":{"$error":"#REF!"}},{"$f":"SUMPRODUCT((Tableautoussaint[23-oct-15]=1)*(#REF!=1)*(#REF!))","v":{"$error":"#REF!"}},{"$f":"SUMPRODUCT((Tableautoussaint[23-oct-15]=1)*(#REF!=1)*(#REF!))","v":{"$error":"#REF!"}}]
[]
["Semaine n°",null,null,null,{"$f":"WEEKNUM(G14)","v":44},"Du",{"$f":"I3+3","v":"2015-10-26"},"au",{"$f":"G14+4","v":"2015-10-30"},{"$f":"Accueil!C18+1","v":2016}]
[]
["EFFECTIFS",null,null,null,null,null,null,null,null,"ALLERGIES ET REGIMES"]
["JOURS","DATES","Pique Niques ?",null,"Moins de 6 ans","Plus de\n6 ans","Adultes","Total Pique niques","Total Repas","Vétarien","Sans Porc","Sans Aïl Oignon Echalote Champignon"]
[null,null,"Moins de\n 6 ans","Plus de \n6 ans"]
["LUNDI",{"$f":"G14","v":"2015-10-26"},false,false,{"$f":"SUMIFS(Tableautoussaint[26-oct-15],Tableautoussaint[Age],\"<6\")","v":13},{"$f":"SUMIFS(Tableautoussaint[26-oct-15],Tableautoussaint[Age],\">=6\")","v":16},null,{"$f":"SUMIFS(E19,C19,\"vrai\")+SUMIFS(F19,D19,\"vrai\")+G19","v":0},{"$f":"G19+F19+E19-H19","v":29},{"$f":"SUMPRODUCT((Tableautoussaint[26-oct-15]=1)*(#REF!=1)*(#REF!))","v":{"$error":"#REF!"}},{"$f":"SUMPRODUCT((Tableautoussaint[26-oct-15]=1)*(#REF!=1)*(#REF!))","v":{"$error":"#REF!"}},{"$f":"SUMPRODUCT((Tableautoussaint[26-oct-15]=1)*(#REF!=1)*(#REF!))","v":{"$error":"#REF!"}}]
["MARDI",{"$f":"B19+1","v":"2015-10-27"},false,false,{"$f":"SUMIFS(Tableautoussaint[27-oct-15],Tableautoussaint[Age],\"<6\")","v":11},{"$f":"SUMIFS(Tableautoussaint[27-oct-15],Tableautoussaint[Age],\">=6\")","v":17},null,{"$f":"SUMIFS(E20,C20,\"vrai\")+SUMIFS(F20,D20,\"vrai\")+G20","v":0},{"$f":"G20+F20+E20-H20","v":28},{"$f":"SUMPRODUCT((Tableautoussaint[27-oct-15]=1)*(#REF!=1)*(#REF!))","v":{"$error":"#REF!"}},{"$f":"SUMPRODUCT((Tableautoussaint[27-oct-15]=1)*(#REF!=1)*(#REF!))","v":{"$error":"#REF!"}},{"$f":"SUMPRODUCT((Tableautoussaint[27-oct-15]=1)*(#REF!=1)*(#REF!))","v":{"$error":"#REF!"}}]
["MERCREDI",{"$f":"B20+1","v":"2015-10-28"},false,false,{"$f":"SUMIFS(Tableautoussaint[28-oct-15],Tableautoussaint[Age],\"<6\")","v":8},{"$f":"SUMIFS(Tableautoussaint[28-oct-15],Tableautoussaint[Age],\">=6\")","v":7},null,{"$f":"SUMIFS(E21,C21,\"vrai\")+SUMIFS(F21,D21,\"vrai\")+G21","v":0},{"$f":"G21+F21+E21-H21","v":15},{"$f":"SUMPRODUCT((Tableautoussaint[28-oct-15]=1)*(#REF!=1)*(#REF!))","v":{"$error":"#REF!"}},{"$f":"SUMPRODUCT((Tableautoussaint[28-oct-15]=1)*(#REF!=1)*(#REF!))","v":{"$error":"#REF!"}},{"$f":"SUMPRODUCT((Tableautoussaint[28-oct-15]=1)*(#REF!=1)*(#REF!))","v":{"$error":"#REF!"}}]
["JEUDI",{"$f":"B21+1","v":"2015-10-29"},false,false,{"$f":"SUMIFS(Tableautoussaint[29-oct-15],Tableautoussaint[Age],\"<6\")","v":16},{"$f":"SUMIFS(Tableautoussaint[29-oct-15],Tableautoussaint[Age],\">=6\")","v":20},null,{"$f":"SUMIFS(E22,C22,\"vrai\")+SUMIFS(F22,D22,\"vrai\")+G22","v":0},{"$f":"G22+F22+E22-H22","v":36},{"$f":"SUMPRODUCT((Tableautoussaint[29-oct-15]=1)*(#REF!=1)*(#REF!))","v":{"$error":"#REF!"}},{"$f":"SUMPRODUCT((Tableautoussaint[29-oct-15]=1)*(#REF!=1)*(#REF!))","v":{"$error":"#REF!"}},{"$f":"SUMPRODUCT((Tableautoussaint[29-oct-15]=1)*(#REF!=1)*(#REF!))","v":{"$error":"#REF!"}}]
["VENDREDI",{"$f":"B22+1","v":"2015-10-30"},false,false,{"$f":"SUMIFS(Tableautoussaint[30-oct-15],Tableautoussaint[Age],\"<6\")","v":10},{"$f":"SUMIFS(Tableautoussaint[30-oct-15],Tableautoussaint[Age],\">=6\")","v":16},null,{"$f":"SUMIFS(E23,C23,\"vrai\")+SUMIFS(F23,D23,\"vrai\")+G23","v":0},{"$f":"G23+F23+E23-H23","v":26},{"$f":"SUMPRODUCT((Tableautoussaint[30-oct-15]=1)*(#REF!=1)*(#REF!))","v":{"$error":"#REF!"}},{"$f":"SUMPRODUCT((Tableautoussaint[30-oct-15]=1)*(#REF!=1)*(#REF!))","v":{"$error":"#REF!"}},{"$f":"SUMPRODUCT((Tableautoussaint[30-oct-15]=1)*(#REF!=1)*(#REF!))","v":{"$error":"#REF!"}}]

{"sheet":"Resto Hivers","index":32,"n_rows":23,"n_cols":12,"rows_kept":23,"cut":false,"hidden":false,"merged":[[16,0,17,0],[16,1,17,1],[16,2,16,3],[16,4,17,4],[16,5,17,5],[16,6,17,6],[5,13,6,13],[5,14,6,14],[5,15,6,15],[5,16,6,16],[16,13,17,13],[16,14,17,14],[16,15,17,15],[16,16,17,16],[16,7,17,7],[16,8,17,8],[16,9,17,9],[16,10,17,10],[16,11,17,11],[16,12,17,12],[13,9,13,10],[13,0,13,3],[15,0,15,8],[15,9,15,16],[5,7,6,7],[5,8,6,8],[5,9,6,9],[5,10,6,10],[5,11,6,11],[5,12,6,12],[0,0,0,16],[2,0,2,3],[4,0,4,8],[4,9,4,16],[5,0,6,0],[5,1,6,1],[5,2,5,3],[5,4,6,4],[5,5,6,5],[5,6,6,6],[2,9,2,10]]}
["Prévisionnel Resto. ALSH « Les Alzouzous » (06-77-26-01-97)"]
[]
["Semaine n°",null,null,null,{"$f":"WEEKNUM(G3)","v":9},"Du",{"$f":"données!B4","v":"2016-02-22"},"au",{"$f":"G3+4","v":"2016-02-26"},{"$f":"Accueil!C18+1","v":2016}]
[]
["EFFECTIFS",null,null,null,null,null,null,null,null,"ALLERGIES ET REGIMES"]
["JOURS","DATES","Pique Niques ?",null,"Moins de 6 ans","Plus de\n6 ans","Adultes","Total Pique niques","Total Repas","Vétarien","Sans Porc","Sans Aïl Oignon Echalote Champignon"]
[null,null,"Moins de\n 6 ans","Plus de \n6 ans"]
["LUNDI",{"$f":"G3","v":"2016-02-22"},false,false,{"$f":"SUMIFS(Tableauhivers[22-févr-16],Tableauhivers[Age],\"<6\")","v":5},{"$f":"SUMIFS(Tableauhivers[22-févr-16],Tableauhivers[Age],\">=6\")","v":5},{"$f":"SUM(Tableau632410[22-févr-16])","v":0},{"$f":"SUMIFS(E8,C8,\"vrai\")+SUMIFS(F8,D8,\"vrai\")+SUMIFS('Emploi du Temps Hivers'!G7,C8,\"vrai\")+SUMIFS('Emploi du Temps Hivers'!G9,D8,\"vrai\")","v":0},{"$f":"G8+F8+E8-H8","v":10},{"$f":"SUMPRODUCT((Tableauhivers[22-févr-16]=1)*(#REF!=1)*(#REF!))","v":{"$error":"#REF!"}},{"$f":"SUMPRODUCT((Tableauhivers[22-févr-16]=1)*(#REF!=1)*(#REF!))","v":{"$error":"#REF!"}},{"$f":"SUMPRODUCT((Tableauhivers[22-févr-16]=1)*(#REF!=1)*(#REF!))","v":{"$error":"#REF!"}}]
["MARDI",{"$f":"B8+1","v":"2016-02-23"},false,false,{"$f":"SUMIFS(Tableauhivers[23-févr-16],Tableauhivers[Age],\"<6\")","v":4},{"$f":"SUMIFS(Tableauhivers[23-févr-16],Tableauhivers[Age],\">=6\")","v":4},{"$f":"SUM(Tableau632410[23-févr-16])","v":0},{"$f":"SUMIFS(E9,C9,\"vrai\")+SUMIFS(F9,D9,\"vrai\")+SUMIFS('Emploi du Temps Hivers'!H7,C9,\"vrai\")+SUMIFS('Emploi du Temps Hivers'!H9,D9,\"vrai\")","v":0},{"$f":"G9+F9+E9-H9","v":8},{"$f":"SUMPRODUCT((Tableauhivers[23-févr-16]=1)*(#REF!=1)*(#REF!))","v":{"$error":"#REF!"}},{"$f":"SUMPRODUCT((Tableauhivers[23-févr-16]=1)*(#REF!=1)*(#REF!))","v":{"$error":"#REF!"}},{"$f":"SUMPRODUCT((Tableauhivers[23-févr-16]=1)*(#REF!=1)*(#REF!))","v":{"$error":"#REF!"}}]
["MERCREDI",{"$f":"B9+1","v":"2016-02-24"},false,false,{"$f":"SUMIFS(Tableauhivers[24-févr-16],Tableauhivers[Age],\"<6\")","v":5},{"$f":"SUMIFS(Tableauhivers[24-févr-16],Tableauhivers[Age],\">=6\")","v":7},{"$f":"SUM(Tableau632410[24-févr-16])","v":0},{"$f":"SUMIFS(E10,C10,\"vrai\")+SUMIFS(F10,D10,\"vrai\")+SUMIFS('Emploi du Temps Hivers'!I7,C10,\"vrai\")+SUMIFS('Emploi du Temps Hivers'!I9,D10,\"vrai\")","v":0},{"$f":"G10+F10+E10-H10","v":12},{"$f":"SUMPRODUCT((Tableauhivers[24-févr-16]=1)*(#REF!=1)*(#REF!))","v":{"$error":"#REF!"}},{"$f":"SUMPRODUCT((Tableauhivers[24-févr-16]=1)*(#REF!=1)*(#REF!))","v":{"$error":"#REF!"}},{"$f":"SUMPRODUCT((Tableauhivers[24-févr-16]=1)*(#REF!=1)*(#REF!))","v":{"$error":"#REF!"}}]
["JEUDI",{"$f":"B10+1","v":"2016-02-25"},false,false,{"$f":"SUMIFS(Tableauhivers[25-févr-16],Tableauhivers[Age],\"<6\")","v":5},{"$f":"SUMIFS(Tableauhivers[25-févr-16],Tableauhivers[Age],\">=6\")","v":5},{"$f":"SUM(Tableau632410[25-févr-16])","v":0},{"$f":"SUMIFS(E11,C11,\"vrai\")+SUMIFS(F11,D11,\"vrai\")+SUMIFS('Emploi du Temps Hivers'!J7,C11,\"vrai\")+SUMIFS('Emploi du Temps Hivers'!J9,D11,\"vrai\")","v":0},{"$f":"G11+F11+E11-H11","v":10},{"$f":"SUMPRODUCT((Tableauhivers[25-févr-16]=1)*(#REF!=1)*(#REF!))","v":{"$error":"#REF!"}},{"$f":"SUMPRODUCT((Tableauhivers[25-févr-16]=1)*(#REF!=1)*(#REF!))","v":{"$error":"#REF!"}},{"$f":"SUMPRODUCT((Tableauhivers[25-févr-16]=1)*(#REF!=1)*(#REF!))","v":{"$error":"#REF!"}}]
["VENDREDI",{"$f":"B11+1","v":"2016-02-26"},false,false,{"$f":"SUMIFS(Tableauhivers[26-févr-16],Tableauhivers[Age],\"<6\")","v":5},{"$f":"SUMIFS(Tableauhivers[26-févr-16],Tableauhivers[Age],\">=6\")","v":5},{"$f":"SUM(Tableau632410[26-févr-16])","v":0},{"$f":"SUMIFS(E12,C12,\"vrai\")+SUMIFS(F12,D12,\"vrai\")+SUMIFS('Emploi du Temps Hivers'!K7,C12,\"vrai\")+SUMIFS('Emploi du Temps Hivers'!K9,D12,\"vrai\")","v":0},{"$f":"G12+F12+E12-H12","v":10},{"$f":"SUMPRODUCT((Tableauhivers[26-févr-16]=1)*(#REF!=1)*(#REF!))","v":{"$error":"#REF!"}},{"$f":"SUMPRODUCT((Tableauhivers[26-févr-16]=1)*(#REF!=1)*(#REF!))","v":{"$error":"#REF!"}},{"$f":"SUMPRODUCT((Tableauhivers[26-févr-16]=1)*(#REF!=1)*(#REF!))","v":{"$error":"#REF!"}}]
[]
["Semaine n°",null,null,null,{"$f":"WEEKNUM(G14)","v":10},"Du",{"$f":"I3+3","v":"2016-02-29"},"au",{"$f":"G14+4","v":"2016-03-04"},{"$f":"Accueil!C18+1","v":2016}]
[]
["EFFECTIFS",null,null,null,null,null,null,null,null,"ALLERGIES ET REGIMES"]
["JOURS","DATES","Pique Niques ?",null,"Moins de 6 ans","Plus de\n6 ans","Adultes","Total Pique niques","Total Repas","Vétarien","Sans Porc","Sans Aïl Oignon Echalote Champignon"]
[null,null,"Moins de\n 6 ans","Plus de \n6 ans"]
["LUNDI",{"$f":"G14","v":"2016-02-29"},false,false,{"$f":"SUMIFS(Tableauhivers[29-févr-16],Tableauhivers[Age],\"<6\")","v":2},{"$f":"SUMIFS(Tableauhivers[29-févr-16],Tableauhivers[Age],\">=6\")","v":1},{"$f":"SUM(Tableau632410[29-févr-16])","v":0},{"$f":"SUMIFS(E19,C19,\"vrai\")+SUMIFS(F19,D19,\"vrai\")+SUMIFS('Emploi du Temps Hivers'!L7,C19,\"vrai\")+SUMIFS('Emploi du Temps Hivers'!L9,D19,\"vrai\")","v":0},{"$f":"G19+F19+E19-H19","v":3},{"$f":"SUMPRODUCT((Tableauhivers[29-févr-16]=1)*(#REF!=1)*(#REF!))","v":{"$error":"#REF!"}},{"$f":"SUMPRODUCT((Tableauhivers[29-févr-16]=1)*(#REF!=1)*(#REF!))","v":{"$error":"#REF!"}},{"$f":"SUMPRODUCT((Tableauhivers[29-févr-16]=1)*(#REF!=1)*(#REF!))","v":{"$error":"#REF!"}}]
["MARDI",{"$f":"B19+1","v":"2016-03-01"},false,false,{"$f":"SUMIFS(Tableauhivers[02-mars-16],Tableauhivers[Age],\"<6\")","v":2},{"$f":"SUMIFS(Tableauhivers[01-mars-16],Tableauhivers[Age],\"<=6\")","v":2},{"$f":"SUM(Tableau632410[01-mars-16])","v":0},{"$f":"SUMIFS(E20,C20,\"vrai\")+SUMIFS(F20,D20,\"vrai\")+SUMIFS('Emploi du Temps Hivers'!M7,C20,\"vrai\")+SUMIFS('Emploi du Temps Hivers'!M9,D20,\"vrai\")","v":0},{"$f":"G20+F20+E20-H20","v":4},{"$f":"SUMPRODUCT((Tableauhivers[01-mars-16]=1)*(#REF!=1)*(#REF!))","v":{"$error":"#REF!"}},{"$f":"SUMPRODUCT((Tableauhivers[01-mars-16]=1)*(#REF!=1)*(#REF!))","v":{"$error":"#REF!"}},{"$f":"SUMPRODUCT((Tableauhivers[01-mars-16]=1)*(#REF!=1)*(#REF!))","v":{"$error":"#REF!"}}]
["MERCREDI",{"$f":"B20+1","v":"2016-03-02"},false,false,{"$f":"SUMIFS(Tableauhivers[02-mars-16],Tableauhivers[Age],\"<6\")","v":2},{"$f":"SUMIFS(Tableauhivers[02-mars-16],Tableauhivers[Age],\"<=6\")","v":2},{"$f":"SUM(Tableau632410[02-mars-16])","v":0},{"$f":"SUMIFS(E21,C21,\"vrai\")+SUMIFS(F21,D21,\"vrai\")+SUMIFS('Emploi du Temps Hivers'!N7,C21,\"vrai\")+SUMIFS('Emploi du Temps Hivers'!N9,D21,\"vrai\")","v":0},{"$f":"G21+F21+E21-H21","v":4},{"$f":"SUMPRODUCT((Tableauhivers[02-mars-16]=1)*(#REF!=1)*(#REF!))","v":{"$error":"#REF!"}},{"$f":"SUMPRODUCT((Tableauhivers[02-mars-16]=1)*(#REF!=1)*(#REF!))","v":{"$error":"#REF!"}},{"$f":"SUMPRODUCT((Tableauhivers[02-mars-16]=1)*(#REF!=1)*(#REF!))","v":{"$error":"#REF!"}}]
["JEUDI",{"$f":"B21+1","v":"2016-03-03"},false,false,{"$f":"SUMIFS(Tableauhivers[03-mars-16],Tableauhivers[Age],\"<6\")","v":2},{"$f":"SUMIFS(Tableauhivers[03-mars-16],Tableauhivers[Age],\"<=6\")","v":2},{"$f":"SUM(Tableau632410[03-mars-16])","v":0},{"$f":"SUMIFS(E22,C22,\"vrai\")+SUMIFS(F22,D22,\"vrai\")+SUMIFS('Emploi du Temps Hivers'!O7,C22,\"vrai\")+SUMIFS('Emploi du Temps Hivers'!O9,D22,\"vrai\")","v":0},{"$f":"G22+F22+E22-H22","v":4},{"$f":"SUMPRODUCT((Tableauhivers[03-mars-16]=1)*(#REF!=1)*(#REF!))","v":{"$error":"#REF!"}},{"$f":"SUMPRODUCT((Tableauhivers[03-mars-16]=1)*(#REF!=1)*(#REF!))","v":{"$error":"#REF!"}},{"$f":"SUMPRODUCT((Tableauhivers[03-mars-16]=1)*(#REF!=1)*(#REF!))","v":{"$error":"#REF!"}}]
["VENDREDI",{"$f":"B22+1","v":"2016-03-04"},false,false,{"$f":"SUMIFS(Tableauhivers[04-mars-16],Tableauhivers[Age],\"<6\")","v":2},{"$f":"SUMIFS(Tableauhivers[04-mars-16],Tableauhivers[Age],\"<=6\")","v":2},{"$f":"SUM(Tableau632410[04-mars-16])","v":0},{"$f":"SUMIFS(E23,C23,\"vrai\")+SUMIFS(F23,D23,\"vrai\")+SUMIFS('Emploi du Temps Hivers'!P7,C23,\"vrai\")+SUMIFS('Emploi du Temps Hivers'!P9,D23,\"vrai\")","v":0},{"$f":"G23+F23+E23-H23","v":4},{"$f":"SUMPRODUCT((Tableauhivers[04-mars-16]=1)*(#REF!=1)*(#REF!))","v":{"$error":"#REF!"}},{"$f":"SUMPRODUCT((Tableauhivers[04-mars-16]=1)*(#REF!=1)*(#REF!))","v":{"$error":"#REF!"}},{"$f":"SUMPRODUCT((Tableauhivers[04-mars-16]=1)*(#REF!=1)*(#REF!))","v":{"$error":"#REF!"}}]

{"sheet":"Resto Pâques","index":33,"n_rows":23,"n_cols":12,"rows_kept":23,"cut":false,"hidden":false,"merged":[[0,0,0,16],[2,0,2,3],[4,0,4,8],[4,9,4,16],[5,0,6,0],[5,1,6,1],[5,2,5,3],[5,4,6,4],[5,5,6,5],[5,6,6,6],[2,9,2,10],[13,0,13,3],[15,0,15,8],[15,9,15,16],[5,7,6,7],[5,8,6,8],[5,9,6,9],[5,10,6,10],[5,11,6,11],[5,12,6,12],[13,9,13,10],[16,6,17,6],[5,13,6,13],[5,14,6,14],[5,15,6,15],[5,16,6,16],[16,13,17,13],[16,14,17,14],[16,15,17,15],[16,16,17,16],[16,7,17,7],[16,8,17,8],[16,9,17,9],[16,10,17,10],[16,11,17,11],[16,12,17,12],[16,0,17,0],[16,1,17,1],[16,2,16,3],[16,4,17,4],[16,5,17,5]]}
["Prévisionnel Resto. ALSH « Les Alzouzous » (06-77-26-01-97)"]
[]
["Semaine n°",null,null,null,{"$f":"WEEKNUM(G3)","v":17},"Du",{"$f":"données!B5","v":"2016-04-18"},"au",{"$f":"G3+4","v":"2016-04-22"},{"$f":"Accueil!C18+1","v":2016}]
[]
["EFFECTIFS",null,null,null,null,null,null,null,null,"ALLERGIES ET REGIMES"]
["JOURS","DATES","Pique Niques ?",null,"Moins de 6 ans","Plus de\n6 ans","Adultes","Total Pique niques","Total Repas","Vétarien","Sans Porc","Sans Aïl Oignon Echalote Champignon"]
[null,null,"Moins de\n 6 ans","Plus de \n6 ans"]
["LUNDI",{"$f":"G3","v":"2016-04-18"},false,false,{"$f":"SUMIFS(Tableaupaques[18-avr-16],Tableaupaques[Age],\"<6\")","v":0},{"$f":"SUMIFS(Tableaupaques[18-avr-16],Tableaupaques[Age],\">=6\")","v":0},null,{"$f":"SUMIFS(E8,C8,\"vrai\")+SUMIFS(F8,D8,\"vrai\")+G8","v":0},{"$f":"G8+F8+E8-H8","v":0},{"$f":"SUMPRODUCT((Tableautoussaint[19-oct-15]=1)*(#REF!=1)*(#REF!))","v":{"$error":"#REF!"}},{"$f":"SUMPRODUCT((Tableautoussaint[19-oct-15]=1)*(#REF!=1)*(#REF!))","v":{"$error":"#REF!"}},{"$f":"SUMPRODUCT((Tableautoussaint[19-oct-15]=1)*(#REF!=1)*(#REF!))","v":{"$error":"#REF!"}}]
["MARDI",{"$f":"B8+1","v":"2016-04-19"},false,false,{"$f":"SUMIFS(Tableaupaques[19-avr-16],Tableaupaques[Age],\"<6\")","v":0},{"$f":"SUMIFS(Tableaupaques[19-avr-16],Tableaupaques[Age],\">=6\")","v":0},null,{"$f":"SUMIFS(E9,C9,\"vrai\")+SUMIFS(F9,D9,\"vrai\")+G9","v":0},{"$f":"G9+F9+E9-H9","v":0},{"$f":"SUMPRODUCT((Tableautoussaint[20-oct-15]=1)*(#REF!=1)*(#REF!))","v":{"$error":"#REF!"}},{"$f":"SUMPRODUCT((Tableautoussaint[20-oct-15]=1)*(#REF!=1)*(#REF!))","v":{"$error":"#REF!"}},{"$f":"SUMPRODUCT((Tableautoussaint[20-oct-15]=1)*(#REF!=1)*(#REF!))","v":{"$error":"#REF!"}}]
["MERCREDI",{"$f":"B9+1","v":"2016-04-20"},false,false,{"$f":"SUMIFS(Tableaupaques[20-avr-16],Tableaupaques[Age],\"<6\")","v":0},{"$f":"SUMIFS(Tableaupaques[20-avr-16],Tableaupaques[Age],\">=6\")","v":0},null,{"$f":"SUMIFS(E10,C10,\"vrai\")+SUMIFS(F10,D10,\"vrai\")+G10","v":0},{"$f":"G10+F10+E10-H10","v":0},{"$f":"SUMPRODUCT((Tableautoussaint[21-oct-15]=1)*(#REF!=1)*(#REF!))","v":{"$error":"#REF!"}},{"$f":"SUMPRODUCT((Tableautoussaint[21-oct-15]=1)*(#REF!=1)*(#REF!))","v":{"$error":"#REF!"}},{"$f":"SUMPRODUCT((Tableautoussaint[21-oct-15]=1)*(#REF!=1)*(#REF!))","v":{"$error":"#REF!"}}]
["JEUDI",{"$f":"B10+1","v":"2016-04-21"},false,false,{"$f":"SUMIFS(Tableaupaques[21-avr-16],Tableaupaques[Age],\"<6\")","v":0},{"$f":"SUMIFS(Tableaupaques[21-avr-16],Tableaupaques[Age],\">=6\")","v":0},null,{"$f":"SUMIFS(E11,C11,\"vrai\")+SUMIFS(F11,D11,\"vrai\")+G11","v":0},{"$f":"G11+F11+E11-H11","v":0},{"$f":"SUMPRODUCT((Tableautoussaint[22-oct-15]=1)*(#REF!=1)*(#REF!))","v":{"$error":"#REF!"}},{"$f":"SUMPRODUCT((Tableautoussaint[22-oct-15]=1)*(#REF!=1)*(#REF!))","v":{"$error":"#REF!"}},{"$f":"SUMPRODUCT((Tableautoussaint[22-oct-15]=1)*(#REF!=1)*(#REF!))","v":{"$error":"#REF!"}}]
["VENDREDI",{"$f":"B11+1","v":"2016-04-22"},false,false,{"$f":"SUMIFS(Tableaupaques[22-avr-16],Tableaupaques[Age],\"<6\")","v":0},{"$f":"SUMIFS(Tableaupaques[22-avr-16],Tableaupaques[Age],\">=6\")","v":0},null,{"$f":"SUMIFS(E12,C12,\"vrai\")+SUMIFS(F12,D12,\"vrai\")+G12","v":0},{"$f":"G12+F12+E12-H12","v":0},{"$f":"SUMPRODUCT((Tableautoussaint[23-oct-15]=1)*(#REF!=1)*(#REF!))","v":{"$error":"#REF!"}},{"$f":"SUMPRODUCT((Tableautoussaint[23-oct-15]=1)*(#REF!=1)*(#REF!))","v":{"$error":"#REF!"}},{"$f":"SUMPRODUCT((Tableautoussaint[23-oct-15]=1)*(#REF!=1)*(#REF!))","v":{"$error":"#REF!"}}]
[]
["Semaine n°",null,null,null,{"$f":"WEEKNUM(G14)","v":18},"Du",{"$f":"I3+3","v":"2016-04-25"},"au",{"$f":"G14+4","v":"2016-04-29"},{"$f":"Accueil!C18+1","v":2016}]
[]
["EFFECTIFS",null,null,null,null,null,null,null,null,"ALLERGIES ET REGIMES"]
["JOURS","DATES","Pique Niques ?",null,"Moins de 6 ans","Plus de\n6 ans","Adultes","Total Pique niques","Total Repas","Vétarien","Sans Porc","Sans Aïl Oignon Echalote Champignon"]
[null,null,"Moins de\n 6 ans","Plus de \n6 ans"]
["LUNDI",{"$f":"G14","v":"2016-04-25"},false,false,{"$f":"SUMIFS(Tableaupaques[25-avr-16],Tableaupaques[Age],\"<6\")","v":0},{"$f":"SUMIFS(Tableaupaques[25-avr-16],Tableaupaques[Age],\">=6\")","v":0},null,{"$f":"SUMIFS(E19,C19,\"vrai\")+SUMIFS(F19,D19,\"vrai\")+G19","v":0},{"$f":"G19+F19+E19-H19","v":0},{"$f":"SUMPRODUCT((Tableautoussaint[19-oct-15]=1)*(#REF!=1)*(#REF!))","v":{"$error":"#REF!"}},{"$f":"SUMPRODUCT((Tableautoussaint[19-oct-15]=1)*(#REF!=1)*(#REF!))","v":{"$error":"#REF!"}},{"$f":"SUMPRODUCT((Tableautoussaint[19-oct-15]=1)*(#REF!=1)*(#REF!))","v":{"$error":"#REF!"}}]
["MARDI",{"$f":"B19+1","v":"2016-04-26"},false,false,{"$f":"SUMIFS(Tableaupaques[26-avr-16],Tableaupaques[Age],\"<6\")","v":0},{"$f":"SUMIFS(Tableaupaques[26-avr-16],Tableaupaques[Age],\">=6\")","v":0},null,{"$f":"SUMIFS(E20,C20,\"vrai\")+SUMIFS(F20,D20,\"vrai\")+G20","v":0},{"$f":"G20+F20+E20-H20","v":0},{"$f":"SUMPRODUCT((Tableautoussaint[20-oct-15]=1)*(#REF!=1)*(#REF!))","v":{"$error":"#REF!"}},{"$f":"SUMPRODUCT((Tableautoussaint[20-oct-15]=1)*(#REF!=1)*(#REF!))","v":{"$error":"#REF!"}},{"$f":"SUMPRODUCT((Tableautoussaint[20-oct-15]=1)*(#REF!=1)*(#REF!))","v":{"$error":"#REF!"}}]
["MERCREDI",{"$f":"B20+1","v":"2016-04-27"},false,false,{"$f":"SUMIFS(Tableaupaques[27-avr-16],Tableaupaques[Age],\"<6\")","v":0},{"$f":"SUMIFS(Tableaupaques[27-avr-16],Tableaupaques[Age],\">=6\")","v":0},null,{"$f":"SUMIFS(E21,C21,\"vrai\")+SUMIFS(F21,D21,\"vrai\")+G21","v":0},{"$f":"G21+F21+E21-H21","v":0},{"$f":"SUMPRODUCT((Tableautoussaint[21-oct-15]=1)*(#REF!=1)*(#REF!))","v":{"$error":"#REF!"}},{"$f":"SUMPRODUCT((Tableautoussaint[21-oct-15]=1)*(#REF!=1)*(#REF!))","v":{"$error":"#REF!"}},{"$f":"SUMPRODUCT((Tableautoussaint[21-oct-15]=1)*(#REF!=1)*(#REF!))","v":{"$error":"#REF!"}}]
["JEUDI",{"$f":"B21+1","v":"2016-04-28"},false,false,{"$f":"SUMIFS(Tableaupaques[28-avr-16],Tableaupaques[Age],\"<6\")","v":0},{"$f":"SUMIFS(Tableaupaques[28-avr-16],Tableaupaques[Age],\">=6\")","v":0},null,{"$f":"SUMIFS(E22,C22,\"vrai\")+SUMIFS(F22,D22,\"vrai\")+G22","v":0},{"$f":"G22+F22+E22-H22","v":0},{"$f":"SUMPRODUCT((Tableautoussaint[22-oct-15]=1)*(#REF!=1)*(#REF!))","v":{"$error":"#REF!"}},{"$f":"SUMPRODUCT((Tableautoussaint[22-oct-15]=1)*(#REF!=1)*(#REF!))","v":{"$error":"#REF!"}},{"$f":"SUMPRODUCT((Tableautoussaint[22-oct-15]=1)*(#REF!=1)*(#REF!))","v":{"$error":"#REF!"}}]
["VENDREDI",{"$f":"B22+1","v":"2016-04-29"},false,false,{"$f":"SUMIFS(Tableaupaques[29-avr-16],Tableaupaques[Age],\"<6\")","v":0},{"$f":"SUMIFS(Tableaupaques[29-avr-16],Tableaupaques[Age],\">=6\")","v":0},null,{"$f":"SUMIFS(E23,C23,\"vrai\")+SUMIFS(F23,D23,\"vrai\")+G23","v":0},{"$f":"G23+F23+E23-H23","v":0},{"$f":"SUMPRODUCT((Tableautoussaint[23-oct-15]=1)*(#REF!=1)*(#REF!))","v":{"$error":"#REF!"}},{"$f":"SUMPRODUCT((Tableautoussaint[23-oct-15]=1)*(#REF!=1)*(#REF!))","v":{"$error":"#REF!"}},{"$f":"SUMPRODUCT((Tableautoussaint[23-oct-15]=1)*(#REF!=1)*(#REF!))","v":{"$error":"#REF!"}}]

{"sheet":"Resto Eté","index":34,"n_rows":67,"n_cols":12,"rows_kept":67,"cut":false,"hidden":false,"merged":[[57,9,57,10],[46,9,46,10],[35,9,35,10],[24,9,24,10],[13,9,13,10],[2,9,2,10],[0,0,0,16],[2,0,2,3],[4,0,4,8],[4,9,4,16],[5,0,6,0],[5,1,6,1],[5,2,5,3],[5,4,6,4],[5,5,6,5],[5,6,6,6],[5,13,6,13],[5,14,6,14],[5,15,6,15],[5,16,6,16],[13,0,13,3],[15,0,15,8],[15,9,15,16],[5,7,6,7],[5,8,6,8],[5,9,6,9],[5,10,6,10],[5,11,6,11],[5,12,6,12],[16,13,17,13],[16,14,17,14],[16,15,17,15],[16,16,17,16],[24,0,24,3],[26,0,26,8],[26,9,26,16],[16,7,17,7],[16,8,17,8],[16,9,17,9],[16,10,17,10],[16,11,17,11],[16,12,17,12],[16,0,17,0],[16,1,17,1],[16,2,16,3],[16,4,17,4],[16,5,17,5],[16,6,17,6],[27,13,28,13],[27,14,28,14],[27,15,28,15],[27,16,28,16],[35,0,35,3],[37,0,37,8],[37,9,37,16],[27,7,28,7],[27,8,28,8],[27,9,28,9],[27,10,28,10],[27,11,28,11],[27,12,28,12],[27,0,28,0],[27,1,28,1],[27,2,27,3],[27,4,28,4],[27,5,28,5],[27,6,28,6],[38,13,39,13],[38,14,39,14],[38,15,39,15],[38,16,39,16],[46,0,46,3],[48,0,48,8],[48,9,48,16],[38,7,39,7],[38,8,39,8],[38,9,39,9],[38,10,39,10],[38,11,39,11],[38,12,39,12],[38,0,39,0],[38,1,39,1],[38,2,38,3],[38,4,39,4],[38,5,39,5],[38,6,39,6],[49,13,50,13],[49,14,50,14],[49,15,50,15],[60,13,61,13],[60,14,61,14],[60,15,61,15],[49,16,50,16],[57,0,57,3],[59,0,59,8],[59,9,59,16],[49,7,50,7],[49,8,50,8],[49,9,50,9],[49,10,50,10],[49,11,50,11],[49,12,50,12],[49,0,50,0],[49,1,50,1],[49,2,49,3],[49,4,50,4],[49,5,50,5],[49,6,50,6],[60,16,61,16],[60,7,61,7],[60,8,61,8],[60,9,61,9],[60,10,61,10],[60,11,61,11],[60,12,61,12],[60,0,61,0],[60,1,61,1],[60,2,60,3],[60,4,61,4],[60,5,61,5],[60,6,61,6]]}
["Prévisionnel Resto. ALSH « Les Alzouzous » (06-77-26-01-97)"]
[]
["Semaine n°",null,null,null,{"$f":"WEEKNUM(G3)","v":29},"Du",{"$f":"données!B6","v":"2016-07-11"},"au",{"$f":"G3+4","v":"2016-07-15"},{"$f":"Accueil!C18+1","v":2016}]
[]
["EFFECTIFS",null,null,null,null,null,null,null,null,"ALLERGIES ET REGIMES"]
["JOURS","DATES","Pique Niques ?",null,"Moins de 6 ans","Plus de\n6 ans","Adultes","Total Pique niques","Total Repas","Vétarien","Sans Porc","Sans Aïl Oignon Echalote Champignon"]
[null,null,"Moins de\n 6 ans","Plus de \n6 ans"]
["LUNDI",{"$f":"G3","v":"2016-07-11"},false,false,{"$f":"SUMIFS(Tableauété[11-juil],Tableauété[Age],\"<6\")","v":0},{"$f":"SUMIFS(Tableauété[11-juil],Tableauété[Age],\">=6\")","v":0},null,{"$f":"SUMIFS(E8,C8,\"vrai\")+SUMIFS(F8,D8,\"vrai\")+G8","v":0},{"$f":"G8+F8+E8-H8","v":0},{"$f":"SUMPRODUCT((Tableautoussaint[19-oct-15]=1)*(#REF!=1)*(#REF!))","v":{"$error":"#REF!"}},{"$f":"SUMPRODUCT((Tableautoussaint[19-oct-15]=1)*(#REF!=1)*(#REF!))","v":{"$error":"#REF!"}},{"$f":"SUMPRODUCT((Tableautoussaint[19-oct-15]=1)*(#REF!=1)*(#REF!))","v":{"$error":"#REF!"}}]
["MARDI",{"$f":"B8+1","v":"2016-07-12"},false,false,{"$f":"SUMIFS(Tableauété[12-juil],Tableauété[Age],\"<6\")","v":0},{"$f":"SUMIFS(Tableauété[12-juil],Tableauété[Age],\">=6\")","v":0},null,{"$f":"SUMIFS(E9,C9,\"vrai\")+SUMIFS(F9,D9,\"vrai\")+G9","v":0},{"$f":"G9+F9+E9-H9","v":0},{"$f":"SUMPRODUCT((Tableautoussaint[20-oct-15]=1)*(#REF!=1)*(#REF!))","v":{"$error":"#REF!"}},{"$f":"SUMPRODUCT((Tableautoussaint[20-oct-15]=1)*(#REF!=1)*(#REF!))","v":{"$error":"#REF!"}},{"$f":"SUMPRODUCT((Tableautoussaint[20-oct-15]=1)*(#REF!=1)*(#REF!))","v":{"$error":"#REF!"}}]
["MERCREDI",{"$f":"B9+1","v":"2016-07-13"},false,false,{"$f":"SUMIFS(Tableauété[13-juil],Tableauété[Age],\"<6\")","v":0},{"$f":"SUMIFS(Tableauété[13-juil],Tableauété[Age],\">=6\")","v":0},null,{"$f":"SUMIFS(E10,C10,\"vrai\")+SUMIFS(F10,D10,\"vrai\")+G10","v":0},{"$f":"G10+F10+E10-H10","v":0},{"$f":"SUMPRODUCT((Tableautoussaint[21-oct-15]=1)*(#REF!=1)*(#REF!))","v":{"$error":"#REF!"}},{"$f":"SUMPRODUCT((Tableautoussaint[21-oct-15]=1)*(#REF!=1)*(#REF!))","v":{"$error":"#REF!"}},{"$f":"SUMPRODUCT((Tableautoussaint[21-oct-15]=1)*(#REF!=1)*(#REF!))","v":{"$error":"#REF!"}}]
["JEUDI",{"$f":"B10+1","v":"2016-07-14"},false,false,{"$f":"SUMIFS(Tableauété[14-juil],Tableauété[Age],\"<6\")","v":0},{"$f":"SUMIFS(Tableauété[14-juil],Tableauété[Age],\">=6\")","v":0},null,{"$f":"SUMIFS(E11,C11,\"vrai\")+SUMIFS(F11,D11,\"vrai\")+G11","v":0},{"$f":"G11+F11+E11-H11","v":0},{"$f":"SUMPRODUCT((Tableautoussaint[22-oct-15]=1)*(#REF!=1)*(#REF!))","v":{"$error":"#REF!"}},{"$f":"SUMPRODUCT((Tableautoussaint[22-oct-15]=1)*(#REF!=1)*(#REF!))","v":{"$error":"#REF!"}},{"$f":"SUMPRODUCT((Tableautoussaint[22-oct-15]=1)*(#REF!=1)*(#REF!))","v":{"$error":"#REF!"}}]
["VENDREDI",{"$f":"B11+1","v":"2016-07-15"},false,false,{"$f":"SUMIFS(Tableauété[15-juil],Tableauété[Age],\"<6\")","v":0},{"$f":"SUMIFS(Tableauété[15-juil],Tableauété[Age],\">=6\")","v":0},null,{"$f":"SUMIFS(E12,C12,\"vrai\")+SUMIFS(F12,D12,\"vrai\")+G12","v":0},{"$f":"G12+F12+E12-H12","v":0},{"$f":"SUMPRODUCT((Tableautoussaint[23-oct-15]=1)*(#REF!=1)*(#REF!))","v":{"$error":"#REF!"}},{"$f":"SUMPRODUCT((Tableautoussaint[23-oct-15]=1)*(#REF!=1)*(#REF!))","v":{"$error":"#REF!"}},{"$f":"SUMPRODUCT((Tableautoussaint[23-oct-15]=1)*(#REF!=1)*(#REF!))","v":{"$error":"#REF!"}}]
[]
["Semaine n°",null,null,null,{"$f":"WEEKNUM(G14)","v":30},"Du",{"$f":"I3+3","v":"2016-07-18"},"au",{"$f":"G14+4","v":"2016-07-22"},{"$f":"Accueil!C18+1","v":2016}]
[]
["EFFECTIFS",null,null,null,null,null,null,null,null,"ALLERGIES ET REGIMES"]
["JOURS","DATES","Pique Niques ?",null,"Moins de 6 ans","Plus de\n6 ans","Adultes","Total Pique niques","Total Repas","Vétarien","Sans Porc","Sans Aïl Oignon Echalote Champignon"]
[null,null,"Moins de\n 6 ans","Plus de \n6 ans"]
["LUNDI",{"$f":"G14","v":"2016-07-18"},false,false,{"$f":"SUMIFS(Tableauété[18-juil],Tableauété[Age],\"<6\")","v":0},{"$f":"SUMIFS(Tableauété[18-juil],Tableauété[Age],\">=6\")","v":0},null,{"$f":"SUMIFS(E19,C19,\"vrai\")+SUMIFS(F19,D19,\"vrai\")+G19","v":0},{"$f":"G19+F19+E19-H19","v":0},{"$f":"SUMPRODUCT((Tableautoussaint[19-oct-15]=1)*(#REF!=1)*(#REF!))","v":{"$error":"#REF!"}},{"$f":"SUMPRODUCT((Tableautoussaint[19-oct-15]=1)*(#REF!=1)*(#REF!))","v":{"$error":"#REF!"}},{"$f":"SUMPRODUCT((Tableautoussaint[19-oct-15]=1)*(#REF!=1)*(#REF!))","v":{"$error":"#REF!"}}]
["MARDI",{"$f":"B19+1","v":"2016-07-19"},false,false,{"$f":"SUMIFS(Tableauété[19-juil],Tableauété[Age],\"<6\")","v":0},{"$f":"SUMIFS(Tableauété[19-juil],Tableauété[Age],\">=6\")","v":0},null,{"$f":"SUMIFS(E20,C20,\"vrai\")+SUMIFS(F20,D20,\"vrai\")+G20","v":0},{"$f":"G20+F20+E20-H20","v":0},{"$f":"SUMPRODUCT((Tableautoussaint[20-oct-15]=1)*(#REF!=1)*(#REF!))","v":{"$error":"#REF!"}},{"$f":"SUMPRODUCT((Tableautoussaint[20-oct-15]=1)*(#REF!=1)*(#REF!))","v":{"$error":"#REF!"}},{"$f":"SUMPRODUCT((Tableautoussaint[20-oct-15]=1)*(#REF!=1)*(#REF!))","v":{"$error":"#REF!"}}]
["MERCREDI",{"$f":"B20+1","v":"2016-07-20"},false,false,{"$f":"SUMIFS(Tableauété[20-juil],Tableauété[Age],\"<6\")","v":0},{"$f":"SUMIFS(Tableauété[20-juil],Tableauété[Age],\">=6\")","v":0},null,{"$f":"SUMIFS(E21,C21,\"vrai\")+SUMIFS(F21,D21,\"vrai\")+G21","v":0},{"$f":"G21+F21+E21-H21","v":0},{"$f":"SUMPRODUCT((Tableautoussaint[21-oct-15]=1)*(#REF!=1)*(#REF!))","v":{"$error":"#REF!"}},{"$f":"SUMPRODUCT((Tableautoussaint[21-oct-15]=1)*(#REF!=1)*(#REF!))","v":{"$error":"#REF!"}},{"$f":"SUMPRODUCT((Tableautoussaint[21-oct-15]=1)*(#REF!=1)*(#REF!))","v":{"$error":"#REF!"}}]
["JEUDI",{"$f":"B21+1","v":"2016-07-21"},false,false,{"$f":"SUMIFS(Tableauété[21-juil],Tableauété[Age],\"<6\")","v":0},{"$f":"SUMIFS(Tableauété[21-juil],Tableauété[Age],\">=6\")","v":0},null,{"$f":"SUMIFS(E22,C22,\"vrai\")+SUMIFS(F22,D22,\"vrai\")+G22","v":0},{"$f":"G22+F22+E22-H22","v":0},{"$f":"SUMPRODUCT((Tableautoussaint[22-oct-15]=1)*(#REF!=1)*(#REF!))","v":{"$error":"#REF!"}},{"$f":"SUMPRODUCT((Tableautoussaint[22-oct-15]=1)*(#REF!=1)*(#REF!))","v":{"$error":"#REF!"}},{"$f":"SUMPRODUCT((Tableautoussaint[22-oct-15]=1)*(#REF!=1)*(#REF!))","v":{"$error":"#REF!"}}]
["VENDREDI",{"$f":"B22+1","v":"2016-07-22"},false,false,{"$f":"SUMIFS(Tableauété[22-juil],Tableauété[Age],\"<6\")","v":0},{"$f":"SUMIFS(Tableauété[22-juil],Tableauété[Age],\">=6\")","v":0},null,{"$f":"SUMIFS(E23,C23,\"vrai\")+SUMIFS(F23,D23,\"vrai\")+G23","v":0},{"$f":"G23+F23+E23-H23","v":0},{"$f":"SUMPRODUCT((Tableautoussaint[23-oct-15]=1)*(#REF!=1)*(#REF!))","v":{"$error":"#REF!"}},{"$f":"SUMPRODUCT((Tableautoussaint[23-oct-15]=1)*(#REF!=1)*(#REF!))","v":{"$error":"#REF!"}},{"$f":"SUMPRODUCT((Tableautoussaint[23-oct-15]=1)*(#REF!=1)*(#REF!))","v":{"$error":"#REF!"}}]
[]
["Semaine n°",null,null,null,{"$f":"WEEKNUM(G25)","v":31},"Du",{"$f":"I14+3","v":"2016-07-25"},"au",{"$f":"G25+4","v":"2016-07-29"},{"$f":"Accueil!C18+1","v":2016}]
[]
["EFFECTIFS",null,null,null,null,null,null,null,null,"ALLERGIES ET REGIMES"]
["JOURS","DATES","Pique Niques ?",null,"Moins de 6 ans","Plus de\n6 ans","Adultes","Total Pique niques","Total Repas","Vétarien","Sans Porc","Sans Aïl Oignon Echalote Champignon"]
[null,null,"Moins de\n 6 ans","Plus de \n6 ans"]
["LUNDI",{"$f":"G25","v":"2016-07-25"},false,false,{"$f":"SUMIFS(Tableauété[25-juil],Tableauété[Age],\"<6\")","v":0},{"$f":"SUMIFS(Tableauété[25-juil],Tableauété[Age],\">=6\")","v":0},null,{"$f":"SUMIFS(E30,C30,\"vrai\")+SUMIFS(F30,D30,\"vrai\")+G30","v":0},{"$f":"G30+F30+E30-H30","v":0},{"$f":"SUMPRODUCT((Tableautoussaint[19-oct-15]=1)*(#REF!=1)*(#REF!))","v":{"$error":"#REF!"}},{"$f":"SUMPRODUCT((Tableautoussaint[19-oct-15]=1)*(#REF!=1)*(#REF!))","v":{"$error":"#REF!"}},{"$f":"SUMPRODUCT((Tableautoussaint[19-oct-15]=1)*(#REF!=1)*(#REF!))","v":{"$error":"#REF!"}}]
["MARDI",{"$f":"B30+1","v":"2016-07-26"},false,false,{"$f":"SUMIFS(Tableauété[26-juil],Tableauété[Age],\"<6\")","v":0},{"$f":"SUMIFS(Tableauété[26-juil],Tableauété[Age],\">=6\")","v":0},null,{"$f":"SUMIFS(E31,C31,\"vrai\")+SUMIFS(F31,D31,\"vrai\")+G31","v":0},{"$f":"G31+F31+E31-H31","v":0},{"$f":"SUMPRODUCT((Tableautoussaint[20-oct-15]=1)*(#REF!=1)*(#REF!))","v":{"$error":"#REF!"}},{"$f":"SUMPRODUCT((Tableautoussaint[20-oct-15]=1)*(#REF!=1)*(#REF!))","v":{"$error":"#REF!"}},{"$f":"SUMPRODUCT((Tableautoussaint[20-oct-15]=1)*(#REF!=1)*(#REF!))","v":{"$error":"#REF!"}}]
["MERCREDI",{"$f":"B31+1","v":"2016-07-27"},false,false,{"$f":"SUMIFS(Tableauété[27-juil],Tableauété[Age],\"<6\")","v":0},{"$f":"SUMIFS(Tableauété[27-juil],Tableauété[Age],\">=6\")","v":0},null,{"$f":"SUMIFS(E32,C32,\"vrai\")+SUMIFS(F32,D32,\"vrai\")+G32","v":0},{"$f":"G32+F32+E32-H32","v":0},{"$f":"SUMPRODUCT((Tableautoussaint[21-oct-15]=1)*(#REF!=1)*(#REF!))","v":{"$error":"#REF!"}},{"$f":"SUMPRODUCT((Tableautoussaint[21-oct-15]=1)*(#REF!=1)*(#REF!))","v":{"$error":"#REF!"}},{"$f":"SUMPRODUCT((Tableautoussaint[21-oct-15]=1)*(#REF!=1)*(#REF!))","v":{"$error":"#REF!"}}]
["JEUDI",{"$f":"B32+1","v":"2016-07-28"},false,false,{"$f":"SUMIFS(Tableauété[28-juil],Tableauété[Age],\"<6\")","v":0},{"$f":"SUMIFS(Tableauété[28-juil],Tableauété[Age],\">=6\")","v":0},null,{"$f":"SUMIFS(E33,C33,\"vrai\")+SUMIFS(F33,D33,\"vrai\")+G33","v":0},{"$f":"G33+F33+E33-H33","v":0},{"$f":"SUMPRODUCT((Tableautoussaint[22-oct-15]=1)*(#REF!=1)*(#REF!))","v":{"$error":"#REF!"}},{"$f":"SUMPRODUCT((Tableautoussaint[22-oct-15]=1)*(#REF!=1)*(#REF!))","v":{"$error":"#REF!"}},{"$f":"SUMPRODUCT((Tableautoussaint[22-oct-15]=1)*(#REF!=1)*(#REF!))","v":{"$error":"#REF!"}}]
["VENDREDI",{"$f":"B33+1","v":"2016-07-29"},false,false,{"$f":"SUMIFS(Tableauété[29-juil],Tableauété[Age],\"<6\")","v":0},{"$f":"SUMIFS(Tableauété[29-juil],Tableauété[Age],\">=6\")","v":0},null,{"$f":"SUMIFS(E34,C34,\"vrai\")+SUMIFS(F34,D34,\"vrai\")+G34","v":0},{"$f":"G34+F34+E34-H34","v":0},{"$f":"SUMPRODUCT((Tableautoussaint[23-oct-15]=1)*(#REF!=1)*(#REF!))","v":{"$error":"#REF!"}},{"$f":"SUMPRODUCT((Tableautoussaint[23-oct-15]=1)*(#REF!=1)*(#REF!))","v":{"$error":"#REF!"}},{"$f":"SUMPRODUCT((Tableautoussaint[23-oct-15]=1)*(#REF!=1)*(#REF!))","v":{"$error":"#REF!"}}]
[]
["Semaine n°",null,null,null,{"$f":"WEEKNUM(G36)","v":32},"Du",{"$f":"I25+3","v":"2016-08-01"},"au",{"$f":"G36+4","v":"2016-08-05"},{"$f":"Accueil!C18+1","v":2016}]
[]
["EFFECTIFS",null,null,null,null,null,null,null,null,"ALLERGIES ET REGIMES"]
["JOURS","DATES","Pique Niques ?",null,"Moins de 6 ans","Plus de\n6 ans","Adultes","Total Pique niques","Total Repas","Vétarien","Sans Porc","Sans Aïl Oignon Echalote Champignon"]
[null,null,"Moins de\n 6 ans","Plus de \n6 ans"]
["LUNDI",{"$f":"G36","v":"2016-08-01"},false,false,{"$f":"SUMIFS(Tableauété[01-août],Tableauété[Age],\"<6\")","v":0},{"$f":"SUMIFS(Tableauété[01-août],Tableauété[Age],\">=6\")","v":0},null,{"$f":"SUMIFS(E41,C41,\"vrai\")+SUMIFS(F41,D41,\"vrai\")+G41","v":0},{"$f":"G41+F41+E41-H41","v":0},{"$f":"SUMPRODUCT((Tableautoussaint[19-oct-15]=1)*(#REF!=1)*(#REF!))","v":{"$error":"#REF!"}},{"$f":"SUMPRODUCT((Tableautoussaint[19-oct-15]=1)*(#REF!=1)*(#REF!))","v":{"$error":"#REF!"}},{"$f":"SUMPRODUCT((Tableautoussaint[19-oct-15]=1)*(#REF!=1)*(#REF!))","v":{"$error":"#REF!"}}]
["MARDI",{"$f":"B41+1","v":"2016-08-02"},false,false,{"$f":"SUMIFS(Tableauété[02-août],Tableauété[Age],\"<6\")","v":0},{"$f":"SUMIFS(Tableauété[02-août],Tableauété[Age],\">=6\")","v":0},null,{"$f":"SUMIFS(E42,C42,\"vrai\")+SUMIFS(F42,D42,\"vrai\")+G42","v":0},{"$f":"G42+F42+E42-H42","v":0},{"$f":"SUMPRODUCT((Tableautoussaint[20-oct-15]=1)*(#REF!=1)*(#REF!))","v":{"$error":"#REF!"}},{"$f":"SUMPRODUCT((Tableautoussaint[20-oct-15]=1)*(#REF!=1)*(#REF!))","v":{"$error":"#REF!"}},{"$f":"SUMPRODUCT((Tableautoussaint[20-oct-15]=1)*(#REF!=1)*(#REF!))","v":{"$error":"#REF!"}}]
["MERCREDI",{"$f":"B42+1","v":"2016-08-03"},false,false,{"$f":"SUMIFS(Tableauété[03-août],Tableauété[Age],\"<6\")","v":0},{"$f":"SUMIFS(Tableauété[03-août],Tableauété[Age],\">=6\")","v":0},null,{"$f":"SUMIFS(E43,C43,\"vrai\")+SUMIFS(F43,D43,\"vrai\")+G43","v":0},{"$f":"G43+F43+E43-H43","v":0},{"$f":"SUMPRODUCT((Tableautoussaint[21-oct-15]=1)*(#REF!=1)*(#REF!))","v":{"$error":"#REF!"}},{"$f":"SUMPRODUCT((Tableautoussaint[21-oct-15]=1)*(#REF!=1)*(#REF!))","v":{"$error":"#REF!"}},{"$f":"SUMPRODUCT((Tableautoussaint[21-oct-15]=1)*(#REF!=1)*(#REF!))","v":{"$error":"#REF!"}}]
["JEUDI",{"$f":"B43+1","v":"2016-08-04"},false,false,{"$f":"SUMIFS(Tableauété[04-août],Tableauété[Age],\"<6\")","v":0},{"$f":"SUMIFS(Tableauété[04-août],Tableauété[Age],\">=6\")","v":0},null,{"$f":"SUMIFS(E44,C44,\"vrai\")+SUMIFS(F44,D44,\"vrai\")+G44","v":0},{"$f":"G44+F44+E44-H44","v":0},{"$f":"SUMPRODUCT((Tableautoussaint[22-oct-15]=1)*(#REF!=1)*(#REF!))","v":{"$error":"#REF!"}},{"$f":"SUMPRODUCT((Tableautoussaint[22-oct-15]=1)*(#REF!=1)*(#REF!))","v":{"$error":"#REF!"}},{"$f":"SUMPRODUCT((Tableautoussaint[22-oct-15]=1)*(#REF!=1)*(#REF!))","v":{"$error":"#REF!"}}]
["VENDREDI",{"$f":"B44+1","v":"2016-08-05"},false,false,{"$f":"SUMIFS(Tableauété[05-août],Tableauété[Age],\"<6\")","v":0},{"$f":"SUMIFS(Tableauété[05-août],Tableauété[Age],\">=6\")","v":0},null,{"$f":"SUMIFS(E45,C45,\"vrai\")+SUMIFS(F45,D45,\"vrai\")+G45","v":0},{"$f":"G45+F45+E45-H45","v":0},{"$f":"SUMPRODUCT((Tableautoussaint[23-oct-15]=1)*(#REF!=1)*(#REF!))","v":{"$error":"#REF!"}},{"$f":"SUMPRODUCT((Tableautoussaint[23-oct-15]=1)*(#REF!=1)*(#REF!))","v":{"$error":"#REF!"}},{"$f":"SUMPRODUCT((Tableautoussaint[23-oct-15]=1)*(#REF!=1)*(#REF!))","v":{"$error":"#REF!"}}]
[]
["Semaine n°",null,null,null,{"$f":"WEEKNUM(G47)","v":33},"Du",{"$f":"I36+3","v":"2016-08-08"},"au",{"$f":"G47+4","v":"2016-08-12"},{"$f":"Accueil!C18+1","v":2016}]
[]
["EFFECTIFS",null,null,null,null,null,null,null,null,"ALLERGIES ET REGIMES"]
["JOURS","DATES","Pique Niques ?",null,"Moins de 6 ans","Plus de\n6 ans","Adultes","Total Pique niques","Total Repas","Vétarien","Sans Porc","Sans Aïl Oignon Echalote Champignon"]
[null,null,"Moins de\n 6 ans","Plus de \n6 ans"]
["LUNDI",{"$f":"G47","v":"2016-08-08"},false,false,{"$f":"SUMIFS(Tableauété[08-août],Tableauété[Age],\"<6\")","v":0},{"$f":"SUMIFS(Tableauété[08-août],Tableauété[Age],\">=6\")","v":0},null,{"$f":"SUMIFS(E52,C52,\"vrai\")+SUMIFS(F52,D52,\"vrai\")+G52","v":0},{"$f":"G52+F52+E52-H52","v":0},{"$f":"SUMPRODUCT((Tableautoussaint[19-oct-15]=1)*(#REF!=1)*(#REF!))","v":{"$error":"#REF!"}},{"$f":"SUMPRODUCT((Tableautoussaint[19-oct-15]=1)*(#REF!=1)*(#REF!))","v":{"$error":"#REF!"}},{"$f":"SUMPRODUCT((Tableautoussaint[19-oct-15]=1)*(#REF!=1)*(#REF!))","v":{"$error":"#REF!"}}]
["MARDI",{"$f":"B52+1","v":"2016-08-09"},false,false,{"$f":"SUMIFS(Tableauété[09-août],Tableauété[Age],\"<6\")","v":0},{"$f":"SUMIFS(Tableauété[09-août],Tableauété[Age],\">=6\")","v":0},null,{"$f":"SUMIFS(E53,C53,\"vrai\")+SUMIFS(F53,D53,\"vrai\")+G53","v":0},{"$f":"G53+F53+E53-H53","v":0},{"$f":"SUMPRODUCT((Tableautoussaint[20-oct-15]=1)*(#REF!=1)*(#REF!))","v":{"$error":"#REF!"}},{"$f":"SUMPRODUCT((Tableautoussaint[20-oct-15]=1)*(#REF!=1)*(#REF!))","v":{"$error":"#REF!"}},{"$f":"SUMPRODUCT((Tableautoussaint[20-oct-15]=1)*(#REF!=1)*(#REF!))","v":{"$error":"#REF!"}}]
["MERCREDI",{"$f":"B53+1","v":"2016-08-10"},false,false,{"$f":"SUMIFS(Tableauété[10-août],Tableauété[Age],\"<6\")","v":0},{"$f":"SUMIFS(Tableauété[10-août],Tableauété[Age],\">=6\")","v":0},null,{"$f":"SUMIFS(E54,C54,\"vrai\")+SUMIFS(F54,D54,\"vrai\")+G54","v":0},{"$f":"G54+F54+E54-H54","v":0},{"$f":"SUMPRODUCT((Tableautoussaint[21-oct-15]=1)*(#REF!=1)*(#REF!))","v":{"$error":"#REF!"}},{"$f":"SUMPRODUCT((Tableautoussaint[21-oct-15]=1)*(#REF!=1)*(#REF!))","v":{"$error":"#REF!"}},{"$f":"SUMPRODUCT((Tableautoussaint[21-oct-15]=1)*(#REF!=1)*(#REF!))","v":{"$error":"#REF!"}}]
["JEUDI",{"$f":"B54+1","v":"2016-08-11"},false,false,{"$f":"SUMIFS(Tableauété[11-août],Tableauété[Age],\"<6\")","v":0},{"$f":"SUMIFS(Tableauété[11-août],Tableauété[Age],\">=6\")","v":0},null,{"$f":"SUMIFS(E55,C55,\"vrai\")+SUMIFS(F55,D55,\"vrai\")+G55","v":0},{"$f":"G55+F55+E55-H55","v":0},{"$f":"SUMPRODUCT((Tableautoussaint[22-oct-15]=1)*(#REF!=1)*(#REF!))","v":{"$error":"#REF!"}},{"$f":"SUMPRODUCT((Tableautoussaint[22-oct-15]=1)*(#REF!=1)*(#REF!))","v":{"$error":"#REF!"}},{"$f":"SUMPRODUCT((Tableautoussaint[22-oct-15]=1)*(#REF!=1)*(#REF!))","v":{"$error":"#REF!"}}]
["VENDREDI",{"$f":"B55+1","v":"2016-08-12"},false,false,{"$f":"SUMIFS(Tableauété[12-août],Tableauété[Age],\"<6\")","v":0},{"$f":"SUMIFS(Tableauété[12-août],Tableauété[Age],\">=6\")","v":0},null,{"$f":"SUMIFS(E56,C56,\"vrai\")+SUMIFS(F56,D56,\"vrai\")+G56","v":0},{"$f":"G56+F56+E56-H56","v":0},{"$f":"SUMPRODUCT((Tableautoussaint[23-oct-15]=1)*(#REF!=1)*(#REF!))","v":{"$error":"#REF!"}},{"$f":"SUMPRODUCT((Tableautoussaint[23-oct-15]=1)*(#REF!=1)*(#REF!))","v":{"$error":"#REF!"}},{"$f":"SUMPRODUCT((Tableautoussaint[23-oct-15]=1)*(#REF!=1)*(#REF!))","v":{"$error":"#REF!"}}]
[]
["Semaine n°",null,null,null,{"$f":"WEEKNUM(G58)","v":34},"Du",{"$f":"I47+3","v":"2016-08-15"},"au",{"$f":"G58+4","v":"2016-08-19"},{"$f":"Accueil!C18+1","v":2016}]
[]
["EFFECTIFS",null,null,null,null,null,null,null,null,"ALLERGIES ET REGIMES"]
["JOURS","DATES","Pique Niques ?",null,"Moins de 6 ans","Plus de\n6 ans","Adultes","Total Pique niques","Total Repas","Vétarien","Sans Porc","Sans Aïl Oignon Echalote Champignon"]
[null,null,"Moins de\n 6 ans","Plus de \n6 ans"]
["LUNDI",{"$f":"G58","v":"2016-08-15"},false,false,{"$f":"SUMIFS(Tableauété[15-août],Tableauété[Age],\"<6\")","v":0},{"$f":"SUMIFS(Tableauété[15-août],Tableauété[Age],\">=6\")","v":0},null,{"$f":"SUMIFS(E63,C63,\"vrai\")+SUMIFS(F63,D63,\"vrai\")+G63","v":0},{"$f":"G63+F63+E63-H63","v":0},{"$f":"SUMPRODUCT((Tableautoussaint[19-oct-15]=1)*(#REF!=1)*(#REF!))","v":{"$error":"#REF!"}},{"$f":"SUMPRODUCT((Tableautoussaint[19-oct-15]=1)*(#REF!=1)*(#REF!))","v":{"$error":"#REF!"}},{"$f":"SUMPRODUCT((Tableautoussaint[19-oct-15]=1)*(#REF!=1)*(#REF!))","v":{"$error":"#REF!"}}]
["MARDI",{"$f":"B63+1","v":"2016-08-16"},false,false,{"$f":"SUMIFS(Tableauété[16-août],Tableauété[Age],\"<6\")","v":0},{"$f":"SUMIFS(Tableauété[16-août],Tableauété[Age],\">=6\")","v":0},null,{"$f":"SUMIFS(E64,C64,\"vrai\")+SUMIFS(F64,D64,\"vrai\")+G64","v":0},{"$f":"G64+F64+E64-H64","v":0},{"$f":"SUMPRODUCT((Tableautoussaint[20-oct-15]=1)*(#REF!=1)*(#REF!))","v":{"$error":"#REF!"}},{"$f":"SUMPRODUCT((Tableautoussaint[20-oct-15]=1)*(#REF!=1)*(#REF!))","v":{"$error":"#REF!"}},{"$f":"SUMPRODUCT((Tableautoussaint[20-oct-15]=1)*(#REF!=1)*(#REF!))","v":{"$error":"#REF!"}}]
["MERCREDI",{"$f":"B64+1","v":"2016-08-17"},false,false,{"$f":"SUMIFS(Tableauété[17-août],Tableauété[Age],\"<6\")","v":0},{"$f":"SUMIFS(Tableauété[17-août],Tableauété[Age],\">=6\")","v":0},null,{"$f":"SUMIFS(E65,C65,\"vrai\")+SUMIFS(F65,D65,\"vrai\")+G65","v":0},{"$f":"G65+F65+E65-H65","v":0},{"$f":"SUMPRODUCT((Tableautoussaint[21-oct-15]=1)*(#REF!=1)*(#REF!))","v":{"$error":"#REF!"}},{"$f":"SUMPRODUCT((Tableautoussaint[21-oct-15]=1)*(#REF!=1)*(#REF!))","v":{"$error":"#REF!"}},{"$f":"SUMPRODUCT((Tableautoussaint[21-oct-15]=1)*(#REF!=1)*(#REF!))","v":{"$error":"#REF!"}}]
["JEUDI",{"$f":"B65+1","v":"2016-08-18"},false,false,{"$f":"SUMIFS(Tableauété[18-août],Tableauété[Age],\"<6\")","v":0},{"$f":"SUMIFS(Tableauété[18-août],Tableauété[Age],\">=6\")","v":0},null,{"$f":"SUMIFS(E66,C66,\"vrai\")+SUMIFS(F66,D66,\"vrai\")+G66","v":0},{"$f":"G66+F66+E66-H66","v":0},{"$f":"SUMPRODUCT((Tableautoussaint[22-oct-15]=1)*(#REF!=1)*(#REF!))","v":{"$error":"#REF!"}},{"$f":"SUMPRODUCT((Tableautoussaint[22-oct-15]=1)*(#REF!=1)*(#REF!))","v":{"$error":"#REF!"}},{"$f":"SUMPRODUCT((Tableautoussaint[22-oct-15]=1)*(#REF!=1)*(#REF!))","v":{"$error":"#REF!"}}]
["VENDREDI",{"$f":"B66+1","v":"2016-08-19"},false,false,{"$f":"SUMIFS(Tableauété[19-août],Tableauété[Age],\"<6\")","v":0},{"$f":"SUMIFS(Tableauété[19-août],Tableauété[Age],\">=6\")","v":0},null,{"$f":"SUMIFS(E67,C67,\"vrai\")+SUMIFS(F67,D67,\"vrai\")+G67","v":0},{"$f":"G67+F67+E67-H67","v":0},{"$f":"SUMPRODUCT((Tableautoussaint[23-oct-15]=1)*(#REF!=1)*(#REF!))","v":{"$error":"#REF!"}},{"$f":"SUMPRODUCT((Tableautoussaint[23-oct-15]=1)*(#REF!=1)*(#REF!))","v":{"$error":"#REF!"}},{"$f":"SUMPRODUCT((Tableautoussaint[23-oct-15]=1)*(#REF!=1)*(#REF!))","v":{"$error":"#REF!"}}]

{"sheet":"Resto Mercredi","index":35,"n_rows":122,"n_cols":12,"rows_kept":122,"cut":false,"hidden":false,"merged":[[112,0,112,3],[112,4,112,6],[112,7,112,9],[114,0,114,8],[114,9,114,16],[115,0,116,0],[115,1,116,1],[115,2,115,3],[115,4,116,4],[115,5,116,5],[115,6,116,6],[115,7,116,7],[115,8,116,8],[115,9,116,9],[115,10,116,10],[115,11,116,11],[115,12,116,12],[115,13,116,13],[115,14,116,14],[115,15,116,15],[115,16,116,16],[101,0,101,3],[101,4,101,6],[101,7,101,9],[103,0,103,8],[103,9,103,16],[104,0,105,0],[104,1,105,1],[104,2,104,3],[104,4,105,4],[104,5,105,5],[104,6,105,6],[104,7,105,7],[104,8,105,8],[104,9,105,9],[104,10,105,10],[104,11,105,11],[104,12,105,12],[104,13,105,13],[104,14,105,14],[104,15,105,15],[104,16,105,16],[90,0,90,3],[90,4,90,6],[90,7,90,9],[92,0,92,8],[92,9,92,16],[93,0,94,0],[93,1,94,1],[93,2,93,3],[93,4,94,4],[93,5,94,5],[93,6,94,6],[93,7,94,7],[93,8,94,8],[93,9,94,9],[93,10,94,10],[93,11,94,11],[93,12,94,12],[93,13,94,13],[93,14,94,14],[93,15,94,15],[93,16,94,16],[79,0,79,3],[79,4,79,6],[79,7,79,9],[81,0,81,8],[81,9,81,16],[82,0,83,0],[82,1,83,1],[82,2,82,3],[82,4,83,4],[82,5,83,5],[82,6,83,6],[82,7,83,7],[82,8,83,8],[82,9,83,9],[82,10,83,10],[82,11,83,11],[82,12,83,12],[82,13,83,13],[82,14,83,14],[82,15,83,15],[82,16,83,16],[68,0,68,3],[68,4,68,6],[68,7,68,9],[70,0,70,8],[70,9,70,16],[71,0,72,0],[71,1,72,1],[71,2,71,3],[71,4,72,4],[71,5,72,5],[71,6,72,6],[71,7,72,7],[71,8,72,8],[71,9,72,9],[71,10,72,10],[71,11,72,11],[71,12,72,12],[71,13,72,13],[71,14,72,14],[71,15,72,15],[71,16,72,16],[60,13,61,13],[60,14,61,14],[60,15,61,15],[60,16,61,16],[2,4,2,6],[2,7,2,9],[13,4,13,6],[24,4,24,6],[35,4,35,6],[46,4,46,6],[60,7,61,7],[60,8,61,8],[60,9,61,9],[60,10,61,10],[60,11,61,11],[60,12,61,12],[49,16,50,16],[49,5,50,5],[49,6,50,6],[38,13,39,13],[38,14,39,14],[38,15,39,15],[38,16,39,16],[27,13,28,13],[60,0,61,0],[60,1,61,1],[60,2,60,3],[60,4,61,4],[60,5,61,5],[60,6,61,6],[49,13,50,13],[49,14,50,14],[49,15,50,15],[57,0,57,3],[59,0,59,8],[59,9,59,16],[57,4,57,6],[57,7,57,9],[49,7,50,7],[49,8,50,8],[49,9,50,9],[49,10,50,10],[49,11,50,11],[49,12,50,12],[49,0,50,0],[49,1,50,1],[49,2,49,3],[49,4,50,4],[46,0,46,3],[48,0,48,8],[48,9,48,16],[46,7,46,9],[38,7,39,7],[38,8,39,8],[38,9,39,9],[38,10,39,10],[38,11,39,11],[38,12,39,12],[38,0,39,0],[38,1,39,1],[38,2,38,3],[38,4,39,4],[38,5,39,5],[38,6,39,6],[27,14,28,14],[27,15,28,15],[27,16,28,16],[35,0,35,3],[37,0,37,8],[37,9,37,16],[35,7,35,9],[27,7,28,7],[27,8,28,8],[27,9,28,9],[27,10,28,10],[27,11,28,11],[27,12,28,12],[27,0,28,0],[27,1,28,1],[27,2,27,3],[27,4,28,4],[27,5,28,5],[27,6,28,6],[16,13,17,13],[16,14,17,14],[16,15,17,15],[16,16,17,16],[24,0,24,3],[26,0,26,8],[26,9,26,16],[24,7,24,9],[16,7,17,7],[16,8,17,8],[16,9,17,9],[16,10,17,10],[16,11,17,11],[16,12,17,12],[16,0,17,0],[16,1,17,1],[16,2,16,3],[16,4,17,4],[16,5,17,5],[16,6,17,6],[13,0,13,3],[15,0,15,8],[15,9,15,16],[13,7,13,9],[5,7,6,7],[5,8,6,8],[5,9,6,9],[5,10,6,10],[5,11,6,11],[5,12,6,12],[0,0,0,16],[2,0,2,3],[4,0,4,8],[4,9,4,16],[5,0,6,0],[5,1,6,1],[5,2,5,3],[5,4,6,4],[5,5,6,5],[5,6,6,6],[5,13,6,13],[5,14,6,14],[5,15,6,15],[5,16,6,16]]}
["Prévisionnel Resto. ALSH « Les Alzouzous » (06-77-26-01-97)"]
[]
["Mois de : ",null,null,null,{"$f":"Septembre!J3","v":"Septembre"},null,null,{"$f":"Accueil!C18","v":2015}]
[]
["EFFECTIFS",null,null,null,null,null,null,null,null,"ALLERGIES ET REGIMES"]
["JOURS","DATES","Pique Niques ?",null,"Moins de 6 ans","Plus de\n6 ans","Adultes","Total Pique niques","Total Repas","Vétarien","Sans Porc","Sans Aïl Oignon Echalote Champignon"]
[null,null,"Moins de\n 6 ans","Plus de \n6 ans"]
["Mercredi",{"$f":"An!S29","v":"2015-09-02"},false,false,{"$f":"SUMIFS(Tableauseptembre[7],Tableauseptembre[24],\"<6\")","v":12},{"$f":"SUMIFS(Tableauseptembre[7],Tableauseptembre[24],\">=6\")","v":14},null,{"$f":"SUMIFS(E8,C8,\"vrai\")+SUMIFS(F8,D8,\"vrai\")+G8","v":0},{"$f":"G8+F8+E8-H8","v":26},{"$f":"SUMPRODUCT((Tableauseptembre[7]=1)*(Tableauseptembre[Colonne5]=1)*(Tableauseptembre[Colonne5]))","v":0},{"$f":"SUMPRODUCT((Tableauseptembre[7]=1)*(Tableauseptembre[Colonne5]=3)*(Tableauseptembre[Colonne5]))/3","v":0},{"$f":"SUMPRODUCT((Tableauseptembre[7]=1)*(Tableauseptembre[Colonne5]=4)*(Tableauseptembre[Colonne5]))/4","v":0}]
["Mercredi",{"$f":"An!S30","v":"2015-09-09"},false,false,{"$f":"SUMIFS(Tableauseptembre[10],Tableauseptembre[24],\"<6\")","v":12},{"$f":"SUMIFS(Tableauseptembre[10],Tableauseptembre[24],\">=6\")","v":19},null,{"$f":"SUMIFS(E9,C9,\"vrai\")+SUMIFS(F9,D9,\"vrai\")+G9","v":0},{"$f":"G9+F9+E9-H9","v":31},{"$f":"SUMPRODUCT((Tableauseptembre[10]=1)*(Tableauseptembre[Colonne5]=1)*(Tableauseptembre[Colonne5]))","v":0},{"$f":"SUMPRODUCT((Tableauseptembre[10]=1)*(Tableauseptembre[Colonne5]=3)*(Tableauseptembre[Colonne5]))/3","v":0},{"$f":"SUMPRODUCT((Tableauseptembre[10]=1)*(Tableauseptembre[Colonne5]=4)*(Tableauseptembre[Colonne5]))/4","v":0}]
["Mercredi",{"$f":"An!S31","v":"2015-09-16"},false,false,{"$f":"SUMIFS(Tableauseptembre[13],Tableauseptembre[24],\"<6\")","v":16},{"$f":"SUMIFS(Tableauseptembre[13],Tableauseptembre[24],\">=6\")","v":22},null,{"$f":"SUMIFS(E10,C10,\"vrai\")+SUMIFS(F10,D10,\"vrai\")+G10","v":0},{"$f":"G10+F10+E10-H10","v":38},{"$f":"SUMPRODUCT((Tableauseptembre[13]=1)*(Tableauseptembre[Colonne5]=1)*(Tableauseptembre[Colonne5]))","v":0},{"$f":"SUMPRODUCT((Tableauseptembre[13]=1)*(Tableauseptembre[Colonne5]=3)*(Tableauseptembre[Colonne5]))/3","v":0},{"$f":"SUMPRODUCT((Tableauseptembre[13]=1)*(Tableauseptembre[Colonne5]=4)*(Tableauseptembre[Colonne5]))/4","v":0}]
["Mercredi",{"$f":"An!S32","v":"2015-09-23"},false,false,{"$f":"SUMIFS(Tableauseptembre[16],Tableauseptembre[24],\"<6\")","v":15},{"$f":"SUMIFS(Tableauseptembre[16],Tableauseptembre[24],\">=6\")","v":18},null,{"$f":"SUMIFS(E11,C11,\"vrai\")+SUMIFS(F11,D11,\"vrai\")+G11","v":0},{"$f":"G11+F11+E11-H11","v":33},{"$f":"SUMPRODUCT((Tableauseptembre[16]=1)*(Tableauseptembre[Colonne5]=1)*(Tableauseptembre[Colonne5]))","v":0},{"$f":"SUMPRODUCT((Tableauseptembre[16]=1)*(Tableauseptembre[Colonne5]=3)*(Tableauseptembre[Colonne5]))/3","v":0},{"$f":"SUMPRODUCT((Tableauseptembre[16]=1)*(Tableauseptembre[Colonne5]=4)*(Tableauseptembre[Colonne5]))/4","v":0}]
["Mercredi",{"$f":"An!S33","v":"2015-09-30"},false,false,{"$f":"SUMIFS(Tableauseptembre[19],Tableauseptembre[24],\"<6\")","v":17},{"$f":"SUMIFS(Tableauseptembre[19],Tableauseptembre[24],\">=6\")","v":17},null,{"$f":"SUMIFS(E12,C12,\"vrai\")+SUMIFS(F12,D12,\"vrai\")+G12","v":0},{"$f":"G12+F12+E12-H12","v":34},{"$f":"SUMPRODUCT((Tableauseptembre[19]=1)*(Tableauseptembre[Colonne5]=1)*(Tableauseptembre[Colonne5]))","v":0},{"$f":"SUMPRODUCT((Tableauseptembre[19]=1)*(Tableauseptembre[Colonne5]=3)*(Tableauseptembre[Colonne5]))/3","v":0},{"$f":"SUMPRODUCT((Tableauseptembre[19]=1)*(Tableauseptembre[Colonne5]=4)*(Tableauseptembre[Colonne5]))/4","v":0}]
[]
["Mois de : ",null,null,null,{"$f":"Octobre!J3","v":"Octobre"},null,null,{"$f":"Accueil!C18","v":2015}]
[]
["EFFECTIFS",null,null,null,null,null,null,null,null,"ALLERGIES ET REGIMES"]
["JOURS","DATES","Pique Niques ?",null,"Moins de 6 ans","Plus de\n6 ans","Adultes","Total Pique niques","Total Repas","Vétarien","Sans Porc","Sans Aïl Oignon Echalote Champignon"]
[null,null,"Moins de\n 6 ans","Plus de \n6 ans"]
["Mercredi",{"$f":"An!C38","v":""},false,false,{"$f":"SUMIFS(Tableauoctobre[7],Tableauoctobre[24],\"<6\")","v":0},{"$f":"SUMIFS(Tableauoctobre[7],Tableauoctobre[24],\">=6\")","v":0},null,{"$f":"SUMIFS(E19,C19,\"vrai\")+SUMIFS(F19,D19,\"vrai\")+G19","v":0},{"$f":"G19+F19+E19-H19","v":0},{"$f":"SUMPRODUCT((Tableauoctobre[7]=1)*(Tableauoctobre[Colonne5]=1)*(Tableauoctobre[Colonne5]))","v":0},{"$f":"SUMPRODUCT((Tableauoctobre[7]=1)*(Tableauoctobre[Colonne5]=3)*(Tableauoctobre[Colonne5]))/3","v":0},{"$f":"SUMPRODUCT((Tableauoctobre[7]=1)*(Tableauoctobre[Colonne5]=4)*(Tableauoctobre[Colonne5]))/4","v":0}]
["Mercredi",{"$f":"An!C39","v":"2015-10-07"},false,false,{"$f":"SUMIFS(Tableauoctobre[10],Tableauoctobre[24],\"<6\")","v":12},{"$f":"SUMIFS(Tableauoctobre[10],Tableauoctobre[24],\">=6\")","v":19},null,{"$f":"SUMIFS(E20,C20,\"vrai\")+SUMIFS(F20,D20,\"vrai\")+G20","v":0},{"$f":"G20+F20+E20-H20","v":31},{"$f":"SUMPRODUCT((Tableauoctobre[10]=1)*(Tableauoctobre[Colonne5]=1)*(Tableauoctobre[Colonne5]))","v":0},{"$f":"SUMPRODUCT((Tableauoctobre[10]=1)*(Tableauoctobre[Colonne5]=3)*(Tableauoctobre[Colonne5]))/3","v":0},{"$f":"SUMPRODUCT((Tableauoctobre[10]=1)*(Tableauoctobre[Colonne5]=4)*(Tableauoctobre[Colonne5]))/4","v":0}]
["Mercredi",{"$f":"An!C40","v":"2015-10-14"},false,false,{"$f":"SUMIFS(Tableauoctobre[13],Tableauoctobre[24],\"<6\")","v":16},{"$f":"SUMIFS(Tableauoctobre[13],Tableauoctobre[24],\">=6\")","v":17},null,{"$f":"SUMIFS(E21,C21,\"vrai\")+SUMIFS(F21,D21,\"vrai\")+G21","v":0},{"$f":"G21+F21+E21-H21","v":33},{"$f":"SUMPRODUCT((Tableauoctobre[13]=1)*(Tableauoctobre[Colonne5]=1)*(Tableauoctobre[Colonne5]))","v":0},{"$f":"SUMPRODUCT((Tableauoctobre[13]=1)*(Tableauoctobre[Colonne5]=3)*(Tableauoctobre[Colonne5]))/3","v":0},{"$f":"SUMPRODUCT((Tableauoctobre[13]=1)*(Tableauoctobre[Colonne5]=4)*(Tableauoctobre[Colonne5]))/4","v":0}]
["Mercredi",{"$f":"An!C41","v":"2015-10-21"},false,false,{"$f":"SUMIFS(Tableauoctobre[16],Tableauoctobre[24],\"<6\")","v":0},{"$f":"SUMIFS(Tableauoctobre[16],Tableauoctobre[24],\">=6\")","v":0},null,{"$f":"SUMIFS(E22,C22,\"vrai\")+SUMIFS(F22,D22,\"vrai\")+G22","v":0},{"$f":"G22+F22+E22-H22","v":0},{"$f":"SUMPRODUCT((Tableauoctobre[16]=1)*(Tableauoctobre[Colonne5]=1)*(Tableauoctobre[Colonne5]))","v":0},{"$f":"SUMPRODUCT((Tableauoctobre[16]=1)*(Tableauoctobre[Colonne5]=3)*(Tableauoctobre[Colonne5]))/3","v":0},{"$f":"SUMPRODUCT((Tableauoctobre[16]=1)*(Tableauoctobre[Colonne5]=4)*(Tableauoctobre[Colonne5]))/4","v":0}]
["Mercredi",{"$f":"An!C42","v":"2015-10-28"},false,false,{"$f":"SUMIFS(Tableauoctobre[19],Tableauoctobre[24],\"<6\")","v":0},{"$f":"SUMIFS(Tableauoctobre[19],Tableauoctobre[24],\">=6\")","v":0},null,{"$f":"SUMIFS(E23,C23,\"vrai\")+SUMIFS(F23,D23,\"vrai\")+G23","v":0},{"$f":"G23+F23+E23-H23","v":0},{"$f":"SUMPRODUCT((Tableauoctobre[19]=1)*(Tableauoctobre[Colonne5]=1)*(Tableauoctobre[Colonne5]))","v":0},{"$f":"SUMPRODUCT((Tableauoctobre[19]=1)*(Tableauoctobre[Colonne5]=3)*(Tableauoctobre[Colonne5]))/3","v":0},{"$f":"SUMPRODUCT((Tableauoctobre[19]=1)*(Tableauoctobre[Colonne5]=4)*(Tableauoctobre[Colonne5]))/4","v":0}]
[]
["Mois de : ",null,null,null,{"$f":"Novembre!J3","v":"Novembre"},null,null,{"$f":"Accueil!C18","v":2015}]
[]
["EFFECTIFS",null,null,null,null,null,null,null,null,"ALLERGIES ET REGIMES"]
["JOURS","DATES","Pique Niques ?",null,"Moins de 6 ans","Plus de\n6 ans","Adultes","Total Pique niques","Total Repas","Vétarien","Sans Porc","Sans Aïl Oignon Echalote Champignon"]
[null,null,"Moins de\n 6 ans","Plus de \n6 ans"]
["Mercredi",{"$f":"An!K39","v":"2015-11-04"},false,false,{"$f":"SUMIFS(Tableaunovembre[7],Tableaunovembre[24],\"<6\")","v":17},{"$f":"SUMIFS(Tableaunovembre[7],Tableaunovembre[24],\">=6\")","v":20},null,{"$f":"SUMIFS(E30,C30,\"vrai\")+SUMIFS(F30,D30,\"vrai\")+G30","v":0},{"$f":"G30+F30+E30-H30","v":37},{"$f":"SUMPRODUCT((Tableaunovembre[7]=1)*(Tableaunovembre[Colonne5]=1)*(Tableaunovembre[Colonne5]))","v":0},{"$f":"SUMPRODUCT((Tableaunovembre[7]=1)*(Tableaunovembre[Colonne5]=3)*(Tableaunovembre[Colonne5]))/3","v":0},{"$f":"SUMPRODUCT((Tableaunovembre[7]=1)*(Tableaunovembre[Colonne5]=4)*(Tableaunovembre[Colonne5]))/4","v":0}]
["Mercredi",{"$f":"An!K40","v":"2015-11-11"},false,false,{"$f":"SUMIFS(Tableaunovembre[10],Tableaunovembre[24],\"<6\")","v":0},{"$f":"SUMIFS(Tableaunovembre[10],Tableaunovembre[24],\">=6\")","v":0},null,{"$f":"SUMIFS(E31,C31,\"vrai\")+SUMIFS(F31,D31,\"vrai\")+G31","v":0},{"$f":"G31+F31+E31-H31","v":0},{"$f":"SUMPRODUCT((Tableaunovembre[10]=1)*(Tableaunovembre[Colonne5]=1)*(Tableaunovembre[Colonne5]))","v":0},{"$f":"SUMPRODUCT((Tableaunovembre[10]=1)*(Tableaunovembre[Colonne5]=3)*(Tableaunovembre[Colonne5]))/3","v":0},{"$f":"SUMPRODUCT((Tableaunovembre[10]=1)*(Tableaunovembre[Colonne5]=4)*(Tableaunovembre[Colonne5]))/4","v":0}]
["Mercredi",{"$f":"An!K41","v":"2015-11-18"},false,false,{"$f":"SUMIFS(Tableaunovembre[13],Tableaunovembre[24],\"<6\")","v":17},{"$f":"SUMIFS(Tableaunovembre[13],Tableaunovembre[24],\">=6\")","v":20},null,{"$f":"SUMIFS(E32,C32,\"vrai\")+SUMIFS(F32,D32,\"vrai\")+G32","v":0},{"$f":"G32+F32+E32-H32","v":37},{"$f":"SUMPRODUCT((Tableaunovembre[13]=1)*(Tableaunovembre[Colonne5]=1)*(Tableaunovembre[Colonne5]))","v":0},{"$f":"SUMPRODUCT((Tableaunovembre[13]=1)*(Tableaunovembre[Colonne5]=3)*(Tableaunovembre[Colonne5]))/3","v":0},{"$f":"SUMPRODUCT((Tableaunovembre[13]=1)*(Tableaunovembre[Colonne5]=4)*(Tableaunovembre[Colonne5]))/4","v":0}]
["Mercredi",{"$f":"An!K42","v":"2015-11-25"},false,false,{"$f":"SUMIFS(Tableaunovembre[16],Tableaunovembre[24],\"<6\")","v":15},{"$f":"SUMIFS(Tableaunovembre[16],Tableaunovembre[24],\">=6\")","v":14},null,{"$f":"SUMIFS(E33,C33,\"vrai\")+SUMIFS(F33,D33,\"vrai\")+G33","v":0},{"$f":"G33+F33+E33-H33","v":29},{"$f":"SUMPRODUCT((Tableaunovembre[16]=1)*(Tableaunovembre[Colonne5]=1)*(Tableaunovembre[Colonne5]))","v":0},{"$f":"SUMPRODUCT((Tableaunovembre[16]=1)*(Tableaunovembre[Colonne5]=3)*(Tableaunovembre[Colonne5]))/3","v":0},{"$f":"SUMPRODUCT((Tableaunovembre[16]=1)*(Tableaunovembre[Colonne5]=4)*(Tableaunovembre[Colonne5]))/4","v":0}]
["Mercredi",{"$f":"An!K43","v":""},false,false,{"$f":"SUMIFS(Tableaunovembre[19],Tableaunovembre[24],\"<6\")","v":0},{"$f":"SUMIFS(Tableaunovembre[19],Tableaunovembre[24],\">=6\")","v":0},null,{"$f":"SUMIFS(E34,C34,\"vrai\")+SUMIFS(F34,D34,\"vrai\")+G34","v":0},{"$f":"G34+F34+E34-H34","v":0},{"$f":"SUMPRODUCT((Tableaunovembre[19]=1)*(Tableaunovembre[Colonne5]=1)*(Tableaunovembre[Colonne5]))","v":0},{"$f":"SUMPRODUCT((Tableaunovembre[19]=1)*(Tableaunovembre[Colonne5]=3)*(Tableaunovembre[Colonne5]))/3","v":0},{"$f":"SUMPRODUCT((Tableaunovembre[19]=1)*(Tableaunovembre[Colonne5]=4)*(Tableaunovembre[Colonne5]))/4","v":0}]
[]
["Mois de : ",null,null,null,{"$f":"Décembre!J3","v":"Décembre"},null,null,{"$f":"Accueil!C18","v":2015}]
[]
["EFFECTIFS",null,null,null,null,null,null,null,null,"ALLERGIES ET REGIMES"]
["JOURS","DATES","Pique Niques ?",null,"Moins de 6 ans","Plus de\n6 ans","Adultes","Total Pique niques","Total Repas","Vétarien","Sans Porc","Sans Aïl Oignon Echalote Champignon"]
[null,null,"Moins de\n 6 ans","Plus de \n6 ans"]
["Mercredi",{"$f":"An!S38","v":"2015-12-02"},false,false,{"$f":"SUMIFS(Tableaudécembre[7],Tableaudécembre[24],\"<6\")","v":15},{"$f":"SUMIFS(Tableaudécembre[7],Tableaudécembre[24],\">=6\")","v":19},null,{"$f":"SUMIFS(E41,C41,\"vrai\")+SUMIFS(F41,D41,\"vrai\")+G41","v":0},{"$f":"G41+F41+E41-H41","v":34},{"$f":"SUMPRODUCT((Tableaudécembre[7]=1)*(Tableaudécembre[Colonne5]=1)*(Tableaudécembre[Colonne5]))","v":0},{"$f":"SUMPRODUCT((Tableaudécembre[7]=1)*(Tableaudécembre[Colonne5]=3)*(Tableaudécembre[Colonne5]))/3","v":3},{"$f":"SUMPRODUCT((Tableaudécembre[7]=1)*(Tableaudécembre[Colonne5]=4)*(Tableaudécembre[Colonne5]))/4","v":0}]
["Mercredi",{"$f":"An!S39","v":"2015-12-09"},false,false,{"$f":"SUMIFS(Tableaudécembre[10],Tableaudécembre[24],\"<6\")","v":16},{"$f":"SUMIFS(Tableaudécembre[10],Tableaudécembre[24],\">=6\")","v":19},null,{"$f":"SUMIFS(E42,C42,\"vrai\")+SUMIFS(F42,D42,\"vrai\")+G42","v":0},{"$f":"G42+F42+E42-H42","v":35},{"$f":"SUMPRODUCT((Tableaudécembre[10]=1)*(Tableaudécembre[Colonne5]=1)*(Tableaudécembre[Colonne5]))","v":0},{"$f":"SUMPRODUCT((Tableaudécembre[10]=1)*(Tableaudécembre[Colonne5]=3)*(Tableaudécembre[Colonne5]))/3","v":3},{"$f":"SUMPRODUCT((Tableaudécembre[10]=1)*(Tableaudécembre[Colonne5]=4)*(Tableaudécembre[Colonne5]))/4","v":0}]
["Mercredi",{"$f":"An!S40","v":"2015-12-16"},false,false,{"$f":"SUMIFS(Tableaudécembre[13],Tableaudécembre[24],\"<6\")","v":12},{"$f":"SUMIFS(Tableaudécembre[13],Tableaudécembre[24],\">=6\")","v":15},null,{"$f":"SUMIFS(E43,C43,\"vrai\")+SUMIFS(F43,D43,\"vrai\")+G43","v":0},{"$f":"G43+F43+E43-H43","v":27},{"$f":"SUMPRODUCT((Tableaudécembre[13]=1)*(Tableaudécembre[Colonne5]=1)*(Tableaudécembre[Colonne5]))","v":0},{"$f":"SUMPRODUCT((Tableaudécembre[13]=1)*(Tableaudécembre[Colonne5]=3)*(Tableaudécembre[Colonne5]))/3","v":3},{"$f":"SUMPRODUCT((Tableaudécembre[13]=1)*(Tableaudécembre[Colonne5]=4)*(Tableaudécembre[Colonne5]))/4","v":0}]
["Mercredi",{"$f":"An!S41","v":"2015-12-23"},false,false,{"$f":"SUMIFS(Tableaudécembre[16],Tableaudécembre[24],\"<6\")","v":0},{"$f":"SUMIFS(Tableaudécembre[16],Tableaudécembre[24],\">=6\")","v":0},null,{"$f":"SUMIFS(E44,C44,\"vrai\")+SUMIFS(F44,D44,\"vrai\")+G44","v":0},{"$f":"G44+F44+E44-H44","v":0},{"$f":"SUMPRODUCT((Tableaudécembre[16]=1)*(Tableaudécembre[Colonne5]=1)*(Tableaudécembre[Colonne5]))","v":0},{"$f":"SUMPRODUCT((Tableaudécembre[16]=1)*(Tableaudécembre[Colonne5]=3)*(Tableaudécembre[Colonne5]))/3","v":0},{"$f":"SUMPRODUCT((Tableaudécembre[16]=1)*(Tableaudécembre[Colonne5]=4)*(Tableaudécembre[Colonne5]))/4","v":0}]
["Mercredi",{"$f":"An!S42","v":"2015-12-30"},false,false,{"$f":"SUMIFS(Tableaudécembre[19],Tableaudécembre[24],\"<6\")","v":0},{"$f":"SUMIFS(Tableaudécembre[19],Tableaudécembre[24],\">=6\")","v":0},null,{"$f":"SUMIFS(E45,C45,\"vrai\")+SUMIFS(F45,D45,\"vrai\")+G45","v":0},{"$f":"G45+F45+E45-H45","v":0},{"$f":"SUMPRODUCT((Tableaudécembre[19]=1)*(Tableaudécembre[Colonne5]=1)*(Tableaudécembre[Colonne5]))","v":0},{"$f":"SUMPRODUCT((Tableaudécembre[19]=1)*(Tableaudécembre[Colonne5]=3)*(Tableaudécembre[Colonne5]))/3","v":0},{"$f":"SUMPRODUCT((Tableaudécembre[19]=1)*(Tableaudécembre[Colonne5]=4)*(Tableaudécembre[Colonne5]))/4","v":0}]
[]
["Mois de : ",null,null,null,{"$f":"Janvier!J3","v":"Janvier"},null,null,{"$f":"Accueil!C18+1","v":2016}]
[]
["EFFECTIFS",null,null,null,null,null,null,null,null,"ALLERGIES ET REGIMES"]
["JOURS","DATES","Pique Niques ?",null,"Moins de 6 ans","Plus de\n6 ans","Adultes","Total Pique niques","Total Repas","Vétarien","Sans Porc","Sans Aïl Oignon Echalote Champignon"]
[null,null,"Moins de\n 6 ans","Plus de \n6 ans"]
["Mercredi",{"$f":"'An1'!C11","v":""},false,false,{"$f":"SUMIFS(Tableaujanvier[7],Tableaujanvier[24],\"<6\")","v":0},{"$f":"SUMIFS(Tableaujanvier[7],Tableaujanvier[24],\">=6\")","v":0},null,{"$f":"SUMIFS(E52,C52,\"vrai\")+SUMIFS(F52,D52,\"vrai\")+G52","v":0},{"$f":"G52+F52+E52-H52","v":0},{"$f":"SUMPRODUCT((Tableaujanvier[7]=1)*(Tableaujanvier[Colonne5]=1)*(Tableaujanvier[Colonne5]))","v":0},{"$f":"SUMPRODUCT((Tableaujanvier[7]=1)*(Tableaujanvier[Colonne5]=3)*(Tableaujanvier[Colonne5]))/3","v":0},{"$f":"SUMPRODUCT((Tableaujanvier[7]=1)*(Tableaujanvier[Colonne5]=4)*(Tableaujanvier[Colonne5]))/4","v":0}]
["Mercredi",{"$f":"'An1'!C12","v":"2016-01-06"},false,false,{"$f":"SUMIFS(Tableaujanvier[10],Tableaujanvier[24],\"<6\")","v":14},{"$f":"SUMIFS(Tableaujanvier[10],Tableaujanvier[24],\">=6\")","v":19},null,{"$f":"SUMIFS(E53,C53,\"vrai\")+SUMIFS(F53,D53,\"vrai\")+G53","v":0},{"$f":"G53+F53+E53-H53","v":33},{"$f":"SUMPRODUCT((Tableaujanvier[10]=1)*(Tableaujanvier[Colonne5]=1)*(Tableaujanvier[Colonne5]))","v":0},{"$f":"SUMPRODUCT((Tableaujanvier[10]=1)*(Tableaujanvier[Colonne5]=3)*(Tableaujanvier[Colonne5]))/3","v":3},{"$f":"SUMPRODUCT((Tableaujanvier[10]=1)*(Tableaujanvier[Colonne5]=4)*(Tableaujanvier[Colonne5]))/4","v":0}]
["Mercredi",{"$f":"'An1'!C13","v":"2016-01-13"},false,false,{"$f":"SUMIFS(Tableaujanvier[13],Tableaujanvier[24],\"<6\")","v":16},{"$f":"SUMIFS(Tableaujanvier[13],Tableaujanvier[24],\">=6\")","v":23},null,{"$f":"SUMIFS(E54,C54,\"vrai\")+SUMIFS(F54,D54,\"vrai\")+G54","v":0},{"$f":"G54+F54+E54-H54","v":39},{"$f":"SUMPRODUCT((Tableaujanvier[13]=1)*(Tableaujanvier[Colonne5]=1)*(Tableaujanvier[Colonne5]))","v":0},{"$f":"SUMPRODUCT((Tableaujanvier[13]=1)*(Tableaujanvier[Colonne5]=3)*(Tableaujanvier[Colonne5]))/3","v":3},{"$f":"SUMPRODUCT((Tableaujanvier[13]=1)*(Tableaujanvier[Colonne5]=4)*(Tableaujanvier[Colonne5]))/4","v":0}]
["Mercredi",{"$f":"'An1'!C14","v":"2016-01-20"},false,false,{"$f":"SUMIFS(Tableaujanvier[16],Tableaujanvier[24],\"<6\")","v":16},{"$f":"SUMIFS(Tableaujanvier[16],Tableaujanvier[24],\">=6\")","v":15},null,{"$f":"SUMIFS(E55,C55,\"vrai\")+SUMIFS(F55,D55,\"vrai\")+G55","v":0},{"$f":"G55+F55+E55-H55","v":31},{"$f":"SUMPRODUCT((Tableaujanvier[16]=1)*(Tableaujanvier[Colonne5]=1)*(Tableaujanvier[Colonne5]))","v":0},{"$f":"SUMPRODUCT((Tableaujanvier[16]=1)*(Tableaujanvier[Colonne5]=3)*(Tableaujanvier[Colonne5]))/3","v":2},{"$f":"SUMPRODUCT((Tableaujanvier[16]=1)*(Tableaujanvier[Colonne5]=4)*(Tableaujanvier[Colonne5]))/4","v":0}]
["Mercredi",{"$f":"'An1'!C15","v":"2016-01-27"},false,false,{"$f":"SUMIFS(Tableaujanvier[19],Tableaujanvier[24],\"<6\")","v":17},{"$f":"SUMIFS(Tableaujanvier[19],Tableaujanvier[24],\">=6\")","v":22},null,{"$f":"SUMIFS(E56,C56,\"vrai\")+SUMIFS(F56,D56,\"vrai\")+G56","v":0},{"$f":"G56+F56+E56-H56","v":39},{"$f":"SUMPRODUCT((Tableaujanvier[19]=1)*(Tableaujanvier[Colonne5]=1)*(Tableaujanvier[Colonne5]))","v":0},{"$f":"SUMPRODUCT((Tableaujanvier[19]=1)*(Tableaujanvier[Colonne5]=3)*(Tableaujanvier[Colonne5]))/3","v":3},{"$f":"SUMPRODUCT((Tableaujanvier[19]=1)*(Tableaujanvier[Colonne5]=4)*(Tableaujanvier[Colonne5]))/4","v":0}]
[]
["Mois de : ",null,null,null,{"$f":"Février!J3","v":"Février"},null,null,{"$f":"Accueil!C18+1","v":2016}]
[]
["EFFECTIFS",null,null,null,null,null,null,null,null,"ALLERGIES ET REGIMES"]
["JOURS","DATES","Pique Niques ?",null,"Moins de 6 ans","Plus de\n6 ans","Adultes","Total Pique niques","Total Repas","Vétarien","Sans Porc","Sans Aïl Oignon Echalote Champignon"]
[null,null,"Moins de\n 6 ans","Plus de \n6 ans"]
["Mercredi",{"$f":"'An1'!K11","v":"2016-02-03"},false,false,{"$f":"SUMIFS(Tableaufévrier[7],Tableaufévrier[24],\"<6\")","v":16},{"$f":"SUMIFS(Tableaufévrier[7],Tableaufévrier[24],\">=6\")","v":17},null,{"$f":"SUMIFS(E63,C63,\"vrai\")+SUMIFS(F63,D63,\"vrai\")+G63","v":0},{"$f":"G63+F63+E63-H63","v":33},{"$f":"SUMPRODUCT((Tableaufévrier[7]=1)*(Tableaufévrier[Colonne5]=1)*(Tableaufévrier[Colonne5]))","v":0},{"$f":"SUMPRODUCT((Tableaufévrier[7]=1)*(Tableaufévrier[Colonne5]=3)*(Tableaufévrier[Colonne5]))/3","v":3},{"$f":"SUMPRODUCT((Tableaufévrier[7]=1)*(Tableaufévrier[Colonne5]=4)*(Tableaufévrier[Colonne5]))/4","v":0}]
["Mercredi",{"$f":"'An1'!K12","v":"2016-02-10"},false,false,{"$f":"SUMIFS(Tableaufévrier[10],Tableaufévrier[24],\"<6\")","v":15},{"$f":"SUMIFS(Tableaufévrier[10],Tableaufévrier[24],\">=6\")","v":20},null,{"$f":"SUMIFS(E64,C64,\"vrai\")+SUMIFS(F64,D64,\"vrai\")+G64","v":0},{"$f":"G64+F64+E64-H64","v":35},{"$f":"SUMPRODUCT((Tableaufévrier[10]=1)*(Tableaufévrier[Colonne5]=1)*(Tableaufévrier[Colonne5]))","v":0},{"$f":"SUMPRODUCT((Tableaufévrier[10]=1)*(Tableaufévrier[Colonne5]=3)*(Tableaufévrier[Colonne5]))/3","v":3},{"$f":"SUMPRODUCT((Tableaufévrier[10]=1)*(Tableaufévrier[Colonne5]=4)*(Tableaufévrier[Colonne5]))/4","v":0}]
["Mercredi",{"$f":"'An1'!K13","v":"2016-02-17"},false,false,{"$f":"SUMIFS(Tableaufévrier[13],Tableaufévrier[24],\"<6\")","v":15},{"$f":"SUMIFS(Tableaufévrier[13],Tableaufévrier[24],\">=6\")","v":17},null,{"$f":"SUMIFS(E65,C65,\"vrai\")+SUMIFS(F65,D65,\"vrai\")+G65","v":0},{"$f":"G65+F65+E65-H65","v":32},{"$f":"SUMPRODUCT((Tableaufévrier[13]=1)*(Tableaufévrier[Colonne5]=1)*(Tableaufévrier[Colonne5]))","v":0},{"$f":"SUMPRODUCT((Tableaufévrier[13]=1)*(Tableaufévrier[Colonne5]=3)*(Tableaufévrier[Colonne5]))/3","v":3},{"$f":"SUMPRODUCT((Tableaufévrier[13]=1)*(Tableaufévrier[Colonne5]=4)*(Tableaufévrier[Colonne5]))/4","v":0}]
["Mercredi",{"$f":"'An1'!K14","v":"2016-02-24"},false,false,{"$f":"SUMIFS(Tableaufévrier[16],Tableaufévrier[24],\"<6\")","v":0},{"$f":"SUMIFS(Tableaufévrier[16],Tableaufévrier[24],\">=6\")","v":0},null,{"$f":"SUMIFS(E66,C66,\"vrai\")+SUMIFS(F66,D66,\"vrai\")+G66","v":0},{"$f":"G66+F66+E66-H66","v":0},{"$f":"SUMPRODUCT((Tableaufévrier[16]=1)*(Tableaufévrier[Colonne5]=1)*(Tableaufévrier[Colonne5]))","v":0},{"$f":"SUMPRODUCT((Tableaufévrier[16]=1)*(Tableaufévrier[Colonne5]=3)*(Tableaufévrier[Colonne5]))/3","v":0},{"$f":"SUMPRODUCT((Tableaufévrier[16]=1)*(Tableaufévrier[Colonne5]=4)*(Tableaufévrier[Colonne5]))/4","v":0}]
["Mercredi",{"$f":"'An1'!K15","v":""},false,false,{"$f":"SUMIFS(Tableaufévrier[19],Tableaufévrier[24],\"<6\")","v":0},{"$f":"SUMIFS(Tableaufévrier[19],Tableaufévrier[24],\">=6\")","v":0},null,{"$f":"SUMIFS(E67,C67,\"vrai\")+SUMIFS(F67,D67,\"vrai\")+G67","v":0},{"$f":"G67+F67+E67-H67","v":0},{"$f":"SUMPRODUCT((Tableaufévrier[19]=1)*(Tableaufévrier[Colonne5]=1)*(Tableaufévrier[Colonne5]))","v":0},{"$f":"SUMPRODUCT((Tableaufévrier[19]=1)*(Tableaufévrier[Colonne5]=3)*(Tableaufévrier[Colonne5]))/3","v":0},{"$f":"SUMPRODUCT((Tableaufévrier[19]=1)*(Tableaufévrier[Colonne5]=4)*(Tableaufévrier[Colonne5]))/4","v":0}]
[]
["Mois de : ",null,null,null,{"$f":"Mars!J3","v":"Mars"},null,null,{"$f":"Accueil!C18+1","v":2016}]
[]
["EFFECTIFS",null,null,null,null,null,null,null,null,"ALLERGIES ET REGIMES"]
["JOURS","DATES","Pique Niques ?",null,"Moins de 6 ans","Plus de\n6 ans","Adultes","Total Pique niques","Total Repas","Vétarien","Sans Porc","Sans Aïl Oignon Echalote Champignon"]
[null,null,"Moins de\n 6 ans","Plus de \n6 ans"]
["Mercredi",{"$f":"'An1'!S11","v":"2016-03-02"},false,false,{"$f":"SUMIFS(Tableaumars[7],Tableaumars[24],\"<6\")","v":11},{"$f":"SUMIFS(Tableaumars[7],Tableaumars[24],\">=6\")","v":9},null,{"$f":"SUMIFS(E74,C74,\"vrai\")+SUMIFS(F74,D74,\"vrai\")+G74","v":0},{"$f":"G74+F74+E74-H74","v":20},{"$f":"SUMPRODUCT((Tableaumars[7]=1)*(Tableaumars[Colonne5]=1)*(Tableaumars[Colonne5]))","v":0},{"$f":"SUMPRODUCT((Tableaumars[7]=1)*(Tableaumars[Colonne5]=3)*(Tableaumars[Colonne5]))/3","v":0},{"$f":"SUMPRODUCT((Tableaumars[7]=1)*(Tableaumars[Colonne5]=4)*(Tableaumars[Colonne5]))/4","v":0}]
["Mercredi",{"$f":"'An1'!S12","v":"2016-03-09"},false,false,{"$f":"SUMIFS(Tableaumars[10],Tableaumars[24],\"<6\")","v":12},{"$f":"SUMIFS(Tableaumars[10],Tableaumars[24],\">=6\")","v":13},null,{"$f":"SUMIFS(E75,C75,\"vrai\")+SUMIFS(F75,D75,\"vrai\")+G75","v":0},{"$f":"G75+F75+E75-H75","v":25},{"$f":"SUMPRODUCT((Tableaumars[10]=1)*(Tableaumars[Colonne5]=1)*(Tableaumars[Colonne5]))","v":0},{"$f":"SUMPRODUCT((Tableaumars[10]=1)*(Tableaumars[Colonne5]=3)*(Tableaumars[Colonne5]))/3","v":0},{"$f":"SUMPRODUCT((Tableaumars[10]=1)*(Tableaumars[Colonne5]=4)*(Tableaumars[Colonne5]))/4","v":0}]
["Mercredi",{"$f":"'An1'!S13","v":"2016-03-16"},false,false,{"$f":"SUMIFS(Tableaumars[13],Tableaumars[24],\"<6\")","v":14},{"$f":"SUMIFS(Tableaumars[13],Tableaumars[24],\">=6\")","v":10},null,{"$f":"SUMIFS(E76,C76,\"vrai\")+SUMIFS(F76,D76,\"vrai\")+G76","v":0},{"$f":"G76+F76+E76-H76","v":24},{"$f":"SUMPRODUCT((Tableaumars[13]=1)*(Tableaumars[Colonne5]=1)*(Tableaumars[Colonne5]))","v":0},{"$f":"SUMPRODUCT((Tableaumars[13]=1)*(Tableaumars[Colonne5]=3)*(Tableaumars[Colonne5]))/3","v":0},{"$f":"SUMPRODUCT((Tableaumars[13]=1)*(Tableaumars[Colonne5]=4)*(Tableaumars[Colonne5]))/4","v":0}]
["Mercredi",{"$f":"'An1'!S14","v":"2016-03-23"},false,false,{"$f":"SUMIFS(Tableaumars[16],Tableaumars[24],\"<6\")","v":16},{"$f":"SUMIFS(Tableaumars[16],Tableaumars[24],\">=6\")","v":15},null,{"$f":"SUMIFS(E77,C77,\"vrai\")+SUMIFS(F77,D77,\"vrai\")+G77","v":0},{"$f":"G77+F77+E77-H77","v":31},{"$f":"SUMPRODUCT((Tableaumars[16]=1)*(Tableaumars[Colonne5]=1)*(Tableaumars[Colonne5]))","v":0},{"$f":"SUMPRODUCT((Tableaumars[16]=1)*(Tableaumars[Colonne5]=3)*(Tableaumars[Colonne5]))/3","v":0},{"$f":"SUMPRODUCT((Tableaumars[16]=1)*(Tableaumars[Colonne5]=4)*(Tableaumars[Colonne5]))/4","v":0}]
["Mercredi",{"$f":"'An1'!S15","v":"2016-03-30"},false,false,{"$f":"SUMIFS(Tableaumars[19],Tableaumars[24],\"<6\")","v":14},{"$f":"SUMIFS(Tableaumars[19],Tableaumars[24],\">=6\")","v":10},null,{"$f":"SUMIFS(E78,C78,\"vrai\")+SUMIFS(F78,D78,\"vrai\")+G78","v":0},{"$f":"G78+F78+E78-H78","v":24},{"$f":"SUMPRODUCT((Tableaumars[19]=1)*(Tableaumars[Colonne5]=1)*(Tableaumars[Colonne5]))","v":0},{"$f":"SUMPRODUCT((Tableaumars[19]=1)*(Tableaumars[Colonne5]=3)*(Tableaumars[Colonne5]))/3","v":0},{"$f":"SUMPRODUCT((Tableaumars[19]=1)*(Tableaumars[Colonne5]=4)*(Tableaumars[Colonne5]))/4","v":0}]
[]
["Mois de : ",null,null,null,{"$f":"Avril!J3","v":"Avril"},null,null,{"$f":"Accueil!C18+1","v":2016}]
[]
["EFFECTIFS",null,null,null,null,null,null,null,null,"ALLERGIES ET REGIMES"]
["JOURS","DATES","Pique Niques ?",null,"Moins de 6 ans","Plus de\n6 ans","Adultes","Total Pique niques","Total Repas","Vétarien","Sans Porc","Sans Aïl Oignon Echalote Champignon"]
[null,null,"Moins de\n 6 ans","Plus de \n6 ans"]
["Mercredi",{"$f":"'An1'!C20","v":""},false,false,{"$f":"SUMIFS(Tableauavril[7],Tableauavril[24],\"<6\")","v":0},{"$f":"SUMIFS(Tableauavril[7],Tableauavril[24],\">=6\")","v":0},null,{"$f":"SUMIFS(E85,C85,\"vrai\")+SUMIFS(F85,D85,\"vrai\")+G85","v":0},{"$f":"G85+F85+E85-H85","v":0},{"$f":"SUMPRODUCT((Tableauavril[7]=1)*(Tableauavril[Colonne5]=1)*(Tableauavril[Colonne5]))","v":0},{"$f":"SUMPRODUCT((Tableauavril[7]=1)*(Tableauavril[Colonne5]=3)*(Tableauavril[Colonne5]))/3","v":0},{"$f":"SUMPRODUCT((Tableauavril[7]=1)*(Tableauavril[Colonne5]=4)*(Tableauavril[Colonne5]))/4","v":0}]
["Mercredi",{"$f":"'An1'!C21","v":"2016-04-06"},false,false,{"$f":"SUMIFS(Tableauavril[10],Tableauavril[24],\"<6\")","v":14},{"$f":"SUMIFS(Tableauavril[10],Tableauavril[24],\">=6\")","v":14},null,{"$f":"SUMIFS(E86,C86,\"vrai\")+SUMIFS(F86,D86,\"vrai\")+G86","v":0},{"$f":"G86+F86+E86-H86","v":28},{"$f":"SUMPRODUCT((Tableauavril[10]=1)*(Tableauavril[Colonne5]=1)*(Tableauavril[Colonne5]))","v":0},{"$f":"SUMPRODUCT((Tableauavril[10]=1)*(Tableauavril[Colonne5]=3)*(Tableauavril[Colonne5]))/3","v":0},{"$f":"SUMPRODUCT((Tableauavril[10]=1)*(Tableauavril[Colonne5]=4)*(Tableauavril[Colonne5]))/4","v":0}]
["Mercredi",{"$f":"'An1'!C22","v":"2016-04-13"},false,false,{"$f":"SUMIFS(Tableauavril[13],Tableauavril[24],\"<6\")","v":14},{"$f":"SUMIFS(Tableauavril[13],Tableauavril[24],\">=6\")","v":11},null,{"$f":"SUMIFS(E87,C87,\"vrai\")+SUMIFS(F87,D87,\"vrai\")+G87","v":0},{"$f":"G87+F87+E87-H87","v":25},{"$f":"SUMPRODUCT((Tableauavril[13]=1)*(Tableauavril[Colonne5]=1)*(Tableauavril[Colonne5]))","v":0},{"$f":"SUMPRODUCT((Tableauavril[13]=1)*(Tableauavril[Colonne5]=3)*(Tableauavril[Colonne5]))/3","v":0},{"$f":"SUMPRODUCT((Tableauavril[13]=1)*(Tableauavril[Colonne5]=4)*(Tableauavril[Colonne5]))/4","v":0}]
["Mercredi",{"$f":"'An1'!C23","v":"2016-04-20"},false,false,{"$f":"SUMIFS(Tableauavril[16],Tableauavril[24],\"<6\")","v":10},{"$f":"SUMIFS(Tableauavril[16],Tableauavril[24],\">=6\")","v":10},null,{"$f":"SUMIFS(E88,C88,\"vrai\")+SUMIFS(F88,D88,\"vrai\")+G88","v":0},{"$f":"G88+F88+E88-H88","v":20},{"$f":"SUMPRODUCT((Tableauavril[16]=1)*(Tableauavril[Colonne5]=1)*(Tableauavril[Colonne5]))","v":0},{"$f":"SUMPRODUCT((Tableauavril[16]=1)*(Tableauavril[Colonne5]=3)*(Tableauavril[Colonne5]))/3","v":0},{"$f":"SUMPRODUCT((Tableauavril[16]=1)*(Tableauavril[Colonne5]=4)*(Tableauavril[Colonne5]))/4","v":0}]
["Mercredi",{"$f":"'An1'!C24","v":"2016-04-27"},false,false,{"$f":"SUMIFS(Tableauavril[19],Tableauavril[24],\"<6\")","v":9},{"$f":"SUMIFS(Tableauavril[19],Tableauavril[24],\">=6\")","v":9},null,{"$f":"SUMIFS(E89,C89,\"vrai\")+SUMIFS(F89,D89,\"vrai\")+G89","v":0},{"$f":"G89+F89+E89-H89","v":18},{"$f":"SUMPRODUCT((Tableauavril[19]=1)*(Tableauavril[Colonne5]=1)*(Tableauavril[Colonne5]))","v":0},{"$f":"SUMPRODUCT((Tableauavril[19]=1)*(Tableauavril[Colonne5]=3)*(Tableauavril[Colonne5]))/3","v":0},{"$f":"SUMPRODUCT((Tableauavril[19]=1)*(Tableauavril[Colonne5]=4)*(Tableauavril[Colonne5]))/4","v":0}]
[]
["Mois de : ",null,null,null,{"$f":"Mai!J3","v":"Mai"},null,null,{"$f":"Accueil!C18+1","v":2016}]
[]
["EFFECTIFS",null,null,null,null,null,null,null,null,"ALLERGIES ET REGIMES"]
["JOURS","DATES","Pique Niques ?",null,"Moins de 6 ans","Plus de\n6 ans","Adultes","Total Pique niques","Total Repas","Vétarien","Sans Porc","Sans Aïl Oignon Echalote Champignon"]
[null,null,"Moins de\n 6 ans","Plus de \n6 ans"]
["Mercredi",{"$f":"'An1'!K20","v":""},false,false,{"$f":"SUMIFS(Tableaumai[7],Tableaumai[24],\"<6\")","v":0},{"$f":"SUMIFS(Tableaumai[7],Tableaumai[24],\">=6\")","v":0},null,{"$f":"SUMIFS(E96,C96,\"vrai\")+SUMIFS(F96,D96,\"vrai\")+G96","v":0},{"$f":"G96+F96+E96-H96","v":0},{"$f":"SUMPRODUCT((Tableaumai[7]=1)*(Tableaumai[Colonne5]=1)*(Tableaumai[Colonne5]))","v":0},{"$f":"SUMPRODUCT((Tableaumai[7]=1)*(Tableaumai[Colonne5]=3)*(Tableaumai[Colonne5]))/3","v":0},{"$f":"SUMPRODUCT((Tableaumai[7]=1)*(Tableaumai[Colonne5]=4)*(Tableaumai[Colonne5]))/4","v":0}]
["Mercredi",{"$f":"'An1'!K21","v":"2016-05-04"},false,false,{"$f":"SUMIFS(Tableaumai[10],Tableaumai[24],\"<6\")","v":13},{"$f":"SUMIFS(Tableaumai[10],Tableaumai[24],\">=6\")","v":12},null,{"$f":"SUMIFS(E97,C97,\"vrai\")+SUMIFS(F97,D97,\"vrai\")+G97","v":0},{"$f":"G97+F97+E97-H97","v":25},{"$f":"SUMPRODUCT((Tableaumai[10]=1)*(Tableaumai[Colonne5]=1)*(Tableaumai[Colonne5]))","v":0},{"$f":"SUMPRODUCT((Tableaumai[10]=1)*(Tableaumai[Colonne5]=3)*(Tableaumai[Colonne5]))/3","v":0},{"$f":"SUMPRODUCT((Tableaumai[7]=1)*(Tableaumai[Colonne5]=4)*(Tableaumai[Colonne5]))/4","v":0}]
["Mercredi",{"$f":"'An1'!K22","v":"2016-05-11"},false,false,{"$f":"SUMIFS(Tableaumai[13],Tableaumai[24],\"<6\")","v":13},{"$f":"SUMIFS(Tableaumai[13],Tableaumai[24],\">=6\")","v":10},null,{"$f":"SUMIFS(E98,C98,\"vrai\")+SUMIFS(F98,D98,\"vrai\")+G98","v":0},{"$f":"G98+F98+E98-H98","v":23},{"$f":"SUMPRODUCT((Tableaumai[13]=1)*(Tableaumai[Colonne5]=1)*(Tableaumai[Colonne5]))","v":0},{"$f":"SUMPRODUCT((Tableaumai[13]=1)*(Tableaumai[Colonne5]=3)*(Tableaumai[Colonne5]))/3","v":0},{"$f":"SUMPRODUCT((Tableaumai[7]=1)*(Tableaumai[Colonne5]=4)*(Tableaumai[Colonne5]))/4","v":0}]
["Mercredi",{"$f":"'An1'!K23","v":"2016-05-18"},false,false,{"$f":"SUMIFS(Tableaumai[16],Tableaumai[24],\"<6\")","v":13},{"$f":"SUMIFS(Tableaumai[16],Tableaumai[24],\">=6\")","v":13},null,{"$f":"SUMIFS(E99,C99,\"vrai\")+SUMIFS(F99,D99,\"vrai\")+G99","v":0},{"$f":"G99+F99+E99-H99","v":26},{"$f":"SUMPRODUCT((Tableaumai[16]=1)*(Tableaumai[Colonne5]=1)*(Tableaumai[Colonne5]))","v":0},{"$f":"SUMPRODUCT((Tableaumai[16]=1)*(Tableaumai[Colonne5]=3)*(Tableaumai[Colonne5]))/3","v":0},{"$f":"SUMPRODUCT((Tableaumai[7]=1)*(Tableaumai[Colonne5]=4)*(Tableaumai[Colonne5]))/4","v":0}]
["Mercredi",{"$f":"'An1'!K24","v":"2016-05-25"},false,false,{"$f":"SUMIFS(Tableaumai[19],Tableaumai[24],\"<6\")","v":13},{"$f":"SUMIFS(Tableaumai[19],Tableaumai[24],\">=6\")","v":10},null,{"$f":"SUMIFS(E100,C100,\"vrai\")+SUMIFS(F100,D100,\"vrai\")+G100","v":0},{"$f":"G100+F100+E100-H100","v":23},{"$f":"SUMPRODUCT((Tableaumai[19]=1)*(Tableaumai[Colonne5]=1)*(Tableaumai[Colonne5]))","v":0},{"$f":"SUMPRODUCT((Tableaumai[19]=1)*(Tableaumai[Colonne5]=3)*(Tableaumai[Colonne5]))/3","v":0},{"$f":"SUMPRODUCT((Tableaumai[7]=1)*(Tableaumai[Colonne5]=4)*(Tableaumai[Colonne5]))/4","v":0}]
[]
["Mois de : ",null,null,null,{"$f":"Juin!J3","v":"Juin"},null,null,{"$f":"Accueil!C18+1","v":2016}]
[]
["EFFECTIFS",null,null,null,null,null,null,null,null,"ALLERGIES ET REGIMES"]
["JOURS","DATES","Pique Niques ?",null,"Moins de 6 ans","Plus de\n6 ans","Adultes","Total Pique niques","Total Repas","Vétarien","Sans Porc","Sans Aïl Oignon Echalote Champignon"]
[null,null,"Moins de\n 6 ans","Plus de \n6 ans"]
["Mercredi",{"$f":"'An1'!S20","v":"2016-06-01"},false,false,{"$f":"SUMIFS(Tableaujuin[7],Tableaujuin[24],\"<6\")","v":3},{"$f":"SUMIFS(Tableaujuin[7],Tableaujuin[24],\">=6\")","v":8},null,{"$f":"SUMIFS(E107,C107,\"vrai\")+SUMIFS(F107,D107,\"vrai\")+G107","v":0},{"$f":"G107+F107+E107-H107","v":11},{"$f":"SUMPRODUCT((Tableaujuin[7]=1)*(Tableaujuin[Colonne5]=1)*(Tableaujuin[Colonne5]))","v":0},{"$f":"SUMPRODUCT((Tableaujuin[7]=1)*(Tableaujuin[Colonne5]=3)*(Tableaujuin[Colonne5]))/3","v":0},{"$f":"SUMPRODUCT((Tableaujuin[7]=1)*(Tableaujuin[Colonne5]=4)*(Tableaujuin[Colonne5]))/4","v":0}]
["Mercredi",{"$f":"'An1'!S21","v":"2016-06-08"},false,false,{"$f":"SUMIFS(Tableaujuin[10],Tableaujuin[24],\"<6\")","v":3},{"$f":"SUMIFS(Tableaujuin[10],Tableaujuin[24],\">=6\")","v":8},null,{"$f":"SUMIFS(E108,C108,\"vrai\")+SUMIFS(F108,D108,\"vrai\")+G108","v":0},{"$f":"G108+F108+E108-H108","v":11},{"$f":"SUMPRODUCT((Tableaujuin[10]=1)*(Tableaujuin[Colonne5]=1)*(Tableaujuin[Colonne5]))","v":0},{"$f":"SUMPRODUCT((Tableaujuin[10]=1)*(Tableaujuin[Colonne5]=3)*(Tableaujuin[Colonne5]))/3","v":0},{"$f":"SUMPRODUCT((Tableaujuin[10]=1)*(Tableaujuin[Colonne5]=4)*(Tableaujuin[Colonne5]))/4","v":0}]
["Mercredi",{"$f":"'An1'!S22","v":"2016-06-15"},false,false,{"$f":"SUMIFS(Tableaujuin[13],Tableaujuin[24],\"<6\")","v":3},{"$f":"SUMIFS(Tableaujuin[13],Tableaujuin[24],\">=6\")","v":8},null,{"$f":"SUMIFS(E109,C109,\"vrai\")+SUMIFS(F109,D109,\"vrai\")+G109","v":0},{"$f":"G109+F109+E109-H109","v":11},{"$f":"SUMPRODUCT((Tableaujuin[13]=1)*(Tableaujuin[Colonne5]=1)*(Tableaujuin[Colonne5]))","v":0},{"$f":"SUMPRODUCT((Tableaujuin[13]=1)*(Tableaujuin[Colonne5]=3)*(Tableaujuin[Colonne5]))/3","v":0},{"$f":"SUMPRODUCT((Tableaujuin[13]=1)*(Tableaujuin[Colonne5]=4)*(Tableaujuin[Colonne5]))/4","v":0}]
["Mercredi",{"$f":"'An1'!S23","v":"2016-06-22"},false,false,{"$f":"SUMIFS(Tableaujuin[16],Tableaujuin[24],\"<6\")","v":3},{"$f":"SUMIFS(Tableaujuin[16],Tableaujuin[24],\">=6\")","v":8},null,{"$f":"SUMIFS(E110,C110,\"vrai\")+SUMIFS(F110,D110,\"vrai\")+G110","v":0},{"$f":"G110+F110+E110-H110","v":11},{"$f":"SUMPRODUCT((Tableaujuin[16]=1)*(Tableaujuin[Colonne5]=1)*(Tableaujuin[Colonne5]))","v":0},{"$f":"SUMPRODUCT((Tableaujuin[16]=1)*(Tableaujuin[Colonne5]=3)*(Tableaujuin[Colonne5]))/3","v":0},{"$f":"SUMPRODUCT((Tableaujuin[16]=1)*(Tableaujuin[Colonne5]=4)*(Tableaujuin[Colonne5]))/4","v":0}]
["Mercredi",{"$f":"'An1'!S24","v":"2016-06-29"},false,false,{"$f":"SUMIFS(Tableaujuin[19],Tableaujuin[24],\"<6\")","v":3},{"$f":"SUMIFS(Tableaujuin[19],Tableaujuin[24],\">=6\")","v":8},null,{"$f":"SUMIFS(E111,C111,\"vrai\")+SUMIFS(F111,D111,\"vrai\")+G111","v":0},{"$f":"G111+F111+E111-H111","v":11},{"$f":"SUMPRODUCT((Tableaujuin[19]=1)*(Tableaujuin[Colonne5]=1)*(Tableaujuin[Colonne5]))","v":0},{"$f":"SUMPRODUCT((Tableaujuin[19]=1)*(Tableaujuin[Colonne5]=3)*(Tableaujuin[Colonne5]))/3","v":0},{"$f":"SUMPRODUCT((Tableaujuin[19]=1)*(Tableaujuin[Colonne5]=4)*(Tableaujuin[Colonne5]))/4","v":0}]
[]
["Mois de : ",null,null,null,{"$f":"Juillet!J3","v":"Juillet"},null,null,{"$f":"Accueil!C18+1","v":2016}]
[]
["EFFECTIFS",null,null,null,null,null,null,null,null,"ALLERGIES ET REGIMES"]
["JOURS","DATES","Pique Niques ?",null,"Moins de 6 ans","Plus de\n6 ans","Adultes","Total Pique niques","Total Repas","Vétarien","Sans Porc","Sans Aïl Oignon Echalote Champignon"]
[null,null,"Moins de\n 6 ans","Plus de \n6 ans"]
["Mercredi",{"$f":"'An1'!C29","v":""},false,false,{"$f":"SUMIFS(Tableaujuillet[7],Tableaujuillet[24],\"<6\")","v":0},{"$f":"SUMIFS(Tableaujuillet[7],Tableaujuillet[24],\">=6\")","v":0},null,{"$f":"SUMIFS(E118,C118,\"vrai\")+SUMIFS(F118,D118,\"vrai\")+G118","v":0},{"$f":"G118+F118+E118-H118","v":0},{"$f":"SUMPRODUCT((Tableaujuillet[7]=1)*(Tableaujuillet[Colonne5]=1)*(Tableaujuillet[Colonne5]))","v":0},{"$f":"SUMPRODUCT((Tableaujuillet[7]=1)*(Tableaujuillet[Colonne5]=3)*(Tableaujuillet[Colonne5]))/3","v":0},{"$f":"SUMPRODUCT((Tableaujuillet[7]=1)*(Tableaujuillet[Colonne5]=4)*(Tableaujuillet[Colonne5]))/4","v":0}]
["Mercredi",{"$f":"'An1'!C30","v":"2016-07-06"},false,false,{"$f":"SUMIFS(Tableaujuillet[10],Tableaujuillet[24],\"<6\")","v":0},{"$f":"SUMIFS(Tableaujuillet[10],Tableaujuillet[24],\">=6\")","v":0},null,{"$f":"SUMIFS(E119,C119,\"vrai\")+SUMIFS(F119,D119,\"vrai\")+G119","v":0},{"$f":"G119+F119+E119-H119","v":0},{"$f":"SUMPRODUCT((Tableaujuillet[10]=1)*(Tableaujuillet[Colonne5]=1)*(Tableaujuillet[Colonne5]))","v":0},{"$f":"SUMPRODUCT((Tableaujuillet[10]=1)*(Tableaujuillet[Colonne5]=3)*(Tableaujuillet[Colonne5]))/3","v":0},{"$f":"SUMPRODUCT((Tableaujuillet[10]=1)*(Tableaujuillet[Colonne5]=4)*(Tableaujuillet[Colonne5]))/4","v":0}]
["Mercredi",{"$f":"'An1'!C31","v":"2016-07-13"},false,false,{"$f":"SUMIFS(Tableaujuillet[13],Tableaujuillet[24],\"<6\")","v":0},{"$f":"SUMIFS(Tableaujuillet[13],Tableaujuillet[24],\">=6\")","v":0},null,{"$f":"SUMIFS(E120,C120,\"vrai\")+SUMIFS(F120,D120,\"vrai\")+G120","v":0},{"$f":"G120+F120+E120-H120","v":0},{"$f":"SUMPRODUCT((Tableaujuillet[13]=1)*(Tableaujuillet[Colonne5]=1)*(Tableaujuillet[Colonne5]))","v":0},{"$f":"SUMPRODUCT((Tableaujuillet[13]=1)*(Tableaujuillet[Colonne5]=3)*(Tableaujuillet[Colonne5]))/3","v":0},{"$f":"SUMPRODUCT((Tableaujuillet[13]=1)*(Tableaujuillet[Colonne5]=4)*(Tableaujuillet[Colonne5]))/4","v":0}]
["Mercredi",{"$f":"'An1'!C32","v":"2016-07-20"},false,false,{"$f":"SUMIFS(Tableaujuillet[16],Tableaujuillet[24],\"<6\")","v":0},{"$f":"SUMIFS(Tableaujuillet[16],Tableaujuillet[24],\">=6\")","v":0},null,{"$f":"SUMIFS(E121,C121,\"vrai\")+SUMIFS(F121,D121,\"vrai\")+G121","v":0},{"$f":"G121+F121+E121-H121","v":0},{"$f":"SUMPRODUCT((Tableaujuillet[16]=1)*(Tableaujuillet[Colonne5]=1)*(Tableaujuillet[Colonne5]))","v":0},{"$f":"SUMPRODUCT((Tableaujuillet[16]=1)*(Tableaujuillet[Colonne5]=3)*(Tableaujuillet[Colonne5]))/3","v":0},{"$f":"SUMPRODUCT((Tableaujuillet[16]=1)*(Tableaujuillet[Colonne5]=4)*(Tableaujuillet[Colonne5]))/4","v":0}]
["Mercredi",{"$f":"'An1'!C33","v":"2016-07-27"},false,false,{"$f":"SUMIFS(Tableaujuillet[19],Tableaujuillet[24],\"<6\")","v":0},{"$f":"SUMIFS(Tableaujuillet[19],Tableaujuillet[24],\">=6\")","v":0},null,{"$f":"SUMIFS(E122,C122,\"vrai\")+SUMIFS(F122,D122,\"vrai\")+G122","v":0},{"$f":"G122+F122+E122-H122","v":0},{"$f":"SUMPRODUCT((Tableaujuillet[19]=1)*(Tableaujuillet[Colonne5]=1)*(Tableaujuillet[Colonne5]))","v":0},{"$f":"SUMPRODUCT((Tableaujuillet[19]=1)*(Tableaujuillet[Colonne5]=3)*(Tableaujuillet[Colonne5]))/3","v":0},{"$f":"SUMPRODUCT((Tableaujuillet[19]=1)*(Tableaujuillet[Colonne5]=4)*(Tableaujuillet[Colonne5]))/4","v":0}]

{"sheet":"données","index":36,"n_rows":6,"n_cols":3,"rows_kept":6,"cut":false,"hidden":false,"merged":[]}
["Vacances","Début","Fin"]
["Vacances de la Toussaint","2015-10-19","2015-10-30"]
["Vacances de Noël","2015-12-23","2015-10-01"]
["Vacances d'Hivers","2016-02-22","2016-03-04"]
["Vacances de Pâques","2016-04-18","2016-04-29"]
["Vacances d'Eté","2016-07-11","2016-08-12"]

{"sheet":"An","index":37,"n_rows":43,"n_cols":26,"rows_kept":43,"cut":false,"hidden":false,"merged":[[43,0,43,14],[43,16,43,22],[26,0,26,6],[26,8,26,14],[26,16,26,22],[35,0,35,6],[35,8,35,14],[35,16,35,22],[6,0,6,22],[8,0,8,6],[8,8,8,14],[8,16,8,22],[17,0,17,6],[17,8,17,14],[17,16,17,22],[5,0,5,22],[0,0,0,25],[1,0,1,15],[2,0,2,2],[2,4,2,6],[2,8,2,10],[2,16,2,22],[3,0,3,2],[3,4,3,6],[3,8,3,10],[3,11,3,14],[3,16,3,25]]}
[]
[]
["An",null,null,null,"Mois",null,null,null,"premier jour",null,null,null,null,null,null,null,"Calendrier Titre"]
[{"$f":"Accueil!C18","v":2015},null,null,null,1,null,null,null,2,null,null,"1:di, 2:lu",null,null,null,null,"Calendrier de données"]
[]
[{"$f":"IF(Q4=\"\",\"\",Q4)","v":"Calendrier de données"}]
[{"$f":"IF($E$4=1,A4,A4&\"-\"&A4+1)","v":2015}]
[]
[{"$f":"DATE($A$4,$E$4,1)","v":"2015-01-01"},null,null,null,null,null,null,null,{"$f":"DATE(YEAR(A9),MONTH(A9)+1,1)","v":"2015-02-01"},null,null,null,null,null,null,null,{"$f":"DATE(YEAR(I9),MONTH(I9)+1,1)","v":"2015-03-01"},null,null,null,null,null,null,null,"Date","Vacances ou Evénement"]
[{"$f":"INDEX({\"di\";\"lu\";\"ma\";\"me\";\"je\";\"ve\";\"sa\"},1+MOD($I$4+1-2,7))","v":"lu"},{"$f":"INDEX({\"di\";\"lu\";\"ma\";\"me\";\"je\";\"ve\";\"sa\"},1+MOD($I$4+2-2,7))","v":"ma"},{"$f":"INDEX({\"di\";\"lu\";\"ma\";\"me\";\"je\";\"ve\";\"sa\"},1+MOD($I$4+3-2,7))","v":"me"},{"$f":"INDEX({\"di\";\"lu\";\"ma\";\"me\";\"je\";\"ve\";\"sa\"},1+MOD($I$4+4-2,7))","v":"je"},{"$f":"INDEX({\"di\";\"lu\";\"ma\";\"me\";\"je\";\"ve\";\"sa\"},1+MOD($I$4+5-2,7))","v":"ve"},{"$f":"INDEX({\"di\";\"lu\";\"ma\";\"me\";\"je\";\"ve\";\"sa\"},1+MOD($I$4+6-2,7))","v":"sa"},{"$f":"INDEX({\"di\";\"lu\";\"ma\";\"me\";\"je\";\"ve\";\"sa\"},1+MOD($I$4+7-2,7))","v":"di"},null,{"$f":"$A$10","v":"lu"},{"$f":"$B$10","v":"ma"},{"$f":"$C$10","v":"me"},{"$f":"$D$10","v":"je"},{"$f":"$E$10","v":"ve"},{"$f":"$F$10","v":"sa"},{"$f":"$G$10","v":"di"},null,{"$f":"$A$10","v":"lu"},{"$f":"$B$10","v":"ma"},{"$f":"$C$10","v":"me"},{"$f":"$D$10","v":"je"},{"$f":"$E$10","v":"ve"},{"$f":"$F$10","v":"sa"},{"$f":"$G$10","v":"di"}]
[{"$f":"IF(MONTH($A$9)<>MONTH($A$9-(WEEKDAY($A$9,1)-($I$4-1))-IF((WEEKDAY($A$9,1)-($I$4-1))<=0,7,0)+(ROW(A11)-ROW($A$11))*7+(COLUMN(A11)-COLUMN($A$11)+1)),\"\",$A$9-(WEEKDAY($A$9,1)-($I$4-1))-IF((WEEKDAY($A$9,1)-($I$4-1))<=0,7,0)+(ROW(A11)-ROW($A$11))*7+(COLUMN(A11)-COLUMN($A$11)+1))","v":""},"",{"$f":"IF(MONTH($A$9)<>MONTH($A$9-(WEEKDAY($A$9,1)-($I$4-1))-IF((WEEKDAY($A$9,1)-($I$4-1))<=0,7,0)+(ROW(C11)-ROW($A$11))*7+(COLUMN(C11)-COLUMN($A$11)+1)),\"\",$A$9-(WEEKDAY($A$9,1)-($I$4-1))-IF((WEEKDAY($A$9,1)-($I$4-1))<=0,7,0)+(ROW(C11)-ROW($A$11))*7+(COLUMN(C11)-COLUMN($A$11)+1))","v":""},"2015-01-01","2015-01-02","2015-01-03","2015-01-04",null,{"$f":"IF(MONTH($I$9)<>MONTH($I$9-(WEEKDAY($I$9,1)-($I$4-1))-IF((WEEKDAY($I$9,1)-($I$4-1))<=0,7,0)+(ROW(I11)-ROW($I$11))*7+(COLUMN(I11)-COLUMN($I$11)+1)),\"\",$I$9-(WEEKDAY($I$9,1)-($I$4-1))-IF((WEEKDAY($I$9,1)-($I$4-1))<=0,7,0)+(ROW(I11)-ROW($I$11))*7+(COLUMN(I11)-COLUMN($I$11)+1))","v":""},"","","","","","2015-02-01",null,{"$f":"IF(MONTH($Q$9)<>MONTH($Q$9-(WEEKDAY($Q$9,1)-($I$4-1))-IF((WEEKDAY($Q$9,1)-($I$4-1))<=0,7,0)+(ROW(Q11)-ROW($Q$11))*7+(COLUMN(Q11)-COLUMN($Q$11)+1)),\"\",$Q$9-(WEEKDAY($Q$9,1)-($I$4-1))-IF((WEEKDAY($Q$9,1)-($I$4-1))<=0,7,0)+(ROW(Q11)-ROW($Q$11))*7+(COLUMN(Q11)-COLUMN($Q$11)+1))","v":""},"","","","","","2015-03-01",null,{"$f":"DATE($A$4+IF($E$4>1,1,0),1,1)","v":"2015-01-01"},"Jour de l'an"]
["2015-01-05",{"$f":"IF(MONTH($A$9)<>MONTH($A$9-(WEEKDAY($A$9,1)-($I$4-1))-IF((WEEKDAY($A$9,1)-($I$4-1))<=0,7,0)+(ROW(B12)-ROW($A$11))*7+(COLUMN(B12)-COLUMN($A$11)+1)),\"\",$A$9-(WEEKDAY($A$9,1)-($I$4-1))-IF((WEEKDAY($A$9,1)-($I$4-1))<=0,7,0)+(ROW(B12)-ROW($A$11))*7+(COLUMN(B12)-COLUMN($A$11)+1))","v":"2015-01-06"},"2015-01-07","2015-01-08","2015-01-09","2015-01-10","2015-01-11",null,"2015-02-02","2015-02-03","2015-02-04","2015-02-05","2015-02-06","2015-02-07","2015-02-08",null,"2015-03-02","2015-03-03","2015-03-04","2015-03-05","2015-03-06","2015-03-07","2015-03-08",null,{"$f":"DATE($A$4+IF($E$4>5,1,0),5,1)","v":"2015-05-01"},"Fête du premier mai"]
["2015-01-12","2015-01-13","2015-01-14","2015-01-15","2015-01-16","2015-01-17","2015-01-18",null,"2015-02-09","2015-02-10","2015-02-11","2015-02-12","2015-02-13","2015-02-14","2015-02-15",null,"2015-03-09","2015-03-10","2015-03-11","2015-03-12","2015-03-13","2015-03-14","2015-03-15",null,{"$f":"DATE($A$4+IF($E$4>5,1,0),5,8)","v":"2015-05-08"},"Fête de la Victoire 1945"]
["2015-01-19","2015-01-20","2015-01-21","2015-01-22","2015-01-23","2015-01-24","2015-01-25",null,"2015-02-16","2015-02-17","2015-02-18","2015-02-19","2015-02-20","2015-02-21","2015-02-22",null,"2015-03-16","2015-03-17","2015-03-18","2015-03-19","2015-03-20","2015-03-21","2015-03-22",null,{"$f":"DATE($A$4+IF($E$4>7,1,0),7,14)","v":"2015-07-14"},"Fête nationale"]
["2015-01-26","2015-01-27","2015-01-28","2015-01-29","2015-01-30","2015-01-31","",null,"2015-02-23","2015-02-24","2015-02-25","2015-02-26","2015-02-27","2015-02-28","",null,"2015-03-23","2015-03-24","2015-03-25","2015-03-26","2015-03-27","2015-03-28","2015-03-29",null,{"$f":"DATE($A$4+IF($E$4>8,1,0),8,15)","v":"2015-08-15"},"Assomption"]
["","","","","","","",null,"","","","","","","",null,"2015-03-30","2015-03-31","","","","","",null,{"$f":"DATE($A$4+IF($E$4>11,1,0),11,1)","v":"2015-11-01"},"La Toussaint"]
[null,null,null,null,null,null,null,null,null,null,null,null,null,null,null,null,null,null,null,null,null,null,null,null,{"$f":"DATE($A$4+IF($E$4>11,1,0),11,11)","v":"2015-11-11"},"Jour d'armistice"]
[{"$f":"DATE(YEAR(Q9),MONTH(Q9)+1,1)","v":"2015-04-01"},null,null,null,null,null,null,null,{"$f":"DATE(YEAR(A18),MONTH(A18)+1,1)","v":"2015-05-01"},null,null,null,null,null,null,null,{"$f":"DATE(YEAR(I18),MONTH(I18)+1,1)","v":"2015-06-01"},null,null,null,null,null,null,null,{"$f":"IF(AND($A$4>1900,$A$4<2099),IF(MONTH(ROUNDDOWN((DATE(2000,3,20)+TIME(7,29,0))+($A$4-2000)*365.24238,0))<$E$4,ROUNDDOWN((DATE(2000,3,20)+TIME(7,29,0))+($A$4+1-2000)*365.24238,0),ROUNDDOWN((DATE(2000,3,20)+TIME(7,29,0))+($A$4-2000)*365.24238,0)),\"n/f\")","v":"2015-03-20"},"équinoxe de printemps"]
[{"$f":"$A$10","v":"lu"},{"$f":"$B$10","v":"ma"},{"$f":"$C$10","v":"me"},{"$f":"$D$10","v":"je"},{"$f":"$E$10","v":"ve"},{"$f":"$F$10","v":"sa"},{"$f":"$G$10","v":"di"},null,{"$f":"$A$10","v":"lu"},{"$f":"$B$10","v":"ma"},{"$f":"$C$10","v":"me"},{"$f":"$D$10","v":"je"},{"$f":"$E$10","v":"ve"},{"$f":"$F$10","v":"sa"},{"$f":"$G$10","v":"di"},null,{"$f":"$A$10","v":"lu"},{"$f":"$B$10","v":"ma"},{"$f":"$C$10","v":"me"},{"$f":"$D$10","v":"je"},{"$f":"$E$10","v":"ve"},{"$f":"$F$10","v":"sa"},{"$f":"$G$10","v":"di"},null,{"$f":"IF(AND($A$4>1900,$A$4<2099),IF(MONTH(ROUNDDOWN((DATE(2000,6,21)+TIME(1,36,0))+($A$4-2000)*365.24163,0))<$E$4,ROUNDDOWN((DATE(2000,6,21)+TIME(1,36,0))+($A$4+1-2000)*365.24163,0),ROUNDDOWN((DATE(2000,6,21)+TIME(1,36,0))+($A$4-2000)*365.24163,0)),\"n/f\")","v":"2015-06-21"},"juin solstice"]
[{"$f":"IF(MONTH($A$18)<>MONTH($A$18-(WEEKDAY($A$18,1)-($I$4-1))-IF((WEEKDAY($A$18,1)-($I$4-1))<=0,7,0)+(ROW(A20)-ROW($A$20))*7+(COLUMN(A20)-COLUMN($A$20)+1)),\"\",$A$18-(WEEKDAY($A$18,1)-($I$4-1))-IF((WEEKDAY($A$18,1)-($I$4-1))<=0,7,0)+(ROW(A20)-ROW($A$20))*7+(COLUMN(A20)-COLUMN($A$20)+1))","v":""},"","2015-04-01","2015-04-02","2015-04-03","2015-04-04","2015-04-05",null,{"$f":"IF(MONTH($I$18)<>MONTH($I$18-(WEEKDAY($I$18,1)-($I$4-1))-IF((WEEKDAY($I$18,1)-($I$4-1))<=0,7,0)+(ROW(I20)-ROW($I$20))*7+(COLUMN(I20)-COLUMN($I$20)+1)),\"\",$I$18-(WEEKDAY($I$18,1)-($I$4-1))-IF((WEEKDAY($I$18,1)-($I$4-1))<=0,7,0)+(ROW(I20)-ROW($I$20))*7+(COLUMN(I20)-COLUMN($I$20)+1))","v":""},"","","","2015-05-01","2015-05-02","2015-05-03",null,{"$f":"IF(MONTH($Q$18)<>MONTH($Q$18-(WEEKDAY($Q$18,1)-($I$4-1))-IF((WEEKDAY($Q$18,1)-($I$4-1))<=0,7,0)+(ROW(Q20)-ROW($Q$20))*7+(COLUMN(Q20)-COLUMN($Q$20)+1)),\"\",$Q$18-(WEEKDAY($Q$18,1)-($I$4-1))-IF((WEEKDAY($Q$18,1)-($I$4-1))<=0,7,0)+(ROW(Q20)-ROW($Q$20))*7+(COLUMN(Q20)-COLUMN($Q$20)+1))","v":"2015-06-01"},"2015-06-02","2015-06-03","2015-06-04","2015-06-05","2015-06-06","2015-06-07",null,{"$f":"IF(AND($A$4>1900,$A$4<2099),IF(MONTH(ROUNDDOWN((DATE(2000,9,22)+TIME(17,17,0))+($A$4-2000)*365.24205,0))<$E$4,ROUNDDOWN((DATE(2000,9,22)+TIME(17,17,0))+($A$4+1-2000)*365.24205,0),ROUNDDOWN((DATE(2000,9,22)+TIME(17,17,0))+($A$4-2000)*365.24205,0)),\"n/f\")","v":"2015-09-23"},"équinoxe automnal"]
["2015-04-06","2015-04-07","2015-04-08","2015-04-09","2015-04-10","2015-04-11","2015-04-12",null,"2015-05-04","2015-05-05","2015-05-06","2015-05-07","2015-05-08","2015-05-09","2015-05-10",null,"2015-06-08","2015-06-09","2015-06-10","2015-06-11","2015-06-12","2015-06-13","2015-06-14",null,{"$f":"IF(AND($A$4>1900,$A$4<2099),IF(MONTH(ROUNDDOWN((DATE(2000,12,21)+TIME(13,30,0))+($A$4-2000)*365.242743,0))<$E$4,ROUNDDOWN((DATE(2000,12,21)+TIME(13,30,0))+($A$4+1-2000)*365.242743,0),ROUNDDOWN((DATE(2000,12,21)+TIME(13,30,0))+($A$4-2000)*365.242743,0)),\"n/f\")","v":"2015-12-22"},"décembre solstice"]
["2015-04-13","2015-04-14","2015-04-15","2015-04-16","2015-04-17","2015-04-18","2015-04-19",null,"2015-05-11","2015-05-12","2015-05-13","2015-05-14","2015-05-15","2015-05-16","2015-05-17",null,"2015-06-15","2015-06-16","2015-06-17","2015-06-18","2015-06-19","2015-06-20","2015-06-21",null,{"$f":"(DATE($A$4+IF($E$4>4,1,0),4,1)+(0-1)*7)+1-WEEKDAY(DATE($A$4+IF($E$4>4,1,0),4,1),1)+IF(1<WEEKDAY(DATE($A$4+IF($E$4>4,1,0),4,1),1),7,0)","v":"2015-03-29"},"heure d'été commencent"]
["2015-04-20","2015-04-21","2015-04-22","2015-04-23","2015-04-24","2015-04-25","2015-04-26",null,"2015-05-18","2015-05-19","2015-05-20","2015-05-21","2015-05-22","2015-05-23","2015-05-24",null,"2015-06-22","2015-06-23","2015-06-24","2015-06-25","2015-06-26","2015-06-27","2015-06-28",null,{"$f":"(DATE($A$4+IF($E$4>11,1,0),11,1)+(0-1)*7)+1-WEEKDAY(DATE($A$4+IF($E$4>11,1,0),11,1),1)+IF(1<WEEKDAY(DATE($A$4+IF($E$4>11,1,0),11,1),1),7,0)","v":"2015-10-25"},"heure d'été terminent"]
["2015-04-27","2015-04-28","2015-04-29","2015-04-30","","","",null,"2015-05-25","2015-05-26","2015-05-27","2015-05-28","2015-05-29","2015-05-30","2015-05-31",null,"2015-06-29","2015-06-30","","","","","",null,{"$f":"DATE($A$4+IF($E$4>12,1,0),12,25)","v":"2015-12-25"},"Noël"]
["","","","","","","",null,"","","","","","","",null,"","","","","","","",null,{"$f":"IF(AND($A$4>1900,$A$4<2199),IF(MONTH(ROUND(DATE($A$4,4,1)/7+MOD(19*MOD($A$4,19)-7,30)*0.14,0)*7-6)<$E$4,ROUND(DATE($A$4+1,4,1)/7+MOD(19*MOD($A$4+1,19)-7,30)*0.14,0)*7-6,ROUND(DATE($A$4,4,1)/7+MOD(19*MOD($A$4,19)-7,30)*0.14,0)*7-6),\"n/f\")","v":"2015-04-05"},"Pâques (Easter)"]
[null,null,null,null,null,null,null,null,null,null,null,null,null,null,null,null,null,null,null,null,null,null,null,null,{"$f":"IF(AND($A$4>1900,$A$4<2199),IF(MONTH(39+ROUND(DATE($A$4,4,1)/7+MOD(19*MOD($A$4,19)-7,30)*0.14,0)*7-6)<$E$4,39+ROUND(DATE($A$4+1,4,1)/7+MOD(19*MOD($A$4+1,19)-7,30)*0.14,0)*7-6,39+ROUND(DATE($A$4,4,1)/7+MOD(19*MOD($A$4,19)-7,30)*0.14,0)*7-6),\"n/f\")","v":"2015-05-14"},"l'Ascension catholique"]
[{"$f":"DATE(YEAR(Q18),MONTH(Q18)+1,1)","v":"2015-07-01"},null,null,null,null,null,null,null,{"$f":"DATE(YEAR(A27),MONTH(A27)+1,1)","v":"2015-08-01"},null,null,null,null,null,null,null,{"$f":"DATE(YEAR(I27),MONTH(I27)+1,1)","v":"2015-09-01"}]
[{"$f":"$A$10","v":"lu"},{"$f":"$B$10","v":"ma"},{"$f":"$C$10","v":"me"},{"$f":"$D$10","v":"je"},{"$f":"$E$10","v":"ve"},{"$f":"$F$10","v":"sa"},{"$f":"$G$10","v":"di"},null,{"$f":"$A$10","v":"lu"},{"$f":"$B$10","v":"ma"},{"$f":"$C$10","v":"me"},{"$f":"$D$10","v":"je"},{"$f":"$E$10","v":"ve"},{"$f":"$F$10","v":"sa"},{"$f":"$G$10","v":"di"},null,{"$f":"$A$10","v":"lu"},{"$f":"$B$10","v":"ma"},{"$f":"$C$10","v":"me"},{"$f":"$D$10","v":"je"},{"$f":"$E$10","v":"ve"},{"$f":"$F$10","v":"sa"},{"$f":"$G$10","v":"di"}]
[{"$f":"IF(MONTH($A$27)<>MONTH($A$27-(WEEKDAY($A$27,1)-($I$4-1))-IF((WEEKDAY($A$27,1)-($I$4-1))<=0,7,0)+(ROW(A29)-ROW($A$29))*7+(COLUMN(A29)-COLUMN($A$29)+1)),\"\",$A$27-(WEEKDAY($A$27,1)-($I$4-1))-IF((WEEKDAY($A$27,1)-($I$4-1))<=0,7,0)+(ROW(A29)-ROW($A$29))*7+(COLUMN(A29)-COLUMN($A$29)+1))","v":""},"","2015-07-01","2015-07-02","2015-07-03","2015-07-04","2015-07-05",null,{"$f":"IF(MONTH($I$27)<>MONTH($I$27-(WEEKDAY($I$27,1)-($I$4-1))-IF((WEEKDAY($I$27,1)-($I$4-1))<=0,7,0)+(ROW(I29)-ROW($I$29))*7+(COLUMN(I29)-COLUMN($I$29)+1)),\"\",$I$27-(WEEKDAY($I$27,1)-($I$4-1))-IF((WEEKDAY($I$27,1)-($I$4-1))<=0,7,0)+(ROW(I29)-ROW($I$29))*7+(COLUMN(I29)-COLUMN($I$29)+1))","v":""},"","","","","2015-08-01","2015-08-02",null,{"$f":"IF(MONTH($Q$27)<>MONTH($Q$27-(WEEKDAY($Q$27,1)-($I$4-1))-IF((WEEKDAY($Q$27,1)-($I$4-1))<=0,7,0)+(ROW(Q29)-ROW($Q$29))*7+(COLUMN(Q29)-COLUMN($Q$29)+1)),\"\",$Q$27-(WEEKDAY($Q$27,1)-($I$4-1))-IF((WEEKDAY($Q$27,1)-($I$4-1))<=0,7,0)+(ROW(Q29)-ROW($Q$29))*7+(COLUMN(Q29)-COLUMN($Q$29)+1))","v":""},"2015-09-01","2015-09-02","2015-09-03","2015-09-04","2015-09-05","2015-09-06"]
["2015-07-06","2015-07-07","2015-07-08","2015-07-09","2015-07-10","2015-07-11","2015-07-12",null,"2015-08-03","2015-08-04","2015-08-05","2015-08-06","2015-08-07","2015-08-08","2015-08-09",null,"2015-09-07","2015-09-08","2015-09-09","2015-09-10","2015-09-11","2015-09-12","2015-09-13"]
["2015-07-13","2015-07-14","2015-07-15","2015-07-16","2015-07-17","2015-07-18","2015-07-19",null,"2015-08-10","2015-08-11","2015-08-12","2015-08-13","2015-08-14","2015-08-15","2015-08-16",null,"2015-09-14","2015-09-15","2015-09-16","2015-09-17","2015-09-18","2015-09-19","2015-09-20"]
["2015-07-20","2015-07-21","2015-07-22","2015-07-23","2015-07-24","2015-07-25","2015-07-26",null,"2015-08-17","2015-08-18","2015-08-19","2015-08-20","2015-08-21","2015-08-22","2015-08-23",null,"2015-09-21","2015-09-22","2015-09-23","2015-09-24","2015-09-25","2015-09-26","2015-09-27"]
["2015-07-27","2015-07-28","2015-07-29","2015-07-30","2015-07-31","","",null,"2015-08-24","2015-08-25","2015-08-26","2015-08-27","2015-08-28","2015-08-29","2015-08-30",null,"2015-09-28","2015-09-29","2015-09-30","","","",""]
["","","","","","","",null,"2015-08-31","","","","","","",null,"","","","","","",""]
[]
[{"$f":"DATE(YEAR(Q27),MONTH(Q27)+1,1)","v":"2015-10-01"},null,null,null,null,null,null,null,{"$f":"DATE(YEAR(A36),MONTH(A36)+1,1)","v":"2015-11-01"},null,null,null,null,null,null,null,{"$f":"DATE(YEAR(I36),MONTH(I36)+1,1)","v":"2015-12-01"},null,null,null,null,null,null,"[42]"]
[{"$f":"$A$10","v":"lu"},{"$f":"$B$10","v":"ma"},{"$f":"$C$10","v":"me"},{"$f":"$D$10","v":"je"},{"$f":"$E$10","v":"ve"},{"$f":"$F$10","v":"sa"},{"$f":"$G$10","v":"di"},null,{"$f":"$A$10","v":"lu"},{"$f":"$B$10","v":"ma"},{"$f":"$C$10","v":"me"},{"$f":"$D$10","v":"je"},{"$f":"$E$10","v":"ve"},{"$f":"$F$10","v":"sa"},{"$f":"$G$10","v":"di"},null,{"$f":"$A$10","v":"lu"},{"$f":"$B$10","v":"ma"},{"$f":"$C$10","v":"me"},{"$f":"$D$10","v":"je"},{"$f":"$E$10","v":"ve"},{"$f":"$F$10","v":"sa"},{"$f":"$G$10","v":"di"}]
[{"$f":"IF(MONTH($A$36)<>MONTH($A$36-(WEEKDAY($A$36,1)-($I$4-1))-IF((WEEKDAY($A$36,1)-($I$4-1))<=0,7,0)+(ROW(A38)-ROW($A$38))*7+(COLUMN(A38)-COLUMN($A$38)+1)),\"\",$A$36-(WEEKDAY($A$36,1)-($I$4-1))-IF((WEEKDAY($A$36,1)-($I$4-1))<=0,7,0)+(ROW(A38)-ROW($A$38))*7+(COLUMN(A38)-COLUMN($A$38)+1))","v":""},"","","2015-10-01","2015-10-02","2015-10-03","2015-10-04",null,{"$f":"IF(MONTH($I$36)<>MONTH($I$36-(WEEKDAY($I$36,1)-($I$4-1))-IF((WEEKDAY($I$36,1)-($I$4-1))<=0,7,0)+(ROW(I38)-ROW($I$38))*7+(COLUMN(I38)-COLUMN($I$38)+1)),\"\",$I$36-(WEEKDAY($I$36,1)-($I$4-1))-IF((WEEKDAY($I$36,1)-($I$4-1))<=0,7,0)+(ROW(I38)-ROW($I$38))*7+(COLUMN(I38)-COLUMN($I$38)+1))","v":""},"","","","","","2015-11-01",null,{"$f":"IF(MONTH($Q$36)<>MONTH($Q$36-(WEEKDAY($Q$36,1)-($I$4-1))-IF((WEEKDAY($Q$36,1)-($I$4-1))<=0,7,0)+(ROW(Q38)-ROW($Q$38))*7+(COLUMN(Q38)-COLUMN($Q$38)+1)),\"\",$Q$36-(WEEKDAY($Q$36,1)-($I$4-1))-IF((WEEKDAY($Q$36,1)-($I$4-1))<=0,7,0)+(ROW(Q38)-ROW($Q$38))*7+(COLUMN(Q38)-COLUMN($Q$38)+1))","v":""},"2015-12-01","2015-12-02","2015-12-03","2015-12-04","2015-12-05","2015-12-06"]
["2015-10-05","2015-10-06","2015-10-07","2015-10-08","2015-10-09","2015-10-10","2015-10-11",null,"2015-11-02","2015-11-03","2015-11-04","2015-11-05","2015-11-06","2015-11-07","2015-11-08",null,"2015-12-07","2015-12-08","2015-12-09","2015-12-10","2015-12-11","2015-12-12","2015-12-13"]
["2015-10-12","2015-10-13","2015-10-14","2015-10-15","2015-10-16","2015-10-17","2015-10-18",null,"2015-11-09","2015-11-10","2015-11-11","2015-11-12","2015-11-13","2015-11-14","2015-11-15",null,"2015-12-14","2015-12-15","2015-12-16","2015-12-17","2015-12-18","2015-12-19","2015-12-20"]
["2015-10-19","2015-10-20","2015-10-21","2015-10-22","2015-10-23","2015-10-24","2015-10-25",null,"2015-11-16","2015-11-17","2015-11-18","2015-11-19","2015-11-20","2015-11-21","2015-11-22",null,"2015-12-21","2015-12-22","2015-12-23","2015-12-24","2015-12-25","2015-12-26","2015-12-27"]
["2015-10-26","2015-10-27","2015-10-28","2015-10-29","2015-10-30","2015-10-31","",null,"2015-11-23","2015-11-24","2015-11-25","2015-11-26","2015-11-27","2015-11-28","2015-11-29",null,"2015-12-28","2015-12-29","2015-12-30","2015-12-31","","",""]
["","","","","","","",null,"2015-11-30","","","","","","",null,"","","","","","",""]

{"sheet":"An1","index":38,"n_rows":43,"n_cols":26,"rows_kept":43,"cut":false,"hidden":false,"merged":[[43,0,43,14],[43,16,43,22],[26,0,26,6],[26,8,26,14],[26,16,26,22],[35,0,35,6],[35,8,35,14],[35,16,35,22],[6,0,6,22],[8,0,8,6],[8,8,8,14],[8,16,8,22],[17,0,17,6],[17,8,17,14],[17,16,17,22],[5,0,5,22],[0,0,0,25],[1,0,1,15],[2,0,2,2],[2,4,2,6],[2,8,2,10],[2,16,2,22],[3,0,3,2],[3,4,3,6],[3,8,3,10],[3,11,3,14],[3,16,3,25]]}
[]
[]
["An",null,null,null,"Mois",null,null,null,"premier jour",null,null,null,null,null,null,null,"Calendrier Titre"]
[{"$f":"Accueil!C18+1","v":2016},null,null,null,1,null,null,null,2,null,null,"1:di, 2:lu",null,null,null,null,"Calendrier de données"]
[]
[{"$f":"IF(Q4=\"\",\"\",Q4)","v":"Calendrier de données"}]
[{"$f":"IF($E$4=1,A4,A4&\"-\"&A4+1)","v":2016}]
[]
[{"$f":"DATE($A$4,$E$4,1)","v":"2016-01-01"},null,null,null,null,null,null,null,{"$f":"DATE(YEAR(A9),MONTH(A9)+1,1)","v":"2016-02-01"},null,null,null,null,null,null,null,{"$f":"DATE(YEAR(I9),MONTH(I9)+1,1)","v":"2016-03-01"},null,null,null,null,null,null,null,"Date","Vacances ou Evénement"]
[{"$f":"INDEX({\"di\";\"lu\";\"ma\";\"me\";\"je\";\"ve\";\"sa\"},1+MOD($I$4+1-2,7))","v":"lu"},{"$f":"INDEX({\"di\";\"lu\";\"ma\";\"me\";\"je\";\"ve\";\"sa\"},1+MOD($I$4+2-2,7))","v":"ma"},{"$f":"INDEX({\"di\";\"lu\";\"ma\";\"me\";\"je\";\"ve\";\"sa\"},1+MOD($I$4+3-2,7))","v":"me"},{"$f":"INDEX({\"di\";\"lu\";\"ma\";\"me\";\"je\";\"ve\";\"sa\"},1+MOD($I$4+4-2,7))","v":"je"},{"$f":"INDEX({\"di\";\"lu\";\"ma\";\"me\";\"je\";\"ve\";\"sa\"},1+MOD($I$4+5-2,7))","v":"ve"},{"$f":"INDEX({\"di\";\"lu\";\"ma\";\"me\";\"je\";\"ve\";\"sa\"},1+MOD($I$4+6-2,7))","v":"sa"},{"$f":"INDEX({\"di\";\"lu\";\"ma\";\"me\";\"je\";\"ve\";\"sa\"},1+MOD($I$4+7-2,7))","v":"di"},null,{"$f":"$A$10","v":"lu"},{"$f":"$B$10","v":"ma"},{"$f":"$C$10","v":"me"},{"$f":"$D$10","v":"je"},{"$f":"$E$10","v":"ve"},{"$f":"$F$10","v":"sa"},{"$f":"$G$10","v":"di"},null,{"$f":"$A$10","v":"lu"},{"$f":"$B$10","v":"ma"},{"$f":"$C$10","v":"me"},{"$f":"$D$10","v":"je"},{"$f":"$E$10","v":"ve"},{"$f":"$F$10","v":"sa"},{"$f":"$G$10","v":"di"}]
[{"$f":"IF(MONTH($A$9)<>MONTH($A$9-(WEEKDAY($A$9,1)-($I$4-1))-IF((WEEKDAY($A$9,1)-($I$4-1))<=0,7,0)+(ROW(A11)-ROW($A$11))*7+(COLUMN(A11)-COLUMN($A$11)+1)),\"\",$A$9-(WEEKDAY($A$9,1)-($I$4-1))-IF((WEEKDAY($A$9,1)-($I$4-1))<=0,7,0)+(ROW(A11)-ROW($A$11))*7+(COLUMN(A11)-COLUMN($A$11)+1))","v":""},"",{"$f":"IF(MONTH($A$9)<>MONTH($A$9-(WEEKDAY($A$9,1)-($I$4-1))-IF((WEEKDAY($A$9,1)-($I$4-1))<=0,7,0)+(ROW(C11)-ROW($A$11))*7+(COLUMN(C11)-COLUMN($A$11)+1)),\"\",$A$9-(WEEKDAY($A$9,1)-($I$4-1))-IF((WEEKDAY($A$9,1)-($I$4-1))<=0,7,0)+(ROW(C11)-ROW($A$11))*7+(COLUMN(C11)-COLUMN($A$11)+1))","v":""},"","2016-01-01","2016-01-02","2016-01-03",null,{"$f":"IF(MONTH($I$9)<>MONTH($I$9-(WEEKDAY($I$9,1)-($I$4-1))-IF((WEEKDAY($I$9,1)-($I$4-1))<=0,7,0)+(ROW(I11)-ROW($I$11))*7+(COLUMN(I11)-COLUMN($I$11)+1)),\"\",$I$9-(WEEKDAY($I$9,1)-($I$4-1))-IF((WEEKDAY($I$9,1)-($I$4-1))<=0,7,0)+(ROW(I11)-ROW($I$11))*7+(COLUMN(I11)-COLUMN($I$11)+1))","v":"2016-02-01"},"2016-02-02","2016-02-03","2016-02-04","2016-02-05","2016-02-06","2016-02-07",null,{"$f":"IF(MONTH($Q$9)<>MONTH($Q$9-(WEEKDAY($Q$9,1)-($I$4-1))-IF((WEEKDAY($Q$9,1)-($I$4-1))<=0,7,0)+(ROW(Q11)-ROW($Q$11))*7+(COLUMN(Q11)-COLUMN($Q$11)+1)),\"\",$Q$9-(WEEKDAY($Q$9,1)-($I$4-1))-IF((WEEKDAY($Q$9,1)-($I$4-1))<=0,7,0)+(ROW(Q11)-ROW($Q$11))*7+(COLUMN(Q11)-COLUMN($Q$11)+1))","v":""},"2016-03-01","2016-03-02","2016-03-03","2016-03-04","2016-03-05","2016-03-06",null,{"$f":"DATE($A$4+IF($E$4>1,1,0),1,1)","v":"2016-01-01"},"Jour de l'an"]
["2016-01-04",{"$f":"IF(MONTH($A$9)<>MONTH($A$9-(WEEKDAY($A$9,1)-($I$4-1))-IF((WEEKDAY($A$9,1)-($I$4-1))<=0,7,0)+(ROW(B12)-ROW($A$11))*7+(COLUMN(B12)-COLUMN($A$11)+1)),\"\",$A$9-(WEEKDAY($A$9,1)-($I$4-1))-IF((WEEKDAY($A$9,1)-($I$4-1))<=0,7,0)+(ROW(B12)-ROW($A$11))*7+(COLUMN(B12)-COLUMN($A$11)+1))","v":"2016-01-05"},"2016-01-06","2016-01-07","2016-01-08","2016-01-09","2016-01-10",null,"2016-02-08","2016-02-09","2016-02-10","2016-02-11","2016-02-12","2016-02-13","2016-02-14",null,"2016-03-07","2016-03-08","2016-03-09","2016-03-10","2016-03-11","2016-03-12","2016-03-13",null,{"$f":"DATE($A$4+IF($E$4>5,1,0),5,1)","v":"2016-05-01"},"Fête du premier mai"]
["2016-01-11","2016-01-12","2016-01-13","2016-01-14","2016-01-15","2016-01-16","2016-01-17",null,"2016-02-15","2016-02-16","2016-02-17","2016-02-18","2016-02-19","2016-02-20","2016-02-21",null,"2016-03-14","2016-03-15","2016-03-16","2016-03-17","2016-03-18","2016-03-19","2016-03-20",null,{"$f":"DATE($A$4+IF($E$4>5,1,0),5,8)","v":"2016-05-08"},"Fête de la Victoire 1945"]
["2016-01-18","2016-01-19","2016-01-20","2016-01-21","2016-01-22","2016-01-23","2016-01-24",null,"2016-02-22","2016-02-23","2016-02-24","2016-02-25","2016-02-26","2016-02-27","2016-02-28",null,"2016-03-21","2016-03-22","2016-03-23","2016-03-24","2016-03-25","2016-03-26","2016-03-27",null,{"$f":"DATE($A$4+IF($E$4>7,1,0),7,14)","v":"2016-07-14"},"Fête nationale"]
["2016-01-25","2016-01-26","2016-01-27","2016-01-28","2016-01-29","2016-01-30","2016-01-31",null,"2016-02-29","","","","","","",null,"2016-03-28","2016-03-29","2016-03-30","2016-03-31","","","",null,{"$f":"DATE($A$4+IF($E$4>8,1,0),8,15)","v":"2016-08-15"},"Assomption"]
["","","","","","","",null,"","","","","","","",null,"","","","","","","",null,{"$f":"DATE($A$4+IF($E$4>11,1,0),11,1)","v":"2016-11-01"},"La Toussaint"]
[null,null,null,null,null,null,null,null,null,null,null,null,null,null,null,null,null,null,null,null,null,null,null,null,{"$f":"DATE($A$4+IF($E$4>11,1,0),11,11)","v":"2016-11-11"},"Jour d'armistice"]
[{"$f":"DATE(YEAR(Q9),MONTH(Q9)+1,1)","v":"2016-04-01"},null,null,null,null,null,null,null,{"$f":"DATE(YEAR(A18),MONTH(A18)+1,1)","v":"2016-05-01"},null,null,null,null,null,null,null,{"$f":"DATE(YEAR(I18),MONTH(I18)+1,1)","v":"2016-06-01"},null,null,null,null,null,null,null,{"$f":"IF(AND($A$4>1900,$A$4<2099),IF(MONTH(ROUNDDOWN((DATE(2000,3,20)+TIME(7,29,0))+($A$4-2000)*365.24238,0))<$E$4,ROUNDDOWN((DATE(2000,3,20)+TIME(7,29,0))+($A$4+1-2000)*365.24238,0),ROUNDDOWN((DATE(2000,3,20)+TIME(7,29,0))+($A$4-2000)*365.24238,0)),\"n/f\")","v":"2016-03-20"},"équinoxe de printemps"]
[{"$f":"$A$10","v":"lu"},{"$f":"$B$10","v":"ma"},{"$f":"$C$10","v":"me"},{"$f":"$D$10","v":"je"},{"$f":"$E$10","v":"ve"},{"$f":"$F$10","v":"sa"},{"$f":"$G$10","v":"di"},null,{"$f":"$A$10","v":"lu"},{"$f":"$B$10","v":"ma"},{"$f":"$C$10","v":"me"},{"$f":"$D$10","v":"je"},{"$f":"$E$10","v":"ve"},{"$f":"$F$10","v":"sa"},{"$f":"$G$10","v":"di"},null,{"$f":"$A$10","v":"lu"},{"$f":"$B$10","v":"ma"},{"$f":"$C$10","v":"me"},{"$f":"$D$10","v":"je"},{"$f":"$E$10","v":"ve"},{"$f":"$F$10","v":"sa"},{"$f":"$G$10","v":"di"},null,{"$f":"IF(AND($A$4>1900,$A$4<2099),IF(MONTH(ROUNDDOWN((DATE(2000,6,21)+TIME(1,36,0))+($A$4-2000)*365.24163,0))<$E$4,ROUNDDOWN((DATE(2000,6,21)+TIME(1,36,0))+($A$4+1-2000)*365.24163,0),ROUNDDOWN((DATE(2000,6,21)+TIME(1,36,0))+($A$4-2000)*365.24163,0)),\"n/f\")","v":"2016-06-20"},"juin solstice"]
[{"$f":"IF(MONTH($A$18)<>MONTH($A$18-(WEEKDAY($A$18,1)-($I$4-1))-IF((WEEKDAY($A$18,1)-($I$4-1))<=0,7,0)+(ROW(A20)-ROW($A$20))*7+(COLUMN(A20)-COLUMN($A$20)+1)),\"\",$A$18-(WEEKDAY($A$18,1)-($I$4-1))-IF((WEEKDAY($A$18,1)-($I$4-1))<=0,7,0)+(ROW(A20)-ROW($A$20))*7+(COLUMN(A20)-COLUMN($A$20)+1))","v":""},"","","","2016-04-01","2016-04-02","2016-04-03",null,{"$f":"IF(MONTH($I$18)<>MONTH($I$18-(WEEKDAY($I$18,1)-($I$4-1))-IF((WEEKDAY($I$18,1)-($I$4-1))<=0,7,0)+(ROW(I20)-ROW($I$20))*7+(COLUMN(I20)-COLUMN($I$20)+1)),\"\",$I$18-(WEEKDAY($I$18,1)-($I$4-1))-IF((WEEKDAY($I$18,1)-($I$4-1))<=0,7,0)+(ROW(I20)-ROW($I$20))*7+(COLUMN(I20)-COLUMN($I$20)+1))","v":""},"","","","","","2016-05-01",null,{"$f":"IF(MONTH($Q$18)<>MONTH($Q$18-(WEEKDAY($Q$18,1)-($I$4-1))-IF((WEEKDAY($Q$18,1)-($I$4-1))<=0,7,0)+(ROW(Q20)-ROW($Q$20))*7+(COLUMN(Q20)-COLUMN($Q$20)+1)),\"\",$Q$18-(WEEKDAY($Q$18,1)-($I$4-1))-IF((WEEKDAY($Q$18,1)-($I$4-1))<=0,7,0)+(ROW(Q20)-ROW($Q$20))*7+(COLUMN(Q20)-COLUMN($Q$20)+1))","v":""},"","2016-06-01","2016-06-02","2016-06-03","2016-06-04","2016-06-05",null,{"$f":"IF(AND($A$4>1900,$A$4<2099),IF(MONTH(ROUNDDOWN((DATE(2000,9,22)+TIME(17,17,0))+($A$4-2000)*365.24205,0))<$E$4,ROUNDDOWN((DATE(2000,9,22)+TIME(17,17,0))+($A$4+1-2000)*365.24205,0),ROUNDDOWN((DATE(2000,9,22)+TIME(17,17,0))+($A$4-2000)*365.24205,0)),\"n/f\")","v":"2016-09-22"},"équinoxe automnal"]
["2016-04-04","2016-04-05","2016-04-06","2016-04-07","2016-04-08","2016-04-09","2016-04-10",null,"2016-05-02","2016-05-03","2016-05-04","2016-05-05","2016-05-06","2016-05-07","2016-05-08",null,"2016-06-06","2016-06-07","2016-06-08","2016-06-09","2016-06-10","2016-06-11","2016-06-12",null,{"$f":"IF(AND($A$4>1900,$A$4<2099),IF(MONTH(ROUNDDOWN((DATE(2000,12,21)+TIME(13,30,0))+($A$4-2000)*365.242743,0))<$E$4,ROUNDDOWN((DATE(2000,12,21)+TIME(13,30,0))+($A$4+1-2000)*365.242743,0),ROUNDDOWN((DATE(2000,12,21)+TIME(13,30,0))+($A$4-2000)*365.242743,0)),\"n/f\")","v":"2016-12-21"},"décembre solstice"]
["2016-04-11","2016-04-12","2016-04-13","2016-04-14","2016-04-15","2016-04-16","2016-04-17",null,"2016-05-09","2016-05-10","2016-05-11","2016-05-12","2016-05-13","2016-05-14","2016-05-15",null,"2016-06-13","2016-06-14","2016-06-15","2016-06-16","2016-06-17","2016-06-18","2016-06-19",null,{"$f":"(DATE($A$4+IF($E$4>4,1,0),4,1)+(0-1)*7)+1-WEEKDAY(DATE($A$4+IF($E$4>4,1,0),4,1),1)+IF(1<WEEKDAY(DATE($A$4+IF($E$4>4,1,0),4,1),1),7,0)","v":"2016-03-27"},"heure d'été commencent"]
["2016-04-18","2016-04-19","2016-04-20","2016-04-21","2016-04-22","2016-04-23","2016-04-24",null,"2016-05-16","2016-05-17","2016-05-18","2016-05-19","2016-05-20","2016-05-21","2016-05-22",null,"2016-06-20","2016-06-21","2016-06-22","2016-06-23","2016-06-24","2016-06-25","2016-06-26",null,{"$f":"(DATE($A$4+IF($E$4>11,1,0),11,1)+(0-1)*7)+1-WEEKDAY(DATE($A$4+IF($E$4>11,1,0),11,1),1)+IF(1<WEEKDAY(DATE($A$4+IF($E$4>11,1,0),11,1),1),7,0)","v":"2016-10-30"},"heure d'été terminent"]
["2016-04-25","2016-04-26","2016-04-27","2016-04-28","2016-04-29","2016-04-30","",null,"2016-05-23","2016-05-24","2016-05-25","2016-05-26","2016-05-27","2016-05-28","2016-05-29",null,"2016-06-27","2016-06-28","2016-06-29","2016-06-30","","","",null,{"$f":"DATE($A$4+IF($E$4>12,1,0),12,25)","v":"2016-12-25"},"Noël"]
["","","","","","","",null,"2016-05-30","2016-05-31","","","","","",null,"","","","","","","",null,{"$f":"IF(AND($A$4>1900,$A$4<2199),IF(MONTH(ROUND(DATE($A$4,4,1)/7+MOD(19*MOD($A$4,19)-7,30)*0.14,0)*7-6)<$E$4,ROUND(DATE($A$4+1,4,1)/7+MOD(19*MOD($A$4+1,19)-7,30)*0.14,0)*7-6,ROUND(DATE($A$4,4,1)/7+MOD(19*MOD($A$4,19)-7,30)*0.14,0)*7-6),\"n/f\")","v":"2016-03-27"},"Pâques (Easter)"]
[null,null,null,null,null,null,null,null,null,null,null,null,null,null,null,null,null,null,null,null,null,null,null,null,{"$f":"IF(AND($A$4>1900,$A$4<2199),IF(MONTH(39+ROUND(DATE($A$4,4,1)/7+MOD(19*MOD($A$4,19)-7,30)*0.14,0)*7-6)<$E$4,39+ROUND(DATE($A$4+1,4,1)/7+MOD(19*MOD($A$4+1,19)-7,30)*0.14,0)*7-6,39+ROUND(DATE($A$4,4,1)/7+MOD(19*MOD($A$4,19)-7,30)*0.14,0)*7-6),\"n/f\")","v":"2016-05-05"},"l'Ascension catholique"]
[{"$f":"DATE(YEAR(Q18),MONTH(Q18)+1,1)","v":"2016-07-01"},null,null,null,null,null,null,null,{"$f":"DATE(YEAR(A27),MONTH(A27)+1,1)","v":"2016-08-01"},null,null,null,null,null,null,null,{"$f":"DATE(YEAR(I27),MONTH(I27)+1,1)","v":"2016-09-01"}]
[{"$f":"$A$10","v":"lu"},{"$f":"$B$10","v":"ma"},{"$f":"$C$10","v":"me"},{"$f":"$D$10","v":"je"},{"$f":"$E$10","v":"ve"},{"$f":"$F$10","v":"sa"},{"$f":"$G$10","v":"di"},null,{"$f":"$A$10","v":"lu"},{"$f":"$B$10","v":"ma"},{"$f":"$C$10","v":"me"},{"$f":"$D$10","v":"je"},{"$f":"$E$10","v":"ve"},{"$f":"$F$10","v":"sa"},{"$f":"$G$10","v":"di"},null,{"$f":"$A$10","v":"lu"},{"$f":"$B$10","v":"ma"},{"$f":"$C$10","v":"me"},{"$f":"$D$10","v":"je"},{"$f":"$E$10","v":"ve"},{"$f":"$F$10","v":"sa"},{"$f":"$G$10","v":"di"}]
[{"$f":"IF(MONTH($A$27)<>MONTH($A$27-(WEEKDAY($A$27,1)-($I$4-1))-IF((WEEKDAY($A$27,1)-($I$4-1))<=0,7,0)+(ROW(A29)-ROW($A$29))*7+(COLUMN(A29)-COLUMN($A$29)+1)),\"\",$A$27-(WEEKDAY($A$27,1)-($I$4-1))-IF((WEEKDAY($A$27,1)-($I$4-1))<=0,7,0)+(ROW(A29)-ROW($A$29))*7+(COLUMN(A29)-COLUMN($A$29)+1))","v":""},"","","","2016-07-01","2016-07-02","2016-07-03",null,{"$f":"IF(MONTH($I$27)<>MONTH($I$27-(WEEKDAY($I$27,1)-($I$4-1))-IF((WEEKDAY($I$27,1)-($I$4-1))<=0,7,0)+(ROW(I29)-ROW($I$29))*7+(COLUMN(I29)-COLUMN($I$29)+1)),\"\",$I$27-(WEEKDAY($I$27,1)-($I$4-1))-IF((WEEKDAY($I$27,1)-($I$4-1))<=0,7,0)+(ROW(I29)-ROW($I$29))*7+(COLUMN(I29)-COLUMN($I$29)+1))","v":"2016-08-01"},"2016-08-02","2016-08-03","2016-08-04","2016-08-05","2016-08-06","2016-08-07",null,{"$f":"IF(MONTH($Q$27)<>MONTH($Q$27-(WEEKDAY($Q$27,1)-($I$4-1))-IF((WEEKDAY($Q$27,1)-($I$4-1))<=0,7,0)+(ROW(Q29)-ROW($Q$29))*7+(COLUMN(Q29)-COLUMN($Q$29)+1)),\"\",$Q$27-(WEEKDAY($Q$27,1)-($I$4-1))-IF((WEEKDAY($Q$27,1)-($I$4-1))<=0,7,0)+(ROW(Q29)-ROW($Q$29))*7+(COLUMN(Q29)-COLUMN($Q$29)+1))","v":""},"","","2016-09-01","2016-09-02","2016-09-03","2016-09-04"]
["2016-07-04","2016-07-05","2016-07-06","2016-07-07","2016-07-08","2016-07-09","2016-07-10",null,"2016-08-08","2016-08-09","2016-08-10","2016-08-11","2016-08-12","2016-08-13","2016-08-14",null,"2016-09-05","2016-09-06","2016-09-07","2016-09-08","2016-09-09","2016-09-10","2016-09-11"]
["2016-07-11","2016-07-12","2016-07-13","2016-07-14","2016-07-15","2016-07-16","2016-07-17",null,"2016-08-15","2016-08-16","2016-08-17","2016-08-18","2016-08-19","2016-08-20","2016-08-21",null,"2016-09-12","2016-09-13","2016-09-14","2016-09-15","2016-09-16","2016-09-17","2016-09-18"]
["2016-07-18","2016-07-19","2016-07-20","2016-07-21","2016-07-22","2016-07-23","2016-07-24",null,"2016-08-22","2016-08-23","2016-08-24","2016-08-25","2016-08-26","2016-08-27","2016-08-28",null,"2016-09-19","2016-09-20","2016-09-21","2016-09-22","2016-09-23","2016-09-24","2016-09-25"]
["2016-07-25","2016-07-26","2016-07-27","2016-07-28","2016-07-29","2016-07-30","2016-07-31",null,"2016-08-29","2016-08-30","2016-08-31","","","","",null,"2016-09-26","2016-09-27","2016-09-28","2016-09-29","2016-09-30","",""]
["","","","","","","",null,"","","","","","","",null,"","","","","","",""]
[]
[{"$f":"DATE(YEAR(Q27),MONTH(Q27)+1,1)","v":"2016-10-01"},null,null,null,null,null,null,null,{"$f":"DATE(YEAR(A36),MONTH(A36)+1,1)","v":"2016-11-01"},null,null,null,null,null,null,null,{"$f":"DATE(YEAR(I36),MONTH(I36)+1,1)","v":"2016-12-01"},null,null,null,null,null,null,"[42]"]
[{"$f":"$A$10","v":"lu"},{"$f":"$B$10","v":"ma"},{"$f":"$C$10","v":"me"},{"$f":"$D$10","v":"je"},{"$f":"$E$10","v":"ve"},{"$f":"$F$10","v":"sa"},{"$f":"$G$10","v":"di"},null,{"$f":"$A$10","v":"lu"},{"$f":"$B$10","v":"ma"},{"$f":"$C$10","v":"me"},{"$f":"$D$10","v":"je"},{"$f":"$E$10","v":"ve"},{"$f":"$F$10","v":"sa"},{"$f":"$G$10","v":"di"},null,{"$f":"$A$10","v":"lu"},{"$f":"$B$10","v":"ma"},{"$f":"$C$10","v":"me"},{"$f":"$D$10","v":"je"},{"$f":"$E$10","v":"ve"},{"$f":"$F$10","v":"sa"},{"$f":"$G$10","v":"di"}]
[{"$f":"IF(MONTH($A$36)<>MONTH($A$36-(WEEKDAY($A$36,1)-($I$4-1))-IF((WEEKDAY($A$36,1)-($I$4-1))<=0,7,0)+(ROW(A38)-ROW($A$38))*7+(COLUMN(A38)-COLUMN($A$38)+1)),\"\",$A$36-(WEEKDAY($A$36,1)-($I$4-1))-IF((WEEKDAY($A$36,1)-($I$4-1))<=0,7,0)+(ROW(A38)-ROW($A$38))*7+(COLUMN(A38)-COLUMN($A$38)+1))","v":""},"","","","","2016-10-01","2016-10-02",null,{"$f":"IF(MONTH($I$36)<>MONTH($I$36-(WEEKDAY($I$36,1)-($I$4-1))-IF((WEEKDAY($I$36,1)-($I$4-1))<=0,7,0)+(ROW(I38)-ROW($I$38))*7+(COLUMN(I38)-COLUMN($I$38)+1)),\"\",$I$36-(WEEKDAY($I$36,1)-($I$4-1))-IF((WEEKDAY($I$36,1)-($I$4-1))<=0,7,0)+(ROW(I38)-ROW($I$38))*7+(COLUMN(I38)-COLUMN($I$38)+1))","v":""},"2016-11-01","2016-11-02","2016-11-03","2016-11-04","2016-11-05","2016-11-06",null,{"$f":"IF(MONTH($Q$36)<>MONTH($Q$36-(WEEKDAY($Q$36,1)-($I$4-1))-IF((WEEKDAY($Q$36,1)-($I$4-1))<=0,7,0)+(ROW(Q38)-ROW($Q$38))*7+(COLUMN(Q38)-COLUMN($Q$38)+1)),\"\",$Q$36-(WEEKDAY($Q$36,1)-($I$4-1))-IF((WEEKDAY($Q$36,1)-($I$4-1))<=0,7,0)+(ROW(Q38)-ROW($Q$38))*7+(COLUMN(Q38)-COLUMN($Q$38)+1))","v":""},"","","2016-12-01","2016-12-02","2016-12-03","2016-12-04"]
["2016-10-03","2016-10-04","2016-10-05","2016-10-06","2016-10-07","2016-10-08","2016-10-09",null,"2016-11-07","2016-11-08","2016-11-09","2016-11-10","2016-11-11","2016-11-12","2016-11-13",null,"2016-12-05","2016-12-06","2016-12-07","2016-12-08","2016-12-09","2016-12-10","2016-12-11"]
["2016-10-10","2016-10-11","2016-10-12","2016-10-13","2016-10-14","2016-10-15","2016-10-16",null,"2016-11-14","2016-11-15","2016-11-16","2016-11-17","2016-11-18","2016-11-19","2016-11-20",null,"2016-12-12","2016-12-13","2016-12-14","2016-12-15","2016-12-16","2016-12-17","2016-12-18"]
["2016-10-17","2016-10-18","2016-10-19","2016-10-20","2016-10-21","2016-10-22","2016-10-23",null,"2016-11-21","2016-11-22","2016-11-23","2016-11-24","2016-11-25","2016-11-26","2016-11-27",null,"2016-12-19","2016-12-20","2016-12-21","2016-12-22","2016-12-23","2016-12-24","2016-12-25"]
["2016-10-24","2016-10-25","2016-10-26","2016-10-27","2016-10-28","2016-10-29","2016-10-30",null,"2016-11-28","2016-11-29","2016-11-30","","","","",null,"2016-12-26","2016-12-27","2016-12-28","2016-12-29","2016-12-30","2016-12-31",""]
["2016-10-31","","","","","","",null,"","","","","","","",null,"","","","","","",""]

{"sheet":"1","index":39,"n_rows":38,"n_cols":14,"rows_kept":38,"cut":false,"hidden":false,"merged":[[36,0,36,1],[36,2,36,3],[36,12,36,13],[37,0,37,1],[37,2,37,3],[37,10,37,13],[31,12,31,13],[33,0,33,1],[33,2,33,3],[34,0,34,1],[34,2,34,3],[35,0,35,1],[35,2,35,3],[31,0,31,1],[31,2,31,3],[31,4,31,5],[31,6,31,7],[31,8,31,9],[31,10,31,11],[29,12,29,13],[30,0,30,1],[30,2,30,3],[30,4,30,5],[30,6,30,7],[30,8,30,9],[30,10,30,11],[30,12,30,13],[29,0,29,1],[29,2,29,3],[29,4,29,5],[29,6,29,7],[29,8,29,9],[29,10,29,11],[27,12,27,13],[28,0,28,1],[28,2,28,3],[28,4,28,5],[28,6,28,7],[28,8,28,9],[28,10,28,11],[28,12,28,13],[27,0,27,1],[27,2,27,3],[27,4,27,5],[27,6,27,7],[27,8,27,9],[27,10,27,11],[24,12,24,13],[25,0,25,1],[25,2,25,3],[25,4,25,5],[25,6,25,7],[25,8,25,9],[25,10,25,11],[25,12,25,13],[24,0,24,1],[24,2,24,3],[24,4,24,5],[24,6,24,7],[24,8,24,9],[24,10,24,11],[22,12,22,13],[23,0,23,1],[23,2,23,3],[23,4,23,5],[23,6,23,7],[23,8,23,9],[23,10,23,11],[23,12,23,13],[22,0,22,1],[22,2,22,3],[22,4,22,5],[22,6,22,7],[22,8,22,9],[22,10,22,11],[19,12,19,13],[21,0,21,1],[21,2,21,3],[21,4,21,5],[21,6,21,7],[21,8,21,9],[21,10,21,11],[21,12,21,13],[19,0,19,1],[19,2,19,3],[19,4,19,5],[19,6,19,7],[19,8,19,9],[19,10,19,11],[17,12,17,13],[18,0,18,1],[18,2,18,3],[18,4,18,5],[18,6,18,7],[18,8,18,9],[18,10,18,11],[18,12,18,13],[17,0,17,1],[17,2,17,3],[17,4,17,5],[17,6,17,7],[17,8,17,9],[17,10,17,11],[15,12,15,13],[16,0,16,1],[16,2,16,3],[16,4,16,5],[16,6,16,7],[16,8,16,9],[16,10,16,11],[16,12,16,13],[15,0,15,1],[15,2,15,3],[15,4,15,5],[15,6,15,7],[15,8,15,9],[15,10,15,11],[12,12,12,13],[13,0,13,1],[13,2,13,3],[13,4,13,5],[13,6,13,7],[13,8,13,9],[13,10,13,11],[13,12,13,13],[12,0,12,1],[12,2,12,3],[12,4,12,5],[12,6,12,7],[12,8,12,9],[12,10,12,11],[10,12,10,13],[11,0,11,1],[11,2,11,3],[11,4,11,5],[11,6,11,7],[11,8,11,9],[11,10,11,11],[11,12,11,13],[10,0,10,1],[10,2,10,3],[10,4,10,5],[10,6,10,7],[10,8,10,9],[10,10,10,11],[7,12,7,13],[9,0,9,1],[9,2,9,3],[9,4,9,5],[9,6,9,7],[9,8,9,9],[9,10,9,11],[9,12,9,13],[7,0,7,1],[7,2,7,3],[7,4,7,5],[7,6,7,7],[7,8,7,9],[7,10,7,11],[5,12,5,13],[6,0,6,1],[6,2,6,3],[6,4,6,5],[6,6,6,7],[6,8,6,9],[6,10,6,11],[6,12,6,13],[5,0,5,1],[5,2,5,3],[5,4,5,5],[5,6,5,7],[5,8,5,9],[5,10,5,11],[3,12,3,13],[4,0,4,1],[4,2,4,3],[4,4,4,5],[4,6,4,7],[4,8,4,9],[4,10,4,11],[4,12,4,13],[3,0,3,1],[3,2,3,3],[3,4,3,5],[3,6,3,7],[3,8,3,9],[3,10,3,11],[0,0,0,6],[0,7,0,13],[1,0,1,1],[1,2,1,3],[1,4,1,5],[1,6,1,7],[1,8,1,9],[1,10,1,11],[1,12,1,13]]}
[{"$f":"IF(An!$Q$4=\"\",\"\",An!$Q$4)","v":"Calendrier de données"},null,null,null,null,null,null,{"$f":"An!A9","v":"2015-01-01"}]
[{"$f":"INDEX({\"dimanche\";\"lundi\";\"mardi\";\"mercredi\";\"jeudi\";\"vendredi\";\"samedi\"},1+MOD(An!$I$4+1-2,7))","v":"lundi"},null,{"$f":"INDEX({\"dimanche\";\"lundi\";\"mardi\";\"mercredi\";\"jeudi\";\"vendredi\";\"samedi\"},1+MOD(An!$I$4+2-2,7))","v":"mardi"},null,{"$f":"INDEX({\"dimanche\";\"lundi\";\"mardi\";\"mercredi\";\"jeudi\";\"vendredi\";\"samedi\"},1+MOD(An!$I$4+3-2,7))","v":"mercredi"},null,{"$f":"INDEX({\"dimanche\";\"lundi\";\"mardi\";\"mercredi\";\"jeudi\";\"vendredi\";\"samedi\"},1+MOD(An!$I$4+4-2,7))","v":"jeudi"},null,{"$f":"INDEX({\"dimanche\";\"lundi\";\"mardi\";\"mercredi\";\"jeudi\";\"vendredi\";\"samedi\"},1+MOD(An!$I$4+5-2,7))","v":"vendredi"},null,{"$f":"INDEX({\"dimanche\";\"lundi\";\"mardi\";\"mercredi\";\"jeudi\";\"vendredi\";\"samedi\"},1+MOD(An!$I$4+6-2,7))","v":"samedi"},null,{"$f":"INDEX({\"dimanche\";\"lundi\";\"mardi\";\"mercredi\";\"jeudi\";\"vendredi\";\"samedi\"},1+MOD(An!$I$4+7-2,7))","v":"dimanche"}]
[{"$f":"An!A11","v":""},"",{"$f":"An!B11","v":""},"",{"$f":"An!C11","v":""},"",{"$f":"An!D11","v":"2015-01-01"},"",{"$f":"An!E11","v":"2015-01-02"},"",{"$f":"An!F11","v":"2015-01-03"},"",{"$f":"An!G11","v":"2015-01-04"},""]
["",null,"",null,"",null,"",null,"",null,"",null,""]
[]
[]
["",null,"",null,"",null,"",null,"",null,"",null,""]
["",null,"",null,"",null,"",null,"",null,"",null,""]
[{"$f":"An!A12","v":"2015-01-05"},"",{"$f":"An!B12","v":"2015-01-06"},"",{"$f":"An!C12","v":"2015-01-07"},"",{"$f":"An!D12","v":"2015-01-08"},"",{"$f":"An!E12","v":"2015-01-09"},"",{"$f":"An!F12","v":"2015-01-10"},"",{"$f":"An!G12","v":"2015-01-11"},""]
["",null,"",null,"",null,"",null,"",null,"",null,""]
[]
[]
["",null,"",null,"",null,"",null,"",null,"",null,""]
["",null,"",null,"",null,"",null,"",null,"",null,""]
[{"$f":"An!A13","v":"2015-01-12"},"",{"$f":"An!B13","v":"2015-01-13"},"",{"$f":"An!C13","v":"2015-01-14"},"",{"$f":"An!D13","v":"2015-01-15"},"",{"$f":"An!E13","v":"2015-01-16"},"",{"$f":"An!F13","v":"2015-01-17"},"",{"$f":"An!G13","v":"2015-01-18"},""]
["",null,"",null,"",null,"",null,"",null,"",null,""]
[]
[]
["",null,"",null,"",null,"",null,"",null,"",null,""]
["",null,"",null,"",null,"",null,"",null,"",null,""]
[{"$f":"An!A14","v":"2015-01-19"},"",{"$f":"An!B14","v":"2015-01-20"},"",{"$f":"An!C14","v":"2015-01-21"},"",{"$f":"An!D14","v":"2015-01-22"},"",{"$f":"An!E14","v":"2015-01-23"},"",{"$f":"An!F14","v":"2015-01-24"},"",{"$f":"An!G14","v":"2015-01-25"},""]
["",null,"",null,"",null,"",null,"",null,"",null,""]
[]
[]
["",null,"",null,"",null,"",null,"",null,"",null,""]
["",null,"",null,"",null,"",null,"",null,"",null,""]
[{"$f":"An!A15","v":"2015-01-26"},"",{"$f":"An!B15","v":"2015-01-27"},"",{"$f":"An!C15","v":"2015-01-28"},"",{"$f":"An!D15","v":"2015-01-29"},"",{"$f":"An!E15","v":"2015-01-30"},"",{"$f":"An!F15","v":"2015-01-31"},"",{"$f":"An!G15","v":""},""]
["",null,"",null,"",null,"",null,"",null,"",null,""]
[]
[]
["",null,"",null,"",null,"",null,"",null,"",null,""]
["",null,"",null,"",null,"",null,"",null,"",null,""]
[{"$f":"An!A16","v":""},"",{"$f":"An!B16","v":""},"","Notes"]
["",null,""]
[]
[]
["",null,""]
["",null,"[42]"]

{"sheet":"LISTES","index":40,"n_rows":12,"n_cols":10,"rows_kept":12,"cut":false,"hidden":false,"merged":[]}
["Civilité","Communes","Groupe Sanguin","Lien de Parenté","Genre","Classe","Etablissements","Diplomes","Allergies Alimentaires","Autres Allergies"]
["Mr","Anglars St Félix","A+","Père","Garçon","PS Maternelle","Ecole Maternelle et Primaire Publique Rignac","BAFA","Arachides","Arnica"]
["Mme","Auzits","O+","Mère","Fille","MS Maternelle","Collège public Georges Rouquier Rignac","STG BAFA","Céléri","Maquillage"]
[null,"Belcastel","B+","Oncle",null,"GS Maternelle","Ecole maternelle et primaire Saint Joseph Rignac","BAFD","Fraise","Soleil"]
[null,"Bournazel","A-","Tante",null,"CP","Collège Privé Jeanne d’Arc Rignac","STG BAFD","Lactose"]
[null,"Escandolières","O-","Grand-Père",null,"CE1","Ecole Publique Anglars Saint Félix","BP JEPS","Lait de vache"]
[null,"Goutrens","AB+","Grand-Mère",null,"CE2","Ecole Publique Roger Noyer Auzits","STG BP JEPS","Œufs"]
[null,"Mayran","B-","Frère",null,"CM1","Ecole Primaire et Elementaire Mayran","DIRECTEUR","Tomates"]
[null,"Rignac","AB-","Sœur",null,"CM2","Ecole Publique Goutrens","SOUS-DIRECTEUR","Tous fruits à coques"]
[null,"Rignac SJO",null,"Cousin",null,"6em Collège","Ecole Publique Bournazel","STAGIARE"]
[null,"Rodez",null,"Cousine",null,"5em Collège","Ecole Publique Escandolières","INTERVENANT"]
[null,null,null,"Autre"]

{"sheet":"Couleurs","index":41,"n_rows":5,"n_cols":1,"rows_kept":5,"cut":false,"hidden":false,"merged":[]}
["F"]
["A"]
[1]
[1]
[0]