{"text_format":"1","workbook":"xlsx","n_sheets":11,"sheets":["Accueil","Arrivée","Départ","Délais","Supports","Services","Rédacteurs","Statistiques Arrivée","Statistiques Départ","Paramètres","Listes Saisie Auto"],"not_rendered":{"charts":4,"images":5,"macros":1,"external_links":1,"defined_names":49,"comments":0,"pivot_tables":8},"unopened":[],"bounds":{"document_bytes":16777216,"sheet_cells":100000,"rows_first":2000,"rows_last":500,"rows_between":2000,"halvings":0,"cell_chars":16384,"cell_head_chars":4096},"cells_cut":0,"cells_raw":0,"read":"whole","date_system":"1900"}

{"sheet":"Accueil","index":0,"n_rows":18,"n_cols":8,"rows_kept":18,"cut":false,"hidden":false,"merged":[[0,3,0,5],[1,1,1,7],[18,1,18,7]]}
[null,null,null,{"$f":"Collectivité&\"\n\"&Service&\"\nRegistre du courrier\"","v":"Ville d'Excel-les-Bains\nEnseignement, Réglementation et Citoyenneté\nRegistre du courrier"}]
[null,"Tableau de bord"]
[null,"Chrono","Date","Objet","Date limite de réponse","Criticité","Correspondant","Service"]
[null,{"$f":"IF(LEN(Arrivée!Q10001)>0,Arrivée!Q10001,\"\")","v":""},{"$f":"IF(LEN(Arrivée!R10001)>0,Arrivée!R10001,\"\")","v":""},{"$f":"IF(LEN(Arrivée!T10001)>0,Arrivée!T10001,\"\")","v":""},{"$f":"IF(LEN(Arrivée!W10001)>0,Arrivée!W10001,\"\")","v":""},{"$f":"IF(LEN(Arrivée!Y10001)>0,Arrivée!Y10001,\"néant\")","v":"néant"},{"$f":"IF(LEN(Arrivée!Z10001)>0,Arrivée!Z10001,\"\")","v":""},{"$f":"IF(LEN(Arrivée!AB10001)>0,Arrivée!AB10001,\"\")","v":""}]
[null,{"$f":"IF(LEN(Arrivée!Q10002)>0,Arrivée!Q10002,\"\")","v":""},{"$f":"IF(LEN(Arrivée!R10002)>0,Arrivée!R10002,\"\")","v":""},{"$f":"IF(LEN(Arrivée!T10002)>0,Arrivée!T10002,\"\")","v":""},{"$f":"IF(LEN(Arrivée!W10002)>0,Arrivée!W10002,\"\")","v":""},{"$f":"IF(LEN(Arrivée!Y10002)>0,Arrivée!Y10002,\"néant\")","v":"néant"},{"$f":"IF(LEN(Arrivée!Z10002)>0,Arrivée!Z10002,\"\")","v":""},{"$f":"IF(LEN(Arrivée!AB10002)>0,Arrivée!AB10002,\"\")","v":""}]
[null,{"$f":"IF(LEN(Arrivée!Q10003)>0,Arrivée!Q10003,\"\")","v":""},{"$f":"IF(LEN(Arrivée!R10003)>0,Arrivée!R10003,\"\")","v":""},{"$f":"IF(LEN(Arrivée!T10003)>0,Arrivée!T10003,\"\")","v":""},{"$f":"IF(LEN(Arrivée!W10003)>0,Arrivée!W10003,\"\")","v":""},{"$f":"IF(LEN(Arrivée!Y10003)>0,Arrivée!Y10003,\"néant\")","v":"néant"},{"$f":"IF(LEN(Arrivée!Z10003)>0,Arrivée!Z10003,\"\")","v":""},{"$f":"IF(LEN(Arrivée!AB10003)>0,Arrivée!AB10003,\"\")","v":""}]
[null,{"$f":"IF(LEN(Arrivée!Q10004)>0,Arrivée!Q10004,\"\")","v":""},{"$f":"IF(LEN(Arrivée!R10004)>0,Arrivée!R10004,\"\")","v":""},{"$f":"IF(LEN(Arrivée!T10004)>0,Arrivée!T10004,\"\")","v":""},{"$f":"IF(LEN(Arrivée!W10004)>0,Arrivée!W10004,\"\")","v":""},{"$f":"IF(LEN(Arrivée!Y10004)>0,Arrivée!Y10004,\"néant\")","v":"néant"},{"$f":"IF(LEN(Arrivée!Z10004)>0,Arrivée!Z10004,\"\")","v":""},{"$f":"IF(LEN(Arrivée!AB10004)>0,Arrivée!AB10004,\"\")","v":""}]
[null,{"$f":"IF(LEN(Arrivée!Q10005)>0,Arrivée!Q10005,\"\")","v":""},{"$f":"IF(LEN(Arrivée!R10005)>0,Arrivée!R10005,\"\")","v":""},{"$f":"IF(LEN(Arrivée!T10005)>0,Arrivée!T10005,\"\")","v":""},{"$f":"IF(LEN(Arrivée!W10005)>0,Arrivée!W10005,\"\")","v":""},{"$f":"IF(LEN(Arrivée!Y10005)>0,Arrivée!Y10005,\"néant\")","v":"néant"},{"$f":"IF(LEN(Arrivée!Z10005)>0,Arrivée!Z10005,\"\")","v":""},{"$f":"IF(LEN(Arrivée!AB10005)>0,Arrivée!AB10005,\"\")","v":""}]
[null,{"$f":"IF(LEN(Arrivée!Q10006)>0,Arrivée!Q10006,\"\")","v":""},{"$f":"IF(LEN(Arrivée!R10006)>0,Arrivée!R10006,\"\")","v":""},{"$f":"IF(LEN(Arrivée!T10006)>0,Arrivée!T10006,\"\")","v":""},{"$f":"IF(LEN(Arrivée!W10006)>0,Arrivée!W10006,\"\")","v":""},{"$f":"IF(LEN(Arrivée!Y10006)>0,Arrivée!Y10006,\"néant\")","v":"néant"},{"$f":"IF(LEN(Arrivée!Z10006)>0,Arrivée!Z10006,\"\")","v":""},{"$f":"IF(LEN(Arrivée!AB10006)>0,Arrivée!AB10006,\"\")","v":""}]
[null,{"$f":"IF(LEN(Arrivée!Q10007)>0,Arrivée!Q10007,\"\")","v":""},{"$f":"IF(LEN(Arrivée!R10007)>0,Arrivée!R10007,\"\")","v":""},{"$f":"IF(LEN(Arrivée!T10007)>0,Arrivée!T10007,\"\")","v":""},{"$f":"IF(LEN(Arrivée!W10007)>0,Arrivée!W10007,\"\")","v":""},{"$f":"IF(LEN(Arrivée!Y10007)>0,Arrivée!Y10007,\"néant\")","v":"néant"},{"$f":"IF(LEN(Arrivée!Z10007)>0,Arrivée!Z10007,\"\")","v":""},{"$f":"IF(LEN(Arrivée!AB10007)>0,Arrivée!AB10007,\"\")","v":""}]
[null,{"$f":"IF(LEN(Arrivée!Q10008)>0,Arrivée!Q10008,\"\")","v":""},{"$f":"IF(LEN(Arrivée!R10008)>0,Arrivée!R10008,\"\")","v":""},{"$f":"IF(LEN(Arrivée!T10008)>0,Arrivée!T10008,\"\")","v":""},{"$f":"IF(LEN(Arrivée!W10008)>0,Arrivée!W10008,\"\")","v":""},{"$f":"IF(LEN(Arrivée!Y10008)>0,Arrivée!Y10008,\"néant\")","v":"néant"},{"$f":"IF(LEN(Arrivée!Z10008)>0,Arrivée!Z10008,\"\")","v":""},{"$f":"IF(LEN(Arrivée!AB10008)>0,Arrivée!AB10008,\"\")","v":""}]
[null,{"$f":"IF(LEN(Arrivée!Q10009)>0,Arrivée!Q10009,\"\")","v":""},{"$f":"IF(LEN(Arrivée!R10009)>0,Arrivée!R10009,\"\")","v":""},{"$f":"IF(LEN(Arrivée!T10009)>0,Arrivée!T10009,\"\")","v":""},{"$f":"IF(LEN(Arrivée!W10009)>0,Arrivée!W10009,\"\")","v":""},{"$f":"IF(LEN(Arrivée!Y10009)>0,Arrivée!Y10009,\"néant\")","v":"néant"},{"$f":"IF(LEN(Arrivée!Z10009)>0,Arrivée!Z10009,\"\")","v":""},{"$f":"IF(LEN(Arrivée!AB10009)>0,Arrivée!AB10009,\"\")","v":""}]
[null,{"$f":"IF(LEN(Arrivée!Q10010)>0,Arrivée!Q10010,\"\")","v":""},{"$f":"IF(LEN(Arrivée!R10010)>0,Arrivée!R10010,\"\")","v":""},{"$f":"IF(LEN(Arrivée!T10010)>0,Arrivée!T10010,\"\")","v":""},{"$f":"IF(LEN(Arrivée!W10010)>0,Arrivée!W10010,\"\")","v":""},{"$f":"IF(LEN(Arrivée!Y10010)>0,Arrivée!Y10010,\"néant\")","v":"néant"},{"$f":"IF(LEN(Arrivée!Z10010)>0,Arrivée!Z10010,\"\")","v":""},{"$f":"IF(LEN(Arrivée!AB10010)>0,Arrivée!AB10010,\"\")","v":""}]
[null,{"$f":"IF(LEN(Arrivée!Q10011)>0,Arrivée!Q10011,\"\")","v":""},{"$f":"IF(LEN(Arrivée!R10011)>0,Arrivée!R10011,\"\")","v":""},{"$f":"IF(LEN(Arrivée!T10011)>0,Arrivée!T10011,\"\")","v":""},{"$f":"IF(LEN(Arrivée!W10011)>0,Arrivée!W10011,\"\")","v":""},{"$f":"IF(LEN(Arrivée!Y10011)>0,Arrivée!Y10011,\"néant\")","v":"néant"},{"$f":"IF(LEN(Arrivée!Z10011)>0,Arrivée!Z10011,\"\")","v":""},{"$f":"IF(LEN(Arrivée!AB10011)>0,Arrivée!AB10011,\"\")","v":""}]
[null,{"$f":"IF(LEN(Arrivée!Q10012)>0,Arrivée!Q10012,\"\")","v":""},{"$f":"IF(LEN(Arrivée!R10012)>0,Arrivée!R10012,\"\")","v":""},{"$f":"IF(LEN(Arrivée!T10012)>0,Arrivée!T10012,\"\")","v":""},{"$f":"IF(LEN(Arrivée!W10012)>0,Arrivée!W10012,\"\")","v":""},{"$f":"IF(LEN(Arrivée!Y10012)>0,Arrivée!Y10012,\"néant\")","v":"néant"},{"$f":"IF(LEN(Arrivée!Z10012)>0,Arrivée!Z10012,\"\")","v":""},{"$f":"IF(LEN(Arrivée!AB10012)>0,Arrivée!AB10012,\"\")","v":""}]
[null,{"$f":"IF(LEN(Arrivée!Q10013)>0,Arrivée!Q10013,\"\")","v":""},{"$f":"IF(LEN(Arrivée!R10013)>0,Arrivée!R10013,\"\")","v":""},{"$f":"IF(LEN(Arrivée!T10013)>0,Arrivée!T10013,\"\")","v":""},{"$f":"IF(LEN(Arrivée!W10013)>0,Arrivée!W10013,\"\")","v":""},{"$f":"IF(LEN(Arrivée!Y10013)>0,Arrivée!Y10013,\"néant\")","v":"néant"},{"$f":"IF(LEN(Arrivée!Z10013)>0,Arrivée!Z10013,\"\")","v":""},{"$f":"IF(LEN(Arrivée!AB10013)>0,Arrivée!AB10013,\"\")","v":""}]
[null,{"$f":"IF(LEN(Arrivée!Q10014)>0,Arrivée!Q10014,\"\")","v":""},{"$f":"IF(LEN(Arrivée!R10014)>0,Arrivée!R10014,\"\")","v":""},{"$f":"IF(LEN(Arrivée!T10014)>0,Arrivée!T10014,\"\")","v":""},{"$f":"IF(LEN(Arrivée!W10014)>0,Arrivée!W10014,\"\")","v":""},{"$f":"IF(LEN(Arrivée!Y10014)>0,Arrivée!Y10014,\"néant\")","v":"néant"},{"$f":"IF(LEN(Arrivée!Z10014)>0,Arrivée!Z10014,\"\")","v":""},{"$f":"IF(LEN(Arrivée!AB10014)>0,Arrivée!AB10014,\"\")","v":""}]
[null,{"$f":"IF(LEN(Arrivée!Q10015)>0,Arrivée!Q10015,\"\")","v":""},{"$f":"IF(LEN(Arrivée!R10015)>0,Arrivée!R10015,\"\")","v":""},{"$f":"IF(LEN(Arrivée!T10015)>0,Arrivée!T10015,\"\")","v":""},{"$f":"IF(LEN(Arrivée!W10015)>0,Arrivée!W10015,\"\")","v":""},{"$f":"IF(LEN(Arrivée!Y10015)>0,Arrivée!Y10015,\"néant\")","v":"néant"},{"$f":"IF(LEN(Arrivée!Z10015)>0,Arrivée!Z10015,\"\")","v":""},{"$f":"IF(LEN(Arrivée!AB10015)>0,Arrivée!AB10015,\"\")","v":""}]

{"sheet":"Arrivée","index":1,"n_rows":10000,"n_cols":29,"rows_kept":10000,"cut":false,"hidden":false,"merged":[]}
[{"$f":"Collectivité&\" - \"&Service & \" - Registre du courrier Arrivée\"","v":"Ville d'Excel-les-Bains - Enseignement, Réglementation et Citoyenneté - Registre du courrier Arrivée"}]
[null,null,null,{"$f":"SUBTOTAL(3,A4:A6)-1","v":1}]
[]
["Chrono","Date","Support","Objet","Type délai","Délai","Date limite de réponse","Date de réponse","Criticité","Correspondant","Adresse","Service","Observations","Délai de réponse","Lien","Chrono Réponse"]
[1,"2016-01-01","Courrier postal","Essai","Correspondance standard",{"$f":"IFERROR(VLOOKUP(E5,Délais,2,FALSE),\"\")","v":0},null,null,{"$f":"IF(F5,IF(H5>0,\"\",G5-TODAY()),\"\")","v":""},"Essai",null,"...",null,{"$f":"IF(H5,H5-B5,\"\")","v":""}]
[]
[]
[]
[]
[]
[]
[]
[]
[]
[]
[]
[]
[]
[]
[]
[]
[]
[]
[]
[]
[]
[]
[]
[]
[]
[]
[]
[]
[]
[]
[]
[]
[]
[]
[]
[]
[]
[]
[]
[]
[]
[]
[]
[]
[]
[]
[]
[]
[]
[]
[]
[]
[]
[]
[]
[]
[]
[]
[]
[]
[]
[]
[]
[]
[]
[]
[]
[]
[]
[]
[]
[]
[]
[]
[]
[]
[]
[]
[]
[]
[]
[]
[]
[]
[]
[]
[]
[]
[]
[]
[]
[]
[]
[]
[]
[]
[]
[]
[]
[]
[]
[]
[]
[]
[]
[]
[]
[]
[]
[]
[]
[]
[]
[]
[]
[]
[]
[]
[]
[]
[]
[]
[]
[]
[]
[]
[]
[]
[]
[]
[]
[]
[]
[]
[]
[]
[]
[]
[]
[]
[]
[]
[]
[]
[]
[]
[]
[]
[]
[]
[]
[]
[]
[]
[]
[]
[]
[]
[]
[]
[]
[]
[]
[]
[]
[]
[]
[]
[]
[]
[]
[]
[]
[]
[]
[]
[]
[]
[]
[]
[]
[]
[]
[]
[]
[]
[]
[]
[]
[]
[]
[]
[]
[]
[]
[]
[]
[]
[]
[]
[]
[]
[]
[]
[]
[]
[]
[]
[]
[]
[]
[]
[]
[]
[]
[]
[]
[]
[]
[]
[]
[]
[]
[]
[]
[]
[]
[]
[]
[]
[]
[]
[]
[]
[]
[]
[]
[]
[]
[]
[]
[]
[]
[]
[]
[]
[]
[]
[]
[]
[]
[]
[]
[]
[]
[]
[]
[]
[]
[]
[]
[]
[]
[]
[]
[]
[]
[]
[]
[]
[]
[]
[]
[]
[]
[]
[]
[]
[]
[]
[]
[]
[]
[]
[]
[]
[]
[]
[]
[]
[]
[]
[]
[]
[]
[]
[]
[]
[]
[]
[]
[]
[]
[]
[]
[]
[]
[]
[]
[]
[]
[]
[]
[]
[]
[]
[]
[]
[]
[]
[]
[]
[]
[]
[]
[]
[]
[]
[]
[]
[]
[]
[]
[]
[]
[]
[]
[]
[]
[]
[]
[]
[]
[]
[]
[]
[]
[]
[]
[]
[]
[]
[]
[]
[]
[]
[]
[]
[]
[]
[]
[]
[]
[]
[]
[]
[]
[]
[]
[]
[]
[]
[]
[]
[]
[]
[]
[]
[]
[]
[]
[]
[]
[]
[]
[]
[]
[]
[]
[]
[]
[]
[]
[]
[]
[]
[]
[]
[]
[]
[]
[]
[]
[]
[]
[]
[]
[]
[]
[]
[]
[]
[]
[]
[]
[]
[]
[]
[]
[]
[]
[]
[]
[]
[]
[]
[]
[]
[]
[]
[]
[]
[]
[]
[]
[]
[]
[]
[]
[]
[]
[]
[]
[]
[]
[]
[]
[]
[]
[]
[]
[]
[]
[]
[]
[]
[]
[]
[]
[]
[]
[]
[]
[]
[]
[]
[]
[]
[]
[]
[]
[]
[]
[]
[]
[]
[]
[]
[]
[]
[]
[]
[]
[]
[]
[]
[]
[]
[]
[]
[]
[]
[]
[]
[]
[]
[]
[]
[]
[]
[]
[]
[]
[]
[]
[]
[]
[]
[]
[]
[]
[]
[]
[]
[]
[]
[]
[]
[]
[]
[]
[]
[]
[]
[]
[]
[]
[]
[]
[]
[]
[]
[]
[]
[]
[]
[]
[]
[]
[]
[]
[]
[]
[]
[]
[]
[]
[]
[]
[]
[]
[]
[]
[]
[]
[]
[]
[]
[]
[]
[]
[]
[]
[]
[]
[]
[]
[]
[]
[]
[]
[]
[]
[]
[]
[]
[]
[]
[]
[]
[]
[]
[]
[]
[]
[]
[]
[]
[]
[]
[]
[]
[]
[]
[]
[]
[]
[]
[]
[]
[]
[]
[]
[]
[]
[]
[]
[]
[]
[]
[]
[]
[]
[]
[]
[]
[]
[]
[]
[]
[]
[]
[]
[]
[]
[]
[]
[]
[]
[]
[]
[]
[]
[]
[]
[]
[]
[]
[]
[]
[]
[]
[]
[]
[]
[]
[]
[]
[]
[]
[]
[]
[]
[]
[]
[]
[]
[]
[]
[]
[]
[]
[]
[]
[]
[]
[]
[]
[]
[]
[]
[]
[]
[]
[]
[]
[]
[]
[]
[]
[]
[]
[]
[]
[]
[]
[]
[]
[]
[]
[]
[]
[]
[]
[]
[]
[]
[]
[]
[]
[]
[]
[]
[]
[]
[]
[]
[]
[]
[]
[]
[]
[]
[]
[]
[]
[]
[]
[]
[]
[]
[]
[]
[]
[]
[]
[]
[]
[]
[]
[]
[]
[]
[]
[]
[]
[]
[]
[]
[]
[]
[]
[]
[]
[]
[]
[]
[]
[]
[]
[]
[]
[]
[]
[]
[]
[]
[]
[]
[]
[]
[]
[]
[]
[]
[]
[]
[]
[]
[]
[]
[]
[]
[]
[]
[]
[]
[]
[]
[]
[]
[]
[]
[]
[]
[]
[]
[]
[]
[]
[]
[]
[]
[]
[]
[]
[]
[]
[]
[]
[]
[]
[]
[]
[]
[]
[]
[]
[]
[]
[]
[]
[]
[]
[]
[]
[]
[]
[]
[]
[]
[]
[]
[]
[]
[]
[]
[]
[]
[]
[]
[]
[]
[]
[]
[]
[]
[]
[]
[]
[]
[]
[]
[]
[]
[]
[]
[]
[]
[]
[]
[]
[]
[]
[]
[]
[]
[]
[]
[]
[]
[]
[]
[]
[]
[]
[]
[]
[]
[]
[]
[]
[]
[]
[]
[]
[]
[]
[]
[]
[]
[]
[]
[]
[]
[]
[]
[]
[]
[]
[]
[]
[]
[]
[]
[]
[]
[]
[]
[]
[]
[]
[]
[]
[]
[]
[]
[]
[]
[]
[]
[]
[]
[]
[]
[]
[]
[]
[]
[]
[]
[]
[]
[]
[]
[]
[]
[]
[]
[]
[]
[]
[]
[]
[]
[]
[]
[]
[]
[]
[]
[]
[]
[]
[]
[]
[]
[]
[]
[]
[]
[]
[]
[]
[]
[]
[]
[]
[]
[]
[]
[]
[]
[]
[]
[]
[]
[]
[]
[]
[]
[]
[]
[]
[]
[]
[]
[]
[]
[]
[]
[]
[]
[]
[]
[]
[]
[]
[]
[]
[]
[]
[]
[]
[]
[]
[]
[]
[]
[]
[]
[]
[]
[]
[]
[]
[]
[]
[]
[]
[]
[]
[]
[]
[]
[]
[]
[]
[]
[]
[]
[]
[]
[]
[]
[]
[]
[]
[]
[]
[]
[]
[]
[]
[]
[]
[]
[]
[]
[]
[]
[]
[]
[]
[]
[]
[]
[]
[]
[]
[]
[]
[]
[]
[]
[]
[]
[]
[]
[]
[]
[]
[]
[]
[]
[]
[]
[]
[]
[]
[]
[]
[]
[]
[]
[]
[]
[]
[]
[]
[]
[]
[]
[]
[]
[]
[]
[]
[]
[]
[]
[]
[]
[]
[]
[]
[]
[]
[]
[]
[]
[]
[]
[]
[]
[]
[]
[]
[]
[]
[]
[]
[]
[]
[]
[]
[]
[]
[]
[]
[]
[]
[]
[]
[]
[]
[]
[]
[]
[]
[]
[]
[]
[]
[]
[]
[]
[]
[]
[]
[]
[]
[]
[]
[]
[]
[]
[]
[]
[]
[]
[]
[]
[]
[]
[]
[]
[]
[]
[]
[]
[]
[]
[]
[]
[]
[]
[]
[]
[]
[]
[]
[]
[]
[]
[]
[]
[]
[]
[]
[]
[]
[]
[]
[]
[]
[]
[]
[]
[]
[]
[]
[]
[]
[]
[]
[]
[]
[]
[]
[]
[]
[]
[]
[]
[]
[]
[]
[]
[]
[]
[]
[]
[]
[]
[]
[]
[]
[]
[]
[]
[]
[]
[]
[]
[]
[]
[]
[]
[]
[]
[]
[]
[]
[]
[]
[]
[]
[]
[]
[]
[]
[]
[]
[]
[]
[]
[]
[]
[]
[]
[]
[]
[]
[]
[]
[]
[]
[]
[]
[]
[]
[]
[]
[]
[]
[]
[]
[]
[]
[]
[]
[]
[]
[]
[]
[]
[]
[]
[]
[]
[]
[]
[]
[]
[]
[]
[]
[]
[]
[]
[]
[]
[]
[]
[]
[]
[]
[]
[]
[]
[]
[]
[]
[]
[]
[]
[]
[]
[]
[]
[]
[]
[]
[]
[]
[]
[]
[]
[]
[]
[]
[]
[]
[]
[]
[]
[]
[]
[]
[]
[]
[]
[]
[]
[]
[]
[]
[]
[]
[]
[]
[]
[]
[]
[]
[]
[]
[]
[]
[]
[]
[]
[]
[]
[]
[]
[]
[]
[]
[]
[]
[]
[]
[]
[]
[]
[]
[]
[]
[]
[]
[]
[]
[]
[]
[]
[]
[]
[]
[]
[]
[]
[]
[]
[]
[]
[]
[]
[]
[]
[]
[]
[]
[]
[]
[]
[]
[]
[]
[]
[]
[]
[]
[]
[]
[]
[]
[]
[]
[]
[]
[]
[]
[]
[]
[]
[]
[]
[]
[]
[]
[]
[]
[]
[]
[]
[]
[]
[]
[]
[]
[]
[]
[]
[]
[]
[]
[]
[]
[]
[]
[]
[]
[]
[]
[]
[]
[]
[]
[]
[]
[]
[]
[]
[]
[]
[]
[]
[]
[]
[]
[]
[]
[]
[]
[]
[]
[]
[]
[]
[]
[]
[]
[]
[]
[]
[]
[]
[]
[]
[]
[]
[]
[]
[]
[]
[]
[]
[]
[]
[]
[]
[]
[]
[]
[]
[]
[]
[]
[]
[]
[]
[]
[]
[]
[]
[]
[]
[]
[]
[]
[]
[]
[]
[]
[]
[]
[]
[]
[]
[]
[]
[]
[]
[]
[]
[]
[]
[]
[]
[]
[]
[]
[]
[]
[]
[]
[]
[]
[]
[]
[]
[]
[]
[]
[]
[]
[]
[]
[]
[]
[]
[]
[]
[]
[]
[]
[]
[]
[]
[]
[]
[]
[]
[]
[]
[]
[]
[]
[]
[]
[]
[]
[]
[]
[]
[]
[]
[]
[]
[]
[]
[]
[]
[]
[]
[]
[]
[]
[]
[]
[]
[]
[]
[]
[]
[]
[]
[]
[]
[]
[]
[]
[]
[]
[]
[]
[]
[]
[]
[]
[]
[]
[]
[]
[]
[]
[]
[]
[]
[]
[]
[]
[]
[]
[]
[]
[]
[]
[]
[]
[]
[]
[]
[]
[]
[]
[]
[]
[]
[]
[]
[]
[]
[]
[]
[]
[]
[]
[]
[]
[]
[]
[]
[]
[]
[]
[]
[]
[]
[]
[]
[]
[]
[]
[]
[]
[]
[]
[]
[]
[]
[]
[]
[]
[]
[]
[]
[]
[]
[]
[]
[]
[]
[]
[]
[]
[]
[]
[]
[]
[]
[]
[]
[]
[]
[]
[]
[]
[]
[]
[]
[]
[]
[]
[]
[]
[]
[]
[]
[]
[]
[]
[]
[]
[]
[]
[]
[]
[]
[]
[]
[]
[]
[]
[]
[]
[]
[]
[]
[]
[]
[]
[]
[]
[]
[]
[]
[]
[]
[]
[]
[]
[]
[]
[]
[]
[]
[]
[]
[]
[]
[]
[]
[]
[]
[]
[]
[]
[]
[]
[]
[]
[]
[]
[]
[]
[]
[]
[]
[]
[]
[]
[]
[]
[]
[]
[]
[]
[]
[]
[]
[]
[]
[]
[]
[]
[]
[]
[]
[]
[]
[]
[]
[]
[]
[]
[]
[]
[]
[]
[]
[]
[]
[]
[]
[]
[]
[]
[]
[]
[]
[]
[]
[]
[]
[]
[]
[]
[]
[]
[]
[]
[]
[]
[]
[]
[]
[]
[]
[]
[]
[]
[]
[]
[]
[]
[]
[]
[]
[]
[]
[]
[]
[]
[]
[]
[]
[]
[]
[]
[]
[]
[]
[]
[]
[]
[]
[]
[]
[]
[]
[]
[]
[]
[]
[]
[]
[]
[]
[]
[]
[]
[]
[]
[]
[]
[]
[]
[]
[]
[]
[]
[]
[]
[]
[]
[]
[]
[]
[]
[]
[]
[]
[]
[]
[]
[]
[]
[]
[]
[]
[]
[]
[]
[]
[]
[]
[]
[]
[]
[]
[]
[]
[]
[]
[]
[]
[]
[]
[]
[]
[]
[]
[]
[]
[]
[]
[]
[]
[]
[]
[]
[]
[]
[]
[]
[]
[]
[]
[]
[]
[]
[]
[]
[]
[]
[]
[]
[]
[]
[]
[]
[]
[]
[]
[]
[]
[]
[]
[]
[]
[]
[]
[]
[]
[]
[]
[]
[]
[]
[]
[]
[]
[]
[]
[]
[]
[]
[]
[]
[]
[]
[]
[]
[]
[]
[]
[]
[]
[]
[]
[]
[]
[]
[]
[]
[]
[]
[]
[]
[]
[]
[]
[]
[]
[]
[]
[]
[]
[]
[]
[]
[]
[]
[]
[]
[]
[]
[]
[]
[]
[]
[]
[]
[]
[]
[]
[]
[]
[]
[]
[]
[]
[]
[]
[]
[]
[]
[]
[]
[]
[]
[]
[]
[]
[]
[]
[]
[]
[]
[]
[]
[]
[]
[]
[]
[]
[]
[]
[]
[]
[]
[]
[]
[]
[]
[]
[]
[]
[]
[]
[]
[]
[]
[]
[]
[]
[]
[]
[]
[]
[]
[]
[]
[]
[]
[]
[]
[]
[]
[]
[]
[]
[]
[]
[]
[]
[]
[]
[]
[]
[]
[]
[]
[]
[]
[]
[]
[]
[]
[]
[]
[]
[]
[]
[]
[]
[]
[]
[]
[]
[]
[]
[]
[]
[]
[]
[]
[]
[]
[]
[]
[]
[]
[]
[]
[]
[]
[]
[]
[]
[]
[]
[]
[]
[]
[]
[]
[]
[]
[]
[]
[]
[]
[]
[]
[]
[]
[]
[]
[]
[]
[]
[]
[]
[]
[]
[]
[]
[]
[]
[]
[]
[]
[]
[]
[]
[]
[]
[]
[]
[]
[]
[]
[]
[]
[]
[]
[]
[]
[]
[]
[]
[]
[]
[]
[]
[]
[]
[]
[]
[]
[]
[]
[]
[]
[]
[]
[]
[]
[]
[]
[]
[]
[]
[]
[]
[]
[]
[]
[]
[]
[]
[]
[]
[]
[]
[]
[]
[]
[]
[]
[]
[]
[]
[]
[]
[]
[]
[]
[]
[]
[]
[]
[]
[]
[]
[]
[]
[]
[]
[]
[]
[]
[]
[]
[]
[]
[]
[]
[]
[]
[]
[]
[]
[]
[]
[]
[]
[]
[]
[]
[]
[]
[]
[]
[]
[]
[]
[]
[]
[]
[]
[]
[]
[]
[]
[]
[]
[]
[]
[]
[]
[]
[]
[]
[]
[]
[]
[]
[]
[]
[]
[]
[]
[]
[]
[]
[]
[]
[]
[]
[]
[]
[]
[]
[]
[]
[]
[]
[]
[]
[]
[]
[]
[]
[]
[]
[]
[]
[]
[]
[]
[]
[]
[]
[]
[]
[]
[]
[]
[]
[]
[]
[]
[]
[]
[]
[]
[]
[]
[]
[]
[]
[]
[]
[]
[]
[]
[]
[]
[]
[]
[]
[]
[]
[]
[]
[]
[]
[]
[]
[]
[]
[]
[]
[]
[]
[]
[]
[]
[]
[]
[]
[]
[]
[]
[]
[]
[]
[]
[]
[]
[]
[]
[]
[]
[]
[]
[]
[]
[]
[]
[]
[]
[]
[]
[]
[]
[]
[]
[]
[]
[]
[]
[]
[]
[]
[]
[]
[]
[]
[]
[]
[]
[]
[]
[]
[]
[]
[]
[]
[]
[]
[]
[]
[]
[]
[]
[]
[]
[]
[]
[]
[]
[]
[]
[]
[]
[]
[]
[]
[]
[]
[]
[]
[]
[]
[]
[]
[]
[]
[]
[]
[]
[]
[]
[]
[]
[]
[]
[]
[]
[]
[]
[]
[]
[]
[]
[]
[]
[]
[]
[]
[]
[]
[]
[]
[]
[]
[]
[]
[]
[]
[]
[]
[]
[]
[]
[]
[]
[]
[]
[]
[]
[]
[]
[]
[]
[]
[]
[]
[]
[]
[]
[]
[]
[]
[]
[]
[]
[]
[]
[]
[]
[]
[]
[]
[]
[]
[]
[]
[]
[]
[]
[]
[]
[]
[]
[]
[]
[]
[]
[]
[]
[]
[]
[]
[]
[]
[]
[]
[]
[]
[]
[]
[]
[]
[]
[]
[]
[]
[]
[]
[]
[]
[]
[]
[]
[]
[]
[]
[]
[]
[]
[]
[]
[]
[]
[]
[]
[]
[]
[]
[]
[]
[]
[]
[]
[]
[]
[]
[]
[]
[]
[]
[]
[]
[]
[]
[]
[]
[]
[]
[]
[]
[]
[]
[]
[]
[]
[]
[]
[]
[]
[]
[]
[]
[]
[]
[]
[]
[]
[]
[]
[]
[]
[]
[]
[]
[]
[]
[]
[]
[]
[]
[]
[]
[]
[]
[]
[]
[]
[]
[]
[]
[]
[]
[]
[]
[]
[]
[]
[]
[]
[]
[]
[]
[]
[]
[]
[]
[]
[]
[]
[]
[]
[]
[]
[]
[]
[]
[]
[]
[]
[]
[]
[]
[]
[]
[]
[]
[]
[]
[]
[]
[]
[]
[]
[]
[]
[]
[]
[]
[]
[]
[]
[]
[]
[]
[]
[]
[]
[]
[]
[]
[]
[]
[]
[]
[]
[]
[]
[]
[]
[]
[]
[]
[]
[]
[]
[]
[]
[]
[]
[]
[]
[]
[]
[]
[]
[]
[]
[]
[]
[]
[]
[]
[]
[]
[]
[]
[]
[]
[]
[]
[]
[]
[]
[]
[]
[]
[]
[]
[]
[]
[]
[]
[]
[]
[]
[]
[]
[]
[]
[]
[]
[]
[]
[]
[]
[]
[]
[]
[]
[]
[]
[]
[]
[]
[]
[]
[]
[]
[]
[]
[]
[]
[]
[]
[]
[]
[]
[]
[]
[]
[]
[]
[]
[]
[]
[]
[]
[]
[]
[]
[]
[]
[]
[]
[]
[]
[]
[]
[]
[]
[]
[]
[]
[]
[]
[]
[]
[]
[]
[]
[]
[]
[]
[]
[]
[]
[]
[]
[]
[]
[]
[]
[]
[]
[]
[]
[]
[]
[]
[]
[]
[]
[]
[]
[]
[]
[]
[]
[]
[]
[]
[]
[]
[]
[]
[]
[]
[]
[]
[]
[]
[]
[]
[]
[]
[]
[]
[]
[]
[]
[]
[]
[]
[]
[]
[]
[]
[]
[]
[]
[]
[]
[]
[]
[]
[]
[]
[]
[]
[]
[]
[]
[]
[]
[]
[]
[]
[]
[]
[]
[]
[]
[]
[]
[]
[]
[]
[]
[]
[]
[]
[]
[]
[]
[]
[]
[]
[]
[]
[]
[]
[]
[]
[]
[]
[]
[]
[]
[]
[]
[]
[]
[]
[]
[]
[]
[]
[]
[]
[]
[]
[]
[]
[]
[]
[]
[]
[]
[]
[]
[]
[]
[]
[]
[]
[]
[]
[]
[]
[]
[]
[]
[]
[]
[]
[]
[]
[]
[]
[]
[]
[]
[]
[]
[]
[]
[]
[]
[]
[]
[]
[]
[]
[]
[]
[]
[]
[]
[]
[]
[]
[]
[]
[]
[]
[]
[]
[]
[]
[]
[]
[]
[]
[]
[]
[]
[]
[]
[]
[]
[]
[]
[]
[]
[]
[]
[]
[]
[]
[]
[]
[]
[]
[]
[]
[]
[]
[]
[]
[]
[]
[]
[]
[]
[]
[]
[]
[]
[]
[]
[]
[]
[]
[]
[]
[]
[]
[]
[]
[]
[]
[]
[]
[]
[]
[]
[]
[]
[]
[]
[]
[]
[]
[]
[]
[]
[]
[]
[]
[]
[]
[]
[]
[]
[]
[]
[]
[]
[]
[]
[]
[]
[]
[]
[]
[]
[]
[]
[]
[]
[]
[]
[]
[]
[]
[]
[]
[]
[]
[]
[]
[]
[]
[]
[]
[]
[]
[]
[]
[]
[]
[]
[]
[]
[]
[]
[]
[]
[]
[]
[]
[]
[]
[]
[]
[]
[]
[]
[]
[]
[]
[]
[]
[]
[]
[]
[]
[]
[]
[]
[]
[]
[]
[]
[]
[]
[]
[]
[]
[]
[]
[]
[]
[]
[]
[]
[]
[]
[]
[]
[]
[]
[]
[]
[]
[]
[]
[]
[]
[]
[]
[]
[]
[]
[]
[]
[]
[]
[]
[]
[]
[]
[]
[]
[]
[]
[]
[]
[]
[]
[]
[]
[]
[]
[]
[]
[]
[]
[]
[]
[]
[]
[]
[]
[]
[]
[]
[]
[]
[]
[]
[]
[]
[]
[]
[]
[]
[]
[]
[]
[]
[]
[]
[]
[]
[]
[]
[]
[]
[]
[]
[]
[]
[]
[]
[]
[]
[]
[]
[]
[]
[]
[]
[]
[]
[]
[]
[]
[]
[]
[]
[]
[]
[]
[]
[]
[]
[]
[]
[]
[]
[]
[]
[]
[]
[]
[]
[]
[]
[]
[]
[]
[]
[]
[]
[]
[]
[]
[]
[]
[]
[]
[]
[]
[]
[]
[]
[]
[]
[]
[]
[]
[]
[]
[]
[]
[]
[]
[]
[]
[]
[]
[]
[]
[]
[]
[]
[]
[]
[]
[]
[]
[]
[]
[]
[]
[]
[]
[]
[]
[]
[]
[]
[]
[]
[]
[]
[]
[]
[]
[]
[]
[]
[]
[]
[]
[]
[]
[]
[]
[]
[]
[]
[]
[]
[]
[]
[]
[]
[]
[]
[]
[]
[]
[]
[]
[]
[]
[]
[]
[]
[]
[]
[]
[]
[]
[]
[]
[]
[]
[]
[]
[]
[]
[]
[]
[]
[]
[]
[]
[]
[]
[]
[]
[]
[]
[]
[]
[]
[]
[]
[]
[]
[]
[]
[]
[]
[]
[]
[]
[]
[]
[]
[]
[]
[]
[]
[]
[]
[]
[]
[]
[]
[]
[]
[]
[]
[]
[]
[]
[]
[]
[]
[]
[]
[]
[]
[]
[]
[]
[]
[]
[]
[]
[]
[]
[]
[]
[]
[]
[]
[]
[]
[]
[]
[]
[]
[]
[]
[]
[]
[]
[]
[]
[]
[]
[]
[]
[]
[]
[]
[]
[]
[]
[]
[]
[]
[]
[]
[]
[]
[]
[]
[]
[]
[]
[]
[]
[]
[]
[]
[]
[]
[]
[]
[]
[]
[]
[]
[]
[]
[]
[]
[]
[]
[]
[]
[]
[]
[]
[]
[]
[]
[]
[]
[]
[]
[]
[]
[]
[]
[]
[]
[]
[]
[]
[]
[]
[]
[]
[]
[]
[]
[]
[]
[]
[]
[]
[]
[]
[]
[]
[]
[]
[]
[]
[]
[]
[]
[]
[]
[]
[]
[]
[]
[]
[]
[]
[]
[]
[]
[]
[]
[]
[]
[]
[]
[]
[]
[]
[]
[]
[]
[]
[]
[]
[]
[]
[]
[]
[]
[]
[]
[]
[]
[]
[]
[]
[]
[]
[]
[]
[]
[]
[]
[]
[]
[]
[]
[]
[]
[]
[]
[]
[]
[]
[]
[]
[]
[]
[]
[]
[]
[]
[]
[]
[]
[]
[]
[]
[]
[]
[]
[]
[]
[]
[]
[]
[]
[]
[]
[]
[]
[]
[]
[]
[]
[]
[]
[]
[]
[]
[]
[]
[]
[]
[]
[]
[]
[]
[]
[]
[]
[]
[]
[]
[]
[]
[]
[]
[]
[]
[]
[]
[]
[]
[]
[]
[]
[]
[]
[]
[]
[]
[]
[]
[]
[]
[]
[]
[]
[]
[]
[]
[]
[]
[]
[]
[]
[]
[]
[]
[]
[]
[]
[]
[]
[]
[]
[]
[]
[]
[]
[]
[]
[]
[]
[]
[]
[]
[]
[]
[]
[]
[]
[]
[]
[]
[]
[]
[]
[]
[]
[]
[]
[]
[]
[]
[]
[]
[]
[]
[]
[]
[]
[]
[]
[]
[]
[]
[]
[]
[]
[]
[]
[]
[]
[]
[]
[]
[]
[]
[]
[]
[]
[]
[]
[]
[]
[]
[]
[]
[]
[]
[]
[]
[]
[]
[]
[]
[]
[]
[]
[]
[]
[]
[]
[]
[]
[]
[]
[]
[]
[]
[]
[]
[]
[]
[]
[]
[]
[]
[]
[]
[]
[]
[]
[]
[]
[]
[]
[]
[]
[]
[]
[]
[]
[]
[]
[]
[]
[]
[]
[]
[]
[]
[]
[]
[]
[]
[]
[]
[]
[]
[]
[]
[]
[]
[]
[]
[]
[]
[]
[]
[]
[]
[]
[]
[]
[]
[]
[]
[]
[]
[]
[]
[]
[]
[]
[]
[]
[]
[]
[]
[]
[]
[]
[]
[]
[]
[]
[]
[]
[]
[]
[]
[]
[]
[]
[]
[]
[]
[]
[]
[]
[]
[]
[]
[]
[]
[]
[]
[]
[]
[]
[]
[]
[]
[]
[]
[]
[]
[]
[]
[]
[]
[]
[]
[]
[]
[]
[]
[]
[]
[]
[]
[]
[]
[]
[]
[]
[]
[]
[]
[]
[]
[]
[]
[]
[]
[]
[]
[]
[]
[]
[]
[]
[]
[]
[]
[]
[]
[]
[]
[]
[]
[]
[]
[]
[]
[]
[]
[]
[]
[]
[]
[]
[]
[]
[]
[]
[]
[]
[]
[]
[]
[]
[]
[]
[]
[]
[]
[]
[]
[]
[]
[]
[]
[]
[]
[]
[]
[]
[]
[]
[]
[]
[]
[]
[]
[]
[]
[]
[]
[]
[]
[]
[]
[]
[]
[]
[]
[]
[]
[]
[]
[]
[]
[]
[]
[]
[]
[]
[]
[]
[]
[]
[]
[]
[]
[]
[]
[]
[]
[]
[]
[]
[]
[]
[]
[]
[]
[]
[]
[]
[]
[]
[]
[]
[]
[]
[]
[]
[]
[]
[]
[]
[]
[]
[]
[]
[]
[]
[]
[]
[]
[]
[]
[]
[]
[]
[]
[]
[]
[]
[]
[]
[]
[]
[]
[]
[]
[]
[]
[]
[]
[]
[]
[]
[]
[]
[]
[]
[]
[]
[]
[]
[]
[]
[]
[]
[]
[]
[]
[]
[]
[]
[]
[]
[]
[]
[]
[]
[]
[]
[]
[]
[]
[]
[]
[]
[]
[]
[]
[]
[]
[]
[]
[]
[]
[]
[]
[]
[]
[]
[]
[]
[]
[]
[]
[]
[]
[]
[]
[]
[]
[]
[]
[]
[]
[]
[]
[]
[]
[]
[]
[]
[]
[]
[]
[]
[]
[]
[]
[]
[]
[]
[]
[]
[]
[]
[]
[]
[]
[]
[]
[]
[]
[]
[]
[]
[]
[]
[]
[]
[]
[]
[]
[]
[]
[]
[]
[]
[]
[]
[]
[]
[]
[]
[]
[]
[]
[]
[]
[]
[]
[]
[]
[]
[]
[]
[]
[]
[]
[]
[]
[]
[]
[]
[]
[]
[]
[]
[]
[]
[]
[]
[]
[]
[]
[]
[]
[]
[]
[]
[]
[]
[]
[]
[]
[]
[]
[]
[]
[]
[]
[]
[]
[]
[]
[]
[]
[]
[]
[]
[]
[]
[]
[]
[]
[]
[]
[]
[]
[]
[]
[]
[]
[]
[]
[]
[]
[]
[]
[]
[]
[]
[]
[]
[]
[]
[]
[]
[]
[]
[]
[]
[]
[]
[]
[]
[]
[]
[]
[]
[]
[]
[]
[]
[]
[]
[]
[]
[]
[]
[]
[]
[]
[]
[]
[]
[]
[]
[]
[]
[]
[]
[]
[]
[]
[]
[]
[]
[]
[]
[]
[]
[]
[]
[]
[]
[]
[]
[]
[]
[]
[]
[]
[]
[]
[]
[]
[]
[]
[]
[]
[]
[]
[]
[]
[]
[]
[]
[]
[]
[]
[]
[]
[]
[]
[]
[]
[]
[]
[]
[]
[]
[]
[]
[]
[]
[]
[]
[]
[]
[]
[]
[]
[]
[]
[]
[]
[]
[]
[]
[]
[]
[]
[]
[]
[]
[]
[]
[]
[]
[]
[]
[]
[]
[]
[]
[]
[]
[]
[]
[]
[]
[]
[]
[]
[]
[]
[]
[]
[]
[]
[]
[]
[]
[]
[]
[]
[]
[]
[]
[]
[]
[]
[]
[]
[]
[]
[]
[]
[]
[]
[]
[]
[]
[]
[]
[]
[]
[]
[]
[]
[]
[]
[]
[]
[]
[]
[]
[]
[]
[]
[]
[]
[]
[]
[]
[]
[]
[]
[]
[]
[]
[]
[]
[]
[]
[]
[]
[]
[]
[]
[]
[]
[]
[]
[]
[]
[]
[]
[]
[]
[]
[]
[]
[]
[]
[]
[]
[]
[]
[]
[]
[]
[]
[]
[]
[]
[]
[]
[]
[]
[]
[]
[]
[]
[]
[]
[]
[]
[]
[]
[]
[]
[]
[]
[]
[]
[]
[]
[]
[]
[]
[]
[]
[]
[]
[]
[]
[]
[]
[]
[]
[]
[]
[]
[]
[]
[]
[]
[]
[]
[]
[]
[]
[]
[]
[]
[]
[]
[]
[]
[]
[]
[]
[]
[]
[]
[]
[]
[]
[]
[]
[]
[]
[]
[]
[]
[]
[]
[]
[]
[]
[]
[]
[]
[]
[]
[]
[]
[]
[]
[]
[]
[]
[]
[]
[]
[]
[]
[]
[]
[]
[]
[]
[]
[]
[]
[]
[]
[]
[]
[]
[]
[]
[]
[]
[]
[]
[]
[]
[]
[]
[]
[]
[]
[]
[]
[]
[]
[]
[]
[]
[]
[]
[]
[]
[]
[]
[]
[]
[]
[]
[]
[]
[]
[]
[]
[]
[]
[]
[]
[]
[]
[]
[]
[]
[]
[]
[]
[]
[]
[]
[]
[]
[]
[]
[]
[]
[]
[]
[]
[]
[]
[]
[]
[]
[]
[]
[]
[]
[]
[]
[]
[]
[]
[]
[]
[]
[]
[]
[]
[]
[]
[]
[]
[]
[]
[]
[]
[]
[]
[]
[]
[]
[]
[]
[]
[]
[]
[]
[]
[]
[]
[]
[]
[]
[]
[]
[]
[]
[]
[]
[]
[]
[]
[]
[]
[]
[]
[]
[]
[]
[]
[]
[]
[]
[]
[]
[]
[]
[]
[]
[]
[]
[]
[]
[]
[]
[]
[]
[]
[]
[]
[]
[]
[]
[]
[]
[]
[]
[]
[]
[]
[]
[]
[]
[]
[]
[]
[]
[]
[]
[]
[]
[]
[]
[]
[]
[]
[]
[]
[]
[]
[]
[]
[]
[]
[]
[]
[]
[]
[]
[]
[]
[]
[]
[]
[]
[]
[]
[]
[]
[]
[]
[]
[]
[]
[]
[]
[]
[]
[]
[]
[]
[]
[]
[]
[]
[]
[]
[]
[]
[]
[]
[]
[]
[]
[]
[]
[]
[]
[]
[]
[]
[]
[]
[]
[]
[]
[]
[]
[]
[]
[]
[]
[]
[]
[]
[]
[]
[]
[]
[]
[]
[]
[]
[]
[]
[]
[]
[]
[]
[]
[]
[]
[]
[]
[]
[]
[]
[]
[]
[]
[]
[]
[]
[]
[]
[]
[]
[]
[]
[]
[]
[]
[]
[]
[]
[]
[]
[]
[]
[]
[]
[]
[]
[]
[]
[]
[]
[]
[]
[]
[]
[]
[]
[]
[]
[]
[]
[]
[]
[]
[]
[]
[]
[]
[]
[]
[]
[]
[]
[]
[]
[]
[]
[]
[]
[]
[]
[]
[]
[]
[]
[]
[]
[]
[]
[]
[]
[]
[]
[]
[]
[]
[]
[]
[]
[]
[]
[]
[]
[]
[]
[]
[]
[]
[]
[]
[]
[]
[]
[]
[]
[]
[]
[]
[]
[]
[]
[]
[]
[]
[]
[]
[]
[]
[]
[]
[]
[]
[]
[]
[]
[]
[]
[]
[]
[]
[]
[]
[]
[]
[]
[]
[]
[]
[]
[]
[]
[]
[]
[]
[]
[]
[]
[]
[]
[]
[]
[]
[]
[]
[]
[]
[]
[]
[]
[]
[]
[]
[]
[]
[]
[]
[]
[]
[]
[]
[]
[]
[]
[]
[]
[]
[]
[]
[]
[]
[]
[]
[]
[]
[]
[]
[]
[]
[]
[]
[]
[]
[]
[]
[]
[]
[]
[]
[]
[]
[]
[]
[]
[]
[]
[]
[]
[]
[]
[]
[]
[]
[]
[]
[]
[]
[]
[]
[]
[]
[]
[]
[]
[]
[]
[]
[]
[]
[]
[]
[]
[]
[]
[]
[]
[]
[]
[]
[]
[]
[]
[]
[]
[]
[]
[]
[]
[]
[]
[]
[]
[]
[]
[]
[]
[]
[]
[]
[]
[]
[]
[]
[]
[]
[]
[]
[]
[]
[]
[]
[]
[]
[]
[]
[]
[]
[]
[]
[]
[]
[]
[]
[]
[]
[]
[]
[]
[]
[]
[]
[]
[]
[]
[]
[]
[]
[]
[]
[]
[]
[]
[]
[]
[]
[]
[]
[]
[]
[]
[]
[]
[]
[]
[]
[]
[]
[]
[]
[]
[]
[]
[]
[]
[]
[]
[]
[]
[]
[]
[]
[]
[]
[]
[]
[]
[]
[]
[]
[]
[]
[]
[]
[]
[]
[]
[]
[]
[]
[]
[]
[]
[]
[]
[]
[]
[]
[]
[]
[]
[]
[]
[]
[]
[]
[]
[]
[]
[]
[]
[]
[]
[]
[]
[]
[]
[]
[]
[]
[]
[]
[]
[]
[]
[]
[]
[]
[]
[]
[]
[]
[]
[]
[]
[]
[]
[]
[]
[]
[]
[]
[]
[]
[]
[]
[]
[]
[]
[]
[]
[]
[]
[]
[]
[]
[]
[]
[]
[]
[]
[]
[]
[]
[]
[]
[]
[]
[]
[]
[]
[]
[]
[]
[]
[]
[]
[]
[]
[]
[]
[]
[]
[]
[]
[]
[]
[]
[]
[]
[]
[]
[]
[]
[]
[]
[]
[]
[]
[]
[]
[]
[]
[]
[]
[]
[]
[]
[]
[]
[]
[]
[]
[]
[]
[]
[]
[]
[]
[]
[]
[]
[]
[]
[]
[]
[]
[]
[]
[]
[]
[]
[]
[]
[]
[]
[]
[]
[]
[]
[]
[]
[]
[]
[]
[]
[]
[]
[]
[]
[]
[]
[]
[]
[]
[]
[]
[]
[]
[]
[]
[]
[]
[]
[]
[]
[]
[]
[]
[]
[]
[]
[]
[]
[]
[]
[]
[]
[]
[]
[]
[]
[]
[]
[]
[]
[]
[]
[]
[]
[]
[]
[]
[]
[]
[]
[]
[]
[]
[]
[]
[]
[]
[]
[]
[]
[]
[]
[]
[]
[]
[]
[]
[]
[]
[]
[]
[]
[]
[]
[]
[]
[]
[]
[]
[]
[]
[]
[]
[]
[]
[]
[]
[]
[]
[]
[]
[]
[]
[]
[]
[]
[]
[]
[]
[]
[]
[]
[]
[]
[]
[]
[]
[]
[]
[]
[]
[]
[]
[]
[]
[]
[]
[]
[]
[]
[]
[]
[]
[]
[]
[]
[]
[]
[]
[]
[]
[]
[]
[]
[]
[]
[]
[]
[]
[]
[]
[]
[]
[]
[]
[]
[]
[]
[]
[]
[]
[]
[]
[]
[]
[]
[]
[]
[]
[]
[]
[]
[]
[]
[]
[]
[]
[]
[]
[]
[]
[]
[]
[]
[]
[]
[]
[]
[]
[]
[]
[]
[]
[]
[]
[]
[]
[]
[]
[]
[]
[]
[]
[]
[]
[]
[]
[]
[]
[]
[]
[]
[]
[]
[]
[]
[]
[]
[]
[]
[]
[]
[]
[]
[]
[]
[]
[]
[]
[]
[]
[]
[]
[]
[]
[]
[]
[]
[]
[]
[]
[]
[]
[]
[]
[]
[]
[]
[]
[]
[]
[]
[]
[]
[]
[]
[]
[]
[]
[]
[]
[]
[]
[]
[]
[]
[]
[]
[]
[]
[]
[]
[]
[]
[]
[]
[]
[]
[]
[]
[]
[]
[]
[]
[]
[]
[]
[]
[]
[]
[]
[]
[]
[]
[]
[]
[]
[]
[]
[]
[]
[]
[]
[]
[]
[]
[]
[]
[]
[]
[]
[]
[]
[]
[]
[]
[]
[]
[]
[]
[]
[]
[]
[]
[]
[]
[]
[]
[]
[]
[]
[]
[]
[]
[]
[]
[]
[]
[]
[]
[]
[]
[]
[]
[]
[]
[]
[]
[]
[]
[]
[]
[]
[]
[]
[]
[]
[]
[]
[]
[]
[]
[]
[]
[]
[]
[]
[]
[]
[]
[]
[]
[]
[]
[]
[]
[]
[]
[]
[]
[]
[]
[]
[]
[]
[]
[]
[]
[]
[]
[]
[]
[]
[]
[]
[]
[]
[]
[]
[]
[]
[]
[]
[]
[]
[]
[]
[]
[]
[]
[]
[]
[]
[]
[]
[]
[]
[]
[]
[]
[]
[]
[]
[]
[]
[]
[]
[]
[]
[]
[]
[]
[]
[]
[]
[]
[]
[]
[]
[]
[]
[]
[]
[]
[]
[]
[]
[]
[]
[]
[]
[]
[]
[]
[]
[]
[]
[]
[]
[]
[]
[]
[]
[]
[]
[]
[]
[]
[]
[]
[]
[]
[]
[]
[]
[]
[]
[]
[]
[]
[]
[]
[]
[]
[]
[]
[]
[]
[]
[]
[]
[]
[]
[]
[]
[]
[]
[]
[]
[]
[]
[]
[]
[]
[]
[]
[]
[]
[]
[]
[]
[]
[]
[]
[]
[]
[]
[]
[]
[]
[]
[]
[]
[]
[]
[]
[]
[]
[]
[]
[]
[]
[]
[]
[]
[]
[]
[]
[]
[]
[]
[]
[]
[]
[]
[]
[]
[]
[]
[]
[]
[]
[]
[]
[]
[]
[]
[]
[]
[]
[]
[]
[]
[]
[]
[]
[]
[]
[]
[]
[]
[]
[]
[]
[]
[]
[]
[]
[]
[]
[]
[]
[]
[]
[]
[]
[]
[]
[]
[]
[]
[]
[]
[]
[]
[]
[]
[]
[]
[]
[]
[]
[]
[]
[]
[]
[]
[]
[]
[]
[]
[]
[]
[]
[]
[]
[]
[]
[]
[]
[]
[]
[]
[]
[]
[]
[]
[]
[]
[]
[]
[]
[]
[]
[]
[]
[]
[]
[]
[]
[]
[]
[]
[]
[]
[]
[]
[]
[]
[]
[]
[]
[]
[]
[]
[]
[]
[]
[]
[]
[]
[]
[]
[]
[]
[]
[]
[]
[]
[]
[]
[]
[]
[]
[]
[]
[]
[]
[]
[]
[]
[]
[]
[]
[]
[]
[]
[]
[]
[]
[]
[]
[]
[]
[]
[]
[]
[]
[]
[]
[]
[]
[]
[]
[]
[]
[]
[]
[]
[]
[]
[]
[]
[]
[]
[]
[]
[]
[]
[]
[]
[]
[]
[]
[]
[]
[]
[]
[]
[]
[]
[]
[]
[]
[]
[]
[]
[]
[]
[]
[]
[]
[]
[]
[]
[]
[]
[]
[]
[]
[]
[]
[]
[]
[]
[]
[]
[]
[]
[]
[]
[]
[]
[]
[]
[]
[]
[]
[]
[]
[]
[]
[]
[]
[]
[]
[]
[]
[]
[]
[]
[]
[]
[]
[]
[]
[]
[]
[]
[]
[]
[]
[]
[]
[]
[]
[]
[]
[]
[]
[]
[]
[]
[]
[]
[]
[]
[]
[]
[]
[]
[]
[]
[]
[]
[]
[]
[]
[]
[]
[]
[]
[]
[]
[]
[]
[]
[]
[]
[]
[]
[]
[]
[]
[]
[]
[]
[]
[]
[]
[]
[]
[]
[]
[]
[]
[]
[]
[]
[]
[]
[]
[]
[]
[]
[]
[]
[]
[]
[]
[]
[]
[]
[]
[]
[]
[]
[]
[]
[]
[]
[]
[]
[]
[]
[]
[]
[]
[]
[]
[]
[]
[]
[]
[]
[]
[]
[]
[]
[]
[]
[]
[]
[]
[]
[]
[]
[]
[]
[]
[]
[]
[]
[]
[]
[]
[]
[]
[]
[]
[]
[]
[]
[]
[]
[]
[]
[]
[]
[]
[]
[]
[]
[]
[]
[]
[]
[]
[]
[]
[]
[]
[]
[]
[]
[]
[]
[]
[]
[]
[]
[]
[]
[]
[]
[]
[]
[]
[]
[]
[]
[]
[]
[]
[]
[]
[]
[]
[]
[]
[]
[]
[]
[]
[]
[]
[]
[]
[]
[]
[]
[]
[]
[]
[]
[]
[]
[]
[]
[]
[]
[]
[]
[]
[]
[]
[]
[]
[]
[]
[]
[]
[]
[]
[]
[]
[]
[]
[]
[]
[]
[]
[]
[]
[]
[]
[]
[]
[]
[]
[]
[]
[]
[]
[]
[]
[]
[]
[]
[]
[]
[]
[]
[]
[]
[]
[]
[]
[]
[]
[]
[]
[]
[]
[]
[]
[]
[]
[]
[]
[]
[]
[]
[]
[]
[]
[]
[]
[]
[]
[]
[]
[]
[]
[]
[]
[]
[]
[]
[]
[]
[]
[]
[]
[]
[]
[]
[]
[]
[]
[]
[]
[]
[]
[]
[]
[]
[]
[]
[]
[]
[]
[]
[]
[]
[]
[]
[]
[]
[]
[]
[]
[]
[]
[]
[]
[]
[]
[]
[]
[]
[]
[]
[]
[]
[]
[]
[]
[]
[]
[]
[]
[]
[]
[]
[]
[]
[]
[]
[]
[]
[]
[]
[]
[]
[]
[]
[]
[]
[]
[]
[]
[]
[]
[]
[]
[]
[]
[]
[]
[]
[]
[]
[]
[]
[]
[]
[]
[]
[]
[]
[]
[]
[]
[]
[]
[]
[]
[]
[]
[]
[]
[]
[]
[]
[]
[]
[]
[]
[]
[]
[]
[]
[]
[]
[]
[]
[]
[]
[]
[]
[]
[]
[]
[]
[]
[]
[]
[]
[]
[]
[]
[]
[]
[]
[]
[]
[]
[]
[]
[]
[]
[]
[]
[]
[]
[]
[]
[]
[]
[]
[]
[]
[]
[]
[]
[]
[]
[]
[]
[]
[]
[]
[]
[]
[]
[]
[]
[]
[]
[]
[]
[]
[]
[]
[]
[]
[]
[]
[]
[]
[]
[]
[]
[]
[]
[]
[]
[]
[]
[]
[]
[]
[]
[]
[]
[]
[]
[]
[]
[]
[]
[]
[]
[]
[]
[]
[]
[]
[]
[]
[]
[]
[]
[]
[]
[]
[]
[]
[]
[]
[]
[]
[]
[]
[]
[]
[]
[]
[]
[]
[]
[]
[]
[]
[]
[]
[]
[]
[]
[]
[]
[]
[]
[]
[]
[]
[]
[]
[]
[]
[]
[]
[]
[]
[]
[]
[]
[]
[]
[]
[]
[]
[]
[]
[]
[]
[]
[]
[]
[]
[]
[]
[]
[]
[]
[]
[]
[]
[]
[]
[]
[]
[]
[]
[]
[]
[]
[]
[]
[]
[]
[]
[]
[]
[]
[]
[]
[]
[]
[]
[]
[]
[]
[]
[]
[]
[]
[]
[]
[]
[]
[]
[]
[]
[]
[]
[]
[]
[]
[]
[]
[]
[]
[]
[]
[]
[]
[]
[]
[]
[]
[]
[]
[]
[]
[]
[]
[]
[]
[]
[]
[]
[]
[]
[]
[]
[]
[]
[]
[]
[]
[]
[]
[]
[]
[]
[]
[]
[]
[]
[]
[]
[]
[]
[]
[]
[]
[]
[]
[]
[]
[]
[]
[]
[]
[]
[]
[]
[]
[]
[]
[]
[]
[]
[]
[]
[]
[]
[]
[]
[]
[]
[]
[]
[]
[]
[]
[]
[]
[]
[]
[]
[]
[]
[]
[]
[]
[]
[]
[]
[]
[]
[]
[]
[]
[]
[]
[]
[]
[]
[]
[]
[]
[]
[]
[]
[]
[]
[]
[]
[]
[]
[]
[]
[]
[]
[]
[]
[]
[]
[]
[]
[]
[]
[]
[]
[]
[]
[]
[]
[]
[]
[]
[]
[]
[]
[]
[]
[]
[]
[]
[]
[]
[]
[]
[]
[]
[]
[]
[]
[]
[]
[]
[]
[]
[]
[]
[]
[]
[]
[]
[]
[]
[]
[]
[]
[]
[]
[]
[]
[]
[]
[]
[]
[]
[]
[]
[]
[]
[]
[]
[]
[]
[]
[]
[]
[]
[]
[]
[]
[]
[]
[]
[]
[]
[]
[]
[]
[]
[]
[]
[]
[]
[]
[]
[]
[]
[]
[]
[]
[]
[]
[]
[]
[]
[]
[]
[]
[]
[]
[]
[]
[]
[]
[]
[]
[]
[]
[]
[]
[]
[]
[]
[]
[]
[]
[]
[]
[]
[]
[]
[]
[]
[]
[]
[]
[]
[]
[]
[]
[]
[]
[]
[]
[]
[]
[]
[]
[]
[]
[]
[]
[]
[]
[]
[]
[]
[]
[]
[]
[]
[]
[]
[]
[]
[]
[]
[]
[]
[]
[]
[]
[]
[]
[]
[]
[]
[]
[]
[]
[]
[]
[]
[]
[]
[]
[]
[]
[]
[]
[]
[]
[]
[]
[]
[]
[]
[]
[]
[]
[]
[]
[]
[]
[]
[]
[]
[]
[]
[]
[]
[]
[]
[]
[]
[]
[]
[]
[]
[]
[]
[]
[]
[]
[]
[]
[]
[]
[]
[]
[]
[]
[]
[]
[]
[]
[]
[]
[]
[]
[]
[]
[]
[]
[]
[]
[]
[]
[]
[]
[]
[]
[]
[]
[]
[]
[]
[]
[]
[]
[]
[]
[]
[]
[]
[]
[]
[]
[]
[]
[]
[]
[]
[]
[]
[]
[]
[]
[]
[]
[]
[]
[]
[]
[]
[]
[]
[]
[]
[]
[]
[]
[]
[]
[]
[]
[]
[]
[]
[]
[]
[]
[]
[]
[]
[]
[]
[]
[]
[]
[]
[]
[]
[]
[]
[]
[]
[]
[]
[]
[]
[]
[]
[]
[]
[]
[]
[]
[]
[]
[]
[]
[]
[]
[]
[]
[]
[]
[]
[]
[]
[]
[]
[]
[]
[]
[]
[]
[]
[]
[]
[]
[]
[]
[]
[]
[]
[]
[]
[]
[]
[]
[]
[]
[]
[]
[]
[]
[]
[]
[]
[]
[]
[]
[]
[]
[]
[]
[]
[]
[]
[]
[]
[]
[]
[]
[]
[]
[]
[]
[]
[]
[]
[]
[]
[]
[]
[]
[]
[]
[]
[]
[]
[]
[]
[]
[]
[]
[]
[]
[]
[]
[]
[]
[]
[]
[]
[]
[]
[]
[]
[]
[]
[]
[]
[]
[]
[]
[]
[]
[]
[]
[]
[]
[]
[]
[]
[]
[]
[]
[]
[]
[]
[]
[]
[]
[]
[]
[]
[]
[]
[]
[]
[]
[]
[]
[]
[]
[]
[]
[]
[]
[]
[]
[]
[]
[]
[]
[]
[]
[]
[]
[]
[]
[]
[]
[]
[]
[]
[]
[]
[]
[]
[]
[]
[]
[]
[]
[]
[]
[]
[]
[]
[]
[]
[]
[]
[]
[]
[]
[]
[]
[]
[]
[]
[]
[]
[]
[]
[]
[]
[]
[]
[]
[]
[]
[]
[]
[]
[]
[]
[]
[]
[]
[]
[]
[]
[]
[]
[]
[]
[]
[]
[]
[]
[]
[]
[]
[]
[]
[]
[]
[]
[]
[]
[]
[]
[]
[]
[]
[]
[]
[]
[]
[]
[]
[]
[]
[]
[]
[]
[]
[]
[]
[]
[]
[]
[]
[]
[]
[]
[]
[]
[]
[]
[]
[]
[]
[]
[]
[]
[]
[]
[]
[]
[]
[]
[]
[]
[]
[]
[]
[]
[]
[]
[]
[]
[]
[]
[]
[]
[]
[]
[]
[]
[]
[]
[]
[]
[]
[]
[]
[]
[]
[]
[]
[]
[]
[]
[]
[]
[]
[]
[]
[]
[]
[]
[]
[]
[]
[]
[]
[]
[]
[]
[]
[]
[]
[]
[]
[]
[]
[]
[]
[]
[]
[]
[]
[]
[]
[]
[]
[]
[]
[]
[]
[]
[]
[]
[]
[]
[]
[]
[]
[]
[]
[]
[]
[]
[]
[]
[]
[]
[]
[]
[]
[]
[]
[]
[]
[]
[]
[]
[]
[]
[]
[]
[]
[]
[]
[]
[]
[]
[]
[]
[]
[]
[]
[]
[]
[]
[]
[]
[]
[]
[]
[]
[]
[]
[]
[]
[]
[]
[]
[]
[]
[]
[]
[]
[]
[]
[]
[]
[]
[]
[]
[]
[]
[]
[]
[]
[]
[]
[]
[]
[]
[]
[]
[]
[]
[]
[]
[]
[]
[]
[]
[]
[]
[]
[]
[]
[]
[]
[]
[]
[]
[]
[]
[]
[]
[]
[]
[]
[]
[]
[]
[]
[]
[]
[]
[]
[]
[]
[]
[]
[]
[]
[]
[]
[]
[]
[]
[]
[]
[]
[]
[]
[]
[]
[]
[]
[]
[]
[]
[]
[]
[]
[]
[]
[]
[]
[]
[]
[]
[]
[]
[]
[]
[]
[]
[]
[]
[]
[]
[]
[]
[]
[]
[]
[]
[]
[]
[]
[]
[]
[]
[]
[]
[]
[]
[]
[]
[]
[]
[]
[]
[]
[]
[]
[]
[]
[]
[]
[]
[]
[]
[]
[]
[]
[]
[]
[]
[]
[]
[]
[]
[]
[]
[]
[]
[]
[]
[]
[]
[]
[]
[]
[]
[]
[]
[]
[]
[]
[]
[]
[]
[]
[]
[]
[]
[]
[]
[]
[]
[]
[]
[]
[]
[]
[]
[]
[]
[]
[]
[]
[]
[]
[]
[]
[]
[]
[]
[]
[]
[]
[]
[]
[]
[]
[]
[]
[]
[]
[]
[]
[]
[]
[]
[]
[]
[]
[]
[]
[]
[]
[]
[]
[]
[]
[]
[]
[]
[]
[]
[]
[]
[]
[]
[]
[]
[]
[]
[]
[]
[]
[]
[]
[]
[]
[]
[]
[]
[]
[]
[]
[]
[]
[]
[]
[]
[]
[]
[]
[]
[]
[]
[]
[]
[]
[]
[]
[]
[]
[]
[]
[]
[]
[]
[]
[]
[]
[]
[]
[]
[]
[]
[]
[]
[]
[]
[]
[]
[]
[]
[]
[]
[]
[]
[]
[]
[]
[]
[]
[]
[]
[]
[]
[]
[]
[]
[]
[]
[]
[]
[]
[]
[]
[]
[]
[]
[]
[]
[]
[]
[]
[]
[]
[]
[]
[]
[]
[]
[]
[]
[]
[]
[]
[]
[]
[]
[]
[]
[]
[]
[]
[]
[]
[]
[]
[]
[]
[]
[]
[]
[]
[]
[]
[]
[]
[]
[]
[]
[]
[]
[]
[]
[]
[]
[]
[]
[]
[]
[]
[]
[]
[]
[]
[]
[]
[]
[]
[]
[]
[]
[]
[]
[]
[]
[]
[]
[]
[]
[]
[]
[]
[]
[]
[]
[]
[]
[]
[]
[]
[]
[]
[]
[]
[]
[]
[]
[]
[]
[]
[]
[]
[]
[]
[]
[]
[]
[]
[]
[]
[]
[]
[]
[]
[]
[]
[]
[]
[]
[]
[]
[]
[]
[]
[]
[]
[]
[]
[]
[]
[]
[]
[]
[]
[]
[]
[]
[]
[]
[]
[]
[]
[]
[]
[]
[]
[]
[]
[]
[]
[]
[]
[]
[]
[]
[]
[]
[]
[]
[]
[]
[]
[]
[]
[]
[]
[]
[]
[]
[]
[]
[]
[]
[]
[]
[]
[]
[]
[]
[]
[]
[]
[]
[]
[]
[]
[]
[]
[]
[]
[]
[]
[]
[]
[]
[]
[]
[]
[]
[]
[]
[]
[]
[]
[]
[]
[]
[]
[]
[]
[]
[]
[]
[]
[]
[]
[]
[]
[]
[]
[]
[]
[]
[]
[]
[]
[]
[]
[]
[]
[]
[]
[]
[]
[]
[]
[]
[]
[]
[]
[]
[]
[]
[]
[]
[]
[]
[]
[]
[]
[]
[]
[]
[]
[]
[]
[]
[]
[]
[]
[]
[]
[]
[]
[]
[]
[]
[]
[]
[]
[]
[]
[]
[]
[]
[]
[]
[]
[]
[]
[]
[]
[]
[]
[]
[]
[]
[]
[]
[]
[]
[]
[]
[]
[]
[]
[]
[]
[]
[]
[]
[]
[]
[]
[]
[]
[]
[]
[]
[]
[]
[]
[]
[]
[]
[]
[]
[]
[]
[]
[]
[]
[]
[]
[]
[]
[]
[]
[]
[]
[]
[]
[]
[]
[]
[]
[]
[]
[]
[]
[]
[]
[]
[]
[]
[]
[]
[]
[]
[]
[]
[]
[]
[]
[]
[]
[]
[]
[]
[]
[]
[]
[]
[]
[]
[]
[]
[]
[]
[]
[]
[]
[]
[]
[]
[]
[]
[]
[]
[]
[]
[]
[]
[]
[]
[]
[]
[]
[]
[]
[]
[]
[]
[]
[]
[]
[]
[]
[]
[]
[]
[]
[]
[]
[]
[]
[]
[]
[]
[]
[]
[]
[]
[]
[]
[]
[]
[]
[]
[]
[]
[]
[]
[]
[]
[]
[]
[]
[]
[]
[]
[]
[]
[]
[]
[]
[]
[]
[]
[]
[]
[]
[]
[]
[]
[]
[]
[]
[]
[]
[]
[]
[]
[]
[]
[]
[]
[]
[]
[]
[]
[]
[]
[]
[]
[]
[]
[]
[]
[]
[]
[]
[]
[]
[]
[]
[]
[]
[]
[]
[]
[]
[]
[]
[]
[]
[]
[]
[]
[]
[]
[]
[]
[]
[]
[]
[]
[]
[]
[]
[]
[]
[]
[]
[]
[]
[]
[]
[]
[]
[]
[]
[]
[]
[]
[]
[]
[]
[]
[]
[]
[]
[]
[]
[]
[]
[]
[]
[]
[]
[]
[]
[]
[]
[]
[]
[]
[]
[]
[]
[]
[]
[]
[]
[]
[]
[]
[]
[]
[]
[]
[]
[]
[]
[]
[]
[]
[]
[]
[]
[]
[]
[]
[]
[]
[]
[]
[]
[]
[]
[]
[]
[]
[]
[]
[]
[]
[]
[]
[]
[]
[]
[]
[]
[]
[]
[]
[]
[]
[]
[]
[]
[]
[]
[]
[]
[]
[]
[]
[]
[]
[]
[]
[]
[]
[]
[]
[]
[]
[]
[]
[]
[]
[]
[]
[]
[]
[]
[]
[]
[]
[]
[]
[]
[]
[]
[]
[]
[]
[]
[]
[]
[]
[]
[]
[]
[]
[]
[]
[]
[]
[]
[]
[]
[]
[]
[]
[]
[]
[]
[]
[]
[]
[]
[]
[]
[]
[]
[]
[]
[]
[]
[]
[]
[]
[]
[]
[]
[]
[]
[]
[]
[]
[]
[]
[]
[]
[]
[]
[]
[]
[]
[]
[]
[]
[]
[]
[]
[]
[]
[]
[]
[]
[]
[]
[]
[]
[]
[]
[]
[]
[]
[]
[]
[]
[]
[]
[]
[]
[]
[]
[]
[]
[]
[]
[]
[]
[]
[]
[]
[]
[]
[]
[]
[]
[]
[]
[]
[]
[]
[]
[]
[]
[]
[]
[]
[]
[]
[]
[]
[]
[]
[]
[]
[]
[]
[]
[]
[]
[]
[]
[]
[]
[]
[]
[]
[]
[]
[]
[]
[]
[]
[]
[]
[]
[]
[]
[]
[]
[]
[]
[]
[]
[]
[]
[]
[]
[]
[]
[]
[]
[]
[]
[]
[]
[]
[]
[]
[]
[]
[]
[]
[]
[]
[]
[]
[]
[]
[]
[]
[]
[]
[]
[]
[]
[]
[]
[]
[]
[]
[]
[]
[]
[]
[]
[]
[]
[]
[]
[]
[]
[]
[]
[]
[]
[]
[]
[]
[]
[]
[]
[]
[]
[]
[]
[]
[]
[]
[]
[]
[]
[]
[]
[]
[]
[]
[]
[]
[]
[]
[]
[]
[]
[]
[]
[]
[]
[]
[]
[]
[]
[]
[]
[]
[]
[]
[]
[]
[]
[]
[]
[]
[]
[]
[]
[]
[]
[]
[]
[]
[]
[]
[]
[]
[]
[]
[]
[]
[]
[]
[]
[]
[]
[]
[]
[]
[]
[]
[]
[]
[]
[]
[]
[]
[]
[]
[]
[]
[]
[]
[]
[]
[]
[]
[]
[]
[]
[]
[]
[]
[]
[]
[]
[]
[]
[]
[]
[]
[]
[]
[]
[]
[]
[]
[]
[]
[]
[]
[]
[]
[]
[]
[]
[]
[]
[]
[]
[]
[]
[]
[]
[]
[]
[]
[]
[]
[]
[]
[]
[]
[]
[]
[]
[]
[]
[]
[]
[]
[]
[]
[]
[]
[]
[]
[]
[]
[]
[]
[]
[]
[]
[]
[]
[]
[]
[]
[]
[]
[]
[]
[]
[]
[]
[]
[]
[]
[]
[]
[]
[]
[]
[]
[]
[]
[]
[]
[]
[]
[]
[]
[]
[]
[]
[]
[]
[]
[]
[]
[]
[]
[]
[]
[]
[]
[]
[]
[]
[]
[]
[]
[]
[]
[]
[]
[]
[]
[]
[]
[]
[]
[]
[]
[]
[]
[]
[]
[]
[]
[]
[]
[]
[]
[]
[]
[]
[]
[]
[]
[]
[]
[]
[]
[]
[]
[]
[]
[]
[]
[]
[]
[]
[]
[]
[]
[]
[]
[]
[]
[]
[]
[]
[]
[]
[]
[]
[]
[]
[]
[]
[]
[]
[]
[]
[]
[]
[]
[]
[]
[]
[]
[]
[]
[]
[]
[]
[]
[]
[]
[]
[]
[]
[]
[]
[]
[]
[]
[]
[]
[]
[]
[]
[]
[]
[]
[]
[]
[]
[]
[]
[]
[]
[]
[]
[]
[]
[]
[]
[]
[]
[]
[]
[]
[]
[]
[]
[]
[]
[]
[]
[]
[]
[]
[]
[]
[]
[]
[]
[]
[]
[]
[]
[]
[]
[]
[]
[]
[]
[]
[]
[]
[]
[]
[]
[]
[]
[]
[]
[]
[]
[]
[]
[]
[]
[]
[]
[]
[]
[]
[]
[]
[]
[]
[]
[]
[]
[]
[]
[]
[]
[]
[]
[]
[]
[]
[]
[]
[]
[]
[]
[]
[]
[]
[]
[]
[]
[]
[]
[]
[]
[]
[]
[]
[]
[]
[]
[]
[]
[]
[]
[]
[]
[]
[]
[]
[]
[]
[]
[]
[]
[]
[]
[]
[]
[]
[]
[]
[]
[]
[]
[]
[]
[]
[]
[]
[]
[]
[]
[]
[]
[]
[]
[]
[]
[]
[]
[]
[]
[]
[]
[]
[]
[]
[]
[]
[]
[]
[]
[]
[]
[]
[]
[]
[]
[]
[]
[]
[]
[]
[]
[]
[]
[]
[]
[]
[]
[]
[]
[]
[]
[]
[]
[]
[]
[]
[]
[]
[]
[]
[]
[]
[]
[]
[]
[]
[]
[]
[]
[]
[]
[]
[]
[]
[]
[]
[]
[]
[]
[]
[]
[]
[]
[]
[]
[]
[]
[]
[]
[]
[]
[]
[]
[]
[]
[]
[]
[]
[]
[]
[]
[]
[]
[]
[]
[]
[]
[]
[]
[]
[]
[]
[]
[]
[]
[]
[]
[]
[]
[]
[]
[]
[]
[]
[]
[]
[]
[]
[]
[]
[]
[]
[]
[]
[]
[]
[]
[]
[]
[]
[]
[]
[]
[]
[]
[]
[]
[]
[]
[]
[]
[]
[]
[]
[]
[]
[]
[]
[]
[]
[]
[]
[]
[]
[]
[]
[]
[]
[]
[]
[]
[]
[]
[]
[]
[]
[]
[]
[]
[]
[]
[]
[]
[]
[]
[]
[]
[]
[]
[]
[]
[]
[]
[]
[]
[]
[]
[]
[]
[]
[]
[]
[]
[]
[]
[]
[]
[]
[]
[]
[]
[]
[]
[]
[]
[]
[]
[]
[]
[]
[]
[]
[]
[]
[]
[]
[]
[]
[]
[]
[]
[]
[]
[]
[]
[]
[]
[]
[]
[]
[]
[]
[]
[]
[]
[]
[]
[]
[]
[]
[]
[]
[]
[]
[]
[]
[]
[]
[]
[]
[]
[]
[]
[]
[]
[]
[]
[]
[]
[]
[]
[]
[]
[]
[]
[]
[]
[]
[]
[]
[]
[]
[]
[]
[]
[]
[]
[]
[]
[]
[]
[]
[]
[]
[]
[]
[]
[]
[]
[]
[]
[]
[]
[]
[]
[]
[]
[]
[]
[]
[]
[]
[]
[]
[]
[]
[]
[]
[]
[]
[]
[]
[]
[]
[]
[]
[]
[]
[]
[]
[]
[]
[]
[]
[]
[]
[]
[]
[]
[]
[]
[]
[]
[]
[]
[]
[]
[]
[]
[]
[]
[]
[]
[]
[]
[]
[]
[]
[]
[]
[]
[]
[]
[]
[]
[]
[]
[]
[]
[]
[]
[]
[]
[]
[]
[]
[]
[]
[]
[]
[]
[]
[]
[]
[]
[]
[]
[]
[]
[]
[]
[]
[]
[]
[]
[]
[]
[]
[]
[]
[]
[]
[]
[]
[]
[]
[]
[]
[]
[]
[]
[]
[]
[]
[]
[]
[]
[]
[]
[]
[]
[]
[]
[]
[]
[]
[]
[]
[]
[]
[]
[]
[]
[]
[]
[]
[]
[]
[]
[]
[]
[]
[]
[]
[]
[]
[]
[]
[]
[]
[]
[]
[]
[]
[]
[]
[]
[]
[]
[]
[]
[]
[]
[]
[]
[]
[]
[]
[]
[]
[]
[]
[]
[]
[]
[]
[]
[]
[]
[]
[]
[]
[]
[]
[]
[]
[]
[]
[]
[]
[]
[]
[]
[]
[]
[]
[]
[]
[]
[]
[]
[]
[]
[]
[]
[]
[]
[]
[]
[]
[]
[]
[]
[]
[]
[]
[]
[]
[]
[]
[]
[]
[]
[]
[]
[]
[]
[]
[]
[]
[]
[]
[]
[]
[]
[]
[]
[]
[]
[]
[]
[]
[]
[]
[]
[]
[]
[]
[]
[]
[]
[]
[]
[]
[]
[]
[]
[]
[]
[]
[]
[]
[]
[]
[]
[]
[]
[]
[]
[]
[]
[]
[]
[]
[]
[]
[]
[]
[]
[]
[]
[]
[]
[]
[]
[]
[]
[]
[]
[]
[]
[]
[]
[]
[]
[]
[]
[]
[]
[]
[]
[]
[]
[]
[]
[]
[]
[]
[]
[]
[]
[]
[]
[]
[]
[]
[]
[]
[]
[]
[]
[]
[]
[]
[]
[]
[]
[]
[]
[]
[]
[]
[]
[]
[]
[]
[]
[]
[]
[]
[]
[]
[]
[]
[]
[]
[]
[]
[]
[]
[]
[]
[]
[]
[]
[]
[]
[]
[]
[]
[]
[]
[]
[]
[]
[]
[]
[]
[]
[]
[]
[]
[]
[]
[]
[]
[]
[]
[]
[]
[]
[]
[]
[]
[]
[]
[]
[]
[]
[]
[]
[]
[]
[]
[]
[]
[]
[]
[]
[]
[]
[]
[]
[]
[]
[]
[]
[]
[]
[]
[]
[]
[]
[]
[]
[]
[]
[]
[]
[]
[]
[]
[]
[]
[]
[]
[]
[]
[]
[]
[]
[]
[]
[]
[]
[]
[]
[]
[]
[]
[]
[]
[]
[]
[]
[]
[]
[]
[]
[]
[]
[]
[]
[]
[]
[]
[]
[]
[]
[]
[]
[]
[]
[]
[]
[]
[]
[]
[]
[]
[]
[]
[]
[]
[]
[]
[]
[]
[]
[]
[]
[]
[]
[]
[]
[]
[]
[]
[]
[]
[]
[]
[]
[]
[]
[]
[]
[]
[]
[]
[]
[]
[]
[]
[]
[]
[]
[]
[]
[]
[]
[]
[]
[]
[]
[]
[]
[]
[]
[]
[]
[]
[]
[]
[]
[]
[]
[]
[]
[]
[]
[]
[]
[]
[]
[]
[]
[]
[]
[]
[]
[]
[]
[]
[]
[]
[]
[]
[]
[]
[]
[]
[]
[]
[]
[]
[]
[]
[]
[]
[]
[]
[]
[]
[]
[]
[]
[]
[]
[]
[]
[]
[]
[]
[]
[]
[]
[]
[]
[]
[]
[]
[]
[]
[]
[]
[]
[]
[]
[]
[]
[]
[]
[]
[]
[]
[]
[]
[]
[]
[]
[]
[]
[]
[]
[]
[]
[]
[]
[]
[]
[]
[]
[null,null,null,null,null,null,null,null,null,null,null,null,null,null,null,null,null,null,null,null,null,null,null,null,"Criticité"]
[null,null,null,null,null,null,null,null,null,null,null,null,null,null,null,null,null,null,null,null,null,null,null,null,{"$f":"Délai","v":"<=10"}]
[]
[null,null,null,null,null,null,null,null,null,null,null,null,null,null,null,null,"Chrono","Date","Support","Objet","Type délai","Délai","Date limite de réponse","Date de réponse","Criticité","Correspondant","Adresse","Service","Observations"]

{"sheet":"Départ","index":2,"n_rows":6,"n_cols":11,"rows_kept":6,"cut":false,"hidden":false,"merged":[]}
[{"$f":"Collectivité&\" - \"&Service & \" - Registre du courrier Départ\"","v":"Ville d'Excel-les-Bains - Enseignement, Réglementation et Citoyenneté - Registre du courrier Départ"}]
[null,null,null,{"$f":"SUBTOTAL(3,A4:A7)-1","v":2}]
[]
["Chrono","Date","Support","Objet","Correspondant","Adresse","Service","Rédacteur","Observations","Lien","Chrono Arrivée"]
[3,"2016-01-14","Courrier postal","Essai 1","Service Central Etat Civil","11 rue Maison Blanche - 44941 NANTES ","Etat Civil","Brigitte Moreau"]
[2,"2016-01-11","Courrier postal","Essai 2","Service Central Etat Civil","11 rue Maison Blanche - 44941 NANTES ","Etat Civil","Brigitte Moreau"]

{"sheet":"Délais","index":3,"n_rows":8,"n_cols":5,"rows_kept":8,"cut":false,"hidden":false,"merged":[]}
[{"$f":"Collectivité & \" - \"&Service& \" - Délais\"","v":"Ville d'Excel-les-Bains - Enseignement, Réglementation et Citoyenneté - Délais"}]
[null,null,{"$f":"SUBTOTAL(9,C4:C10)","v":1}]
[]
["Libellé","Délai légal en jours","Arrivées","Délai de réponse moyen","Observations"]
["Correspondance standard",0,{"$f":"COUNTIF(Arrivée!E:E,A:A)","v":1},{"$f":"IF(SUMIF(Arrivée!E:E,A:A,Arrivée!N:N)>0,COUNTIFS(Arrivée!E:E,A:A,Arrivée!I:I,\">0\")/SUMIF(Arrivée!E:E,A:A,Arrivée!N:N),\"\")","v":""}]
["Demande de rendez-vous (externe)",30,{"$f":"COUNTIF(Arrivée!E:E,A:A)","v":0},{"$f":"IF(SUMIF(Arrivée!E:E,A:A,Arrivée!N:N)>0,COUNTIFS(Arrivée!E:E,A:A,Arrivée!I:I,\">0\")/SUMIF(Arrivée!E:E,A:A,Arrivée!N:N),\"\")","v":""}]
["Demande de rendez-vous (interne)",20,{"$f":"COUNTIF(Arrivée!E:E,A:A)","v":0},{"$f":"IF(SUMIF(Arrivée!E:E,A:A,Arrivée!N:N)>0,COUNTIFS(Arrivée!E:E,A:A,Arrivée!I:I,\">0\")/SUMIF(Arrivée!E:E,A:A,Arrivée!N:N),\"\")","v":""}]
["Demande de stage",20,{"$f":"COUNTIF(Arrivée!E:E,A:A)","v":0},{"$f":"IF(SUMIF(Arrivée!E:E,A:A,Arrivée!N:N)>0,COUNTIFS(Arrivée!E:E,A:A,Arrivée!I:I,\">0\")/SUMIF(Arrivée!E:E,A:A,Arrivée!N:N),\"\")","v":""}]

{"sheet":"Supports","index":4,"n_rows":9,"n_cols":5,"rows_kept":9,"cut":false,"hidden":false,"merged":[]}
[{"$f":"Collectivité & \" - \"&Service& \" - Supports\"","v":"Ville d'Excel-les-Bains - Enseignement, Réglementation et Citoyenneté - Supports"}]
[null,{"$f":"SUBTOTAL(9,B4:B10)","v":1},{"$f":"SUBTOTAL(9,C4:C10)","v":2}]
[]
["Libellé","Arrivées","Départs","Délai de réponse moyen","Observations"]
["...",{"$f":"COUNTIF(Arrivée!C:C,A:A)","v":0},{"$f":"COUNTIF(Départ!C:C,A:A)","v":0},{"$f":"IF(SUMIF(Arrivée!C:C,A:A,Arrivée!N:N)>0,COUNTIFS(Arrivée!C:C,A:A,Arrivée!H:H,\">0\")/SUMIF(Arrivée!C:C,A:A,Arrivée!N:N),\"\")","v":""}]
["Courrier électronique",{"$f":"COUNTIF(Arrivée!C:C,A:A)","v":0},{"$f":"COUNTIF(Départ!C:C,A:A)","v":0},{"$f":"IF(SUMIF(Arrivée!C:C,A:A,Arrivée!N:N)>0,COUNTIFS(Arrivée!C:C,A:A,Arrivée!H:H,\">0\")/SUMIF(Arrivée!C:C,A:A,Arrivée!N:N),\"\")","v":""}]
["Courrier postal",{"$f":"COUNTIF(Arrivée!C:C,A:A)","v":1},{"$f":"COUNTIF(Départ!C:C,A:A)","v":2},{"$f":"IF(SUMIF(Arrivée!C:C,A:A,Arrivée!N:N)>0,COUNTIFS(Arrivée!C:C,A:A,Arrivée!H:H,\">0\")/SUMIF(Arrivée!C:C,A:A,Arrivée!N:N),\"\")","v":""}]
["Recommandé AR",{"$f":"COUNTIF(Arrivée!C:C,A:A)","v":0},{"$f":"COUNTIF(Départ!C:C,A:A)","v":0},{"$f":"IF(SUMIF(Arrivée!C:C,A:A,Arrivée!N:N)>0,COUNTIFS(Arrivée!C:C,A:A,Arrivée!H:H,\">0\")/SUMIF(Arrivée!C:C,A:A,Arrivée!N:N),\"\")","v":""}]
["Télécopie",{"$f":"COUNTIF(Arrivée!C:C,A:A)","v":0},{"$f":"COUNTIF(Départ!C:C,A:A)","v":0},{"$f":"IF(SUMIF(Arrivée!C:C,A:A,Arrivée!N:N)>0,COUNTIFS(Arrivée!C:C,A:A,Arrivée!H:H,\">0\")/SUMIF(Arrivée!C:C,A:A,Arrivée!N:N),\"\")","v":""}]

{"sheet":"Services","index":5,"n_rows":10,"n_cols":5,"rows_kept":10,"cut":false,"hidden":false,"merged":[]}
[{"$f":"Collectivité & \" - \"&Service& \" - Services\"","v":"Ville d'Excel-les-Bains - Enseignement, Réglementation et Citoyenneté - Services"}]
[null,{"$f":"SUBTOTAL(9,B4:B10)","v":1},{"$f":"SUBTOTAL(9,C4:C10)","v":2}]
[]
["Libellé","Arrivées","Départs","Délai de réponse moyen","Observations"]
["...",{"$f":"COUNTIF(Arrivée!L:L,A:A)","v":1},{"$f":"COUNTIF(Départ!G:G,A:A)","v":0},{"$f":"IF(SUMIF(Arrivée!L:L,A:A,Arrivée!N:N)>0,COUNTIFS(Arrivée!L:L,A:A,Arrivée!H:H,\">0\")/SUMIF(Arrivée!L:L,A:A,Arrivée!N:N),\"\")","v":""}]
["Accueil",{"$f":"COUNTIF(Arrivée!L:L,A:A)","v":0},{"$f":"COUNTIF(Départ!G:G,A:A)","v":0},{"$f":"IF(SUMIF(Arrivée!L:L,A:A,Arrivée!N:N)>0,COUNTIFS(Arrivée!L:L,A:A,Arrivée!H:H,\">0\")/SUMIF(Arrivée!L:L,A:A,Arrivée!N:N),\"\")","v":""}]
["Archives et Documentation",{"$f":"COUNTIF(Arrivée!L:L,A:A)","v":0},{"$f":"COUNTIF(Départ!G:G,A:A)","v":0},{"$f":"IF(SUMIF(Arrivée!L:L,A:A,Arrivée!N:N)>0,COUNTIFS(Arrivée!L:L,A:A,Arrivée!H:H,\">0\")/SUMIF(Arrivée!L:L,A:A,Arrivée!N:N),\"\")","v":""}]
["Elections",{"$f":"COUNTIF(Arrivée!L:L,A:A)","v":0},{"$f":"COUNTIF(Départ!G:G,A:A)","v":0},{"$f":"IF(SUMIF(Arrivée!L:L,A:A,Arrivée!N:N)>0,COUNTIFS(Arrivée!L:L,A:A,Arrivée!H:H,\">0\")/SUMIF(Arrivée!L:L,A:A,Arrivée!N:N),\"\")","v":""}]
["Enseignement",{"$f":"COUNTIF(Arrivée!L:L,A:A)","v":0},{"$f":"COUNTIF(Départ!G:G,A:A)","v":0},{"$f":"IF(SUMIF(Arrivée!L:L,A:A,Arrivée!N:N)>0,COUNTIFS(Arrivée!L:L,A:A,Arrivée!H:H,\">0\")/SUMIF(Arrivée!L:L,A:A,Arrivée!N:N),\"\")","v":""}]
["Etat Civil",{"$f":"COUNTIF(Arrivée!L:L,A:A)","v":0},{"$f":"COUNTIF(Départ!G:G,A:A)","v":2},{"$f":"IF(SUMIF(Arrivée!L:L,A:A,Arrivée!N:N)>0,COUNTIFS(Arrivée!L:L,A:A,Arrivée!H:H,\">0\")/SUMIF(Arrivée!L:L,A:A,Arrivée!N:N),\"\")","v":""}]

{"sheet":"Rédacteurs","index":6,"n_rows":11,"n_cols":3,"rows_kept":11,"cut":false,"hidden":false,"merged":[]}
[{"$f":"Collectivité & \" - \"&Service& \" - Rédacteurs\"","v":"Ville d'Excel-les-Bains - Enseignement, Réglementation et Citoyenneté - Rédacteurs"}]
[null,{"$f":"SUBTOTAL(9,B4:B9)","v":2}]
[]
["Libellé","Départs","Observations"]
["...",{"$f":"COUNTIF(Départ!H:H,A:A)","v":0}]
["Annick Poirier",{"$f":"COUNTIF(Départ!H:H,A:A)","v":0}]
["Brigitte Moreau",{"$f":"COUNTIF(Départ!H:H,A:A)","v":2}]
["France Kaburski",{"$f":"COUNTIF(Départ!H:H,A:A)","v":0}]
["Jean-Jacques Boulez",{"$f":"COUNTIF(Départ!H:H,A:A)","v":0}]
["Martine Mortagne",{"$f":"COUNTIF(Départ!H:H,A:A)","v":0}]
["Olivier Dassaud",{"$f":"COUNTIF(Départ!H:H,A:A)","v":0}]

{"sheet":"Statistiques Arrivée","index":7,"n_rows":28,"n_cols":4,"rows_kept":28,"cut":false,"hidden":false,"merged":[]}
[{"$f":"Collectivité&\" - \"&Service& \" - Statistiques Arrivées\"","v":"Ville d'Excel-les-Bains - Enseignement, Réglementation et Citoyenneté - Statistiques Arrivées"}]
[]
[]
[]
["Nombre de Chrono",null,"Support"]
["Années","Date","Courrier postal","Total général"]
["2016","janv",1,1]
["Total général",null,1,1]
[]
[]
[]
[]
[]
[]
[]
[]
[]
[]
[]
[]
[]
[]
[]
[]
[]
["Étiquettes de lignes","Nombre"]
["Courrier postal",1]
["Total général",1]

{"sheet":"Statistiques Départ","index":8,"n_rows":27,"n_cols":4,"rows_kept":27,"cut":false,"hidden":false,"merged":[]}
[{"$f":"Collectivité&\" - \"&Service& \" - Statistiques Départs\"","v":"Ville d'Excel-les-Bains - Enseignement, Réglementation et Citoyenneté - Statistiques Départs"}]
[]
[]
[]
["Nombre de Chrono",null,"Support"]
["Années","Date","Courrier postal","Total général"]
["2016","janv",2,2]
["Total général",null,2,2]
[]
[]
[]
[]
[]
[]
[]
[]
[]
[]
[]
[]
[]
[]
[]
[]
["Étiquettes de lignes","Nombre de Chrono"]
["Courrier postal",2]
["Total général",2]

{"sheet":"Paramètres","index":9,"n_rows":22,"n_cols":3,"rows_kept":22,"cut":false,"hidden":false,"merged":[]}
["Paramètres généraux"]
["Collectivité :","Ville d'Excel-les-Bains"]
["Service :","Enseignement, Réglementation et Citoyenneté"]
["Année :",2016]
["Délai d'observation :","<=10"]
[]
[]
["Valeurs par défaut"]
["Délai","Correspondance standard",{"$f":"IF(ISNUMBER(MATCH(VD_Délai,Liste_Délais,0)-1),MATCH(VD_Délai,Liste_Délais,0)-1,\"\")","v":1}]
["Support","Courrier postal",{"$f":"IF(ISNUMBER(MATCH(VD_Support,Liste_Supports,0)-1),MATCH(VD_Support,Liste_Supports,0)-1,\"\")","v":3}]
["Service","Etat Civil",{"$f":"IF(ISNUMBER(MATCH(VD_Service,Liste_Services,0)-1),MATCH(VD_Service,Liste_Services,0)-1,\"\")","v":6}]
["Rédacteur","Olivier Dassaud",{"$f":"IF(ISNUMBER(MATCH(VD_Rédacteur,Liste_Rédacteurs,0)-1),MATCH(VD_Rédacteur,Liste_Rédacteurs,0)-1,\"\")","v":7}]
[]
[null,{"$f":"VLOOKUP(\"Essai\",Coordonnées_Arrivées,2,FALSE)","v":0}]
["Personnalisation du classeur"]
["Appliquer plein écran ?","oui"]
["Afficher formules ?","non"]
["Afficher feuilles ?","non"]
["Afficher entêtes ?","non"]
[]
[]
["Cellule de travail",{"$f":"MATCH(1,Liste_Arrivées,0)+4","v":6}]

{"sheet":"Listes Saisie Auto","index":10,"n_rows":79,"n_cols":7,"rows_kept":79,"cut":false,"hidden":true,"merged":[]}
["Étiquettes de lignes",null,"Étiquettes de lignes",null,"Étiquettes de lignes",null,"Étiquettes de lignes"]
["(vide)",null,"(vide)",null,"(vide)",null,"(vide)"]
["DAACT pour DP 15V8054 (Carrefour Market)",null,"Direction Départementale des Finances Publiques de la Loire - Pôle Gestion Publique Division Missions Domaniales",null,"Demande de délai pour enlever dispositif non réglementaire sur clôture ",null,"DI PAOLO Jérôme"]
["DAACT pour DP 15V8094",null,"CSF ZI de Saint-Sorlin BP 43 01152 LAGNIEU Cedex",null,"Demande arrêté de circulation rue J. Vachet.",null,"CEGELEC Réseaux Centre Est"]
["exemplaire DOC",null,"BARTHELEMY Isabelle",null,"Envoi des modèles de procès verbaux et d'arrêtés de mise en demeure pour les panneaux publicitaires non conformes",null,"Vlimant Thierry"]
["Etat vacance logement 2015",null,"MABBOUX Marc",null,"Signale dysfonctionnement EP au niveau du 106 de la rue de Saint-Romain",null,"BOUSSARD Danielle"]
["PC 15V0020 ",null,"Philippe DEPOUX Directeur Général GECINA",null,"Demande remplacement container ordures ménagers",null,"DRESSY Jean-Claude"]
["Nouvelle génération de compteur électricité d'ErDF \"Linky\"",null,"Philippe OLMICCIA Directeur Général DUGOURD & GAME",null,"projet de changer porte de garage : demande si dépôt DP",null,"parileitao@wanadoo.fr"]
["Dérogation accessibilité association Réseau Santé du Roannnais",null,"Patrick GERBAY Président GERBAY IMMO",null,"Demande autorisation  stationnement  pour déménagemnt de mme Forest, le Marianne, 35 place de la République le 26/01/2015 matin.",null,"CHAMBON DEMENAGEMENTS"]
["Envoi DIA serv fiscaux",null,"Véronique MADELRIEUX PDG GINET",null,"Demande information relative au projet d'installation du nouveau compteur d'ErDF \"LINKY\".",null,"LAROCHE Gérard"]
["Demande avis sécurité pour salon de l'habitat, de la décoration et du bien-être du 26 au 28 fév ",null,"Bernard FARINA Directeur Général CITE NOUVELLE",null,"Convention tripartite de Partenariat entre SAS Boudret, P.M.S.e et PCC relative à aménagement du GS Pontet 1 et 2 certificat d'Economies d'Energie 3ème période.",null,"PCC"]
["Bon de commande EV160001 + feuillez d'adhésion et déclaration de ruches pour assurances",null,"Jacques Ferrand Directeur Général NEOLIA",null,"Déclaration projet de travaux - DICT 98 impasse Julien Vachet : plantation 1 appui)",null,"EIFFAGE ENERGIE TELECOM - PERREUX"]
["Plan Communal de Sauvegarde + annexe \"moyens\" + dépliant",null,"Laurent GAGNAIRE Directeur Général LOIRE HABITAT",null,"Convention tripartite de Partenariat entre SAS Boudret, P.M.S.e et Bezacier relative à aménagement du GS Pontet 1 et 2 certificat d'Economies d'Energie 3ème période.",null,"BEZACIER SAS"]
["Précision sur adresse exacte d'un annonceur",null,"Anne-Sophie WARSMANN Directrice Générale Immo RA",null,"ZAC Canaux",null,"EPORA - Anne-Sophie Bonhour"]
["Envoi exemplaire PDF du PCs de la commune + dépliant  + annexe \"myens\"",null,"Marc PATAY Directeur Général OPHEOR",null,"Demande renseignement sur autorisation enseignes provisoires",null,"MOUILLER Catherine"]
["Invite le particulier à contacter les services déchets Ménagers de Roannais Agglomération.",null,"GENUIT Eric MATHELIN Sylvie ",null,"projet de construction sur Riorges, demande comment sont calculées les taxes liées à la construction et leurs montants",null,"ExterionMedia"]
["Réponse dysfonctionnement EP AU 126 rue de Saint-Romain",null,"LAROCHE Gérard",null,"Déclaration rectificative 2015",null,"JCDecaux - Mme Isabelle KOENIG"]
["OS n° 2 du lot 10 - Marché : Aménagement du G.S. du Pontet 1 et 2",null,"Direction Départementale des Territoires",null,"Déclaration préalable au 650 avenue Charles de Gaulle",null,"Ets Cl. DESBENOIT"]
["OS n° 2 du lot 9 - Marché : Tx d'aménagement du G.S. du Pontet 1 et 2",null,"Finances publiques de la Loire (M. le Directeur)",null,"Convention tripartite de Partenariat entre SAS Boudret, P.M.S.e et Desbenoit relative à aménagement du GS Pontet 1 et 2 certificat d'Economies d'Energie 3ème période.",null,"Sous-préfecture de Roanne"]
["OS n° 2 du lot 8 - Marché : Tx d'aménagement du G.S. du Pontet 1 et 2",null,"SDIS",null,"Autorisation enseigne (totem) 2015-16",null,"ROURE Sylvain"]
["OS n° 2 du lot 7 - Marché Tx d'aménagement du G.S. du Pontet 1 et 2",null,"RAQUIN Maurice",null,"DAACT ROURE"]
["OS n° 2 du lot 6 - Marché : Tx d'aménagement du G.S. du Pontet 1 et 2",null,"Direction Départementale de la Protection des Populations de la Loire"]
["OS n° 2 du lot 5 - Marché : Tx d'aménagement du G.S. du Pontet 1 et 2",null,"CROIX ROUGE FRANCAISE"]
["OS n° 2 du lot 4 - Marché : Tx d'aménagement du G.S. du Pontet 1 et 2",null,"Sous-préfecture de Roanne"]
["OS n° 2 du lot 3 - Marché : Tx d'aménagement du G.S. du Pontet 1 et 2",null,"Vlimant Thierry"]
["OS n° 2 du lot 2 - Marché : Tx d'aménagement du G.S. du Pontet 1 et 2",null,"SDIS 42 - TARDY Martine"]
["Déclaration rectificative 2015 pour pré enseigne au 43 rue Michel Rondet",null,"DRESSY Jean-Claude"]
["Certificat administratif réduction sur titre",null,"BOUSSARD Danielle"]
["DP 16 V8001",null,"Ets ALGECO SAS"]
["DP 16V8004 pour M. MARIN",null,"BEZACIER SAS"]
["Demande Avis France Domaine",null,"Ets CREA BOIS"]
["Coulée verte Hôtel de ville - Riorges Centre",null,"Ets PUTANIER"]
["Convocation réunion Arrêt PLU",null,"Ets BROSSARD"]
["Demande renseignement sur autorisation enseignes provisoires",null,"Ets Cl. DESBENOIT"]
["Construction d'un mur de soutènement et terrassement d'une plateforme rue Saint-Alban",null,"Ets LABOURET"]
["Pas de salle à disposition",null,"Ets René FESSY"]
["Préciser réaménagement intersection indispensable entre la rue Jean Reboul et la rue Maréchal Foch",null,"Ets PCC"]
["Autorisation ouverture établissement catégorie 5 et type X",null,"Exterion Media France : Monsieur François BERNELIN"]
["Envoi fiche de renseignements suite à nouvelle installation",null,"Trésorerie Municipale"]
["Autorisation enseigne (totem) 2015-16",null,"BUZIEUX Jean-Pierre"]
["Convention de mise à disposition de services de la commune à Roannais Agglomération",null,"ISO WATT Energies"]
["Demande emplacement camion-magasin sur parking de la mairie le 29 mai 2016 de 15 h à 18 h (ECO VD 2015-36)",null,"Direction départementale des Finances Publiques de la Loire - Division Missions Domaniales"]
["Autorisation enseigne Ecran Led pour Riorges Lavage (2015-21) installée par sté Winlight",null,"SA Immo ACLPME"]
["Autorisation enseigne Sté PDF Rhône-Alpes (2015-16)",null,"ACL PME LOIRE - Monsieur Chauvelot"]
["Autorisation 2015-20 (GEDIBOIS)",null,"Institut National de l'Origine et de la Qualité"]
["Demande évaluation France Domaine",null,"DDT Service Aménagement et Planification"]
[null,null,"SIEL"]
[null,null,"RTE"]
[null,null,"ERDF"]
[null,null,"GRDF"]
[null,null,"Maire Ouches"]
[null,null,"Maire Pouilly-les-Nonains"]
[null,null,"Maire Saint-Léger-sur-Roanne"]
[null,null,"Maire Saint-Romain-la-Motte"]
[null,null,"Maire Mably"]
[null,null,"Maire Villerest"]
[null,null,"Maire Roanne"]
[null,null,"Président Roannaise Eau"]
[null,null,"Président Conseil Général Loire Cellule urbanisme"]
[null,null,"Président Conseil Régional"]
[null,null,"Président Chambre Agriculture Aménagement Environnement Territoires"]
[null,null,"Président Chambre Commerce et Industrie"]
[null,null,"Président Chambre des Métiers"]
[null,null,"Président SEEDR"]
[null,null,"Président Roannais Agglomération"]
[null,null,"Président du SYEPAR"]
[null,null,"Conseil Départemental de la Loire Président (M.)"]
[null,null,"VAP 2000 - Corinne"]
[null,null,"Chabert Henri"]
[null,null,"KEEP COOL Société NEOFIT - Mme Anne-Sophie BERTRAND KONEFAL"]
[null,null,"Maridet Jean-Pierre"]
[null,null,"SARRAZIN Laura - Roannais Agglomération"]
[null,null,"CARIEN Angelina OUTIROR"]
[null,null,"Cohen Benjamin"]
[null,null,"Winlight International (société)"]
[null,null,"Bochu Henri"]
[null,null,"Bachelet Roger"]
[null,null,"Rondard Alain"]
[null,null,"Fromage Jean-Louis"]