{"text_format":"1","workbook":"xlsx","n_sheets":19,"sheets":["Sommaire","Synthèse","Feuil4","Zones complètes","Catégories Complètes","Monstres Originaux","Besaid","Kilika","Route de Mi'ihen","Route de Myorocos","Route de Djose","Plaine foudroyée","Macalania","Bikanel","Plaine Félicité","Grotte du Priant Volé","Mont Gagazet","Sin","Ruines d'Omega"],"not_rendered":{"charts":2,"images":136,"macros":1,"external_links":0,"defined_names":7,"comments":0,"pivot_tables":0},"unopened":[],"bounds":{"document_bytes":16777216,"sheet_cells":100000,"rows_first":2000,"rows_last":500,"rows_between":2000,"halvings":0,"cell_chars":16384,"cell_head_chars":4096},"cells_cut":0,"cells_raw":0,"read":"whole","date_system":"1900"}

{"sheet":"Sommaire","index":0,"n_rows":1,"n_cols":1,"rows_kept":1,"cut":false,"hidden":false,"merged":[[0,55,0,59],[0,60,0,64],[0,65,0,69],[0,70,0,74],[0,75,0,79],[0,80,0,84],[0,25,0,29],[0,30,0,34],[0,35,0,39],[0,40,0,44],[0,45,0,49],[0,50,0,54],[0,0,0,4],[0,5,0,9],[0,10,0,14],[0,15,0,19],[0,20,0,24],[0,145,0,149],[0,150,0,154],[0,155,0,159],[0,160,0,164],[0,165,0,169],[0,170,0,174],[0,115,0,119],[0,120,0,124],[0,125,0,129],[0,130,0,134],[0,135,0,139],[0,140,0,144],[0,85,0,89],[0,90,0,94],[0,95,0,99],[0,100,0,104],[0,105,0,109],[0,110,0,114],[0,235,0,239],[0,240,0,244],[0,245,0,249],[0,250,0,254],[0,255,0,259],[0,260,0,264],[0,205,0,209],[0,210,0,214],[0,215,0,219],[0,220,0,224],[0,225,0,229],[0,230,0,234],[0,175,0,179],[0,180,0,184],[0,185,0,189],[0,190,0,194],[0,195,0,199],[0,200,0,204],[0,325,0,329],[0,330,0,334],[0,335,0,339],[0,340,0,344],[0,345,0,349],[0,350,0,354],[0,295,0,299],[0,300,0,304],[0,305,0,309],[0,310,0,314],[0,315,0,319],[0,320,0,324],[0,265,0,269],[0,270,0,274],[0,275,0,279],[0,280,0,284],[0,285,0,289],[0,290,0,294],[0,415,0,419],[0,420,0,424],[0,425,0,429],[0,430,0,434],[0,435,0,439],[0,440,0,444],[0,385,0,389],[0,390,0,394],[0,395,0,399],[0,400,0,404],[0,405,0,409],[0,410,0,414],[0,355,0,359],[0,360,0,364],[0,365,0,369],[0,370,0,374],[0,375,0,379],[0,380,0,384],[0,505,0,509],[0,510,0,514],[0,515,0,519],[0,520,0,524],[0,525,0,529],[0,530,0,534],[0,475,0,479],[0,480,0,484],[0,485,0,489],[0,490,0,494],[0,495,0,499],[0,500,0,504],[0,445,0,449],[0,450,0,454],[0,455,0,459],[0,460,0,464],[0,465,0,469],[0,470,0,474],[0,595,0,599],[0,600,0,604],[0,605,0,609],[0,610,0,614],[0,615,0,619],[0,620,0,624],[0,565,0,569],[0,570,0,574],[0,575,0,579],[0,580,0,584],[0,585,0,589],[0,590,0,594],[0,535,0,539],[0,540,0,544],[0,545,0,549],[0,550,0,554],[0,555,0,559],[0,560,0,564],[0,685,0,689],[0,690,0,694],[0,695,0,699],[0,700,0,704],[0,705,0,709],[0,710,0,714],[0,655,0,659],[0,660,0,664],[0,665,0,669],[0,670,0,674],[0,675,0,679],[0,680,0,684],[0,625,0,629],[0,630,0,634],[0,635,0,639],[0,640,0,644],[0,645,0,649],[0,650,0,654],[0,775,0,779],[0,780,0,784],[0,785,0,789],[0,790,0,794],[0,795,0,799],[0,800,0,804],[0,745,0,749],[0,750,0,754],[0,755,0,759],[0,760,0,764],[0,765,0,769],[0,770,0,774],[0,715,0,719],[0,720,0,724],[0,725,0,729],[0,730,0,734],[0,735,0,739],[0,740,0,744],[0,865,0,869],[0,870,0,874],[0,875,0,879],[0,880,0,884],[0,885,0,889],[0,890,0,894],[0,835,0,839],[0,840,0,844],[0,845,0,849],[0,850,0,854],[0,855,0,859],[0,860,0,864],[0,805,0,809],[0,810,0,814],[0,815,0,819],[0,820,0,824],[0,825,0,829],[0,830,0,834],[0,955,0,959],[0,960,0,964],[0,965,0,969],[0,970,0,974],[0,975,0,979],[0,980,0,984],[0,925,0,929],[0,930,0,934],[0,935,0,939],[0,940,0,944],[0,945,0,949],[0,950,0,954],[0,895,0,899],[0,900,0,904],[0,905,0,909],[0,910,0,914],[0,915,0,919],[0,920,0,924],[0,1045,0,1049],[0,1050,0,1054],[0,1055,0,1059],[0,1060,0,1064],[0,1065,0,1069],[0,1070,0,1074],[0,1015,0,1019],[0,1020,0,1024],[0,1025,0,1029],[0,1030,0,1034],[0,1035,0,1039],[0,1040,0,1044],[0,985,0,989],[0,990,0,994],[0,995,0,999],[0,1000,0,1004],[0,1005,0,1009],[0,1010,0,1014],[0,1135,0,1139],[0,1140,0,1144],[0,1145,0,1149],[0,1150,0,1154],[0,1155,0,1159],[0,1160,0,1164],[0,1105,0,1109],[0,1110,0,1114],[0,1115,0,1119],[0,1120,0,1124],[0,1125,0,1129],[0,1130,0,1134],[0,1075,0,1079],[0,1080,0,1084],[0,1085,0,1089],[0,1090,0,1094],[0,1095,0,1099],[0,1100,0,1104],[0,1225,0,1229],[0,1230,0,1234],[0,1235,0,1239],[0,1240,0,1244],[0,1245,0,1249],[0,1250,0,1254],[0,1195,0,1199],[0,1200,0,1204],[0,1205,0,1209],[0,1210,0,1214],[0,1215,0,1219],[0,1220,0,1224],[0,1165,0,1169],[0,1170,0,1174],[0,1175,0,1179],[0,1180,0,1184],[0,1185,0,1189],[0,1190,0,1194],[0,1315,0,1319],[0,1320,0,1324],[0,1325,0,1329],[0,1330,0,1334],[0,1335,0,1339],[0,1340,0,1344],[0,1285,0,1289],[0,1290,0,1294],[0,1295,0,1299],[0,1300,0,1304],[0,1305,0,1309],[0,1310,0,1314],[0,1255,0,1259],[0,1260,0,1264],[0,1265,0,1269],[0,1270,0,1274],[0,1275,0,1279],[0,1280,0,1284],[0,1405,0,1409],[0,1410,0,1414],[0,1415,0,1419],[0,1420,0,1424],[0,1425,0,1429],[0,1430,0,1434],[0,1375,0,1379],[0,1380,0,1384],[0,1385,0,1389],[0,1390,0,1394],[0,1395,0,1399],[0,1400,0,1404],[0,1345,0,1349],[0,1350,0,1354],[0,1355,0,1359],[0,1360,0,1364],[0,1365,0,1369],[0,1370,0,1374],[0,1495,0,1499],[0,1500,0,1504],[0,1505,0,1509],[0,1510,0,1514],[0,1515,0,1519],[0,1520,0,1524],[0,1465,0,1469],[0,1470,0,1474],[0,1475,0,1479],[0,1480,0,1484],[0,1485,0,1489],[0,1490,0,1494],[0,1435,0,1439],[0,1440,0,1444],[0,1445,0,1449],[0,1450,0,1454],[0,1455,0,1459],[0,1460,0,1464],[0,1585,0,1589],[0,1590,0,1594],[0,1595,0,1599],[0,1600,0,1604],[0,1605,0,1609],[0,1610,0,1614],[0,1555,0,1559],[0,1560,0,1564],[0,1565,0,1569],[0,1570,0,1574],[0,1575,0,1579],[0,1580,0,1584],[0,1525,0,1529],[0,1530,0,1534],[0,1535,0,1539],[0,1540,0,1544],[0,1545,0,1549],[0,1550,0,1554],[0,1675,0,1679],[0,1680,0,1684],[0,1685,0,1689],[0,1690,0,1694],[0,1695,0,1699],[0,1700,0,1704],[0,1645,0,1649],[0,1650,0,1654],[0,1655,0,1659],[0,1660,0,1664],[0,1665,0,1669],[0,1670,0,1674],[0,1615,0,1619],[0,1620,0,1624],[0,1625,0,1629],[0,1630,0,1634],[0,1635,0,1639],[0,1640,0,1644],[0,1765,0,1769],[0,1770,0,1774],[0,1775,0,1779],[0,1780,0,1784],[0,1785,0,1789],[0,1790,0,1794],[0,1735,0,1739],[0,1740,0,1744],[0,1745,0,1749],[0,1750,0,1754],[0,1755,0,1759],[0,1760,0,1764],[0,1705,0,1709],[0,1710,0,1714],[0,1715,0,1719],[0,1720,0,1724],[0,1725,0,1729],[0,1730,0,1734],[0,1855,0,1859],[0,1860,0,1864],[0,1865,0,1869],[0,1870,0,1874],[0,1875,0,1879],[0,1880,0,1884],[0,1825,0,1829],[0,1830,0,1834],[0,1835,0,1839],[0,1840,0,1844],[0,1845,0,1849],[0,1850,0,1854],[0,1795,0,1799],[0,1800,0,1804],[0,1805,0,1809],[0,1810,0,1814],[0,1815,0,1819],[0,1820,0,1824],[0,1945,0,1949],[0,1950,0,1954],[0,1955,0,1959],[0,1960,0,1964],[0,1965,0,1969],[0,1970,0,1974],[0,1915,0,1919],[0,1920,0,1924],[0,1925,0,1929],[0,1930,0,1934],[0,1935,0,1939],[0,1940,0,1944],[0,1885,0,1889],[0,1890,0,1894],[0,1895,0,1899],[0,1900,0,1904],[0,1905,0,1909],[0,1910,0,1914],[0,2035,0,2039],[0,2040,0,2044],[0,2045,0,2049],[0,2050,0,2054],[0,2055,0,2059],[0,2060,0,2064],[0,2005,0,2009],[0,2010,0,2014],[0,2015,0,2019],[0,2020,0,2024],[0,2025,0,2029],[0,2030,0,2034],[0,1975,0,1979],[0,1980,0,1984],[0,1985,0,1989],[0,1990,0,1994],[0,1995,0,1999],[0,2000,0,2004],[0,2125,0,2129],[0,2130,0,2134],[0,2135,0,2139],[0,2140,0,2144],[0,2145,0,2149],[0,2150,0,2154],[0,2095,0,2099],[0,2100,0,2104],[0,2105,0,2109],[0,2110,0,2114],[0,2115,0,2119],[0,2120,0,2124],[0,2065,0,2069],[0,2070,0,2074],[0,2075,0,2079],[0,2080,0,2084],[0,2085,0,2089],[0,2090,0,2094],[0,2215,0,2219],[0,2220,0,2224],[0,2225,0,2229],[0,2230,0,2234],[0,2235,0,2239],[0,2240,0,2244],[0,2185,0,2189],[0,2190,0,2194],[0,2195,0,2199],[0,2200,0,2204],[0,2205,0,2209],[0,2210,0,2214],[0,2155,0,2159],[0,2160,0,2164],[0,2165,0,2169],[0,2170,0,2174],[0,2175,0,2179],[0,2180,0,2184],[0,2305,0,2309],[0,2310,0,2314],[0,2315,0,2319],[0,2320,0,2324],[0,2325,0,2329],[0,2330,0,2334],[0,2275,0,2279],[0,2280,0,2284],[0,2285,0,2289],[0,2290,0,2294],[0,2295,0,2299],[0,2300,0,2304],[0,2245,0,2249],[0,2250,0,2254],[0,2255,0,2259],[0,2260,0,2264],[0,2265,0,2269],[0,2270,0,2274],[0,2395,0,2399],[0,2400,0,2404],[0,2405,0,2409],[0,2410,0,2414],[0,2415,0,2419],[0,2420,0,2424],[0,2365,0,2369],[0,2370,0,2374],[0,2375,0,2379],[0,2380,0,2384],[0,2385,0,2389],[0,2390,0,2394],[0,2335,0,2339],[0,2340,0,2344],[0,2345,0,2349],[0,2350,0,2354],[0,2355,0,2359],[0,2360,0,2364],[0,2485,0,2489],[0,2490,0,2494],[0,2495,0,2499],[0,2500,0,2504],[0,2505,0,2509],[0,2510,0,2514],[0,2455,0,2459],[0,2460,0,2464],[0,2465,0,2469],[0,2470,0,2474],[0,2475,0,2479],[0,2480,0,2484],[0,2425,0,2429],[0,2430,0,2434],[0,2435,0,2439],[0,2440,0,2444],[0,2445,0,2449],[0,2450,0,2454],[0,2575,0,2579],[0,2580,0,2584],[0,2585,0,2589],[0,2590,0,2594],[0,2595,0,2599],[0,2600,0,2604],[0,2545,0,2549],[0,2550,0,2554],[0,2555,0,2559],[0,2560,0,2564],[0,2565,0,2569],[0,2570,0,2574],[0,2515,0,2519],[0,2520,0,2524],[0,2525,0,2529],[0,2530,0,2534],[0,2535,0,2539],[0,2540,0,2544],[0,2665,0,2669],[0,2670,0,2674],[0,2675,0,2679],[0,2680,0,2684],[0,2685,0,2689],[0,2690,0,2694],[0,2635,0,2639],[0,2640,0,2644],[0,2645,0,2649],[0,2650,0,2654],[0,2655,0,2659],[0,2660,0,2664],[0,2605,0,2609],[0,2610,0,2614],[0,2615,0,2619],[0,2620,0,2624],[0,2625,0,2629],[0,2630,0,2634],[0,2755,0,2759],[0,2760,0,2764],[0,2765,0,2769],[0,2770,0,2774],[0,2775,0,2779],[0,2780,0,2784],[0,2725,0,2729],[0,2730,0,2734],[0,2735,0,2739],[0,2740,0,2744],[0,2745,0,2749],[0,2750,0,2754],[0,2695,0,2699],[0,2700,0,2704],[0,2705,0,2709],[0,2710,0,2714],[0,2715,0,2719],[0,2720,0,2724],[0,2845,0,2849],[0,2850,0,2854],[0,2855,0,2859],[0,2860,0,2864],[0,2865,0,2869],[0,2870,0,2874],[0,2815,0,2819],[0,2820,0,2824],[0,2825,0,2829],[0,2830,0,2834],[0,2835,0,2839],[0,2840,0,2844],[0,2785,0,2789],[0,2790,0,2794],[0,2795,0,2799],[0,2800,0,2804],[0,2805,0,2809],[0,2810,0,2814],[0,2935,0,2939],[0,2940,0,2944],[0,2945,0,2949],[0,2950,0,2954],[0,2955,0,2959],[0,2960,0,2964],[0,2905,0,2909],[0,2910,0,2914],[0,2915,0,2919],[0,2920,0,2924],[0,2925,0,2929],[0,2930,0,2934],[0,2875,0,2879],[0,2880,0,2884],[0,2885,0,2889],[0,2890,0,2894],[0,2895,0,2899],[0,2900,0,2904],[0,3025,0,3029],[0,3030,0,3034],[0,3035,0,3039],[0,3040,0,3044],[0,3045,0,3049],[0,3050,0,3054],[0,2995,0,2999],[0,3000,0,3004],[0,3005,0,3009],[0,3010,0,3014],[0,3015,0,3019],[0,3020,0,3024],[0,2965,0,2969],[0,2970,0,2974],[0,2975,0,2979],[0,2980,0,2984],[0,2985,0,2989],[0,2990,0,2994],[0,3115,0,3119],[0,3120,0,3124],[0,3125,0,3129],[0,3130,0,3134],[0,3135,0,3139],[0,3140,0,3144],[0,3085,0,3089],[0,3090,0,3094],[0,3095,0,3099],[0,3100,0,3104],[0,3105,0,3109],[0,3110,0,3114],[0,3055,0,3059],[0,3060,0,3064],[0,3065,0,3069],[0,3070,0,3074],[0,3075,0,3079],[0,3080,0,3084],[0,3205,0,3209],[0,3210,0,3214],[0,3215,0,3219],[0,3220,0,3224],[0,3225,0,3229],[0,3230,0,3234],[0,3175,0,3179],[0,3180,0,3184],[0,3185,0,3189],[0,3190,0,3194],[0,3195,0,3199],[0,3200,0,3204],[0,3145,0,3149],[0,3150,0,3154],[0,3155,0,3159],[0,3160,0,3164],[0,3165,0,3169],[0,3170,0,3174],[0,3295,0,3299],[0,3300,0,3304],[0,3305,0,3309],[0,3310,0,3314],[0,3315,0,3319],[0,3320,0,3324],[0,3265,0,3269],[0,3270,0,3274],[0,3275,0,3279],[0,3280,0,3284],[0,3285,0,3289],[0,3290,0,3294],[0,3235,0,3239],[0,3240,0,3244],[0,3245,0,3249],[0,3250,0,3254],[0,3255,0,3259],[0,3260,0,3264],[0,3385,0,3389],[0,3390,0,3394],[0,3395,0,3399],[0,3400,0,3404],[0,3405,0,3409],[0,3410,0,3414],[0,3355,0,3359],[0,3360,0,3364],[0,3365,0,3369],[0,3370,0,3374],[0,3375,0,3379],[0,3380,0,3384],[0,3325,0,3329],[0,3330,0,3334],[0,3335,0,3339],[0,3340,0,3344],[0,3345,0,3349],[0,3350,0,3354],[0,3475,0,3479],[0,3480,0,3484],[0,3485,0,3489],[0,3490,0,3494],[0,3495,0,3499],[0,3500,0,3504],[0,3445,0,3449],[0,3450,0,3454],[0,3455,0,3459],[0,3460,0,3464],[0,3465,0,3469],[0,3470,0,3474],[0,3415,0,3419],[0,3420,0,3424],[0,3425,0,3429],[0,3430,0,3434],[0,3435,0,3439],[0,3440,0,3444],[0,3565,0,3569],[0,3570,0,3574],[0,3575,0,3579],[0,3580,0,3584],[0,3585,0,3589],[0,3590,0,3594],[0,3535,0,3539],[0,3540,0,3544],[0,3545,0,3549],[0,3550,0,3554],[0,3555,0,3559],[0,3560,0,3564],[0,3505,0,3509],[0,3510,0,3514],[0,3515,0,3519],[0,3520,0,3524],[0,3525,0,3529],[0,3530,0,3534],[0,3655,0,3659],[0,3660,0,3664],[0,3665,0,3669],[0,3670,0,3674],[0,3675,0,3679],[0,3680,0,3684],[0,3625,0,3629],[0,3630,0,3634],[0,3635,0,3639],[0,3640,0,3644],[0,3645,0,3649],[0,3650,0,3654],[0,3595,0,3599],[0,3600,0,3604],[0,3605,0,3609],[0,3610,0,3614],[0,3615,0,3619],[0,3620,0,3624],[0,3745,0,3749],[0,3750,0,3754],[0,3755,0,3759],[0,3760,0,3764],[0,3765,0,3769],[0,3770,0,3774],[0,3715,0,3719],[0,3720,0,3724],[0,3725,0,3729],[0,3730,0,3734],[0,3735,0,3739],[0,3740,0,3744],[0,3685,0,3689],[0,3690,0,3694],[0,3695,0,3699],[0,3700,0,3704],[0,3705,0,3709],[0,3710,0,3714],[0,3835,0,3839],[0,3840,0,3844],[0,3845,0,3849],[0,3850,0,3854],[0,3855,0,3859],[0,3860,0,3864],[0,3805,0,3809],[0,3810,0,3814],[0,3815,0,3819],[0,3820,0,3824],[0,3825,0,3829],[0,3830,0,3834],[0,3775,0,3779],[0,3780,0,3784],[0,3785,0,3789],[0,3790,0,3794],[0,3795,0,3799],[0,3800,0,3804],[0,3925,0,3929],[0,3930,0,3934],[0,3935,0,3939],[0,3940,0,3944],[0,3945,0,3949],[0,3950,0,3954],[0,3895,0,3899],[0,3900,0,3904],[0,3905,0,3909],[0,3910,0,3914],[0,3915,0,3919],[0,3920,0,3924],[0,3865,0,3869],[0,3870,0,3874],[0,3875,0,3879],[0,3880,0,3884],[0,3885,0,3889],[0,3890,0,3894],[0,4015,0,4019],[0,4020,0,4024],[0,4025,0,4029],[0,4030,0,4034],[0,4035,0,4039],[0,4040,0,4044],[0,3985,0,3989],[0,3990,0,3994],[0,3995,0,3999],[0,4000,0,4004],[0,4005,0,4009],[0,4010,0,4014],[0,3955,0,3959],[0,3960,0,3964],[0,3965,0,3969],[0,3970,0,3974],[0,3975,0,3979],[0,3980,0,3984],[0,4105,0,4109],[0,4110,0,4114],[0,4115,0,4119],[0,4120,0,4124],[0,4125,0,4129],[0,4130,0,4134],[0,4075,0,4079],[0,4080,0,4084],[0,4085,0,4089],[0,4090,0,4094],[0,4095,0,4099],[0,4100,0,4104],[0,4045,0,4049],[0,4050,0,4054],[0,4055,0,4059],[0,4060,0,4064],[0,4065,0,4069],[0,4070,0,4074],[0,4195,0,4199],[0,4200,0,4204],[0,4205,0,4209],[0,4210,0,4214],[0,4215,0,4219],[0,4220,0,4224],[0,4165,0,4169],[0,4170,0,4174],[0,4175,0,4179],[0,4180,0,4184],[0,4185,0,4189],[0,4190,0,4194],[0,4135,0,4139],[0,4140,0,4144],[0,4145,0,4149],[0,4150,0,4154],[0,4155,0,4159],[0,4160,0,4164],[0,4285,0,4289],[0,4290,0,4294],[0,4295,0,4299],[0,4300,0,4304],[0,4305,0,4309],[0,4310,0,4314],[0,4255,0,4259],[0,4260,0,4264],[0,4265,0,4269],[0,4270,0,4274],[0,4275,0,4279],[0,4280,0,4284],[0,4225,0,4229],[0,4230,0,4234],[0,4235,0,4239],[0,4240,0,4244],[0,4245,0,4249],[0,4250,0,4254],[0,4375,0,4379],[0,4380,0,4384],[0,4385,0,4389],[0,4390,0,4394],[0,4395,0,4399],[0,4400,0,4404],[0,4345,0,4349],[0,4350,0,4354],[0,4355,0,4359],[0,4360,0,4364],[0,4365,0,4369],[0,4370,0,4374],[0,4315,0,4319],[0,4320,0,4324],[0,4325,0,4329],[0,4330,0,4334],[0,4335,0,4339],[0,4340,0,4344],[0,4465,0,4469],[0,4470,0,4474],[0,4475,0,4479],[0,4480,0,4484],[0,4485,0,4489],[0,4490,0,4494],[0,4435,0,4439],[0,4440,0,4444],[0,4445,0,4449],[0,4450,0,4454],[0,4455,0,4459],[0,4460,0,4464],[0,4405,0,4409],[0,4410,0,4414],[0,4415,0,4419],[0,4420,0,4424],[0,4425,0,4429],[0,4430,0,4434],[0,4555,0,4559],[0,4560,0,4564],[0,4565,0,4569],[0,4570,0,4574],[0,4575,0,4579],[0,4580,0,4584],[0,4525,0,4529],[0,4530,0,4534],[0,4535,0,4539],[0,4540,0,4544],[0,4545,0,4549],[0,4550,0,4554],[0,4495,0,4499],[0,4500,0,4504],[0,4505,0,4509],[0,4510,0,4514],[0,4515,0,4519],[0,4520,0,4524],[0,4645,0,4649],[0,4650,0,4654],[0,4655,0,4659],[0,4660,0,4664],[0,4665,0,4669],[0,4670,0,4674],[0,4615,0,4619],[0,4620,0,4624],[0,4625,0,4629],[0,4630,0,4634],[0,4635,0,4639],[0,4640,0,4644],[0,4585,0,4589],[0,4590,0,4594],[0,4595,0,4599],[0,4600,0,4604],[0,4605,0,4609],[0,4610,0,4614],[0,4735,0,4739],[0,4740,0,4744],[0,4745,0,4749],[0,4750,0,4754],[0,4755,0,4759],[0,4760,0,4764],[0,4705,0,4709],[0,4710,0,4714],[0,4715,0,4719],[0,4720,0,4724],[0,4725,0,4729],[0,4730,0,4734],[0,4675,0,4679],[0,4680,0,4684],[0,4685,0,4689],[0,4690,0,4694],[0,4695,0,4699],[0,4700,0,4704],[0,4825,0,4829],[0,4830,0,4834],[0,4835,0,4839],[0,4840,0,4844],[0,4845,0,4849],[0,4850,0,4854],[0,4795,0,4799],[0,4800,0,4804],[0,4805,0,4809],[0,4810,0,4814],[0,4815,0,4819],[0,4820,0,4824],[0,4765,0,4769],[0,4770,0,4774],[0,4775,0,4779],[0,4780,0,4784],[0,4785,0,4789],[0,4790,0,4794],[0,4915,0,4919],[0,4920,0,4924],[0,4925,0,4929],[0,4930,0,4934],[0,4935,0,4939],[0,4940,0,4944],[0,4885,0,4889],[0,4890,0,4894],[0,4895,0,4899],[0,4900,0,4904],[0,4905,0,4909],[0,4910,0,4914],[0,4855,0,4859],[0,4860,0,4864],[0,4865,0,4869],[0,4870,0,4874],[0,4875,0,4879],[0,4880,0,4884],[0,5005,0,5009],[0,5010,0,5014],[0,5015,0,5019],[0,5020,0,5024],[0,5025,0,5029],[0,5030,0,5034],[0,4975,0,4979],[0,4980,0,4984],[0,4985,0,4989],[0,4990,0,4994],[0,4995,0,4999]],"merged_total":3277,"flags":["merged_cut"]}
["SOMMAIRE"]

{"sheet":"Synthèse","index":1,"n_rows":1,"n_cols":1,"rows_kept":1,"cut":false,"hidden":false,"merged":[[0,0,0,14]]}
["SYNTHESE"]

{"sheet":"Feuil4","index":2,"n_rows":26,"n_cols":10,"rows_kept":26,"cut":false,"hidden":true,"merged":[]}
[0]
[1]
[2]
[3,null,null,null,null,null,null,"L'Etre ultime"]
[4,null,null,null,null,null,null,"Non Capturés","Capturés","Total"]
[5,null,null,null,null,null,"Besaid",{"$f":"Besaid!E6","v":25},{"$f":"J6-H6","v":5},30]
[6,null,null,null,null,null,"Kilika",{"$f":"Kilika!E7","v":40},{"$f":"J7-H7","v":0},40]
[7,null,null,null,null,null,"Route de Mi'ihen",{"$f":"'Route de Mi''ihen'!E12","v":80},0,80]
[8,null,null,null,null,null,"Route de Myorocos",{"$f":"'Route de Myorocos'!E11","v":70},0,70]
[9,null,null,{"$f":"+Besaid!E6+Kilika!E7+'Route de Mi''ihen'!E12+'Route de Myorocos'!E11+'Route de Djose'!E11+'Plaine foudroyée'!E12+Macalania!E14+Bikanel!E10+'Plaine Félicité'!E13+'Grotte du Priant Volé'!E13+'Mont Gagazet'!E16+Sin!E13+'Ruines d''Omega'!E14","v":1005},{"$f":"+D11-D10","v":5},null,"Route de Djose",{"$f":"'Route de Djose'!E11","v":70},0,70]
[10,null,null,1010,null,null,"Plaine foudroyée",{"$f":"'Plaine foudroyée'!E12","v":80},0,80]
[11,null,null,null,null,null,"Macalania",{"$f":"Macalania!E14","v":100},0,100]
[12,null,null,null,null,null,"Bikaniel",{"$f":"Bikanel!E10","v":60},0,60]
[13,null,null,null,null,null,"Plaine Félicité",{"$f":"'Plaine Félicité'!E13","v":90},0,90]
[14,null,null,null,null,null,"Gotte du Piant Volé",{"$f":"'Grotte du Priant Volé'!E13","v":90},0,90]
[15,null,null,null,null,null,"Mont Gazet",{"$f":"'Mont Gagazet'!E16","v":120},0,120]
["15 et +",null,null,null,null,null,"Sin",{"$f":"Sin!E13","v":90},0,90]
[null,null,null,null,null,null,"Ruines d'Omega",{"$f":"'Ruines d''Omega'!E14","v":90},{"$f":"J18-H18","v":0},90]
[null,null,null,null,null,null,"TOTAL",{"$f":"SUM(H6:H18)","v":1005},{"$f":"SUM(I6:I18)","v":5},{"$f":"SUM(J6:J18)","v":1010}]
[null,null,null,null,null,null,null,null,"DISPONIBLES","NON DISPONIBLES"]
["OUI",null,null,null,null,null,"% Capturés",null,{"$f":"I19/J19","v":4.9504950495049506E-3},{"$f":"1-I21","v":0.99504950495049505}]
["NON",null,null,null,null,null,"% Zones complètes",null,{"$f":"+'Zones complètes'!G83","v":0},{"$f":"1-I22","v":1}]
[null,null,null,null,null,null,"% Catégories Complètes",null,{"$f":"'Catégories Complètes'!G33","v":0},{"$f":"1-I23","v":1}]
[null,null,null,null,null,null,"% Monstres Originaux",null,{"$f":"'Monstres Originaux'!G19","v":0},{"$f":"1-I24","v":1}]
[null,null,null,null,null,null,"% TOTAL",null,{"$f":"AVERAGE(I21:I24)","v":1.2376237623762376E-3},{"$f":"1-I25","v":0.99876237623762376}]
[null,null,null,null,null,null,null,null,{"$f":"1-I25","v":0.99876237623762376}]

{"sheet":"Zones complètes","index":3,"n_rows":84,"n_cols":12,"rows_kept":84,"cut":false,"hidden":false,"merged":[[2,2,7,2],[2,4,7,4],[2,3,7,3],[2,0,7,0],[2,1,7,1],[0,0,0,6],[8,4,13,4],[8,3,13,3],[8,2,13,2],[8,1,13,1],[8,0,13,0],[14,4,19,4],[14,3,19,3],[14,2,19,2],[14,1,19,1],[14,0,19,0],[20,4,25,4],[20,3,25,3],[20,2,25,2],[20,1,25,1],[20,0,25,0],[26,4,31,4],[26,2,31,2],[26,3,31,3],[26,1,31,1],[26,0,31,0],[32,4,37,4],[32,3,37,3],[32,2,37,2],[32,1,37,1],[32,0,37,0],[38,4,43,4],[38,3,43,3],[38,2,43,2],[38,1,43,1],[38,0,43,0],[44,4,49,4],[44,3,49,3],[44,2,49,2],[44,1,49,1],[44,0,49,0],[50,4,55,4],[50,3,55,3],[50,2,55,2],[50,1,55,1],[50,0,55,0],[56,4,61,4],[56,3,61,3],[56,2,61,2],[56,1,61,1],[56,0,61,0],[62,4,67,4],[62,3,67,3],[62,2,67,2],[62,1,67,1],[62,0,67,0],[68,4,73,4],[68,3,73,3],[68,2,73,2],[68,1,73,1],[68,0,73,0],[14,6,19,6],[74,4,79,4],[74,3,79,3],[74,2,79,2],[74,1,79,1],[74,0,79,0],[8,6,13,6],[2,6,7,6],[44,5,49,5],[38,5,43,5],[32,5,37,5],[74,5,79,5],[68,5,73,5],[62,5,67,5],[56,5,61,5],[50,5,55,5],[14,5,19,5],[8,5,13,5],[2,5,7,5],[26,5,31,5],[20,5,25,5],[74,6,79,6],[68,6,73,6],[62,6,67,6],[2,7,7,7],[8,7,13,7],[14,7,19,7],[20,7,25,7],[26,7,31,7],[32,7,37,7],[38,7,43,7],[44,7,49,7],[50,7,55,7],[56,7,61,7],[62,7,67,7],[68,7,73,7],[74,7,79,7],[44,6,49,6],[38,6,43,6],[32,6,37,6],[26,6,31,6],[20,6,25,6],[50,6,55,6],[56,6,61,6]]}
["ZONNES COMPLETES",null,null,null,null,null,null,null,"OUI","NON",false,true]
["ZONE","MONSTRE CREE","IMAGE","RECOMPENSE","DISPONIBLE",null,"FAIT"]
["BESAID","STRATOEIBIS",null,"BREUVAGE VITAL X99",{"$f":"AND(Besaid!D3>=1,Besaid!D4>=1,Besaid!D5>=1)","v":false},{"$f":"IF(E3=TRUE,1,0)","v":0},"NON",{"$f":"IF(G3=\"OUI\",1,0)","v":0}]
[]
[]
[]
[]
[]
["KILIKA","MEGA MORBOL",null,"CROCHET VENIMEUX X99",{"$f":"AND(Kilika!D3>=1,Kilika!D4>=1,Kilika!D5>=1,Kilika!D6>=1)","v":false},{"$f":"IF(E9=TRUE,1,0)","v":0},"NON",{"$f":"IF(G9=\"OUI\",1,0)","v":0}]
[]
[]
[]
[]
[]
["ROUTE DE MI'IHEN","TOKI",null,"SOURCE REVIGORANTE X99",{"$f":"AND('Route de Mi''ihen'!D4>=1,'Route de Mi''ihen'!D5>=1,'Route de Mi''ihen'!D6>=1,'Route de Mi''ihen'!D7>=1,'Route de Mi''ihen'!D9>=1,'Route de Mi''ihen'!D8>=1,'Route de Mi''ihen'!D10>=1,'Route de Mi''ihen'!D11>=1)","v":false},{"$f":"IF(E15=TRUE,1,0)","v":0},"NON",{"$f":"IF(G15=\"OUI\",1,0)","v":0}]
[]
[]
[]
[]
[]
["ROUTE DES MYOROCS","MEGA COUGAR",null,"CIERGE DE VIE X99",{"$f":"AND('Route de Myorocos'!D4>=1,'Route de Myorocos'!D5>=1,'Route de Myorocos'!D6>=1,'Route de Myorocos'!D7>=1,'Route de Myorocos'!D8>=1,'Route de Myorocos'!D9>=1,'Route de Myorocos'!D10>=1)","v":false},{"$f":"IF(E21=TRUE,1,0)","v":0},"NON",{"$f":"IF(G21=\"OUI\",1,0)","v":0}]
[]
[]
[]
[]
[]
["ROUTE DE DJOSE","JORMUNGAND",null,"GRENADE PETRIFIANTE X99",{"$f":"AND('Route de Djose'!D4>=1,'Route de Djose'!D5>=1,'Route de Djose'!D6>=1,'Route de Djose'!D7>=1,'Route de Djose'!D8>=1,'Route de Djose'!D9>=1,'Route de Djose'!D10>=1)","v":false},{"$f":"IF(E27=TRUE,1,0)","v":0},"NON",{"$f":"IF(G27=\"OUI\",1,0)","v":0}]
[]
[]
[]
[]
[]
["PLANIE FOUDROYEE","PAMPI",null,"AILE DE CHOCOBO X99",{"$f":"AND('Plaine foudroyée'!D4>=1,'Plaine foudroyée'!D5>=1,'Plaine foudroyée'!D6>=1,'Plaine foudroyée'!D7>=1,'Plaine foudroyée'!D8>=1,'Plaine foudroyée'!D9>=1,'Plaine foudroyée'!D10>=1,'Plaine foudroyée'!D11>=1)","v":false},{"$f":"IF(E33=TRUE,1,0)","v":0},"NON",{"$f":"IF(G33=\"OUI\",1,0)","v":0}]
[]
[]
[]
[]
[]
["MACALANIA","ESPADA",null,"MAGIKOROC HYALIN X60",{"$f":"AND(Macalania!D4>=1,Macalania!D5>=1,Macalania!D6>=1,Macalania!D7>=1,Macalania!D8>=1,Macalania!D9>=1,Macalania!D10>=1,Macalania!D11>=1,Macalania!D12>=1,Macalania!D13>=1)","v":false},{"$f":"IF(E39=TRUE,1,0)","v":0},"NON",{"$f":"IF(G39=\"OUI\",1,0)","v":0}]
[]
[]
[]
[]
[]
["BIKANEL","VER ABYSSAL",null,"MAGIKOROC NOIR X99",{"$f":"AND(Bikanel!D4>=1,Bikanel!D5>=1,Bikanel!D6>=1,Bikanel!D7>=1,Bikanel!D8>=1,Bikanel!D9>=1)","v":false},{"$f":"IF(E45=TRUE,1,0)","v":0},"NON",{"$f":"IF(G45=\"OUI\",1,0)","v":0}]
[]
[]
[]
[]
[]
["PLAINE FELICITE","MEGA CHIMAIRA",null,"SOUFFLE DE L'AU-DELA X60",{"$f":"AND('Plaine Félicité'!D4>=1,'Plaine Félicité'!D5>=1,'Plaine Félicité'!D6>=1,'Plaine Félicité'!D7>=1,'Plaine Félicité'!D8>=1,'Plaine Félicité'!D9>=1,'Plaine Félicité'!D10>=1,'Plaine Félicité'!D11>=1,'Plaine Félicité'!D12>=1)","v":false},{"$f":"IF(E51=TRUE,1,0)","v":0},"NON",{"$f":"IF(G51=\"OUI\",1,0)","v":0}]
[]
[]
[]
[]
[]
["GROTTE DE LA VALLEE","DON TOMBERRY",null,"SABLIER D'ARGENT X40",{"$f":"AND('Grotte du Priant Volé'!D4>=1,'Grotte du Priant Volé'!D5>=1,'Grotte du Priant Volé'!D6>=1,'Grotte du Priant Volé'!D7>=1,'Grotte du Priant Volé'!D8>=1,'Grotte du Priant Volé'!D9>=1,'Grotte du Priant Volé'!D10>=1,'Grotte du Priant Volé'!D11>=1,'Grotte du Priant Volé'!D12>=1)","v":false},{"$f":"IF(E57=TRUE,1,0)","v":0},"NON",{"$f":"IF(G57=\"OUI\",1,0)","v":0}]
[]
[]
[]
[]
[]
["MONT GAGAZET","CATOBLEPAS",null,"TIARE DE BOURGEONS",{"$f":"AND('Mont Gagazet'!D4>=1,'Mont Gagazet'!D5>=1,'Mont Gagazet'!D6>=1,'Mont Gagazet'!D7>=1,'Mont Gagazet'!D8>=1,'Mont Gagazet'!D9>=1,'Mont Gagazet'!D10>=1,'Mont Gagazet'!D11>=1,'Mont Gagazet'!D12>=1,'Mont Gagazet'!D13>=1,'Mont Gagazet'!D14>=1,'Mont Gagazet'!D15>=1)","v":false},{"$f":"IF(E63=TRUE,1,0)","v":0},"NON",{"$f":"IF(G63=\"OUI\",1,0)","v":0}]
[]
[]
[]
[]
[]
["SIN","ABADON",null,"RIDEAU DE LUNE X99",{"$f":"AND(Sin!D4>=1,Sin!D5>=1,Sin!D6>=1,Sin!D7>=1,Sin!D8>=1,Sin!D9>=1,Sin!D10>=1,Sin!D11>=1,Sin!D12>=1)","v":false},{"$f":"IF(E69=TRUE,1,0)","v":0},"NON",{"$f":"IF(G69=\"OUI\",1,0)","v":0}]
[]
[]
[]
[]
[]
["RUINES D OMEGA","VORBAN",null,"PORTEFEUILLE LUXUEUX X60",{"$f":"AND('Ruines d''Omega'!D4>=1,'Ruines d''Omega'!D5>=1,'Ruines d''Omega'!D6>=1,'Ruines d''Omega'!D7>=1,'Ruines d''Omega'!D8>=1,'Ruines d''Omega'!D9>=1,'Ruines d''Omega'!D10>=1,'Ruines d''Omega'!D11>=1,'Ruines d''Omega'!D12>=1,'Ruines d''Omega'!D13>=1)","v":false},{"$f":"IF(E75=TRUE,1,0)","v":0},"NON",{"$f":"IF(G75=\"OUI\",1,0)","v":0}]
[]
[]
[]
[]
[]
[null,null,null,"DISPONIBLES","NON DISPONIBLES",null,"FAIT",null,"NON FAIT"]
[null,null,null,{"$f":"SUM(F3:F80)","v":0},{"$f":"D84-D82","v":13},null,{"$f":"SUM(H3:H80)","v":0},null,{"$f":"D84-G82","v":13}]
[null,null,"%",{"$f":"D82/D84","v":0},{"$f":"1-D83","v":1},null,{"$f":"G82/D84","v":0}]
[null,null,"TOTAL",13]

{"sheet":"Catégories Complètes","index":4,"n_rows":34,"n_cols":11,"rows_kept":34,"cut":false,"hidden":false,"merged":[[15,0,15,6],[17,0,17,6],[27,0,27,6],[29,0,29,6],[0,0,0,6],[11,0,11,6],[19,0,19,6],[21,0,21,6],[23,0,23,6],[25,0,25,6],[12,7,13,7],[3,0,3,6],[5,0,5,6],[7,0,7,6],[9,0,9,6],[13,0,13,6],[2,7,3,7],[4,7,5,7],[6,7,7,7],[8,7,9,7],[10,7,11,7],[28,7,29,7],[14,7,15,7],[16,7,17,7],[18,7,19,7],[20,7,21,7],[22,7,23,7],[24,7,25,7],[26,7,27,7]]}
["CATEGORIES COMPLETES",null,null,null,null,null,null,"OUI",false,true,"NON"]
["CONDITIONS D'OBTENTION","MONSTRE CREE","IMAGE","RECOMPENSE","DISPO","","FAIT"]
["CAPTUREZ 3 INDIVIDUS DES ESPECES SUIVANTES: DINGO, CHIEN DE MI'IHEN, GAROUM, LOUP DES NEIGES, LOUP DES SABLES, LYCAON, BANDERSNATCH. ","FENRIL","","99 PLUMES DE CHOCOBO ",{"$f":"AND(Besaid!D3>=3,'Route de Mi''ihen'!D4>=3,'Route de Djose'!D4>=3,Macalania!D4>=3,Bikanel!D4>=3,'Plaine Félicité'!D4>=3,'Mont Gagazet'!D4>=3)","v":false},{"$f":"IF(E3=TRUE,1,0)","v":0},"NON",{"$f":"IF(G3=\"OUI\",1,0)","v":0}]
["FENRIL EST RAPIDE ET A UNE BONNE ESQUIVE. IL PEUT INFLIGER L'ALTERATION D'ETAT MORT OU BIEN CONFUSION TOUT EN INFLIGEANT PLUS DE 15 000 DOMMAGES. L'OVERDRIVE CHAOS D'ANIMA OU DARD-DARD D'ANABELLA LE METTRONT A TERRE FACILEMENT. SI VOUS N'EN DISPOSEZ PAS, UTILISEZ BOOSTER X ET AUREOLE PUIS ATTAQUEZ. "]
["OBTENTION: CAPTUREZ 3 INDIVIDUS DES ESPECES SUIVANTES: DIONYX, IPIRIA, RAPTOUR, MELUSINE, YOWIE, ZAURUS ","ORNITHOLESTES","","99 SOURCES VITALES ",{"$f":"AND(Kilika!D3>=3,'Route de Mi''ihen'!D5>=3,'Route de Myorocos'!D4>=3,'Plaine foudroyée'!D4>=3,'Grotte du Priant Volé'!D4>=3,'Ruines d''Omega'!D4>=3)","v":false},{"$f":"IF(E5=TRUE,1,0)","v":0},"NON",{"$f":"IF(G5=\"OUI\",1,0)","v":0}]
["HORMIS SON ESQUIVE PLUTOT HAUTE, IL EST PLUTOT FAIBLE. IL PEUT INFLIGER POISON OU DRAINER DES HP EN ATTAQUANT MAIS CELA NE DEVRAIT PAS ETRE UN GRAND DANGER POUR VOS PERSONNAGES. "]
["CAPTUREZ 4 INDIVIDUS DES ESPECES SUIVANTES: CONDOR, SIMURGH, ALCYON ","PTERIX","","99 MEGA PHENIX ",{"$f":"AND(Besaid!D4>=4,'Route de Djose'!D5>=4,Bikanel!D5>=4)","v":false},{"$f":"IF(E7=TRUE,1,0)","v":0},"NON",{"$f":"IF(G7=\"OUI\",1,0)","v":0}]
["ENCORE UN ENNEMI AYANT UNE ESQUIVE ASSEZ HAUTE, MAIS SEULEMENT 100 000 HP. RIEN DE TRES DANGEREUX! "]
["CAPTUREZ 4 INDIVIDUS DES ESPECES SUIVANTES: ABEILLE TUEUSE, ELMIDEA, GUEPE, NEBIROS ","FRELON","","60 BREUVAGES MAGIQUES ",{"$f":"AND(Kilika!D4>=4,'Route de Djose'!D6>=4,Macalania!D6>=4,'Plaine Félicité'!D5>=4)","v":false},{"$f":"IF(E9=TRUE,1,0)","v":0},"NON",{"$f":"IF(G9=\"OUI\",1,0)","v":0}]
["IL EST CAPABLE D'INFLIGER MORT, SOMMEIL, SILENCE ET CECITE GRÂCE A L'UNE DE SES ATTAQUES. A PART CA, RIEN D'INSURMONTABLE. "]
["CAPTUREZ 4 INDIVIDUS DES ESPECES SUIVANTES: GANDHARVA, AROJ, GALKIMASERA ","WIZARSHA","","99 SOURCES MAGIQUES ",{"$f":"AND('Route de Myorocos'!D5>=4,'Plaine foudroyée'!D5>=4,'Grotte du Priant Volé'!D5>=4)","v":false},{"$f":"IF(E11=TRUE,1,0)","v":0},"NON",{"$f":"IF(G11=\"OUI\",1,0)","v":0}]
["N'UTILISEZ PAS LA MAGIE CONTRE LUI, C'EST PEINE PERDUE CAR IL LES BLOQUERA. EN REVANCHE, IL EST FAIBLE FACE AUS ATTAQUES PHYSIQUES ET NE DISPOSE QUE DE 95 000 HP! "]
["CAPTUREZ 4 INDIVIDUS DES ESPECES SUIVANTES: OEIL FLOTTANT, BUER, OEIL DEMONIAQUE, AHRIMAN, OEIL DE LA MORT ","LIEO NUKAN","","60 ONGUENTS VITAUX ",{"$f":"AND('Route de Mi''ihen'!D6>=4,'Plaine foudroyée'!D6>=4,Macalania!D7>=4,'Mont Gagazet'!D5>=4,'Ruines d''Omega'!D5>=4)","v":false},{"$f":"IF(E13=TRUE,1,0)","v":0},"NON",{"$f":"IF(G13=\"OUI\",1,0)","v":0}]
["VOILA UN ENNEMI EMBETANT CAPABLE D'INFLIGER DE NOMBREUSES ALTERATIONS D'ETAT ET PLUS DE 9 999 DOMMAGES. LE MEILLEUR MOYEN DE L'EVITER AU DEBUT DU COMBAT EST D'AVOIR UN PERSONNAGE PORTANT UNE ARME QUI A \"INITIATIVE\" COMME COMPETENCE ET DE LE REMPLACER PAR YUNA POUR QU'ELLE INVOQUE UNE CHIMERE. "]
["CAPTUREZ 3 INDIVIDUS DES ESPECES SUIVANTES: FLAMBOS D'EAU, FLAMBOS DE FOUDRE, FLAMBOS DE NEIGE, FLAMBOS DE GLACE, FLAMBOS NOIR ","JUMBO FLAMBOS","","RECOMPENSE: 60 BISTELLAS ",{"$f":"AND(Besaid!D5>=3,'Route de Myorocos'!D6>=3,'Route de Djose'!D7>=3,Macalania!D8>=3,'Plaine Félicité'!D6>=3,'Mont Gagazet'!D6>=3)","v":false},{"$f":"IF(E15=TRUE,1,0)","v":0},"NON",{"$f":"IF(G15=\"OUI\",1,0)","v":0}]
["EN VOILA UN QUI POSE REELLEMENT PROBLEME CAR IL EST IMMUNISE AUX ATTAQUES PHYSIQUES ET ABSORBE LES SORTS ELEMENTAIRES (QUI DE TOUTE FACON SONT RENVOYEES PAR SON BOOMERANG PERMANENT)! HEUREUSEMENT, IL Y A DEUX FACONS DE LE BATTRE. LA PREMIERE EST DE LANCER BOOMERANG SUR UN DE VOS EQUIPIERS AINSI QUE SOMNI QUI SE REFLETERA VERS LE FLAMBOS. UNE FOIS QU'IL EST RALENTI, UTILISEZ SORCELLERIE POUR LANCER DEUX FOIS ULTIMA VERS VOTRE ENNEMI. UTILISEZ ENSUITE \"IMITER\" POUR REPETER CETTE ACTION. SI VOUS NE DISPOSEZ PAS ENCORE D'ULTIMA, VOUS POUVEZ APPRENDRE LES SORTS BOOMERANG, SOMNI, DISSIPATION, BLINDAGE ET BOOSTER A ANIMA ET L'UTILISER. INVOQUEZ-LA ET LANCER BOOSTER, BLINDAGE PUIS BOOMERANG ET SOMNI SUR SON BOOMERANG POUR QUE LE SORT SE REFLETE VERS JUMBO FLAMBOS. ENSUITE, UTILISEZ LAMENTO ET DISSIPATION SI IL SE LANCE MISTRAL. "]
["CAPTUREZ 3 INDIVIDUS DES ESPECES SUIVANTES: ELEMENTAIRE JAUNE, ELEMENTAIRE BLANC, ELEMENTAIRE ROUGE, ELEMENTAIRE OR, ELEMENTAIRE BLEU, ELEMENTAIRE OBSCUR, ELEMENTAIRE NOIR ","NEGA ELEMENTAIRE","","60 RIDEAUX D'ETOILES ",{"$f":"AND(Kilika!D5>=3,'Route de Mi''ihen'!D7>=3,'Route de Myorocos'!D7>=3,'Plaine foudroyée'!D7>=3,Macalania!D9>=3,'Grotte du Priant Volé'!D6>=3,'Ruines d''Omega'!D6>=3)","v":false},{"$f":"IF(E17=TRUE,1,0)","v":0},"NON",{"$f":"IF(G17=\"OUI\",1,0)","v":0}]
["LA STRATEGIE EST LA MEME QUE CONTRE LE JUMBO FLAMBOS! NOTEZ QUE LUI N'EST PAS IMMUNISE AUX ATTAQUES PHYSIQUES MAIS IL LES CONTRE AVEC UN ULTIMA. LES OVERDRIVES SONT DONC RENTABLES A UTILISER CONTRE LUI. "]
["CAPTUREZ 3 INDIVIDUS DES ESPECES SUIVANTES: CUJO, BUNYIPS, MULFUS, MAFUT, SHRED, HAARMA ","TANKUJO","","99 SABLIERS D'OR ",{"$f":"AND('Route de Mi''ihen'!D8>=3,'Route de Djose'!D8>=3,Macalania!D10>=3,Macalania!D11>=3,'Plaine Félicité'!D7>=3,'Ruines d''Omega'!D7>=3)","v":false},{"$f":"IF(E19=TRUE,1,0)","v":0},"NON",{"$f":"IF(G19=\"OUI\",1,0)","v":0}]
["COMME SON NOM L'INDIQUE, TANKUJO EST PLUTOT TOURNE VERS LA DEFENSE. EN FAIT IL EST SURTOUT BON A ENCAISSER LES MAGIES D'ATTAQUE. AVEC LE SORT BOOSTER SUR VOS PERSONNAGES, IL N'AURA MEME PAS LE TEMPS DE JOUER (OU PEUT-ETRE UNE FOIS) . "]
["CAPTUREZ 4 INDIVIDUS DES ESPECES SUIVANTES: VOUIVRE, LAMASHTU, KISARIQUE, MUSHUSSU, NIDHOG ","FAFNIR","","99 SELS PURIFICATEURS ",{"$f":"AND('Route de Mi''ihen'!D9>=4,'Route de Myorocos'!D8>=4,'Plaine foudroyée'!D8>=4,Bikanel!D6>=4,'Grotte du Priant Volé'!D7>=4)","v":false},{"$f":"IF(E21=TRUE,1,0)","v":0},"NON",{"$f":"IF(G21=\"OUI\",1,0)","v":0}]
["LE PRINCIPAL DANGER DE FAFNIR EST LA \"TRIPEL ATTAQUE\" QU'IL LANCE A SON 2EME TOUR DE JEU. ELLE SE CARACTERISE PAR UNE ATTAQUE PHYSIQUE SUR UN PERSONNAGE, UNE ATTAQUE D'UN ELEMENT PRIS AU HASARD SUR TOUS LES PERSONNAGES ET D'UNE NOUVELLE ATTAQUE PHYSIQUE SUR UN PERSONNAGE. !UTILISEZ DES PROTECTIONS CONTRE LES SORTS OU BIEN BATTEZ-LE AVANT QUE CETTE ATTAQUE N'ARRIVE! "]
["CAPTUREZ 5 INDIVIDUS DES ESPECES SUIVANTES: FUNGUS, THORN, EXORAY ","SOPORICHAMP","","99 SOURCES REGENERANTES ",{"$f":"AND('Route de Myorocos'!D9>=5,'Grotte du Priant Volé'!D8>=5,Sin!D4>=5)","v":false},{"$f":"IF(E23=TRUE,1,0)","v":0},"NON",{"$f":"IF(G23=\"OUI\",1,0)","v":0}]
["SI VOUS NE POUVEZ PAS LE TOUCHER A 99 999 ET LE BATTRE EN UN COUP, IL VAUT MIEUX INVOQUER UNE CHIMERE AVANT QU'IL NE VOUS ENDORME ET NE COMMENCE A VOUS LANCER DES SORTS COMME ULTIMA. "]
["CAPTUREZ 5 INDIVIDUS DES ESPECES SUIVANTES: BOMBO, GRENADA, PYROBOLSE ","ATOMICO","","60 ETHERS + ",{"$f":"AND('Route de Mi''ihen'!D10>=5,'Mont Gagazet'!D7>=5,'Ruines d''Omega'!D8>=5)","v":false},{"$f":"IF(E25=TRUE,1,0)","v":0},"NON",{"$f":"IF(G25=\"OUI\",1,0)","v":0}]
["COMME TOUS LES MONSTRES DE TYPE BOMBE, IL GONFLE PROGRESSIVEMENT DURANT LE COMBAT ET A LA FIN, CONTRERA VOS ATTAQUES AVEC ULTIMA. UTILISEZ VOS OVERDRIVES POUR EN VENIR A BOUT RAPIDEMENT. "]
["CAPTUREZ 5 INDIVIDUS DES ESPECES SUIVANTES: BICORNE, VARAHA, GRENDEL ","JUGGERNAUT","","99 RIDEAUX DE LUMIERE ",{"$f":"AND('Route de Mi''ihen'!D11>=5,'Grotte du Priant Volé'!D9>=5,'Mont Gagazet'!D9>=5)","v":false},{"$f":"IF(E27=TRUE,1,0)","v":0},"NON",{"$f":"IF(G27=\"OUI\",1,0)","v":0}]
["JUGGERNAUT TAPE FORT, IL EST RESISTANT, IL A BEAUCOUP D'HP MAIS QU'EST-CE QU'IL EST LENT! LANCEZ BOOSTER X SUR VOTRE EQUIPE ET TAPEZ. IL N'AURA MEME PAS LE TEMPS DE VOUS ATTAQUER. "]
["CAPTUREZ 5 INDIVIDUS DES ESPECES SUIVANTES: EKARISSOR, GEMINI (LES DEUX TYPES) ","TITAN D'ACIER","","60 ONGUENTS MAGIQUES ",{"$f":"AND('Plaine foudroyée'!D10>=5,Sin!D6>=5,Sin!D7>=5)","v":false},{"$f":"IF(E29=TRUE,1,0)","v":0},"NON",{"$f":"IF(G29=\"OUI\",1,0)","v":0}]
["EN VOILA UN TRES ENNUYEUX. ILA A BEAUCOUP D'HP, UNE RESISTANCE AUX DOMMAGES PHYSIQUES ET CONTRERA TOUTES VOS ATTAQUES. SI VOTRE EVASION EST ASSEZ HAUTE, IL N'ARRIVERA PAS A VOUS TOUCHER ET VOUS POURREZ VOUS CONCENTRER SUR LES DOMMAGES A LUI INFLIGER. POUR CELA, ESSAYEZ L'OVERDRIVE D'AURON ERADICATION OU LA GRENADE ANTICHAR DE RIKKU. CES DEUX OVERDRIVES ONT DE GRANDES CHANCES D'INFLIGER TREPAN. ENSUITE, LANCEZ VOS AUTRES OVERDRIVES ET ATTAQUEZ POUR VENIR A BOUT DE CE MONSTRE."]
[null,null,null,"DISPONIBLES","NON DISPONIBLES",null,"FAIT",null,"NON FAIT"]
[null,null,null,{"$f":"SUM(F3:F30)","v":0},{"$f":"D34-D32","v":14},null,{"$f":"SUM(H3:H30)","v":0},null,{"$f":"D34-G32","v":14}]
[null,null,"%",{"$f":"D32/D34","v":0},{"$f":"1-D33","v":1},null,{"$f":"G32/D34","v":0}]
[null,null,"TOTAL",14]

{"sheet":"Monstres Originaux","index":5,"n_rows":24,"n_cols":22,"rows_kept":24,"cut":false,"hidden":false,"merged":[[0,0,0,6],[4,7,5,7],[6,7,7,7],[2,7,3,7],[3,0,3,6],[5,0,5,6],[7,0,7,6],[12,7,13,7],[14,7,15,7],[15,0,15,6],[13,0,13,6],[8,7,9,7],[10,7,11,7],[9,0,9,6],[11,0,11,6]]}
["MONSTRES ORIGINAUX",null,null,null,null,null,null,null,null,true,"OUI",false,"NON"]
["CONDITIONS D'OBTENTION","MONSTRE CREE","IMAGE","RECOMPENSE","DISPO","","FAIT",null,null,null,null,null,null,null,null,null,null,null,null,null,null,{"$f":"+UPPER(H2)","v":""}]
["DEBLOQUEZ 2 CREATURES DE LA CATEGORIE \"ZONES COMPLETES\" ","TERRAGLOUTON","","60 TRISTELLAS ",{"$f":"IF('Zones complètes'!$D$82>=2,TRUE,FALSE)","v":false},{"$f":"IF(E3=TRUE,1,0)","v":0},"NON",{"$f":"IF(G3=\"OUI\",1,0)","v":0}]
["LORSQU'IL EST DEBOUT, IL PEUT INFLIGER UNE ATTAQUE AYANT L'ALTERATION D'ETAT MORT A SON TOUR DE JEU OU EN CONTRANT VOS ATTAQUES PHYSIQUES. UNE FOIS QU'IL A PERDU 100 000 HP, IL TOMBE SUR LE DOS ET CONTRE VOS ATTAQUES AVEC ATOMNIUM DONT VOUS SURVIVREZ SANS PROBLEMES SI L'ESPRIT DE VOS PERSONNAGES EST AU-DESSUS DE 200. "]
["DEBLOQUEZ 2 CREATURES DES \"CATEGORIES COMPLETES\" ","SPHERE GEANTE","","60 MEGA MAGIKOROCS ",{"$f":"IF('Catégories Complètes'!$D$32>=2,TRUE,FALSE)","v":false},{"$f":"IF(E5=TRUE,1,0)","v":0},"NON",{"$f":"IF(G5=\"OUI\",1,0)","v":0}]
["ENCORE UN ENNEMI QUI CONTRE LES ATTAQUES. CETTE FOIS-CI C'EST UN AQUASOUFFLE QUI TUERA PRESQUE VOS PERSONNAGES MÊME AVEC DES CARACS A 255. LA MEILLEURE FAÇON DE LA BATTRE EST D'UTILISER LES OVERDRIVES COMBOS DE WAKKA ET ASSAUT DE TIDUS. SI LES DEUX SONT REUSSIES, VOUS AUREZ GAGNE LE COMBAT. "]
["DEBLOQUEZ 6 CREATURES DE LA CATEGORIE \"ZONES COMPLETES\" ","CATASTROPHE","","99 GRAINES DE SAGESSE ",{"$f":"IF('Zones complètes'!$D$82>=6,TRUE,FALSE)","v":false},{"$f":"IF(E7=TRUE,1,0)","v":0},"NON",{"$f":"IF(G7=\"OUI\",1,0)","v":0}]
["VOTRE ENNEMI COMMENCE LE COMBAT DANS SA CARAPACE ET N'EN SORTIRA QU'APRES AVOIR SUBI 500 000 DOMMAGES. LANCEZ BOOSTER X ET ATTAQUEZ POUR ESSAYER D'EVITER QU'IL NE VOUS LANCE POISON, CONFUSION ET FLEAU. UNE FOIS SORTI DE SA CARAPACE, IL PEUT LANCER QUART, MUCUS TOXIQUE QUI INFLIGE DECHEANCE OU BIEN PLUIE DE COUPS QUI, COMME SON NOM L'INDIQUE, LANCE DE NOMBREUX COUPS QUI TOUCHENT TOUS VOS PERSONNAGES. GARDEZ TOUJOURS VOS HP HAUTS EN PREVISION. "]
["DEBLOQUEZ 6 CREATURES DES \"CATEGORIES COMPLETES\" ","BRACHIORAIDOS","","99 LUEURS D'ESPOIR ",{"$f":"IF(E24+F24>=6,TRUE,FALSE)","v":false},{"$f":"IF(E9=TRUE,1,0)","v":0},"NON",{"$f":"IF(G9=\"OUI\",1,0)","v":0}]
["CE DRAGON GEANT DISPOSE DE 3 ATTAQUES PRINCIPALES: SEDAQUEUE, QU'IL UTILISE COMME CONTRE-ATTAQUE ET QUI DISSIPE TOUS LES EFFETS BENEFIQUES, PHOTON WING QUI INFLIGE FLEAU ET ENFIN SOUFFLE MAGIQUE QUI INFLIGE 99 999 DOMMAGES A UN PERSONNAGE PEU IMPORTE SES CARACS. VOS MEILLEURES ARMES SONT UNE NOUVELLE FOIS LES OVERDRIVES COMBOS, CHAMPION DE BLITZ ET CHAOS. "]
["CAPTUREZ 1 INDIVIDU DE CHAQUE ESPECE DE TOUTES LES ZONES ","NESLUG","","99 CLES DE LA VICTOIRE ",{"$f":"AND(Besaid!D3>=1,Besaid!D4>=1,Besaid!D5>=1,Kilika!D3>=1,Kilika!D4>=1,Kilika!D5>=1,Kilika!D6>=1,'Route de Mi''ihen'!D4>=1,'Route de Mi''ihen'!D5>=1,'Route de Mi''ihen'!D6>=1,'Route de Mi''ihen'!D7>=1,'Route de Mi''ihen'!D8>=1,'Route de Mi''ihen'!D9>=1,'Route de Mi''ihen'!D10>=1,'Route de Mi''ihen'!D11>=1,'Route de Myorocos'!D4>=1,'Route de Myorocos'!D5>=1,'Route de Myorocos'!D6>=1,'Route de Myorocos'!D7>=1,'Route de Myorocos'!D8>=1,'Route de Myorocos'!D9>=1,'Route de Myorocos'!D10>=1,'Route de Djose'!D4>=1,'Route de Djose'!D5>=1,'Route de Djose'!D6>=1,'Route de Djose'!D7>=1,'Route de Djose'!D8>=1,'Route de Djose'!D9>=1,'Route de Djose'!D10>=1,'Plaine foudroyée'!D4>=1,'Plaine foudroyée'!D5>=1,'Plaine foudroyée'!D6>=1,'Plaine foudroyée'!D7>=1,'Plaine foudroyée'!D8>=1,'Plaine foudroyée'!D9>=1,'Plaine foudroyée'!D10>=1,'Plaine foudroyée'!D11>=1,Macalania!D4>=1,Macalania!D5>=1,Macalania!D6>=1,Macalania!D7>=1,Macalania!D8>=1,Macalania!D9>=1,Macalania!D10>=1,Macalania!D11>=1,Macalania!D12>=1,Macalania!D13>=1,Bikanel!D4>=1,Bikanel!D5>=1,Bikanel!D6>=1,Bikanel!D7>=1,Bikanel!D8>=1,Bikanel!D9>=1,'Plaine Félicité'!D4>=1,'Plaine Félicité'!D5>=1,'Plaine Félicité'!D6>=1,'Plaine Félicité'!D7>=1,'Plaine Félicité'!D8>=1,'Plaine Félicité'!D9>=1,'Plaine Félicité'!D10>=1,'Plaine Félicité'!D11>=1,'Plaine Félicité'!D12>=1,'Grotte du Priant Volé'!D4>=1,'Grotte du Priant Volé'!D5>=1,'Grotte du Priant Volé'!D6>=1,'Grotte du Priant Volé'!D7>=1,'Grotte du Priant Volé'!D8>=1,'Grotte du Priant Volé'!D9>=1,'Grotte du Priant Volé'!D10>=1,'Grotte du Priant Volé'!D11>=1,'Grotte du Priant Volé'!D12>=1,'Mont Gagazet'!D4>=1,'Mont Gagazet'!D5>=1,'Mont Gagazet'!D6>=1,'Mont Gagazet'!D7>=1,'Mont Gagazet'!D8>=1,'Mont Gagazet'!D9>=1,'Mont Gagazet'!D10>=1,'Mont Gagazet'!D11>=1,'Mont Gagazet'!D12>=1,'Mont Gagazet'!D13>=1,'Mont Gagazet'!D14>=1,'Mont Gagazet'!D15>=1,Sin!D4>=1,Sin!D5>=1,Sin!D6>=1,Sin!D7>=1,Sin!D8>=1,Sin!D9>=1,Sin!D10>=1,Sin!D11>=1,Sin!D12>=1,'Ruines d''Omega'!D4>=1,'Ruines d''Omega'!D5>=1,'Ruines d''Omega'!D6>=1,'Ruines d''Omega'!D7>=1,'Ruines d''Omega'!D8>=1,'Ruines d''Omega'!D9>=1,'Ruines d''Omega'!D10>=1,'Ruines d''Omega'!D11>=1,'Ruines d''Omega'!D12>=1,'Ruines d''Omega'!D13>=1)","v":false},{"$f":"IF(E11=TRUE,1,0)","v":0},"NON",{"$f":"IF(G11=\"OUI\",1,0)","v":0}]
["COMMENCEZ PAR LANCER BOOSTER X SUR VOS PERSONNAGES PUIS ATTAQUEZ. LORSQU'IL AURA PERDU 2 000 000 D'HP, NESLUG SE RAMASSERA DANS SA COQUILLE D'OÙ IL PEUT SE REGENERER. A CE MOMENT, IL EST IMMUNISE AUX ATTAQUES PHYSIQUES MAIS PAS AUX OVERDRIVES! UTILISEZ-LES POUR FAIRE PERDRE UN AUTRE MILLION D'HP A NESLUG ET DETRUIRE SA COQUILLE. IL NE VOUS RESTE PLUS ALORS QU'A LUI RETIRER SON DERNIER MILLION D'HP AVEC DES ATTAQUES PHYSIQUES OU DES OVERDRIVES. "]
["CAPTUREZ 5 INDIVIDUS DE CHAQUE ESPECE DE TOUTES LES ZONES ","ULTIMA BUSTER","","99 H-ESPACES ",{"$f":"AND(Besaid!D3>=5,Besaid!D4>=5,Besaid!D5>=5,Kilika!D3>=5,Kilika!D4>=5,Kilika!D5>=5,Kilika!D6>=5,'Route de Mi''ihen'!D4>=5,'Route de Mi''ihen'!D5>=5,'Route de Mi''ihen'!D6>=5,'Route de Mi''ihen'!D7>=5,'Route de Mi''ihen'!D8>=5,'Route de Mi''ihen'!D9>=5,'Route de Mi''ihen'!D10>=5,'Route de Mi''ihen'!D11>=5,'Route de Myorocos'!D4>=5,'Route de Myorocos'!D5>=5,'Route de Myorocos'!D6>=5,'Route de Myorocos'!D7>=5,'Route de Myorocos'!D8>=5,'Route de Myorocos'!D9>=5,'Route de Myorocos'!D10>=5,'Route de Djose'!D4>=5,'Route de Djose'!D5>=5,'Route de Djose'!D6>=5,'Route de Djose'!D7>=5,'Route de Djose'!D8>=5,'Route de Djose'!D9>=5,'Route de Djose'!D10>=5,'Plaine foudroyée'!D4>=5,'Plaine foudroyée'!D5>=5,'Plaine foudroyée'!D6>=5,'Plaine foudroyée'!D7>=5,'Plaine foudroyée'!D8>=5,'Plaine foudroyée'!D9>=5,'Plaine foudroyée'!D10>=5,'Plaine foudroyée'!D11>=5,Macalania!D4>=5,Macalania!D5>=5,Macalania!D6>=5,Macalania!D7>=5,Macalania!D8>=5,Macalania!D9>=5,Macalania!D10>=5,Macalania!D11>=5,Macalania!D12>=5,Macalania!D13>=5,Bikanel!D4>=5,Bikanel!D5>=5,Bikanel!D6>=5,Bikanel!D7>=5,Bikanel!D8>=5,Bikanel!D9>=5,'Plaine Félicité'!D4>=5,'Plaine Félicité'!D5>=5,'Plaine Félicité'!D6>=5,'Plaine Félicité'!D7>=5,'Plaine Félicité'!D8>=5,'Plaine Félicité'!D9>=5,'Plaine Félicité'!D10>=5,'Plaine Félicité'!D11>=5,'Plaine Félicité'!D12>=5,'Grotte du Priant Volé'!D4>=5,'Grotte du Priant Volé'!D5>=5,'Grotte du Priant Volé'!D6>=5,'Grotte du Priant Volé'!D7>=5,'Grotte du Priant Volé'!D8>=5,'Grotte du Priant Volé'!D9>=5,'Grotte du Priant Volé'!D10>=5,'Grotte du Priant Volé'!D11>=5,'Grotte du Priant Volé'!D12>=5,'Mont Gagazet'!D4>=5,'Mont Gagazet'!D5>=5,'Mont Gagazet'!D6>=5,'Mont Gagazet'!D7>=5,'Mont Gagazet'!D8>=5,'Mont Gagazet'!D9>=5,'Mont Gagazet'!D10>=5,'Mont Gagazet'!D11>=5,'Mont Gagazet'!D12>=5,'Mont Gagazet'!D13>=5,'Mont Gagazet'!D14>=5,'Mont Gagazet'!D15>=5,Sin!D4>=5,Sin!D5>=5,Sin!D6>=5,Sin!D7>=5,Sin!D8>=5,Sin!D9>=5,Sin!D10>=5,Sin!D11>=5,Sin!D12>=5,'Ruines d''Omega'!D4>=5,'Ruines d''Omega'!D5>=5,'Ruines d''Omega'!D6>=5,'Ruines d''Omega'!D7>=5,'Ruines d''Omega'!D8>=5,'Ruines d''Omega'!D9>=5,'Ruines d''Omega'!D10>=5,'Ruines d''Omega'!D11>=5,'Ruines d''Omega'!D12>=5,'Ruines d''Omega'!D13>=5)","v":false},{"$f":"IF(E13=TRUE,1,0)","v":0},"NON",{"$f":"IF(G13=\"OUI\",1,0)","v":0}]
["COMMENCEZ PAR LES PREPARATIFS HABITUELS: BOOSTER, AUREOLE ETC. CE COMBAT SE DEROULE A LA MANIERE DU COMBAT CONTRE GHI A LA ROUTE DES MYOROCS. VOUS DEVEZ ATTAQUER LES BRAS (QUI DISPOSENT DE 80 000 HP CHACUN) POUR EVITER QU'ILS NE PROTEGENT LE TORSE. LORSQUE C'EST FAIT, UTILISEZ VOS MEILLEURES ATTAQUES POUR INFLIGER UN MAXIMUM DE DOMMAGES AU TORSE. SI LA TÊTE SE MET A BOUGER BIZARREMENT, LANCEZ-LUI UN BON SORT POUR LA CALMER. SI VOUS AVEZ PARCOURU TOUT LE LE SPHERIER AVEC YUNA, LES SOEURS MAGUS SE REVELERONT TRES EFFICACES CONTRE ULTIMA BUSTER. NOTEZ QU'A PARTIR DU MOMENT OÙ VOUS L'AVEZ BATTU, VOUS POUVEZ ACHETER DES SPHERES D'ANNULATION QUI PERMETTENT D'EFFACER UNE SPHERE DU SPHERIER. "]
["CAPTUREZ 2 INDIVIDUS DES ESPECES SUIVANTES: SERRASALMUS, ACHELUS, BARRACUDA CORNU ","SHINRYU","","30 MAGALIXIRS ",{"$f":"AND('Mont Gagazet'!D13>=2,'Mont Gagazet'!D14>=2,'Mont Gagazet'!D15>=2)","v":false},{"$f":"IF(E15=TRUE,1,0)","v":0},"NON",{"$f":"IF(G15=\"OUI\",1,0)","v":0}]
["CE COMBAT SE DEROULANT SOUS L'EAU, SEULS RIKKU, WAKKA ET TIDUS PEUVENT COMBATTRE. SA SEULE VRAIE ATTAQUE DANGEREUSE EST LE REGARD PETRIFIANT QUI PETRIFIE ET FAIT DISPARAÎTRE UN PERSONNAGE. HEUREUSEMENT, IL CESSE DE L'UTILISER QUAND IL NE RESTE PLUS QU'UN PERSONNAGE. CE SONT ENCORE UNE FOIS VOS OVERDRIVES QUI FERONT TOUT LE TRAVAIL ICI!"]
[null,null,null,"DISPONIBLES","NON DISPONIBLES",null,"FAIT",null,"NON FAIT"]
[null,null,null,{"$f":"SUM(F3:F16)","v":0},{"$f":"+D20-D18","v":7},null,{"$f":"+SUM(H3:H16)","v":0},null,{"$f":"D20-G18","v":7}]
[null,null,"%",{"$f":"+D18/D20","v":0},null,null,{"$f":"+G18/D20","v":0}]
[null,null,"TOTAL",7]
[]
[]
[]
[null,null,null,null,{"$f":"COUNTIF(E10:E16,\"VRAI\")","v":0},{"$f":"+COUNTIF(E3:E7,\"VRAI\")","v":0}]

{"sheet":"Besaid","index":6,"n_rows":6,"n_cols":6,"rows_kept":6,"cut":false,"hidden":false,"merged":[[0,1,0,5]]}
[null,"BESAID"]
[null,"NOM DU MONSTRE","IMAGE","NBRE DE CAPTURE","RESTE","TOTAL ATTEINT"]
[null,"DINGO",null,5,{"$f":"IF(D3<=10,10-D3,0)","v":5},{"$f":"IF(D3<10,\"NON\",\"OUI\")","v":"NON"}]
[null,"CONDOR",null,0,{"$f":"IF(D4<=10,10-D4,0)","v":10},{"$f":"IF(D4<10,\"NON\",\"OUI\")","v":"NON"}]
[null,"FLAMBOS D'EAU",null,0,{"$f":"IF(D5<=10,10-D5,0)","v":10},{"$f":"IF(D5<10,\"NON\",\"OUI\")","v":"NON"}]
[null,"TOTAL",null,{"$f":"SUM(D3:D5)","v":5},{"$f":"SUM(E3:E5)","v":25},{"$f":"AND(D3>=10,D4>=10,D5>=10)","v":false}]

{"sheet":"Kilika","index":7,"n_rows":7,"n_cols":6,"rows_kept":7,"cut":false,"hidden":false,"merged":[[0,1,0,5]]}
[null,"KILIKA"]
[null,"NOM DU MONSTRE","IMAGE","NBRE DE CAPTURE","RESTE","TOTAL ATTEINT"]
[null,"DIONYX",null,0,{"$f":"IF(D3<=10,10-D3,0)","v":10},{"$f":"IF(D3<10,\"NON\",\"OUI\")","v":"NON"}]
[null,"ABEILLE TUEUSE",null,0,{"$f":"IF(D4<=10,10-D4,0)","v":10},{"$f":"IF(D4<10,\"NON\",\"OUI\")","v":"NON"}]
[null,"ELÉMENTAIRE JAUNE",null,0,{"$f":"IF(D5<=10,10-D5,0)","v":10},{"$f":"IF(D5<10,\"NON\",\"OUI\")","v":"NON"}]
[null,"BALSAMINE",null,0,{"$f":"IF(D6<=10,10-D6,0)","v":10},{"$f":"IF(D6<10,\"NON\",\"OUI\")","v":"NON"}]
[null,"TOTAL",null,{"$f":"SUM(D2:D6)","v":0},{"$f":"SUM(E3:E6)","v":40},{"$f":"AND(D3>=10,D4>=10,D5>=10,D6>=10)","v":false}]

{"sheet":"Route de Mi'ihen","index":8,"n_rows":12,"n_cols":6,"rows_kept":12,"cut":false,"hidden":false,"merged":[[1,1,1,5],[0,1,0,5]]}
[null,"ROUTE DE MI'IHEN"]
[null,"VOUS POURREZ TROUVER TOUS LES MONSTRES DANS LA PARTIE AU NORD DU COMPTOIR DE RIN ET DANS L'ANCIENNE ROUTE. LES FLAMBOS DE FOUDRE SONT COMPTABILISES POUR LA ROUTE DE MYOROCS."]
[null,"NOM DU MONSTRE","IMAGE","NBRE DE CAPTURE","RESTE","TOTAL ATTEINT"]
[null,"CHIEN DE MI'IHEN",null,0,{"$f":"IF(D4<=10,10-D4,0)","v":10},{"$f":"IF(D4<10,\"NON\",\"OUI\")","v":"NON"}]
[null,"IPIRIA",null,0,10,"NON"]
[null,"ŒIL FLOTTANT",null,0,10,"NON"]
[null,"ELÉMENTAIRE BLANC",null,0,10,"NON"]
[null,"CUJO",null,0,10,"NON"]
[null,"VOUIVRE",null,0,10,"NON"]
[null,"BOMBO",null,0,10,"NON"]
[null,"BICORNE",null,0,10,"NON"]
[null,"TOTAL",null,{"$f":"SUM(D4:D11)","v":0},{"$f":"SUM(E4:E11)","v":80},{"$f":"AND(D4>=10,D5>=10,D6>=10,D7>=10,D8>=10,D9>=10,D10>=10,D11>=10)","v":false}]

{"sheet":"Route de Myorocos","index":9,"n_rows":11,"n_cols":6,"rows_kept":11,"cut":false,"hidden":false,"merged":[[0,1,0,5],[1,1,1,5]]}
[null,"ROUTE DE MYOROCOS"]
[null,"VOUS TROUVEREZ LA MAJORITEDES CREATURES DANS LA ZONE APPELEE \"VALLEE\". POUR LES FLAMBOS DE FOUDRE, LE PLUS SIMPLE EST DE CHERCHER SUR L'ANCIENNE ROUTE DE MI'IHEN."]
[null,"NOM DU MONSTRE","IMAGE","NBRE DE CAPTURE","RESTE","TOTAL ATTEINT"]
[null,"RAPTOUR",null,0,{"$f":"IF(D4<=10,10-D4,0)","v":10},{"$f":"IF(D4<10,\"NON\",\"OUI\")","v":"NON"}]
[null,"GANDHARVA",null,0,10,"NON"]
[null,"FLAMBOS DE FOUDRE",null,0,10,"NON"]
[null,"ELÉMENTAIRE ROUGE",null,0,10,"NON"]
[null,"LAMASHTU",null,0,10,"NON"]
[null,"FUNGUS",null,0,10,"NON"]
[null,"GARUDA",null,0,10,"NON"]
[null,"TOTAL",null,{"$f":"SUM(D4:D10)","v":0},{"$f":"SUM(E4:E10)","v":70},{"$f":"AND(D4>=10,D5>=10,D6>=10,D7>=10,D8>=10,D9>=10,D10>=10)","v":false}]

{"sheet":"Route de Djose","index":10,"n_rows":11,"n_cols":6,"rows_kept":11,"cut":false,"hidden":false,"merged":[[0,1,0,5],[1,1,1,5]]}
[null,"ROUTE DE DJOSE"]
[null,"LES MONSTRES A CAPTURER SE SITUENT DANS LA MOITIE NORD DE LA ROUTE ET SUR LA ROUTE MENANT AU SELENOS."]
[null,"NOM DU MONSTRE","IMAGE","NBRE DE CAPTURE","RESTE","TOTAL ATTEINT"]
[null,"GAROUM",null,0,{"$f":"IF(D4<=10,10-D4,0)","v":10},{"$f":"IF(D4<10,\"NON\",\"OUI\")","v":"NON"}]
[null,"SIMURGH",null,0,10,"NON"]
[null,"ELMIDEA",null,0,10,"NON"]
[null,"FLAMBOS DE NEIGE",null,0,10,"NON"]
[null,"BUNYIPS",null,0,10,"NON"]
[null,"BASILIK",null,0,10,"NON"]
[null,"OCHU",null,0,10,"NON"]
[null,"TOTAL",null,{"$f":"SUM(D4:D10)","v":0},{"$f":"SUM(E4:E10)","v":70},{"$f":"AND(D4>=10,D5>=10,D6>=10,D7>=10,D8>=10,D9>=10,D10>=10)","v":false}]

{"sheet":"Plaine foudroyée","index":11,"n_rows":12,"n_cols":6,"rows_kept":12,"cut":false,"hidden":false,"merged":[[0,1,0,5],[1,1,1,5]]}
[null,"PLAINE FOUDROYEE"]
[null,"LES EKARISSORS NE SE TROUVENT QUE DANS LA PARTIE NORD DE LA PLAINE. EXAMINEZ LES PIERRES DE PAMPAS POUR QUE CEUX-CI APPARAISSENT PLUS FREQUEMMENT."]
[null,"NOM DU MONSTRE","IMAGE","NBRE DE CAPTURE","RESTE","TOTAL ATTEINT"]
[null,"MELUSINE",null,0,{"$f":"IF(D4<=10,10-D4,0)","v":10},{"$f":"IF(D4<10,\"NON\",\"OUI\")","v":"NON"}]
[null,"AROJ",null,0,10,"NON"]
[null,"BUER",null,0,10,"NON"]
[null,"ELEMENTAIRE OR",null,0,10,"NON"]
[null,"KISARIQUE",null,0,10,"NON"]
[null,"LARVA",null,0,10,"NON"]
[null,"EKARISSOR",null,0,10,"NON"]
[null,"PAMPA ?",null,0,10,"NON"]
[null,"TOTAL",null,{"$f":"SUM(D4:D11)","v":0},{"$f":"SUM(E4:E11)","v":80},{"$f":"AND(D4>=10,D5>=10,D6>=10,D7>=10,D8>=10,D9>=10,D10>=10,D11>=10)","v":false}]

{"sheet":"Macalania","index":12,"n_rows":14,"n_cols":6,"rows_kept":14,"cut":false,"hidden":false,"merged":[[0,1,0,5],[1,1,1,5]]}
[null,"MACALANIA"]
[null,"LES LOUPS DES NEIGES, LES FLAMBOS DE NEIGE, LES MAFTUS ET LES YEUX DEMONIAQUES ERRENT DANS LES ZONES DU LAC. LES AUTRES SE TROUVENT DANS LA FORET."]
[null,"NOM DU MONSTRE","IMAGE","NBRE DE CAPTURE","RESTE","TOTAL ATTEINT"]
[null,"LOUP DES NEIGES",null,0,{"$f":"IF(D4<=10,10-D4,0)","v":10},{"$f":"IF(D4<10,\"NON\",\"OUI\")","v":"NON"}]
[null,"IGUANOR",null,0,10,"NON"]
[null,"GUEPE",null,0,10,"NON"]
[null,"OEIL DEMONIAQUE",null,0,10,"NON"]
[null,"FLAMBOS DE GLACE",null,0,10,"NON"]
[null,"ELEMENTAIRE BLEU",null,0,10,"NON"]
[null,"MULFUS",null,0,10,"NON"]
[null,"MAFUT",null,0,10,"NON"]
[null,"KOOSPOS",null,0,10,"NON"]
[null,"CHIMAIRA",null,0,10,"NON"]
[null,"TOTAL",null,{"$f":"SUM(D4:D13)","v":0},{"$f":"SUM(E4:E13)","v":100},{"$f":"AND(D4>=10,D5>=10,D6>=10,D7>=10,D8>=10,D9>=10,D10>=10,D11>=10,D12>=10,D13>=10)","v":false}]

{"sheet":"Bikanel","index":13,"n_rows":10,"n_cols":6,"rows_kept":10,"cut":false,"hidden":false,"merged":[[0,1,0,5],[1,1,1,5]]}
[null,"BIKANEL"]
[null,"VOUS TROUVEREZ PLUS FACILEMENT DES PAMPAS APRES AVOIR ACCOMPLI LA QUETE DU VILLAGE DES PAMPAS. CAPTURER LES MONSTRES DE LA ZONE EN FAISANT LA QUETE EST UN BON MOYEN DE TOUS LES COLLECTER."]
[null,"NOM DU MONSTRE","IMAGE","NBRE DE CAPTURE","RESTE","TOTAL ATTEINT"]
[null,"LOUP DES SABLES",null,0,{"$f":"IF(D4<=10,10-D4,0)","v":10},{"$f":"IF(D4<10,\"NON\",\"OUI\")","v":"NON"}]
[null,"ALCYON",null,0,10,"NON"]
[null,"MUSHUSSU",null,0,10,"NON"]
[null,"ZU",null,0,10,"NON"]
[null,"VER DES SABLES",null,0,10,"NON"]
[null,"PAMPA",null,0,10,"NON"]
[null,"TOTAL",null,{"$f":"SUM(D4:D9)","v":0},{"$f":"SUM(E4:E9)","v":60},{"$f":"AND(D4>=10,D5>=10,D6>=10,D7>=10,D8>=10,D9>=10)","v":false}]

{"sheet":"Plaine Félicité","index":14,"n_rows":13,"n_cols":6,"rows_kept":13,"cut":false,"hidden":false,"merged":[[0,1,0,5],[1,1,1,5]]}
[null,"PLAINE FELICITEE"]
[null,"LES XYLOMIDS ET LES KIMAIRAS ERRENT DANS LA PARTIE NORD-OUEST DE LA PLAINE."]
[null,"NOM DU MONSTRE","IMAGE","NBRE DE CAPTURE","RESTE","TOTAL ATTEINT"]
[null,"LYCAON",null,0,{"$f":"IF(D4<=10,10-D4,0)","v":10},{"$f":"IF(D4<10,\"NON\",\"OUI\")","v":"NON"}]
[null,"NEBIROS",null,0,10,"NON"]
[null,"FLAMBOS DE FEU",null,0,10,"NON"]
[null,"SHRED",null,0,10,"NON"]
[null,"VIPERE-MEDUSE",null,0,10,"NON"]
[null,"OGRE",null,0,10,"NON"]
[null,"COUGAR",null,0,10,"NON"]
[null,"KIMAIRA",null,0,10,"NON"]
[null,"XYLOMID",null,0,10,"NON"]
[null,"TOTAL",null,{"$f":"SUM(D4:D12)","v":0},{"$f":"SUM(E4:E12)","v":90},{"$f":"AND(D4>=10,D5>=10,D6>=10,D7>=10,D8>=10,D9>=10,D10>=10,D11>=10,D12>=10)","v":false}]

{"sheet":"Grotte du Priant Volé","index":15,"n_rows":13,"n_cols":6,"rows_kept":13,"cut":false,"hidden":false,"merged":[[1,1,1,5],[0,1,0,5]]}
[null,"GROTTE DU PRIANT VOLE"]
[null,"LES TOMBERRYS SONT ASSEZ RARES. ILS SE CONCENTRENT SURTOUT AU BOUT DU 2EME ENBRANCHEMENT VERS L'EST, LA OU LA LUMIERE EST VERDATRE."]
[null,"NOM DU MONSTRE","IMAGE","NBRE DE CAPTURE","RESTE","TOTAL ATTEINT"]
[null,"YOWIE",null,0,{"$f":"IF(D4<=10,10-D4,0)","v":10},{"$f":"IF(D4<10,\"NON\",\"OUI\")","v":"NON"}]
[null,"GALKIMASERA",null,0,10,"NON"]
[null,"ELEMENTAIRE OBSCUR",null,0,10,"NON"]
[null,"NIDHOG",null,0,10,"NON"]
[null,"THORN",null,0,10,"NON"]
[null,"VARAHA",null,0,10,"NON"]
[null,"EPEHJ",null,0,10,"NON"]
[null,"FANTOME",null,0,10,"NON"]
[null,"TOMBERRY",null,0,10,"NON"]
[null,"TOTAL",null,{"$f":"SUM(D4:D12)","v":0},{"$f":"SUM(E4:E12)","v":90},{"$f":"AND(D4>=10,D5>=10,D6>=10,D7>=10,D8>=10,D9>=10,D10>=10,D11>=10,D12>=10)","v":false}]

{"sheet":"Mont Gagazet","index":16,"n_rows":16,"n_cols":6,"rows_kept":16,"cut":false,"hidden":false,"merged":[[1,1,1,5],[0,1,0,5]]}
[null,"MONT GAGAZET"]
[null,"VOUS TROUVEREZ LES BANDERSNATCH, LES GRENADA, LES ORCHIDA ET LES ASHERAH SUR LA PISTE. LES AUTRES ESPECES RODENT DANS LE GOTTE. VOUS EN TROUVEREZ CERTAINES DANS LES RUINES DE ZANARKAND EGALEMENT."]
[null,"NOM DU MONSTRE","IMAGE","NBRE DE CAPTURE","RESTE","TOTAL ATTEINT"]
[null,"BANDERSNATCH",null,0,{"$f":"IF(D4<=10,10-D4,0)","v":10},{"$f":"IF(D4<10,\"NON\",\"OUI\")","v":"NON"}]
[null,"AHRIMAN",null,0,10,"NON"]
[null,"FLAMBOS NOIR",null,0,10,"NON"]
[null,"GRENADA",null,0,10,"NON"]
[null,"ORCHIDA",null,0,10,"NON"]
[null,"GRENDEL",null,0,10,"NON"]
[null,"ASHERAH",null,0,10,"NON"]
[null,"MANDRAGORE",null,0,10,"NON"]
[null,"BEHEMOTH",null,0,10,"NON"]
[null,"SERRASALMUS",null,0,10,"NON"]
[null,"ACHELUS",null,0,10,"NON"]
[null,"BARRACUDA CORNU",null,0,10,"NON"]
[null,"TOTAL",null,{"$f":"SUM(D4:D15)","v":0},{"$f":"SUM(E4:E15)","v":120},{"$f":"AND(D4>=10,D5>=10,D6>=10,D7>=10,D8>=10,D9>=10,D10>=10,D11>=10,D12>=10,D13>=10,D14>=10,D15>=10)","v":false}]

{"sheet":"Sin","index":17,"n_rows":13,"n_cols":6,"rows_kept":13,"cut":false,"hidden":false,"merged":[[1,1,1,5],[0,1,0,5]]}
[null,"SIN"]
[null,"VOUS TROUVEREZ LES BARBATOS DANS LA ZONE APPELEE CITE ONIRIQUE. NOTEZ QUE LES GEMINI SONT TOUJOURS ENSEMBLE."]
[null,"NOM DU MONSTRE","IMAGE","NBRE DE CAPTURE","RESTE","TOTAL ATTEINT"]
[null,"EXORAY",null,0,{"$f":"IF(D4<=10,10-D4,0)","v":10},{"$f":"IF(D4<10,\"NON\",\"OUI\")","v":"NON"}]
[null,"SPECTRE",null,0,10,"NON"]
[null,"GEMINI 1",null,0,10,"NON"]
[null,"GEMINI 2",null,0,10,"NON"]
[null,"DEMONOLITHE",null,0,10,"NON"]
[null,"MORBOL",null,0,10,"NON"]
[null,"BARBATOS",null,0,10,"NON"]
[null,"ADAMANKHELONE",null,0,10,"NON"]
[null,"MEGA BEHEMOTH",null,0,10,"NON"]
[null,"TOTAL",null,{"$f":"SUM(D4:D12)","v":0},{"$f":"SUM(E4:E12)","v":90},{"$f":"AND(D4>=10,D5>=10,D6>=10,D7>=10,D8>=10,D9>=10,D10>=10,D11>=10,D12>=10)","v":false}]

{"sheet":"Ruines d'Omega","index":18,"n_rows":14,"n_cols":6,"rows_kept":14,"cut":false,"hidden":false,"merged":[[1,1,1,5],[0,1,0,5]]}
[null,"RUINES D'OMEGA"]
[null,"LES TOMBERRYS ET LE VARUNAS SONT UN PEU PLUS RARES QUE LES AUTRES. TOUTES LES ESPECES PEUVENT APPARAITRE DANS LA PREMIERE PARTIE DES RUINES AVEC EN PLUS DES ADAMANKHELONE, DES DEMONOLITHES DES SPECTRES ET DES MORBOLS COMPTABILISES DANS LA ZONE DE SIN."]
[null,"NOM DU MONSTRE","IMAGE","NBRE DE CAPTURE","RESTE","TOTAL ATTEINT"]
[null,"ZAURUS",null,0,{"$f":"IF(D4<=10,10-D4,0)","v":10},{"$f":"IF(D4<10,\"NON\",\"OUI\")","v":"NON"}]
[null,"OEIL DE LA MORT",null,0,10,"NON"]
[null,"ELEMENTAIRE NOIR",null,0,10,"NON"]
[null,"HAARMA",null,0,10,"NON"]
[null,"PYROBOLSE",null,0,10,"NON"]
[null,"ESPRIT",null,0,10,"NON"]
[null,"METILLE",null,0,10,"NON"]
[null,"MAITRE COUGAR",null,0,10,"NON"]
[null,"TOMBERRY NION",null,0,10,"NON"]
[null,"VARUNA",null,0,10,"NON"]
[null,"TOTAL",null,0,90,false]