{"text_format":"1","workbook":"xlsx","n_sheets":15,"sheets":["Données","Exemple","Bilan 14","Jan 14","Fév 14","Mars 14","Avril14","Mai 14","Juin 14","Juill 14","Août 14","Sept 14","Oct 14","Nov 14","Déc 14"],"not_rendered":{"charts":0,"images":2,"macros":1,"external_links":0,"defined_names":108,"comments":13,"pivot_tables":0},"unopened":[],"bounds":{"document_bytes":16777216,"sheet_cells":100000,"rows_first":2000,"rows_last":500,"rows_between":2000,"halvings":0,"cell_chars":16384,"cell_head_chars":4096},"cells_cut":0,"cells_raw":0,"read":"whole","date_system":"1900"}

{"sheet":"Données","index":0,"n_rows":103,"n_cols":26,"rows_kept":103,"cut":false,"hidden":false,"merged":[[4,2,4,5]]}
[null,null,"Heure début <",null,null,null,null,null,"CP","2015-06-01","2015-05-31"]
[null,"Midi",0.48958333333333331,null,null,null,null,null,null,{"$f":"DATEDIF(J3,K3,\"m\")*2.08","v":104},null,null,null,null,null,null,null,null,"TRUC POUR CORRIGER LA SOMME DES HEURES",null,null,null,null,null,null,"[h]:mm"]
[null,"Soir",0.78125,null,null,null,null,null,null,"2011-09-12",{"$f":"TODAY()","v":"2015-12-02"}]
[null,null,null,null,null,null,null,null,null,null,null,null,null,null,null,null,null,null,"."]
[null,"Taux horaire","Pour",null,null,null,null,null,null,"période d'acquisition des congés"]
[null,1,"=<",1.4583333333333333,null,null,null,null,null,"du 01/04/N au 31/03/N+1",null,null,null,null,null,null,null,null,"Tout est une question de format de cellules. Si vous utilisez le format de cellules suivant: [h]:mm, vous pourrez corriger le tir."]
[null,1.1000000000000001,"entre",1.4583333333333333,"et",1.625]
[null,1.2,"entre",1.625,"et",1.7916666666666667,null,null,null,"période de prise des congés",null,null,null,null,null,null,null,null,"."]
[null,1.4,">",1.7916666666666667,null,null,null,null,null,"du 01/05/N au 30/04/N+1"]
[null,null,null,null,null,null,null,null,null,null,null,null,null,null,null,null,null,null,"Pour modifier le format des cellules, sélectionnez d’abord la zone de données, cliquez à droite sur votre souris, choisissez l’option \"Format de cellules\" (\"Format Cells\") et cliquez sur \"Personnaliser\" (\"Custom\"). Entrez ensuite le format [h]:mm et cliquez sur OK."]
[null,"Entre soir et matin doit y avoir :",null,null,null,"11:00:00"]
[null,null,null,null,null,"00:00:00"]
[]
[null,"Année",5,null,null,"Mois",12,null,"Date",null,null,null,"Année"]
[1,2010,{"$f":"VLOOKUP(C14,A15:B103,2)","v":2014},null,1,"Janvier",{"$f":"VLOOKUP(G14,E15:F26,2)","v":"Décembre"},null,{"$f":"DATE(Exemple!$J$2,Exemple!$F$2,1)","v":"2014-12-01"},null,null,null,null,null,"1900-01-05",null,null,null,"."]
[2,2011,null,null,2,"Février",null,null,null,null,null,null,"Pâques","2015-04-05",{"$f":"ROUND(DATE(S_Année+2009,4,MOD(234-11*MOD(S_Année+2009,19),30))/7,0)*7-6","v":"2014-04-20"}]
[3,2012,null,null,3,"Mars",null,null,{"$f":"Exemple!B5","v":"2014-12-01"},null,null,null,"Pentecôte","2015-05-24",{"$f":"Pâques+49","v":"2014-06-08"}]
[4,2013,null,null,4,"Avril",null,null,null,null,null,null,"Jour de l'an","2015-01-01",{"$f":"DATE(S_Année+2009,1,1)","v":"2014-01-01"}]
[5,2014,null,null,5,"Mai",null,null,null,null,null,null,"Vendredi Saint","2015-04-03",{"$f":"Pâques-2","v":"2014-04-18"}]
[6,2015,null,null,6,"Juin",null,null,null,null,null,null,"Lundi de Pâques","2015-04-06",{"$f":"Pâques+1","v":"2014-04-21"}]
[7,2016,null,null,7,"Juillet",null,null,null,50,null,"REPOS","Fête du Travail","2015-05-01",{"$f":"DATE(S_Année+2009,5,1)","v":"2014-05-01"}]
[8,2017,null,null,8,"Août",null,null,null,42,null,"Récup","8 Mai 1945","2015-05-08",{"$f":"DATE(S_Année+2009,5,8)","v":"2014-05-08"}]
[9,2018,null,null,9,"Septembre",null,null,null,48,null,"JFG","Jeudi de l'Ascension","2015-05-14",{"$f":"Pâques+39","v":"2014-05-29"}]
[10,2019,null,null,10,"Octobre",null,null,null,44,null,"VAC","Lundi de Pentecôte","2015-05-25",{"$f":"Pâques+50","v":"2014-06-09"}]
[11,2020,null,null,11,"Novembre",null,null,null,3,null,"MAL","Fête Nationale","2015-07-14",{"$f":"DATE(S_Année+2009,7,14)","v":"2014-07-14"}]
[12,2021,null,null,12,"Décembre",null,null,null,{"$f":"CodeCouleur(K26)","v":2},null,"Travaillé","Assomption","2015-08-15",{"$f":"DATE(S_Année+2009,8,15)","v":"2014-08-15"}]
[13,2022,null,null,null,null,null,null,null,null,null,null,"La Toussaint","2015-11-01",{"$f":"DATE(S_Année+2009,11,1)","v":"2014-11-01"}]
[14,2023,null,null,null,null,null,null,null,null,null,null,"Armistice","2015-11-11",{"$f":"DATE(S_Année+2009,11,11)","v":"2014-11-11"}]
[15,2024,null,null,null,null,null,null,null,null,null,null,"Noël","2015-12-25",{"$f":"DATE(S_Année+2009,12,25)","v":"2014-12-25"}]
[16,2025,null,null,null,null,null,null,null,null,null,null,"Saint Etienne","2015-12-26",{"$f":"Noel+1","v":"2014-12-26"}]
[17,2026]
[18,2027]
[19,2028]
[20,2029]
[21,2030]
[22,2031]
[23,2032]
[24,2033]
[25,2034]
[26,2035,null,null,null,null,null,null,null,null,null,null,null,null,null,null,null,null,"."]
[27,2036]
[28,2037,null,null,null,null,null,null,null,null,null,null,null,null,null,null,null,null,"Résultat? Vos données seront converties dans un format compréhensible par Excel. Vous obtiendrez donc un total de 40 heures, tel que l’on pourrait s’y attendre."]
[29,2038]
[30,2039,null,null,null,null,null,null,null,null,null,null,null,null,null,null,null,null,"."]
[31,2040]
[32,2041]
[33,2042]
[34,2043]
[35,2044]
[36,2045]
[37,2046]
[38,2047]
[39,2048]
[40,2049]
[41,2050]
[42,2051]
[43,2052]
[44,2053]
[45,2054]
[46,2055]
[47,2056]
[48,2057]
[49,2058]
[50,2059]
[51,2060]
[52,2061]
[53,2062]
[54,2063]
[55,2064]
[56,2065]
[57,2066]
[58,2067]
[59,2068]
[60,2069]
[61,2070]
[62,2071]
[63,2072]
[64,2073]
[65,2074]
[66,2075]
[67,2076]
[68,2077]
[69,2078]
[70,2079]
[71,2080]
[72,2081]
[73,2082]
[74,2083]
[75,2084]
[76,2085]
[77,2086]
[78,2087]
[79,2088]
[80,2089]
[81,2090]
[82,2091]
[83,2092]
[84,2093]
[85,2094]
[86,2095]
[87,2096]
[88,2097]
[89,2098]

{"sheet":"Exemple","index":1,"n_rows":78,"n_cols":34,"rows_kept":78,"cut":false,"hidden":false,"merged":[[2,12,3,12],[4,1,4,2],[5,1,5,2],[6,1,6,2],[7,1,7,2],[2,9,3,9],[2,1,3,2],[2,3,2,4],[2,5,3,5],[2,6,3,6],[2,7,2,8],[24,1,24,2],[25,1,25,2],[26,1,26,2],[9,1,9,2],[10,1,10,2],[11,1,11,3],[19,1,19,3],[0,3,0,9],[2,10,3,10],[50,1,50,2],[44,1,44,2],[45,1,45,2],[46,1,46,2],[47,1,47,2],[48,1,48,2],[12,1,12,2],[13,1,13,2],[8,1,8,2],[17,1,17,2],[18,1,18,2],[14,1,14,2],[15,1,15,2],[16,1,16,2],[59,0,59,1],[27,1,27,3],[35,1,35,3],[43,1,43,3],[38,1,38,2],[39,1,39,2],[29,1,29,2],[49,1,49,2],[30,1,30,2],[40,1,40,2],[31,1,31,2],[32,1,32,2],[0,18,0,21],[0,30,0,32],[2,11,3,11],[108,5,108,8],[20,1,20,2],[21,1,21,2],[22,1,22,2],[23,1,23,2],[28,1,28,2],[41,1,41,2],[42,1,42,2],[37,1,37,2],[36,1,36,2],[33,1,33,2],[34,1,34,2],[51,1,51,3]]}
[null,null,null,"TEMPS DE TRAVAIL",null,null,null,null,null,null,null,null,null,null,null,null,null,null,"RÉCAPITULATIF",null,null,null,null,null,null,null,null,null,null,null,"IMPÔTS"]
[null,null,null,null,null,{"$f":"Données!G14","v":12},null,null,null,{"$f":"Données!C15","v":2014}]
[null,"Jour",null,"Midi",null,"Cumul Midi","Repas","Soir",null,"Cumul Soir","Repas","Totaux","Total Repas"]
[null,null,null,"Début","Fin",null,null,"Début","Fin",null,null,null,null,null,null,null,null,null,null,null,null,null,null,null,null,null,null,null,null,null,null,{"$f":"VLOOKUP(F2,Données!E15:F26,2)","v":"Décembre"},{"$f":"J2","v":2014}]
[null,{"$f":"Données!I15-WEEKDAY(Données!I15-1)+1","v":"2014-12-01"},null,null,null,{"$f":"$E5-$D5+IF($D5>$E5,1)","v":0},{"$f":"IF($D5<>\"\",IF($D5<Données!$C$2,1,0),0)","v":0},null,null,{"$f":"$I5-$H5+IF($H5>$I5,1)","v":0},{"$f":"IF($H5<>\"\",IF($H5<Données!$C$3,1,0),0)","v":0},{"$f":"$F5+$J5-($G5+$K5)*(\"00:30\")","v":0},{"$f":"$G5+$K5","v":0}]
[null,{"$f":"B5+1","v":"2014-12-02"},null,null,null,{"$f":"$E6-$D6+IF($D6>$E6,1)","v":0},{"$f":"IF($D6<>\"\",IF($D6<Données!$C$2,1,0),0)","v":0},null,null,{"$f":"$I6-$H6+IF($H6>$I6,1)","v":0},{"$f":"IF($H6<>\"\",IF($H6<Données!$C$3,1,0),0)","v":0},{"$f":"$F6+$J6-($G6+$K6)*(\"00:30\")","v":0},{"$f":"$G6+$K6","v":0},{"$f":"$D6-$I5+IF($I5>$D6,1)","v":0},{"$f":"IF($N6=Données!$F$12,0,IF($N6<Données!$F$11,1,0))","v":0},null,null,null,"Soit au total pour le mois de :",null,{"$f":"VLOOKUP(F2,Données!E15:F26,2)","v":"Décembre"},{"$f":"J2","v":2014}]
[null,{"$f":"B6+1","v":"2014-12-03"},null,null,null,0,{"$f":"IF($D7<>\"\",IF($D7<Données!$C$2,1,0),0)","v":0},null,null,0,{"$f":"IF($H7<>\"\",IF($H7<Données!$C$3,1,0),0)","v":0},0,0,{"$f":"$D7-$I6+IF($I6>$D7,1)","v":0},{"$f":"IF($N7=Données!$F$12,0,IF($N7<Données!$F$11,1,0))","v":0}]
[null,"2014-12-04",null,null,null,0,{"$f":"IF($D8<>\"\",IF($D8<Données!$C$2,1,0),0)","v":0},null,null,0,{"$f":"IF($H8<>\"\",IF($H8<Données!$C$3,1,0),0)","v":0},0,0,{"$f":"$D8-$I7+IF($I7>$D8,1)","v":0},{"$f":"IF($N8=Données!$F$12,0,IF($N8<Données!$F$11,1,0))","v":0},null,null,null,null,null,null,null,null,null,null,null,null,null,null,null,"Numéro Fiscal :"]
[null,"2014-12-05",null,null,null,0,{"$f":"IF($D9<>\"\",IF($D9<Données!$C$2,1,0),0)","v":0},null,null,0,{"$f":"IF($H9<>\"\",IF($H9<Données!$C$3,1,0),0)","v":0},0,0,0,{"$f":"IF($N9=Données!$F$12,0,IF($N9<Données!$F$11,1,0))","v":0},null,null,null,"Nombre de jours travaillés :",null,{"$f":"H78","v":0},null,null,null,null,null,null,null,null,null,"MDP:"]
[null,"2014-12-06",null,null,null,0,{"$f":"IF($D10<>\"\",IF($D10<Données!$C$2,1,0),0)","v":0},null,null,0,{"$f":"IF($H10<>\"\",IF($H10<Données!$C$3,1,0),0)","v":0},0,0,{"$f":"$D10-$I9+IF($I9>$D10,1)","v":0},{"$f":"IF($N10=Données!$F$12,0,IF($N10<Données!$F$11,1,0))","v":0},null,null,null,"Nombre de jours repos :",null,{"$f":"B78","v":0}]
[null,"2014-12-07",null,null,null,0,{"$f":"IF($D11<>\"\",IF($D11<Données!$C$2,1,0),0)","v":0},null,null,0,{"$f":"IF($H11<>\"\",IF($H11<Données!$C$3,1,0),0)","v":0},0,0,{"$f":"$D11-$I10+IF($I10>$D11,1)","v":0},{"$f":"IF($N11=Données!$F$12,0,IF($N11<Données!$F$11,1,0))","v":0},null,null,null,"Nombre de jours récup :",null,{"$f":"C$78","v":0},null,null,null,null,null,null,null,null,null,"Adresse domicile:","-"]
[null,"Total Semaine",null,null,{"$f":"WEEKNUM(B5,21)","v":49},{"$f":"SUM($F5:$F11)","v":0},{"$f":"G5+G6+G7+G8+G9+G10+G11","v":0},null,null,{"$f":"SUM(J5:J11)","v":0},{"$f":"K5+K6+K7+K8+K9+K10+K11","v":0},{"$f":"SUM(L5:L11)","v":0},{"$f":"SUM(M5:M11)","v":0},null,{"$f":"SUM(O6:O11)","v":0},null,null,null,"Nombre de jfg :",null,{"$f":"D$78","v":0}]
[null,{"$f":"B11+1","v":"2014-12-08"},null,null,null,{"$f":"$E13-$D13+IF($D13>$E13,1)","v":0},{"$f":"IF($D13<>\"\",IF($D13<Données!$C$2,1,0),0)","v":0},null,null,{"$f":"$I13-$H13+IF($H13>$I13,1)","v":0},{"$f":"IF($H13<>\"\",IF($H13<Données!$C$3,1,0),0)","v":0},{"$f":"$F13+$J13-($G13+$K13)*(\"00:30\")","v":0},{"$f":"$G13+$K13","v":0},{"$f":"$D13-$I11+IF($I11>$D13,1)","v":0},{"$f":"IF($N13=Données!$F$12,0,IF($N13<Données!$F$11,1,0))","v":0},null,null,null,"Nombre de jours de vacances :",null,{"$f":"E$78","v":0}]
[null,{"$f":"B13+1","v":"2014-12-09"},null,null,null,{"$f":"$E14-$D14+IF($D14>$E14,1)","v":0},{"$f":"IF($D14<>\"\",IF($D14<Données!$C$2,1,0),0)","v":0},null,null,{"$f":"$I14-$H14+IF($H14>$I14,1)","v":0},{"$f":"IF($H14<>\"\",IF($H14<Données!$C$3,1,0),0)","v":0},{"$f":"$F14+$J14-($G14+$K14)*(\"00:30\")","v":0},{"$f":"$G14+$K14","v":0},{"$f":"$D14-$I13+IF($I13>$D14,1)","v":0},{"$f":"IF($N14=Données!$F$12,0,IF($N14<Données!$F$11,1,0))","v":0},null,null,null,"Nombre de jours de maladie :",null,{"$f":"F$78","v":0}]
[null,{"$f":"B14+1","v":"2014-12-10"},null,null,null,0,{"$f":"IF($D15<>\"\",IF($D15<Données!$C$2,1,0),0)","v":0},null,null,0,{"$f":"IF($H15<>\"\",IF($H15<Données!$C$3,1,0),0)","v":0},0,0,{"$f":"$D15-$I14+IF($I14>$D15,1)","v":0},{"$f":"IF($N15=Données!$F$12,0,IF($N15<Données!$F$11,1,0))","v":0},null,null,null,"Nombre jours fériées travaillés :",null,{"$f":"I78","v":0},null,null,null,null,null,null,null,null,null,"Adresse lieu de travail:","-"]
[null,"2014-12-11",null,null,null,0,{"$f":"IF($D16<>\"\",IF($D16<Données!$C$2,1,0),0)","v":0},null,null,0,{"$f":"IF($H16<>\"\",IF($H16<Données!$C$3,1,0),0)","v":0},0,0,0,{"$f":"IF($N16=Données!$F$12,0,IF($N16<Données!$F$11,1,0))","v":0},null,null,null,"Nombre de fois 11h de batement non respecté :",null,{"$f":"J78","v":0}]
[null,"2014-12-12",null,null,null,0,{"$f":"IF($D17<>\"\",IF($D17<Données!$C$2,1,0),0)","v":0},null,null,0,{"$f":"IF($H17<>\"\",IF($H17<Données!$C$3,1,0),0)","v":0},0,0,0,{"$f":"IF($N17=Données!$F$12,0,IF($N17<Données!$F$11,1,0))","v":0}]
[null,"2014-12-13",null,null,null,0,{"$f":"IF($D18<>\"\",IF($D18<Données!$C$2,1,0),0)","v":0},null,null,0,{"$f":"IF($H18<>\"\",IF($H18<Données!$C$3,1,0),0)","v":0},0,0,0,{"$f":"IF($N18=Données!$F$12,0,IF($N18<Données!$F$11,1,0))","v":0},null,null,null,null,null,null,null,null,null,null,null,null,null,null,null,"Distance ( Source Mappy) :","-","7,4 KM"]
[null,"2014-12-14",null,null,null,0,{"$f":"IF($D19<>\"\",IF($D19<Données!$C$2,1,0),0)","v":0},null,null,0,{"$f":"IF($H19<>\"\",IF($H19<Données!$C$3,1,0),0)","v":0},0,0,0,{"$f":"IF($N19=Données!$F$12,0,IF($N19<Données!$F$11,1,0))","v":0},null,null,null,null,null,{"$f":"SUM(L12+L20+L28+L36+L44+L52)","v":0},"Heures effectués"]
[null,"Total Semaine",null,null,{"$f":"WEEKNUM(B13,21)","v":50},{"$f":"SUM($F13:$F19)","v":0},{"$f":"G13+G14+G15+G16+G17+G18+G19","v":0},null,null,{"$f":"SUM(J13:J19)","v":0},{"$f":"K13+K14+K15+K16+K17+K18+K19","v":0},{"$f":"SUM(L13:L19)","v":0},{"$f":"SUM(M13:M19)","v":0},null,{"$f":"SUM(O13:O19)","v":0},null,null,null,null,null,{"$f":"IF(U19<N53,\"- \"&TEXT(ABS(N53-U19),\"[hh]:mm\"),U19-N53)","v":"- 169:00"},"Heures dues/supp",null,null,null,null,null,null,null,null,"Nombre Aller-Retour :","-",{"$f":"COUNT(E5:E11,I5:I11,E13:E19,I13:I19,E21:E27,I21:I27,E29:E35,I29:I35,E37:E43,I37:I43,E45:E51,I45:I51)","v":0}]
[null,{"$f":"B19+1","v":"2014-12-15"},null,null,null,{"$f":"$E21-$D21+IF($D21>$E21,1)","v":0},{"$f":"IF($D21<>\"\",IF($D21<Données!$C$2,1,0),0)","v":0},null,null,{"$f":"$I21-$H21+IF($H21>$I21,1)","v":0},{"$f":"IF($H21<>\"\",IF($H21<Données!$C$3,1,0),0)","v":0},{"$f":"$F21+$J21-($G21+$K21)*(\"00:30\")","v":0},{"$f":"$G21+$K21","v":0},{"$f":"$D21-$I19+IF($I19>$D21,1)","v":0},{"$f":"IF($N21=Données!$F$12,0,IF($N21<Données!$F$11,1,0))","v":0},null,null,null,null,null,null,null,null,null,null,null,null,null,null,null,"Km Parcourue :","-",{"$f":"SUM(AG20*14.8)","v":0},"Km"]
[null,{"$f":"B21+1","v":"2014-12-16"},null,null,null,{"$f":"$E22-$D22+IF($D22>$E22,1)","v":0},{"$f":"IF($D22<>\"\",IF($D22<Données!$C$2,1,0),0)","v":0},null,null,{"$f":"$I22-$H22+IF($H22>$I22,1)","v":0},{"$f":"IF($H22<>\"\",IF($H22<Données!$C$3,1,0),0)","v":0},{"$f":"$F22+$J22-($G22+$K22)*(\"00:30\")","v":0},{"$f":"$G22+$K22","v":0},{"$f":"$D22-$I21+IF($I21>$D22,1)","v":0},{"$f":"IF($N22=Données!$F$12,0,IF($N22<Données!$F$11,1,0))","v":0},null,null,null,null,null,null,null,null,null,null,null,null,null,null,null,"Horodateur Payé :","-"]
[null,{"$f":"B22+1","v":"2014-12-17"},null,null,null,0,{"$f":"IF($D23<>\"\",IF($D23<Données!$C$2,1,0),0)","v":0},null,null,0,{"$f":"IF($H23<>\"\",IF($H23<Données!$C$3,1,0),0)","v":0},0,0,{"$f":"$D23-$I22+IF($I22>$D23,1)","v":0},{"$f":"IF($N23=Données!$F$12,0,IF($N23<Données!$F$11,1,0))","v":0},null,null,null,"Dont :","-",{"$f":"$B$68","v":0},"Heures à taux normal ( 35h )",null,null,null,null,null,null,null,null,"Achat divers pour le travail :","-"]
[null,"2014-12-18",null,null,null,0,{"$f":"IF($D24<>\"\",IF($D24<Données!$C$2,1,0),0)","v":0},null,null,0,{"$f":"IF($H24<>\"\",IF($H24<Données!$C$3,1,0),0)","v":0},0,0,0,{"$f":"IF($N24=Données!$F$12,0,IF($N24<Données!$F$11,1,0))","v":0},null,null,null,null,"-",{"$f":"$C$68","v":0},"Heures en HS 10%         ( 35h à 39h )",null,null,null,null,null,null,null,null,null,"-"]
[null,"2014-12-19",null,null,null,0,{"$f":"IF($D25<>\"\",IF($D25<Données!$C$2,1,0),0)","v":0},null,null,0,{"$f":"IF($H25<>\"\",IF($H25<Données!$C$3,1,0),0)","v":0},0,0,0,{"$f":"IF($N25=Données!$F$12,0,IF($N25<Données!$F$11,1,0))","v":0},null,null,null,null,"-",{"$f":"$D$68","v":0},"Heures en HS 20%         (39h à 43h )",null,null,null,null,null,null,null,null,null,"-"]
[null,"2014-12-20",null,null,null,0,{"$f":"IF($D26<>\"\",IF($D26<Données!$C$2,1,0),0)","v":0},null,null,0,{"$f":"IF($H26<>\"\",IF($H26<Données!$C$3,1,0),0)","v":0},0,0,0,{"$f":"IF($N26=Données!$F$12,0,IF($N26<Données!$F$11,1,0))","v":0},null,null,null,null,"-",{"$f":"$E$68","v":0},"Heures en HS 40%         ( 43h et plus )",null,null,null,null,null,null,null,null,null,"-"]
[null,"2014-12-21",null,null,null,0,{"$f":"IF($D27<>\"\",IF($D27<Données!$C$2,1,0),0)","v":0},null,null,0,{"$f":"IF($H27<>\"\",IF($H27<Données!$C$3,1,0),0)","v":0},0,0,0,{"$f":"IF($N27=Données!$F$12,0,IF($N27<Données!$F$11,1,0))","v":0},null,null,null,null,"-",{"$f":"SUM(M12+M20+M28+M36+M44+M52)","v":0},"Nombre de repas",null,null,null,null,null,null,null,null,null,"-"]
[null,"Total Semaine",null,null,{"$f":"WEEKNUM(B21,21)","v":51},{"$f":"SUM($F21:$F27)","v":0},{"$f":"G21+G22+G23+G24+G25+G26+G27","v":0},null,null,{"$f":"SUM(J21:J27)","v":0},{"$f":"K21+K22+K23+K24+K25+K26+K27","v":0},{"$f":"SUM(L21:L27)","v":0},{"$f":"SUM(M21:M27)","v":0},null,{"$f":"SUM(O21:O27)","v":0},null,null,null,null,null,null,null,null,null,null,null,null,null,null,null,null,"-"]
[null,{"$f":"B27+1","v":"2014-12-22"},null,null,null,{"$f":"$E29-$D29+IF($D29>$E29,1)","v":0},{"$f":"IF($D29<>\"\",IF($D29<Données!$C$2,1,0),0)","v":0},null,null,{"$f":"$I29-$H29+IF($H29>$I29,1)","v":0},{"$f":"IF($H29<>\"\",IF($H29<Données!$C$3,1,0),0)","v":0},{"$f":"$F29+$J29-($G29+$K29)*(\"00:30\")","v":0},{"$f":"$G29+$K29","v":0},{"$f":"$D29-$I27+IF($I27>$D29,1)","v":0},{"$f":"IF($N29=Données!$F$12,0,IF($N29<Données!$F$11,1,0))","v":0},null,null,null,"Heure fiche de paie:",null,null,null,null,null,null,null,null,null,null,null,null,"-"]
[null,{"$f":"B29+1","v":"2014-12-23"},null,null,null,{"$f":"$E30-$D30+IF($D30>$E30,1)","v":0},{"$f":"IF($D30<>\"\",IF($D30<Données!$C$2,1,0),0)","v":0},null,null,{"$f":"$I30-$H30+IF($H30>$I30,1)","v":0},{"$f":"IF($H30<>\"\",IF($H30<Données!$C$3,1,0),0)","v":0},{"$f":"$F30+$J30-($G30+$K30)*(\"00:30\")","v":0},{"$f":"$G30+$K30","v":0},{"$f":"$D30-$I29+IF($I29>$D30,1)","v":0},{"$f":"IF($N30=Données!$F$12,0,IF($N30<Données!$F$11,1,0))","v":0},null,null,null,null,null,null,null,null,null,null,null,null,null,null,null,null,"-"]
[null,{"$f":"B30+1","v":"2014-12-24"},null,null,null,0,{"$f":"IF($D31<>\"\",IF($D31<Données!$C$2,1,0),0)","v":0},null,null,0,{"$f":"IF($H31<>\"\",IF($H31<Données!$C$3,1,0),0)","v":0},0,0,{"$f":"$D31-$I30+IF($I30>$D31,1)","v":0},{"$f":"IF($N31=Données!$F$12,0,IF($N31<Données!$F$11,1,0))","v":0},null,null,null,"Dont :","-",6.3194444444444438,"Heures à taux normal",null,null,null,null,null,null,null,null,null,"-"]
[null,"2014-12-25",null,null,null,0,{"$f":"IF($D32<>\"\",IF($D32<Données!$C$2,1,0),0)","v":0},null,null,0,{"$f":"IF($H32<>\"\",IF($H32<Données!$C$3,1,0),0)","v":0},0,0,0,{"$f":"IF($N32=Données!$F$12,0,IF($N32<Données!$F$11,1,0))","v":0},null,null,null,null,"-",0.73125000000000007,"Heures en HS 10%",null,null,null,null,null,null,null,null,null,"-"]
[null,"2014-12-26",null,null,null,0,{"$f":"IF($D33<>\"\",IF($D33<Données!$C$2,1,0),0)","v":0},null,null,0,{"$f":"IF($H33<>\"\",IF($H33<Données!$C$3,1,0),0)","v":0},0,0,0,{"$f":"IF($N33=Données!$F$12,0,IF($N33<Données!$F$11,1,0))","v":0},null,null,null,null,"-",0,"Heures en HS 20%"]
[null,"2014-12-27",null,null,null,0,{"$f":"IF($D34<>\"\",IF($D34<Données!$C$2,1,0),0)","v":0},null,null,0,{"$f":"IF($H34<>\"\",IF($H34<Données!$C$3,1,0),0)","v":0},0,0,0,{"$f":"IF($N34=Données!$F$12,0,IF($N34<Données!$F$11,1,0))","v":0},null,null,null,null,"-",0,"Heures en HS 40%",null,null,null,null,null,null,null,null,"Total dépenses:","-",{"$f":"SUM(AG22:AG32)","v":0}]
[null,"2014-12-28",null,null,null,0,{"$f":"IF($D35<>\"\",IF($D35<Données!$C$2,1,0),0)","v":0},null,null,0,{"$f":"IF($H35<>\"\",IF($H35<Données!$C$3,1,0),0)","v":0},0,0,0,{"$f":"IF($N35=Données!$F$12,0,IF($N35<Données!$F$11,1,0))","v":0},null,null,null,null,"-",0,"Nombre de repas"]
[null,"Total Semaine",null,null,{"$f":"WEEKNUM(B29,21)","v":52},{"$f":"SUM($F29:$F35)","v":0},{"$f":"G29+G30+G31+G32+G33+G34+G35","v":0},null,null,{"$f":"SUM(J29:J35)","v":0},{"$f":"K29+K30+K31+K32+K33+K34+K35","v":0},{"$f":"SUM(L29:L35)","v":0},{"$f":"SUM(M29:M35)","v":0},null,{"$f":"SUM(O29:O35)","v":0}]
[null,{"$f":"B35+1","v":"2014-12-29"},null,null,null,{"$f":"$E37-$D37+IF($D37>$E37,1)","v":0},{"$f":"IF($D37<>\"\",IF($D37<Données!$C$2,1,0),0)","v":0},null,null,{"$f":"$I37-$H37+IF($H37>$I37,1)","v":0},{"$f":"IF($H37<>\"\",IF($H37<Données!$C$3,1,0),0)","v":0},{"$f":"$F37+$J37-($G37+$K37)*(\"00:30\")","v":0},{"$f":"$G37+$K37","v":0},{"$f":"$D37-$I35+IF($I35>$D37,1)","v":0},{"$f":"IF($N37=Données!$F$12,0,IF($N37<Données!$F$11,1,0))","v":0},null,null,null,"Différence:"]
[null,{"$f":"B37+1","v":"2014-12-30"},null,null,null,{"$f":"$E38-$D38+IF($D38>$E38,1)","v":0},{"$f":"IF($D38<>\"\",IF($D38<Données!$C$2,1,0),0)","v":0},null,null,{"$f":"$I38-$H38+IF($H38>$I38,1)","v":0},{"$f":"IF($H38<>\"\",IF($H38<Données!$C$3,1,0),0)","v":0},{"$f":"$F38+$J38-($G38+$K38)*(\"00:30\")","v":0},{"$f":"$G38+$K38","v":0},{"$f":"$D38-$I37+IF($I37>$D38,1)","v":0},{"$f":"IF($N38=Données!$F$12,0,IF($N38<Données!$F$11,1,0))","v":0}]
[null,{"$f":"B38+1","v":"2014-12-31"},null,null,null,0,{"$f":"IF($D39<>\"\",IF($D39<Données!$C$2,1,0),0)","v":0},null,null,0,{"$f":"IF($H39<>\"\",IF($H39<Données!$C$3,1,0),0)","v":0},0,0,{"$f":"$D39-$I38+IF($I38>$D39,1)","v":0},{"$f":"IF($N39=Données!$F$12,0,IF($N39<Données!$F$11,1,0))","v":0},null,null,null,"Dont :","-",{"$f":"$U31-$U23+IF($U23>$U31,1)","v":6.3194444444444438},"Heures à taux normal"]
[null,"2015-01-01",null,null,null,0,{"$f":"IF($D40<>\"\",IF($D40<Données!$C$2,1,0),0)","v":0},null,null,0,{"$f":"IF($H40<>\"\",IF($H40<Données!$C$3,1,0),0)","v":0},0,0,0,{"$f":"IF($N40=Données!$F$12,0,IF($N40<Données!$F$11,1,0))","v":0},null,null,null,null,"-",{"$f":"$U32-$U24+IF($U24>$U32,1)","v":0.73125000000000007},"Heures en HS 10%"]
[null,"2015-01-02",null,null,null,0,{"$f":"IF($D41<>\"\",IF($D41<Données!$C$2,1,0),0)","v":0},null,null,0,{"$f":"IF($H41<>\"\",IF($H41<Données!$C$3,1,0),0)","v":0},0,0,0,{"$f":"IF($N41=Données!$F$12,0,IF($N41<Données!$F$11,1,0))","v":0},null,null,null,null,"-",{"$f":"$U33-$U25+IF($U25>$U33,1)","v":0},"Heures en HS 20%"]
[null,"2015-01-03",null,null,null,0,{"$f":"IF($D42<>\"\",IF($D42<Données!$C$2,1,0),0)","v":0},null,null,0,{"$f":"IF($H42<>\"\",IF($H42<Données!$C$3,1,0),0)","v":0},0,0,0,{"$f":"IF($N42=Données!$F$12,0,IF($N42<Données!$F$11,1,0))","v":0},null,null,null,null,"-",{"$f":"$U34-$U26+IF($U26>$U34,1)","v":0},"Heures en HS 40%"]
[null,"2015-01-04",null,null,null,0,{"$f":"IF($D43<>\"\",IF($D43<Données!$C$2,1,0),0)","v":0},null,null,0,{"$f":"IF($H43<>\"\",IF($H43<Données!$C$3,1,0),0)","v":0},0,0,0,{"$f":"IF($N43=Données!$F$12,0,IF($N43<Données!$F$11,1,0))","v":0},null,null,null,null,"-",{"$f":"SUM(U35-U27)","v":0},"Nombre de repas"]
[null,"Total Semaine",null,null,{"$f":"WEEKNUM(B37,21)","v":1},{"$f":"SUM($F37:$F43)","v":0},{"$f":"G37+G38+G39+G40+G41+G42+G43","v":0},null,null,{"$f":"SUM(J37:J43)","v":0},{"$f":"K37+K38+K39+K40+K41+K42+K43","v":0},{"$f":"SUM(L37:L43)","v":0},{"$f":"SUM(M37:M43)","v":0},null,{"$f":"SUM(O37:O43)","v":0}]
[null,{"$f":"B43+1","v":"2015-01-05"},null,null,null,{"$f":"$E45-$D45+IF($D45>$E45,1)","v":0},{"$f":"IF($D45<>\"\",IF($D45<Données!$C$2,1,0),0)","v":0},null,null,{"$f":"$I45-$H45+IF($H45>$I45,1)","v":0},{"$f":"IF($H45<>\"\",IF($H45<Données!$C$3,1,0),0)","v":0},{"$f":"$F45+$J45-($G45+$K45)*(\"00:30\")","v":0},{"$f":"$G45+$K45","v":0},{"$f":"$D45-$I43+IF($I43>$D45,1)","v":0},{"$f":"IF($N45=Données!$F$12,0,IF($N45<Données!$F$11,1,0))","v":0}]
[null,{"$f":"B45+1","v":"2015-01-06"},null,null,null,0,{"$f":"IF($D46<>\"\",IF($D46<Données!$C$2,1,0),0)","v":0},null,null,{"$f":"$I46-$H46+IF($H46>$I46,1)","v":0},{"$f":"IF($H46<>\"\",IF($H46<Données!$C$3,1,0),0)","v":0},{"$f":"$F46+$J46-($G46+$K46)*(\"00:30\")","v":0},{"$f":"$G46+$K46","v":0},{"$f":"$D46-$I45+IF($I45>$D46,1)","v":0},{"$f":"IF($N46=Données!$F$12,0,IF($N46<Données!$F$11,1,0))","v":0}]
[null,{"$f":"B46+1","v":"2015-01-07"},null,null,null,0,{"$f":"IF($D47<>\"\",IF($D47<Données!$C$2,1,0),0)","v":0},null,null,0,{"$f":"IF($H47<>\"\",IF($H47<Données!$C$3,1,0),0)","v":0},0,0,{"$f":"$D47-$I46+IF($I46>$D47,1)","v":0},{"$f":"IF($N47=Données!$F$12,0,IF($N47<Données!$F$11,1,0))","v":0}]
[null,"2015-01-08",null,null,null,0,{"$f":"IF($D48<>\"\",IF($D48<Données!$C$2,1,0),0)","v":0},null,null,0,{"$f":"IF($H48<>\"\",IF($H48<Données!$C$3,1,0),0)","v":0},0,0,0,{"$f":"IF($N48=Données!$F$12,0,IF($N48<Données!$F$11,1,0))","v":0}]
[null,"2015-01-09",null,null,null,0,{"$f":"IF($D49<>\"\",IF($D49<Données!$C$2,1,0),0)","v":0},null,null,0,{"$f":"IF($H49<>\"\",IF($H49<Données!$C$3,1,0),0)","v":0},0,0,0,{"$f":"IF($N49=Données!$F$12,0,IF($N49<Données!$F$11,1,0))","v":0}]
[null,"2015-01-10",null,null,null,0,{"$f":"IF($D50<>\"\",IF($D50<Données!$C$2,1,0),0)","v":0},null,null,0,{"$f":"IF($H50<>\"\",IF($H50<Données!$C$3,1,0),0)","v":0},0,0,0,{"$f":"IF($N50=Données!$F$12,0,IF($N50<Données!$F$11,1,0))","v":0}]
[null,"2015-01-11",null,null,null,0,{"$f":"IF($D51<>\"\",IF($D51<Données!$C$2,1,0),0)","v":0},null,null,0,{"$f":"IF($H51<>\"\",IF($H51<Données!$C$3,1,0),0)","v":0},0,0,0,{"$f":"IF($N51=Données!$F$12,0,IF($N51<Données!$F$11,1,0))","v":0}]
[null,"Total semaine",null,null,{"$f":"WEEKNUM(B45,21)","v":2},{"$f":"SUM($F45:$F51)","v":0},{"$f":"G45+G46+G47+G48+G49+G50+G51","v":0},null,null,{"$f":"SUM(J45:J51)","v":0},{"$f":"K45+K46+K47+K48+K49+K50+K51","v":0},{"$f":"SUM(L45:L51)","v":0},{"$f":"SUM(M45:M51)","v":0},null,{"$f":"SUM(O45:O51)","v":0}]
[null,null,null,null,null,null,null,null,null,null,null,null,null,7.041666666666667]
[null,null,null,null,null,null,null,null,null,null,null,{"$f":"CodeCouleur(M54)","v":50},null,"REPOS"]
[null,null,null,null,null,null,null,null,null,null,null,{"$f":"CodeCouleur(M55)","v":42},null,"Récup"]
[null,null,null,null,null,null,null,null,null,null,null,48,null,"JFG"]
[null,null,null,null,null,null,null,null,null,null,null,44,null,"VAC"]
[null,null,null,null,null,null,null,null,null,null,null,3,null,"MAL"]
[null,null,null,null,null,null,null,null,null,null,null,{"$f":"CodeCouleur(M59)","v":40},null,"Jf Taf"]
["Heures",null,1.4583333333333333,1.625,1.7916666666666667,"Total"]
["Taux",1,1.1000000000000001,1.2,1.4]
["S 1",{"$f":"IF($L$12<=$C$60,$L$12,$C$60)","v":0},{"$f":"IF($L$12<=$C$60,0,IF($L$12<=$D$60,$L$12,$D$60)-$C$60)","v":0},{"$f":"IF($L$12<=$D$60,0,IF($L$12<=$E$60,$L$12,$D$60)-$C$60)","v":0},{"$f":"IF($L$12<=$E$60,0,IF($L$12>$E$60,$L$12,$E$60)-$E$60)","v":0},{"$f":"B62+C62+D62+E62","v":0}]
["S 2",{"$f":"IF($L$20<=$C$60,$L$20,$C$60)","v":0},{"$f":"IF($L$20<=$C$60,0,IF($L$20<=$D$60,$L$20,$D$60)-$C$60)","v":0},{"$f":"IF($L$20<=$D$60,0,IF($L$20<=$E$60,$L$20,$D$60)-$C$60)","v":0},{"$f":"IF($L$20<=$E$60,0,IF($L$20>$E$60,$L$20,$E$60)-$E$60)","v":0},0]
["S 3",{"$f":"IF($L$28<=$C$60,$L$28,$C$60)","v":0},{"$f":"IF($L$28<=$C$60,0,IF($L$28<=$D$60,$L$28,$D$60)-$C$60)","v":0},{"$f":"IF($L$28<=$D$60,0,IF($L$28<=$E$60,$L$28,$D$60)-$C$60)","v":0},{"$f":"IF($L$28<=$E$60,0,IF($L$28>$E$60,$L$28,$E$60)-$E$60)","v":0},0]
["S 4",{"$f":"IF($L$36<=$C$60,$L$36,$C$60)","v":0},{"$f":"IF($L$36<=$C$60,0,IF($L$36<=$D$60,$L$36,$D$60)-$C$60)","v":0},{"$f":"IF($L$36<=$D$60,0,IF($L$36<=$E$60,$L$36,$D$60)-$C$60)","v":0},{"$f":"IF($L$36<=$E$60,0,IF($L$36>$E$60,$L$36,$E$60)-$E$60)","v":0},0]
["S 5",{"$f":"IF($L$44<=$C$60,$L$44,$C$60)","v":0},{"$f":"IF($L$44<=$C$60,0,IF($L$44<=$D$60,$L$44,$D$60)-$C$60)","v":0},{"$f":"IF($L$44<=$D$60,0,IF($L$44<=$E$60,$L$44,$D$60)-$C$60)","v":0},{"$f":"IF($L$44<=$E$60,0,IF($L$44>$E$60,$L$44,$E$60)-$E$60)","v":0},0]
["S 6",{"$f":"IF($L$52<=$C$60,$L$52,$C$60)","v":0},{"$f":"IF($L$52<=$C$60,0,IF($L$52<=$D$60,$L$52,$D$60)-$C$60)","v":0},{"$f":"IF($L$52<=$D$60,0,IF($L$52<=$E$60,$L$52,$D$60)-$C$60)","v":0},{"$f":"IF($L$52<=$E$60,0,IF($L$52>$E$60,$L$52,$E$60)-$E$60)","v":0},0]
["Total",{"$f":"SUM(B62:B67)","v":0},{"$f":"SUM(C62:C67)","v":0},{"$f":"SUM(D62:D67)","v":0},{"$f":"SUM(E62:E67)","v":0},0]
[]
[]
["Jours","Repos","Récup","Jfg","Vac","Mal","Vides","Taf","Jf Taf","<11h"]
["S 1",{"$f":"NbCellsCoul($D$5:$I$11,50)*0.25","v":0},{"$f":"NbCellsCoul($D$5:$I$11,42)*0.25","v":0},{"$f":"NbCellsCoul($D$5:$I$11,48)*0.25","v":0},{"$f":"NbCellsCoul($D$5:$I$11,44)*0.25","v":0},{"$f":"NbCellsCoul($D$5:$I$11,3)*0.25","v":0},{"$f":"+COUNTBLANK(E5:H11)/2","v":7},{"$f":"7-$G72","v":0},{"$f":"NbCellsCoul($D$5:$I$11,40)*0.25","v":0},{"$f":"SUM($O$6:$O$11)","v":0}]
["S 2",{"$f":"NbCellsCoul($D$13:$I$19,50)*0.25","v":0},{"$f":"NbCellsCoul($D$13:$I$19,42)*0.25","v":0},{"$f":"NbCellsCoul($D$13:$I$19,48)*0.25","v":0},{"$f":"NbCellsCoul($D$13:$I$19,44)*0.25","v":0},{"$f":"NbCellsCoul($D$13:$I$19,3)*0.25","v":0},{"$f":"+COUNTBLANK(E13:H19)/2","v":7},0,{"$f":"NbCellsCoul($D$13:$I$19,40)*0.25","v":0},{"$f":"SUM($O$13:$O$19)","v":0}]
["S 3",{"$f":"NbCellsCoul($D$21:$I$27,50)*0.25","v":0},{"$f":"NbCellsCoul($D$21:$I$27,42)*0.25","v":0},{"$f":"NbCellsCoul($D$21:$I$27,48)*0.25","v":0},{"$f":"NbCellsCoul($D$21:$I$27,44)*0.25","v":0},{"$f":"NbCellsCoul($D$21:$I$27,3)*0.25","v":0},{"$f":"+COUNTBLANK(E21:H27)/2","v":7},0,{"$f":"NbCellsCoul($D$21:$I$27,40)*0.25","v":0},{"$f":"SUM($O$21:$O$27)","v":0}]
["S 4",{"$f":"NbCellsCoul($D$29:$I$35,50)*0.25","v":0},{"$f":"NbCellsCoul($D$29:$I$35,42)*0.25","v":0},{"$f":"NbCellsCoul($D$29:$I$35,48)*0.25","v":0},{"$f":"NbCellsCoul($D$29:$I$35,44)*0.25","v":0},{"$f":"NbCellsCoul($D$29:$I$35,3)*0.25","v":0},{"$f":"+COUNTBLANK(E29:H35)/2","v":7},0,{"$f":"NbCellsCoul($D$29:$I$35,40)*0.25","v":0},{"$f":"SUM($O$29:$O$35)","v":0}]
["S 5",{"$f":"NbCellsCoul($D$37:$I$43,50)*0.25","v":0},{"$f":"NbCellsCoul($D$37:$I$43,42)*0.25","v":0},{"$f":"NbCellsCoul($D$37:$I$43,48)*0.25","v":0},{"$f":"NbCellsCoul($D$37:$I$43,44)*0.25","v":0},{"$f":"NbCellsCoul($D$37:$I$43,3)*0.25","v":0},{"$f":"+COUNTBLANK(E37:H43)/2","v":7},0,{"$f":"NbCellsCoul($D$37:$I$43,40)*0.25","v":0},{"$f":"SUM($O$37:$O$43)","v":0}]
["S 6",{"$f":"NbCellsCoul($D$45:$I$51,50)*0.25","v":0},{"$f":"NbCellsCoul($D$45:$I$51,42)*0.25","v":0},{"$f":"NbCellsCoul($D$45:$I$51,48)*0.25","v":0},{"$f":"NbCellsCoul($D$45:$I$51,44)*0.25","v":0},{"$f":"NbCellsCoul($D$45:$I$51,3)*0.25","v":0},{"$f":"+COUNTBLANK(E45:H51)/2","v":7},0,{"$f":"NbCellsCoul($D$45:$I$51,40)*0.25","v":0},{"$f":"SUM($O$45:$O$51)","v":0}]
["Total",{"$f":"SUM(B$72:B$77)","v":0},0,0,0,{"$f":"SUM(F$72:F$77)","v":0},{"$f":"SUM(G$72:G$77)","v":42},{"$f":"SUM(H$72:H$77)","v":0},{"$f":"SUM(I$72:I$77)","v":0},{"$f":"SUM(J$72:J$77)","v":0}]

{"sheet":"Bilan 14","index":2,"n_rows":41,"n_cols":15,"rows_kept":41,"cut":false,"hidden":false,"merged":[[0,4,0,6],[0,11,0,13]]}
[null,null,null,null,"BILAN ANNUELLE",null,null,2014,null,null,null,"BILAN ANUELLE IMPOTS",null,null,2014]
[]
[]
[]
[]
[null,null,null,"-",{"$f":"SUM('Jan 14'!$U9+'Fév 14'!$U9+'Mars 14'!$U9+Avril14!$U9+'Mai 14'!$U9+'Juin 14'!$U9+'Juill 14'!$U9+'Août 14'!$U9+'Sept 14'!$U9+'Oct 14'!$U9+'Nov 14'!$U9+'Déc 14'!$U9)","v":224},null,"Nombre de jours travaillés ",null,null,null,null,"-",{"$f":"#REF!+#REF!+#REF!+#REF!+#REF!+#REF!+#REF!+#REF!+#REF!+#REF!+#REF!+#REF!","v":{"$error":"#REF!"}},"Nombre d'aller retour"]
[null,null,null,"-",{"$f":"SUM('Jan 14'!$U10+'Fév 14'!$U10+'Mars 14'!$U10+Avril14!$U10+'Mai 14'!$U10+'Juin 14'!$U10+'Juill 14'!$U10+'Août 14'!$U10+'Sept 14'!$U10+'Oct 14'!$U10+'Nov 14'!$U10+'Déc 14'!$U10)","v":99.5},null,"Nombre de jours repos ",null,null,null,null,"-",{"$f":"#REF!+#REF!+#REF!+#REF!+#REF!+#REF!+#REF!+#REF!+#REF!+#REF!+#REF!+#REF!","v":{"$error":"#REF!"}},"KM Parcourue"]
[null,null,null,"-",{"$f":"SUM('Jan 14'!$U11+'Fév 14'!$U11+'Mars 14'!$U11+Avril14!$U11+'Mai 14'!$U11+'Juin 14'!$U11+'Juill 14'!$U11+'Août 14'!$U11+'Sept 14'!$U11+'Oct 14'!$U11+'Nov 14'!$U11+'Déc 14'!$U11)","v":2},null,"Nombre de jours récup ",null,null,null,null,"-",{"$f":"#REF!+#REF!+#REF!+#REF!+#REF!+#REF!+#REF!+#REF!+#REF!+#REF!+#REF!+#REF!","v":{"$error":"#REF!"}},"Horadateur Payé"]
[null,null,null,"-",{"$f":"SUM('Jan 14'!$U12+'Fév 14'!$U12+'Mars 14'!$U12+Avril14!$U12+'Mai 14'!$U12+'Juin 14'!$U12+'Juill 14'!$U12+'Août 14'!$U12+'Sept 14'!$U12+'Oct 14'!$U12+'Nov 14'!$U12+'Déc 14'!$U12)","v":0},null,"Nombre de jfg "]
[null,null,null,"-",{"$f":"SUM('Jan 14'!$U13+'Fév 14'!$U13+'Mars 14'!$U13+Avril14!$U13+'Mai 14'!$U13+'Juin 14'!$U13+'Juill 14'!$U13+'Août 14'!$U13+'Sept 14'!$U13+'Oct 14'!$U13+'Nov 14'!$U13+'Déc 14'!$U13)","v":28},null,"Nombre de jours de vacances "]
[null,null,null,"-",{"$f":"SUM('Jan 14'!$U14+'Fév 14'!$U14+'Mars 14'!$U14+Avril14!$U14+'Mai 14'!$U14+'Juin 14'!$U14+'Juill 14'!$U14+'Août 14'!$U14+'Sept 14'!$U14+'Oct 14'!$U14+'Nov 14'!$U14+'Déc 14'!$U14)","v":9},null,"Nombre de jours de maladie "]
[null,null,null,"-",{"$f":"SUM('Jan 14'!$U15+'Fév 14'!$U15+'Mars 14'!$U15+Avril14!$U15+'Mai 14'!$U15+'Juin 14'!$U15+'Juill 14'!$U15+'Août 14'!$U15+'Sept 14'!$U15+'Oct 14'!$U15+'Nov 14'!$U15+'Déc 14'!$U15)","v":8},null,"Nombre jours fériées travaillés "]
[null,null,null,"-",{"$f":"SUM('Jan 14'!$U16+'Fév 14'!$U16+'Mars 14'!$U16+Avril14!$U16+'Mai 14'!$U16+'Juin 14'!$U16+'Juill 14'!$U16+'Août 14'!$U16+'Sept 14'!$U16+'Oct 14'!$U16+'Nov 14'!$U16+'Déc 14'!$U16)","v":42},null,"Nombre de fois 11h de batement non respecté "]
[null,null,null,"-"]
[]
[null,null,null,"-",{"$f":"169*12","v":2028},null,"Nombre d'heure théorique a l’année"]
[null,null,null,null,{"$f":"SUM('Jan 14'!$U19+'Fév 14'!$U19+'Mars 14'!$U19+Avril14!$U19+'Mai 14'!$U19+'Juin 14'!$U19+'Juill 14'!$U19+'Août 14'!$U19+'Sept 14'!$U19+'Oct 14'!$U19+'Nov 14'!$U19+'Déc 14'!$U19)","v":91.729166666666771},null,"Nombre d'heure éffectué"]
[null,null,"Dont :","-"]
[null,null,null,"-",{"$f":"'Jan 14'!U20+'Fév 14'!U20+'Mars 14'!U20+Avril14!U20+'Mai 14'!U20+'Juin 14'!U20","v":{"$error":"#VALUE!"}},null,"Nombre d'heure supp"]
[null,null,null,"-"]
[null,null,null,"-",{"$f":"#REF!+#REF!+#REF!+#REF!+#REF!+#REF!+#REF!+#REF!+#REF!+#REF!+#REF!+#REF!","v":{"$error":"#REF!"}},null,"Heures à taux normal ( 35h )"]
[null,null,null,"-",{"$f":"#REF!+#REF!+#REF!+#REF!+#REF!+#REF!+#REF!+#REF!+#REF!+#REF!+#REF!+#REF!","v":{"$error":"#REF!"}},null,"Heures en HS 10%         ( 35h à 39h )"]
[null,null,null,null,{"$f":"#REF!+#REF!+#REF!+#REF!+#REF!+#REF!+#REF!+#REF!+#REF!+#REF!+#REF!+#REF!","v":{"$error":"#REF!"}},null,"Heures en HS 20%         (39h à 43h )"]
[null,null,"Heure fiche de paie:",null,{"$f":"#REF!+#REF!+#REF!+#REF!+#REF!+#REF!+#REF!+#REF!+#REF!+#REF!+#REF!+#REF!","v":{"$error":"#REF!"}},null,"Heures en HS 40%         ( 43h et plus )"]
[null,null,null,null,{"$f":"#REF!+#REF!+#REF!+#REF!+#REF!+#REF!+#REF!+#REF!+#REF!+#REF!+#REF!+#REF!","v":{"$error":"#REF!"}},null,"Nombre de repas pris"]
[null,null,"Dont :","-"]
[null,null,null,"-"]
[null,null,null,"-"]
[null,null,null,"-",{"$f":"#REF!+#REF!+#REF!+#REF!+#REF!+#REF!+#REF!+#REF!+#REF!+#REF!+#REF!+#REF!","v":{"$error":"#REF!"}},null,"Heures à taux normal"]
[null,null,null,"-",{"$f":"#REF!+#REF!+#REF!+#REF!+#REF!+#REF!+#REF!+#REF!+#REF!+#REF!+#REF!+#REF!","v":{"$error":"#REF!"}},null,"Heures en HS 10%"]
[null,null,null,null,{"$f":"#REF!+#REF!+#REF!+#REF!+#REF!+#REF!+#REF!+#REF!+#REF!+#REF!+#REF!+#REF!","v":{"$error":"#REF!"}},null,"Heures en HS 20%"]
[null,null,"Différence:",null,{"$f":"#REF!+#REF!+#REF!+#REF!+#REF!+#REF!+#REF!+#REF!+#REF!+#REF!+#REF!+#REF!","v":{"$error":"#REF!"}},null,"Heures en HS 40%"]
[null,null,null,null,{"$f":"#REF!+#REF!+#REF!+#REF!+#REF!+#REF!+#REF!+#REF!+#REF!+#REF!+#REF!+#REF!","v":{"$error":"#REF!"}},null,"Nombre de repas"]
[null,null,"Dont :","-"]
[null,null,null,"-"]
[null,null,null,"-"]
[null,null,null,"-",{"$f":"#REF!+#REF!+#REF!+#REF!+#REF!+#REF!+#REF!+#REF!+#REF!+#REF!+#REF!+#REF!","v":{"$error":"#REF!"}},null,"Heures à taux normal"]
[null,null,null,"-",{"$f":"#REF!+#REF!+#REF!+#REF!+#REF!+#REF!+#REF!+#REF!+#REF!+#REF!+#REF!+#REF!","v":{"$error":"#REF!"}},null,"Heures en HS 10%"]
[null,null,null,null,{"$f":"#REF!+#REF!+#REF!+#REF!+#REF!+#REF!+#REF!+#REF!+#REF!+#REF!+#REF!+#REF!","v":{"$error":"#REF!"}},null,"Heures en HS 20%"]
[null,null,null,null,{"$f":"#REF!+#REF!+#REF!+#REF!+#REF!+#REF!+#REF!+#REF!+#REF!+#REF!+#REF!+#REF!","v":{"$error":"#REF!"}},null,"Heures en HS 40%"]
[null,null,null,null,{"$f":"#REF!+#REF!+#REF!+#REF!+#REF!+#REF!+#REF!+#REF!+#REF!+#REF!+#REF!+#REF!","v":{"$error":"#REF!"}},null,"Nombre de repas"]

{"sheet":"Jan 14","index":3,"n_rows":78,"n_cols":34,"rows_kept":78,"cut":false,"hidden":false,"merged":[[7,1,7,2],[0,3,0,9],[0,18,0,21],[0,30,0,32],[2,1,3,2],[2,3,2,4],[2,5,3,5],[2,6,3,6],[2,7,2,8],[2,9,3,9],[2,10,3,10],[2,11,3,11],[2,12,3,12],[4,1,4,2],[5,1,5,2],[6,1,6,2],[19,1,19,3],[8,1,8,2],[9,1,9,2],[10,1,10,2],[11,1,11,3],[12,1,12,2],[13,1,13,2],[14,1,14,2],[15,1,15,2],[16,1,16,2],[17,1,17,2],[18,1,18,2],[31,1,31,2],[20,1,20,2],[21,1,21,2],[22,1,22,2],[23,1,23,2],[24,1,24,2],[25,1,25,2],[26,1,26,2],[27,1,27,3],[28,1,28,2],[29,1,29,2],[30,1,30,2],[43,1,43,3],[32,1,32,2],[33,1,33,2],[34,1,34,2],[35,1,35,3],[36,1,36,2],[37,1,37,2],[38,1,38,2],[39,1,39,2],[40,1,40,2],[41,1,41,2],[42,1,42,2],[50,1,50,2],[51,1,51,3],[59,0,59,1],[108,5,108,8],[44,1,44,2],[45,1,45,2],[46,1,46,2],[47,1,47,2],[48,1,48,2],[49,1,49,2]]}
[null,null,null,"TEMPS DE TRAVAIL",null,null,null,null,null,null,null,null,null,null,null,null,null,null,"RÉCAPITULATIF",null,null,null,null,null,null,null,null,null,null,null,"IMPÔTS"]
[null,null,null,null,null,{"$f":"Données!G14","v":12},null,null,null,{"$f":"Données!C15","v":2014}]
[null,"Jour",null,"Midi",null,"Cumul Midi","Repas","Soir",null,"Cumul Soir","Repas","Totaux","Total Repas"]
[null,null,null,"Début","Fin",null,null,"Début","Fin",null,null,null,null,null,null,null,null,null,null,null,null,null,null,null,null,null,null,null,null,null,null,{"$f":"VLOOKUP(F2,Données!E15:F26,2)","v":"Décembre"},{"$f":"J2","v":2014}]
[null,{"$f":"Données!I15-WEEKDAY(Données!I15-1)+1","v":"2014-12-01"},null,null,null,{"$f":"$E5-$D5+IF($D5>$E5,1)","v":0},{"$f":"IF($D5<>\"\",IF($D5<Données!$C$2,1,0),0)","v":0},null,null,{"$f":"$I5-$H5+IF($H5>$I5,1)","v":0},{"$f":"IF($H5<>\"\",IF($H5<Données!$C$3,1,0),0)","v":0},{"$f":"$F5+$J5-($G5+$K5)*(\"00:30\")","v":0},{"$f":"$G5+$K5","v":0}]
[null,{"$f":"B5+1","v":"2014-12-02"},null,null,null,{"$f":"$E6-$D6+IF($D6>$E6,1)","v":0},{"$f":"IF($D6<>\"\",IF($D6<Données!$C$2,1,0),0)","v":0},null,null,{"$f":"$I6-$H6+IF($H6>$I6,1)","v":0},{"$f":"IF($H6<>\"\",IF($H6<Données!$C$3,1,0),0)","v":0},{"$f":"$F6+$J6-($G6+$K6)*(\"00:30\")","v":0},{"$f":"$G6+$K6","v":0},{"$f":"$D6-$I5+IF($I5>$D6,1)","v":0},{"$f":"IF($N6=Données!$F$12,0,IF($N6<Données!$F$11,1,0))","v":0},null,null,null,"Soit au total pour le mois de :",null,{"$f":"VLOOKUP(F2,Données!E15:F26,2)","v":"Décembre"},{"$f":"J2","v":2014}]
[null,{"$f":"B6+1","v":"2014-12-03"},null,0.48958333333333298,0.66666666666666696,0.17708333333333398,{"$f":"IF($D7<>\"\",IF($D7<Données!$C$2,1,0),0)","v":0},null,null,0,{"$f":"IF($H7<>\"\",IF($H7<Données!$C$3,1,0),0)","v":0},0.17708333333333398,0,{"$f":"$D7-$I6+IF($I6>$D7,1)","v":0.48958333333333298},{"$f":"IF($N7=Données!$F$12,0,IF($N7<Données!$F$11,1,0))","v":0}]
[null,"2014-12-04",null,0.48958333333333298,0.625,0.13541666666666702,{"$f":"IF($D8<>\"\",IF($D8<Données!$C$2,1,0),0)","v":0},0.78125,0.9375,0.15625,{"$f":"IF($H8<>\"\",IF($H8<Données!$C$3,1,0),0)","v":0},0.29166666666666702,0,{"$f":"$D8-$I7+IF($I7>$D8,1)","v":0.48958333333333298},{"$f":"IF($N8=Données!$F$12,0,IF($N8<Données!$F$11,1,0))","v":0},null,null,null,null,null,null,null,null,null,null,null,null,null,null,null,"Numéro Fiscal :"]
[null,"2014-12-05",null,0.48958333333333298,0.63541666666666696,0.14583333333333398,{"$f":"IF($D9<>\"\",IF($D9<Données!$C$2,1,0),0)","v":0},0.78125,0.9375,0.15625,{"$f":"IF($H9<>\"\",IF($H9<Données!$C$3,1,0),0)","v":0},0.30208333333333398,0,0.55208333333333304,{"$f":"IF($N9=Données!$F$12,0,IF($N9<Données!$F$11,1,0))","v":0},null,null,null,"Nombre de jours travaillés :",null,{"$f":"H78","v":21},null,null,null,null,null,null,null,null,null,"MDP:"]
[null,"2014-12-06",null,0.48958333333333298,0.625,0.13541666666666702,{"$f":"IF($D10<>\"\",IF($D10<Données!$C$2,1,0),0)","v":0},0.78125,0.92708333333333304,0.14583333333333304,{"$f":"IF($H10<>\"\",IF($H10<Données!$C$3,1,0),0)","v":0},0.28125000000000006,0,{"$f":"$D10-$I9+IF($I9>$D10,1)","v":0.55208333333333304},{"$f":"IF($N10=Données!$F$12,0,IF($N10<Données!$F$11,1,0))","v":0},null,null,null,"Nombre de jours repos :",null,{"$f":"B78","v":8.5}]
[null,"2014-12-07",null,0.48958333333333298,0.625,0.13541666666666702,{"$f":"IF($D11<>\"\",IF($D11<Données!$C$2,1,0),0)","v":0},0.78125,0.875,9.375E-2,{"$f":"IF($H11<>\"\",IF($H11<Données!$C$3,1,0),0)","v":0},0.22916666666666702,0,{"$f":"$D11-$I10+IF($I10>$D11,1)","v":0.5625},{"$f":"IF($N11=Données!$F$12,0,IF($N11<Données!$F$11,1,0))","v":0},null,null,null,"Nombre de jours récup :",null,{"$f":"C$78","v":0.5},null,null,null,null,null,null,null,null,null,"Adresse domicile:","-"]
[null,"Total Semaine",null,null,{"$f":"WEEKNUM(B5,21)","v":49},{"$f":"SUM($F5:$F11)","v":0.72916666666666896},{"$f":"G5+G6+G7+G8+G9+G10+G11","v":0},null,null,{"$f":"SUM(J5:J11)","v":0.55208333333333304},{"$f":"K5+K6+K7+K8+K9+K10+K11","v":0},{"$f":"SUM(L5:L11)","v":1.281250000000002},{"$f":"SUM(M5:M11)","v":0},null,{"$f":"SUM(O6:O11)","v":0},null,null,null,"Nombre de jfg :",null,{"$f":"D$78","v":0}]
[null,{"$f":"B11+1","v":"2014-12-08"},null,0.5,0.63541666666666696,{"$f":"$E13-$D13+IF($D13>$E13,1)","v":0.13541666666666696},{"$f":"IF($D13<>\"\",IF($D13<Données!$C$2,1,0),0)","v":0},0.78125,0.98958333333333304,{"$f":"$I13-$H13+IF($H13>$I13,1)","v":0.20833333333333304},{"$f":"IF($H13<>\"\",IF($H13<Données!$C$3,1,0),0)","v":0},{"$f":"$F13+$J13-($G13+$K13)*(\"00:30\")","v":0.34375},{"$f":"$G13+$K13","v":0},{"$f":"$D13-$I11+IF($I11>$D13,1)","v":0.625},{"$f":"IF($N13=Données!$F$12,0,IF($N13<Données!$F$11,1,0))","v":0},null,null,null,"Nombre de jours de vacances :",null,{"$f":"E$78","v":1}]
[null,{"$f":"B13+1","v":"2014-12-09"},null,null,null,{"$f":"$E14-$D14+IF($D14>$E14,1)","v":0},{"$f":"IF($D14<>\"\",IF($D14<Données!$C$2,1,0),0)","v":0},null,null,{"$f":"$I14-$H14+IF($H14>$I14,1)","v":0},{"$f":"IF($H14<>\"\",IF($H14<Données!$C$3,1,0),0)","v":0},{"$f":"$F14+$J14-($G14+$K14)*(\"00:30\")","v":0},{"$f":"$G14+$K14","v":0},{"$f":"$D14-$I13+IF($I13>$D14,1)","v":1.0416666666666963E-2},0,null,null,null,"Nombre de jours de maladie :",null,{"$f":"F$78","v":0}]
[null,{"$f":"B14+1","v":"2014-12-10"},null,null,null,0,{"$f":"IF($D15<>\"\",IF($D15<Données!$C$2,1,0),0)","v":0},null,null,0,{"$f":"IF($H15<>\"\",IF($H15<Données!$C$3,1,0),0)","v":0},0,0,{"$f":"$D15-$I14+IF($I14>$D15,1)","v":0},{"$f":"IF($N15=Données!$F$12,0,IF($N15<Données!$F$11,1,0))","v":0},null,null,null,"Nombre jours fériées travaillés :",null,{"$f":"I78","v":0.5},null,null,null,null,null,null,null,null,null,"Adresse lieu de travail:","-"]
[null,"2014-12-11",null,0.48958333333333298,0.64583333333333304,0.15625000000000006,{"$f":"IF($D16<>\"\",IF($D16<Données!$C$2,1,0),0)","v":0},0.78125,0.88541666666666696,0.10416666666666696,{"$f":"IF($H16<>\"\",IF($H16<Données!$C$3,1,0),0)","v":0},0.26041666666666702,0,0.48958333333333298,{"$f":"IF($N16=Données!$F$12,0,IF($N16<Données!$F$11,1,0))","v":0},null,null,null,"Nombre de fois 11h de batement non respecté :",null,{"$f":"J78","v":1}]
[null,"2014-12-12",null,0.48958333333333298,0.60416666666666696,0.11458333333333398,{"$f":"IF($D17<>\"\",IF($D17<Données!$C$2,1,0),0)","v":0},0.78125,0.9375,0.15625,{"$f":"IF($H17<>\"\",IF($H17<Données!$C$3,1,0),0)","v":0},0.27083333333333398,0,0.60416666666666607,{"$f":"IF($N17=Données!$F$12,0,IF($N17<Données!$F$11,1,0))","v":0}]
[null,"2014-12-13",null,0.48958333333333298,0.65625,0.16666666666666702,{"$f":"IF($D18<>\"\",IF($D18<Données!$C$2,1,0),0)","v":0},0.78125,0.9375,0.15625,{"$f":"IF($H18<>\"\",IF($H18<Données!$C$3,1,0),0)","v":0},0.32291666666666702,0,0.55208333333333304,{"$f":"IF($N18=Données!$F$12,0,IF($N18<Données!$F$11,1,0))","v":0},null,null,null,null,null,null,null,null,null,null,null,null,null,null,null,"Distance ( Source Mappy) :","-","7,4 KM"]
[null,"2014-12-14",null,0.48958333333333298,0.625,0.13541666666666702,{"$f":"IF($D19<>\"\",IF($D19<Données!$C$2,1,0),0)","v":0},0.79166666666666696,0.875,8.3333333333333037E-2,{"$f":"IF($H19<>\"\",IF($H19<Données!$C$3,1,0),0)","v":0},0.21875000000000006,0,0.55208333333333304,{"$f":"IF($N19=Données!$F$12,0,IF($N19<Données!$F$11,1,0))","v":0},null,null,null,null,null,{"$f":"SUM(L12+L20+L28+L36+L44+L52)","v":6.1979166666666741},"Heures effectués"]
[null,"Total Semaine",null,null,{"$f":"WEEKNUM(B13,21)","v":50},{"$f":"SUM($F13:$F19)","v":0.70833333333333504},{"$f":"G13+G14+G15+G16+G17+G18+G19","v":0},null,null,{"$f":"SUM(J13:J19)","v":0.70833333333333304},{"$f":"K13+K14+K15+K16+K17+K18+K19","v":0},{"$f":"SUM(L13:L19)","v":1.4166666666666679},{"$f":"SUM(M13:M19)","v":0},null,{"$f":"SUM(O13:O19)","v":0},null,null,null,null,null,{"$f":"IF(U19<N53,\"- \"&TEXT(ABS(N53-U19),\"[hh]:mm\"),U19-N53)","v":"- 20:15"},"Heures dues/supp",null,null,null,null,null,null,null,null,"Nombre Aller-Retour :","-",{"$f":"COUNT(E5:E11,I5:I11,E13:E19,I13:I19,E21:E27,I21:I27,E29:E35,I29:I35,E37:E43,I37:I43,E45:E51,I45:I51)","v":42}]
[null,{"$f":"B19+1","v":"2014-12-15"},null,0.48958333333333298,0.60416666666666696,{"$f":"$E21-$D21+IF($D21>$E21,1)","v":0.11458333333333398},{"$f":"IF($D21<>\"\",IF($D21<Données!$C$2,1,0),0)","v":0},0.78125,0.95833333333333304,{"$f":"$I21-$H21+IF($H21>$I21,1)","v":0.17708333333333304},{"$f":"IF($H21<>\"\",IF($H21<Données!$C$3,1,0),0)","v":0},{"$f":"$F21+$J21-($G21+$K21)*(\"00:30\")","v":0.29166666666666702},{"$f":"$G21+$K21","v":0},{"$f":"$D21-$I19+IF($I19>$D21,1)","v":0.61458333333333304},{"$f":"IF($N21=Données!$F$12,0,IF($N21<Données!$F$11,1,0))","v":0},null,null,null,null,null,null,null,null,null,null,null,null,null,null,null,"Km Parcourue :","-",{"$f":"SUM(AG20*14.8)","v":621.6},"Km"]
[null,{"$f":"B21+1","v":"2014-12-16"},null,null,null,{"$f":"$E22-$D22+IF($D22>$E22,1)","v":0},{"$f":"IF($D22<>\"\",IF($D22<Données!$C$2,1,0),0)","v":0},null,null,{"$f":"$I22-$H22+IF($H22>$I22,1)","v":0},{"$f":"IF($H22<>\"\",IF($H22<Données!$C$3,1,0),0)","v":0},{"$f":"$F22+$J22-($G22+$K22)*(\"00:30\")","v":0},{"$f":"$G22+$K22","v":0},{"$f":"$D22-$I21+IF($I21>$D22,1)","v":4.1666666666666963E-2},0,null,null,null,null,null,null,null,null,null,null,null,null,null,null,null,"Horodateur Payé :","-",29.1]
[null,{"$f":"B22+1","v":"2014-12-17"},null,null,null,0,{"$f":"IF($D23<>\"\",IF($D23<Données!$C$2,1,0),0)","v":0},null,null,0,{"$f":"IF($H23<>\"\",IF($H23<Données!$C$3,1,0),0)","v":0},0,0,{"$f":"$D23-$I22+IF($I22>$D23,1)","v":0},{"$f":"IF($N23=Données!$F$12,0,IF($N23<Données!$F$11,1,0))","v":0},null,null,null,"Dont :","-",{"$f":"$B$68","v":6.1666666666666723},"Heures à taux normal ( 35h )",null,null,null,null,null,null,null,null,"Achat divers pour le travail :","-"]
[null,"2014-12-18",null,0.48958333333333298,0.625,0.13541666666666702,{"$f":"IF($D24<>\"\",IF($D24<Données!$C$2,1,0),0)","v":0},0.78125,0.875,9.375E-2,{"$f":"IF($H24<>\"\",IF($H24<Données!$C$3,1,0),0)","v":0},0.22916666666666702,0,0.48958333333333298,{"$f":"IF($N24=Données!$F$12,0,IF($N24<Données!$F$11,1,0))","v":0},null,null,null,null,"-",{"$f":"$C$68","v":3.1250000000001776E-2},"Heures en HS 10%         ( 35h à 39h )",null,null,null,null,null,null,null,null,null,"-"]
[null,"2014-12-19",null,0.48958333333333298,0.625,0.13541666666666702,{"$f":"IF($D25<>\"\",IF($D25<Données!$C$2,1,0),0)","v":0},0.83333333333333304,0.95833333333333304,0.125,{"$f":"IF($H25<>\"\",IF($H25<Données!$C$3,1,0),0)","v":0},0.26041666666666702,0,0.61458333333333304,{"$f":"IF($N25=Données!$F$12,0,IF($N25<Données!$F$11,1,0))","v":0},null,null,null,null,"-",{"$f":"$D$68","v":0},"Heures en HS 20%         (39h à 43h )",null,null,null,null,null,null,null,null,null,"-"]
[null,"2014-12-20",null,null,null,0,{"$f":"IF($D26<>\"\",IF($D26<Données!$C$2,1,0),0)","v":0},0.78125,0.96875,0.1875,{"$f":"IF($H26<>\"\",IF($H26<Données!$C$3,1,0),0)","v":0},0.1875,0,{"$f":"$D26-$I25+IF($I25>$D26,1)","v":4.1666666666666963E-2},0,null,null,null,null,"-",{"$f":"$E$68","v":0},"Heures en HS 40%         ( 43h et plus )",null,null,null,null,null,null,null,null,null,"-"]
[null,"2014-12-21",null,0.48958333333333298,0.64583333333333304,0.15625000000000006,{"$f":"IF($D27<>\"\",IF($D27<Données!$C$2,1,0),0)","v":0},0.78125,0.91666666666666696,0.13541666666666696,{"$f":"IF($H27<>\"\",IF($H27<Données!$C$3,1,0),0)","v":0},0.29166666666666702,0,0.52083333333333304,{"$f":"IF($N27=Données!$F$12,0,IF($N27<Données!$F$11,1,0))","v":0},null,null,null,null,"-",{"$f":"SUM(M12+M20+M28+M36+M44+M52)","v":0},"Nombre de repas",null,null,null,null,null,null,null,null,null,"-"]
[null,"Total Semaine",null,null,{"$f":"WEEKNUM(B21,21)","v":51},{"$f":"SUM($F21:$F27)","v":0.54166666666666807},{"$f":"G21+G22+G23+G24+G25+G26+G27","v":0},null,null,{"$f":"SUM(J21:J27)","v":0.71875},{"$f":"K21+K22+K23+K24+K25+K26+K27","v":0},{"$f":"SUM(L21:L27)","v":1.2604166666666681},{"$f":"SUM(M21:M27)","v":0},null,{"$f":"SUM(O21:O27)","v":0},null,null,null,null,null,null,null,null,null,null,null,null,null,null,null,null,"-"]
[null,{"$f":"B27+1","v":"2014-12-22"},null,null,null,{"$f":"$E29-$D29+IF($D29>$E29,1)","v":0},{"$f":"IF($D29<>\"\",IF($D29<Données!$C$2,1,0),0)","v":0},null,null,{"$f":"$I29-$H29+IF($H29>$I29,1)","v":0},{"$f":"IF($H29<>\"\",IF($H29<Données!$C$3,1,0),0)","v":0},0.32291666666666669,{"$f":"$G29+$K29","v":0},{"$f":"$D29-$I27+IF($I27>$D29,1)","v":8.3333333333333037E-2},0,null,null,null,"Heure fiche de paie:",null,null,null,null,null,null,null,null,null,null,null,null,"-"]
[null,{"$f":"B29+1","v":"2014-12-23"},null,null,null,{"$f":"$E30-$D30+IF($D30>$E30,1)","v":0},{"$f":"IF($D30<>\"\",IF($D30<Données!$C$2,1,0),0)","v":0},null,null,{"$f":"$I30-$H30+IF($H30>$I30,1)","v":0},{"$f":"IF($H30<>\"\",IF($H30<Données!$C$3,1,0),0)","v":0},{"$f":"$F30+$J30-($G30+$K30)*(\"00:30\")","v":0},{"$f":"$G30+$K30","v":0},{"$f":"$D30-$I29+IF($I29>$D30,1)","v":0},{"$f":"IF($N30=Données!$F$12,0,IF($N30<Données!$F$11,1,0))","v":0},null,null,null,null,null,null,null,null,null,null,null,null,null,null,null,null,"-"]
[null,{"$f":"B30+1","v":"2014-12-24"},null,null,null,0,{"$f":"IF($D31<>\"\",IF($D31<Données!$C$2,1,0),0)","v":0},null,null,0,{"$f":"IF($H31<>\"\",IF($H31<Données!$C$3,1,0),0)","v":0},0,0,{"$f":"$D31-$I30+IF($I30>$D31,1)","v":0},{"$f":"IF($N31=Données!$F$12,0,IF($N31<Données!$F$11,1,0))","v":0},null,null,null,"Dont :","-",6.3194444444444438,"Heures à taux normal",null,null,null,null,null,null,null,null,null,"-"]
[null,"2014-12-25",null,0.48958333333333298,0.61458333333333304,0.12500000000000006,{"$f":"IF($D32<>\"\",IF($D32<Données!$C$2,1,0),0)","v":0},0.78125,0.92708333333333304,0.14583333333333304,{"$f":"IF($H32<>\"\",IF($H32<Données!$C$3,1,0),0)","v":0},0.27083333333333309,0,0.48958333333333298,{"$f":"IF($N32=Données!$F$12,0,IF($N32<Données!$F$11,1,0))","v":0},null,null,null,null,"-",0.73125000000000007,"Heures en HS 10%",null,null,null,null,null,null,null,null,null,"-"]
[null,"2014-12-26",null,0.48958333333333298,0.60416666666666696,0.11458333333333398,{"$f":"IF($D33<>\"\",IF($D33<Données!$C$2,1,0),0)","v":0},0.78125,0.91666666666666696,0.13541666666666696,{"$f":"IF($H33<>\"\",IF($H33<Données!$C$3,1,0),0)","v":0},0.25000000000000094,0,0.5625,{"$f":"IF($N33=Données!$F$12,0,IF($N33<Données!$F$11,1,0))","v":0},null,null,null,null,"-",0,"Heures en HS 20%"]
[null,"2014-12-27",null,0.48958333333333298,0.625,0.13541666666666702,{"$f":"IF($D34<>\"\",IF($D34<Données!$C$2,1,0),0)","v":0},0.78125,5.2083333333333336E-2,0.27083333333333337,{"$f":"IF($H34<>\"\",IF($H34<Données!$C$3,1,0),0)","v":0},0.40625000000000039,0,0.57291666666666607,{"$f":"IF($N34=Données!$F$12,0,IF($N34<Données!$F$11,1,0))","v":0},null,null,null,null,"-",0,"Heures en HS 40%",null,null,null,null,null,null,null,null,"Total dépenses:","-",{"$f":"SUM(AG22:AG32)","v":29.1}]
[null,"2014-12-28",null,0.48958333333333298,0.63541666666666696,0.14583333333333398,{"$f":"IF($D35<>\"\",IF($D35<Données!$C$2,1,0),0)","v":0},0.78125,0.875,9.375E-2,{"$f":"IF($H35<>\"\",IF($H35<Données!$C$3,1,0),0)","v":0},0.23958333333333398,0,{"$f":"$D35-$I34+IF($I34>$D35,1)","v":0.43749999999999967},{"$f":"IF($N35=Données!$F$12,0,IF($N35<Données!$F$11,1,0))","v":1},null,null,null,null,"-",0,"Nombre de repas"]
[null,"Total Semaine",null,null,{"$f":"WEEKNUM(B29,21)","v":52},{"$f":"SUM($F29:$F35)","v":0.52083333333333504},{"$f":"G29+G30+G31+G32+G33+G34+G35","v":0},null,null,{"$f":"SUM(J29:J35)","v":0.64583333333333337},{"$f":"K29+K30+K31+K32+K33+K34+K35","v":0},{"$f":"SUM(L29:L35)","v":1.489583333333335},{"$f":"SUM(M29:M35)","v":0},null,{"$f":"SUM(O29:O35)","v":1}]
[null,{"$f":"B35+1","v":"2014-12-29"},null,0.5,0.60416666666666696,{"$f":"$E37-$D37+IF($D37>$E37,1)","v":0.10416666666666696},{"$f":"IF($D37<>\"\",IF($D37<Données!$C$2,1,0),0)","v":0},0.83333333333333304,0.97916666666666696,{"$f":"$I37-$H37+IF($H37>$I37,1)","v":0.14583333333333393},{"$f":"IF($H37<>\"\",IF($H37<Données!$C$3,1,0),0)","v":0},{"$f":"$F37+$J37-($G37+$K37)*(\"00:30\")","v":0.25000000000000089},{"$f":"$G37+$K37","v":0},{"$f":"$D37-$I35+IF($I35>$D37,1)","v":0.625},{"$f":"IF($N37=Données!$F$12,0,IF($N37<Données!$F$11,1,0))","v":0},null,null,null,"Différence:"]
[null,{"$f":"B37+1","v":"2014-12-30"},null,null,null,{"$f":"$E38-$D38+IF($D38>$E38,1)","v":0},{"$f":"IF($D38<>\"\",IF($D38<Données!$C$2,1,0),0)","v":0},null,null,{"$f":"$I38-$H38+IF($H38>$I38,1)","v":0},{"$f":"IF($H38<>\"\",IF($H38<Données!$C$3,1,0),0)","v":0},{"$f":"$F38+$J38-($G38+$K38)*(\"00:30\")","v":0},{"$f":"$G38+$K38","v":0},{"$f":"$D38-$I37+IF($I37>$D38,1)","v":2.0833333333333037E-2},0]
[null,{"$f":"B38+1","v":"2014-12-31"},null,null,null,0,{"$f":"IF($D39<>\"\",IF($D39<Données!$C$2,1,0),0)","v":0},null,null,0,{"$f":"IF($H39<>\"\",IF($H39<Données!$C$3,1,0),0)","v":0},0,0,{"$f":"$D39-$I38+IF($I38>$D39,1)","v":0},{"$f":"IF($N39=Données!$F$12,0,IF($N39<Données!$F$11,1,0))","v":0},null,null,null,"Dont :","-","-3:40","Heures à taux normal"]
[null,"2015-01-01",null,0.48958333333333298,0.625,0.13541666666666702,{"$f":"IF($D40<>\"\",IF($D40<Données!$C$2,1,0),0)","v":0},0.78125,0.89583333333333304,0.11458333333333304,{"$f":"IF($H40<>\"\",IF($H40<Données!$C$3,1,0),0)","v":0},0.25000000000000006,0,0.48958333333333298,{"$f":"IF($N40=Données!$F$12,0,IF($N40<Données!$F$11,1,0))","v":0},null,null,null,null,"-",{"$f":"$U32-$U24+IF($U24>$U32,1)","v":0.69999999999999829},"Heures en HS 10%"]
[null,"2015-01-02",null,0.48958333333333298,0.57291666666666696,8.3333333333333981E-2,{"$f":"IF($D41<>\"\",IF($D41<Données!$C$2,1,0),0)","v":0},0.83333333333333304,0,0.16666666666666696,{"$f":"IF($H41<>\"\",IF($H41<Données!$C$3,1,0),0)","v":0},0.25000000000000094,0,0.59375,{"$f":"IF($N41=Données!$F$12,0,IF($N41<Données!$F$11,1,0))","v":0},null,null,null,null,"-",{"$f":"$U33-$U25+IF($U25>$U33,1)","v":0},"Heures en HS 20%"]
[null,"2015-01-03",null,null,null,0,{"$f":"IF($D42<>\"\",IF($D42<Données!$C$2,1,0),0)","v":0},null,null,0,{"$f":"IF($H42<>\"\",IF($H42<Données!$C$3,1,0),0)","v":0},0,0,0,{"$f":"IF($N42=Données!$F$12,0,IF($N42<Données!$F$11,1,0))","v":0},null,null,null,null,"-",{"$f":"$U34-$U26+IF($U26>$U34,1)","v":0},"Heures en HS 40%"]
[null,"2015-01-04",null,null,null,0,{"$f":"IF($D43<>\"\",IF($D43<Données!$C$2,1,0),0)","v":0},null,null,0,{"$f":"IF($H43<>\"\",IF($H43<Données!$C$3,1,0),0)","v":0},0,0,0,{"$f":"IF($N43=Données!$F$12,0,IF($N43<Données!$F$11,1,0))","v":0},null,null,null,null,"-",{"$f":"SUM(U35-U27)","v":0},"Nombre de repas"]
[null,"Total Semaine",null,null,{"$f":"WEEKNUM(B37,21)","v":1},{"$f":"SUM($F37:$F43)","v":0.32291666666666796},{"$f":"G37+G38+G39+G40+G41+G42+G43","v":0},null,null,{"$f":"SUM(J37:J43)","v":0.42708333333333393},{"$f":"K37+K38+K39+K40+K41+K42+K43","v":0},{"$f":"SUM(L37:L43)","v":0.75000000000000178},{"$f":"SUM(M37:M43)","v":0},null,{"$f":"SUM(O37:O43)","v":0}]
[null,{"$f":"B43+1","v":"2015-01-05"},null,null,null,{"$f":"$E45-$D45+IF($D45>$E45,1)","v":0},{"$f":"IF($D45<>\"\",IF($D45<Données!$C$2,1,0),0)","v":0},null,null,{"$f":"$I45-$H45+IF($H45>$I45,1)","v":0},{"$f":"IF($H45<>\"\",IF($H45<Données!$C$3,1,0),0)","v":0},{"$f":"$F45+$J45-($G45+$K45)*(\"00:30\")","v":0},{"$f":"$G45+$K45","v":0},{"$f":"$D45-$I43+IF($I43>$D45,1)","v":0},{"$f":"IF($N45=Données!$F$12,0,IF($N45<Données!$F$11,1,0))","v":0}]
[null,{"$f":"B45+1","v":"2015-01-06"},null,null,null,0,{"$f":"IF($D46<>\"\",IF($D46<Données!$C$2,1,0),0)","v":0},null,null,{"$f":"$I46-$H46+IF($H46>$I46,1)","v":0},{"$f":"IF($H46<>\"\",IF($H46<Données!$C$3,1,0),0)","v":0},{"$f":"$F46+$J46-($G46+$K46)*(\"00:30\")","v":0},{"$f":"$G46+$K46","v":0},{"$f":"$D46-$I45+IF($I45>$D46,1)","v":0},{"$f":"IF($N46=Données!$F$12,0,IF($N46<Données!$F$11,1,0))","v":0}]
[null,{"$f":"B46+1","v":"2015-01-07"},null,null,null,0,{"$f":"IF($D47<>\"\",IF($D47<Données!$C$2,1,0),0)","v":0},null,null,0,{"$f":"IF($H47<>\"\",IF($H47<Données!$C$3,1,0),0)","v":0},0,0,{"$f":"$D47-$I46+IF($I46>$D47,1)","v":0},{"$f":"IF($N47=Données!$F$12,0,IF($N47<Données!$F$11,1,0))","v":0}]
[null,"2015-01-08",null,null,null,0,{"$f":"IF($D48<>\"\",IF($D48<Données!$C$2,1,0),0)","v":0},null,null,0,{"$f":"IF($H48<>\"\",IF($H48<Données!$C$3,1,0),0)","v":0},0,0,0,{"$f":"IF($N48=Données!$F$12,0,IF($N48<Données!$F$11,1,0))","v":0}]
[null,"2015-01-09",null,null,null,0,{"$f":"IF($D49<>\"\",IF($D49<Données!$C$2,1,0),0)","v":0},null,null,0,{"$f":"IF($H49<>\"\",IF($H49<Données!$C$3,1,0),0)","v":0},0,0,0,{"$f":"IF($N49=Données!$F$12,0,IF($N49<Données!$F$11,1,0))","v":0}]
[null,"2015-01-10",null,null,null,0,{"$f":"IF($D50<>\"\",IF($D50<Données!$C$2,1,0),0)","v":0},null,null,0,{"$f":"IF($H50<>\"\",IF($H50<Données!$C$3,1,0),0)","v":0},0,0,0,{"$f":"IF($N50=Données!$F$12,0,IF($N50<Données!$F$11,1,0))","v":0}]
[null,"2015-01-11",null,null,null,0,{"$f":"IF($D51<>\"\",IF($D51<Données!$C$2,1,0),0)","v":0},null,null,0,{"$f":"IF($H51<>\"\",IF($H51<Données!$C$3,1,0),0)","v":0},0,0,0,{"$f":"IF($N51=Données!$F$12,0,IF($N51<Données!$F$11,1,0))","v":0}]
[null,"Total semaine",null,null,{"$f":"WEEKNUM(B45,21)","v":2},{"$f":"SUM($F45:$F51)","v":0},{"$f":"G45+G46+G47+G48+G49+G50+G51","v":0},null,null,{"$f":"SUM(J45:J51)","v":0},{"$f":"K45+K46+K47+K48+K49+K50+K51","v":0},{"$f":"SUM(L45:L51)","v":0},{"$f":"SUM(M45:M51)","v":0},null,{"$f":"SUM(O45:O51)","v":0}]
[null,null,null,null,null,null,null,null,null,null,null,null,null,7.041666666666667]
[null,null,null,null,null,null,null,null,null,null,null,{"$f":"CodeCouleur(M54)","v":50},null,"REPOS"]
[null,null,null,null,null,null,null,null,null,null,null,{"$f":"CodeCouleur(M55)","v":42},null,"Récup"]
[null,null,null,null,null,null,null,null,null,null,null,48,null,"JFG"]
[null,null,null,null,null,null,null,null,null,null,null,44,null,"VAC"]
[null,null,null,null,null,null,null,null,null,null,null,3,null,"MAL"]
[null,null,null,null,null,null,null,null,null,null,null,{"$f":"CodeCouleur(M59)","v":40},null,"Jf Taf"]
["Heures",null,1.4583333333333333,1.625,1.7916666666666667,"Total"]
["Taux",1,1.1000000000000001,1.2,1.4]
["S 1",{"$f":"IF($L$12<=$C$60,$L$12,$C$60)","v":1.281250000000002},{"$f":"IF($L$12<=$C$60,0,IF($L$12<=$D$60,$L$12,$D$60)-$C$60)","v":0},{"$f":"IF($L$12<=$D$60,0,IF($L$12<=$E$60,$L$12,$D$60)-$C$60)","v":0},{"$f":"IF($L$12<=$E$60,0,IF($L$12>$E$60,$L$12,$E$60)-$E$60)","v":0},{"$f":"B62+C62+D62+E62","v":1.281250000000002}]
["S 2",{"$f":"IF($L$20<=$C$60,$L$20,$C$60)","v":1.4166666666666679},{"$f":"IF($L$20<=$C$60,0,IF($L$20<=$D$60,$L$20,$D$60)-$C$60)","v":0},{"$f":"IF($L$20<=$D$60,0,IF($L$20<=$E$60,$L$20,$D$60)-$C$60)","v":0},{"$f":"IF($L$20<=$E$60,0,IF($L$20>$E$60,$L$20,$E$60)-$E$60)","v":0},1.4166666666666679]
["S 3",{"$f":"IF($L$28<=$C$60,$L$28,$C$60)","v":1.2604166666666681},{"$f":"IF($L$28<=$C$60,0,IF($L$28<=$D$60,$L$28,$D$60)-$C$60)","v":0},{"$f":"IF($L$28<=$D$60,0,IF($L$28<=$E$60,$L$28,$D$60)-$C$60)","v":0},{"$f":"IF($L$28<=$E$60,0,IF($L$28>$E$60,$L$28,$E$60)-$E$60)","v":0},1.2604166666666681]
["S 4",{"$f":"IF($L$36<=$C$60,$L$36,$C$60)","v":1.4583333333333333},{"$f":"IF($L$36<=$C$60,0,IF($L$36<=$D$60,$L$36,$D$60)-$C$60)","v":3.1250000000001776E-2},{"$f":"IF($L$36<=$D$60,0,IF($L$36<=$E$60,$L$36,$D$60)-$C$60)","v":0},{"$f":"IF($L$36<=$E$60,0,IF($L$36>$E$60,$L$36,$E$60)-$E$60)","v":0},1.489583333333335]
["S 5",{"$f":"IF($L$44<=$C$60,$L$44,$C$60)","v":0.75000000000000178},{"$f":"IF($L$44<=$C$60,0,IF($L$44<=$D$60,$L$44,$D$60)-$C$60)","v":0},{"$f":"IF($L$44<=$D$60,0,IF($L$44<=$E$60,$L$44,$D$60)-$C$60)","v":0},{"$f":"IF($L$44<=$E$60,0,IF($L$44>$E$60,$L$44,$E$60)-$E$60)","v":0},0.75000000000000178]
["S 6",{"$f":"IF($L$52<=$C$60,$L$52,$C$60)","v":0},{"$f":"IF($L$52<=$C$60,0,IF($L$52<=$D$60,$L$52,$D$60)-$C$60)","v":0},{"$f":"IF($L$52<=$D$60,0,IF($L$52<=$E$60,$L$52,$D$60)-$C$60)","v":0},{"$f":"IF($L$52<=$E$60,0,IF($L$52>$E$60,$L$52,$E$60)-$E$60)","v":0},0]
["Total",{"$f":"SUM(B62:B67)","v":6.1666666666666723},{"$f":"SUM(C62:C67)","v":3.1250000000001776E-2},{"$f":"SUM(D62:D67)","v":0},{"$f":"SUM(E62:E67)","v":0},6.1979166666666741]
[]
[]
["Jours","Repos","Récup","Jfg","Vac","Mal","Vides","Taf","Jf Taf","<11h"]
["S 1",{"$f":"NbCellsCoul($D$5:$I$11,50)*0.25","v":0.5},{"$f":"NbCellsCoul($D$5:$I$11,42)*0.25","v":0},{"$f":"NbCellsCoul($D$5:$I$11,48)*0.25","v":0},{"$f":"NbCellsCoul($D$5:$I$11,44)*0.25","v":0},{"$f":"NbCellsCoul($D$5:$I$11,3)*0.25","v":0},{"$f":"+COUNTBLANK(E5:H11)/2","v":2.5},{"$f":"7-$G72","v":4.5},{"$f":"NbCellsCoul($D$5:$I$11,40)*0.25","v":0.5},{"$f":"SUM($O$6:$O$11)","v":0}]
["S 2",{"$f":"NbCellsCoul($D$13:$I$19,50)*0.25","v":2},{"$f":"NbCellsCoul($D$13:$I$19,42)*0.25","v":0},{"$f":"NbCellsCoul($D$13:$I$19,48)*0.25","v":0},{"$f":"NbCellsCoul($D$13:$I$19,44)*0.25","v":0},{"$f":"NbCellsCoul($D$13:$I$19,3)*0.25","v":0},{"$f":"+COUNTBLANK(E13:H19)/2","v":2},5,{"$f":"NbCellsCoul($D$13:$I$19,40)*0.25","v":0},{"$f":"SUM($O$13:$O$19)","v":0}]
["S 3",{"$f":"NbCellsCoul($D$21:$I$27,50)*0.25","v":2},{"$f":"NbCellsCoul($D$21:$I$27,42)*0.25","v":0.5},{"$f":"NbCellsCoul($D$21:$I$27,48)*0.25","v":0},{"$f":"NbCellsCoul($D$21:$I$27,44)*0.25","v":0},{"$f":"NbCellsCoul($D$21:$I$27,3)*0.25","v":0},{"$f":"+COUNTBLANK(E21:H27)/2","v":2.5},4.5,{"$f":"NbCellsCoul($D$21:$I$27,40)*0.25","v":0},{"$f":"SUM($O$21:$O$27)","v":0}]
["S 4",{"$f":"NbCellsCoul($D$29:$I$35,50)*0.25","v":2},{"$f":"NbCellsCoul($D$29:$I$35,42)*0.25","v":0},{"$f":"NbCellsCoul($D$29:$I$35,48)*0.25","v":0},{"$f":"NbCellsCoul($D$29:$I$35,44)*0.25","v":1},{"$f":"NbCellsCoul($D$29:$I$35,3)*0.25","v":0},{"$f":"+COUNTBLANK(E29:H35)/2","v":3},4,{"$f":"NbCellsCoul($D$29:$I$35,40)*0.25","v":0},{"$f":"SUM($O$29:$O$35)","v":1}]
["S 5",{"$f":"NbCellsCoul($D$37:$I$43,50)*0.25","v":2},{"$f":"NbCellsCoul($D$37:$I$43,42)*0.25","v":0},{"$f":"NbCellsCoul($D$37:$I$43,48)*0.25","v":0},{"$f":"NbCellsCoul($D$37:$I$43,44)*0.25","v":0},{"$f":"NbCellsCoul($D$37:$I$43,3)*0.25","v":0},{"$f":"+COUNTBLANK(E37:H43)/2","v":4},3,{"$f":"NbCellsCoul($D$37:$I$43,40)*0.25","v":0},{"$f":"SUM($O$37:$O$43)","v":0}]
["S 6",{"$f":"NbCellsCoul($D$45:$I$51,50)*0.25","v":0},{"$f":"NbCellsCoul($D$45:$I$51,42)*0.25","v":0},{"$f":"NbCellsCoul($D$45:$I$51,48)*0.25","v":0},{"$f":"NbCellsCoul($D$45:$I$51,44)*0.25","v":0},{"$f":"NbCellsCoul($D$45:$I$51,3)*0.25","v":0},{"$f":"+COUNTBLANK(E45:H51)/2","v":7},0,{"$f":"NbCellsCoul($D$45:$I$51,40)*0.25","v":0},{"$f":"SUM($O$45:$O$51)","v":0}]
["Total",{"$f":"SUM(B$72:B$77)","v":8.5},0.5,0,1,{"$f":"SUM(F$72:F$77)","v":0},{"$f":"SUM(G$72:G$77)","v":21},{"$f":"SUM(H$72:H$77)","v":21},{"$f":"SUM(I$72:I$77)","v":0.5},{"$f":"SUM(J$72:J$77)","v":1}]

{"sheet":"Fév 14","index":4,"n_rows":78,"n_cols":34,"rows_kept":78,"cut":false,"hidden":false,"merged":[[7,1,7,2],[0,3,0,9],[0,18,0,21],[0,30,0,32],[2,1,3,2],[2,3,2,4],[2,5,3,5],[2,6,3,6],[2,7,2,8],[2,9,3,9],[2,10,3,10],[2,11,3,11],[2,12,3,12],[4,1,4,2],[5,1,5,2],[6,1,6,2],[19,1,19,3],[8,1,8,2],[9,1,9,2],[10,1,10,2],[11,1,11,3],[12,1,12,2],[13,1,13,2],[14,1,14,2],[15,1,15,2],[16,1,16,2],[17,1,17,2],[18,1,18,2],[31,1,31,2],[20,1,20,2],[21,1,21,2],[22,1,22,2],[23,1,23,2],[24,1,24,2],[25,1,25,2],[26,1,26,2],[27,1,27,3],[28,1,28,2],[29,1,29,2],[30,1,30,2],[43,1,43,3],[32,1,32,2],[33,1,33,2],[34,1,34,2],[35,1,35,3],[36,1,36,2],[37,1,37,2],[38,1,38,2],[39,1,39,2],[40,1,40,2],[41,1,41,2],[42,1,42,2],[50,1,50,2],[51,1,51,3],[59,0,59,1],[108,5,108,8],[44,1,44,2],[45,1,45,2],[46,1,46,2],[47,1,47,2],[48,1,48,2],[49,1,49,2]]}
[null,null,null,"TEMPS DE TRAVAIL",null,null,null,null,null,null,null,null,null,null,null,null,null,null,"RÉCAPITULATIF",null,null,null,null,null,null,null,null,null,null,null,"IMPÔTS"]
[null,null,null,null,null,{"$f":"Données!G14","v":12},null,null,null,{"$f":"Données!C15","v":2014}]
[null,"Jour",null,"Midi",null,"Cumul Midi","Repas","Soir",null,"Cumul Soir","Repas","Totaux","Total Repas"]
[null,null,null,"Début","Fin",null,null,"Début","Fin",null,null,null,null,null,null,null,null,null,null,null,null,null,null,null,null,null,null,null,null,null,null,{"$f":"VLOOKUP(F2,Données!E15:F26,2)","v":"Décembre"},{"$f":"J2","v":2014}]
[null,{"$f":"Données!I15-WEEKDAY(Données!I15-1)+1","v":"2014-12-01"},null,null,null,{"$f":"$E5-$D5+IF($D5>$E5,1)","v":0},{"$f":"IF($D5<>\"\",IF($D5<Données!$C$2,1,0),0)","v":0},null,null,{"$f":"$I5-$H5+IF($H5>$I5,1)","v":0},{"$f":"IF($H5<>\"\",IF($H5<Données!$C$3,1,0),0)","v":0},{"$f":"$F5+$J5-($G5+$K5)*(\"00:30\")","v":0},{"$f":"$G5+$K5","v":0}]
[null,{"$f":"B5+1","v":"2014-12-02"},null,null,null,{"$f":"$E6-$D6+IF($D6>$E6,1)","v":0},{"$f":"IF($D6<>\"\",IF($D6<Données!$C$2,1,0),0)","v":0},null,null,{"$f":"$I6-$H6+IF($H6>$I6,1)","v":0},{"$f":"IF($H6<>\"\",IF($H6<Données!$C$3,1,0),0)","v":0},{"$f":"$F6+$J6-($G6+$K6)*(\"00:30\")","v":0},{"$f":"$G6+$K6","v":0},{"$f":"$D6-$I5+IF($I5>$D6,1)","v":0},{"$f":"IF($N6=Données!$F$12,0,IF($N6<Données!$F$11,1,0))","v":0},null,null,null,"Soit au total pour le mois de :",null,{"$f":"VLOOKUP(F2,Données!E15:F26,2)","v":"Décembre"},{"$f":"J2","v":2014}]
[null,{"$f":"B6+1","v":"2014-12-03"},null,null,null,0,{"$f":"IF($D7<>\"\",IF($D7<Données!$C$2,1,0),0)","v":0},null,null,0,{"$f":"IF($H7<>\"\",IF($H7<Données!$C$3,1,0),0)","v":0},0,0,{"$f":"$D7-$I6+IF($I6>$D7,1)","v":0},{"$f":"IF($N7=Données!$F$12,0,IF($N7<Données!$F$11,1,0))","v":0}]
[null,"2014-12-04",null,null,null,0,{"$f":"IF($D8<>\"\",IF($D8<Données!$C$2,1,0),0)","v":0},null,null,0,{"$f":"IF($H8<>\"\",IF($H8<Données!$C$3,1,0),0)","v":0},0,0,{"$f":"$D8-$I7+IF($I7>$D8,1)","v":0},{"$f":"IF($N8=Données!$F$12,0,IF($N8<Données!$F$11,1,0))","v":0},null,null,null,null,null,null,null,null,null,null,null,null,null,null,null,"Numéro Fiscal :"]
[null,"2014-12-05",null,null,null,0,{"$f":"IF($D9<>\"\",IF($D9<Données!$C$2,1,0),0)","v":0},null,null,0,{"$f":"IF($H9<>\"\",IF($H9<Données!$C$3,1,0),0)","v":0},0,0,0,{"$f":"IF($N9=Données!$F$12,0,IF($N9<Données!$F$11,1,0))","v":0},null,null,null,"Nombre de jours travaillés :",null,{"$f":"H78","v":17.5},null,null,null,null,null,null,null,null,null,"MDP:"]
[null,"2014-12-06",null,0.48958333333333298,0.61458333333333304,0.12500000000000006,{"$f":"IF($D10<>\"\",IF($D10<Données!$C$2,1,0),0)","v":0},0.78125,2.0833333333333332E-2,0.23958333333333337,{"$f":"IF($H10<>\"\",IF($H10<Données!$C$3,1,0),0)","v":0},0.36458333333333343,0,{"$f":"$D10-$I9+IF($I9>$D10,1)","v":0.48958333333333298},{"$f":"IF($N10=Données!$F$12,0,IF($N10<Données!$F$11,1,0))","v":0},null,null,null,"Nombre de jours repos :",null,{"$f":"B78","v":8.5}]
[null,"2014-12-07",null,0.48958333333333298,0.64583333333333304,0.15625000000000006,{"$f":"IF($D11<>\"\",IF($D11<Données!$C$2,1,0),0)","v":0},0.78125,0.94791666666666696,0.16666666666666696,{"$f":"IF($H11<>\"\",IF($H11<Données!$C$3,1,0),0)","v":0},0.32291666666666702,0,{"$f":"$D11-$I10+IF($I10>$D11,1)","v":0.46874999999999967},{"$f":"IF($N11=Données!$F$12,0,IF($N11<Données!$F$11,1,0))","v":0},null,null,null,"Nombre de jours récup :",null,{"$f":"C$78","v":0},null,null,null,null,null,null,null,null,null,"Adresse domicile:","-"]
[null,"Total Semaine",null,null,{"$f":"WEEKNUM(B5,21)","v":49},{"$f":"SUM($F5:$F11)","v":0.28125000000000011},{"$f":"G5+G6+G7+G8+G9+G10+G11","v":0},null,null,{"$f":"SUM(J5:J11)","v":0.40625000000000033},{"$f":"K5+K6+K7+K8+K9+K10+K11","v":0},{"$f":"SUM(L5:L11)","v":0.68750000000000044},{"$f":"SUM(M5:M11)","v":0},null,{"$f":"SUM(O6:O11)","v":0},null,null,null,"Nombre de jfg :",null,{"$f":"D$78","v":0}]
[null,{"$f":"B11+1","v":"2014-12-08"},null,0.5,0.60416666666666696,{"$f":"$E13-$D13+IF($D13>$E13,1)","v":0.10416666666666696},{"$f":"IF($D13<>\"\",IF($D13<Données!$C$2,1,0),0)","v":0},0.78125,0.96875,{"$f":"$I13-$H13+IF($H13>$I13,1)","v":0.1875},{"$f":"IF($H13<>\"\",IF($H13<Données!$C$3,1,0),0)","v":0},{"$f":"$F13+$J13-($G13+$K13)*(\"00:30\")","v":0.29166666666666696},{"$f":"$G13+$K13","v":0},{"$f":"$D13-$I11+IF($I11>$D13,1)","v":0.55208333333333304},{"$f":"IF($N13=Données!$F$12,0,IF($N13<Données!$F$11,1,0))","v":0},null,null,null,"Nombre de jours de vacances :",null,{"$f":"E$78","v":2}]
[null,{"$f":"B13+1","v":"2014-12-09"},null,null,null,{"$f":"$E14-$D14+IF($D14>$E14,1)","v":0},{"$f":"IF($D14<>\"\",IF($D14<Données!$C$2,1,0),0)","v":0},null,null,{"$f":"$I14-$H14+IF($H14>$I14,1)","v":0},{"$f":"IF($H14<>\"\",IF($H14<Données!$C$3,1,0),0)","v":0},{"$f":"$F14+$J14-($G14+$K14)*(\"00:30\")","v":0},{"$f":"$G14+$K14","v":0},{"$f":"$D14-$I13+IF($I13>$D14,1)","v":3.125E-2},0,null,null,null,"Nombre de jours de maladie :",null,{"$f":"F$78","v":0}]
[null,{"$f":"B14+1","v":"2014-12-10"},null,null,null,0,{"$f":"IF($D15<>\"\",IF($D15<Données!$C$2,1,0),0)","v":0},null,null,0,{"$f":"IF($H15<>\"\",IF($H15<Données!$C$3,1,0),0)","v":0},0,0,{"$f":"$D15-$I14+IF($I14>$D15,1)","v":0},{"$f":"IF($N15=Données!$F$12,0,IF($N15<Données!$F$11,1,0))","v":0},null,null,null,"Nombre jours fériées travaillés :",null,{"$f":"I78","v":0},null,null,null,null,null,null,null,null,null,"Adresse lieu de travail:","-"]
[null,"2014-12-11",null,0.48958333333333298,0.625,0.13541666666666702,{"$f":"IF($D16<>\"\",IF($D16<Données!$C$2,1,0),0)","v":0},0.78125,0.91666666666666696,0.13541666666666696,{"$f":"IF($H16<>\"\",IF($H16<Données!$C$3,1,0),0)","v":0},0.27083333333333398,0,0.48958333333333298,{"$f":"IF($N16=Données!$F$12,0,IF($N16<Données!$F$11,1,0))","v":0},null,null,null,"Nombre de fois 11h de batement non respecté :",null,{"$f":"J78","v":5}]
[null,"2014-12-12",null,0.48958333333333298,0.63541666666666696,0.14583333333333398,{"$f":"IF($D17<>\"\",IF($D17<Données!$C$2,1,0),0)","v":0},0.78125,1.0416666666666666E-2,0.22916666666666663,{"$f":"IF($H17<>\"\",IF($H17<Données!$C$3,1,0),0)","v":0},0.37500000000000061,0,0.57291666666666607,{"$f":"IF($N17=Données!$F$12,0,IF($N17<Données!$F$11,1,0))","v":0}]
[null,"2014-12-13",null,0.48958333333333298,0.59375,0.10416666666666702,{"$f":"IF($D18<>\"\",IF($D18<Données!$C$2,1,0),0)","v":0},0.78125,4.1666666666666664E-2,0.26041666666666663,{"$f":"IF($H18<>\"\",IF($H18<Données!$C$3,1,0),0)","v":0},0.36458333333333365,0,0.4791666666666663,{"$f":"IF($N18=Données!$F$12,0,IF($N18<Données!$F$11,1,0))","v":0},null,null,null,null,null,null,null,null,null,null,null,null,null,null,null,"Distance ( Source Mappy) :","-","7,4 KM"]
[null,"2014-12-14",null,0.48958333333333298,0.65625,0.16666666666666702,{"$f":"IF($D19<>\"\",IF($D19<Données!$C$2,1,0),0)","v":0},0.78125,0.89583333333333304,0.11458333333333304,{"$f":"IF($H19<>\"\",IF($H19<Données!$C$3,1,0),0)","v":0},0.28125000000000006,0,{"$f":"$D19-$I18+IF($I18>$D19,1)","v":0.4479166666666663},{"$f":"IF($N19=Données!$F$12,0,IF($N19<Données!$F$11,1,0))","v":1},null,null,null,null,null,{"$f":"SUM(L12+L20+L28+L36+L44+L52)","v":6.8645833333333393},"Heures effectués"]
[null,"Total Semaine",null,null,{"$f":"WEEKNUM(B13,21)","v":50},{"$f":"SUM($F13:$F19)","v":0.656250000000002},{"$f":"G13+G14+G15+G16+G17+G18+G19","v":0},null,null,{"$f":"SUM(J13:J19)","v":0.92708333333333326},{"$f":"K13+K14+K15+K16+K17+K18+K19","v":0},{"$f":"SUM(L13:L19)","v":1.5833333333333353},{"$f":"SUM(M13:M19)","v":0},null,{"$f":"SUM(O13:O19)","v":1},null,null,null,null,null,{"$f":"IF(U19<N53,\"- \"&TEXT(ABS(N53-U19),\"[hh]:mm\"),U19-N53)","v":"- 04:15"},"Heures dues/supp",null,null,null,null,null,null,null,null,"Nombre Aller-Retour :","-",{"$f":"COUNT(E5:E11,I5:I11,E13:E19,I13:I19,E21:E27,I21:I27,E29:E35,I29:I35,E37:E43,I37:I43,E45:E51,I45:I51)","v":35}]
[null,{"$f":"B19+1","v":"2014-12-15"},null,0.5,0.625,{"$f":"$E21-$D21+IF($D21>$E21,1)","v":0.125},{"$f":"IF($D21<>\"\",IF($D21<Données!$C$2,1,0),0)","v":0},0.79166666666666696,1.0416666666666666E-2,{"$f":"$I21-$H21+IF($H21>$I21,1)","v":0.21874999999999967},{"$f":"IF($H21<>\"\",IF($H21<Données!$C$3,1,0),0)","v":0},{"$f":"$F21+$J21-($G21+$K21)*(\"00:30\")","v":0.34374999999999967},{"$f":"$G21+$K21","v":0},{"$f":"$D21-$I19+IF($I19>$D21,1)","v":0.60416666666666696},{"$f":"IF($N21=Données!$F$12,0,IF($N21<Données!$F$11,1,0))","v":0},null,null,null,null,null,null,null,null,null,null,null,null,null,null,null,"Km Parcourue :","-",{"$f":"SUM(AG20*14.8)","v":518},"Km"]
[null,{"$f":"B21+1","v":"2014-12-16"},null,null,null,{"$f":"$E22-$D22+IF($D22>$E22,1)","v":0},{"$f":"IF($D22<>\"\",IF($D22<Données!$C$2,1,0),0)","v":0},null,null,{"$f":"$I22-$H22+IF($H22>$I22,1)","v":0},{"$f":"IF($H22<>\"\",IF($H22<Données!$C$3,1,0),0)","v":0},{"$f":"$F22+$J22-($G22+$K22)*(\"00:30\")","v":0},{"$f":"$G22+$K22","v":0},{"$f":"$D22-$I21+IF($I21>$D22,1)","v":0.98958333333333337},{"$f":"IF($N22=Données!$F$12,0,IF($N22<Données!$F$11,1,0))","v":0},null,null,null,null,null,null,null,null,null,null,null,null,null,null,null,"Horodateur Payé :","-",16.7]
[null,{"$f":"B22+1","v":"2014-12-17"},null,null,null,0,{"$f":"IF($D23<>\"\",IF($D23<Données!$C$2,1,0),0)","v":0},null,null,0,{"$f":"IF($H23<>\"\",IF($H23<Données!$C$3,1,0),0)","v":0},0,0,{"$f":"$D23-$I22+IF($I22>$D23,1)","v":0},{"$f":"IF($N23=Données!$F$12,0,IF($N23<Données!$F$11,1,0))","v":0},null,null,null,"Dont :","-",{"$f":"$B$68","v":6.0208333333333339},"Heures à taux normal ( 35h )",null,null,null,null,null,null,null,null,"Achat divers pour le travail :","-"]
[null,"2014-12-18",null,0.48958333333333298,0.61458333333333304,0.12500000000000006,{"$f":"IF($D24<>\"\",IF($D24<Données!$C$2,1,0),0)","v":0},0.78125,0.94791666666666696,0.16666666666666696,{"$f":"IF($H24<>\"\",IF($H24<Données!$C$3,1,0),0)","v":0},0.29166666666666702,0,0.48958333333333298,{"$f":"IF($N24=Données!$F$12,0,IF($N24<Données!$F$11,1,0))","v":0},null,null,null,null,"-",{"$f":"$C$68","v":0.45833333333333548},"Heures en HS 10%         ( 35h à 39h )",null,null,null,null,null,null,null,null,null,"-"]
[null,"2014-12-19",null,0.48958333333333298,0.625,0.13541666666666702,{"$f":"IF($D25<>\"\",IF($D25<Données!$C$2,1,0),0)","v":0},0.77083333333333304,6.25E-2,0.29166666666666696,0,0.42708333333333398,0,0.54166666666666607,{"$f":"IF($N25=Données!$F$12,0,IF($N25<Données!$F$11,1,0))","v":0},null,null,null,null,"-",{"$f":"$D$68","v":0.28125000000000006},"Heures en HS 20%         (39h à 43h )",null,null,null,null,null,null,null,null,null,"-"]
[null,"2014-12-20",null,0.48958333333333298,0.64583333333333304,0.15625000000000006,{"$f":"IF($D26<>\"\",IF($D26<Données!$C$2,1,0),0)","v":0},0.78125,4.1666666666666664E-2,0.26041666666666663,{"$f":"IF($H26<>\"\",IF($H26<Données!$C$3,1,0),0)","v":0},0.41666666666666669,0,{"$f":"$D26-$I25+IF($I25>$D26,1)","v":0.42708333333333298},{"$f":"IF($N26=Données!$F$12,0,IF($N26<Données!$F$11,1,0))","v":1},null,null,null,null,"-",{"$f":"$E$68","v":0.10416666666666763},"Heures en HS 40%         ( 43h et plus )",null,null,null,null,null,null,null,null,null,"-"]
[null,"2014-12-21",null,0.48958333333333298,0.70833333333333304,0.21875000000000006,{"$f":"IF($D27<>\"\",IF($D27<Données!$C$2,1,0),0)","v":0},0.78125,0.97916666666666696,0.19791666666666696,{"$f":"IF($H27<>\"\",IF($H27<Données!$C$3,1,0),0)","v":0},0.41666666666666702,0,0.4479166666666663,{"$f":"IF($N27=Données!$F$12,0,IF($N27<Données!$F$11,1,0))","v":1},null,null,null,null,"-",{"$f":"SUM(M12+M20+M28+M36+M44+M52)","v":0},"Nombre de repas",null,null,null,null,null,null,null,null,null,"-"]
[null,"Total Semaine",null,null,{"$f":"WEEKNUM(B21,21)","v":51},{"$f":"SUM($F21:$F27)","v":0.76041666666666718},{"$f":"G21+G22+G23+G24+G25+G26+G27","v":0},null,null,{"$f":"SUM(J21:J27)","v":1.1354166666666672},{"$f":"K21+K22+K23+K24+K25+K26+K27","v":0},{"$f":"SUM(L21:L27)","v":1.8958333333333344},{"$f":"SUM(M21:M27)","v":0},null,{"$f":"SUM(O21:O27)","v":2},null,null,null,null,null,null,null,null,null,null,null,null,null,null,null,null,"-"]
[null,{"$f":"B27+1","v":"2014-12-22"},null,0.48958333333333298,0.625,{"$f":"$E29-$D29+IF($D29>$E29,1)","v":0.13541666666666702},{"$f":"IF($D29<>\"\",IF($D29<Données!$C$2,1,0),0)","v":0},0.78125,0.97916666666666696,{"$f":"$I29-$H29+IF($H29>$I29,1)","v":0.19791666666666696},{"$f":"IF($H29<>\"\",IF($H29<Données!$C$3,1,0),0)","v":0},{"$f":"$F29+$J29-($G29+$K29)*(\"00:30\")","v":0.33333333333333398},{"$f":"$G29+$K29","v":0},{"$f":"$D29-$I27+IF($I27>$D29,1)","v":0.51041666666666607},{"$f":"IF($N29=Données!$F$12,0,IF($N29<Données!$F$11,1,0))","v":0},null,null,null,"Heure fiche de paie:",null,null,null,null,null,null,null,null,null,null,null,null,"-"]
[null,{"$f":"B29+1","v":"2014-12-23"},null,null,null,{"$f":"$E30-$D30+IF($D30>$E30,1)","v":0},{"$f":"IF($D30<>\"\",IF($D30<Données!$C$2,1,0),0)","v":0},null,null,{"$f":"$I30-$H30+IF($H30>$I30,1)","v":0},{"$f":"IF($H30<>\"\",IF($H30<Données!$C$3,1,0),0)","v":0},{"$f":"$F30+$J30-($G30+$K30)*(\"00:30\")","v":0},{"$f":"$G30+$K30","v":0},{"$f":"$D30-$I29+IF($I29>$D30,1)","v":2.0833333333333037E-2},0,null,null,null,null,null,null,null,null,null,null,null,null,null,null,null,null,"-"]
[null,{"$f":"B30+1","v":"2014-12-24"},null,null,null,0,{"$f":"IF($D31<>\"\",IF($D31<Données!$C$2,1,0),0)","v":0},null,null,0,{"$f":"IF($H31<>\"\",IF($H31<Données!$C$3,1,0),0)","v":0},0,0,{"$f":"$D31-$I30+IF($I30>$D31,1)","v":0},{"$f":"IF($N31=Données!$F$12,0,IF($N31<Données!$F$11,1,0))","v":0},null,null,null,"Dont :","-",6.3194444444444438,"Heures à taux normal",null,null,null,null,null,null,null,null,null,"-"]
[null,"2014-12-25",null,null,null,0,{"$f":"IF($D32<>\"\",IF($D32<Données!$C$2,1,0),0)","v":0},null,null,0,{"$f":"IF($H32<>\"\",IF($H32<Données!$C$3,1,0),0)","v":0},0.32291666666666669,0,0,{"$f":"IF($N32=Données!$F$12,0,IF($N32<Données!$F$11,1,0))","v":0},null,null,null,null,"-",0.73125000000000007,"Heures en HS 10%",null,null,null,null,null,null,null,null,null,"-"]
[null,"2014-12-26",null,null,null,0,{"$f":"IF($D33<>\"\",IF($D33<Données!$C$2,1,0),0)","v":0},null,null,0,{"$f":"IF($H33<>\"\",IF($H33<Données!$C$3,1,0),0)","v":0},0.32291666666666669,0,0,{"$f":"IF($N33=Données!$F$12,0,IF($N33<Données!$F$11,1,0))","v":0},null,null,null,null,"-",0,"Heures en HS 20%"]
[null,"2014-12-27",null,0.48958333333333298,0.63541666666666696,0.14583333333333398,{"$f":"IF($D34<>\"\",IF($D34<Données!$C$2,1,0),0)","v":0},0.78125,5.2083333333333336E-2,0.27083333333333337,{"$f":"IF($H34<>\"\",IF($H34<Données!$C$3,1,0),0)","v":0},0.41666666666666735,0,0.48958333333333298,{"$f":"IF($N34=Données!$F$12,0,IF($N34<Données!$F$11,1,0))","v":0},null,null,null,null,"-",0,"Heures en HS 40%",null,null,null,null,null,null,null,null,"Total dépenses:","-",{"$f":"SUM(AG22:AG32)","v":16.7}]
[null,"2014-12-28",null,0.48958333333333298,0.63541666666666696,0.14583333333333398,{"$f":"IF($D35<>\"\",IF($D35<Données!$C$2,1,0),0)","v":0},0.78125,0.97916666666666696,0.19791666666666696,{"$f":"IF($H35<>\"\",IF($H35<Données!$C$3,1,0),0)","v":0},0.34375000000000094,0,0.43749999999999967,{"$f":"IF($N35=Données!$F$12,0,IF($N35<Données!$F$11,1,0))","v":1},null,null,null,null,"-",0,"Nombre de repas"]
[null,"Total Semaine",null,null,{"$f":"WEEKNUM(B29,21)","v":52},{"$f":"SUM($F29:$F35)","v":0.42708333333333498},{"$f":"G29+G30+G31+G32+G33+G34+G35","v":0},null,null,{"$f":"SUM(J29:J35)","v":0.6666666666666673},{"$f":"K29+K30+K31+K32+K33+K34+K35","v":0},{"$f":"SUM(L29:L35)","v":1.7395833333333357},{"$f":"SUM(M29:M35)","v":0},null,{"$f":"SUM(O29:O35)","v":1}]
[null,{"$f":"B35+1","v":"2014-12-29"},null,0.48958333333333298,0.61458333333333304,{"$f":"$E37-$D37+IF($D37>$E37,1)","v":0.12500000000000006},{"$f":"IF($D37<>\"\",IF($D37<Données!$C$2,1,0),0)","v":0},0.78125,0,{"$f":"$I37-$H37+IF($H37>$I37,1)","v":0.21875},{"$f":"IF($H37<>\"\",IF($H37<Données!$C$3,1,0),0)","v":0},{"$f":"$F37+$J37-($G37+$K37)*(\"00:30\")","v":0.34375000000000006},{"$f":"$G37+$K37","v":0},{"$f":"$D37-$I35+IF($I35>$D37,1)","v":0.51041666666666607},{"$f":"IF($N37=Données!$F$12,0,IF($N37<Données!$F$11,1,0))","v":0},null,null,null,"Différence:"]
[null,{"$f":"B37+1","v":"2014-12-30"},null,null,null,{"$f":"$E38-$D38+IF($D38>$E38,1)","v":0},{"$f":"IF($D38<>\"\",IF($D38<Données!$C$2,1,0),0)","v":0},null,null,{"$f":"$I38-$H38+IF($H38>$I38,1)","v":0},{"$f":"IF($H38<>\"\",IF($H38<Données!$C$3,1,0),0)","v":0},{"$f":"$F38+$J38-($G38+$K38)*(\"00:30\")","v":0},{"$f":"$G38+$K38","v":0},{"$f":"$D38-$I37+IF($I37>$D38,1)","v":0},{"$f":"IF($N38=Données!$F$12,0,IF($N38<Données!$F$11,1,0))","v":0}]
[null,{"$f":"B38+1","v":"2014-12-31"},null,null,null,0,{"$f":"IF($D39<>\"\",IF($D39<Données!$C$2,1,0),0)","v":0},null,null,0,{"$f":"IF($H39<>\"\",IF($H39<Données!$C$3,1,0),0)","v":0},0,0,{"$f":"$D39-$I38+IF($I38>$D39,1)","v":0},{"$f":"IF($N39=Données!$F$12,0,IF($N39<Données!$F$11,1,0))","v":0},null,null,null,"Dont :","-","-7:10","Heures à taux normal"]
[null,"2015-01-01",null,0.48958333333333298,0.625,0.13541666666666702,{"$f":"IF($D40<>\"\",IF($D40<Données!$C$2,1,0),0)","v":0},0.78125,0.97916666666666696,0.19791666666666696,{"$f":"IF($H40<>\"\",IF($H40<Données!$C$3,1,0),0)","v":0},0.33333333333333398,0,0.48958333333333298,{"$f":"IF($N40=Données!$F$12,0,IF($N40<Données!$F$11,1,0))","v":0},null,null,null,null,"-","-6:33","Heures en HS 10%"]
[null,"2015-01-02",null,null,null,0,{"$f":"IF($D41<>\"\",IF($D41<Données!$C$2,1,0),0)","v":0},0.78125,6.25E-2,0.28125,{"$f":"IF($H41<>\"\",IF($H41<Données!$C$3,1,0),0)","v":0},0.28125,0,2.0833333333333037E-2,1,null,null,null,null,"-",{"$f":"$U25-$U33+IF($U33>$U25,1)","v":0.28125000000000006},"Heures en HS 20%"]
[null,"2015-01-03",null,null,null,0,{"$f":"IF($D42<>\"\",IF($D42<Données!$C$2,1,0),0)","v":0},null,null,0,{"$f":"IF($H42<>\"\",IF($H42<Données!$C$3,1,0),0)","v":0},0,0,0.9375,{"$f":"IF($N42=Données!$F$12,0,IF($N42<Données!$F$11,1,0))","v":0},null,null,null,null,"-",{"$f":"$U26-$U34+IF($U34>$U26,1)","v":0.10416666666666763},"Heures en HS 40%"]
[null,"2015-01-04",null,null,null,0,{"$f":"IF($D43<>\"\",IF($D43<Données!$C$2,1,0),0)","v":0},null,null,0,{"$f":"IF($H43<>\"\",IF($H43<Données!$C$3,1,0),0)","v":0},0,0,0,{"$f":"IF($N43=Données!$F$12,0,IF($N43<Données!$F$11,1,0))","v":0},null,null,null,null,"-",{"$f":"SUM(U35-U27)","v":0},"Nombre de repas"]
[null,"Total Semaine",null,null,{"$f":"WEEKNUM(B37,21)","v":1},{"$f":"SUM($F37:$F43)","v":0.26041666666666707},{"$f":"G37+G38+G39+G40+G41+G42+G43","v":0},null,null,{"$f":"SUM(J37:J43)","v":0.69791666666666696},{"$f":"K37+K38+K39+K40+K41+K42+K43","v":0},{"$f":"SUM(L37:L43)","v":0.95833333333333404},{"$f":"SUM(M37:M43)","v":0},null,{"$f":"SUM(O37:O43)","v":1}]
[null,{"$f":"B43+1","v":"2015-01-05"},null,null,null,{"$f":"$E45-$D45+IF($D45>$E45,1)","v":0},{"$f":"IF($D45<>\"\",IF($D45<Données!$C$2,1,0),0)","v":0},null,null,{"$f":"$I45-$H45+IF($H45>$I45,1)","v":0},{"$f":"IF($H45<>\"\",IF($H45<Données!$C$3,1,0),0)","v":0},{"$f":"$F45+$J45-($G45+$K45)*(\"00:30\")","v":0},{"$f":"$G45+$K45","v":0},{"$f":"$D45-$I43+IF($I43>$D45,1)","v":0},{"$f":"IF($N45=Données!$F$12,0,IF($N45<Données!$F$11,1,0))","v":0}]
[null,{"$f":"B45+1","v":"2015-01-06"},null,null,null,0,{"$f":"IF($D46<>\"\",IF($D46<Données!$C$2,1,0),0)","v":0},null,null,{"$f":"$I46-$H46+IF($H46>$I46,1)","v":0},{"$f":"IF($H46<>\"\",IF($H46<Données!$C$3,1,0),0)","v":0},{"$f":"$F46+$J46-($G46+$K46)*(\"00:30\")","v":0},{"$f":"$G46+$K46","v":0},{"$f":"$D46-$I45+IF($I45>$D46,1)","v":0},{"$f":"IF($N46=Données!$F$12,0,IF($N46<Données!$F$11,1,0))","v":0}]
[null,{"$f":"B46+1","v":"2015-01-07"},null,null,null,0,{"$f":"IF($D47<>\"\",IF($D47<Données!$C$2,1,0),0)","v":0},null,null,0,{"$f":"IF($H47<>\"\",IF($H47<Données!$C$3,1,0),0)","v":0},0,0,{"$f":"$D47-$I46+IF($I46>$D47,1)","v":0},{"$f":"IF($N47=Données!$F$12,0,IF($N47<Données!$F$11,1,0))","v":0}]
[null,"2015-01-08",null,null,null,0,{"$f":"IF($D48<>\"\",IF($D48<Données!$C$2,1,0),0)","v":0},null,null,0,{"$f":"IF($H48<>\"\",IF($H48<Données!$C$3,1,0),0)","v":0},0,0,0,{"$f":"IF($N48=Données!$F$12,0,IF($N48<Données!$F$11,1,0))","v":0}]
[null,"2015-01-09",null,null,null,0,{"$f":"IF($D49<>\"\",IF($D49<Données!$C$2,1,0),0)","v":0},null,null,0,{"$f":"IF($H49<>\"\",IF($H49<Données!$C$3,1,0),0)","v":0},0,0,0,{"$f":"IF($N49=Données!$F$12,0,IF($N49<Données!$F$11,1,0))","v":0}]
[null,"2015-01-10",null,null,null,0,{"$f":"IF($D50<>\"\",IF($D50<Données!$C$2,1,0),0)","v":0},null,null,0,{"$f":"IF($H50<>\"\",IF($H50<Données!$C$3,1,0),0)","v":0},0,0,0,{"$f":"IF($N50=Données!$F$12,0,IF($N50<Données!$F$11,1,0))","v":0}]
[null,"2015-01-11",null,null,null,0,{"$f":"IF($D51<>\"\",IF($D51<Données!$C$2,1,0),0)","v":0},null,null,0,{"$f":"IF($H51<>\"\",IF($H51<Données!$C$3,1,0),0)","v":0},0,0,0,{"$f":"IF($N51=Données!$F$12,0,IF($N51<Données!$F$11,1,0))","v":0}]
[null,"Total semaine",null,null,{"$f":"WEEKNUM(B45,21)","v":2},{"$f":"SUM($F45:$F51)","v":0},{"$f":"G45+G46+G47+G48+G49+G50+G51","v":0},null,null,{"$f":"SUM(J45:J51)","v":0},{"$f":"K45+K46+K47+K48+K49+K50+K51","v":0},{"$f":"SUM(L45:L51)","v":0},{"$f":"SUM(M45:M51)","v":0},null,{"$f":"SUM(O45:O51)","v":0}]
[null,null,null,null,null,null,null,null,null,null,null,null,null,7.041666666666667]
[null,null,null,null,null,null,null,null,null,null,null,{"$f":"CodeCouleur(M54)","v":50},null,"REPOS"]
[null,null,null,null,null,null,null,null,null,null,null,{"$f":"CodeCouleur(M55)","v":42},null,"Récup"]
[null,null,null,null,null,null,null,null,null,null,null,48,null,"JFG"]
[null,null,null,null,null,null,null,null,null,null,null,44,null,"VAC"]
[null,null,null,null,null,null,null,null,null,null,null,3,null,"MAL"]
[null,null,null,null,null,null,null,null,null,null,null,{"$f":"CodeCouleur(M59)","v":40},null,"Jf Taf"]
["Heures",null,1.4583333333333333,1.625,1.7916666666666667,"Total"]
["Taux",1,1.1000000000000001,1.2,1.4]
["S 1",{"$f":"IF($L$12<=$C$60,$L$12,$C$60)","v":0.68750000000000044},{"$f":"IF($L$12<=$C$60,0,IF($L$12<=$D$60,$L$12,$D$60)-$C$60)","v":0},{"$f":"IF($L$12<=$D$60,0,IF($L$12<=$E$60,$L$12,$D$60)-$C$60)","v":0},{"$f":"IF($L$12<=$E$60,0,IF($L$12>$E$60,$L$12,$E$60)-$E$60)","v":0},{"$f":"B62+C62+D62+E62","v":0.68750000000000044}]
["S 2",{"$f":"IF($L$20<=$C$60,$L$20,$C$60)","v":1.4583333333333333},{"$f":"IF($L$20<=$C$60,0,IF($L$20<=$D$60,$L$20,$D$60)-$C$60)","v":0.125000000000002},{"$f":"IF($L$20<=$D$60,0,IF($L$20<=$E$60,$L$20,$D$60)-$C$60)","v":0},{"$f":"IF($L$20<=$E$60,0,IF($L$20>$E$60,$L$20,$E$60)-$E$60)","v":0},1.5833333333333353]
["S 3",{"$f":"IF($L$28<=$C$60,$L$28,$C$60)","v":1.4583333333333333},{"$f":"IF($L$28<=$C$60,0,IF($L$28<=$D$60,$L$28,$D$60)-$C$60)","v":0.16666666666666674},{"$f":"IF($L$28<=$D$60,0,IF($L$28<=$E$60,$L$28,$D$60)-$C$60)","v":0.16666666666666674},{"$f":"IF($L$28<=$E$60,0,IF($L$28>$E$60,$L$28,$E$60)-$E$60)","v":0.10416666666666763},1.8958333333333344]
["S 4",{"$f":"IF($L$36<=$C$60,$L$36,$C$60)","v":1.4583333333333333},{"$f":"IF($L$36<=$C$60,0,IF($L$36<=$D$60,$L$36,$D$60)-$C$60)","v":0.16666666666666674},0.11458333333333333,{"$f":"IF($L$36<=$E$60,0,IF($L$36>$E$60,$L$36,$E$60)-$E$60)","v":0},1.7395833333333333]
["S 5",{"$f":"IF($L$44<=$C$60,$L$44,$C$60)","v":0.95833333333333404},{"$f":"IF($L$44<=$C$60,0,IF($L$44<=$D$60,$L$44,$D$60)-$C$60)","v":0},{"$f":"IF($L$44<=$D$60,0,IF($L$44<=$E$60,$L$44,$D$60)-$C$60)","v":0},{"$f":"IF($L$44<=$E$60,0,IF($L$44>$E$60,$L$44,$E$60)-$E$60)","v":0},0.95833333333333404]
["S 6",{"$f":"IF($L$52<=$C$60,$L$52,$C$60)","v":0},{"$f":"IF($L$52<=$C$60,0,IF($L$52<=$D$60,$L$52,$D$60)-$C$60)","v":0},{"$f":"IF($L$52<=$D$60,0,IF($L$52<=$E$60,$L$52,$D$60)-$C$60)","v":0},{"$f":"IF($L$52<=$E$60,0,IF($L$52>$E$60,$L$52,$E$60)-$E$60)","v":0},0]
["Total",{"$f":"SUM(B62:B67)","v":6.0208333333333339},{"$f":"SUM(C62:C67)","v":0.45833333333333548},{"$f":"SUM(D62:D67)","v":0.28125000000000006},{"$f":"SUM(E62:E67)","v":0.10416666666666763},6.8645833333333375]
[]
[]
["Jours","Repos","Récup","Jfg","Vac","Mal","Vides","Taf","Jf Taf","<11h"]
["S 1",{"$f":"NbCellsCoul($D$5:$I$11,50)*0.25","v":0},{"$f":"NbCellsCoul($D$5:$I$11,42)*0.25","v":0},{"$f":"NbCellsCoul($D$5:$I$11,48)*0.25","v":0},{"$f":"NbCellsCoul($D$5:$I$11,44)*0.25","v":0},{"$f":"NbCellsCoul($D$5:$I$11,3)*0.25","v":0},{"$f":"+COUNTBLANK(E5:H11)/2","v":5},{"$f":"7-$G72","v":2},{"$f":"NbCellsCoul($D$5:$I$11,40)*0.25","v":0},{"$f":"SUM($O$6:$O$11)","v":0}]
["S 2",{"$f":"NbCellsCoul($D$13:$I$19,50)*0.25","v":2},{"$f":"NbCellsCoul($D$13:$I$19,42)*0.25","v":0},{"$f":"NbCellsCoul($D$13:$I$19,48)*0.25","v":0},{"$f":"NbCellsCoul($D$13:$I$19,44)*0.25","v":0},{"$f":"NbCellsCoul($D$13:$I$19,3)*0.25","v":0},{"$f":"+COUNTBLANK(E13:H19)/2","v":2},5,{"$f":"NbCellsCoul($D$13:$I$19,40)*0.25","v":0},{"$f":"SUM($O$13:$O$19)","v":1}]
["S 3",{"$f":"NbCellsCoul($D$21:$I$27,50)*0.25","v":2},{"$f":"NbCellsCoul($D$21:$I$27,42)*0.25","v":0},{"$f":"NbCellsCoul($D$21:$I$27,48)*0.25","v":0},{"$f":"NbCellsCoul($D$21:$I$27,44)*0.25","v":0},{"$f":"NbCellsCoul($D$21:$I$27,3)*0.25","v":0},{"$f":"+COUNTBLANK(E21:H27)/2","v":2},5,{"$f":"NbCellsCoul($D$21:$I$27,40)*0.25","v":0},{"$f":"SUM($O$21:$O$27)","v":2}]
["S 4",{"$f":"NbCellsCoul($D$29:$I$35,50)*0.25","v":2},{"$f":"NbCellsCoul($D$29:$I$35,42)*0.25","v":0},{"$f":"NbCellsCoul($D$29:$I$35,48)*0.25","v":0},{"$f":"NbCellsCoul($D$29:$I$35,44)*0.25","v":2},{"$f":"NbCellsCoul($D$29:$I$35,3)*0.25","v":0},{"$f":"+COUNTBLANK(E29:H35)/2","v":4},3,{"$f":"NbCellsCoul($D$29:$I$35,40)*0.25","v":0},{"$f":"SUM($O$29:$O$35)","v":1}]
["S 5",{"$f":"NbCellsCoul($D$37:$I$43,50)*0.25","v":2.5},{"$f":"NbCellsCoul($D$37:$I$43,42)*0.25","v":0},{"$f":"NbCellsCoul($D$37:$I$43,48)*0.25","v":0},{"$f":"NbCellsCoul($D$37:$I$43,44)*0.25","v":0},{"$f":"NbCellsCoul($D$37:$I$43,3)*0.25","v":0},{"$f":"+COUNTBLANK(E37:H43)/2","v":4.5},2.5,{"$f":"NbCellsCoul($D$37:$I$43,40)*0.25","v":0},{"$f":"SUM($O$37:$O$43)","v":1}]
["S 6",{"$f":"NbCellsCoul($D$45:$I$51,50)*0.25","v":0},{"$f":"NbCellsCoul($D$45:$I$51,42)*0.25","v":0},{"$f":"NbCellsCoul($D$45:$I$51,48)*0.25","v":0},{"$f":"NbCellsCoul($D$45:$I$51,44)*0.25","v":0},{"$f":"NbCellsCoul($D$45:$I$51,3)*0.25","v":0},{"$f":"+COUNTBLANK(E45:H51)/2","v":7},0,{"$f":"NbCellsCoul($D$45:$I$51,40)*0.25","v":0},{"$f":"SUM($O$45:$O$51)","v":0}]
["Total",{"$f":"SUM(B$72:B$77)","v":8.5},0,0,2,{"$f":"SUM(F$72:F$77)","v":0},{"$f":"SUM(G$72:G$77)","v":24.5},{"$f":"SUM(H$72:H$77)","v":17.5},{"$f":"SUM(I$72:I$77)","v":0},{"$f":"SUM(J$72:J$77)","v":5}]

{"sheet":"Mars 14","index":5,"n_rows":78,"n_cols":34,"rows_kept":78,"cut":false,"hidden":false,"merged":[[7,1,7,2],[0,3,0,9],[0,18,0,21],[0,30,0,32],[2,1,3,2],[2,3,2,4],[2,5,3,5],[2,6,3,6],[2,7,2,8],[2,9,3,9],[2,10,3,10],[2,11,3,11],[2,12,3,12],[4,1,4,2],[5,1,5,2],[6,1,6,2],[19,1,19,3],[8,1,8,2],[9,1,9,2],[10,1,10,2],[11,1,11,3],[12,1,12,2],[13,1,13,2],[14,1,14,2],[15,1,15,2],[16,1,16,2],[17,1,17,2],[18,1,18,2],[31,1,31,2],[20,1,20,2],[21,1,21,2],[22,1,22,2],[23,1,23,2],[24,1,24,2],[25,1,25,2],[26,1,26,2],[27,1,27,3],[28,1,28,2],[29,1,29,2],[30,1,30,2],[43,1,43,3],[32,1,32,2],[33,1,33,2],[34,1,34,2],[35,1,35,3],[36,1,36,2],[37,1,37,2],[38,1,38,2],[39,1,39,2],[40,1,40,2],[41,1,41,2],[42,1,42,2],[50,1,50,2],[51,1,51,3],[59,0,59,1],[108,5,108,8],[44,1,44,2],[45,1,45,2],[46,1,46,2],[47,1,47,2],[48,1,48,2],[49,1,49,2]]}
[null,null,null,"TEMPS DE TRAVAIL",null,null,null,null,null,null,null,null,null,null,null,null,null,null,"RÉCAPITULATIF",null,null,null,null,null,null,null,null,null,null,null,"IMPÔTS"]
[null,null,null,null,null,{"$f":"Données!G14","v":12},null,null,null,{"$f":"Données!C15","v":2014}]
[null,"Jour",null,"Midi",null,"Cumul Midi","Repas","Soir",null,"Cumul Soir","Repas","Totaux","Total Repas"]
[null,null,null,"Début","Fin",null,null,"Début","Fin",null,null,null,null,null,null,null,null,null,null,null,null,null,null,null,null,null,null,null,null,null,null,{"$f":"VLOOKUP(F2,Données!E15:F26,2)","v":"Décembre"},{"$f":"J2","v":2014}]
[null,{"$f":"Données!I15-WEEKDAY(Données!I15-1)+1","v":"2014-12-01"},null,null,null,{"$f":"$E5-$D5+IF($D5>$E5,1)","v":0},{"$f":"IF($D5<>\"\",IF($D5<Données!$C$2,1,0),0)","v":0},null,null,{"$f":"$I5-$H5+IF($H5>$I5,1)","v":0},{"$f":"IF($H5<>\"\",IF($H5<Données!$C$3,1,0),0)","v":0},{"$f":"$F5+$J5-($G5+$K5)*(\"00:30\")","v":0},{"$f":"$G5+$K5","v":0}]
[null,{"$f":"B5+1","v":"2014-12-02"},null,null,null,{"$f":"$E6-$D6+IF($D6>$E6,1)","v":0},{"$f":"IF($D6<>\"\",IF($D6<Données!$C$2,1,0),0)","v":0},null,null,{"$f":"$I6-$H6+IF($H6>$I6,1)","v":0},{"$f":"IF($H6<>\"\",IF($H6<Données!$C$3,1,0),0)","v":0},{"$f":"$F6+$J6-($G6+$K6)*(\"00:30\")","v":0},{"$f":"$G6+$K6","v":0},{"$f":"$D6-$I5+IF($I5>$D6,1)","v":0},{"$f":"IF($N6=Données!$F$12,0,IF($N6<Données!$F$11,1,0))","v":0},null,null,null,"Soit au total pour le mois de :",null,{"$f":"VLOOKUP(F2,Données!E15:F26,2)","v":"Décembre"},{"$f":"J2","v":2014}]
[null,{"$f":"B6+1","v":"2014-12-03"},null,null,null,0,{"$f":"IF($D7<>\"\",IF($D7<Données!$C$2,1,0),0)","v":0},null,null,0,{"$f":"IF($H7<>\"\",IF($H7<Données!$C$3,1,0),0)","v":0},0,0,{"$f":"$D7-$I6+IF($I6>$D7,1)","v":0},{"$f":"IF($N7=Données!$F$12,0,IF($N7<Données!$F$11,1,0))","v":0}]
[null,"2014-12-04",null,null,null,0,{"$f":"IF($D8<>\"\",IF($D8<Données!$C$2,1,0),0)","v":0},null,null,0,{"$f":"IF($H8<>\"\",IF($H8<Données!$C$3,1,0),0)","v":0},0,0,{"$f":"$D8-$I7+IF($I7>$D8,1)","v":0},{"$f":"IF($N8=Données!$F$12,0,IF($N8<Données!$F$11,1,0))","v":0},null,null,null,null,null,null,null,null,null,null,null,null,null,null,null,"Numéro Fiscal :"]
[null,"2014-12-05",null,null,null,0,{"$f":"IF($D9<>\"\",IF($D9<Données!$C$2,1,0),0)","v":0},null,null,0,{"$f":"IF($H9<>\"\",IF($H9<Données!$C$3,1,0),0)","v":0},0,0,0,{"$f":"IF($N9=Données!$F$12,0,IF($N9<Données!$F$11,1,0))","v":0},null,null,null,"Nombre de jours travaillés :",null,{"$f":"H78","v":12},null,null,null,null,null,null,null,null,null,"MDP:"]
[null,"2014-12-06",null,0.48958333333333298,0.625,0.13541666666666702,{"$f":"IF($D10<>\"\",IF($D10<Données!$C$2,1,0),0)","v":0},0.78125,5.2083333333333336E-2,0.27083333333333337,{"$f":"IF($H10<>\"\",IF($H10<Données!$C$3,1,0),0)","v":0},0.40625000000000039,0,{"$f":"$D10-$I9+IF($I9>$D10,1)","v":0.48958333333333298},{"$f":"IF($N10=Données!$F$12,0,IF($N10<Données!$F$11,1,0))","v":0},null,null,null,"Nombre de jours repos :",null,{"$f":"B78","v":8}]
[null,"2014-12-07",null,0.48958333333333298,0.67708333333333304,0.18750000000000006,{"$f":"IF($D11<>\"\",IF($D11<Données!$C$2,1,0),0)","v":0},0.78125,0.95833333333333304,0.17708333333333304,{"$f":"IF($H11<>\"\",IF($H11<Données!$C$3,1,0),0)","v":0},0.36458333333333309,0,{"$f":"$D11-$I10+IF($I10>$D11,1)","v":0.43749999999999967},{"$f":"IF($N11=Données!$F$12,0,IF($N11<Données!$F$11,1,0))","v":1},null,null,null,"Nombre de jours récup :",null,{"$f":"C$78","v":1},null,null,null,null,null,null,null,null,null,"Adresse domicile:","-"]
[null,"Total Semaine",null,null,{"$f":"WEEKNUM(B5,21)","v":49},{"$f":"SUM($F5:$F11)","v":0.32291666666666707},{"$f":"G5+G6+G7+G8+G9+G10+G11","v":0},null,null,{"$f":"SUM(J5:J11)","v":0.44791666666666641},{"$f":"K5+K6+K7+K8+K9+K10+K11","v":0},{"$f":"SUM(L5:L11)","v":0.77083333333333348},{"$f":"SUM(M5:M11)","v":0},null,{"$f":"SUM(O6:O11)","v":1},null,null,null,"Nombre de jfg :",null,{"$f":"D$78","v":0}]
[null,{"$f":"B11+1","v":"2014-12-08"},null,0.48958333333333298,0.65625,{"$f":"$E13-$D13+IF($D13>$E13,1)","v":0.16666666666666702},{"$f":"IF($D13<>\"\",IF($D13<Données!$C$2,1,0),0)","v":0},0.78125,0.98958333333333304,{"$f":"$I13-$H13+IF($H13>$I13,1)","v":0.20833333333333304},{"$f":"IF($H13<>\"\",IF($H13<Données!$C$3,1,0),0)","v":0},{"$f":"$F13+$J13-($G13+$K13)*(\"00:30\")","v":0.37500000000000006},{"$f":"$G13+$K13","v":0},{"$f":"$D13-$I11+IF($I11>$D13,1)","v":0.53125},{"$f":"IF($N13=Données!$F$12,0,IF($N13<Données!$F$11,1,0))","v":0},null,null,null,"Nombre de jours de vacances :",null,{"$f":"E$78","v":10}]
[null,{"$f":"B13+1","v":"2014-12-09"},null,null,null,{"$f":"$E14-$D14+IF($D14>$E14,1)","v":0},{"$f":"IF($D14<>\"\",IF($D14<Données!$C$2,1,0),0)","v":0},null,null,{"$f":"$I14-$H14+IF($H14>$I14,1)","v":0},{"$f":"IF($H14<>\"\",IF($H14<Données!$C$3,1,0),0)","v":0},{"$f":"$F14+$J14-($G14+$K14)*(\"00:30\")","v":0},{"$f":"$G14+$K14","v":0},{"$f":"$D14-$I13+IF($I13>$D14,1)","v":1.0416666666666963E-2},0,null,null,null,"Nombre de jours de maladie :",null,{"$f":"F$78","v":0}]
[null,{"$f":"B14+1","v":"2014-12-10"},null,null,null,0,{"$f":"IF($D15<>\"\",IF($D15<Données!$C$2,1,0),0)","v":0},null,null,0,{"$f":"IF($H15<>\"\",IF($H15<Données!$C$3,1,0),0)","v":0},0,0,{"$f":"$D15-$I14+IF($I14>$D15,1)","v":0},{"$f":"IF($N15=Données!$F$12,0,IF($N15<Données!$F$11,1,0))","v":0},null,null,null,"Nombre jours fériées travaillés :",null,{"$f":"I78","v":0},null,null,null,null,null,null,null,null,null,"Adresse lieu de travail:","-"]
[null,"2014-12-11",null,0.48958333333333298,0.58333333333333304,9.3750000000000056E-2,{"$f":"IF($D16<>\"\",IF($D16<Données!$C$2,1,0),0)","v":0},0.78125,0.9375,0.15625,{"$f":"IF($H16<>\"\",IF($H16<Données!$C$3,1,0),0)","v":0},0.25000000000000006,0,0.48958333333333298,{"$f":"IF($N16=Données!$F$12,0,IF($N16<Données!$F$11,1,0))","v":0},null,null,null,"Nombre de fois 11h de batement non respecté :",null,{"$f":"J78","v":1}]
[null,"2014-12-12",null,null,null,0,{"$f":"IF($D17<>\"\",IF($D17<Données!$C$2,1,0),0)","v":0},0.78125,0.95833333333333304,0.17708333333333304,{"$f":"IF($H17<>\"\",IF($H17<Données!$C$3,1,0),0)","v":0},0.17708333333333304,0,6.25E-2,0]
[null,"2014-12-13",null,0.48958333333333298,0.625,0.13541666666666702,{"$f":"IF($D18<>\"\",IF($D18<Données!$C$2,1,0),0)","v":0},0.78125,0.97916666666666696,0.19791666666666696,{"$f":"IF($H18<>\"\",IF($H18<Données!$C$3,1,0),0)","v":0},0.33333333333333398,0,0.53125,{"$f":"IF($N18=Données!$F$12,0,IF($N18<Données!$F$11,1,0))","v":0},null,null,null,null,null,null,null,null,null,null,null,null,null,null,null,"Distance ( Source Mappy) :","-","7,4 KM"]
[null,"2014-12-14",null,0.48958333333333298,0.66666666666666696,0.17708333333333398,{"$f":"IF($D19<>\"\",IF($D19<Données!$C$2,1,0),0)","v":0},0.78125,0.95833333333333304,0.17708333333333304,{"$f":"IF($H19<>\"\",IF($H19<Données!$C$3,1,0),0)","v":0},0.35416666666666702,0,0.51041666666666607,{"$f":"IF($N19=Données!$F$12,0,IF($N19<Données!$F$11,1,0))","v":0},null,null,null,null,null,{"$f":"SUM(L12+L20+L28+L36+L44+L52)","v":7.4479166666666696},"Heures effectués"]
[null,"Total Semaine",null,null,{"$f":"WEEKNUM(B13,21)","v":50},{"$f":"SUM($F13:$F19)","v":0.57291666666666807},{"$f":"G13+G14+G15+G16+G17+G18+G19","v":0},null,null,{"$f":"SUM(J13:J19)","v":0.91666666666666607},{"$f":"K13+K14+K15+K16+K17+K18+K19","v":0},{"$f":"SUM(L13:L19)","v":1.4895833333333341},{"$f":"SUM(M13:M19)","v":0},null,{"$f":"SUM(O13:O19)","v":0},null,null,null,null,null,{"$f":"IF(U19<N53,\"- \"&TEXT(ABS(N53-U19),\"[hh]:mm\"),U19-N53)","v":0.40625000000000266},"Heures dues/supp",null,null,null,null,null,null,null,null,"Nombre Aller-Retour :","-",{"$f":"COUNT(E5:E11,I5:I11,E13:E19,I13:I19,E21:E27,I21:I27,E29:E35,I29:I35,E37:E43,I37:I43,E45:E51,I45:I51)","v":24}]
[null,{"$f":"B19+1","v":"2014-12-15"},null,null,null,{"$f":"$E21-$D21+IF($D21>$E21,1)","v":0},{"$f":"IF($D21<>\"\",IF($D21<Données!$C$2,1,0),0)","v":0},null,null,{"$f":"$I21-$H21+IF($H21>$I21,1)","v":0},{"$f":"IF($H21<>\"\",IF($H21<Données!$C$3,1,0),0)","v":0},0.32291666666666669,{"$f":"$G21+$K21","v":0},{"$f":"$D21-$I19+IF($I19>$D21,1)","v":4.1666666666666963E-2},0,null,null,null,null,null,null,null,null,null,null,null,null,null,null,null,"Km Parcourue :","-",{"$f":"SUM(AG20*14.8)","v":355.20000000000005},"Km"]
[null,{"$f":"B21+1","v":"2014-12-16"},null,null,null,{"$f":"$E22-$D22+IF($D22>$E22,1)","v":0},{"$f":"IF($D22<>\"\",IF($D22<Données!$C$2,1,0),0)","v":0},null,null,{"$f":"$I22-$H22+IF($H22>$I22,1)","v":0},{"$f":"IF($H22<>\"\",IF($H22<Données!$C$3,1,0),0)","v":0},{"$f":"$F22+$J22-($G22+$K22)*(\"00:30\")","v":0},{"$f":"$G22+$K22","v":0},{"$f":"$D22-$I21+IF($I21>$D22,1)","v":0},{"$f":"IF($N22=Données!$F$12,0,IF($N22<Données!$F$11,1,0))","v":0},null,null,null,null,null,null,null,null,null,null,null,null,null,null,null,"Horodateur Payé :","-",16.5]
[null,{"$f":"B22+1","v":"2014-12-17"},null,null,null,0,{"$f":"IF($D23<>\"\",IF($D23<Données!$C$2,1,0),0)","v":0},null,null,0,{"$f":"IF($H23<>\"\",IF($H23<Données!$C$3,1,0),0)","v":0},0,0,{"$f":"$D23-$I22+IF($I22>$D23,1)","v":0},{"$f":"IF($N23=Données!$F$12,0,IF($N23<Données!$F$11,1,0))","v":0},null,null,null,"Dont :","-",{"$f":"$B$68","v":6.9791666666666661},"Heures à taux normal ( 35h )",null,null,null,null,null,null,null,null,"Achat divers pour le travail :","-"]
[null,"2014-12-18",null,null,null,0,{"$f":"IF($D24<>\"\",IF($D24<Données!$C$2,1,0),0)","v":0},null,null,0,{"$f":"IF($H24<>\"\",IF($H24<Données!$C$3,1,0),0)","v":0},0.32291666666666669,0,0,{"$f":"IF($N24=Données!$F$12,0,IF($N24<Données!$F$11,1,0))","v":0},null,null,null,null,"-",{"$f":"$C$68","v":0.46875000000000311},"Heures en HS 10%         ( 35h à 39h )",null,null,null,null,null,null,null,null,null,"-"]
[null,"2014-12-19",null,null,null,0,{"$f":"IF($D25<>\"\",IF($D25<Données!$C$2,1,0),0)","v":0},null,null,0,{"$f":"IF($H25<>\"\",IF($H25<Données!$C$3,1,0),0)","v":0},0.32291666666666669,0,0,{"$f":"IF($N25=Données!$F$12,0,IF($N25<Données!$F$11,1,0))","v":0},null,null,null,null,"-",{"$f":"$D$68","v":0},"Heures en HS 20%         (39h à 43h )",null,null,null,null,null,null,null,null,null,"-"]
[null,"2014-12-20",null,null,null,0,{"$f":"IF($D26<>\"\",IF($D26<Données!$C$2,1,0),0)","v":0},null,null,0,{"$f":"IF($H26<>\"\",IF($H26<Données!$C$3,1,0),0)","v":0},0.32291666666666669,0,0,{"$f":"IF($N26=Données!$F$12,0,IF($N26<Données!$F$11,1,0))","v":0},null,null,null,null,"-",{"$f":"$E$68","v":0},"Heures en HS 40%         ( 43h et plus )",null,null,null,null,null,null,null,null,null,"-"]
[null,"2014-12-21",null,null,null,0,{"$f":"IF($D27<>\"\",IF($D27<Données!$C$2,1,0),0)","v":0},null,null,0,{"$f":"IF($H27<>\"\",IF($H27<Données!$C$3,1,0),0)","v":0},0.32291666666666669,0,0,{"$f":"IF($N27=Données!$F$12,0,IF($N27<Données!$F$11,1,0))","v":0},null,null,null,null,"-",{"$f":"SUM(M12+M20+M28+M36+M44+M52)","v":0},"Nombre de repas",null,null,null,null,null,null,null,null,null,"-"]
[null,"Total Semaine",null,null,{"$f":"WEEKNUM(B21,21)","v":51},{"$f":"SUM($F21:$F27)","v":0},{"$f":"G21+G22+G23+G24+G25+G26+G27","v":0},null,null,{"$f":"SUM(J21:J27)","v":0},{"$f":"K21+K22+K23+K24+K25+K26+K27","v":0},{"$f":"SUM(L21:L27)","v":1.6145833333333335},{"$f":"SUM(M21:M27)","v":0},null,{"$f":"SUM(O21:O27)","v":0},null,null,null,null,null,null,null,null,null,null,null,null,null,null,null,null,"-"]
[null,{"$f":"B27+1","v":"2014-12-22"},null,null,null,{"$f":"$E29-$D29+IF($D29>$E29,1)","v":0},{"$f":"IF($D29<>\"\",IF($D29<Données!$C$2,1,0),0)","v":0},null,null,{"$f":"$I29-$H29+IF($H29>$I29,1)","v":0},{"$f":"IF($H29<>\"\",IF($H29<Données!$C$3,1,0),0)","v":0},0.32291666666666669,{"$f":"$G29+$K29","v":0},{"$f":"$D29-$I27+IF($I27>$D29,1)","v":0},{"$f":"IF($N29=Données!$F$12,0,IF($N29<Données!$F$11,1,0))","v":0},null,null,null,"Heure fiche de paie:",null,null,null,null,null,null,null,null,null,null,null,null,"-"]
[null,{"$f":"B29+1","v":"2014-12-23"},null,null,null,{"$f":"$E30-$D30+IF($D30>$E30,1)","v":0},{"$f":"IF($D30<>\"\",IF($D30<Données!$C$2,1,0),0)","v":0},null,null,{"$f":"$I30-$H30+IF($H30>$I30,1)","v":0},{"$f":"IF($H30<>\"\",IF($H30<Données!$C$3,1,0),0)","v":0},{"$f":"$F30+$J30-($G30+$K30)*(\"00:30\")","v":0},{"$f":"$G30+$K30","v":0},{"$f":"$D30-$I29+IF($I29>$D30,1)","v":0},{"$f":"IF($N30=Données!$F$12,0,IF($N30<Données!$F$11,1,0))","v":0},null,null,null,null,null,null,null,null,null,null,null,null,null,null,null,null,"-"]
[null,{"$f":"B30+1","v":"2014-12-24"},null,null,null,0,{"$f":"IF($D31<>\"\",IF($D31<Données!$C$2,1,0),0)","v":0},null,null,0,{"$f":"IF($H31<>\"\",IF($H31<Données!$C$3,1,0),0)","v":0},0,0,{"$f":"$D31-$I30+IF($I30>$D31,1)","v":0},{"$f":"IF($N31=Données!$F$12,0,IF($N31<Données!$F$11,1,0))","v":0},null,null,null,"Dont :","-",6.3194444444444438,"Heures à taux normal",null,null,null,null,null,null,null,null,null,"-"]
[null,"2014-12-25",null,null,null,0,{"$f":"IF($D32<>\"\",IF($D32<Données!$C$2,1,0),0)","v":0},null,null,0,{"$f":"IF($H32<>\"\",IF($H32<Données!$C$3,1,0),0)","v":0},0.32291666666666669,0,0,{"$f":"IF($N32=Données!$F$12,0,IF($N32<Données!$F$11,1,0))","v":0},null,null,null,null,"-",0.73125000000000007,"Heures en HS 10%",null,null,null,null,null,null,null,null,null,"-"]
[null,"2014-12-26",null,null,null,0,{"$f":"IF($D33<>\"\",IF($D33<Données!$C$2,1,0),0)","v":0},null,null,0,{"$f":"IF($H33<>\"\",IF($H33<Données!$C$3,1,0),0)","v":0},0.32291666666666669,0,0,{"$f":"IF($N33=Données!$F$12,0,IF($N33<Données!$F$11,1,0))","v":0},null,null,null,null,"-",0,"Heures en HS 20%"]
[null,"2014-12-27",null,null,null,0,{"$f":"IF($D34<>\"\",IF($D34<Données!$C$2,1,0),0)","v":0},null,null,0,{"$f":"IF($H34<>\"\",IF($H34<Données!$C$3,1,0),0)","v":0},0.32291666666666669,0,0,{"$f":"IF($N34=Données!$F$12,0,IF($N34<Données!$F$11,1,0))","v":0},null,null,null,null,"-",0,"Heures en HS 40%",null,null,null,null,null,null,null,null,"Total dépenses:","-",{"$f":"SUM(AG22:AG32)","v":16.5}]
[null,"2014-12-28",null,null,null,0,{"$f":"IF($D35<>\"\",IF($D35<Données!$C$2,1,0),0)","v":0},null,null,0,{"$f":"IF($H35<>\"\",IF($H35<Données!$C$3,1,0),0)","v":0},0.32291666666666669,0,0,{"$f":"IF($N35=Données!$F$12,0,IF($N35<Données!$F$11,1,0))","v":0},null,null,null,null,"-",0,"Nombre de repas"]
[null,"Total Semaine",null,null,{"$f":"WEEKNUM(B29,21)","v":52},{"$f":"SUM($F29:$F35)","v":0},{"$f":"G29+G30+G31+G32+G33+G34+G35","v":0},null,null,{"$f":"SUM(J29:J35)","v":0},{"$f":"K29+K30+K31+K32+K33+K34+K35","v":0},{"$f":"SUM(L29:L35)","v":1.6145833333333335},{"$f":"SUM(M29:M35)","v":0},null,{"$f":"SUM(O29:O35)","v":0}]
[null,{"$f":"B35+1","v":"2014-12-29"},null,0.48958333333333298,0.65625,{"$f":"$E37-$D37+IF($D37>$E37,1)","v":0.16666666666666702},{"$f":"IF($D37<>\"\",IF($D37<Données!$C$2,1,0),0)","v":0},0.78125,3.125E-2,{"$f":"$I37-$H37+IF($H37>$I37,1)","v":0.25},{"$f":"IF($H37<>\"\",IF($H37<Données!$C$3,1,0),0)","v":0},{"$f":"$F37+$J37-($G37+$K37)*(\"00:30\")","v":0.41666666666666702},{"$f":"$G37+$K37","v":0},{"$f":"$D37-$I35+IF($I35>$D37,1)","v":0.48958333333333298},{"$f":"IF($N37=Données!$F$12,0,IF($N37<Données!$F$11,1,0))","v":0},null,null,null,"Différence:"]
[null,{"$f":"B37+1","v":"2014-12-30"},null,null,null,{"$f":"$E38-$D38+IF($D38>$E38,1)","v":0},{"$f":"IF($D38<>\"\",IF($D38<Données!$C$2,1,0),0)","v":0},null,null,{"$f":"$I38-$H38+IF($H38>$I38,1)","v":0},{"$f":"IF($H38<>\"\",IF($H38<Données!$C$3,1,0),0)","v":0},{"$f":"$F38+$J38-($G38+$K38)*(\"00:30\")","v":0},{"$f":"$G38+$K38","v":0},{"$f":"$D38-$I37+IF($I37>$D38,1)","v":0.96875},{"$f":"IF($N38=Données!$F$12,0,IF($N38<Données!$F$11,1,0))","v":0}]
[null,{"$f":"B38+1","v":"2014-12-31"},null,null,null,0,{"$f":"IF($D39<>\"\",IF($D39<Données!$C$2,1,0),0)","v":0},null,null,0,{"$f":"IF($H39<>\"\",IF($H39<Données!$C$3,1,0),0)","v":0},0,0,{"$f":"$D39-$I38+IF($I38>$D39,1)","v":0},{"$f":"IF($N39=Données!$F$12,0,IF($N39<Données!$F$11,1,0))","v":0},null,null,null,"Dont :","-",{"$f":"$U31-$U23+IF($U23>$U31,1)","v":0.34027777777777768},"Heures à taux normal"]
[null,"2015-01-01",null,0.48958333333333298,0.60416666666666696,0.11458333333333398,{"$f":"IF($D40<>\"\",IF($D40<Données!$C$2,1,0),0)","v":0},0.78125,0.98958333333333304,0.20833333333333304,{"$f":"IF($H40<>\"\",IF($H40<Données!$C$3,1,0),0)","v":0},0.32291666666666702,0,0.48958333333333298,{"$f":"IF($N40=Données!$F$12,0,IF($N40<Données!$F$11,1,0))","v":0},null,null,null,null,"-","-6:18","Heures en HS 10%"]
[null,"2015-01-02",null,null,null,0,{"$f":"IF($D41<>\"\",IF($D41<Données!$C$2,1,0),0)","v":0},0.78125,3.125E-2,0.25,{"$f":"IF($H41<>\"\",IF($H41<Données!$C$3,1,0),0)","v":0},0.25,0,1.0416666666666963E-2,0,null,null,null,null,"-",{"$f":"NbCellsCoul($D$5:$I$11,50)*0.25","v":0},"Heures en HS 20%"]
[null,"2015-01-03",null,0.48958333333333298,0.60416666666666696,0.11458333333333398,{"$f":"IF($D42<>\"\",IF($D42<Données!$C$2,1,0),0)","v":0},0.78125,0,0.21875,{"$f":"IF($H42<>\"\",IF($H42<Données!$C$3,1,0),0)","v":0},0.33333333333333398,0,0.45833333333333298,{"$f":"IF($N42=Données!$F$12,0,IF($N42<Données!$F$11,1,0))","v":0},null,null,null,null,"-",{"$f":"$U34-$U26+IF($U26>$U34,1)","v":0},"Heures en HS 40%"]
[null,"2015-01-04",null,0.48958333333333298,0.61458333333333304,0.12500000000000006,{"$f":"IF($D43<>\"\",IF($D43<Données!$C$2,1,0),0)","v":0},0.78125,0.91666666666666696,0.13541666666666696,{"$f":"IF($H43<>\"\",IF($H43<Données!$C$3,1,0),0)","v":0},0.26041666666666702,0,0.48958333333333298,{"$f":"IF($N43=Données!$F$12,0,IF($N43<Données!$F$11,1,0))","v":0},null,null,null,null,"-",{"$f":"SUM(U35-U27)","v":0},"Nombre de repas"]
[null,"Total Semaine",null,null,{"$f":"WEEKNUM(B37,21)","v":1},{"$f":"SUM($F37:$F43)","v":0.52083333333333504},{"$f":"G37+G38+G39+G40+G41+G42+G43","v":0},null,null,{"$f":"SUM(J37:J43)","v":1.0625},{"$f":"K37+K38+K39+K40+K41+K42+K43","v":0},{"$f":"SUM(L37:L43)","v":1.583333333333335},{"$f":"SUM(M37:M43)","v":0},null,{"$f":"SUM(O37:O43)","v":0}]
[null,{"$f":"B43+1","v":"2015-01-05"},null,0.48958333333333298,0.625,{"$f":"$E45-$D45+IF($D45>$E45,1)","v":0.13541666666666702},{"$f":"IF($D45<>\"\",IF($D45<Données!$C$2,1,0),0)","v":0},0.78125,2.0833333333333332E-2,{"$f":"$I45-$H45+IF($H45>$I45,1)","v":0.23958333333333337},{"$f":"IF($H45<>\"\",IF($H45<Données!$C$3,1,0),0)","v":0},{"$f":"$F45+$J45-($G45+$K45)*(\"00:30\")","v":0.37500000000000039},{"$f":"$G45+$K45","v":0},{"$f":"$D45-$I43+IF($I43>$D45,1)","v":0.57291666666666607},{"$f":"IF($N45=Données!$F$12,0,IF($N45<Données!$F$11,1,0))","v":0}]
[null,{"$f":"B45+1","v":"2015-01-06"},null,null,null,0,{"$f":"IF($D46<>\"\",IF($D46<Données!$C$2,1,0),0)","v":0},null,null,{"$f":"$I46-$H46+IF($H46>$I46,1)","v":0},{"$f":"IF($H46<>\"\",IF($H46<Données!$C$3,1,0),0)","v":0},{"$f":"$F46+$J46-($G46+$K46)*(\"00:30\")","v":0},{"$f":"$G46+$K46","v":0},{"$f":"$D46-$I45+IF($I45>$D46,1)","v":0.97916666666666663},{"$f":"IF($N46=Données!$F$12,0,IF($N46<Données!$F$11,1,0))","v":0}]
[null,{"$f":"B46+1","v":"2015-01-07"},null,null,null,0,{"$f":"IF($D47<>\"\",IF($D47<Données!$C$2,1,0),0)","v":0},null,null,0,{"$f":"IF($H47<>\"\",IF($H47<Données!$C$3,1,0),0)","v":0},0,0,{"$f":"$D47-$I46+IF($I46>$D47,1)","v":0},{"$f":"IF($N47=Données!$F$12,0,IF($N47<Données!$F$11,1,0))","v":0}]
[null,"2015-01-08",null,null,null,0,{"$f":"IF($D48<>\"\",IF($D48<Données!$C$2,1,0),0)","v":0},null,null,0,{"$f":"IF($H48<>\"\",IF($H48<Données!$C$3,1,0),0)","v":0},0,0,0,{"$f":"IF($N48=Données!$F$12,0,IF($N48<Données!$F$11,1,0))","v":0}]
[null,"2015-01-09",null,null,null,0,{"$f":"IF($D49<>\"\",IF($D49<Données!$C$2,1,0),0)","v":0},null,null,0,{"$f":"IF($H49<>\"\",IF($H49<Données!$C$3,1,0),0)","v":0},0,0,0,{"$f":"IF($N49=Données!$F$12,0,IF($N49<Données!$F$11,1,0))","v":0}]
[null,"2015-01-10",null,null,null,0,{"$f":"IF($D50<>\"\",IF($D50<Données!$C$2,1,0),0)","v":0},null,null,0,{"$f":"IF($H50<>\"\",IF($H50<Données!$C$3,1,0),0)","v":0},0,0,0,{"$f":"IF($N50=Données!$F$12,0,IF($N50<Données!$F$11,1,0))","v":0}]
[null,"2015-01-11",null,null,null,0,{"$f":"IF($D51<>\"\",IF($D51<Données!$C$2,1,0),0)","v":0},null,null,0,{"$f":"IF($H51<>\"\",IF($H51<Données!$C$3,1,0),0)","v":0},0,0,0,{"$f":"IF($N51=Données!$F$12,0,IF($N51<Données!$F$11,1,0))","v":0}]
[null,"Total semaine",null,null,{"$f":"WEEKNUM(B45,21)","v":2},{"$f":"SUM($F45:$F51)","v":0.13541666666666702},{"$f":"G45+G46+G47+G48+G49+G50+G51","v":0},null,null,{"$f":"SUM(J45:J51)","v":0.23958333333333337},{"$f":"K45+K46+K47+K48+K49+K50+K51","v":0},{"$f":"SUM(L45:L51)","v":0.37500000000000039},{"$f":"SUM(M45:M51)","v":0},null,{"$f":"SUM(O45:O51)","v":0}]
[null,null,null,null,null,null,null,null,null,null,null,null,null,7.041666666666667]
[null,null,null,null,null,null,null,null,null,null,null,{"$f":"CodeCouleur(M54)","v":50},null,"REPOS"]
[null,null,null,null,null,null,null,null,null,null,null,{"$f":"CodeCouleur(M55)","v":42},null,"Récup"]
[null,null,null,null,null,null,null,null,null,null,null,48,null,"JFG"]
[null,null,null,null,null,null,null,null,null,null,null,44,null,"VAC"]
[null,null,null,null,null,null,null,null,null,null,null,3,null,"MAL"]
[null,null,null,null,null,null,null,null,null,null,null,{"$f":"CodeCouleur(M59)","v":40},null,"Jf Taf"]
["Heures",null,1.4583333333333333,1.625,1.7916666666666667,"Total"]
["Taux",1,1.1000000000000001,1.2,1.4]
["S 1",{"$f":"IF($L$12<=$C$60,$L$12,$C$60)","v":0.77083333333333348},{"$f":"IF($L$12<=$C$60,0,IF($L$12<=$D$60,$L$12,$D$60)-$C$60)","v":0},{"$f":"IF($L$12<=$D$60,0,IF($L$12<=$E$60,$L$12,$D$60)-$C$60)","v":0},{"$f":"IF($L$12<=$E$60,0,IF($L$12>$E$60,$L$12,$E$60)-$E$60)","v":0},{"$f":"B62+C62+D62+E62","v":0.77083333333333348}]
["S 2",{"$f":"IF($L$20<=$C$60,$L$20,$C$60)","v":1.4583333333333333},{"$f":"IF($L$20<=$C$60,0,IF($L$20<=$D$60,$L$20,$D$60)-$C$60)","v":3.1250000000000888E-2},{"$f":"IF($L$20<=$D$60,0,IF($L$20<=$E$60,$L$20,$D$60)-$C$60)","v":0},{"$f":"IF($L$20<=$E$60,0,IF($L$20>$E$60,$L$20,$E$60)-$E$60)","v":0},1.4895833333333341]
["S 3",{"$f":"IF($L$28<=$C$60,$L$28,$C$60)","v":1.4583333333333333},{"$f":"IF($L$28<=$C$60,0,IF($L$28<=$D$60,$L$28,$D$60)-$C$60)","v":0.15625000000000022},{"$f":"IF($L$28<=$D$60,0,IF($L$28<=$E$60,$L$28,$D$60)-$C$60)","v":0},{"$f":"IF($L$28<=$E$60,0,IF($L$28>$E$60,$L$28,$E$60)-$E$60)","v":0},1.6145833333333335]
["S 4",{"$f":"IF($L$36<=$C$60,$L$36,$C$60)","v":1.4583333333333333},{"$f":"IF($L$36<=$C$60,0,IF($L$36<=$D$60,$L$36,$D$60)-$C$60)","v":0.15625000000000022},{"$f":"IF($L$36<=$D$60,0,IF($L$36<=$E$60,$L$36,$D$60)-$C$60)","v":0},{"$f":"IF($L$36<=$E$60,0,IF($L$36>$E$60,$L$36,$E$60)-$E$60)","v":0},1.6145833333333335]
["S 5",{"$f":"IF($L$44<=$C$60,$L$44,$C$60)","v":1.4583333333333333},{"$f":"IF($L$44<=$C$60,0,IF($L$44<=$D$60,$L$44,$D$60)-$C$60)","v":0.12500000000000178},{"$f":"IF($L$44<=$D$60,0,IF($L$44<=$E$60,$L$44,$D$60)-$C$60)","v":0},{"$f":"IF($L$44<=$E$60,0,IF($L$44>$E$60,$L$44,$E$60)-$E$60)","v":0},1.583333333333335]
["S 6",{"$f":"IF($L$52<=$C$60,$L$52,$C$60)","v":0.37500000000000039},{"$f":"IF($L$52<=$C$60,0,IF($L$52<=$D$60,$L$52,$D$60)-$C$60)","v":0},{"$f":"IF($L$52<=$D$60,0,IF($L$52<=$E$60,$L$52,$D$60)-$C$60)","v":0},{"$f":"IF($L$52<=$E$60,0,IF($L$52>$E$60,$L$52,$E$60)-$E$60)","v":0},0.37500000000000039]
["Total",{"$f":"SUM(B62:B67)","v":6.9791666666666661},{"$f":"SUM(C62:C67)","v":0.46875000000000311},{"$f":"SUM(D62:D67)","v":0},{"$f":"SUM(E62:E67)","v":0},7.4479166666666696]
[]
[]
["Jours","Repos","Récup","Jfg","Vac","Mal","Vides","Taf","Jf Taf","<11h"]
["S 1",{"$f":"NbCellsCoul($D$5:$I$11,50)*0.25","v":0},{"$f":"NbCellsCoul($D$5:$I$11,42)*0.25","v":0},{"$f":"NbCellsCoul($D$5:$I$11,48)*0.25","v":0},{"$f":"NbCellsCoul($D$5:$I$11,44)*0.25","v":0},{"$f":"NbCellsCoul($D$5:$I$11,3)*0.25","v":0},{"$f":"+COUNTBLANK(E5:H11)/2","v":5},{"$f":"7-$G72","v":2},{"$f":"NbCellsCoul($D$5:$I$11,40)*0.25","v":0},{"$f":"SUM($O$6:$O$11)","v":1}]
["S 2",{"$f":"NbCellsCoul($D$13:$I$19,50)*0.25","v":2},{"$f":"NbCellsCoul($D$13:$I$19,42)*0.25","v":0.5},{"$f":"NbCellsCoul($D$13:$I$19,48)*0.25","v":0},{"$f":"NbCellsCoul($D$13:$I$19,44)*0.25","v":0},{"$f":"NbCellsCoul($D$13:$I$19,3)*0.25","v":0},{"$f":"+COUNTBLANK(E13:H19)/2","v":2.5},4.5,{"$f":"NbCellsCoul($D$13:$I$19,40)*0.25","v":0},{"$f":"SUM($O$13:$O$19)","v":0}]
["S 3",{"$f":"NbCellsCoul($D$21:$I$27,50)*0.25","v":2},{"$f":"NbCellsCoul($D$21:$I$27,42)*0.25","v":0},{"$f":"NbCellsCoul($D$21:$I$27,48)*0.25","v":0},{"$f":"NbCellsCoul($D$21:$I$27,44)*0.25","v":5},{"$f":"NbCellsCoul($D$21:$I$27,3)*0.25","v":0},{"$f":"+COUNTBLANK(E21:H27)/2","v":7},0,{"$f":"NbCellsCoul($D$21:$I$27,40)*0.25","v":0},{"$f":"SUM($O$21:$O$27)","v":0}]
["S 4",{"$f":"NbCellsCoul($D$29:$I$35,50)*0.25","v":2},{"$f":"NbCellsCoul($D$29:$I$35,42)*0.25","v":0},{"$f":"NbCellsCoul($D$29:$I$35,48)*0.25","v":0},{"$f":"NbCellsCoul($D$29:$I$35,44)*0.25","v":5},{"$f":"NbCellsCoul($D$29:$I$35,3)*0.25","v":0},{"$f":"+COUNTBLANK(E29:H35)/2","v":7},0,{"$f":"NbCellsCoul($D$29:$I$35,40)*0.25","v":0},{"$f":"SUM($O$29:$O$35)","v":0}]
["S 5",{"$f":"NbCellsCoul($D$37:$I$43,50)*0.25","v":2},{"$f":"NbCellsCoul($D$37:$I$43,42)*0.25","v":0.5},{"$f":"NbCellsCoul($D$37:$I$43,48)*0.25","v":0},{"$f":"NbCellsCoul($D$37:$I$43,44)*0.25","v":0},{"$f":"NbCellsCoul($D$37:$I$43,3)*0.25","v":0},{"$f":"+COUNTBLANK(E37:H43)/2","v":2.5},4.5,{"$f":"NbCellsCoul($D$37:$I$43,40)*0.25","v":0},{"$f":"SUM($O$37:$O$43)","v":0}]
["S 6",{"$f":"NbCellsCoul($D$45:$I$51,50)*0.25","v":0},{"$f":"NbCellsCoul($D$45:$I$51,42)*0.25","v":0},{"$f":"NbCellsCoul($D$45:$I$51,48)*0.25","v":0},{"$f":"NbCellsCoul($D$45:$I$51,44)*0.25","v":0},{"$f":"NbCellsCoul($D$45:$I$51,3)*0.25","v":0},{"$f":"+COUNTBLANK(E45:H51)/2","v":6},1,{"$f":"NbCellsCoul($D$45:$I$51,40)*0.25","v":0},{"$f":"SUM($O$45:$O$51)","v":0}]
["Total",{"$f":"SUM(B$72:B$77)","v":8},1,0,10,{"$f":"SUM(F$72:F$77)","v":0},{"$f":"SUM(G$72:G$77)","v":30},{"$f":"SUM(H$72:H$77)","v":12},{"$f":"SUM(I$72:I$77)","v":0},{"$f":"SUM(J$72:J$77)","v":1}]

{"sheet":"Avril14","index":6,"n_rows":78,"n_cols":34,"rows_kept":78,"cut":false,"hidden":false,"merged":[[7,1,7,2],[0,3,0,9],[0,18,0,21],[0,30,0,32],[2,1,3,2],[2,3,2,4],[2,5,3,5],[2,6,3,6],[2,7,2,8],[2,9,3,9],[2,10,3,10],[2,11,3,11],[2,12,3,12],[4,1,4,2],[5,1,5,2],[6,1,6,2],[19,1,19,3],[8,1,8,2],[9,1,9,2],[10,1,10,2],[11,1,11,3],[12,1,12,2],[13,1,13,2],[14,1,14,2],[15,1,15,2],[16,1,16,2],[17,1,17,2],[18,1,18,2],[31,1,31,2],[20,1,20,2],[21,1,21,2],[22,1,22,2],[23,1,23,2],[24,1,24,2],[25,1,25,2],[26,1,26,2],[27,1,27,3],[28,1,28,2],[29,1,29,2],[30,1,30,2],[43,1,43,3],[32,1,32,2],[33,1,33,2],[34,1,34,2],[35,1,35,3],[36,1,36,2],[37,1,37,2],[38,1,38,2],[39,1,39,2],[40,1,40,2],[41,1,41,2],[42,1,42,2],[50,1,50,2],[51,1,51,3],[59,0,59,1],[108,5,108,8],[44,1,44,2],[45,1,45,2],[46,1,46,2],[47,1,47,2],[48,1,48,2],[49,1,49,2]]}
[null,null,null,"TEMPS DE TRAVAIL",null,null,null,null,null,null,null,null,null,null,null,null,null,null,"RÉCAPITULATIF",null,null,null,null,null,null,null,null,null,null,null,"IMPÔTS"]
[null,null,null,null,null,{"$f":"Données!G14","v":12},null,null,null,{"$f":"Données!C15","v":2014}]
[null,"Jour",null,"Midi",null,"Cumul Midi","Repas","Soir",null,"Cumul Soir","Repas","Totaux","Total Repas"]
[null,null,null,"Début","Fin",null,null,"Début","Fin",null,null,null,null,null,null,null,null,null,null,null,null,null,null,null,null,null,null,null,null,null,null,{"$f":"VLOOKUP(F2,Données!E15:F26,2)","v":"Décembre"},{"$f":"J2","v":2014}]
[null,{"$f":"Données!I15-WEEKDAY(Données!I15-1)+1","v":"2014-12-01"},null,null,null,{"$f":"$E5-$D5+IF($D5>$E5,1)","v":0},{"$f":"IF($D5<>\"\",IF($D5<Données!$C$2,1,0),0)","v":0},null,null,{"$f":"$I5-$H5+IF($H5>$I5,1)","v":0},{"$f":"IF($H5<>\"\",IF($H5<Données!$C$3,1,0),0)","v":0},{"$f":"$F5+$J5-($G5+$K5)*(\"00:30\")","v":0},{"$f":"$G5+$K5","v":0}]
[null,{"$f":"B5+1","v":"2014-12-02"},null,null,null,{"$f":"$E6-$D6+IF($D6>$E6,1)","v":0},{"$f":"IF($D6<>\"\",IF($D6<Données!$C$2,1,0),0)","v":0},null,null,{"$f":"$I6-$H6+IF($H6>$I6,1)","v":0},{"$f":"IF($H6<>\"\",IF($H6<Données!$C$3,1,0),0)","v":0},{"$f":"$F6+$J6-($G6+$K6)*(\"00:30\")","v":0},{"$f":"$G6+$K6","v":0},{"$f":"$D6-$I5+IF($I5>$D6,1)","v":0},{"$f":"IF($N6=Données!$F$12,0,IF($N6<Données!$F$11,1,0))","v":0},null,null,null,"Soit au total pour le mois de :",null,{"$f":"VLOOKUP(F2,Données!E15:F26,2)","v":"Décembre"},{"$f":"J2","v":2014}]
[null,{"$f":"B6+1","v":"2014-12-03"},null,null,null,0,{"$f":"IF($D7<>\"\",IF($D7<Données!$C$2,1,0),0)","v":0},null,null,0,{"$f":"IF($H7<>\"\",IF($H7<Données!$C$3,1,0),0)","v":0},0,0,{"$f":"$D7-$I6+IF($I6>$D7,1)","v":0},{"$f":"IF($N7=Données!$F$12,0,IF($N7<Données!$F$11,1,0))","v":0}]
[null,"2014-12-04",null,0.48958333333333298,0.57291666666666696,8.3333333333333981E-2,{"$f":"IF($D8<>\"\",IF($D8<Données!$C$2,1,0),0)","v":0},0.78125,2.0833333333333332E-2,0.23958333333333337,{"$f":"IF($H8<>\"\",IF($H8<Données!$C$3,1,0),0)","v":0},0.32291666666666735,0,{"$f":"$D8-$I7+IF($I7>$D8,1)","v":0.48958333333333298},{"$f":"IF($N8=Données!$F$12,0,IF($N8<Données!$F$11,1,0))","v":0},null,null,null,null,null,null,null,null,null,null,null,null,null,null,null,"Numéro Fiscal :"]
[null,"2014-12-05",null,0.48958333333333298,0.64583333333333304,0.15625000000000006,{"$f":"IF($D9<>\"\",IF($D9<Données!$C$2,1,0),0)","v":0},0.78125,0.96875,0.1875,{"$f":"IF($H9<>\"\",IF($H9<Données!$C$3,1,0),0)","v":0},0.34375000000000006,0,0.46874999999999967,{"$f":"IF($N9=Données!$F$12,0,IF($N9<Données!$F$11,1,0))","v":0},null,null,null,"Nombre de jours travaillés :",null,{"$f":"H78","v":20},null,null,null,null,null,null,null,null,null,"MDP:"]
[null,"2014-12-06",null,0.48958333333333298,0.66666666666666696,0.17708333333333398,{"$f":"IF($D10<>\"\",IF($D10<Données!$C$2,1,0),0)","v":0},0.78125,0.94791666666666696,0.16666666666666696,{"$f":"IF($H10<>\"\",IF($H10<Données!$C$3,1,0),0)","v":0},0.34375000000000094,0,{"$f":"$D10-$I9+IF($I9>$D10,1)","v":0.52083333333333304},{"$f":"IF($N10=Données!$F$12,0,IF($N10<Données!$F$11,1,0))","v":0},null,null,null,"Nombre de jours repos :",null,{"$f":"B78","v":10}]
[null,"2014-12-07",null,0.48958333333333298,0.625,0.13541666666666702,{"$f":"IF($D11<>\"\",IF($D11<Données!$C$2,1,0),0)","v":0},0.78125,0.88541666666666696,0.10416666666666696,{"$f":"IF($H11<>\"\",IF($H11<Données!$C$3,1,0),0)","v":0},0.23958333333333398,0,{"$f":"$D11-$I10+IF($I10>$D11,1)","v":0.54166666666666607},{"$f":"IF($N11=Données!$F$12,0,IF($N11<Données!$F$11,1,0))","v":0},null,null,null,"Nombre de jours récup :",null,{"$f":"C$78","v":0},null,null,null,null,null,null,null,null,null,"Adresse domicile:","-"]
[null,"Total Semaine",null,null,{"$f":"WEEKNUM(B5,21)","v":49},{"$f":"SUM($F5:$F11)","v":0.55208333333333504},{"$f":"G5+G6+G7+G8+G9+G10+G11","v":0},null,null,{"$f":"SUM(J5:J11)","v":0.6979166666666673},{"$f":"K5+K6+K7+K8+K9+K10+K11","v":0},{"$f":"SUM(L5:L11)","v":1.2500000000000022},{"$f":"SUM(M5:M11)","v":0},null,{"$f":"SUM(O6:O11)","v":0},null,null,null,"Nombre de jfg :",null,{"$f":"D$78","v":0}]
[null,{"$f":"B11+1","v":"2014-12-08"},null,0.48958333333333298,0.625,{"$f":"$E13-$D13+IF($D13>$E13,1)","v":0.13541666666666702},{"$f":"IF($D13<>\"\",IF($D13<Données!$C$2,1,0),0)","v":0},0.78125,5.2083333333333336E-2,{"$f":"$I13-$H13+IF($H13>$I13,1)","v":0.27083333333333337},{"$f":"IF($H13<>\"\",IF($H13<Données!$C$3,1,0),0)","v":0},{"$f":"$F13+$J13-($G13+$K13)*(\"00:30\")","v":0.40625000000000039},{"$f":"$G13+$K13","v":0},{"$f":"$D13-$I11+IF($I11>$D13,1)","v":0.60416666666666607},{"$f":"IF($N13=Données!$F$12,0,IF($N13<Données!$F$11,1,0))","v":0},null,null,null,"Nombre de jours de vacances :",null,{"$f":"E$78","v":0}]
[null,{"$f":"B13+1","v":"2014-12-09"},null,null,null,{"$f":"$E14-$D14+IF($D14>$E14,1)","v":0},{"$f":"IF($D14<>\"\",IF($D14<Données!$C$2,1,0),0)","v":0},null,null,{"$f":"$I14-$H14+IF($H14>$I14,1)","v":0},{"$f":"IF($H14<>\"\",IF($H14<Données!$C$3,1,0),0)","v":0},{"$f":"$F14+$J14-($G14+$K14)*(\"00:30\")","v":0},{"$f":"$G14+$K14","v":0},{"$f":"$D14-$I13+IF($I13>$D14,1)","v":0.94791666666666663},{"$f":"IF($N14=Données!$F$12,0,IF($N14<Données!$F$11,1,0))","v":0},null,null,null,"Nombre de jours de maladie :",null,{"$f":"F$78","v":0}]
[null,{"$f":"B14+1","v":"2014-12-10"},null,null,null,0,{"$f":"IF($D15<>\"\",IF($D15<Données!$C$2,1,0),0)","v":0},null,null,0,{"$f":"IF($H15<>\"\",IF($H15<Données!$C$3,1,0),0)","v":0},0,0,{"$f":"$D15-$I14+IF($I14>$D15,1)","v":0},{"$f":"IF($N15=Données!$F$12,0,IF($N15<Données!$F$11,1,0))","v":0},null,null,null,"Nombre jours fériées travaillés :",null,{"$f":"I78","v":2},null,null,null,null,null,null,null,null,null,"Adresse lieu de travail:","-"]
[null,"2014-12-11",null,0.48958333333333298,0.625,0.13541666666666702,{"$f":"IF($D16<>\"\",IF($D16<Données!$C$2,1,0),0)","v":0},0.78125,2.0833333333333332E-2,0.23958333333333337,{"$f":"IF($H16<>\"\",IF($H16<Données!$C$3,1,0),0)","v":0},0.37500000000000039,0,0.48958333333333298,{"$f":"IF($N16=Données!$F$12,0,IF($N16<Données!$F$11,1,0))","v":0},null,null,null,"Nombre de fois 11h de batement non respecté :",null,{"$f":"J78","v":1}]
[null,"2014-12-12",null,0.48958333333333298,0.58333333333333304,9.3750000000000056E-2,{"$f":"IF($D17<>\"\",IF($D17<Données!$C$2,1,0),0)","v":0},0.83333333333333304,0.97916666666666696,0.14583333333333393,{"$f":"IF($H17<>\"\",IF($H17<Données!$C$3,1,0),0)","v":0},0.23958333333333398,0,0.46874999999999967,{"$f":"IF($N17=Données!$F$12,0,IF($N17<Données!$F$11,1,0))","v":0}]
[null,"2014-12-13",null,0.48958333333333298,0.625,0.13541666666666702,{"$f":"IF($D18<>\"\",IF($D18<Données!$C$2,1,0),0)","v":0},0.78125,0.96875,0.1875,{"$f":"IF($H18<>\"\",IF($H18<Données!$C$3,1,0),0)","v":0},0.32291666666666702,0,0.51041666666666607,{"$f":"IF($N18=Données!$F$12,0,IF($N18<Données!$F$11,1,0))","v":0},null,null,null,null,null,null,null,null,null,null,null,null,null,null,null,"Distance ( Source Mappy) :","-","7,4 KM"]
[null,"2014-12-14",null,0.48958333333333298,0.61458333333333304,0.12500000000000006,{"$f":"IF($D19<>\"\",IF($D19<Données!$C$2,1,0),0)","v":0},0.78125,0.91666666666666696,0.13541666666666696,{"$f":"IF($H19<>\"\",IF($H19<Données!$C$3,1,0),0)","v":0},0.26041666666666702,0,0.52083333333333304,{"$f":"IF($N19=Données!$F$12,0,IF($N19<Données!$F$11,1,0))","v":0},null,null,null,null,null,{"$f":"SUM(L12+L20+L28+L36+L44+L52)","v":6.500000000000008},"Heures effectués"]
[null,"Total Semaine",null,null,{"$f":"WEEKNUM(B13,21)","v":50},{"$f":"SUM($F13:$F19)","v":0.62500000000000111},{"$f":"G13+G14+G15+G16+G17+G18+G19","v":0},null,null,{"$f":"SUM(J13:J19)","v":0.97916666666666763},{"$f":"K13+K14+K15+K16+K17+K18+K19","v":0},{"$f":"SUM(L13:L19)","v":1.6041666666666687},{"$f":"SUM(M13:M19)","v":0},null,{"$f":"SUM(O13:O19)","v":0},null,null,null,null,null,{"$f":"IF(U19<N53,\"- \"&TEXT(ABS(N53-U19),\"[hh]:mm\"),U19-N53)","v":"- 13:00"},"Heures dues/supp",null,null,null,null,null,null,null,null,"Nombre Aller-Retour :","-",{"$f":"COUNT(E5:E11,I5:I11,E13:E19,I13:I19,E21:E27,I21:I27,E29:E35,I29:I35,E37:E43,I37:I43,E45:E51,I45:I51)","v":40}]
[null,{"$f":"B19+1","v":"2014-12-15"},null,0.48958333333333298,0.63541666666666696,{"$f":"$E21-$D21+IF($D21>$E21,1)","v":0.14583333333333398},{"$f":"IF($D21<>\"\",IF($D21<Données!$C$2,1,0),0)","v":0},0.78125,0.98958333333333304,{"$f":"$I21-$H21+IF($H21>$I21,1)","v":0.20833333333333304},{"$f":"IF($H21<>\"\",IF($H21<Données!$C$3,1,0),0)","v":0},{"$f":"$F21+$J21-($G21+$K21)*(\"00:30\")","v":0.35416666666666702},{"$f":"$G21+$K21","v":0},{"$f":"$D21-$I19+IF($I19>$D21,1)","v":0.57291666666666607},{"$f":"IF($N21=Données!$F$12,0,IF($N21<Données!$F$11,1,0))","v":0},null,null,null,null,null,null,null,null,null,null,null,null,null,null,null,"Km Parcourue :","-",{"$f":"SUM(AG20*14.8)","v":592},"Km"]
[null,{"$f":"B21+1","v":"2014-12-16"},null,null,null,{"$f":"$E22-$D22+IF($D22>$E22,1)","v":0},{"$f":"IF($D22<>\"\",IF($D22<Données!$C$2,1,0),0)","v":0},null,null,{"$f":"$I22-$H22+IF($H22>$I22,1)","v":0},{"$f":"IF($H22<>\"\",IF($H22<Données!$C$3,1,0),0)","v":0},{"$f":"$F22+$J22-($G22+$K22)*(\"00:30\")","v":0},{"$f":"$G22+$K22","v":0},{"$f":"$D22-$I21+IF($I21>$D22,1)","v":1.0416666666666963E-2},0,null,null,null,null,null,null,null,null,null,null,null,null,null,null,null,"Horodateur Payé :","-",28.5]
[null,{"$f":"B22+1","v":"2014-12-17"},null,null,null,0,{"$f":"IF($D23<>\"\",IF($D23<Données!$C$2,1,0),0)","v":0},null,null,0,{"$f":"IF($H23<>\"\",IF($H23<Données!$C$3,1,0),0)","v":0},0,0,{"$f":"$D23-$I22+IF($I22>$D23,1)","v":0},{"$f":"IF($N23=Données!$F$12,0,IF($N23<Données!$F$11,1,0))","v":0},null,null,null,"Dont :","-",{"$f":"$B$68","v":6.0104166666666687},"Heures à taux normal ( 35h )",null,null,null,null,null,null,null,null,"Achat divers pour le travail :","-"]
[null,"2014-12-18",null,0.48958333333333298,0.59375,0.10416666666666702,{"$f":"IF($D24<>\"\",IF($D24<Données!$C$2,1,0),0)","v":0},0.78125,2.0833333333333332E-2,0.23958333333333337,{"$f":"IF($H24<>\"\",IF($H24<Données!$C$3,1,0),0)","v":0},0.34375000000000039,0,0.48958333333333298,{"$f":"IF($N24=Données!$F$12,0,IF($N24<Données!$F$11,1,0))","v":0},null,null,null,null,"-",{"$f":"$C$68","v":0.42708333333333681},"Heures en HS 10%         ( 35h à 39h )",null,null,null,null,null,null,null,null,null,"-"]
[null,"2014-12-19",null,0.48958333333333298,0.59375,0.10416666666666702,{"$f":"IF($D25<>\"\",IF($D25<Données!$C$2,1,0),0)","v":0},0.78125,2.0833333333333332E-2,0.23958333333333337,{"$f":"IF($H25<>\"\",IF($H25<Données!$C$3,1,0),0)","v":0},0.34375000000000039,0,0.46874999999999967,{"$f":"IF($N25=Données!$F$12,0,IF($N25<Données!$F$11,1,0))","v":0},null,null,null,null,"-",{"$f":"$D$68","v":6.25E-2},"Heures en HS 20%         (39h à 43h )",null,null,null,null,null,null,null,null,null,"-"]
[null,"2014-12-20",null,0.48958333333333298,0.625,0.13541666666666702,{"$f":"IF($D26<>\"\",IF($D26<Données!$C$2,1,0),0)","v":0},0.78125,0.98958333333333304,0.20833333333333304,{"$f":"IF($H26<>\"\",IF($H26<Données!$C$3,1,0),0)","v":0},0.34375000000000006,0,0.46874999999999967,{"$f":"IF($N26=Données!$F$12,0,IF($N26<Données!$F$11,1,0))","v":0},null,null,null,null,"-",{"$f":"$E$68","v":0},"Heures en HS 40%         ( 43h et plus )",null,null,null,null,null,null,null,null,null,"-"]
[null,"2014-12-21",null,0.48958333333333298,0.66666666666666696,0.17708333333333398,{"$f":"IF($D27<>\"\",IF($D27<Données!$C$2,1,0),0)","v":0},0.78125,0.90625,0.125,{"$f":"IF($H27<>\"\",IF($H27<Données!$C$3,1,0),0)","v":0},0.30208333333333398,0,0.5,{"$f":"IF($N27=Données!$F$12,0,IF($N27<Données!$F$11,1,0))","v":0},null,null,null,null,"-",{"$f":"SUM(M12+M20+M28+M36+M44+M52)","v":0},"Nombre de repas",null,null,null,null,null,null,null,null,null,"-"]
[null,"Total Semaine",null,null,{"$f":"WEEKNUM(B21,21)","v":51},{"$f":"SUM($F21:$F27)","v":0.66666666666666896},{"$f":"G21+G22+G23+G24+G25+G26+G27","v":0},null,null,{"$f":"SUM(J21:J27)","v":1.0208333333333328},{"$f":"K21+K22+K23+K24+K25+K26+K27","v":0},{"$f":"SUM(L21:L27)","v":1.6875000000000018},{"$f":"SUM(M21:M27)","v":0},null,{"$f":"SUM(O21:O27)","v":0},null,null,null,null,null,null,null,null,null,null,null,null,null,null,null,null,"-"]
[null,{"$f":"B27+1","v":"2014-12-22"},null,0.48958333333333298,0.63541666666666696,{"$f":"$E29-$D29+IF($D29>$E29,1)","v":0.14583333333333398},{"$f":"IF($D29<>\"\",IF($D29<Données!$C$2,1,0),0)","v":0},0.78125,0.96875,{"$f":"$I29-$H29+IF($H29>$I29,1)","v":0.1875},{"$f":"IF($H29<>\"\",IF($H29<Données!$C$3,1,0),0)","v":0},{"$f":"$F29+$J29-($G29+$K29)*(\"00:30\")","v":0.33333333333333398},{"$f":"$G29+$K29","v":0},{"$f":"$D29-$I27+IF($I27>$D29,1)","v":0.58333333333333304},{"$f":"IF($N29=Données!$F$12,0,IF($N29<Données!$F$11,1,0))","v":0},null,null,null,"Heure fiche de paie:",null,null,null,null,null,null,null,null,null,null,null,null,"-"]
[null,{"$f":"B29+1","v":"2014-12-23"},null,null,null,{"$f":"$E30-$D30+IF($D30>$E30,1)","v":0},{"$f":"IF($D30<>\"\",IF($D30<Données!$C$2,1,0),0)","v":0},null,null,{"$f":"$I30-$H30+IF($H30>$I30,1)","v":0},{"$f":"IF($H30<>\"\",IF($H30<Données!$C$3,1,0),0)","v":0},{"$f":"$F30+$J30-($G30+$K30)*(\"00:30\")","v":0},{"$f":"$G30+$K30","v":0},{"$f":"$D30-$I29+IF($I29>$D30,1)","v":3.125E-2},0,null,null,null,null,null,null,null,null,null,null,null,null,null,null,null,null,"-"]
[null,{"$f":"B30+1","v":"2014-12-24"},null,null,null,0,{"$f":"IF($D31<>\"\",IF($D31<Données!$C$2,1,0),0)","v":0},null,null,0,{"$f":"IF($H31<>\"\",IF($H31<Données!$C$3,1,0),0)","v":0},0,0,{"$f":"$D31-$I30+IF($I30>$D31,1)","v":0},{"$f":"IF($N31=Données!$F$12,0,IF($N31<Données!$F$11,1,0))","v":0},null,null,null,"Dont :","-",6.3194444444444438,"Heures à taux normal",null,null,null,null,null,null,null,null,null,"-"]
[null,"2014-12-25",null,0.48958333333333298,0.58333333333333304,9.3750000000000056E-2,{"$f":"IF($D32<>\"\",IF($D32<Données!$C$2,1,0),0)","v":0},0.78125,0.91666666666666696,0.13541666666666696,{"$f":"IF($H32<>\"\",IF($H32<Données!$C$3,1,0),0)","v":0},0.22916666666666702,0,0.48958333333333298,{"$f":"IF($N32=Données!$F$12,0,IF($N32<Données!$F$11,1,0))","v":0},null,null,null,null,"-",0.73125000000000007,"Heures en HS 10%",null,null,null,null,null,null,null,null,null,"-"]
[null,"2014-12-26",null,0.48958333333333298,0.58333333333333304,9.3750000000000056E-2,{"$f":"IF($D33<>\"\",IF($D33<Données!$C$2,1,0),0)","v":0},0.78125,9.375E-2,0.3125,{"$f":"IF($H33<>\"\",IF($H33<Données!$C$3,1,0),0)","v":0},0.40625000000000006,0,0.57291666666666607,{"$f":"IF($N33=Données!$F$12,0,IF($N33<Données!$F$11,1,0))","v":0},null,null,null,null,"-",0,"Heures en HS 20%"]
[null,"2014-12-27",null,0.48958333333333298,0.625,0.13541666666666702,{"$f":"IF($D34<>\"\",IF($D34<Données!$C$2,1,0),0)","v":0},0.78125,1.0416666666666666E-2,0.22916666666666663,{"$f":"IF($H34<>\"\",IF($H34<Données!$C$3,1,0),0)","v":0},0.36458333333333365,0,{"$f":"$D34-$I33+IF($I33>$D34,1)","v":0.39583333333333298},{"$f":"IF($N34=Données!$F$12,0,IF($N34<Données!$F$11,1,0))","v":1},null,null,null,null,"-",0,"Heures en HS 40%",null,null,null,null,null,null,null,null,"Total dépenses:","-",{"$f":"SUM(AG22:AG32)","v":28.5}]
[null,"2014-12-28",null,0.48958333333333298,0.61458333333333304,0.12500000000000006,{"$f":"IF($D35<>\"\",IF($D35<Données!$C$2,1,0),0)","v":0},0.78125,0.89583333333333304,0.11458333333333304,{"$f":"IF($H35<>\"\",IF($H35<Données!$C$3,1,0),0)","v":0},0.23958333333333309,0,0.4791666666666663,{"$f":"IF($N35=Données!$F$12,0,IF($N35<Données!$F$11,1,0))","v":0},null,null,null,null,"-",0,"Nombre de repas"]
[null,"Total Semaine",null,null,{"$f":"WEEKNUM(B29,21)","v":52},{"$f":"SUM($F29:$F35)","v":0.59375000000000111},{"$f":"G29+G30+G31+G32+G33+G34+G35","v":0},null,null,{"$f":"SUM(J29:J35)","v":0.97916666666666663},{"$f":"K29+K30+K31+K32+K33+K34+K35","v":0},{"$f":"SUM(L29:L35)","v":1.5729166666666679},{"$f":"SUM(M29:M35)","v":0},null,{"$f":"SUM(O29:O35)","v":1}]
[null,{"$f":"B35+1","v":"2014-12-29"},null,0.48958333333333298,0.625,{"$f":"$E37-$D37+IF($D37>$E37,1)","v":0.13541666666666702},{"$f":"IF($D37<>\"\",IF($D37<Données!$C$2,1,0),0)","v":0},0.78125,3.125E-2,{"$f":"$I37-$H37+IF($H37>$I37,1)","v":0.25},{"$f":"IF($H37<>\"\",IF($H37<Données!$C$3,1,0),0)","v":0},{"$f":"$F37+$J37-($G37+$K37)*(\"00:30\")","v":0.38541666666666702},{"$f":"$G37+$K37","v":0},{"$f":"$D37-$I35+IF($I35>$D37,1)","v":0.59375},{"$f":"IF($N37=Données!$F$12,0,IF($N37<Données!$F$11,1,0))","v":0},null,null,null,"Différence:"]
[null,{"$f":"B37+1","v":"2014-12-30"},null,null,null,{"$f":"$E38-$D38+IF($D38>$E38,1)","v":0},{"$f":"IF($D38<>\"\",IF($D38<Données!$C$2,1,0),0)","v":0},null,null,{"$f":"$I38-$H38+IF($H38>$I38,1)","v":0},{"$f":"IF($H38<>\"\",IF($H38<Données!$C$3,1,0),0)","v":0},{"$f":"$F38+$J38-($G38+$K38)*(\"00:30\")","v":0},{"$f":"$G38+$K38","v":0},{"$f":"$D38-$I37+IF($I37>$D38,1)","v":0.96875},{"$f":"IF($N38=Données!$F$12,0,IF($N38<Données!$F$11,1,0))","v":0}]
[null,{"$f":"B38+1","v":"2014-12-31"},null,null,null,0,{"$f":"IF($D39<>\"\",IF($D39<Données!$C$2,1,0),0)","v":0},null,null,0,{"$f":"IF($H39<>\"\",IF($H39<Données!$C$3,1,0),0)","v":0},0,0,{"$f":"$D39-$I38+IF($I38>$D39,1)","v":0},{"$f":"IF($N39=Données!$F$12,0,IF($N39<Données!$F$11,1,0))","v":0},null,null,null,"Dont :","-","-7:25","Heures à taux normal"]
[null,"2015-01-01",null,null,null,0,{"$f":"IF($D40<>\"\",IF($D40<Données!$C$2,1,0),0)","v":0},null,null,0,{"$f":"IF($H40<>\"\",IF($H40<Données!$C$3,1,0),0)","v":0},0,0,0,{"$f":"IF($N40=Données!$F$12,0,IF($N40<Données!$F$11,1,0))","v":0},null,null,null,null,"-","-7:18","Heures en HS 10%"]
[null,"2015-01-02",null,null,null,0,{"$f":"IF($D41<>\"\",IF($D41<Données!$C$2,1,0),0)","v":0},null,null,0,{"$f":"IF($H41<>\"\",IF($H41<Données!$C$3,1,0),0)","v":0},0,0,0,{"$f":"IF($N41=Données!$F$12,0,IF($N41<Données!$F$11,1,0))","v":0},null,null,null,null,"-",{"$f":"$U25-$U33+IF($U33>$U25,1)","v":6.25E-2},"Heures en HS 20%"]
[null,"2015-01-03",null,null,null,0,{"$f":"IF($D42<>\"\",IF($D42<Données!$C$2,1,0),0)","v":0},null,null,0,{"$f":"IF($H42<>\"\",IF($H42<Données!$C$3,1,0),0)","v":0},0,0,0,{"$f":"IF($N42=Données!$F$12,0,IF($N42<Données!$F$11,1,0))","v":0},null,null,null,null,"-",null,"Heures en HS 40%"]
[null,"2015-01-04",null,null,null,0,{"$f":"IF($D43<>\"\",IF($D43<Données!$C$2,1,0),0)","v":0},null,null,0,{"$f":"IF($H43<>\"\",IF($H43<Données!$C$3,1,0),0)","v":0},0,0,0,{"$f":"IF($N43=Données!$F$12,0,IF($N43<Données!$F$11,1,0))","v":0},null,null,null,null,"-",{"$f":"SUM(U35-U27)","v":0},"Nombre de repas"]
[null,"Total Semaine",null,null,{"$f":"WEEKNUM(B37,21)","v":1},{"$f":"SUM($F37:$F43)","v":0.13541666666666702},{"$f":"G37+G38+G39+G40+G41+G42+G43","v":0},null,null,{"$f":"SUM(J37:J43)","v":0.25},{"$f":"K37+K38+K39+K40+K41+K42+K43","v":0},{"$f":"SUM(L37:L43)","v":0.38541666666666702},{"$f":"SUM(M37:M43)","v":0},null,{"$f":"SUM(O37:O43)","v":0}]
[null,{"$f":"B43+1","v":"2015-01-05"},null,null,null,{"$f":"$E45-$D45+IF($D45>$E45,1)","v":0},{"$f":"IF($D45<>\"\",IF($D45<Données!$C$2,1,0),0)","v":0},null,null,{"$f":"$I45-$H45+IF($H45>$I45,1)","v":0},{"$f":"IF($H45<>\"\",IF($H45<Données!$C$3,1,0),0)","v":0},{"$f":"$F45+$J45-($G45+$K45)*(\"00:30\")","v":0},{"$f":"$G45+$K45","v":0},{"$f":"$D45-$I43+IF($I43>$D45,1)","v":0},{"$f":"IF($N45=Données!$F$12,0,IF($N45<Données!$F$11,1,0))","v":0}]
[null,{"$f":"B45+1","v":"2015-01-06"},null,null,null,0,{"$f":"IF($D46<>\"\",IF($D46<Données!$C$2,1,0),0)","v":0},null,null,{"$f":"$I46-$H46+IF($H46>$I46,1)","v":0},{"$f":"IF($H46<>\"\",IF($H46<Données!$C$3,1,0),0)","v":0},{"$f":"$F46+$J46-($G46+$K46)*(\"00:30\")","v":0},{"$f":"$G46+$K46","v":0},{"$f":"$D46-$I45+IF($I45>$D46,1)","v":0},{"$f":"IF($N46=Données!$F$12,0,IF($N46<Données!$F$11,1,0))","v":0}]
[null,{"$f":"B46+1","v":"2015-01-07"},null,null,null,0,{"$f":"IF($D47<>\"\",IF($D47<Données!$C$2,1,0),0)","v":0},null,null,0,{"$f":"IF($H47<>\"\",IF($H47<Données!$C$3,1,0),0)","v":0},0,0,{"$f":"$D47-$I46+IF($I46>$D47,1)","v":0},{"$f":"IF($N47=Données!$F$12,0,IF($N47<Données!$F$11,1,0))","v":0}]
[null,"2015-01-08",null,null,null,0,{"$f":"IF($D48<>\"\",IF($D48<Données!$C$2,1,0),0)","v":0},null,null,0,{"$f":"IF($H48<>\"\",IF($H48<Données!$C$3,1,0),0)","v":0},0,0,0,{"$f":"IF($N48=Données!$F$12,0,IF($N48<Données!$F$11,1,0))","v":0}]
[null,"2015-01-09",null,null,null,0,{"$f":"IF($D49<>\"\",IF($D49<Données!$C$2,1,0),0)","v":0},null,null,0,{"$f":"IF($H49<>\"\",IF($H49<Données!$C$3,1,0),0)","v":0},0,0,0,{"$f":"IF($N49=Données!$F$12,0,IF($N49<Données!$F$11,1,0))","v":0}]
[null,"2015-01-10",null,null,null,0,{"$f":"IF($D50<>\"\",IF($D50<Données!$C$2,1,0),0)","v":0},null,null,0,{"$f":"IF($H50<>\"\",IF($H50<Données!$C$3,1,0),0)","v":0},0,0,0,{"$f":"IF($N50=Données!$F$12,0,IF($N50<Données!$F$11,1,0))","v":0}]
[null,"2015-01-11",null,null,null,0,{"$f":"IF($D51<>\"\",IF($D51<Données!$C$2,1,0),0)","v":0},null,null,0,{"$f":"IF($H51<>\"\",IF($H51<Données!$C$3,1,0),0)","v":0},0,0,0,{"$f":"IF($N51=Données!$F$12,0,IF($N51<Données!$F$11,1,0))","v":0}]
[null,"Total semaine",null,null,{"$f":"WEEKNUM(B45,21)","v":2},{"$f":"SUM($F45:$F51)","v":0},{"$f":"G45+G46+G47+G48+G49+G50+G51","v":0},null,null,{"$f":"SUM(J45:J51)","v":0},{"$f":"K45+K46+K47+K48+K49+K50+K51","v":0},{"$f":"SUM(L45:L51)","v":0},{"$f":"SUM(M45:M51)","v":0},null,{"$f":"SUM(O45:O51)","v":0}]
[null,null,null,null,null,null,null,null,null,null,null,null,null,7.041666666666667]
[null,null,null,null,null,null,null,null,null,null,null,{"$f":"CodeCouleur(M54)","v":50},null,"REPOS"]
[null,null,null,null,null,null,null,null,null,null,null,{"$f":"CodeCouleur(M55)","v":42},null,"Récup"]
[null,null,null,null,null,null,null,null,null,null,null,48,null,"JFG"]
[null,null,null,null,null,null,null,null,null,null,null,44,null,"VAC"]
[null,null,null,null,null,null,null,null,null,null,null,3,null,"MAL"]
[null,null,null,null,null,null,null,null,null,null,null,{"$f":"CodeCouleur(M59)","v":40},null,"Jf Taf"]
["Heures",null,1.4583333333333333,1.625,1.7916666666666667,"Total"]
["Taux",1,1.1000000000000001,1.2,1.4]
["S 1",{"$f":"IF($L$12<=$C$60,$L$12,$C$60)","v":1.2500000000000022},{"$f":"IF($L$12<=$C$60,0,IF($L$12<=$D$60,$L$12,$D$60)-$C$60)","v":0},{"$f":"IF($L$12<=$D$60,0,IF($L$12<=$E$60,$L$12,$D$60)-$C$60)","v":0},{"$f":"IF($L$12<=$E$60,0,IF($L$12>$E$60,$L$12,$E$60)-$E$60)","v":0},{"$f":"B62+C62+D62+E62","v":1.2500000000000022}]
["S 2",{"$f":"IF($L$20<=$C$60,$L$20,$C$60)","v":1.4583333333333333},{"$f":"IF($L$20<=$C$60,0,IF($L$20<=$D$60,$L$20,$D$60)-$C$60)","v":0.14583333333333548},{"$f":"IF($L$20<=$D$60,0,IF($L$20<=$E$60,$L$20,$D$60)-$C$60)","v":0},{"$f":"IF($L$20<=$E$60,0,IF($L$20>$E$60,$L$20,$E$60)-$E$60)","v":0},1.6041666666666687]
["S 3",{"$f":"IF($L$28<=$C$60,$L$28,$C$60)","v":1.4583333333333333},{"$f":"IF($L$28<=$C$60,0,IF($L$28<=$D$60,$L$28,$D$60)-$C$60)","v":0.16666666666666674},6.25E-2,{"$f":"IF($L$28<=$E$60,0,IF($L$28>$E$60,$L$28,$E$60)-$E$60)","v":0},1.6875]
["S 4",{"$f":"IF($L$36<=$C$60,$L$36,$C$60)","v":1.4583333333333333},{"$f":"IF($L$36<=$C$60,0,IF($L$36<=$D$60,$L$36,$D$60)-$C$60)","v":0.11458333333333459},{"$f":"IF($L$36<=$D$60,0,IF($L$36<=$E$60,$L$36,$D$60)-$C$60)","v":0},{"$f":"IF($L$36<=$E$60,0,IF($L$36>$E$60,$L$36,$E$60)-$E$60)","v":0},1.5729166666666679]
["S 5",{"$f":"IF($L$44<=$C$60,$L$44,$C$60)","v":0.38541666666666702},{"$f":"IF($L$44<=$C$60,0,IF($L$44<=$D$60,$L$44,$D$60)-$C$60)","v":0},{"$f":"IF($L$44<=$D$60,0,IF($L$44<=$E$60,$L$44,$D$60)-$C$60)","v":0},{"$f":"IF($L$44<=$E$60,0,IF($L$44>$E$60,$L$44,$E$60)-$E$60)","v":0},0.38541666666666702]
["S 6",{"$f":"IF($L$52<=$C$60,$L$52,$C$60)","v":0},{"$f":"IF($L$52<=$C$60,0,IF($L$52<=$D$60,$L$52,$D$60)-$C$60)","v":0},{"$f":"IF($L$52<=$D$60,0,IF($L$52<=$E$60,$L$52,$D$60)-$C$60)","v":0},{"$f":"IF($L$52<=$E$60,0,IF($L$52>$E$60,$L$52,$E$60)-$E$60)","v":0},0]
["Total",{"$f":"SUM(B62:B67)","v":6.0104166666666687},{"$f":"SUM(C62:C67)","v":0.42708333333333681},{"$f":"SUM(D62:D67)","v":6.25E-2},{"$f":"SUM(E62:E67)","v":0},6.5000000000000053]
[]
[]
["Jours","Repos","Récup","Jfg","Vac","Mal","Vides","Taf","Jf Taf","<11h"]
["S 1",{"$f":"NbCellsCoul($D$5:$I$11,50)*0.25","v":2},{"$f":"NbCellsCoul($D$5:$I$11,42)*0.25","v":0},{"$f":"NbCellsCoul($D$5:$I$11,48)*0.25","v":0},{"$f":"NbCellsCoul($D$5:$I$11,44)*0.25","v":0},{"$f":"NbCellsCoul($D$5:$I$11,3)*0.25","v":0},{"$f":"+COUNTBLANK(E5:H11)/2","v":3},{"$f":"7-$G72","v":4},{"$f":"NbCellsCoul($D$5:$I$11,40)*0.25","v":0},{"$f":"SUM($O$6:$O$11)","v":0}]
["S 2",{"$f":"NbCellsCoul($D$13:$I$19,50)*0.25","v":2},{"$f":"NbCellsCoul($D$13:$I$19,42)*0.25","v":0},{"$f":"NbCellsCoul($D$13:$I$19,48)*0.25","v":0},{"$f":"NbCellsCoul($D$13:$I$19,44)*0.25","v":0},{"$f":"NbCellsCoul($D$13:$I$19,3)*0.25","v":0},{"$f":"+COUNTBLANK(E13:H19)/2","v":2},5,{"$f":"NbCellsCoul($D$13:$I$19,40)*0.25","v":0},{"$f":"SUM($O$13:$O$19)","v":0}]
["S 3",{"$f":"NbCellsCoul($D$21:$I$27,50)*0.25","v":2},{"$f":"NbCellsCoul($D$21:$I$27,42)*0.25","v":0},{"$f":"NbCellsCoul($D$21:$I$27,48)*0.25","v":0},{"$f":"NbCellsCoul($D$21:$I$27,44)*0.25","v":0},{"$f":"NbCellsCoul($D$21:$I$27,3)*0.25","v":0},{"$f":"+COUNTBLANK(E21:H27)/2","v":2},5,{"$f":"NbCellsCoul($D$21:$I$27,40)*0.25","v":1},{"$f":"SUM($O$21:$O$27)","v":0}]
["S 4",{"$f":"NbCellsCoul($D$29:$I$35,50)*0.25","v":2},{"$f":"NbCellsCoul($D$29:$I$35,42)*0.25","v":0},{"$f":"NbCellsCoul($D$29:$I$35,48)*0.25","v":0},{"$f":"NbCellsCoul($D$29:$I$35,44)*0.25","v":0},{"$f":"NbCellsCoul($D$29:$I$35,3)*0.25","v":0},{"$f":"+COUNTBLANK(E29:H35)/2","v":2},5,{"$f":"NbCellsCoul($D$29:$I$35,40)*0.25","v":1},{"$f":"SUM($O$29:$O$35)","v":1}]
["S 5",{"$f":"NbCellsCoul($D$37:$I$43,50)*0.25","v":2},{"$f":"NbCellsCoul($D$37:$I$43,42)*0.25","v":0},{"$f":"NbCellsCoul($D$37:$I$43,48)*0.25","v":0},{"$f":"NbCellsCoul($D$37:$I$43,44)*0.25","v":0},{"$f":"NbCellsCoul($D$37:$I$43,3)*0.25","v":0},{"$f":"+COUNTBLANK(E37:H43)/2","v":6},1,{"$f":"NbCellsCoul($D$37:$I$43,40)*0.25","v":0},{"$f":"SUM($O$37:$O$43)","v":0}]
["S 6",{"$f":"NbCellsCoul($D$45:$I$51,50)*0.25","v":0},{"$f":"NbCellsCoul($D$45:$I$51,42)*0.25","v":0},{"$f":"NbCellsCoul($D$45:$I$51,48)*0.25","v":0},{"$f":"NbCellsCoul($D$45:$I$51,44)*0.25","v":0},{"$f":"NbCellsCoul($D$45:$I$51,3)*0.25","v":0},{"$f":"+COUNTBLANK(E45:H51)/2","v":7},0,{"$f":"NbCellsCoul($D$45:$I$51,40)*0.25","v":0},{"$f":"SUM($O$45:$O$51)","v":0}]
["Total",{"$f":"SUM(B$72:B$77)","v":10},0,0,0,{"$f":"SUM(F$72:F$77)","v":0},{"$f":"SUM(G$72:G$77)","v":22},{"$f":"SUM(H$72:H$77)","v":20},{"$f":"SUM(I$72:I$77)","v":2},{"$f":"SUM(J$72:J$77)","v":1}]

{"sheet":"Mai 14","index":7,"n_rows":78,"n_cols":34,"rows_kept":78,"cut":false,"hidden":false,"merged":[[50,1,50,2],[51,1,51,3],[59,0,59,1],[108,5,108,8],[44,1,44,2],[45,1,45,2],[46,1,46,2],[47,1,47,2],[48,1,48,2],[49,1,49,2],[43,1,43,3],[32,1,32,2],[33,1,33,2],[34,1,34,2],[35,1,35,3],[36,1,36,2],[37,1,37,2],[38,1,38,2],[39,1,39,2],[40,1,40,2],[41,1,41,2],[42,1,42,2],[31,1,31,2],[20,1,20,2],[21,1,21,2],[22,1,22,2],[23,1,23,2],[24,1,24,2],[25,1,25,2],[26,1,26,2],[27,1,27,3],[28,1,28,2],[29,1,29,2],[30,1,30,2],[19,1,19,3],[8,1,8,2],[9,1,9,2],[10,1,10,2],[11,1,11,3],[12,1,12,2],[13,1,13,2],[14,1,14,2],[15,1,15,2],[16,1,16,2],[17,1,17,2],[18,1,18,2],[7,1,7,2],[0,3,0,9],[0,18,0,21],[0,30,0,32],[2,1,3,2],[2,3,2,4],[2,5,3,5],[2,6,3,6],[2,7,2,8],[2,9,3,9],[2,10,3,10],[2,11,3,11],[2,12,3,12],[4,1,4,2],[5,1,5,2],[6,1,6,2]]}
[null,null,null,"TEMPS DE TRAVAIL",null,null,null,null,null,null,null,null,null,null,null,null,null,null,"RÉCAPITULATIF",null,null,null,null,null,null,null,null,null,null,null,"IMPÔTS"]
[null,null,null,null,null,{"$f":"Données!G14","v":12},null,null,null,{"$f":"Données!C15","v":2014}]
[null,"Jour",null,"Midi",null,"Cumul Midi","Repas","Soir",null,"Cumul Soir","Repas","Totaux","Total Repas"]
[null,null,null,"Début","Fin",null,null,"Début","Fin",null,null,null,null,null,null,null,null,null,null,null,null,null,null,null,null,null,null,null,null,null,null,{"$f":"VLOOKUP(F2,Données!E15:F26,2)","v":"Décembre"},{"$f":"J2","v":2014}]
[null,{"$f":"Données!I15-WEEKDAY(Données!I15-1)+1","v":"2014-12-01"},null,null,null,{"$f":"$E5-$D5+IF($D5>$E5,1)","v":0},{"$f":"IF($D5<>\"\",IF($D5<Données!$C$2,1,0),0)","v":0},null,null,{"$f":"$I5-$H5+IF($H5>$I5,1)","v":0},{"$f":"IF($H5<>\"\",IF($H5<Données!$C$3,1,0),0)","v":0},{"$f":"$F5+$J5-($G5+$K5)*(\"00:30\")","v":0},{"$f":"$G5+$K5","v":0}]
[null,{"$f":"B5+1","v":"2014-12-02"},null,null,null,{"$f":"$E6-$D6+IF($D6>$E6,1)","v":0},{"$f":"IF($D6<>\"\",IF($D6<Données!$C$2,1,0),0)","v":0},null,null,{"$f":"$I6-$H6+IF($H6>$I6,1)","v":0},{"$f":"IF($H6<>\"\",IF($H6<Données!$C$3,1,0),0)","v":0},{"$f":"$F6+$J6-($G6+$K6)*(\"00:30\")","v":0},{"$f":"$G6+$K6","v":0},{"$f":"$D6-$I5+IF($I5>$D6,1)","v":0},{"$f":"IF($N6=Données!$F$12,0,IF($N6<Données!$F$11,1,0))","v":0},null,null,null,"Soit au total pour le mois de :",null,{"$f":"VLOOKUP(F2,Données!E15:F26,2)","v":"Décembre"},{"$f":"J2","v":2014}]
[null,{"$f":"B6+1","v":"2014-12-03"},null,null,null,0,{"$f":"IF($D7<>\"\",IF($D7<Données!$C$2,1,0),0)","v":0},null,null,0,{"$f":"IF($H7<>\"\",IF($H7<Données!$C$3,1,0),0)","v":0},0,0,{"$f":"$D7-$I6+IF($I6>$D7,1)","v":0},{"$f":"IF($N7=Données!$F$12,0,IF($N7<Données!$F$11,1,0))","v":0}]
[null,"2014-12-04",null,0.48958333333333298,0.63541666666666696,0.14583333333333398,{"$f":"IF($D8<>\"\",IF($D8<Données!$C$2,1,0),0)","v":0},0.78125,0.9375,0.15625,{"$f":"IF($H8<>\"\",IF($H8<Données!$C$3,1,0),0)","v":0},0.30208333333333398,0,{"$f":"$D8-$I7+IF($I7>$D8,1)","v":0.48958333333333298},{"$f":"IF($N8=Données!$F$12,0,IF($N8<Données!$F$11,1,0))","v":0},null,null,null,null,null,null,null,null,null,null,null,null,null,null,null,"Numéro Fiscal :"]
[null,"2014-12-05",null,0.48958333333333298,0.63541666666666696,0.14583333333333398,{"$f":"IF($D9<>\"\",IF($D9<Données!$C$2,1,0),0)","v":0},0.78125,6.25E-2,0.28125,{"$f":"IF($H9<>\"\",IF($H9<Données!$C$3,1,0),0)","v":0},0.42708333333333398,0,{"$f":"$D9-$I8+IF($I8>$D9,1)","v":0.55208333333333304},{"$f":"IF($N9=Données!$F$12,0,IF($N9<Données!$F$11,1,0))","v":0},null,null,null,"Nombre de jours travaillés :",null,{"$f":"H78","v":18.5},null,null,null,null,null,null,null,null,null,"MDP:"]
[null,"2014-12-06",null,null,null,0,{"$f":"IF($D10<>\"\",IF($D10<Données!$C$2,1,0),0)","v":0},0.78125,0.97916666666666696,0.19791666666666696,{"$f":"IF($H10<>\"\",IF($H10<Données!$C$3,1,0),0)","v":0},0.19791666666666696,0,{"$f":"$D10-$I9+IF($I9>$D10,1)","v":0.9375},{"$f":"IF($N10=Données!$F$12,0,IF($N10<Données!$F$11,1,0))","v":0},null,null,null,"Nombre de jours repos :",null,{"$f":"B78","v":6}]
[null,"2014-12-07",null,0.48958333333333298,0.65625,0.16666666666666702,{"$f":"IF($D11<>\"\",IF($D11<Données!$C$2,1,0),0)","v":0},0.78125,0,0.21875,{"$f":"IF($H11<>\"\",IF($H11<Données!$C$3,1,0),0)","v":0},0.38541666666666702,0,{"$f":"$D11-$I10+IF($I10>$D11,1)","v":0.51041666666666607},{"$f":"IF($N11=Données!$F$12,0,IF($N11<Données!$F$11,1,0))","v":0},null,null,null,"Nombre de jours récup :",null,{"$f":"C$78","v":0},null,null,null,null,null,null,null,null,null,"Adresse domicile:","-"]
[null,"Total Semaine",null,null,{"$f":"WEEKNUM(B5,21)","v":49},{"$f":"SUM($F5:$F11)","v":0.45833333333333498},{"$f":"G5+G6+G7+G8+G9+G10+G11","v":0},null,null,{"$f":"SUM(J5:J11)","v":0.85416666666666696},{"$f":"K5+K6+K7+K8+K9+K10+K11","v":0},{"$f":"SUM(L5:L11)","v":1.312500000000002},{"$f":"SUM(M5:M11)","v":0},null,{"$f":"SUM(O6:O11)","v":0},null,null,null,"Nombre de jfg :",null,{"$f":"D$78","v":0}]
[null,{"$f":"B11+1","v":"2014-12-08"},null,0.48958333333333298,0.625,{"$f":"$E13-$D13+IF($D13>$E13,1)","v":0.13541666666666702},{"$f":"IF($D13<>\"\",IF($D13<Données!$C$2,1,0),0)","v":0},0.78125,0.97916666666666696,{"$f":"$I13-$H13+IF($H13>$I13,1)","v":0.19791666666666696},{"$f":"IF($H13<>\"\",IF($H13<Données!$C$3,1,0),0)","v":0},{"$f":"$F13+$J13-($G13+$K13)*(\"00:30\")","v":0.33333333333333398},{"$f":"$G13+$K13","v":0},{"$f":"$D13-$I11+IF($I11>$D13,1)","v":0.48958333333333298},{"$f":"IF($N13=Données!$F$12,0,IF($N13<Données!$F$11,1,0))","v":0},null,null,null,"Nombre de jours de vacances :",null,{"$f":"E$78","v":0}]
[null,{"$f":"B13+1","v":"2014-12-09"},null,null,null,{"$f":"$E14-$D14+IF($D14>$E14,1)","v":0},{"$f":"IF($D14<>\"\",IF($D14<Données!$C$2,1,0),0)","v":0},null,null,{"$f":"$I14-$H14+IF($H14>$I14,1)","v":0},{"$f":"IF($H14<>\"\",IF($H14<Données!$C$3,1,0),0)","v":0},{"$f":"$F14+$J14-($G14+$K14)*(\"00:30\")","v":0},{"$f":"$G14+$K14","v":0},0,{"$f":"IF($N14=Données!$F$12,0,IF($N14<Données!$F$11,1,0))","v":0},null,null,null,"Nombre de jours de maladie :",null,{"$f":"F$78","v":6}]
[null,{"$f":"B14+1","v":"2014-12-10"},null,null,null,0,{"$f":"IF($D15<>\"\",IF($D15<Données!$C$2,1,0),0)","v":0},null,null,0,{"$f":"IF($H15<>\"\",IF($H15<Données!$C$3,1,0),0)","v":0},0,0,{"$f":"$D15-$I14+IF($I14>$D15,1)","v":0},{"$f":"IF($N15=Données!$F$12,0,IF($N15<Données!$F$11,1,0))","v":0},null,null,null,"Nombre jours fériées travaillés :",null,{"$f":"I78","v":1},null,null,null,null,null,null,null,null,null,"Adresse lieu de travail:","-"]
[null,"2014-12-11",null,null,null,0,{"$f":"IF($D16<>\"\",IF($D16<Données!$C$2,1,0),0)","v":0},null,null,0,{"$f":"IF($H16<>\"\",IF($H16<Données!$C$3,1,0),0)","v":0},0.32291666666666669,0,0,{"$f":"IF($N16=Données!$F$12,0,IF($N16<Données!$F$11,1,0))","v":0},null,null,null,"Nombre de fois 11h de batement non respecté :",null,{"$f":"J78","v":5}]
[null,"2014-12-12",null,null,null,0,{"$f":"IF($D17<>\"\",IF($D17<Données!$C$2,1,0),0)","v":0},null,null,0,{"$f":"IF($H17<>\"\",IF($H17<Données!$C$3,1,0),0)","v":0},0.32291666666666669,0,0,{"$f":"IF($N17=Données!$F$12,0,IF($N17<Données!$F$11,1,0))","v":0}]
[null,"2014-12-13",null,null,null,0,{"$f":"IF($D18<>\"\",IF($D18<Données!$C$2,1,0),0)","v":0},null,null,0,{"$f":"IF($H18<>\"\",IF($H18<Données!$C$3,1,0),0)","v":0},0.32291666666666669,0,0,{"$f":"IF($N18=Données!$F$12,0,IF($N18<Données!$F$11,1,0))","v":0},null,null,null,null,null,null,null,null,null,null,null,null,null,null,null,"Distance ( Source Mappy) :","-","7,4 KM"]
[null,"2014-12-14",null,null,null,0,{"$f":"IF($D19<>\"\",IF($D19<Données!$C$2,1,0),0)","v":0},null,null,0,{"$f":"IF($H19<>\"\",IF($H19<Données!$C$3,1,0),0)","v":0},0.32291666666666669,0,0,{"$f":"IF($N19=Données!$F$12,0,IF($N19<Données!$F$11,1,0))","v":0},null,null,null,null,null,{"$f":"SUM(L12+L20+L28+L36+L44+L52)","v":8.0625000000000071},"Heures effectués"]
[null,"Total Semaine",null,null,{"$f":"WEEKNUM(B13,21)","v":50},{"$f":"SUM($F13:$F19)","v":0.13541666666666702},{"$f":"G13+G14+G15+G16+G17+G18+G19","v":0},null,null,{"$f":"SUM(J13:J19)","v":0.19791666666666696},{"$f":"K13+K14+K15+K16+K17+K18+K19","v":0},{"$f":"SUM(L13:L19)","v":1.6250000000000009},{"$f":"SUM(M13:M19)","v":0},null,{"$f":"SUM(O13:O19)","v":0},null,null,null,null,null,{"$f":"IF(U19<N53,\"- \"&TEXT(ABS(N53-U19),\"[hh]:mm\"),U19-N53)","v":1.0208333333333401},"Heures dues/supp",null,null,null,null,null,null,null,null,"Nombre Aller-Retour :","-",{"$f":"COUNT(E5:E11,I5:I11,E13:E19,I13:I19,E21:E27,I21:I27,E29:E35,I29:I35,E37:E43,I37:I43,E45:E51,I45:I51)","v":37}]
[null,{"$f":"B19+1","v":"2014-12-15"},null,0.48958333333333298,0.625,{"$f":"$E21-$D21+IF($D21>$E21,1)","v":0.13541666666666702},{"$f":"IF($D21<>\"\",IF($D21<Données!$C$2,1,0),0)","v":0},0.78125,0.98958333333333304,{"$f":"$I21-$H21+IF($H21>$I21,1)","v":0.20833333333333304},{"$f":"IF($H21<>\"\",IF($H21<Données!$C$3,1,0),0)","v":0},{"$f":"$F21+$J21-($G21+$K21)*(\"00:30\")","v":0.34375000000000006},{"$f":"$G21+$K21","v":0},{"$f":"$D21-$I19+IF($I19>$D21,1)","v":0.48958333333333298},{"$f":"IF($N21=Données!$F$12,0,IF($N21<Données!$F$11,1,0))","v":0},null,null,null,null,null,null,null,null,null,null,null,null,null,null,null,"Km Parcourue :","-",{"$f":"SUM(AG20*14.8)","v":547.6},"Km"]
[null,{"$f":"B21+1","v":"2014-12-16"},null,0.48958333333333298,0.64583333333333304,{"$f":"$E22-$D22+IF($D22>$E22,1)","v":0.15625000000000006},{"$f":"IF($D22<>\"\",IF($D22<Données!$C$2,1,0),0)","v":0},null,null,{"$f":"$I22-$H22+IF($H22>$I22,1)","v":0},{"$f":"IF($H22<>\"\",IF($H22<Données!$C$3,1,0),0)","v":0},{"$f":"$F22+$J22-($G22+$K22)*(\"00:30\")","v":0.15625000000000006},{"$f":"$G22+$K22","v":0},{"$f":"$D22-$I21+IF($I21>$D22,1)","v":0.5},{"$f":"IF($N22=Données!$F$12,0,IF($N22<Données!$F$11,1,0))","v":0},null,null,null,null,null,null,null,null,null,null,null,null,null,null,null,"Horodateur Payé :","-",22.5]
[null,{"$f":"B22+1","v":"2014-12-17"},null,null,null,0,{"$f":"IF($D23<>\"\",IF($D23<Données!$C$2,1,0),0)","v":0},null,null,0,{"$f":"IF($H23<>\"\",IF($H23<Données!$C$3,1,0),0)","v":0},0,0,{"$f":"$D23-$I22+IF($I22>$D23,1)","v":0},{"$f":"IF($N23=Données!$F$12,0,IF($N23<Données!$F$11,1,0))","v":0},null,null,null,"Dont :","-",{"$f":"$B$68","v":7.1458333333333348},"Heures à taux normal ( 35h )",null,null,null,null,null,null,null,null,"Achat divers pour le travail :","-"]
[null,"2014-12-18",null,0.48958333333333298,0.60416666666666696,0.11458333333333398,{"$f":"IF($D24<>\"\",IF($D24<Données!$C$2,1,0),0)","v":0},0.78125,4.1666666666666664E-2,0.26041666666666663,{"$f":"IF($H24<>\"\",IF($H24<Données!$C$3,1,0),0)","v":0},0.37500000000000061,0,0.48958333333333298,{"$f":"IF($N24=Données!$F$12,0,IF($N24<Données!$F$11,1,0))","v":0},null,null,null,null,"-",{"$f":"$C$68","v":0.57291666666666874},"Heures en HS 10%         ( 35h à 39h )",null,null,null,null,null,null,null,null,null,"-"]
[null,"2014-12-19",null,0.48958333333333298,0.61458333333333304,0.12500000000000006,{"$f":"IF($D25<>\"\",IF($D25<Données!$C$2,1,0),0)","v":0},null,null,0,{"$f":"IF($H25<>\"\",IF($H25<Données!$C$3,1,0),0)","v":0},0.12500000000000006,0,{"$f":"$D25-$I24+IF($I24>$D25,1)","v":0.4479166666666663},{"$f":"IF($N25=Données!$F$12,0,IF($N25<Données!$F$11,1,0))","v":1},null,null,null,null,"-",{"$f":"$D$68","v":6.25E-2},"Heures en HS 20%         (39h à 43h )",null,null,null,null,null,null,null,null,null,"-"]
[null,"2014-12-20",null,0.48958333333333298,0.60416666666666696,0.11458333333333398,{"$f":"IF($D26<>\"\",IF($D26<Données!$C$2,1,0),0)","v":0},0.78125,6.25E-2,0.28125,{"$f":"IF($H26<>\"\",IF($H26<Données!$C$3,1,0),0)","v":0},0.39583333333333398,0,0.48958333333333298,{"$f":"IF($N26=Données!$F$12,0,IF($N26<Données!$F$11,1,0))","v":0},null,null,null,null,"-",{"$f":"$E$68","v":0.11458333333333459},"Heures en HS 40%         ( 43h et plus )",null,null,null,null,null,null,null,null,null,"-"]
[null,"2014-12-21",null,0.48958333333333298,0.61458333333333304,0.12500000000000006,{"$f":"IF($D27<>\"\",IF($D27<Données!$C$2,1,0),0)","v":0},0.78125,0.94791666666666696,0.16666666666666696,{"$f":"IF($H27<>\"\",IF($H27<Données!$C$3,1,0),0)","v":0},0.29166666666666702,0,0.42708333333333298,{"$f":"IF($N27=Données!$F$12,0,IF($N27<Données!$F$11,1,0))","v":1},null,null,null,null,"-",{"$f":"SUM(M12+M20+M28+M36+M44+M52)","v":1},"Nombre de repas",null,null,null,null,null,null,null,null,null,"-"]
[null,"Total Semaine",null,null,{"$f":"WEEKNUM(B21,21)","v":51},{"$f":"SUM($F21:$F27)","v":0.77083333333333504},{"$f":"G21+G22+G23+G24+G25+G26+G27","v":0},null,null,{"$f":"SUM(J21:J27)","v":0.91666666666666663},{"$f":"K21+K22+K23+K24+K25+K26+K27","v":0},{"$f":"SUM(L21:L27)","v":1.6875000000000016},{"$f":"SUM(M21:M27)","v":0},null,{"$f":"SUM(O21:O27)","v":2},null,null,null,null,null,null,null,null,null,null,null,null,null,null,null,null,"-"]
[null,{"$f":"B27+1","v":"2014-12-22"},null,0.48958333333333298,0.625,{"$f":"$E29-$D29+IF($D29>$E29,1)","v":0.13541666666666702},{"$f":"IF($D29<>\"\",IF($D29<Données!$C$2,1,0),0)","v":0},0.78125,0,{"$f":"$I29-$H29+IF($H29>$I29,1)","v":0.21875},{"$f":"IF($H29<>\"\",IF($H29<Données!$C$3,1,0),0)","v":0},{"$f":"$F29+$J29-($G29+$K29)*(\"00:30\")","v":0.35416666666666702},{"$f":"$G29+$K29","v":0},{"$f":"$D29-$I27+IF($I27>$D29,1)","v":0.54166666666666607},{"$f":"IF($N29=Données!$F$12,0,IF($N29<Données!$F$11,1,0))","v":0},null,null,null,"Heure fiche de paie:",null,null,null,null,null,null,null,null,null,null,null,null,"-"]
[null,{"$f":"B29+1","v":"2014-12-23"},null,null,null,{"$f":"$E30-$D30+IF($D30>$E30,1)","v":0},{"$f":"IF($D30<>\"\",IF($D30<Données!$C$2,1,0),0)","v":0},null,null,{"$f":"$I30-$H30+IF($H30>$I30,1)","v":0},{"$f":"IF($H30<>\"\",IF($H30<Données!$C$3,1,0),0)","v":0},{"$f":"$F30+$J30-($G30+$K30)*(\"00:30\")","v":0},{"$f":"$G30+$K30","v":0},{"$f":"$D30-$I29+IF($I29>$D30,1)","v":0},{"$f":"IF($N30=Données!$F$12,0,IF($N30<Données!$F$11,1,0))","v":0},null,null,null,null,null,null,null,null,null,null,null,null,null,null,null,null,"-"]
[null,{"$f":"B30+1","v":"2014-12-24"},null,null,null,0,{"$f":"IF($D31<>\"\",IF($D31<Données!$C$2,1,0),0)","v":0},null,null,0,{"$f":"IF($H31<>\"\",IF($H31<Données!$C$3,1,0),0)","v":0},0,0,{"$f":"$D31-$I30+IF($I30>$D31,1)","v":0},{"$f":"IF($N31=Données!$F$12,0,IF($N31<Données!$F$11,1,0))","v":0},null,null,null,"Dont :","-",6.3194444444444438,"Heures à taux normal",null,null,null,null,null,null,null,null,null,"-"]
[null,"2014-12-25",null,0.48958333333333298,0.63541666666666696,0.14583333333333398,{"$f":"IF($D32<>\"\",IF($D32<Données!$C$2,1,0),0)","v":0},0.78125,2.0833333333333332E-2,0.23958333333333337,{"$f":"IF($H32<>\"\",IF($H32<Données!$C$3,1,0),0)","v":0},0.38541666666666735,0,0.48958333333333298,{"$f":"IF($N32=Données!$F$12,0,IF($N32<Données!$F$11,1,0))","v":0},null,null,null,null,"-",0.73125000000000007,"Heures en HS 10%",null,null,null,null,null,null,null,null,null,"-"]
[null,"2014-12-26",null,0.48958333333333298,0.60416666666666696,0.11458333333333398,{"$f":"IF($D33<>\"\",IF($D33<Données!$C$2,1,0),0)","v":0},0.78125,4.1666666666666664E-2,0.26041666666666663,{"$f":"IF($H33<>\"\",IF($H33<Données!$C$3,1,0),0)","v":0},0.37500000000000061,0,0.46874999999999967,{"$f":"IF($N33=Données!$F$12,0,IF($N33<Données!$F$11,1,0))","v":0},null,null,null,null,"-",0,"Heures en HS 20%"]
[null,"2014-12-27",null,0.48958333333333298,0.61458333333333304,0.12500000000000006,{"$f":"IF($D34<>\"\",IF($D34<Données!$C$2,1,0),0)","v":0},0.78125,4.1666666666666664E-2,0.26041666666666663,{"$f":"IF($H34<>\"\",IF($H34<Données!$C$3,1,0),0)","v":0},0.38541666666666669,0,0.4479166666666663,{"$f":"IF($N34=Données!$F$12,0,IF($N34<Données!$F$11,1,0))","v":1},null,null,null,null,"-",0,"Heures en HS 40%",null,null,null,null,null,null,null,null,"Total dépenses:","-",{"$f":"SUM(AG22:AG32)","v":22.5}]
[null,"2014-12-28",null,0.47916666666666702,0.71875,0.23958333333333298,{"$f":"IF($D35<>\"\",IF($D35<Données!$C$2,1,0),0)","v":1},0.78125,0.96875,0.1875,{"$f":"IF($H35<>\"\",IF($H35<Données!$C$3,1,0),0)","v":0},0.40624999999999967,1,0.43750000000000033,{"$f":"IF($N35=Données!$F$12,0,IF($N35<Données!$F$11,1,0))","v":1},null,null,null,null,"-",0,"Nombre de repas"]
[null,"Total Semaine",null,null,{"$f":"WEEKNUM(B29,21)","v":52},{"$f":"SUM($F29:$F35)","v":0.76041666666666807},{"$f":"G29+G30+G31+G32+G33+G34+G35","v":1},null,null,{"$f":"SUM(J29:J35)","v":1.1666666666666665},{"$f":"K29+K30+K31+K32+K33+K34+K35","v":0},{"$f":"SUM(L29:L35)","v":1.9062500000000013},{"$f":"SUM(M29:M35)","v":1},null,{"$f":"SUM(O29:O35)","v":2}]
[null,{"$f":"B35+1","v":"2014-12-29"},null,0.48958333333333298,0.64583333333333304,{"$f":"$E37-$D37+IF($D37>$E37,1)","v":0.15625000000000006},{"$f":"IF($D37<>\"\",IF($D37<Données!$C$2,1,0),0)","v":0},0.78125,2.0833333333333332E-2,{"$f":"$I37-$H37+IF($H37>$I37,1)","v":0.23958333333333337},{"$f":"IF($H37<>\"\",IF($H37<Données!$C$3,1,0),0)","v":0},{"$f":"$F37+$J37-($G37+$K37)*(\"00:30\")","v":0.39583333333333343},{"$f":"$G37+$K37","v":0},{"$f":"$D37-$I35+IF($I35>$D37,1)","v":0.52083333333333304},{"$f":"IF($N37=Données!$F$12,0,IF($N37<Données!$F$11,1,0))","v":0},null,null,null,"Différence:"]
[null,{"$f":"B37+1","v":"2014-12-30"},null,0.48958333333333298,0.63541666666666696,{"$f":"$E38-$D38+IF($D38>$E38,1)","v":0.14583333333333398},{"$f":"IF($D38<>\"\",IF($D38<Données!$C$2,1,0),0)","v":0},0.78125,6.25E-2,{"$f":"$I38-$H38+IF($H38>$I38,1)","v":0.28125},{"$f":"IF($H38<>\"\",IF($H38<Données!$C$3,1,0),0)","v":0},{"$f":"$F38+$J38-($G38+$K38)*(\"00:30\")","v":0.42708333333333398},{"$f":"$G38+$K38","v":0},{"$f":"$D38-$I37+IF($I37>$D38,1)","v":0.46874999999999967},{"$f":"IF($N38=Données!$F$12,0,IF($N38<Données!$F$11,1,0))","v":0}]
[null,{"$f":"B38+1","v":"2014-12-31"},null,null,null,0,{"$f":"IF($D39<>\"\",IF($D39<Données!$C$2,1,0),0)","v":0},null,null,0,{"$f":"IF($H39<>\"\",IF($H39<Données!$C$3,1,0),0)","v":0},0,0,{"$f":"$D39-$I38+IF($I38>$D39,1)","v":0.9375},{"$f":"IF($N39=Données!$F$12,0,IF($N39<Données!$F$11,1,0))","v":0},null,null,null,"Dont :","-",{"$f":"$U31-$U23+IF($U23>$U31,1)","v":0.17361111111110894},"Heures à taux normal"]
[null,"2015-01-01",null,null,null,0,{"$f":"IF($D40<>\"\",IF($D40<Données!$C$2,1,0),0)","v":0},null,null,0,{"$f":"IF($H40<>\"\",IF($H40<Données!$C$3,1,0),0)","v":0},0,0,0,{"$f":"IF($N40=Données!$F$12,0,IF($N40<Données!$F$11,1,0))","v":0},null,null,null,null,"-",{"$f":"$U32-$U24+IF($U24>$U32,1)","v":0.15833333333333133},"Heures en HS 10%"]
[null,"2015-01-02",null,0.48958333333333298,0.64583333333333304,0.15625000000000006,{"$f":"IF($D41<>\"\",IF($D41<Données!$C$2,1,0),0)","v":0},0.78125,8.3333333333333329E-2,0.30208333333333337,{"$f":"IF($H41<>\"\",IF($H41<Données!$C$3,1,0),0)","v":0},0.45833333333333343,0,0.48958333333333298,{"$f":"IF($N41=Données!$F$12,0,IF($N41<Données!$F$11,1,0))","v":0},null,null,null,null,"-",{"$f":"$U33-$U25+IF($U25>$U33,1)","v":0.9375},"Heures en HS 20%"]
[null,"2015-01-03",null,0.48958333333333298,0.59375,0.10416666666666702,{"$f":"IF($D42<>\"\",IF($D42<Données!$C$2,1,0),0)","v":0},0.8125,0.95833333333333304,0.14583333333333304,{"$f":"IF($H42<>\"\",IF($H42<Données!$C$3,1,0),0)","v":0},0.25000000000000006,0,0.40624999999999967,{"$f":"IF($N42=Données!$F$12,0,IF($N42<Données!$F$11,1,0))","v":1},null,null,null,null,"-",{"$f":"$U34-$U26+IF($U26>$U34,1)","v":0.88541666666666541},"Heures en HS 40%"]
[null,"2015-01-04",null,null,null,0,{"$f":"IF($D43<>\"\",IF($D43<Données!$C$2,1,0),0)","v":0},null,null,0,{"$f":"IF($H43<>\"\",IF($H43<Données!$C$3,1,0),0)","v":0},0,0,0,{"$f":"IF($N43=Données!$F$12,0,IF($N43<Données!$F$11,1,0))","v":0},null,null,null,null,"-",{"$f":"SUM(U35-U27)","v":-1},"Nombre de repas"]
[null,"Total Semaine",null,null,{"$f":"WEEKNUM(B37,21)","v":1},{"$f":"SUM($F37:$F43)","v":0.56250000000000111},{"$f":"G37+G38+G39+G40+G41+G42+G43","v":0},null,null,{"$f":"SUM(J37:J43)","v":0.96874999999999978},{"$f":"K37+K38+K39+K40+K41+K42+K43","v":0},{"$f":"SUM(L37:L43)","v":1.5312500000000009},{"$f":"SUM(M37:M43)","v":0},null,{"$f":"SUM(O37:O43)","v":1}]
[null,{"$f":"B43+1","v":"2015-01-05"},null,null,null,{"$f":"$E45-$D45+IF($D45>$E45,1)","v":0},{"$f":"IF($D45<>\"\",IF($D45<Données!$C$2,1,0),0)","v":0},null,null,{"$f":"$I45-$H45+IF($H45>$I45,1)","v":0},{"$f":"IF($H45<>\"\",IF($H45<Données!$C$3,1,0),0)","v":0},{"$f":"$F45+$J45-($G45+$K45)*(\"00:30\")","v":0},{"$f":"$G45+$K45","v":0},{"$f":"$D45-$I43+IF($I43>$D45,1)","v":0},{"$f":"IF($N45=Données!$F$12,0,IF($N45<Données!$F$11,1,0))","v":0}]
[null,{"$f":"B45+1","v":"2015-01-06"},null,null,null,0,{"$f":"IF($D46<>\"\",IF($D46<Données!$C$2,1,0),0)","v":0},null,null,{"$f":"$I46-$H46+IF($H46>$I46,1)","v":0},{"$f":"IF($H46<>\"\",IF($H46<Données!$C$3,1,0),0)","v":0},{"$f":"$F46+$J46-($G46+$K46)*(\"00:30\")","v":0},{"$f":"$G46+$K46","v":0},{"$f":"$D46-$I45+IF($I45>$D46,1)","v":0},{"$f":"IF($N46=Données!$F$12,0,IF($N46<Données!$F$11,1,0))","v":0}]
[null,{"$f":"B46+1","v":"2015-01-07"},null,null,null,0,{"$f":"IF($D47<>\"\",IF($D47<Données!$C$2,1,0),0)","v":0},null,null,0,{"$f":"IF($H47<>\"\",IF($H47<Données!$C$3,1,0),0)","v":0},0,0,{"$f":"$D47-$I46+IF($I46>$D47,1)","v":0},{"$f":"IF($N47=Données!$F$12,0,IF($N47<Données!$F$11,1,0))","v":0}]
[null,"2015-01-08",null,null,null,0,{"$f":"IF($D48<>\"\",IF($D48<Données!$C$2,1,0),0)","v":0},null,null,0,{"$f":"IF($H48<>\"\",IF($H48<Données!$C$3,1,0),0)","v":0},0,0,0,{"$f":"IF($N48=Données!$F$12,0,IF($N48<Données!$F$11,1,0))","v":0}]
[null,"2015-01-09",null,null,null,0,{"$f":"IF($D49<>\"\",IF($D49<Données!$C$2,1,0),0)","v":0},null,null,0,{"$f":"IF($H49<>\"\",IF($H49<Données!$C$3,1,0),0)","v":0},0,0,0,{"$f":"IF($N49=Données!$F$12,0,IF($N49<Données!$F$11,1,0))","v":0}]
[null,"2015-01-10",null,null,null,0,{"$f":"IF($D50<>\"\",IF($D50<Données!$C$2,1,0),0)","v":0},null,null,0,{"$f":"IF($H50<>\"\",IF($H50<Données!$C$3,1,0),0)","v":0},0,0,0,{"$f":"IF($N50=Données!$F$12,0,IF($N50<Données!$F$11,1,0))","v":0}]
[null,"2015-01-11",null,null,null,0,{"$f":"IF($D51<>\"\",IF($D51<Données!$C$2,1,0),0)","v":0},null,null,0,{"$f":"IF($H51<>\"\",IF($H51<Données!$C$3,1,0),0)","v":0},0,0,0,{"$f":"IF($N51=Données!$F$12,0,IF($N51<Données!$F$11,1,0))","v":0}]
[null,"Total semaine",null,null,{"$f":"WEEKNUM(B45,21)","v":2},{"$f":"SUM($F45:$F51)","v":0},{"$f":"G45+G46+G47+G48+G49+G50+G51","v":0},null,null,{"$f":"SUM(J45:J51)","v":0},{"$f":"K45+K46+K47+K48+K49+K50+K51","v":0},{"$f":"SUM(L45:L51)","v":0},{"$f":"SUM(M45:M51)","v":0},null,{"$f":"SUM(O45:O51)","v":0}]
[null,null,null,null,null,null,null,null,null,null,null,null,null,7.041666666666667]
[null,null,null,null,null,null,null,null,null,null,null,{"$f":"CodeCouleur(M54)","v":50},null,"REPOS"]
[null,null,null,null,null,null,null,null,null,null,null,{"$f":"CodeCouleur(M55)","v":42},null,"Récup"]
[null,null,null,null,null,null,null,null,null,null,null,48,null,"JFG"]
[null,null,null,null,null,null,null,null,null,null,null,44,null,"VAC"]
[null,null,null,null,null,null,null,null,null,null,null,3,null,"MAL"]
[null,null,null,null,null,null,null,null,null,null,null,{"$f":"CodeCouleur(M59)","v":40},null,"Jf Taf"]
["Heures",null,1.4583333333333333,1.625,1.7916666666666667,"Total"]
["Taux",1,1.1000000000000001,1.2,1.4]
["S 1",{"$f":"IF($L$12<=$C$60,$L$12,$C$60)","v":1.312500000000002},{"$f":"IF($L$12<=$C$60,0,IF($L$12<=$D$60,$L$12,$D$60)-$C$60)","v":0},{"$f":"IF($L$12<=$D$60,0,IF($L$12<=$E$60,$L$12,$D$60)-$C$60)","v":0},{"$f":"IF($L$12<=$E$60,0,IF($L$12>$E$60,$L$12,$E$60)-$E$60)","v":0},{"$f":"B62+C62+D62+E62","v":1.312500000000002}]
["S 2",{"$f":"IF($L$20<=$C$60,$L$20,$C$60)","v":1.4583333333333333},{"$f":"IF($L$20<=$C$60,0,IF($L$20<=$D$60,$L$20,$D$60)-$C$60)","v":0.16666666666666763},{"$f":"IF($L$20<=$D$60,0,IF($L$20<=$E$60,$L$20,$D$60)-$C$60)","v":0},{"$f":"IF($L$20<=$E$60,0,IF($L$20>$E$60,$L$20,$E$60)-$E$60)","v":0},1.6250000000000009]
["S 3",{"$f":"IF($L$28<=$C$60,$L$28,$C$60)","v":1.4583333333333333},{"$f":"IF($L$28<=$C$60,0,IF($L$28<=$D$60,$L$28,$D$60)-$C$60)","v":0.16666666666666674},6.25E-2,{"$f":"IF($L$28<=$E$60,0,IF($L$28>$E$60,$L$28,$E$60)-$E$60)","v":0},1.6875]
["S 4",{"$f":"IF($L$36<=$C$60,$L$36,$C$60)","v":1.4583333333333333},{"$f":"IF($L$36<=$C$60,0,IF($L$36<=$D$60,$L$36,$D$60)-$C$60)","v":0.16666666666666674},{"$f":"NbCellsCoul($D$5:$I$11,50)*0.25","v":0},{"$f":"IF($L$36<=$E$60,0,IF($L$36>$E$60,$L$36,$E$60)-$E$60)","v":0.11458333333333459},1.7395833333333346]
["S 5",{"$f":"IF($L$44<=$C$60,$L$44,$C$60)","v":1.4583333333333333},{"$f":"IF($L$44<=$C$60,0,IF($L$44<=$D$60,$L$44,$D$60)-$C$60)","v":7.2916666666667629E-2},{"$f":"IF($L$44<=$D$60,0,IF($L$44<=$E$60,$L$44,$D$60)-$C$60)","v":0},{"$f":"IF($L$44<=$E$60,0,IF($L$44>$E$60,$L$44,$E$60)-$E$60)","v":0},1.5312500000000009]
["S 6",{"$f":"IF($L$52<=$C$60,$L$52,$C$60)","v":0},{"$f":"IF($L$52<=$C$60,0,IF($L$52<=$D$60,$L$52,$D$60)-$C$60)","v":0},{"$f":"IF($L$52<=$D$60,0,IF($L$52<=$E$60,$L$52,$D$60)-$C$60)","v":0},{"$f":"IF($L$52<=$E$60,0,IF($L$52>$E$60,$L$52,$E$60)-$E$60)","v":0},0]
["Total",{"$f":"SUM(B62:B67)","v":7.1458333333333348},{"$f":"SUM(C62:C67)","v":0.57291666666666874},{"$f":"SUM(D62:D67)","v":6.25E-2},{"$f":"SUM(E62:E67)","v":0.11458333333333459},7.8958333333333384]
[]
[]
["Jours","Repos","Récup","Jfg","Vac","Mal","Vides","Taf","Jf Taf","<11h"]
["S 1",{"$f":"NbCellsCoul($D$5:$I$11,50)*0.25","v":0},{"$f":"NbCellsCoul($D$5:$I$11,42)*0.25","v":0},{"$f":"NbCellsCoul($D$5:$I$11,48)*0.25","v":0},{"$f":"NbCellsCoul($D$5:$I$11,44)*0.25","v":0},{"$f":"NbCellsCoul($D$5:$I$11,3)*0.25","v":0},{"$f":"+COUNTBLANK(E5:H11)/2","v":3.5},{"$f":"7-$G72","v":3.5},{"$f":"NbCellsCoul($D$5:$I$11,40)*0.25","v":1},{"$f":"SUM($O$6:$O$11)","v":0}]
["S 2",{"$f":"NbCellsCoul($D$13:$I$19,50)*0.25","v":0},{"$f":"NbCellsCoul($D$13:$I$19,42)*0.25","v":0},{"$f":"NbCellsCoul($D$13:$I$19,48)*0.25","v":0},{"$f":"NbCellsCoul($D$13:$I$19,44)*0.25","v":0},{"$f":"NbCellsCoul($D$13:$I$19,3)*0.25","v":6},{"$f":"+COUNTBLANK(E13:H19)/2","v":6},1,{"$f":"NbCellsCoul($D$13:$I$19,40)*0.25","v":0},{"$f":"SUM($O$13:$O$19)","v":0}]
["S 3",{"$f":"NbCellsCoul($D$21:$I$27,50)*0.25","v":2},{"$f":"NbCellsCoul($D$21:$I$27,42)*0.25","v":0},{"$f":"NbCellsCoul($D$21:$I$27,48)*0.25","v":0},{"$f":"NbCellsCoul($D$21:$I$27,44)*0.25","v":0},{"$f":"NbCellsCoul($D$21:$I$27,3)*0.25","v":0},{"$f":"+COUNTBLANK(E21:H27)/2","v":2},5,{"$f":"NbCellsCoul($D$21:$I$27,40)*0.25","v":0},{"$f":"SUM($O$21:$O$27)","v":2}]
["S 4",{"$f":"NbCellsCoul($D$29:$I$35,50)*0.25","v":2},{"$f":"NbCellsCoul($D$29:$I$35,42)*0.25","v":0},{"$f":"NbCellsCoul($D$29:$I$35,48)*0.25","v":0},{"$f":"NbCellsCoul($D$29:$I$35,44)*0.25","v":0},{"$f":"NbCellsCoul($D$29:$I$35,3)*0.25","v":0},{"$f":"+COUNTBLANK(E29:H35)/2","v":2},5,{"$f":"NbCellsCoul($D$29:$I$35,40)*0.25","v":0},{"$f":"SUM($O$29:$O$35)","v":2}]
["S 5",{"$f":"NbCellsCoul($D$37:$I$43,50)*0.25","v":2},{"$f":"NbCellsCoul($D$37:$I$43,42)*0.25","v":0},{"$f":"NbCellsCoul($D$37:$I$43,48)*0.25","v":0},{"$f":"NbCellsCoul($D$37:$I$43,44)*0.25","v":0},{"$f":"NbCellsCoul($D$37:$I$43,3)*0.25","v":0},{"$f":"+COUNTBLANK(E37:H43)/2","v":3},4,{"$f":"NbCellsCoul($D$37:$I$43,40)*0.25","v":0},{"$f":"SUM($O$37:$O$43)","v":1}]
["S 6",{"$f":"NbCellsCoul($D$45:$I$51,50)*0.25","v":0},{"$f":"NbCellsCoul($D$45:$I$51,42)*0.25","v":0},{"$f":"NbCellsCoul($D$45:$I$51,48)*0.25","v":0},{"$f":"NbCellsCoul($D$45:$I$51,44)*0.25","v":0},{"$f":"NbCellsCoul($D$45:$I$51,3)*0.25","v":0},{"$f":"+COUNTBLANK(E45:H51)/2","v":7},0,{"$f":"NbCellsCoul($D$45:$I$51,40)*0.25","v":0},{"$f":"SUM($O$45:$O$51)","v":0}]
["Total",{"$f":"SUM(B$72:B$77)","v":6},0,0,0,{"$f":"SUM(F$72:F$77)","v":6},{"$f":"SUM(G$72:G$77)","v":23.5},{"$f":"SUM(H$72:H$77)","v":18.5},{"$f":"SUM(I$72:I$77)","v":1},{"$f":"SUM(J$72:J$77)","v":5}]

{"sheet":"Juin 14","index":8,"n_rows":78,"n_cols":37,"rows_kept":78,"cut":false,"hidden":false,"merged":[[50,1,50,2],[51,1,51,3],[59,0,59,1],[108,5,108,8],[44,1,44,2],[45,1,45,2],[46,1,46,2],[47,1,47,2],[48,1,48,2],[49,1,49,2],[43,1,43,3],[32,1,32,2],[33,1,33,2],[34,1,34,2],[35,1,35,3],[36,1,36,2],[37,1,37,2],[38,1,38,2],[39,1,39,2],[40,1,40,2],[41,1,41,2],[42,1,42,2],[31,1,31,2],[20,1,20,2],[21,1,21,2],[22,1,22,2],[23,1,23,2],[24,1,24,2],[25,1,25,2],[26,1,26,2],[27,1,27,3],[28,1,28,2],[29,1,29,2],[30,1,30,2],[19,1,19,3],[8,1,8,2],[9,1,9,2],[10,1,10,2],[11,1,11,3],[12,1,12,2],[13,1,13,2],[14,1,14,2],[15,1,15,2],[16,1,16,2],[17,1,17,2],[18,1,18,2],[7,1,7,2],[0,3,0,9],[0,18,0,21],[0,30,0,32],[2,1,3,2],[2,3,2,4],[2,5,3,5],[2,6,3,6],[2,7,2,8],[2,9,3,9],[2,10,3,10],[2,11,3,11],[2,12,3,12],[4,1,4,2],[5,1,5,2],[6,1,6,2]]}
[null,null,null,"TEMPS DE TRAVAIL",null,null,null,null,null,null,null,null,null,null,null,null,null,null,"RÉCAPITULATIF",null,null,null,null,null,null,null,null,null,null,null,"IMPÔTS"]
[null,null,null,null,null,{"$f":"Données!G14","v":12},null,null,null,{"$f":"Données!C15","v":2014}]
[null,"Jour",null,"Midi",null,"Cumul Midi","Repas","Soir",null,"Cumul Soir","Repas","Totaux","Total Repas"]
[null,null,null,"Début","Fin",null,null,"Début","Fin",null,null,null,null,null,null,null,null,null,null,null,null,null,null,null,null,null,null,null,null,null,null,{"$f":"VLOOKUP(F2,Données!E15:F26,2)","v":"Décembre"},{"$f":"J2","v":2014}]
[null,{"$f":"Données!I15-WEEKDAY(Données!I15-1)+1","v":"2014-12-01"},null,null,null,{"$f":"$E5-$D5+IF($D5>$E5,1)","v":0},{"$f":"IF($D5<>\"\",IF($D5<Données!$C$2,1,0),0)","v":0},null,null,{"$f":"$I5-$H5+IF($H5>$I5,1)","v":0},{"$f":"IF($H5<>\"\",IF($H5<Données!$C$3,1,0),0)","v":0},{"$f":"$F5+$J5-($G5+$K5)*(\"00:30\")","v":0},{"$f":"$G5+$K5","v":0}]
[null,{"$f":"B5+1","v":"2014-12-02"},null,null,null,{"$f":"$E6-$D6+IF($D6>$E6,1)","v":0},{"$f":"IF($D6<>\"\",IF($D6<Données!$C$2,1,0),0)","v":0},null,null,{"$f":"$I6-$H6+IF($H6>$I6,1)","v":0},{"$f":"IF($H6<>\"\",IF($H6<Données!$C$3,1,0),0)","v":0},{"$f":"$F6+$J6-($G6+$K6)*(\"00:30\")","v":0},{"$f":"$G6+$K6","v":0},{"$f":"$D6-$I5+IF($I5>$D6,1)","v":0},{"$f":"IF($N6=Données!$F$12,0,IF($N6<Données!$F$11,1,0))","v":0},null,null,null,"Soit au total pour le mois de :",null,{"$f":"VLOOKUP(F2,Données!E15:F26,2)","v":"Décembre"},{"$f":"J2","v":2014}]
[null,{"$f":"B6+1","v":"2014-12-03"},null,null,null,0,{"$f":"IF($D7<>\"\",IF($D7<Données!$C$2,1,0),0)","v":0},null,null,0,{"$f":"IF($H7<>\"\",IF($H7<Données!$C$3,1,0),0)","v":0},0,0,{"$f":"$D7-$I6+IF($I6>$D7,1)","v":0},{"$f":"IF($N7=Données!$F$12,0,IF($N7<Données!$F$11,1,0))","v":0}]
[null,"2014-12-04",null,null,null,0,{"$f":"IF($D8<>\"\",IF($D8<Données!$C$2,1,0),0)","v":0},null,null,0,{"$f":"IF($H8<>\"\",IF($H8<Données!$C$3,1,0),0)","v":0},0,0,{"$f":"$D8-$I7+IF($I7>$D8,1)","v":0},{"$f":"IF($N8=Données!$F$12,0,IF($N8<Données!$F$11,1,0))","v":0},null,null,null,null,null,null,null,null,null,null,null,null,null,null,null,"Numéro Fiscal :"]
[null,"2014-12-05",null,null,null,0,{"$f":"IF($D9<>\"\",IF($D9<Données!$C$2,1,0),0)","v":0},null,null,0,{"$f":"IF($H9<>\"\",IF($H9<Données!$C$3,1,0),0)","v":0},0,0,0,{"$f":"IF($N9=Données!$F$12,0,IF($N9<Données!$F$11,1,0))","v":0},null,null,null,"Nombre de jours travaillés :",null,{"$f":"H78","v":22},null,null,null,null,null,null,null,null,null,"MDP:"]
[null,"2014-12-06",null,null,null,0,{"$f":"IF($D10<>\"\",IF($D10<Données!$C$2,1,0),0)","v":0},null,null,0,{"$f":"IF($H10<>\"\",IF($H10<Données!$C$3,1,0),0)","v":0},0,0,{"$f":"$D10-$I9+IF($I9>$D10,1)","v":0},{"$f":"IF($N10=Données!$F$12,0,IF($N10<Données!$F$11,1,0))","v":0},null,null,null,"Nombre de jours repos :",null,{"$f":"B78","v":8}]
[null,"2014-12-07",null,0.48958333333333298,0.66666666666666696,0.17708333333333398,{"$f":"IF($D11<>\"\",IF($D11<Données!$C$2,1,0),0)","v":0},0.77083333333333304,0.98958333333333304,0.21875,0,0.39583333333333398,0,{"$f":"$D11-$I10+IF($I10>$D11,1)","v":0.48958333333333298},{"$f":"IF($N11=Données!$F$12,0,IF($N11<Données!$F$11,1,0))","v":0},null,null,null,"Nombre de jours récup :",null,{"$f":"C$78","v":0},null,null,null,null,null,null,null,null,null,"Adresse domicile:","-"]
[null,"Total Semaine",null,null,{"$f":"WEEKNUM(B5,21)","v":49},{"$f":"SUM($F5:$F11)","v":0.17708333333333398},{"$f":"G5+G6+G7+G8+G9+G10+G11","v":0},null,null,{"$f":"SUM(J5:J11)","v":0.21875},{"$f":"K5+K6+K7+K8+K9+K10+K11","v":0},{"$f":"SUM(L5:L11)","v":0.39583333333333398},{"$f":"SUM(M5:M11)","v":0},null,{"$f":"SUM(O6:O11)","v":0},null,null,null,"Nombre de jfg :",null,{"$f":"D$78","v":0}]
[null,{"$f":"B11+1","v":"2014-12-08"},null,0.48958333333333298,0.625,{"$f":"$E13-$D13+IF($D13>$E13,1)","v":0.13541666666666702},{"$f":"IF($D13<>\"\",IF($D13<Données!$C$2,1,0),0)","v":0},0.78125,0.98958333333333304,{"$f":"$I13-$H13+IF($H13>$I13,1)","v":0.20833333333333304},{"$f":"IF($H13<>\"\",IF($H13<Données!$C$3,1,0),0)","v":0},{"$f":"$F13+$J13-($G13+$K13)*(\"00:30\")","v":0.34375000000000006},{"$f":"$G13+$K13","v":0},{"$f":"$D13-$I11+IF($I11>$D13,1)","v":0.5},{"$f":"IF($N13=Données!$F$12,0,IF($N13<Données!$F$11,1,0))","v":0},null,null,null,"Nombre de jours de vacances :",null,{"$f":"E$78","v":0}]
[null,{"$f":"B13+1","v":"2014-12-09"},null,0.48958333333333298,0.64583333333333304,{"$f":"$E14-$D14+IF($D14>$E14,1)","v":0.15625000000000006},{"$f":"IF($D14<>\"\",IF($D14<Données!$C$2,1,0),0)","v":0},null,null,{"$f":"$I14-$H14+IF($H14>$I14,1)","v":0},{"$f":"IF($H14<>\"\",IF($H14<Données!$C$3,1,0),0)","v":0},{"$f":"$F14+$J14-($G14+$K14)*(\"00:30\")","v":0.15625000000000006},{"$f":"$G14+$K14","v":0},{"$f":"$D14-$I13+IF($I13>$D14,1)","v":0.5},{"$f":"IF($N14=Données!$F$12,0,IF($N14<Données!$F$11,1,0))","v":0},null,null,null,"Nombre de jours de maladie :",null,{"$f":"F$78","v":0}]
[null,{"$f":"B14+1","v":"2014-12-10"},null,null,null,0,{"$f":"IF($D15<>\"\",IF($D15<Données!$C$2,1,0),0)","v":0},null,null,0,{"$f":"IF($H15<>\"\",IF($H15<Données!$C$3,1,0),0)","v":0},0,0,{"$f":"$D15-$I14+IF($I14>$D15,1)","v":0},{"$f":"IF($N15=Données!$F$12,0,IF($N15<Données!$F$11,1,0))","v":0},null,null,null,"Nombre jours fériées travaillés :",null,{"$f":"I78","v":1},null,null,null,null,null,null,null,null,null,"Adresse lieu de travail:","-"]
[null,"2014-12-11",null,null,null,0,{"$f":"IF($D16<>\"\",IF($D16<Données!$C$2,1,0),0)","v":0},0.78125,4.1666666666666664E-2,0.26041666666666663,{"$f":"IF($H16<>\"\",IF($H16<Données!$C$3,1,0),0)","v":0},0.26041666666666663,0,0,{"$f":"IF($N16=Données!$F$12,0,IF($N16<Données!$F$11,1,0))","v":0},null,null,null,"Nombre de fois 11h de batement non respecté :",null,{"$f":"J78","v":4}]
[null,"2014-12-12",null,0.48958333333333298,0.59375,0.10416666666666702,{"$f":"IF($D17<>\"\",IF($D17<Données!$C$2,1,0),0)","v":0},0.78125,0.98958333333333304,0.20833333333333304,{"$f":"IF($H17<>\"\",IF($H17<Données!$C$3,1,0),0)","v":0},0.31250000000000006,0,0.4479166666666663,{"$f":"IF($N17=Données!$F$12,0,IF($N17<Données!$F$11,1,0))","v":1}]
[null,"2014-12-13",null,0.48958333333333298,0.63541666666666696,0.14583333333333398,{"$f":"IF($D18<>\"\",IF($D18<Données!$C$2,1,0),0)","v":0},0.78125,0,0.21875,{"$f":"IF($H18<>\"\",IF($H18<Données!$C$3,1,0),0)","v":0},0.36458333333333398,0,0.5,{"$f":"IF($N18=Données!$F$12,0,IF($N18<Données!$F$11,1,0))","v":0},null,null,null,null,null,null,null,null,null,null,null,null,null,null,null,"Distance ( Source Mappy) :","-","7,4 KM"]
[null,"2014-12-14",null,0.48958333333333298,0.66666666666666696,0.17708333333333398,{"$f":"IF($D19<>\"\",IF($D19<Données!$C$2,1,0),0)","v":0},0.78125,5.2083333333333336E-2,0.27083333333333337,{"$f":"IF($H19<>\"\",IF($H19<Données!$C$3,1,0),0)","v":0},0.44791666666666735,0,0.48958333333333298,{"$f":"IF($N19=Données!$F$12,0,IF($N19<Données!$F$11,1,0))","v":0},null,null,null,null,null,{"$f":"SUM(L12+L20+L28+L36+L44+L52)","v":8.0833333333333393},"Heures effectués"]
[null,"Total Semaine",null,null,{"$f":"WEEKNUM(B13,21)","v":50},{"$f":"SUM($F13:$F19)","v":0.718750000000002},{"$f":"G13+G14+G15+G16+G17+G18+G19","v":0},null,null,{"$f":"SUM(J13:J19)","v":1.1666666666666661},{"$f":"K13+K14+K15+K16+K17+K18+K19","v":0},{"$f":"SUM(L13:L19)","v":1.8854166666666681},{"$f":"SUM(M13:M19)","v":0},null,{"$f":"SUM(O13:O19)","v":1},null,null,null,null,null,{"$f":"IF(U19<N53,\"- \"&TEXT(ABS(N53-U19),\"[hh]:mm\"),U19-N53)","v":1.0416666666666723},"Heures dues/supp",null,null,null,null,null,null,null,null,"Nombre Aller-Retour :","-",{"$f":"COUNT(E5:E11,I5:I11,E13:E19,I13:I19,E21:E27,I21:I27,E29:E35,I29:I35,E37:E43,I37:I43,E45:E51,I45:I51)","v":44}]
[null,{"$f":"B19+1","v":"2014-12-15"},null,0.48958333333333298,0.66666666666666696,{"$f":"$E21-$D21+IF($D21>$E21,1)","v":0.17708333333333398},{"$f":"IF($D21<>\"\",IF($D21<Données!$C$2,1,0),0)","v":0},0.78125,1.0416666666666666E-2,{"$f":"$I21-$H21+IF($H21>$I21,1)","v":0.22916666666666663},{"$f":"IF($H21<>\"\",IF($H21<Données!$C$3,1,0),0)","v":0},{"$f":"$F21+$J21-($G21+$K21)*(\"00:30\")","v":0.40625000000000061},{"$f":"$G21+$K21","v":0},{"$f":"$D21-$I19+IF($I19>$D21,1)","v":0.43749999999999967},{"$f":"IF($N21=Données!$F$12,0,IF($N21<Données!$F$11,1,0))","v":1},null,null,null,null,null,null,null,null,null,null,null,null,null,null,null,"Km Parcourue :","-",{"$f":"SUM(AG20*14.8)","v":651.20000000000005},"Km"]
[null,{"$f":"B21+1","v":"2014-12-16"},null,0.48958333333333298,0.64583333333333304,{"$f":"$E22-$D22+IF($D22>$E22,1)","v":0.15625000000000006},{"$f":"IF($D22<>\"\",IF($D22<Données!$C$2,1,0),0)","v":0},null,null,{"$f":"$I22-$H22+IF($H22>$I22,1)","v":0},{"$f":"IF($H22<>\"\",IF($H22<Données!$C$3,1,0),0)","v":0},{"$f":"$F22+$J22-($G22+$K22)*(\"00:30\")","v":0.15625000000000006},{"$f":"$G22+$K22","v":0},{"$f":"$D22-$I21+IF($I21>$D22,1)","v":0.4791666666666663},{"$f":"IF($N22=Données!$F$12,0,IF($N22<Données!$F$11,1,0))","v":0},null,null,null,null,null,null,null,null,null,null,null,null,null,null,null,"Horodateur Payé :","-",27.4]
[null,{"$f":"B22+1","v":"2014-12-17"},null,null,null,0,{"$f":"IF($D23<>\"\",IF($D23<Données!$C$2,1,0),0)","v":0},null,null,0,{"$f":"IF($H23<>\"\",IF($H23<Données!$C$3,1,0),0)","v":0},0,0,{"$f":"$D23-$I22+IF($I22>$D23,1)","v":0},{"$f":"IF($N23=Données!$F$12,0,IF($N23<Données!$F$11,1,0))","v":0},null,null,null,"Dont :","-",{"$f":"$B$68","v":6.6458333333333339},"Heures à taux normal ( 35h )",null,null,null,null,null,null,null,null,"Achat divers pour le travail :","-"]
[null,"2014-12-18",null,null,null,0,{"$f":"IF($D24<>\"\",IF($D24<Données!$C$2,1,0),0)","v":0},0.78125,0.98958333333333304,0.20833333333333304,{"$f":"IF($H24<>\"\",IF($H24<Données!$C$3,1,0),0)","v":0},0.20833333333333304,0,0,{"$f":"IF($N24=Données!$F$12,0,IF($N24<Données!$F$11,1,0))","v":0},null,null,null,null,"-",{"$f":"$C$68","v":0.66666666666666696},"Heures en HS 10%         ( 35h à 39h )",null,null,null,null,null,null,null,null,null,"-",null,null,null,null,{"$f":"NbCellsCoul($D$5:$I$11,50)*0.25","v":0}]
[null,"2014-12-19",null,0.48958333333333298,0.66666666666666696,0.17708333333333398,{"$f":"IF($D25<>\"\",IF($D25<Données!$C$2,1,0),0)","v":0},0.78125,0.98958333333333304,0.20833333333333304,{"$f":"IF($H25<>\"\",IF($H25<Données!$C$3,1,0),0)","v":0},0.38541666666666702,0,0.5,{"$f":"IF($N25=Données!$F$12,0,IF($N25<Données!$F$11,1,0))","v":0},null,null,null,null,"-",{"$f":"$D$68","v":0.53125000000000011},"Heures en HS 20%         (39h à 43h )",null,null,null,null,null,null,null,null,null,"-"]
[null,"2014-12-20",null,0.48958333333333298,0.67708333333333304,0.18750000000000006,{"$f":"IF($D26<>\"\",IF($D26<Données!$C$2,1,0),0)","v":0},0.78125,0,0.21875,{"$f":"IF($H26<>\"\",IF($H26<Données!$C$3,1,0),0)","v":0},0.40625000000000006,0,0.5,{"$f":"IF($N26=Données!$F$12,0,IF($N26<Données!$F$11,1,0))","v":0},null,null,null,null,"-",{"$f":"$E$68","v":0.23958333333333615},"Heures en HS 40%         ( 43h et plus )",null,null,null,null,null,null,null,null,null,"-"]
[null,"2014-12-21",null,0.48958333333333298,0.66666666666666696,0.17708333333333398,{"$f":"IF($D27<>\"\",IF($D27<Données!$C$2,1,0),0)","v":0},0.78125,0.97916666666666696,0.19791666666666696,{"$f":"IF($H27<>\"\",IF($H27<Données!$C$3,1,0),0)","v":0},0.37500000000000094,0,0.48958333333333298,{"$f":"IF($N27=Données!$F$12,0,IF($N27<Données!$F$11,1,0))","v":0},null,null,null,null,"-",{"$f":"SUM(M12+M20+M28+M36+M44+M52)","v":0},"Nombre de repas",null,null,null,null,null,null,null,null,null,"-"]
[null,"Total Semaine",null,null,{"$f":"WEEKNUM(B21,21)","v":51},{"$f":"SUM($F21:$F27)","v":0.875000000000002},{"$f":"G21+G22+G23+G24+G25+G26+G27","v":0},null,null,{"$f":"SUM(J21:J27)","v":1.0624999999999996},{"$f":"K21+K22+K23+K24+K25+K26+K27","v":0},{"$f":"SUM(L21:L27)","v":1.9375000000000016},{"$f":"SUM(M21:M27)","v":0},null,{"$f":"SUM(O21:O27)","v":1},null,null,null,null,null,null,null,null,null,null,null,null,null,null,null,null,"-"]
[null,{"$f":"B27+1","v":"2014-12-22"},null,0.48958333333333298,0.64583333333333304,{"$f":"$E29-$D29+IF($D29>$E29,1)","v":0.15625000000000006},{"$f":"IF($D29<>\"\",IF($D29<Données!$C$2,1,0),0)","v":0},0.78125,0.97916666666666696,{"$f":"$I29-$H29+IF($H29>$I29,1)","v":0.19791666666666696},{"$f":"IF($H29<>\"\",IF($H29<Données!$C$3,1,0),0)","v":0},{"$f":"$F29+$J29-($G29+$K29)*(\"00:30\")","v":0.35416666666666702},{"$f":"$G29+$K29","v":0},{"$f":"$D29-$I27+IF($I27>$D29,1)","v":0.51041666666666607},{"$f":"IF($N29=Données!$F$12,0,IF($N29<Données!$F$11,1,0))","v":0},null,null,null,"Heure fiche de paie:",null,null,null,null,null,null,null,null,null,null,null,null,"-"]
[null,{"$f":"B29+1","v":"2014-12-23"},null,0.48958333333333298,0.625,{"$f":"$E30-$D30+IF($D30>$E30,1)","v":0.13541666666666702},{"$f":"IF($D30<>\"\",IF($D30<Données!$C$2,1,0),0)","v":0},null,null,{"$f":"$I30-$H30+IF($H30>$I30,1)","v":0},{"$f":"IF($H30<>\"\",IF($H30<Données!$C$3,1,0),0)","v":0},{"$f":"$F30+$J30-($G30+$K30)*(\"00:30\")","v":0.13541666666666702},{"$f":"$G30+$K30","v":0},{"$f":"$D30-$I29+IF($I29>$D30,1)","v":0.51041666666666607},{"$f":"IF($N30=Données!$F$12,0,IF($N30<Données!$F$11,1,0))","v":0},null,null,null,null,null,null,null,null,null,null,null,null,null,null,null,null,"-"]
[null,{"$f":"B30+1","v":"2014-12-24"},null,null,null,0,{"$f":"IF($D31<>\"\",IF($D31<Données!$C$2,1,0),0)","v":0},null,null,0,{"$f":"IF($H31<>\"\",IF($H31<Données!$C$3,1,0),0)","v":0},0,0,{"$f":"$D31-$I30+IF($I30>$D31,1)","v":0},{"$f":"IF($N31=Données!$F$12,0,IF($N31<Données!$F$11,1,0))","v":0},null,null,null,"Dont :","-",6.3194444444444438,"Heures à taux normal",null,null,null,null,null,null,null,null,null,"-"]
[null,"2014-12-25",null,null,null,0,{"$f":"IF($D32<>\"\",IF($D32<Données!$C$2,1,0),0)","v":0},0.78125,0,0.21875,{"$f":"IF($H32<>\"\",IF($H32<Données!$C$3,1,0),0)","v":0},0.21875,0,0,{"$f":"IF($N32=Données!$F$12,0,IF($N32<Données!$F$11,1,0))","v":0},null,null,null,null,"-",0.73125000000000007,"Heures en HS 10%",null,null,null,null,null,null,null,null,null,"-"]
[null,"2014-12-26",null,0.48958333333333298,0.5625,7.2916666666667018E-2,{"$f":"IF($D33<>\"\",IF($D33<Données!$C$2,1,0),0)","v":0},0.78125,4.1666666666666664E-2,0.26041666666666663,{"$f":"IF($H33<>\"\",IF($H33<Données!$C$3,1,0),0)","v":0},0.33333333333333365,0,0.48958333333333298,{"$f":"IF($N33=Données!$F$12,0,IF($N33<Données!$F$11,1,0))","v":0},null,null,null,null,"-",0,"Heures en HS 20%"]
[null,"2014-12-27",null,0.48958333333333298,0.61458333333333304,0.12500000000000006,{"$f":"IF($D34<>\"\",IF($D34<Données!$C$2,1,0),0)","v":0},0.78125,0.94791666666666696,0.16666666666666696,{"$f":"IF($H34<>\"\",IF($H34<Données!$C$3,1,0),0)","v":0},0.29166666666666702,0,0.4479166666666663,{"$f":"IF($N34=Données!$F$12,0,IF($N34<Données!$F$11,1,0))","v":1},null,null,null,null,"-",0,"Heures en HS 40%",null,null,null,null,null,null,null,null,"Total dépenses:","-",{"$f":"SUM(AG22:AG32)","v":27.4}]
[null,"2014-12-28",null,0.5,0.64583333333333304,0.14583333333333304,{"$f":"IF($D35<>\"\",IF($D35<Données!$C$2,1,0),0)","v":0},0.78125,0.97916666666666696,0.19791666666666696,{"$f":"IF($H35<>\"\",IF($H35<Données!$C$3,1,0),0)","v":0},0.34375,0,0.55208333333333304,{"$f":"IF($N35=Données!$F$12,0,IF($N35<Données!$F$11,1,0))","v":0},null,null,null,null,"-",0,"Nombre de repas"]
[null,"Total Semaine",null,null,{"$f":"WEEKNUM(B29,21)","v":52},{"$f":"SUM($F29:$F35)","v":0.63541666666666718},{"$f":"G29+G30+G31+G32+G33+G34+G35","v":0},null,null,{"$f":"SUM(J29:J35)","v":1.0416666666666674},{"$f":"K29+K30+K31+K32+K33+K34+K35","v":0},{"$f":"SUM(L29:L35)","v":1.6770833333333346},{"$f":"SUM(M29:M35)","v":0},null,{"$f":"SUM(O29:O35)","v":1}]
[null,{"$f":"B35+1","v":"2014-12-29"},null,0.48958333333333298,0.67708333333333304,{"$f":"$E37-$D37+IF($D37>$E37,1)","v":0.18750000000000006},{"$f":"IF($D37<>\"\",IF($D37<Données!$C$2,1,0),0)","v":0},0.78125,0.98958333333333304,{"$f":"$I37-$H37+IF($H37>$I37,1)","v":0.20833333333333304},{"$f":"IF($H37<>\"\",IF($H37<Données!$C$3,1,0),0)","v":0},{"$f":"$F37+$J37-($G37+$K37)*(\"00:30\")","v":0.39583333333333309},{"$f":"$G37+$K37","v":0},{"$f":"$D37-$I35+IF($I35>$D37,1)","v":0.51041666666666607},{"$f":"IF($N37=Données!$F$12,0,IF($N37<Données!$F$11,1,0))","v":0},null,null,null,"Différence:"]
[null,{"$f":"B37+1","v":"2014-12-30"},null,0.48958333333333298,0.64583333333333304,{"$f":"$E38-$D38+IF($D38>$E38,1)","v":0.15625000000000006},{"$f":"IF($D38<>\"\",IF($D38<Données!$C$2,1,0),0)","v":0},null,null,{"$f":"$I38-$H38+IF($H38>$I38,1)","v":0},{"$f":"IF($H38<>\"\",IF($H38<Données!$C$3,1,0),0)","v":0},{"$f":"$F38+$J38-($G38+$K38)*(\"00:30\")","v":0.15625000000000006},{"$f":"$G38+$K38","v":0},{"$f":"$D38-$I37+IF($I37>$D38,1)","v":0.5},{"$f":"IF($N38=Données!$F$12,0,IF($N38<Données!$F$11,1,0))","v":0}]
[null,{"$f":"B38+1","v":"2014-12-31"},null,null,null,0,{"$f":"IF($D39<>\"\",IF($D39<Données!$C$2,1,0),0)","v":0},null,null,0,{"$f":"IF($H39<>\"\",IF($H39<Données!$C$3,1,0),0)","v":0},0,0,{"$f":"$D39-$I38+IF($I38>$D39,1)","v":0},{"$f":"IF($N39=Données!$F$12,0,IF($N39<Données!$F$11,1,0))","v":0},null,null,null,"Dont :","-",{"$f":"$U31-$U23+IF($U23>$U31,1)","v":0.67361111111110983},"Heures à taux normal"]
[null,"2015-01-01",null,null,null,0,{"$f":"IF($D40<>\"\",IF($D40<Données!$C$2,1,0),0)","v":0},0.78125,0.95833333333333304,0.17708333333333304,{"$f":"IF($H40<>\"\",IF($H40<Données!$C$3,1,0),0)","v":0},0.17708333333333304,0,0,{"$f":"IF($N40=Données!$F$12,0,IF($N40<Données!$F$11,1,0))","v":0},null,null,null,null,"-",{"$f":"$U32-$U24+IF($U24>$U32,1)","v":6.4583333333333104E-2},"Heures en HS 10%"]
[null,"2015-01-02",null,0.48958333333333298,0.625,0.13541666666666702,{"$f":"IF($D41<>\"\",IF($D41<Données!$C$2,1,0),0)","v":0},0.83333333333333304,0,0.16666666666666696,{"$f":"IF($H41<>\"\",IF($H41<Données!$C$3,1,0),0)","v":0},0.30208333333333398,0,0.53125,{"$f":"IF($N41=Données!$F$12,0,IF($N41<Données!$F$11,1,0))","v":0},null,null,null,null,"-",{"$f":"$U33-$U25+IF($U25>$U33,1)","v":0.46874999999999989},"Heures en HS 20%"]
[null,"2015-01-03",null,0.48958333333333298,0.64583333333333304,0.15625000000000006,{"$f":"IF($D42<>\"\",IF($D42<Données!$C$2,1,0),0)","v":0},0.78125,0.97916666666666696,0.19791666666666696,{"$f":"IF($H42<>\"\",IF($H42<Données!$C$3,1,0),0)","v":0},0.35416666666666702,0,0.48958333333333298,{"$f":"IF($N42=Données!$F$12,0,IF($N42<Données!$F$11,1,0))","v":0},null,null,null,null,"-",{"$f":"$U34-$U26+IF($U26>$U34,1)","v":0.76041666666666385},"Heures en HS 40%"]
[null,"2015-01-04",null,0.48958333333333298,0.66666666666666696,0.17708333333333398,{"$f":"IF($D43<>\"\",IF($D43<Données!$C$2,1,0),0)","v":0},0.78125,0.98958333333333304,0.20833333333333304,{"$f":"IF($H43<>\"\",IF($H43<Données!$C$3,1,0),0)","v":0},0.38541666666666702,0,0.51041666666666607,{"$f":"IF($N43=Données!$F$12,0,IF($N43<Données!$F$11,1,0))","v":0},null,null,null,null,"-",{"$f":"SUM(U35-U27)","v":0},"Nombre de repas"]
[null,"Total Semaine",null,null,{"$f":"WEEKNUM(B37,21)","v":1},{"$f":"SUM($F37:$F43)","v":0.81250000000000111},{"$f":"G37+G38+G39+G40+G41+G42+G43","v":0},null,null,{"$f":"SUM(J37:J43)","v":0.95833333333333304},{"$f":"K37+K38+K39+K40+K41+K42+K43","v":0},{"$f":"SUM(L37:L43)","v":1.7708333333333341},{"$f":"SUM(M37:M43)","v":0},null,{"$f":"SUM(O37:O43)","v":0}]
[null,{"$f":"B43+1","v":"2015-01-05"},null,0.48958333333333298,0.625,{"$f":"$E45-$D45+IF($D45>$E45,1)","v":0.13541666666666702},{"$f":"IF($D45<>\"\",IF($D45<Données!$C$2,1,0),0)","v":0},0.78125,6.25E-2,{"$f":"$I45-$H45+IF($H45>$I45,1)","v":0.28125},{"$f":"IF($H45<>\"\",IF($H45<Données!$C$3,1,0),0)","v":0},{"$f":"$F45+$J45-($G45+$K45)*(\"00:30\")","v":0.41666666666666702},{"$f":"$G45+$K45","v":0},{"$f":"$D45-$I43+IF($I43>$D45,1)","v":0.5},{"$f":"IF($N45=Données!$F$12,0,IF($N45<Données!$F$11,1,0))","v":0}]
[null,{"$f":"B45+1","v":"2015-01-06"},null,null,null,0,{"$f":"IF($D46<>\"\",IF($D46<Données!$C$2,1,0),0)","v":0},null,null,{"$f":"$I46-$H46+IF($H46>$I46,1)","v":0},{"$f":"IF($H46<>\"\",IF($H46<Données!$C$3,1,0),0)","v":0},{"$f":"$F46+$J46-($G46+$K46)*(\"00:30\")","v":0},{"$f":"$G46+$K46","v":0},{"$f":"$D46-$I45+IF($I45>$D46,1)","v":0.9375},{"$f":"IF($N46=Données!$F$12,0,IF($N46<Données!$F$11,1,0))","v":0}]
[null,{"$f":"B46+1","v":"2015-01-07"},null,null,null,0,{"$f":"IF($D47<>\"\",IF($D47<Données!$C$2,1,0),0)","v":0},null,null,0,{"$f":"IF($H47<>\"\",IF($H47<Données!$C$3,1,0),0)","v":0},0,0,{"$f":"$D47-$I46+IF($I46>$D47,1)","v":0},{"$f":"IF($N47=Données!$F$12,0,IF($N47<Données!$F$11,1,0))","v":0}]
[null,"2015-01-08",null,null,null,0,{"$f":"IF($D48<>\"\",IF($D48<Données!$C$2,1,0),0)","v":0},null,null,0,{"$f":"IF($H48<>\"\",IF($H48<Données!$C$3,1,0),0)","v":0},0,0,0,{"$f":"IF($N48=Données!$F$12,0,IF($N48<Données!$F$11,1,0))","v":0}]
[null,"2015-01-09",null,null,null,0,{"$f":"IF($D49<>\"\",IF($D49<Données!$C$2,1,0),0)","v":0},null,null,0,{"$f":"IF($H49<>\"\",IF($H49<Données!$C$3,1,0),0)","v":0},0,0,0,{"$f":"IF($N49=Données!$F$12,0,IF($N49<Données!$F$11,1,0))","v":0}]
[null,"2015-01-10",null,null,null,0,{"$f":"IF($D50<>\"\",IF($D50<Données!$C$2,1,0),0)","v":0},null,null,0,{"$f":"IF($H50<>\"\",IF($H50<Données!$C$3,1,0),0)","v":0},0,0,0,{"$f":"IF($N50=Données!$F$12,0,IF($N50<Données!$F$11,1,0))","v":0}]
[null,"2015-01-11",null,null,null,0,{"$f":"IF($D51<>\"\",IF($D51<Données!$C$2,1,0),0)","v":0},null,null,0,{"$f":"IF($H51<>\"\",IF($H51<Données!$C$3,1,0),0)","v":0},0,0,0,1]
[null,"Total semaine",null,null,{"$f":"WEEKNUM(B45,21)","v":2},{"$f":"SUM($F45:$F51)","v":0.13541666666666702},{"$f":"G45+G46+G47+G48+G49+G50+G51","v":0},null,null,{"$f":"SUM(J45:J51)","v":0.28125},{"$f":"K45+K46+K47+K48+K49+K50+K51","v":0},{"$f":"SUM(L45:L51)","v":0.41666666666666702},{"$f":"SUM(M45:M51)","v":0},null,{"$f":"SUM(O45:O51)","v":1}]
[null,null,null,null,null,null,null,null,null,null,null,null,null,7.041666666666667]
[null,null,null,null,null,null,null,null,null,null,null,{"$f":"CodeCouleur(M54)","v":50},null,"REPOS"]
[null,null,null,null,null,null,null,null,null,null,null,{"$f":"CodeCouleur(M55)","v":42},null,"Récup"]
[null,null,null,null,null,null,null,null,null,null,null,48,null,"JFG"]
[null,null,null,null,null,null,null,null,null,null,null,44,null,"VAC"]
[null,null,null,null,null,null,null,null,null,null,null,3,null,"MAL"]
[null,null,null,null,null,null,null,null,null,null,null,{"$f":"CodeCouleur(M59)","v":40},null,"Jf Taf"]
["Heures",null,1.4583333333333333,1.625,1.7916666666666667,"Total"]
["Taux",1,1.1000000000000001,1.2,1.4]
["S 1",{"$f":"IF($L$12<=$C$60,$L$12,$C$60)","v":0.39583333333333398},{"$f":"IF($L$12<=$C$60,0,IF($L$12<=$D$60,$L$12,$D$60)-$C$60)","v":0},{"$f":"IF($L$12<=$D$60,0,IF($L$12<=$E$60,$L$12,$D$60)-$C$60)","v":0},{"$f":"IF($L$12<=$E$60,0,IF($L$12>$E$60,$L$12,$E$60)-$E$60)","v":0},{"$f":"B62+C62+D62+E62","v":0.39583333333333398}]
["S 2",{"$f":"IF($L$20<=$C$60,$L$20,$C$60)","v":1.4583333333333333},{"$f":"IF($L$20<=$C$60,0,IF($L$20<=$D$60,$L$20,$D$60)-$C$60)","v":0.16666666666666674},{"$f":"IF($L$20<=$D$60,0,IF($L$20<=$E$60,$L$20,$D$60)-$C$60)","v":0.16666666666666674},{"$f":"IF($L$20<=$E$60,0,IF($L$20>$E$60,$L$20,$E$60)-$E$60)","v":9.3750000000001332E-2},1.8854166666666681]
["S 3",{"$f":"IF($L$28<=$C$60,$L$28,$C$60)","v":1.4583333333333333},{"$f":"IF($L$28<=$C$60,0,IF($L$28<=$D$60,$L$28,$D$60)-$C$60)","v":0.16666666666666674},{"$f":"IF($L$28<=$D$60,0,IF($L$28<=$E$60,$L$28,$D$60)-$C$60)","v":0.16666666666666674},{"$f":"IF($L$28<=$E$60,0,IF($L$28>$E$60,$L$28,$E$60)-$E$60)","v":0.14583333333333481},1.9375000000000016]
["S 4",{"$f":"IF($L$36<=$C$60,$L$36,$C$60)","v":1.4583333333333333},{"$f":"IF($L$36<=$C$60,0,IF($L$36<=$D$60,$L$36,$D$60)-$C$60)","v":0.16666666666666674},5.2083333333333336E-2,{"$f":"IF($L$36<=$E$60,0,IF($L$36>$E$60,$L$36,$E$60)-$E$60)","v":0},1.6770833333333333]
["S 5",{"$f":"IF($L$44<=$C$60,$L$44,$C$60)","v":1.4583333333333333},{"$f":"IF($L$44<=$C$60,0,IF($L$44<=$D$60,$L$44,$D$60)-$C$60)","v":0.16666666666666674},0.14583333333333334,{"$f":"IF($L$44<=$E$60,0,IF($L$44>$E$60,$L$44,$E$60)-$E$60)","v":0},1.7708333333333333]
["S 6",{"$f":"IF($L$52<=$C$60,$L$52,$C$60)","v":0.41666666666666702},{"$f":"IF($L$52<=$C$60,0,IF($L$52<=$D$60,$L$52,$D$60)-$C$60)","v":0},{"$f":"IF($L$52<=$D$60,0,IF($L$52<=$E$60,$L$52,$D$60)-$C$60)","v":0},{"$f":"IF($L$52<=$E$60,0,IF($L$52>$E$60,$L$52,$E$60)-$E$60)","v":0},0.41666666666666702]
["Total",{"$f":"SUM(B62:B67)","v":6.6458333333333339},{"$f":"SUM(C62:C67)","v":0.66666666666666696},{"$f":"SUM(D62:D67)","v":0.53125000000000011},{"$f":"SUM(E62:E67)","v":0.23958333333333615},8.0833333333333375]
[]
[]
["Jours","Repos","Récup","Jfg","Vac","Mal","Vides","Taf","Jf Taf","<11h"]
["S 1",{"$f":"NbCellsCoul($D$5:$I$11,50)*0.25","v":0},{"$f":"NbCellsCoul($D$5:$I$11,42)*0.25","v":0},{"$f":"NbCellsCoul($D$5:$I$11,48)*0.25","v":0},{"$f":"NbCellsCoul($D$5:$I$11,44)*0.25","v":0},{"$f":"NbCellsCoul($D$5:$I$11,3)*0.25","v":0},{"$f":"+COUNTBLANK(E5:H11)/2","v":6},{"$f":"7-$G72","v":1},{"$f":"NbCellsCoul($D$5:$I$11,40)*0.25","v":0},{"$f":"SUM($O$6:$O$11)","v":0}]
["S 2",{"$f":"NbCellsCoul($D$13:$I$19,50)*0.25","v":2},{"$f":"NbCellsCoul($D$13:$I$19,42)*0.25","v":0},{"$f":"NbCellsCoul($D$13:$I$19,48)*0.25","v":0},{"$f":"NbCellsCoul($D$13:$I$19,44)*0.25","v":0},{"$f":"NbCellsCoul($D$13:$I$19,3)*0.25","v":0},{"$f":"+COUNTBLANK(E13:H19)/2","v":2},5,{"$f":"NbCellsCoul($D$13:$I$19,40)*0.25","v":0},{"$f":"SUM($O$13:$O$19)","v":1}]
["S 3",{"$f":"NbCellsCoul($D$21:$I$27,50)*0.25","v":2},{"$f":"NbCellsCoul($D$21:$I$27,42)*0.25","v":0},{"$f":"NbCellsCoul($D$21:$I$27,48)*0.25","v":0},{"$f":"NbCellsCoul($D$21:$I$27,44)*0.25","v":0},{"$f":"NbCellsCoul($D$21:$I$27,3)*0.25","v":0},{"$f":"+COUNTBLANK(E21:H27)/2","v":2},5,{"$f":"NbCellsCoul($D$21:$I$27,40)*0.25","v":1},{"$f":"SUM($O$21:$O$27)","v":1}]
["S 4",{"$f":"NbCellsCoul($D$29:$I$35,50)*0.25","v":2},{"$f":"NbCellsCoul($D$29:$I$35,42)*0.25","v":0},{"$f":"NbCellsCoul($D$29:$I$35,48)*0.25","v":0},{"$f":"NbCellsCoul($D$29:$I$35,44)*0.25","v":0},{"$f":"NbCellsCoul($D$29:$I$35,3)*0.25","v":0},{"$f":"+COUNTBLANK(E29:H35)/2","v":2},5,{"$f":"NbCellsCoul($D$29:$I$35,40)*0.25","v":0},{"$f":"SUM($O$29:$O$35)","v":1}]
["S 5",{"$f":"NbCellsCoul($D$37:$I$43,50)*0.25","v":2},{"$f":"NbCellsCoul($D$37:$I$43,42)*0.25","v":0},{"$f":"NbCellsCoul($D$37:$I$43,48)*0.25","v":0},{"$f":"NbCellsCoul($D$37:$I$43,44)*0.25","v":0},{"$f":"NbCellsCoul($D$37:$I$43,3)*0.25","v":0},{"$f":"+COUNTBLANK(E37:H43)/2","v":2},5,{"$f":"NbCellsCoul($D$37:$I$43,40)*0.25","v":0},{"$f":"SUM($O$37:$O$43)","v":0}]
["S 6",{"$f":"NbCellsCoul($D$45:$I$51,50)*0.25","v":0},{"$f":"NbCellsCoul($D$45:$I$51,42)*0.25","v":0},{"$f":"NbCellsCoul($D$45:$I$51,48)*0.25","v":0},{"$f":"NbCellsCoul($D$45:$I$51,44)*0.25","v":0},{"$f":"NbCellsCoul($D$45:$I$51,3)*0.25","v":0},{"$f":"+COUNTBLANK(E45:H51)/2","v":6},1,{"$f":"NbCellsCoul($D$45:$I$51,40)*0.25","v":0},{"$f":"SUM($O$45:$O$51)","v":1}]
["Total",{"$f":"SUM(B$72:B$77)","v":8},0,0,0,{"$f":"SUM(F$72:F$77)","v":0},{"$f":"SUM(G$72:G$77)","v":20},{"$f":"SUM(H$72:H$77)","v":22},{"$f":"SUM(I$72:I$77)","v":1},{"$f":"SUM(J$72:J$77)","v":4}]

{"sheet":"Juill 14","index":9,"n_rows":78,"n_cols":34,"rows_kept":78,"cut":false,"hidden":false,"merged":[[50,1,50,2],[51,1,51,3],[59,0,59,1],[108,5,108,8],[44,1,44,2],[45,1,45,2],[46,1,46,2],[47,1,47,2],[48,1,48,2],[49,1,49,2],[43,1,43,3],[32,1,32,2],[33,1,33,2],[34,1,34,2],[35,1,35,3],[36,1,36,2],[37,1,37,2],[38,1,38,2],[39,1,39,2],[40,1,40,2],[41,1,41,2],[42,1,42,2],[31,1,31,2],[20,1,20,2],[21,1,21,2],[22,1,22,2],[23,1,23,2],[24,1,24,2],[25,1,25,2],[26,1,26,2],[27,1,27,3],[28,1,28,2],[29,1,29,2],[30,1,30,2],[19,1,19,3],[8,1,8,2],[9,1,9,2],[10,1,10,2],[11,1,11,3],[12,1,12,2],[13,1,13,2],[14,1,14,2],[15,1,15,2],[16,1,16,2],[17,1,17,2],[18,1,18,2],[7,1,7,2],[0,3,0,9],[0,18,0,21],[0,30,0,32],[2,1,3,2],[2,3,2,4],[2,5,3,5],[2,6,3,6],[2,7,2,8],[2,9,3,9],[2,10,3,10],[2,11,3,11],[2,12,3,12],[4,1,4,2],[5,1,5,2],[6,1,6,2]]}
[null,null,null,"TEMPS DE TRAVAIL",null,null,null,null,null,null,null,null,null,null,null,null,null,null,"RÉCAPITULATIF",null,null,null,null,null,null,null,null,null,null,null,"IMPÔTS"]
[null,null,null,null,null,{"$f":"Données!G14","v":12},null,null,null,{"$f":"Données!C15","v":2014}]
[null,"Jour",null,"Midi",null,"Cumul Midi","Repas","Soir",null,"Cumul Soir","Repas","Totaux","Total Repas"]
[null,null,null,"Début","Fin",null,null,"Début","Fin",null,null,null,null,null,null,null,null,null,null,null,null,null,null,null,null,null,null,null,null,null,null,{"$f":"VLOOKUP(F2,Données!E15:F26,2)","v":"Décembre"},{"$f":"J2","v":2014}]
[null,{"$f":"Données!I15-WEEKDAY(Données!I15-1)+1","v":"2014-12-01"},null,null,null,{"$f":"$E5-$D5+IF($D5>$E5,1)","v":0},{"$f":"IF($D5<>\"\",IF($D5<Données!$C$2,1,0),0)","v":0},null,null,{"$f":"$I5-$H5+IF($H5>$I5,1)","v":0},{"$f":"IF($H5<>\"\",IF($H5<Données!$C$3,1,0),0)","v":0},{"$f":"$F5+$J5-($G5+$K5)*(\"00:30\")","v":0},{"$f":"$G5+$K5","v":0}]
[null,{"$f":"B5+1","v":"2014-12-02"},null,0.48958333333333298,0.63541666666666696,{"$f":"$E6-$D6+IF($D6>$E6,1)","v":0.14583333333333398},{"$f":"IF($D6<>\"\",IF($D6<Données!$C$2,1,0),0)","v":0},null,null,{"$f":"$I6-$H6+IF($H6>$I6,1)","v":0},{"$f":"IF($H6<>\"\",IF($H6<Données!$C$3,1,0),0)","v":0},{"$f":"$F6+$J6-($G6+$K6)*(\"00:30\")","v":0.14583333333333398},{"$f":"$G6+$K6","v":0},{"$f":"$D6-$I5+IF($I5>$D6,1)","v":0.48958333333333298},{"$f":"IF($N6=Données!$F$12,0,IF($N6<Données!$F$11,1,0))","v":0},null,null,null,"Soit au total pour le mois de :",null,{"$f":"VLOOKUP(F2,Données!E15:F26,2)","v":"Décembre"},{"$f":"J2","v":2014}]
[null,{"$f":"B6+1","v":"2014-12-03"},null,null,null,0,{"$f":"IF($D7<>\"\",IF($D7<Données!$C$2,1,0),0)","v":0},null,null,0,{"$f":"IF($H7<>\"\",IF($H7<Données!$C$3,1,0),0)","v":0},0,0,{"$f":"$D7-$I6+IF($I6>$D7,1)","v":0},{"$f":"IF($N7=Données!$F$12,0,IF($N7<Données!$F$11,1,0))","v":0}]
[null,"2014-12-04",null,null,null,0,{"$f":"IF($D8<>\"\",IF($D8<Données!$C$2,1,0),0)","v":0},0.78125,1.0416666666666666E-2,0.22916666666666663,{"$f":"IF($H8<>\"\",IF($H8<Données!$C$3,1,0),0)","v":0},0.22916666666666663,0,{"$f":"$D8-$I7+IF($I7>$D8,1)","v":0},{"$f":"IF($N8=Données!$F$12,0,IF($N8<Données!$F$11,1,0))","v":0},null,null,null,null,null,null,null,null,null,null,null,null,null,null,null,"Numéro Fiscal :"]
[null,"2014-12-05",null,0.48958333333333298,0.65625,0.16666666666666702,{"$f":"IF($D9<>\"\",IF($D9<Données!$C$2,1,0),0)","v":0},0.78125,0.98958333333333304,0.20833333333333304,{"$f":"IF($H9<>\"\",IF($H9<Données!$C$3,1,0),0)","v":0},0.37500000000000006,0,0.4791666666666663,{"$f":"IF($N9=Données!$F$12,0,IF($N9<Données!$F$11,1,0))","v":0},null,null,null,"Nombre de jours travaillés :",null,{"$f":"H78","v":21},null,null,null,null,null,null,null,null,null,"MDP:"]
[null,"2014-12-06",null,0.48958333333333298,0.63541666666666696,0.14583333333333398,{"$f":"IF($D10<>\"\",IF($D10<Données!$C$2,1,0),0)","v":0},0.83333333333333304,0.94791666666666696,0.11458333333333393,{"$f":"IF($H10<>\"\",IF($H10<Données!$C$3,1,0),0)","v":0},0.26041666666666791,0,{"$f":"$D10-$I9+IF($I9>$D10,1)","v":0.5},{"$f":"IF($N10=Données!$F$12,0,IF($N10<Données!$F$11,1,0))","v":0},null,null,null,"Nombre de jours repos :",null,{"$f":"B78","v":10}]
[null,"2014-12-07",null,0.48958333333333298,0.64583333333333304,0.15625000000000006,{"$f":"IF($D11<>\"\",IF($D11<Données!$C$2,1,0),0)","v":0},0.78125,1.0416666666666666E-2,0.22916666666666663,{"$f":"IF($H11<>\"\",IF($H11<Données!$C$3,1,0),0)","v":0},0.38541666666666669,0,{"$f":"$D11-$I10+IF($I10>$D11,1)","v":0.54166666666666607},{"$f":"IF($N11=Données!$F$12,0,IF($N11<Données!$F$11,1,0))","v":0},null,null,null,"Nombre de jours récup :",null,{"$f":"C$78","v":0},null,null,null,null,null,null,null,null,null,"Adresse domicile:","-"]
[null,"Total Semaine",null,null,{"$f":"WEEKNUM(B5,21)","v":49},{"$f":"SUM($F5:$F11)","v":0.61458333333333504},{"$f":"G5+G6+G7+G8+G9+G10+G11","v":0},null,null,{"$f":"SUM(J5:J11)","v":0.78125000000000022},{"$f":"K5+K6+K7+K8+K9+K10+K11","v":0},{"$f":"SUM(L5:L11)","v":1.3958333333333353},{"$f":"SUM(M5:M11)","v":0},null,{"$f":"SUM(O6:O11)","v":0},null,null,null,"Nombre de jfg :",null,{"$f":"D$78","v":0}]
[null,{"$f":"B11+1","v":"2014-12-08"},null,0.48958333333333298,0.66666666666666696,{"$f":"$E13-$D13+IF($D13>$E13,1)","v":0.17708333333333398},{"$f":"IF($D13<>\"\",IF($D13<Données!$C$2,1,0),0)","v":0},0.78125,4.1666666666666664E-2,{"$f":"$I13-$H13+IF($H13>$I13,1)","v":0.26041666666666663},{"$f":"IF($H13<>\"\",IF($H13<Données!$C$3,1,0),0)","v":0},{"$f":"$F13+$J13-($G13+$K13)*(\"00:30\")","v":0.43750000000000061},{"$f":"$G13+$K13","v":0},{"$f":"$D13-$I11+IF($I11>$D13,1)","v":0.4791666666666663},{"$f":"IF($N13=Données!$F$12,0,IF($N13<Données!$F$11,1,0))","v":0},null,null,null,"Nombre de jours de vacances :",null,{"$f":"E$78","v":0}]
[null,{"$f":"B13+1","v":"2014-12-09"},null,0.48958333333333298,0.61458333333333304,{"$f":"$E14-$D14+IF($D14>$E14,1)","v":0.12500000000000006},{"$f":"IF($D14<>\"\",IF($D14<Données!$C$2,1,0),0)","v":0},null,null,{"$f":"$I14-$H14+IF($H14>$I14,1)","v":0},{"$f":"IF($H14<>\"\",IF($H14<Données!$C$3,1,0),0)","v":0},{"$f":"$F14+$J14-($G14+$K14)*(\"00:30\")","v":0.12500000000000006},{"$f":"$G14+$K14","v":0},{"$f":"$D14-$I13+IF($I13>$D14,1)","v":0.4479166666666663},{"$f":"IF($N14=Données!$F$12,0,IF($N14<Données!$F$11,1,0))","v":1},null,null,null,"Nombre de jours de maladie :",null,{"$f":"F$78","v":0}]
[null,{"$f":"B14+1","v":"2014-12-10"},null,null,null,0,{"$f":"IF($D15<>\"\",IF($D15<Données!$C$2,1,0),0)","v":0},null,null,0,{"$f":"IF($H15<>\"\",IF($H15<Données!$C$3,1,0),0)","v":0},0,0,{"$f":"$D15-$I14+IF($I14>$D15,1)","v":0},{"$f":"IF($N15=Données!$F$12,0,IF($N15<Données!$F$11,1,0))","v":0},null,null,null,"Nombre jours fériées travaillés :",null,{"$f":"I78","v":1},null,null,null,null,null,null,null,null,null,"Adresse lieu de travail:","-"]
[null,"2014-12-11",null,null,null,0,{"$f":"IF($D16<>\"\",IF($D16<Données!$C$2,1,0),0)","v":0},0.78125,0.91666666666666696,0.13541666666666696,{"$f":"IF($H16<>\"\",IF($H16<Données!$C$3,1,0),0)","v":0},0.13541666666666696,0,0,{"$f":"IF($N16=Données!$F$12,0,IF($N16<Données!$F$11,1,0))","v":0},null,null,null,"Nombre de fois 11h de batement non respecté :",null,{"$f":"J78","v":4}]
[null,"2014-12-12",null,0.48958333333333298,0.60416666666666696,0.11458333333333398,{"$f":"IF($D17<>\"\",IF($D17<Données!$C$2,1,0),0)","v":0},0.78125,0.95833333333333304,0.17708333333333304,{"$f":"IF($H17<>\"\",IF($H17<Données!$C$3,1,0),0)","v":0},0.29166666666666702,0,0.57291666666666607,{"$f":"IF($N17=Données!$F$12,0,IF($N17<Données!$F$11,1,0))","v":0}]
[null,"2014-12-13",null,0.48958333333333298,0.625,0.13541666666666702,{"$f":"IF($D18<>\"\",IF($D18<Données!$C$2,1,0),0)","v":0},0.78125,2.0833333333333332E-2,0.23958333333333337,{"$f":"IF($H18<>\"\",IF($H18<Données!$C$3,1,0),0)","v":0},0.37500000000000039,0,0.53125,{"$f":"IF($N18=Données!$F$12,0,IF($N18<Données!$F$11,1,0))","v":0},null,null,null,null,null,null,null,null,null,null,null,null,null,null,null,"Distance ( Source Mappy) :","-","7,4 KM"]
[null,"2014-12-14",null,0.48958333333333298,0.61458333333333304,0.12500000000000006,{"$f":"IF($D19<>\"\",IF($D19<Données!$C$2,1,0),0)","v":0},0.78125,0.97916666666666696,0.19791666666666696,{"$f":"IF($H19<>\"\",IF($H19<Données!$C$3,1,0),0)","v":0},0.32291666666666702,0,0.46874999999999967,{"$f":"IF($N19=Données!$F$12,0,IF($N19<Données!$F$11,1,0))","v":0},null,null,null,null,null,{"$f":"SUM(L12+L20+L28+L36+L44+L52)","v":7.7916666666666767},"Heures effectués"]
[null,"Total Semaine",null,null,{"$f":"WEEKNUM(B13,21)","v":50},{"$f":"SUM($F13:$F19)","v":0.67708333333333504},{"$f":"G13+G14+G15+G16+G17+G18+G19","v":0},null,null,{"$f":"SUM(J13:J19)","v":1.010416666666667},{"$f":"K13+K14+K15+K16+K17+K18+K19","v":0},{"$f":"SUM(L13:L19)","v":1.687500000000002},{"$f":"SUM(M13:M19)","v":0},null,{"$f":"SUM(O13:O19)","v":1},null,null,null,null,null,{"$f":"IF(U19<N53,\"- \"&TEXT(ABS(N53-U19),\"[hh]:mm\"),U19-N53)","v":0.75000000000000977},"Heures dues/supp",null,null,null,null,null,null,null,null,"Nombre Aller-Retour :","-",{"$f":"COUNT(E5:E11,I5:I11,E13:E19,I13:I19,E21:E27,I21:I27,E29:E35,I29:I35,E37:E43,I37:I43,E45:E51,I45:I51)","v":42}]
[null,{"$f":"B19+1","v":"2014-12-15"},null,0.48958333333333298,0.64583333333333304,{"$f":"$E21-$D21+IF($D21>$E21,1)","v":0.15625000000000006},{"$f":"IF($D21<>\"\",IF($D21<Données!$C$2,1,0),0)","v":0},0.78125,2.0833333333333332E-2,{"$f":"$I21-$H21+IF($H21>$I21,1)","v":0.23958333333333337},{"$f":"IF($H21<>\"\",IF($H21<Données!$C$3,1,0),0)","v":0},{"$f":"$F21+$J21-($G21+$K21)*(\"00:30\")","v":0.39583333333333343},{"$f":"$G21+$K21","v":0},{"$f":"$D21-$I19+IF($I19>$D21,1)","v":0.51041666666666607},{"$f":"IF($N21=Données!$F$12,0,IF($N21<Données!$F$11,1,0))","v":0},null,null,null,null,null,null,null,null,null,null,null,null,null,null,null,"Km Parcourue :","-",{"$f":"SUM(AG20*14.8)","v":621.6},"Km"]
[null,{"$f":"B21+1","v":"2014-12-16"},null,0.48958333333333298,0.61458333333333304,{"$f":"$E22-$D22+IF($D22>$E22,1)","v":0.12500000000000006},{"$f":"IF($D22<>\"\",IF($D22<Données!$C$2,1,0),0)","v":0},0.78125,3.125E-2,{"$f":"$I22-$H22+IF($H22>$I22,1)","v":0.25},{"$f":"IF($H22<>\"\",IF($H22<Données!$C$3,1,0),0)","v":0},{"$f":"$F22+$J22-($G22+$K22)*(\"00:30\")","v":0.37500000000000006},{"$f":"$G22+$K22","v":0},{"$f":"$D22-$I21+IF($I21>$D22,1)","v":0.46874999999999967},{"$f":"IF($N22=Données!$F$12,0,IF($N22<Données!$F$11,1,0))","v":0},null,null,null,null,null,null,null,null,null,null,null,null,null,null,null,"Horodateur Payé :","-",32.9]
[null,{"$f":"B22+1","v":"2014-12-17"},null,null,null,0,{"$f":"IF($D23<>\"\",IF($D23<Données!$C$2,1,0),0)","v":0},null,null,0,{"$f":"IF($H23<>\"\",IF($H23<Données!$C$3,1,0),0)","v":0},0,0,{"$f":"$D23-$I22+IF($I22>$D23,1)","v":0.96875},{"$f":"IF($N23=Données!$F$12,0,IF($N23<Données!$F$11,1,0))","v":0},null,null,null,"Dont :","-",{"$f":"$B$68","v":6.5416666666666696},"Heures à taux normal ( 35h )",null,null,null,null,null,null,null,null,"Achat divers pour le travail :","-"]
[null,"2014-12-18",null,null,null,0,{"$f":"IF($D24<>\"\",IF($D24<Données!$C$2,1,0),0)","v":0},null,null,0,{"$f":"IF($H24<>\"\",IF($H24<Données!$C$3,1,0),0)","v":0},0,0,0,{"$f":"IF($N24=Données!$F$12,0,IF($N24<Données!$F$11,1,0))","v":0},null,null,null,null,"-",{"$f":"$C$68","v":0.50000000000000022},"Heures en HS 10%         ( 35h à 39h )",null,null,null,null,null,null,null,null,null,"-"]
[null,"2014-12-19",null,0.48958333333333298,0.63541666666666696,0.14583333333333398,{"$f":"IF($D25<>\"\",IF($D25<Données!$C$2,1,0),0)","v":0},0.78125,2.0833333333333332E-2,0.23958333333333337,{"$f":"IF($H25<>\"\",IF($H25<Données!$C$3,1,0),0)","v":0},0.38541666666666735,0,0.48958333333333298,{"$f":"IF($N25=Données!$F$12,0,IF($N25<Données!$F$11,1,0))","v":0},null,null,null,null,"-",{"$f":"$D$68","v":0.39583333333333348},"Heures en HS 20%         (39h à 43h )",null,null,null,null,null,null,null,null,null,"-"]
[null,"2014-12-20",null,0.48958333333333298,0.64583333333333304,0.15625000000000006,{"$f":"IF($D26<>\"\",IF($D26<Données!$C$2,1,0),0)","v":0},0.78125,4.1666666666666664E-2,0.26041666666666663,{"$f":"IF($H26<>\"\",IF($H26<Données!$C$3,1,0),0)","v":0},0.41666666666666669,0,0.46874999999999967,{"$f":"IF($N26=Données!$F$12,0,IF($N26<Données!$F$11,1,0))","v":0},null,null,null,null,"-",{"$f":"$E$68","v":0.35416666666667074},"Heures en HS 40%         ( 43h et plus )",null,null,null,null,null,null,null,null,null,"-"]
[null,"2014-12-21",null,0.48958333333333298,0.625,0.13541666666666702,{"$f":"IF($D27<>\"\",IF($D27<Données!$C$2,1,0),0)","v":0},0.78125,0,0.21875,{"$f":"IF($H27<>\"\",IF($H27<Données!$C$3,1,0),0)","v":0},0.35416666666666702,0,0.4479166666666663,{"$f":"IF($N27=Données!$F$12,0,IF($N27<Données!$F$11,1,0))","v":1},null,null,null,null,"-",{"$f":"SUM(M12+M20+M28+M36+M44+M52)","v":0},"Nombre de repas",null,null,null,null,null,null,null,null,null,"-"]
[null,"Total Semaine",null,null,{"$f":"WEEKNUM(B21,21)","v":51},{"$f":"SUM($F21:$F27)","v":0.71875000000000111},{"$f":"G21+G22+G23+G24+G25+G26+G27","v":0},null,null,{"$f":"SUM(J21:J27)","v":1.2083333333333335},{"$f":"K21+K22+K23+K24+K25+K26+K27","v":0},{"$f":"SUM(L21:L27)","v":1.9270833333333346},{"$f":"SUM(M21:M27)","v":0},null,{"$f":"SUM(O21:O27)","v":1},null,null,null,null,null,null,null,null,null,null,null,null,null,null,null,null,"-"]
[null,{"$f":"B27+1","v":"2014-12-22"},null,0.48958333333333298,0.63541666666666696,{"$f":"$E29-$D29+IF($D29>$E29,1)","v":0.14583333333333398},{"$f":"IF($D29<>\"\",IF($D29<Données!$C$2,1,0),0)","v":0},0.78125,0,{"$f":"$I29-$H29+IF($H29>$I29,1)","v":0.21875},{"$f":"IF($H29<>\"\",IF($H29<Données!$C$3,1,0),0)","v":0},{"$f":"$F29+$J29-($G29+$K29)*(\"00:30\")","v":0.36458333333333398},{"$f":"$G29+$K29","v":0},{"$f":"$D29-$I27+IF($I27>$D29,1)","v":0.48958333333333298},{"$f":"IF($N29=Données!$F$12,0,IF($N29<Données!$F$11,1,0))","v":0},null,null,null,"Heure fiche de paie:",null,null,null,null,null,null,null,null,null,null,null,null,"-"]
[null,{"$f":"B29+1","v":"2014-12-23"},null,0.48958333333333298,0.625,{"$f":"$E30-$D30+IF($D30>$E30,1)","v":0.13541666666666702},{"$f":"IF($D30<>\"\",IF($D30<Données!$C$2,1,0),0)","v":0},0.78125,0,{"$f":"$I30-$H30+IF($H30>$I30,1)","v":0.21875},{"$f":"IF($H30<>\"\",IF($H30<Données!$C$3,1,0),0)","v":0},{"$f":"$F30+$J30-($G30+$K30)*(\"00:30\")","v":0.35416666666666702},{"$f":"$G30+$K30","v":0},{"$f":"$D30-$I29+IF($I29>$D30,1)","v":0.48958333333333298},{"$f":"IF($N30=Données!$F$12,0,IF($N30<Données!$F$11,1,0))","v":0},null,null,null,null,null,null,null,null,null,null,null,null,null,null,null,null,"-"]
[null,{"$f":"B30+1","v":"2014-12-24"},null,null,null,0,{"$f":"IF($D31<>\"\",IF($D31<Données!$C$2,1,0),0)","v":0},null,null,0,{"$f":"IF($H31<>\"\",IF($H31<Données!$C$3,1,0),0)","v":0},0,0,{"$f":"$D31-$I30+IF($I30>$D31,1)","v":0},{"$f":"IF($N31=Données!$F$12,0,IF($N31<Données!$F$11,1,0))","v":0},null,null,null,"Dont :","-",6.3194444444444438,"Heures à taux normal",null,null,null,null,null,null,null,null,null,"-"]
[null,"2014-12-25",null,null,null,0,{"$f":"IF($D32<>\"\",IF($D32<Données!$C$2,1,0),0)","v":0},null,null,0,{"$f":"IF($H32<>\"\",IF($H32<Données!$C$3,1,0),0)","v":0},0,0,0,{"$f":"IF($N32=Données!$F$12,0,IF($N32<Données!$F$11,1,0))","v":0},null,null,null,null,"-",0.73125000000000007,"Heures en HS 10%",null,null,null,null,null,null,null,null,null,"-"]
[null,"2014-12-26",null,0.48958333333333298,0.63541666666666696,0.14583333333333398,{"$f":"IF($D33<>\"\",IF($D33<Données!$C$2,1,0),0)","v":0},0.78125,5.2083333333333336E-2,0.27083333333333337,{"$f":"IF($H33<>\"\",IF($H33<Données!$C$3,1,0),0)","v":0},0.41666666666666735,0,0.48958333333333298,{"$f":"IF($N33=Données!$F$12,0,IF($N33<Données!$F$11,1,0))","v":0},null,null,null,null,"-",0,"Heures en HS 20%"]
[null,"2014-12-27",null,0.48958333333333298,0.66666666666666696,0.17708333333333398,{"$f":"IF($D34<>\"\",IF($D34<Données!$C$2,1,0),0)","v":0},0.78125,2.0833333333333332E-2,0.23958333333333337,{"$f":"IF($H34<>\"\",IF($H34<Données!$C$3,1,0),0)","v":0},0.41666666666666735,0,0.43749999999999967,{"$f":"IF($N34=Données!$F$12,0,IF($N34<Données!$F$11,1,0))","v":1},null,null,null,null,"-",0,"Heures en HS 40%",null,null,null,null,null,null,null,null,"Total dépenses:","-",{"$f":"SUM(AG22:AG32)","v":32.9}]
[null,"2014-12-28",null,0.48958333333333298,0.66666666666666696,0.17708333333333398,{"$f":"IF($D35<>\"\",IF($D35<Données!$C$2,1,0),0)","v":0},0.78125,6.25E-2,0.28125,{"$f":"IF($H35<>\"\",IF($H35<Données!$C$3,1,0),0)","v":0},0.45833333333333398,0,0.46874999999999967,{"$f":"IF($N35=Données!$F$12,0,IF($N35<Données!$F$11,1,0))","v":0},null,null,null,null,"-",0,"Nombre de repas"]
[null,"Total Semaine",null,null,{"$f":"WEEKNUM(B29,21)","v":52},{"$f":"SUM($F29:$F35)","v":0.78125000000000289},{"$f":"G29+G30+G31+G32+G33+G34+G35","v":0},null,null,{"$f":"SUM(J29:J35)","v":1.2291666666666667},{"$f":"K29+K30+K31+K32+K33+K34+K35","v":0},{"$f":"SUM(L29:L35)","v":2.0104166666666696},{"$f":"SUM(M29:M35)","v":0},null,{"$f":"SUM(O29:O35)","v":1}]
[null,{"$f":"B35+1","v":"2014-12-29"},null,0.48958333333333298,0.63541666666666696,{"$f":"$E37-$D37+IF($D37>$E37,1)","v":0.14583333333333398},{"$f":"IF($D37<>\"\",IF($D37<Données!$C$2,1,0),0)","v":0},0.78125,0.97916666666666696,{"$f":"$I37-$H37+IF($H37>$I37,1)","v":0.19791666666666696},{"$f":"IF($H37<>\"\",IF($H37<Données!$C$3,1,0),0)","v":0},{"$f":"$F37+$J37-($G37+$K37)*(\"00:30\")","v":0.34375000000000094},{"$f":"$G37+$K37","v":0},{"$f":"$D37-$I35+IF($I35>$D37,1)","v":0.42708333333333298},{"$f":"IF($N37=Données!$F$12,0,IF($N37<Données!$F$11,1,0))","v":1},null,null,null,"Différence:"]
[null,{"$f":"B37+1","v":"2014-12-30"},null,0.48958333333333298,0.66666666666666696,{"$f":"$E38-$D38+IF($D38>$E38,1)","v":0.17708333333333398},{"$f":"IF($D38<>\"\",IF($D38<Données!$C$2,1,0),0)","v":0},0.78125,3.125E-2,{"$f":"$I38-$H38+IF($H38>$I38,1)","v":0.25},{"$f":"IF($H38<>\"\",IF($H38<Données!$C$3,1,0),0)","v":0},{"$f":"$F38+$J38-($G38+$K38)*(\"00:30\")","v":0.42708333333333398},{"$f":"$G38+$K38","v":0},{"$f":"$D38-$I37+IF($I37>$D38,1)","v":0.51041666666666607},{"$f":"IF($N38=Données!$F$12,0,IF($N38<Données!$F$11,1,0))","v":0}]
[null,{"$f":"B38+1","v":"2014-12-31"},null,null,null,0,{"$f":"IF($D39<>\"\",IF($D39<Données!$C$2,1,0),0)","v":0},null,null,0,{"$f":"IF($H39<>\"\",IF($H39<Données!$C$3,1,0),0)","v":0},0,0,{"$f":"$D39-$I38+IF($I38>$D39,1)","v":0.96875},{"$f":"IF($N39=Données!$F$12,0,IF($N39<Données!$F$11,1,0))","v":0},null,null,null,"Dont :","-",{"$f":"$U31-$U23+IF($U23>$U31,1)","v":0.77777777777777413},"Heures à taux normal"]
[null,"2015-01-01",null,null,null,0,{"$f":"IF($D40<>\"\",IF($D40<Données!$C$2,1,0),0)","v":0},null,null,0,{"$f":"IF($H40<>\"\",IF($H40<Données!$C$3,1,0),0)","v":0},0,0,0,{"$f":"IF($N40=Données!$F$12,0,IF($N40<Données!$F$11,1,0))","v":0},null,null,null,null,"-",{"$f":"$U32-$U24+IF($U24>$U32,1)","v":0.23124999999999984},"Heures en HS 10%"]
[null,"2015-01-02",null,null,null,0,{"$f":"IF($D41<>\"\",IF($D41<Données!$C$2,1,0),0)","v":0},null,null,0,{"$f":"IF($H41<>\"\",IF($H41<Données!$C$3,1,0),0)","v":0},0,0,0,{"$f":"IF($N41=Données!$F$12,0,IF($N41<Données!$F$11,1,0))","v":0},null,null,null,null,"-",{"$f":"$U33-$U25+IF($U25>$U33,1)","v":0.60416666666666652},"Heures en HS 20%"]
[null,"2015-01-03",null,null,null,0,{"$f":"IF($D42<>\"\",IF($D42<Données!$C$2,1,0),0)","v":0},null,null,0,{"$f":"IF($H42<>\"\",IF($H42<Données!$C$3,1,0),0)","v":0},0,0,0,{"$f":"IF($N42=Données!$F$12,0,IF($N42<Données!$F$11,1,0))","v":0},null,null,null,null,"-",{"$f":"$U34-$U26+IF($U26>$U34,1)","v":0.64583333333332926},"Heures en HS 40%"]
[null,"2015-01-04",null,null,null,0,{"$f":"IF($D43<>\"\",IF($D43<Données!$C$2,1,0),0)","v":0},null,null,0,{"$f":"IF($H43<>\"\",IF($H43<Données!$C$3,1,0),0)","v":0},0,0,0,{"$f":"IF($N43=Données!$F$12,0,IF($N43<Données!$F$11,1,0))","v":0},null,null,null,null,"-",{"$f":"SUM(U35-U27)","v":0},"Nombre de repas"]
[null,"Total Semaine",null,null,{"$f":"WEEKNUM(B37,21)","v":1},{"$f":"SUM($F37:$F43)","v":0.32291666666666796},{"$f":"G37+G38+G39+G40+G41+G42+G43","v":0},null,null,{"$f":"SUM(J37:J43)","v":0.44791666666666696},{"$f":"K37+K38+K39+K40+K41+K42+K43","v":0},{"$f":"SUM(L37:L43)","v":0.77083333333333492},{"$f":"SUM(M37:M43)","v":0},null,{"$f":"SUM(O37:O43)","v":1},{"$f":"NbCellsCoul($D$5:$I$11,50)*0.25","v":2}]
[null,{"$f":"B43+1","v":"2015-01-05"},null,null,null,{"$f":"$E45-$D45+IF($D45>$E45,1)","v":0},{"$f":"IF($D45<>\"\",IF($D45<Données!$C$2,1,0),0)","v":0},null,null,{"$f":"$I45-$H45+IF($H45>$I45,1)","v":0},{"$f":"IF($H45<>\"\",IF($H45<Données!$C$3,1,0),0)","v":0},{"$f":"$F45+$J45-($G45+$K45)*(\"00:30\")","v":0},{"$f":"$G45+$K45","v":0},{"$f":"$D45-$I43+IF($I43>$D45,1)","v":0},{"$f":"IF($N45=Données!$F$12,0,IF($N45<Données!$F$11,1,0))","v":0}]
[null,{"$f":"B45+1","v":"2015-01-06"},null,null,null,0,{"$f":"IF($D46<>\"\",IF($D46<Données!$C$2,1,0),0)","v":0},null,null,{"$f":"$I46-$H46+IF($H46>$I46,1)","v":0},{"$f":"IF($H46<>\"\",IF($H46<Données!$C$3,1,0),0)","v":0},{"$f":"$F46+$J46-($G46+$K46)*(\"00:30\")","v":0},{"$f":"$G46+$K46","v":0},{"$f":"$D46-$I45+IF($I45>$D46,1)","v":0},{"$f":"IF($N46=Données!$F$12,0,IF($N46<Données!$F$11,1,0))","v":0}]
[null,{"$f":"B46+1","v":"2015-01-07"},null,null,null,0,{"$f":"IF($D47<>\"\",IF($D47<Données!$C$2,1,0),0)","v":0},null,null,0,{"$f":"IF($H47<>\"\",IF($H47<Données!$C$3,1,0),0)","v":0},0,0,{"$f":"$D47-$I46+IF($I46>$D47,1)","v":0},{"$f":"IF($N47=Données!$F$12,0,IF($N47<Données!$F$11,1,0))","v":0}]
[null,"2015-01-08",null,null,null,0,{"$f":"IF($D48<>\"\",IF($D48<Données!$C$2,1,0),0)","v":0},null,null,0,{"$f":"IF($H48<>\"\",IF($H48<Données!$C$3,1,0),0)","v":0},0,0,0,{"$f":"IF($N48=Données!$F$12,0,IF($N48<Données!$F$11,1,0))","v":0}]
[null,"2015-01-09",null,null,null,0,{"$f":"IF($D49<>\"\",IF($D49<Données!$C$2,1,0),0)","v":0},null,null,0,{"$f":"IF($H49<>\"\",IF($H49<Données!$C$3,1,0),0)","v":0},0,0,0,{"$f":"IF($N49=Données!$F$12,0,IF($N49<Données!$F$11,1,0))","v":0}]
[null,"2015-01-10",null,null,null,0,{"$f":"IF($D50<>\"\",IF($D50<Données!$C$2,1,0),0)","v":0},null,null,0,{"$f":"IF($H50<>\"\",IF($H50<Données!$C$3,1,0),0)","v":0},0,0,0,{"$f":"IF($N50=Données!$F$12,0,IF($N50<Données!$F$11,1,0))","v":0}]
[null,"2015-01-11",null,null,null,0,{"$f":"IF($D51<>\"\",IF($D51<Données!$C$2,1,0),0)","v":0},null,null,0,{"$f":"IF($H51<>\"\",IF($H51<Données!$C$3,1,0),0)","v":0},0,0,0,{"$f":"IF($N51=Données!$F$12,0,IF($N51<Données!$F$11,1,0))","v":0}]
[null,"Total semaine",null,null,{"$f":"WEEKNUM(B45,21)","v":2},{"$f":"SUM($F45:$F51)","v":0},{"$f":"G45+G46+G47+G48+G49+G50+G51","v":0},null,null,{"$f":"SUM(J45:J51)","v":0},{"$f":"K45+K46+K47+K48+K49+K50+K51","v":0},{"$f":"SUM(L45:L51)","v":0},{"$f":"SUM(M45:M51)","v":0},null,{"$f":"SUM(O45:O51)","v":0}]
[null,null,null,null,null,null,null,null,null,null,null,null,null,7.041666666666667]
[null,null,null,null,null,null,null,null,null,null,null,{"$f":"CodeCouleur(M54)","v":50},null,"REPOS"]
[null,null,null,null,null,null,null,null,null,null,null,{"$f":"CodeCouleur(M55)","v":42},null,"Récup"]
[null,null,null,null,null,null,null,null,null,null,null,48,null,"JFG"]
[null,null,null,null,null,null,null,null,null,null,null,44,null,"VAC"]
[null,null,null,null,null,null,null,null,null,null,null,3,null,"MAL"]
[null,null,null,null,null,null,null,null,null,null,null,{"$f":"CodeCouleur(M59)","v":40},null,"Jf Taf"]
["Heures",null,1.4583333333333333,1.625,1.7916666666666667,"Total"]
["Taux",1,1.1000000000000001,1.2,1.4]
["S 1",{"$f":"IF($L$12<=$C$60,$L$12,$C$60)","v":1.3958333333333353},{"$f":"IF($L$12<=$C$60,0,IF($L$12<=$D$60,$L$12,$D$60)-$C$60)","v":0},{"$f":"IF($L$12<=$D$60,0,IF($L$12<=$E$60,$L$12,$D$60)-$C$60)","v":0},{"$f":"IF($L$12<=$E$60,0,IF($L$12>$E$60,$L$12,$E$60)-$E$60)","v":0},{"$f":"B62+C62+D62+E62","v":1.3958333333333353}]
["S 2",{"$f":"IF($L$20<=$C$60,$L$20,$C$60)","v":1.4583333333333333},{"$f":"IF($L$20<=$C$60,0,IF($L$20<=$D$60,$L$20,$D$60)-$C$60)","v":0.16666666666666674},6.25E-2,{"$f":"IF($L$20<=$E$60,0,IF($L$20>$E$60,$L$20,$E$60)-$E$60)","v":0},1.6875]
["S 3",{"$f":"IF($L$28<=$C$60,$L$28,$C$60)","v":1.4583333333333333},{"$f":"IF($L$28<=$C$60,0,IF($L$28<=$D$60,$L$28,$D$60)-$C$60)","v":0.16666666666666674},{"$f":"IF($L$28<=$D$60,0,IF($L$28<=$E$60,$L$28,$D$60)-$C$60)","v":0.16666666666666674},{"$f":"IF($L$28<=$E$60,0,IF($L$28>$E$60,$L$28,$E$60)-$E$60)","v":0.13541666666666785},1.9270833333333346]
["S 4",{"$f":"IF($L$36<=$C$60,$L$36,$C$60)","v":1.4583333333333333},{"$f":"IF($L$36<=$C$60,0,IF($L$36<=$D$60,$L$36,$D$60)-$C$60)","v":0.16666666666666674},{"$f":"IF($L$36<=$D$60,0,IF($L$36<=$E$60,$L$36,$D$60)-$C$60)","v":0.16666666666666674},{"$f":"IF($L$36<=$E$60,0,IF($L$36>$E$60,$L$36,$E$60)-$E$60)","v":0.21875000000000289},2.0104166666666696]
["S 5",{"$f":"IF($L$44<=$C$60,$L$44,$C$60)","v":0.77083333333333492},{"$f":"IF($L$44<=$C$60,0,IF($L$44<=$D$60,$L$44,$D$60)-$C$60)","v":0},{"$f":"IF($L$44<=$D$60,0,IF($L$44<=$E$60,$L$44,$D$60)-$C$60)","v":0},{"$f":"IF($L$44<=$E$60,0,IF($L$44>$E$60,$L$44,$E$60)-$E$60)","v":0},0.77083333333333492]
["S 6",{"$f":"IF($L$52<=$C$60,$L$52,$C$60)","v":0},{"$f":"IF($L$52<=$C$60,0,IF($L$52<=$D$60,$L$52,$D$60)-$C$60)","v":0},{"$f":"IF($L$52<=$D$60,0,IF($L$52<=$E$60,$L$52,$D$60)-$C$60)","v":0},{"$f":"IF($L$52<=$E$60,0,IF($L$52>$E$60,$L$52,$E$60)-$E$60)","v":0},0]
["Total",{"$f":"SUM(B62:B67)","v":6.5416666666666696},{"$f":"SUM(C62:C67)","v":0.50000000000000022},{"$f":"SUM(D62:D67)","v":0.39583333333333348},{"$f":"SUM(E62:E67)","v":0.35416666666667074},7.7916666666666741]
[]
[]
["Jours","Repos","Récup","Jfg","Vac","Mal","Vides","Taf","Jf Taf","<11h"]
["S 1",{"$f":"NbCellsCoul($D$5:$I$11,50)*0.25","v":2},{"$f":"NbCellsCoul($D$5:$I$11,42)*0.25","v":0},{"$f":"NbCellsCoul($D$5:$I$11,48)*0.25","v":0},{"$f":"NbCellsCoul($D$5:$I$11,44)*0.25","v":0},{"$f":"NbCellsCoul($D$5:$I$11,3)*0.25","v":0},{"$f":"+COUNTBLANK(E5:H11)/2","v":3},{"$f":"7-$G72","v":4},{"$f":"NbCellsCoul($D$5:$I$11,40)*0.25","v":0},{"$f":"SUM($O$6:$O$11)","v":0}]
["S 2",{"$f":"NbCellsCoul($D$13:$I$19,50)*0.25","v":2},{"$f":"NbCellsCoul($D$13:$I$19,42)*0.25","v":0},{"$f":"NbCellsCoul($D$13:$I$19,48)*0.25","v":0},{"$f":"NbCellsCoul($D$13:$I$19,44)*0.25","v":0},{"$f":"NbCellsCoul($D$13:$I$19,3)*0.25","v":0},{"$f":"+COUNTBLANK(E13:H19)/2","v":2},5,{"$f":"NbCellsCoul($D$13:$I$19,40)*0.25","v":0},{"$f":"SUM($O$13:$O$19)","v":1}]
["S 3",{"$f":"NbCellsCoul($D$21:$I$27,50)*0.25","v":2},{"$f":"NbCellsCoul($D$21:$I$27,42)*0.25","v":0},{"$f":"NbCellsCoul($D$21:$I$27,48)*0.25","v":0},{"$f":"NbCellsCoul($D$21:$I$27,44)*0.25","v":0},{"$f":"NbCellsCoul($D$21:$I$27,3)*0.25","v":0},{"$f":"+COUNTBLANK(E21:H27)/2","v":2},5,{"$f":"NbCellsCoul($D$21:$I$27,40)*0.25","v":1},{"$f":"SUM($O$21:$O$27)","v":1}]
["S 4",{"$f":"NbCellsCoul($D$29:$I$35,50)*0.25","v":2},{"$f":"NbCellsCoul($D$29:$I$35,42)*0.25","v":0},{"$f":"NbCellsCoul($D$29:$I$35,48)*0.25","v":0},{"$f":"NbCellsCoul($D$29:$I$35,44)*0.25","v":0},{"$f":"NbCellsCoul($D$29:$I$35,3)*0.25","v":0},{"$f":"+COUNTBLANK(E29:H35)/2","v":2},5,{"$f":"NbCellsCoul($D$29:$I$35,40)*0.25","v":0},{"$f":"SUM($O$29:$O$35)","v":1}]
["S 5",{"$f":"NbCellsCoul($D$37:$I$43,50)*0.25","v":2},{"$f":"NbCellsCoul($D$37:$I$43,42)*0.25","v":0},{"$f":"NbCellsCoul($D$37:$I$43,48)*0.25","v":0},{"$f":"NbCellsCoul($D$37:$I$43,44)*0.25","v":0},{"$f":"NbCellsCoul($D$37:$I$43,3)*0.25","v":0},{"$f":"+COUNTBLANK(E37:H43)/2","v":5},2,{"$f":"NbCellsCoul($D$37:$I$43,40)*0.25","v":0},{"$f":"SUM($O$37:$O$43)","v":1}]
["S 6",{"$f":"NbCellsCoul($D$45:$I$51,50)*0.25","v":0},{"$f":"NbCellsCoul($D$45:$I$51,42)*0.25","v":0},{"$f":"NbCellsCoul($D$45:$I$51,48)*0.25","v":0},{"$f":"NbCellsCoul($D$45:$I$51,44)*0.25","v":0},{"$f":"NbCellsCoul($D$45:$I$51,3)*0.25","v":0},{"$f":"+COUNTBLANK(E45:H51)/2","v":7},0,{"$f":"NbCellsCoul($D$45:$I$51,40)*0.25","v":0},{"$f":"SUM($O$45:$O$51)","v":0}]
["Total",{"$f":"SUM(B$72:B$77)","v":10},0,0,0,{"$f":"SUM(F$72:F$77)","v":0},{"$f":"SUM(G$72:G$77)","v":21},{"$f":"SUM(H$72:H$77)","v":21},{"$f":"SUM(I$72:I$77)","v":1},{"$f":"SUM(J$72:J$77)","v":4}]

{"sheet":"Août 14","index":10,"n_rows":78,"n_cols":34,"rows_kept":78,"cut":false,"hidden":false,"merged":[[50,1,50,2],[51,1,51,3],[59,0,59,1],[108,5,108,8],[44,1,44,2],[45,1,45,2],[46,1,46,2],[47,1,47,2],[48,1,48,2],[49,1,49,2],[43,1,43,3],[32,1,32,2],[33,1,33,2],[34,1,34,2],[35,1,35,3],[36,1,36,2],[37,1,37,2],[38,1,38,2],[39,1,39,2],[40,1,40,2],[41,1,41,2],[42,1,42,2],[31,1,31,2],[20,1,20,2],[21,1,21,2],[22,1,22,2],[23,1,23,2],[24,1,24,2],[25,1,25,2],[26,1,26,2],[27,1,27,3],[28,1,28,2],[29,1,29,2],[30,1,30,2],[19,1,19,3],[8,1,8,2],[9,1,9,2],[10,1,10,2],[11,1,11,3],[12,1,12,2],[13,1,13,2],[14,1,14,2],[15,1,15,2],[16,1,16,2],[17,1,17,2],[18,1,18,2],[7,1,7,2],[0,3,0,9],[0,18,0,21],[0,30,0,32],[2,1,3,2],[2,3,2,4],[2,5,3,5],[2,6,3,6],[2,7,2,8],[2,9,3,9],[2,10,3,10],[2,11,3,11],[2,12,3,12],[4,1,4,2],[5,1,5,2],[6,1,6,2]]}
[null,null,null,"TEMPS DE TRAVAIL",null,null,null,null,null,null,null,null,null,null,null,null,null,null,"RÉCAPITULATIF",null,null,null,null,null,null,null,null,null,null,null,"IMPÔTS"]
[null,null,null,null,null,{"$f":"Données!G14","v":12},null,null,null,{"$f":"Données!C15","v":2014}]
[null,"Jour",null,"Midi",null,"Cumul Midi","Repas","Soir",null,"Cumul Soir","Repas","Totaux","Total Repas"]
[null,null,null,"Début","Fin",null,null,"Début","Fin",null,null,null,null,null,null,null,null,null,null,null,null,null,null,null,null,null,null,null,null,null,null,{"$f":"VLOOKUP(F2,Données!E15:F26,2)","v":"Décembre"},{"$f":"J2","v":2014}]
[null,{"$f":"Données!I15-WEEKDAY(Données!I15-1)+1","v":"2014-12-01"},null,null,null,{"$f":"$E5-$D5+IF($D5>$E5,1)","v":0},{"$f":"IF($D5<>\"\",IF($D5<Données!$C$2,1,0),0)","v":0},null,null,{"$f":"$I5-$H5+IF($H5>$I5,1)","v":0},{"$f":"IF($H5<>\"\",IF($H5<Données!$C$3,1,0),0)","v":0},{"$f":"$F5+$J5-($G5+$K5)*(\"00:30\")","v":0},{"$f":"$G5+$K5","v":0}]
[null,{"$f":"B5+1","v":"2014-12-02"},null,null,null,{"$f":"$E6-$D6+IF($D6>$E6,1)","v":0},{"$f":"IF($D6<>\"\",IF($D6<Données!$C$2,1,0),0)","v":0},null,null,{"$f":"$I6-$H6+IF($H6>$I6,1)","v":0},{"$f":"IF($H6<>\"\",IF($H6<Données!$C$3,1,0),0)","v":0},{"$f":"$F6+$J6-($G6+$K6)*(\"00:30\")","v":0},{"$f":"$G6+$K6","v":0},{"$f":"$D6-$I5+IF($I5>$D6,1)","v":0},{"$f":"IF($N6=Données!$F$12,0,IF($N6<Données!$F$11,1,0))","v":0},null,null,null,"Soit au total pour le mois de :",null,{"$f":"VLOOKUP(F2,Données!E15:F26,2)","v":"Décembre"},{"$f":"J2","v":2014}]
[null,{"$f":"B6+1","v":"2014-12-03"},null,null,null,0,{"$f":"IF($D7<>\"\",IF($D7<Données!$C$2,1,0),0)","v":0},null,null,0,{"$f":"IF($H7<>\"\",IF($H7<Données!$C$3,1,0),0)","v":0},0,0,{"$f":"$D7-$I6+IF($I6>$D7,1)","v":0},{"$f":"IF($N7=Données!$F$12,0,IF($N7<Données!$F$11,1,0))","v":0}]
[null,"2014-12-04",null,null,null,0,{"$f":"IF($D8<>\"\",IF($D8<Données!$C$2,1,0),0)","v":0},null,null,0,{"$f":"IF($H8<>\"\",IF($H8<Données!$C$3,1,0),0)","v":0},0,0,{"$f":"$D8-$I7+IF($I7>$D8,1)","v":0},{"$f":"IF($N8=Données!$F$12,0,IF($N8<Données!$F$11,1,0))","v":0},null,null,null,null,null,null,null,null,null,null,null,null,null,null,null,"Numéro Fiscal :"]
[null,"2014-12-05",null,0.48958333333333298,0.58333333333333304,9.3750000000000056E-2,{"$f":"IF($D9<>\"\",IF($D9<Données!$C$2,1,0),0)","v":0},0.78125,5.2083333333333336E-2,0.27083333333333337,{"$f":"IF($H9<>\"\",IF($H9<Données!$C$3,1,0),0)","v":0},0.36458333333333343,0,0.48958333333333298,{"$f":"IF($N9=Données!$F$12,0,IF($N9<Données!$F$11,1,0))","v":0},null,null,null,"Nombre de jours travaillés :",null,{"$f":"H78","v":22.5},null,null,null,null,null,null,null,null,null,"MDP:"]
[null,"2014-12-06",null,0.48958333333333298,0.625,0.13541666666666702,{"$f":"IF($D10<>\"\",IF($D10<Données!$C$2,1,0),0)","v":0},0.78125,2.0833333333333332E-2,0.23958333333333337,{"$f":"IF($H10<>\"\",IF($H10<Données!$C$3,1,0),0)","v":0},0.37500000000000039,0,{"$f":"$D10-$I9+IF($I9>$D10,1)","v":0.43749999999999967},{"$f":"IF($N10=Données!$F$12,0,IF($N10<Données!$F$11,1,0))","v":1},null,null,null,"Nombre de jours repos :",null,{"$f":"B78","v":8}]
[null,"2014-12-07",null,0.48958333333333298,0.6875,0.19791666666666702,{"$f":"IF($D11<>\"\",IF($D11<Données!$C$2,1,0),0)","v":0},0.78125,2.0833333333333332E-2,0.23958333333333337,{"$f":"IF($H11<>\"\",IF($H11<Données!$C$3,1,0),0)","v":0},0.43750000000000039,0,{"$f":"$D11-$I10+IF($I10>$D11,1)","v":0.46874999999999967},{"$f":"IF($N11=Données!$F$12,0,IF($N11<Données!$F$11,1,0))","v":0},null,null,null,"Nombre de jours récup :",null,{"$f":"C$78","v":0.5},null,null,null,null,null,null,null,null,null,"Adresse domicile:","-"]
[null,"Total Semaine",null,null,{"$f":"WEEKNUM(B5,21)","v":49},{"$f":"SUM($F5:$F11)","v":0.42708333333333409},{"$f":"G5+G6+G7+G8+G9+G10+G11","v":0},null,null,{"$f":"SUM(J5:J11)","v":0.75000000000000011},{"$f":"K5+K6+K7+K8+K9+K10+K11","v":0},{"$f":"SUM(L5:L11)","v":1.1770833333333341},{"$f":"SUM(M5:M11)","v":0},null,{"$f":"SUM(O6:O11)","v":1},null,null,null,"Nombre de jfg :",null,{"$f":"D$78","v":0}]
[null,{"$f":"B11+1","v":"2014-12-08"},null,0.48958333333333298,0.63541666666666696,{"$f":"$E13-$D13+IF($D13>$E13,1)","v":0.14583333333333398},{"$f":"IF($D13<>\"\",IF($D13<Données!$C$2,1,0),0)","v":0},0.78125,1.0416666666666666E-2,{"$f":"$I13-$H13+IF($H13>$I13,1)","v":0.22916666666666663},{"$f":"IF($H13<>\"\",IF($H13<Données!$C$3,1,0),0)","v":0},{"$f":"$F13+$J13-($G13+$K13)*(\"00:30\")","v":0.37500000000000061},{"$f":"$G13+$K13","v":0},{"$f":"$D13-$I11+IF($I11>$D13,1)","v":0.46874999999999967},{"$f":"IF($N13=Données!$F$12,0,IF($N13<Données!$F$11,1,0))","v":0},null,null,null,"Nombre de jours de vacances :",null,{"$f":"E$78","v":0}]
[null,{"$f":"B13+1","v":"2014-12-09"},null,0.48958333333333298,0.58333333333333304,{"$f":"$E14-$D14+IF($D14>$E14,1)","v":9.3750000000000056E-2},{"$f":"IF($D14<>\"\",IF($D14<Données!$C$2,1,0),0)","v":0},0.78125,0.98958333333333304,{"$f":"$I14-$H14+IF($H14>$I14,1)","v":0.20833333333333304},{"$f":"IF($H14<>\"\",IF($H14<Données!$C$3,1,0),0)","v":0},{"$f":"$F14+$J14-($G14+$K14)*(\"00:30\")","v":0.30208333333333309},{"$f":"$G14+$K14","v":0},{"$f":"$D14-$I13+IF($I13>$D14,1)","v":0.4791666666666663},{"$f":"IF($N14=Données!$F$12,0,IF($N14<Données!$F$11,1,0))","v":0},null,null,null,"Nombre de jours de maladie :",null,{"$f":"F$78","v":0}]
[null,{"$f":"B14+1","v":"2014-12-10"},null,null,null,0,{"$f":"IF($D15<>\"\",IF($D15<Données!$C$2,1,0),0)","v":0},null,null,0,{"$f":"IF($H15<>\"\",IF($H15<Données!$C$3,1,0),0)","v":0},0,0,0,{"$f":"IF($N15=Données!$F$12,0,IF($N15<Données!$F$11,1,0))","v":0},null,null,null,"Nombre jours fériées travaillés :",null,{"$f":"I78","v":1},null,null,null,null,null,null,null,null,null,"Adresse lieu de travail:","-"]
[null,"2014-12-11",null,null,null,0,{"$f":"IF($D16<>\"\",IF($D16<Données!$C$2,1,0),0)","v":0},null,null,0,{"$f":"IF($H16<>\"\",IF($H16<Données!$C$3,1,0),0)","v":0},0,0,{"$f":"$D16-$I15+IF($I15>$D16,1)","v":0},{"$f":"IF($N16=Données!$F$12,0,IF($N16<Données!$F$11,1,0))","v":0},null,null,null,"Nombre de fois 11h de batement non respecté :",null,{"$f":"J78","v":6}]
[null,"2014-12-12",null,null,null,0,{"$f":"IF($D17<>\"\",IF($D17<Données!$C$2,1,0),0)","v":0},0.78125,4.1666666666666664E-2,0.26041666666666663,{"$f":"IF($H17<>\"\",IF($H17<Données!$C$3,1,0),0)","v":0},0.26041666666666663,0,0,{"$f":"IF($N17=Données!$F$12,0,IF($N17<Données!$F$11,1,0))","v":0}]
[null,"2014-12-13",null,0.48958333333333298,0.60416666666666696,0.11458333333333398,{"$f":"IF($D18<>\"\",IF($D18<Données!$C$2,1,0),0)","v":0},0.78125,0.98958333333333304,0.20833333333333304,{"$f":"IF($H18<>\"\",IF($H18<Données!$C$3,1,0),0)","v":0},0.32291666666666702,0,0.4479166666666663,{"$f":"IF($N18=Données!$F$12,0,IF($N18<Données!$F$11,1,0))","v":1},null,null,null,null,null,null,null,null,null,null,null,null,null,null,null,"Distance ( Source Mappy) :","-","7,4 KM"]
[null,"2014-12-14",null,0.48958333333333298,0.6875,0.19791666666666702,{"$f":"IF($D19<>\"\",IF($D19<Données!$C$2,1,0),0)","v":0},0.78125,0.97916666666666696,0.19791666666666696,{"$f":"IF($H19<>\"\",IF($H19<Données!$C$3,1,0),0)","v":0},0.39583333333333398,0,0.5,{"$f":"IF($N19=Données!$F$12,0,IF($N19<Données!$F$11,1,0))","v":0},null,null,null,null,null,{"$f":"SUM(L12+L20+L28+L36+L44+L52)","v":8.072916666666675},"Heures effectués"]
[null,"Total Semaine",null,null,{"$f":"WEEKNUM(B13,21)","v":50},{"$f":"SUM($F13:$F19)","v":0.55208333333333504},{"$f":"G13+G14+G15+G16+G17+G18+G19","v":0},null,null,{"$f":"SUM(J13:J19)","v":1.1041666666666663},{"$f":"K13+K14+K15+K16+K17+K18+K19","v":0},{"$f":"SUM(L13:L19)","v":1.6562500000000013},{"$f":"SUM(M13:M19)","v":0},null,{"$f":"SUM(O13:O19)","v":1},null,null,null,null,null,{"$f":"IF(U19<N53,\"- \"&TEXT(ABS(N53-U19),\"[hh]:mm\"),U19-N53)","v":1.031250000000008},"Heures dues/supp",null,null,null,null,null,null,null,null,"Nombre Aller-Retour :","-",{"$f":"COUNT(E5:E11,I5:I11,E13:E19,I13:I19,E21:E27,I21:I27,E29:E35,I29:I35,E37:E43,I37:I43,E45:E51,I45:I51)","v":45}]
[null,{"$f":"B19+1","v":"2014-12-15"},null,0.48958333333333298,0.63541666666666696,{"$f":"$E21-$D21+IF($D21>$E21,1)","v":0.14583333333333398},{"$f":"IF($D21<>\"\",IF($D21<Données!$C$2,1,0),0)","v":0},0.78125,2.0833333333333332E-2,{"$f":"$I21-$H21+IF($H21>$I21,1)","v":0.23958333333333337},{"$f":"IF($H21<>\"\",IF($H21<Données!$C$3,1,0),0)","v":0},{"$f":"$F21+$J21-($G21+$K21)*(\"00:30\")","v":0.38541666666666735},{"$f":"$G21+$K21","v":0},{"$f":"$D21-$I19+IF($I19>$D21,1)","v":0.51041666666666607},{"$f":"IF($N21=Données!$F$12,0,IF($N21<Données!$F$11,1,0))","v":0},null,null,null,null,null,null,null,null,null,null,null,null,null,null,null,"Km Parcourue :","-",{"$f":"SUM(AG20*14.8)","v":666},"Km"]
[null,{"$f":"B21+1","v":"2014-12-16"},null,0.48958333333333298,0.63541666666666696,{"$f":"$E22-$D22+IF($D22>$E22,1)","v":0.14583333333333398},{"$f":"IF($D22<>\"\",IF($D22<Données!$C$2,1,0),0)","v":0},null,null,{"$f":"$I22-$H22+IF($H22>$I22,1)","v":0},{"$f":"IF($H22<>\"\",IF($H22<Données!$C$3,1,0),0)","v":0},{"$f":"$F22+$J22-($G22+$K22)*(\"00:30\")","v":0.14583333333333398},{"$f":"$G22+$K22","v":0},{"$f":"$D22-$I21+IF($I21>$D22,1)","v":0.46874999999999967},{"$f":"IF($N22=Données!$F$12,0,IF($N22<Données!$F$11,1,0))","v":0},null,null,null,null,null,null,null,null,null,null,null,null,null,null,null,"Horodateur Payé :","-",26.2]
[null,{"$f":"B22+1","v":"2014-12-17"},null,null,null,0,{"$f":"IF($D23<>\"\",IF($D23<Données!$C$2,1,0),0)","v":0},null,null,0,{"$f":"IF($H23<>\"\",IF($H23<Données!$C$3,1,0),0)","v":0},0,0,{"$f":"$D23-$I22+IF($I22>$D23,1)","v":0},{"$f":"IF($N23=Données!$F$12,0,IF($N23<Données!$F$11,1,0))","v":0},null,null,null,"Dont :","-",{"$f":"$B$68","v":7.010416666666667},"Heures à taux normal ( 35h )",null,null,null,null,null,null,null,null,"Achat divers pour le travail :","-"]
[null,"2014-12-18",null,null,null,0,{"$f":"IF($D24<>\"\",IF($D24<Données!$C$2,1,0),0)","v":0},0.78125,3.125E-2,0.25,{"$f":"IF($H24<>\"\",IF($H24<Données!$C$3,1,0),0)","v":0},0.25,0,0,{"$f":"IF($N24=Données!$F$12,0,IF($N24<Données!$F$11,1,0))","v":0},null,null,null,null,"-",{"$f":"$C$68","v":0.66666666666666852},"Heures en HS 10%         ( 35h à 39h )",null,null,null,null,null,null,null,null,null,"-"]
[null,"2014-12-19",null,0.48958333333333298,0.66666666666666696,0.17708333333333398,{"$f":"IF($D25<>\"\",IF($D25<Données!$C$2,1,0),0)","v":0},0.78125,0.9375,0.15625,{"$f":"IF($H25<>\"\",IF($H25<Données!$C$3,1,0),0)","v":0},0.33333333333333398,0,0.45833333333333298,{"$f":"IF($N25=Données!$F$12,0,IF($N25<Données!$F$11,1,0))","v":0},null,null,null,null,"-",{"$f":"$D$68","v":0.35416666666666674},"Heures en HS 20%         (39h à 43h )",null,null,null,null,null,null,null,null,null,"-"]
[null,"2014-12-20",null,0.48958333333333298,0.625,0.13541666666666702,{"$f":"IF($D26<>\"\",IF($D26<Données!$C$2,1,0),0)","v":0},0.78125,8.3333333333333329E-2,0.30208333333333337,{"$f":"IF($H26<>\"\",IF($H26<Données!$C$3,1,0),0)","v":0},0.43750000000000039,0,0.55208333333333304,{"$f":"IF($N26=Données!$F$12,0,IF($N26<Données!$F$11,1,0))","v":0},null,{"$f":"NbCellsCoul($D$5:$I$11,50)*0.25","v":0},null,null,"-",{"$f":"$E$68","v":4.1666666666669849E-2},"Heures en HS 40%         ( 43h et plus )",null,null,null,null,null,null,null,null,null,"-"]
[null,"2014-12-21",null,0.48958333333333298,0.625,0.13541666666666702,{"$f":"IF($D27<>\"\",IF($D27<Données!$C$2,1,0),0)","v":0},0.83333333333333304,0.97916666666666696,0.14583333333333393,{"$f":"IF($H27<>\"\",IF($H27<Données!$C$3,1,0),0)","v":0},0.28125000000000094,0,0.40624999999999967,{"$f":"IF($N27=Données!$F$12,0,IF($N27<Données!$F$11,1,0))","v":1},null,null,null,null,"-",{"$f":"SUM(M12+M20+M28+M36+M44+M52)","v":0},"Nombre de repas",null,null,null,null,null,null,null,null,null,"-"]
[null,"Total Semaine",null,null,{"$f":"WEEKNUM(B21,21)","v":51},{"$f":"SUM($F21:$F27)","v":0.73958333333333592},{"$f":"G21+G22+G23+G24+G25+G26+G27","v":0},null,null,{"$f":"SUM(J21:J27)","v":1.0937500000000007},{"$f":"K21+K22+K23+K24+K25+K26+K27","v":0},{"$f":"SUM(L21:L27)","v":1.8333333333333366},{"$f":"SUM(M21:M27)","v":0},null,{"$f":"SUM(O21:O27)","v":1},null,null,null,null,null,null,null,null,null,null,null,null,null,null,null,null,"-"]
[null,{"$f":"B27+1","v":"2014-12-22"},null,0.48958333333333298,0.61458333333333304,{"$f":"$E29-$D29+IF($D29>$E29,1)","v":0.12500000000000006},{"$f":"IF($D29<>\"\",IF($D29<Données!$C$2,1,0),0)","v":0},0.78125,0.95833333333333304,{"$f":"$I29-$H29+IF($H29>$I29,1)","v":0.17708333333333304},{"$f":"IF($H29<>\"\",IF($H29<Données!$C$3,1,0),0)","v":0},{"$f":"$F29+$J29-($G29+$K29)*(\"00:30\")","v":0.30208333333333309},{"$f":"$G29+$K29","v":0},{"$f":"$D29-$I27+IF($I27>$D29,1)","v":0.51041666666666607},{"$f":"IF($N29=Données!$F$12,0,IF($N29<Données!$F$11,1,0))","v":0},null,null,null,"Heure fiche de paie:",null,null,null,null,null,null,null,null,null,null,null,null,"-"]
[null,{"$f":"B29+1","v":"2014-12-23"},null,0.48958333333333298,0.58333333333333304,{"$f":"$E30-$D30+IF($D30>$E30,1)","v":9.3750000000000056E-2},{"$f":"IF($D30<>\"\",IF($D30<Données!$C$2,1,0),0)","v":0},null,null,{"$f":"$I30-$H30+IF($H30>$I30,1)","v":0},{"$f":"IF($H30<>\"\",IF($H30<Données!$C$3,1,0),0)","v":0},{"$f":"$F30+$J30-($G30+$K30)*(\"00:30\")","v":9.3750000000000056E-2},{"$f":"$G30+$K30","v":0},{"$f":"$D30-$I29+IF($I29>$D30,1)","v":0.53125},{"$f":"IF($N30=Données!$F$12,0,IF($N30<Données!$F$11,1,0))","v":0},null,null,null,null,null,null,null,null,null,null,null,null,null,null,null,null,"-"]
[null,{"$f":"B30+1","v":"2014-12-24"},null,null,null,0,{"$f":"IF($D31<>\"\",IF($D31<Données!$C$2,1,0),0)","v":0},null,null,0,{"$f":"IF($H31<>\"\",IF($H31<Données!$C$3,1,0),0)","v":0},0,0,{"$f":"$D31-$I30+IF($I30>$D31,1)","v":0},{"$f":"IF($N31=Données!$F$12,0,IF($N31<Données!$F$11,1,0))","v":0},null,null,null,"Dont :","-",6.3194444444444438,"Heures à taux normal",null,null,null,null,null,null,null,null,null,"-"]
[null,"2014-12-25",null,null,null,0,{"$f":"IF($D32<>\"\",IF($D32<Données!$C$2,1,0),0)","v":0},0.83333333333333304,0.98958333333333304,0.15625,{"$f":"IF($H32<>\"\",IF($H32<Données!$C$3,1,0),0)","v":0},0.15625,0,0,{"$f":"IF($N32=Données!$F$12,0,IF($N32<Données!$F$11,1,0))","v":0},null,null,null,null,"-",0.73125000000000007,"Heures en HS 10%",null,null,null,null,null,null,null,null,null,"-"]
[null,"2014-12-26",null,0.48958333333333298,0.61458333333333304,0.12500000000000006,{"$f":"IF($D33<>\"\",IF($D33<Données!$C$2,1,0),0)","v":0},0.78125,0.94791666666666696,0.16666666666666696,{"$f":"IF($H33<>\"\",IF($H33<Données!$C$3,1,0),0)","v":0},0.29166666666666702,0,0.5,{"$f":"IF($N33=Données!$F$12,0,IF($N33<Données!$F$11,1,0))","v":0},null,null,null,null,"-",0,"Heures en HS 20%"]
[null,"2014-12-27",null,0.48958333333333298,0.625,0.13541666666666702,{"$f":"IF($D34<>\"\",IF($D34<Données!$C$2,1,0),0)","v":0},0.78125,4.1666666666666664E-2,0.26041666666666663,{"$f":"IF($H34<>\"\",IF($H34<Données!$C$3,1,0),0)","v":0},0.39583333333333365,0,0.54166666666666607,{"$f":"IF($N34=Données!$F$12,0,IF($N34<Données!$F$11,1,0))","v":0},null,null,null,null,"-",0,"Heures en HS 40%",null,null,null,null,null,null,null,null,"Total dépenses:","-",{"$f":"SUM(AG22:AG32)","v":26.2}]
[null,"2014-12-28",null,0.48958333333333298,0.66666666666666696,0.17708333333333398,{"$f":"IF($D35<>\"\",IF($D35<Données!$C$2,1,0),0)","v":0},0.83333333333333304,4.1666666666666664E-2,0.20833333333333359,{"$f":"IF($H35<>\"\",IF($H35<Données!$C$3,1,0),0)","v":0},0.38541666666666757,0,0.4479166666666663,{"$f":"IF($N35=Données!$F$12,0,IF($N35<Données!$F$11,1,0))","v":1},null,null,null,null,"-",0,"Nombre de repas"]
[null,"Total Semaine",null,null,{"$f":"WEEKNUM(B29,21)","v":52},{"$f":"SUM($F29:$F35)","v":0.65625000000000111},{"$f":"G29+G30+G31+G32+G33+G34+G35","v":0},null,null,{"$f":"SUM(J29:J35)","v":0.96875000000000022},{"$f":"K29+K30+K31+K32+K33+K34+K35","v":0},{"$f":"SUM(L29:L35)","v":1.6250000000000016},{"$f":"SUM(M29:M35)","v":0},null,{"$f":"SUM(O29:O35)","v":1}]
[null,{"$f":"B35+1","v":"2014-12-29"},null,0.48958333333333298,0.64583333333333304,{"$f":"$E37-$D37+IF($D37>$E37,1)","v":0.15625000000000006},{"$f":"IF($D37<>\"\",IF($D37<Données!$C$2,1,0),0)","v":0},0.78125,0.98958333333333304,{"$f":"$I37-$H37+IF($H37>$I37,1)","v":0.20833333333333304},{"$f":"IF($H37<>\"\",IF($H37<Données!$C$3,1,0),0)","v":0},{"$f":"$F37+$J37-($G37+$K37)*(\"00:30\")","v":0.36458333333333309},{"$f":"$G37+$K37","v":0},{"$f":"$D37-$I35+IF($I35>$D37,1)","v":0.4479166666666663},{"$f":"IF($N37=Données!$F$12,0,IF($N37<Données!$F$11,1,0))","v":1},null,null,null,"Différence:"]
[null,{"$f":"B37+1","v":"2014-12-30"},null,0.48958333333333298,0.625,{"$f":"$E38-$D38+IF($D38>$E38,1)","v":0.13541666666666702},{"$f":"IF($D38<>\"\",IF($D38<Données!$C$2,1,0),0)","v":0},0.78125,0.98958333333333304,{"$f":"$I38-$H38+IF($H38>$I38,1)","v":0.20833333333333304},{"$f":"IF($H38<>\"\",IF($H38<Données!$C$3,1,0),0)","v":0},{"$f":"$F38+$J38-($G38+$K38)*(\"00:30\")","v":0.34375000000000006},{"$f":"$G38+$K38","v":0},{"$f":"$D38-$I37+IF($I37>$D38,1)","v":0.5},{"$f":"IF($N38=Données!$F$12,0,IF($N38<Données!$F$11,1,0))","v":0}]
[null,{"$f":"B38+1","v":"2014-12-31"},null,null,null,0,{"$f":"IF($D39<>\"\",IF($D39<Données!$C$2,1,0),0)","v":0},null,null,0,{"$f":"IF($H39<>\"\",IF($H39<Données!$C$3,1,0),0)","v":0},0,0,0,{"$f":"IF($N39=Données!$F$12,0,IF($N39<Données!$F$11,1,0))","v":0},null,null,null,"Dont :","-",{"$f":"$U31-$U23+IF($U23>$U31,1)","v":0.30902777777777679},"Heures à taux normal"]
[null,"2015-01-01",null,null,null,0,{"$f":"IF($D40<>\"\",IF($D40<Données!$C$2,1,0),0)","v":0},null,null,0,{"$f":"IF($H40<>\"\",IF($H40<Données!$C$3,1,0),0)","v":0},0,0,{"$f":"$D40-$I39+IF($I39>$D40,1)","v":0},{"$f":"IF($N40=Données!$F$12,0,IF($N40<Données!$F$11,1,0))","v":0},null,null,null,null,"-",{"$f":"$U32-$U24+IF($U24>$U32,1)","v":6.458333333333155E-2},"Heures en HS 10%"]
[null,"2015-01-02",null,0.48958333333333298,0.64583333333333304,0.15625000000000006,{"$f":"IF($D41<>\"\",IF($D41<Données!$C$2,1,0),0)","v":0},0.83333333333333304,6.25E-2,0.22916666666666696,{"$f":"IF($H41<>\"\",IF($H41<Données!$C$3,1,0),0)","v":0},0.38541666666666702,0,0.48958333333333298,{"$f":"IF($N41=Données!$F$12,0,IF($N41<Données!$F$11,1,0))","v":0},null,null,null,null,"-",{"$f":"$U33-$U25+IF($U25>$U33,1)","v":0.64583333333333326},"Heures en HS 20%"]
[null,"2015-01-03",null,0.48958333333333298,0.66666666666666696,0.17708333333333398,{"$f":"IF($D42<>\"\",IF($D42<Données!$C$2,1,0),0)","v":0},0.83333333333333304,0.94791666666666696,0.11458333333333393,{"$f":"IF($H42<>\"\",IF($H42<Données!$C$3,1,0),0)","v":0},0.29166666666666791,0,0.42708333333333298,{"$f":"IF($N42=Données!$F$12,0,IF($N42<Données!$F$11,1,0))","v":1},null,null,null,null,"-",{"$f":"$U34-$U26+IF($U26>$U34,1)","v":0.95833333333333015},"Heures en HS 40%"]
[null,"2015-01-04",null,0.48958333333333298,0.64583333333333304,0.15625000000000006,{"$f":"IF($D43<>\"\",IF($D43<Données!$C$2,1,0),0)","v":0},0.78125,2.0833333333333332E-2,0.23958333333333337,{"$f":"IF($H43<>\"\",IF($H43<Données!$C$3,1,0),0)","v":0},0.39583333333333343,0,0.54166666666666607,{"$f":"IF($N43=Données!$F$12,0,IF($N43<Données!$F$11,1,0))","v":0},null,null,null,null,"-",{"$f":"SUM(U35-U27)","v":0},"Nombre de repas"]
[null,"Total Semaine",null,null,{"$f":"WEEKNUM(B37,21)","v":1},{"$f":"SUM($F37:$F43)","v":0.78125000000000111},{"$f":"G37+G38+G39+G40+G41+G42+G43","v":0},null,null,{"$f":"SUM(J37:J43)","v":1.0000000000000004},{"$f":"K37+K38+K39+K40+K41+K42+K43","v":0},{"$f":"SUM(L37:L43)","v":1.7812500000000016},{"$f":"SUM(M37:M43)","v":0},null,{"$f":"SUM(O37:O43)","v":2}]
[null,{"$f":"B43+1","v":"2015-01-05"},null,null,null,{"$f":"$E45-$D45+IF($D45>$E45,1)","v":0},{"$f":"IF($D45<>\"\",IF($D45<Données!$C$2,1,0),0)","v":0},null,null,{"$f":"$I45-$H45+IF($H45>$I45,1)","v":0},{"$f":"IF($H45<>\"\",IF($H45<Données!$C$3,1,0),0)","v":0},{"$f":"$F45+$J45-($G45+$K45)*(\"00:30\")","v":0},{"$f":"$G45+$K45","v":0},{"$f":"$D45-$I43+IF($I43>$D45,1)","v":0.97916666666666663},{"$f":"IF($N45=Données!$F$12,0,IF($N45<Données!$F$11,1,0))","v":0}]
[null,{"$f":"B45+1","v":"2015-01-06"},null,null,null,0,{"$f":"IF($D46<>\"\",IF($D46<Données!$C$2,1,0),0)","v":0},null,null,{"$f":"$I46-$H46+IF($H46>$I46,1)","v":0},{"$f":"IF($H46<>\"\",IF($H46<Données!$C$3,1,0),0)","v":0},{"$f":"$F46+$J46-($G46+$K46)*(\"00:30\")","v":0},{"$f":"$G46+$K46","v":0},{"$f":"$D46-$I45+IF($I45>$D46,1)","v":0},{"$f":"IF($N46=Données!$F$12,0,IF($N46<Données!$F$11,1,0))","v":0}]
[null,{"$f":"B46+1","v":"2015-01-07"},null,null,null,0,{"$f":"IF($D47<>\"\",IF($D47<Données!$C$2,1,0),0)","v":0},null,null,0,{"$f":"IF($H47<>\"\",IF($H47<Données!$C$3,1,0),0)","v":0},0,0,{"$f":"$D47-$I46+IF($I46>$D47,1)","v":0},{"$f":"IF($N47=Données!$F$12,0,IF($N47<Données!$F$11,1,0))","v":0}]
[null,"2015-01-08",null,null,null,0,{"$f":"IF($D48<>\"\",IF($D48<Données!$C$2,1,0),0)","v":0},null,null,0,{"$f":"IF($H48<>\"\",IF($H48<Données!$C$3,1,0),0)","v":0},0,0,0,{"$f":"IF($N48=Données!$F$12,0,IF($N48<Données!$F$11,1,0))","v":0}]
[null,"2015-01-09",null,null,null,0,{"$f":"IF($D49<>\"\",IF($D49<Données!$C$2,1,0),0)","v":0},null,null,0,{"$f":"IF($H49<>\"\",IF($H49<Données!$C$3,1,0),0)","v":0},0,0,0,{"$f":"IF($N49=Données!$F$12,0,IF($N49<Données!$F$11,1,0))","v":0}]
[null,"2015-01-10",null,null,null,0,{"$f":"IF($D50<>\"\",IF($D50<Données!$C$2,1,0),0)","v":0},null,null,0,{"$f":"IF($H50<>\"\",IF($H50<Données!$C$3,1,0),0)","v":0},0,0,0,{"$f":"IF($N50=Données!$F$12,0,IF($N50<Données!$F$11,1,0))","v":0}]
[null,"2015-01-11",null,null,null,0,{"$f":"IF($D51<>\"\",IF($D51<Données!$C$2,1,0),0)","v":0},null,null,0,{"$f":"IF($H51<>\"\",IF($H51<Données!$C$3,1,0),0)","v":0},0,0,0,{"$f":"IF($N51=Données!$F$12,0,IF($N51<Données!$F$11,1,0))","v":0}]
[null,"Total semaine",null,null,{"$f":"WEEKNUM(B45,21)","v":2},{"$f":"SUM($F45:$F51)","v":0},{"$f":"G45+G46+G47+G48+G49+G50+G51","v":0},null,null,{"$f":"SUM(J45:J51)","v":0},{"$f":"K45+K46+K47+K48+K49+K50+K51","v":0},{"$f":"SUM(L45:L51)","v":0},{"$f":"SUM(M45:M51)","v":0},null,{"$f":"SUM(O45:O51)","v":0}]
[null,null,null,null,null,null,null,null,null,null,null,null,null,7.041666666666667]
[null,null,null,null,null,null,null,null,null,null,null,{"$f":"CodeCouleur(M54)","v":50},null,"REPOS"]
[null,null,null,null,null,null,null,null,null,null,null,{"$f":"CodeCouleur(M55)","v":42},null,"Récup"]
[null,null,null,null,null,null,null,null,null,null,null,48,null,"JFG"]
[null,null,null,null,null,null,null,null,null,null,null,44,null,"VAC"]
[null,null,null,null,null,null,null,null,null,null,null,3,null,"MAL"]
[null,null,null,null,null,null,null,null,null,null,null,{"$f":"CodeCouleur(M59)","v":40},null,"Jf Taf"]
["Heures",null,1.4583333333333333,1.625,1.7916666666666667,"Total"]
["Taux",1,1.1000000000000001,1.2,1.4]
["S 1",{"$f":"IF($L$12<=$C$60,$L$12,$C$60)","v":1.1770833333333341},{"$f":"IF($L$12<=$C$60,0,IF($L$12<=$D$60,$L$12,$D$60)-$C$60)","v":0},{"$f":"IF($L$12<=$D$60,0,IF($L$12<=$E$60,$L$12,$D$60)-$C$60)","v":0},{"$f":"IF($L$12<=$E$60,0,IF($L$12>$E$60,$L$12,$E$60)-$E$60)","v":0},{"$f":"B62+C62+D62+E62","v":1.1770833333333341}]
["S 2",{"$f":"IF($L$20<=$C$60,$L$20,$C$60)","v":1.4583333333333333},{"$f":"IF($L$20<=$C$60,0,IF($L$20<=$D$60,$L$20,$D$60)-$C$60)","v":0.16666666666666674},3.125E-2,{"$f":"IF($L$20<=$E$60,0,IF($L$20>$E$60,$L$20,$E$60)-$E$60)","v":0},1.65625]
["S 3",{"$f":"IF($L$28<=$C$60,$L$28,$C$60)","v":1.4583333333333333},{"$f":"IF($L$28<=$C$60,0,IF($L$28<=$D$60,$L$28,$D$60)-$C$60)","v":0.16666666666666674},{"$f":"IF($L$28<=$D$60,0,IF($L$28<=$E$60,$L$28,$D$60)-$C$60)","v":0.16666666666666674},{"$f":"IF($L$28<=$E$60,0,IF($L$28>$E$60,$L$28,$E$60)-$E$60)","v":4.1666666666669849E-2},1.8333333333333366]
["S 4",{"$f":"IF($L$36<=$C$60,$L$36,$C$60)","v":1.4583333333333333},{"$f":"IF($L$36<=$C$60,0,IF($L$36<=$D$60,$L$36,$D$60)-$C$60)","v":0.16666666666666829},{"$f":"IF($L$36<=$D$60,0,IF($L$36<=$E$60,$L$36,$D$60)-$C$60)","v":0},{"$f":"IF($L$36<=$E$60,0,IF($L$36>$E$60,$L$36,$E$60)-$E$60)","v":0},1.6250000000000016]
["S 5",{"$f":"IF($L$44<=$C$60,$L$44,$C$60)","v":1.4583333333333333},{"$f":"IF($L$44<=$C$60,0,IF($L$44<=$D$60,$L$44,$D$60)-$C$60)","v":0.16666666666666674},0.15625,{"$f":"IF($L$44<=$E$60,0,IF($L$44>$E$60,$L$44,$E$60)-$E$60)","v":0},1.78125]
["S 6",{"$f":"IF($L$52<=$C$60,$L$52,$C$60)","v":0},{"$f":"IF($L$52<=$C$60,0,IF($L$52<=$D$60,$L$52,$D$60)-$C$60)","v":0},{"$f":"IF($L$52<=$D$60,0,IF($L$52<=$E$60,$L$52,$D$60)-$C$60)","v":0},{"$f":"IF($L$52<=$E$60,0,IF($L$52>$E$60,$L$52,$E$60)-$E$60)","v":0},0]
["Total",{"$f":"SUM(B62:B67)","v":7.010416666666667},{"$f":"SUM(C62:C67)","v":0.66666666666666852},{"$f":"SUM(D62:D67)","v":0.35416666666666674},{"$f":"SUM(E62:E67)","v":4.1666666666669849E-2},8.0729166666666714]
[]
[]
["Jours","Repos","Récup","Jfg","Vac","Mal","Vides","Taf","Jf Taf","<11h"]
["S 1",{"$f":"NbCellsCoul($D$5:$I$11,50)*0.25","v":0},{"$f":"NbCellsCoul($D$5:$I$11,42)*0.25","v":0},{"$f":"NbCellsCoul($D$5:$I$11,48)*0.25","v":0},{"$f":"NbCellsCoul($D$5:$I$11,44)*0.25","v":0},{"$f":"NbCellsCoul($D$5:$I$11,3)*0.25","v":0},{"$f":"+COUNTBLANK(E5:H11)/2","v":4},{"$f":"7-$G72","v":3},{"$f":"NbCellsCoul($D$5:$I$11,40)*0.25","v":0},{"$f":"SUM($O$6:$O$11)","v":1}]
["S 2",{"$f":"NbCellsCoul($D$13:$I$19,50)*0.25","v":2},{"$f":"NbCellsCoul($D$13:$I$19,42)*0.25","v":0.5},{"$f":"NbCellsCoul($D$13:$I$19,48)*0.25","v":0},{"$f":"NbCellsCoul($D$13:$I$19,44)*0.25","v":0},{"$f":"NbCellsCoul($D$13:$I$19,3)*0.25","v":0},{"$f":"+COUNTBLANK(E13:H19)/2","v":2.5},4.5,{"$f":"NbCellsCoul($D$13:$I$19,40)*0.25","v":0},{"$f":"SUM($O$13:$O$19)","v":1}]
["S 3",{"$f":"NbCellsCoul($D$21:$I$27,50)*0.25","v":2},{"$f":"NbCellsCoul($D$21:$I$27,42)*0.25","v":0},{"$f":"NbCellsCoul($D$21:$I$27,48)*0.25","v":0},{"$f":"NbCellsCoul($D$21:$I$27,44)*0.25","v":0},{"$f":"NbCellsCoul($D$21:$I$27,3)*0.25","v":0},{"$f":"+COUNTBLANK(E21:H27)/2","v":2},5,{"$f":"NbCellsCoul($D$21:$I$27,40)*0.25","v":1},{"$f":"SUM($O$21:$O$27)","v":1}]
["S 4",{"$f":"NbCellsCoul($D$29:$I$35,50)*0.25","v":2},{"$f":"NbCellsCoul($D$29:$I$35,42)*0.25","v":0},{"$f":"NbCellsCoul($D$29:$I$35,48)*0.25","v":0},{"$f":"NbCellsCoul($D$29:$I$35,44)*0.25","v":0},{"$f":"NbCellsCoul($D$29:$I$35,3)*0.25","v":0},{"$f":"+COUNTBLANK(E29:H35)/2","v":2},5,{"$f":"NbCellsCoul($D$29:$I$35,40)*0.25","v":0},{"$f":"SUM($O$29:$O$35)","v":1}]
["S 5",{"$f":"NbCellsCoul($D$37:$I$43,50)*0.25","v":2},{"$f":"NbCellsCoul($D$37:$I$43,42)*0.25","v":0},{"$f":"NbCellsCoul($D$37:$I$43,48)*0.25","v":0},{"$f":"NbCellsCoul($D$37:$I$43,44)*0.25","v":0},{"$f":"NbCellsCoul($D$37:$I$43,3)*0.25","v":0},{"$f":"+COUNTBLANK(E37:H43)/2","v":2},5,{"$f":"NbCellsCoul($D$37:$I$43,40)*0.25","v":0},{"$f":"SUM($O$37:$O$43)","v":2}]
["S 6",{"$f":"NbCellsCoul($D$45:$I$51,50)*0.25","v":0},{"$f":"NbCellsCoul($D$45:$I$51,42)*0.25","v":0},{"$f":"NbCellsCoul($D$45:$I$51,48)*0.25","v":0},{"$f":"NbCellsCoul($D$45:$I$51,44)*0.25","v":0},{"$f":"NbCellsCoul($D$45:$I$51,3)*0.25","v":0},{"$f":"+COUNTBLANK(E45:H51)/2","v":7},0,{"$f":"NbCellsCoul($D$45:$I$51,40)*0.25","v":0},{"$f":"SUM($O$45:$O$51)","v":0}]
["Total",{"$f":"SUM(B$72:B$77)","v":8},0.5,0,0,{"$f":"SUM(F$72:F$77)","v":0},{"$f":"SUM(G$72:G$77)","v":19.5},{"$f":"SUM(H$72:H$77)","v":22.5},{"$f":"SUM(I$72:I$77)","v":1},{"$f":"SUM(J$72:J$77)","v":6}]

{"sheet":"Sept 14","index":11,"n_rows":78,"n_cols":34,"rows_kept":78,"cut":false,"hidden":false,"merged":[[50,1,50,2],[51,1,51,3],[59,0,59,1],[108,5,108,8],[44,1,44,2],[45,1,45,2],[46,1,46,2],[47,1,47,2],[48,1,48,2],[49,1,49,2],[43,1,43,3],[32,1,32,2],[33,1,33,2],[34,1,34,2],[35,1,35,3],[36,1,36,2],[37,1,37,2],[38,1,38,2],[39,1,39,2],[40,1,40,2],[41,1,41,2],[42,1,42,2],[31,1,31,2],[20,1,20,2],[21,1,21,2],[22,1,22,2],[23,1,23,2],[24,1,24,2],[25,1,25,2],[26,1,26,2],[27,1,27,3],[28,1,28,2],[29,1,29,2],[30,1,30,2],[19,1,19,3],[8,1,8,2],[9,1,9,2],[10,1,10,2],[11,1,11,3],[12,1,12,2],[13,1,13,2],[14,1,14,2],[15,1,15,2],[16,1,16,2],[17,1,17,2],[18,1,18,2],[7,1,7,2],[0,3,0,9],[0,18,0,21],[0,30,0,32],[2,1,3,2],[2,3,2,4],[2,5,3,5],[2,6,3,6],[2,7,2,8],[2,9,3,9],[2,10,3,10],[2,11,3,11],[2,12,3,12],[4,1,4,2],[5,1,5,2],[6,1,6,2]]}
[null,null,null,"TEMPS DE TRAVAIL",null,null,null,null,null,null,null,null,null,null,null,null,null,null,"RÉCAPITULATIF",null,null,null,null,null,null,null,null,null,null,null,"IMPÔTS"]
[null,null,null,null,null,{"$f":"Données!G14","v":12},null,null,null,{"$f":"Données!C15","v":2014}]
[null,"Jour",null,"Midi",null,"Cumul Midi","Repas","Soir",null,"Cumul Soir","Repas","Totaux","Total Repas"]
[null,null,null,"Début","Fin",null,null,"Début","Fin",null,null,null,null,null,null,null,null,null,null,null,null,null,null,null,null,null,null,null,null,null,null,{"$f":"VLOOKUP(F2,Données!E15:F26,2)","v":"Décembre"},{"$f":"J2","v":2014}]
[null,{"$f":"Données!I15-WEEKDAY(Données!I15-1)+1","v":"2014-12-01"},null,null,null,{"$f":"$E5-$D5+IF($D5>$E5,1)","v":0},{"$f":"IF($D5<>\"\",IF($D5<Données!$C$2,1,0),0)","v":0},null,null,{"$f":"$I5-$H5+IF($H5>$I5,1)","v":0},{"$f":"IF($H5<>\"\",IF($H5<Données!$C$3,1,0),0)","v":0},0.32291666666666669,{"$f":"$G5+$K5","v":0}]
[null,{"$f":"B5+1","v":"2014-12-02"},null,null,null,{"$f":"$E6-$D6+IF($D6>$E6,1)","v":0},{"$f":"IF($D6<>\"\",IF($D6<Données!$C$2,1,0),0)","v":0},null,null,{"$f":"$I6-$H6+IF($H6>$I6,1)","v":0},{"$f":"IF($H6<>\"\",IF($H6<Données!$C$3,1,0),0)","v":0},{"$f":"$F6+$J6-($G6+$K6)*(\"00:30\")","v":0},{"$f":"$G6+$K6","v":0},{"$f":"$D6-$I5+IF($I5>$D6,1)","v":0},{"$f":"IF($N6=Données!$F$12,0,IF($N6<Données!$F$11,1,0))","v":0},null,null,null,"Soit au total pour le mois de :",null,{"$f":"VLOOKUP(F2,Données!E15:F26,2)","v":"Décembre"},{"$f":"J2","v":2014}]
[null,{"$f":"B6+1","v":"2014-12-03"},null,null,null,0,{"$f":"IF($D7<>\"\",IF($D7<Données!$C$2,1,0),0)","v":0},null,null,0,{"$f":"IF($H7<>\"\",IF($H7<Données!$C$3,1,0),0)","v":0},0,0,{"$f":"$D7-$I6+IF($I6>$D7,1)","v":0},{"$f":"IF($N7=Données!$F$12,0,IF($N7<Données!$F$11,1,0))","v":0}]
[null,"2014-12-04",null,null,null,0,{"$f":"IF($D8<>\"\",IF($D8<Données!$C$2,1,0),0)","v":0},null,null,0,{"$f":"IF($H8<>\"\",IF($H8<Données!$C$3,1,0),0)","v":0},0.32291666666666669,0,{"$f":"$D8-$I7+IF($I7>$D8,1)","v":0},{"$f":"IF($N8=Données!$F$12,0,IF($N8<Données!$F$11,1,0))","v":0},null,null,null,null,null,null,null,null,null,null,null,null,null,null,null,"Numéro Fiscal :"]
[null,"2014-12-05",null,null,null,0,{"$f":"IF($D9<>\"\",IF($D9<Données!$C$2,1,0),0)","v":0},null,null,0,{"$f":"IF($H9<>\"\",IF($H9<Données!$C$3,1,0),0)","v":0},0.32291666666666669,0,0,{"$f":"IF($N9=Données!$F$12,0,IF($N9<Données!$F$11,1,0))","v":0},null,null,null,"Nombre de jours travaillés :",null,{"$f":"H78","v":7},null,null,null,null,null,null,null,null,null,"MDP:"]
[null,"2014-12-06",null,null,null,0,{"$f":"IF($D10<>\"\",IF($D10<Données!$C$2,1,0),0)","v":0},null,null,0,{"$f":"IF($H10<>\"\",IF($H10<Données!$C$3,1,0),0)","v":0},0.32291666666666669,0,{"$f":"$D10-$I9+IF($I9>$D10,1)","v":0},{"$f":"IF($N10=Données!$F$12,0,IF($N10<Données!$F$11,1,0))","v":0},null,null,null,"Nombre de jours repos :",null,{"$f":"B78","v":8}]
[null,"2014-12-07",null,null,null,0,{"$f":"IF($D11<>\"\",IF($D11<Données!$C$2,1,0),0)","v":0},null,null,0,{"$f":"IF($H11<>\"\",IF($H11<Données!$C$3,1,0),0)","v":0},0.32291666666666669,0,{"$f":"$D11-$I10+IF($I10>$D11,1)","v":0},{"$f":"IF($N11=Données!$F$12,0,IF($N11<Données!$F$11,1,0))","v":0},null,null,null,"Nombre de jours récup :",null,{"$f":"C$78","v":0},null,null,null,null,null,null,null,null,null,"Adresse domicile:","-"]
[null,"Total Semaine",null,null,{"$f":"WEEKNUM(B5,21)","v":49},{"$f":"SUM($F5:$F11)","v":0},{"$f":"G5+G6+G7+G8+G9+G10+G11","v":0},null,null,{"$f":"SUM(J5:J11)","v":0},{"$f":"K5+K6+K7+K8+K9+K10+K11","v":0},{"$f":"SUM(L5:L11)","v":1.6145833333333335},{"$f":"SUM(M5:M11)","v":0},null,{"$f":"SUM(O6:O11)","v":0},null,null,null,"Nombre de jfg :",null,{"$f":"D$78","v":0}]
[null,{"$f":"B11+1","v":"2014-12-08"},null,null,null,{"$f":"$E13-$D13+IF($D13>$E13,1)","v":0},{"$f":"IF($D13<>\"\",IF($D13<Données!$C$2,1,0),0)","v":0},null,null,{"$f":"$I13-$H13+IF($H13>$I13,1)","v":0},{"$f":"IF($H13<>\"\",IF($H13<Données!$C$3,1,0),0)","v":0},0.32291666666666669,{"$f":"$G13+$K13","v":0},{"$f":"$D13-$I11+IF($I11>$D13,1)","v":0},{"$f":"IF($N13=Données!$F$12,0,IF($N13<Données!$F$11,1,0))","v":0},null,null,null,"Nombre de jours de vacances :",null,{"$f":"E$78","v":15}]
[null,{"$f":"B13+1","v":"2014-12-09"},null,null,null,{"$f":"$E14-$D14+IF($D14>$E14,1)","v":0},{"$f":"IF($D14<>\"\",IF($D14<Données!$C$2,1,0),0)","v":0},null,null,{"$f":"$I14-$H14+IF($H14>$I14,1)","v":0},{"$f":"IF($H14<>\"\",IF($H14<Données!$C$3,1,0),0)","v":0},{"$f":"$F14+$J14-($G14+$K14)*(\"00:30\")","v":0},{"$f":"$G14+$K14","v":0},{"$f":"$D14-$I13+IF($I13>$D14,1)","v":0},{"$f":"IF($N14=Données!$F$12,0,IF($N14<Données!$F$11,1,0))","v":0},null,null,null,"Nombre de jours de maladie :",null,{"$f":"F$78","v":0}]
[null,{"$f":"B14+1","v":"2014-12-10"},null,null,null,0,{"$f":"IF($D15<>\"\",IF($D15<Données!$C$2,1,0),0)","v":0},null,null,0,{"$f":"IF($H15<>\"\",IF($H15<Données!$C$3,1,0),0)","v":0},0,0,{"$f":"$D15-$I14+IF($I14>$D15,1)","v":0},{"$f":"IF($N15=Données!$F$12,0,IF($N15<Données!$F$11,1,0))","v":0},null,null,null,"Nombre jours fériées travaillés :",null,{"$f":"I78","v":0},null,null,null,null,null,null,null,null,null,"Adresse lieu de travail:","-"]
[null,"2014-12-11",null,null,null,0,{"$f":"IF($D16<>\"\",IF($D16<Données!$C$2,1,0),0)","v":0},null,null,0,{"$f":"IF($H16<>\"\",IF($H16<Données!$C$3,1,0),0)","v":0},0.32291666666666669,0,0,{"$f":"IF($N16=Données!$F$12,0,IF($N16<Données!$F$11,1,0))","v":0},null,null,null,"Nombre de fois 11h de batement non respecté :",null,{"$f":"J78","v":1}]
[null,"2014-12-12",null,null,null,0,{"$f":"IF($D17<>\"\",IF($D17<Données!$C$2,1,0),0)","v":0},null,null,0,{"$f":"IF($H17<>\"\",IF($H17<Données!$C$3,1,0),0)","v":0},0.32291666666666669,0,0,{"$f":"IF($N17=Données!$F$12,0,IF($N17<Données!$F$11,1,0))","v":0}]
[null,"2014-12-13",null,null,null,0,{"$f":"IF($D18<>\"\",IF($D18<Données!$C$2,1,0),0)","v":0},null,null,0,{"$f":"IF($H18<>\"\",IF($H18<Données!$C$3,1,0),0)","v":0},0.32291666666666669,0,0,{"$f":"IF($N18=Données!$F$12,0,IF($N18<Données!$F$11,1,0))","v":0},null,null,null,null,null,null,null,null,null,null,null,null,null,null,null,"Distance ( Source Mappy) :","-","7,4 KM"]
[null,"2014-12-14",null,null,null,0,{"$f":"IF($D19<>\"\",IF($D19<Données!$C$2,1,0),0)","v":0},null,null,0,{"$f":"IF($H19<>\"\",IF($H19<Données!$C$3,1,0),0)","v":0},0.32291666666666669,0,0,{"$f":"IF($N19=Données!$F$12,0,IF($N19<Données!$F$11,1,0))","v":0},null,null,null,null,null,{"$f":"SUM(L12+L20+L28+L36+L44+L52)","v":7.5416666666666687},"Heures effectués"]
[null,"Total Semaine",null,null,{"$f":"WEEKNUM(B13,21)","v":50},{"$f":"SUM($F13:$F19)","v":0},{"$f":"G13+G14+G15+G16+G17+G18+G19","v":0},null,null,{"$f":"SUM(J13:J19)","v":0},{"$f":"K13+K14+K15+K16+K17+K18+K19","v":0},{"$f":"SUM(L13:L19)","v":1.6145833333333335},{"$f":"SUM(M13:M19)","v":0},null,{"$f":"SUM(O13:O19)","v":0},null,null,null,null,null,{"$f":"IF(U19<N53,\"- \"&TEXT(ABS(N53-U19),\"[hh]:mm\"),U19-N53)","v":0.50000000000000178},"Heures dues/supp",null,null,null,null,null,null,null,null,"Nombre Aller-Retour :","-",{"$f":"COUNT(E5:E11,I5:I11,E13:E19,I13:I19,E21:E27,I21:I27,E29:E35,I29:I35,E37:E43,I37:I43,E45:E51,I45:I51)","v":14}]
[null,{"$f":"B19+1","v":"2014-12-15"},null,null,null,{"$f":"$E21-$D21+IF($D21>$E21,1)","v":0},{"$f":"IF($D21<>\"\",IF($D21<Données!$C$2,1,0),0)","v":0},null,null,{"$f":"$I21-$H21+IF($H21>$I21,1)","v":0},{"$f":"IF($H21<>\"\",IF($H21<Données!$C$3,1,0),0)","v":0},0.32291666666666669,{"$f":"$G21+$K21","v":0},{"$f":"$D21-$I19+IF($I19>$D21,1)","v":0},{"$f":"IF($N21=Données!$F$12,0,IF($N21<Données!$F$11,1,0))","v":0},null,null,null,null,null,null,null,null,null,null,null,null,null,null,null,"Km Parcourue :","-",{"$f":"SUM(AG20*14.8)","v":207.20000000000002},"Km"]
[null,{"$f":"B21+1","v":"2014-12-16"},null,null,null,{"$f":"$E22-$D22+IF($D22>$E22,1)","v":0},{"$f":"IF($D22<>\"\",IF($D22<Données!$C$2,1,0),0)","v":0},null,null,{"$f":"$I22-$H22+IF($H22>$I22,1)","v":0},{"$f":"IF($H22<>\"\",IF($H22<Données!$C$3,1,0),0)","v":0},{"$f":"$F22+$J22-($G22+$K22)*(\"00:30\")","v":0},{"$f":"$G22+$K22","v":0},{"$f":"$D22-$I21+IF($I21>$D22,1)","v":0},{"$f":"IF($N22=Données!$F$12,0,IF($N22<Données!$F$11,1,0))","v":0},null,null,null,null,null,null,null,null,null,null,null,null,null,null,null,"Horodateur Payé :","-",10.4]
[null,{"$f":"B22+1","v":"2014-12-17"},null,null,null,0,{"$f":"IF($D23<>\"\",IF($D23<Données!$C$2,1,0),0)","v":0},null,null,0,{"$f":"IF($H23<>\"\",IF($H23<Données!$C$3,1,0),0)","v":0},0,0,{"$f":"$D23-$I22+IF($I22>$D23,1)","v":0},{"$f":"IF($N23=Données!$F$12,0,IF($N23<Données!$F$11,1,0))","v":0},null,null,null,"Dont :","-",{"$f":"$B$68","v":6.5625},"Heures à taux normal ( 35h )",null,null,null,null,null,null,null,null,"Achat divers pour le travail :","-",{"$f":"NbCellsCoul($D$5:$I$11,50)*0.25","v":2}]
[null,"2014-12-18",null,null,null,0,{"$f":"IF($D24<>\"\",IF($D24<Données!$C$2,1,0),0)","v":0},null,null,0,{"$f":"IF($H24<>\"\",IF($H24<Données!$C$3,1,0),0)","v":0},0.32291666666666669,0,0,{"$f":"IF($N24=Données!$F$12,0,IF($N24<Données!$F$11,1,0))","v":0},null,null,null,null,"-",{"$f":"$C$68","v":0.63541666666666741},"Heures en HS 10%         ( 35h à 39h )",null,null,null,null,null,null,null,null,null,"-"]
[null,"2014-12-19",null,null,null,0,{"$f":"IF($D25<>\"\",IF($D25<Données!$C$2,1,0),0)","v":0},null,null,0,{"$f":"IF($H25<>\"\",IF($H25<Données!$C$3,1,0),0)","v":0},0.32291666666666669,0,0,{"$f":"IF($N25=Données!$F$12,0,IF($N25<Données!$F$11,1,0))","v":0},null,null,null,null,"-",{"$f":"$D$68","v":0.16666666666666674},"Heures en HS 20%         (39h à 43h )",null,null,null,null,null,null,null,null,null,"-"]
[null,"2014-12-20",null,null,null,0,{"$f":"IF($D26<>\"\",IF($D26<Données!$C$2,1,0),0)","v":0},null,null,0,{"$f":"IF($H26<>\"\",IF($H26<Données!$C$3,1,0),0)","v":0},0.32291666666666669,0,0,{"$f":"IF($N26=Données!$F$12,0,IF($N26<Données!$F$11,1,0))","v":0},null,null,null,null,"-",{"$f":"$E$68","v":0.17708333333333459},"Heures en HS 40%         ( 43h et plus )",null,null,null,null,null,null,null,null,null,"-"]
[null,"2014-12-21",null,null,null,0,{"$f":"IF($D27<>\"\",IF($D27<Données!$C$2,1,0),0)","v":0},null,null,0,{"$f":"IF($H27<>\"\",IF($H27<Données!$C$3,1,0),0)","v":0},0.32291666666666669,0,0,{"$f":"IF($N27=Données!$F$12,0,IF($N27<Données!$F$11,1,0))","v":0},null,null,null,null,"-",{"$f":"SUM(M12+M20+M28+M36+M44+M52)","v":0},"Nombre de repas",null,null,null,null,null,null,null,null,null,"-"]
[null,"Total Semaine",null,null,{"$f":"WEEKNUM(B21,21)","v":51},{"$f":"SUM($F21:$F27)","v":0},{"$f":"G21+G22+G23+G24+G25+G26+G27","v":0},null,null,{"$f":"SUM(J21:J27)","v":0},{"$f":"K21+K22+K23+K24+K25+K26+K27","v":0},{"$f":"SUM(L21:L27)","v":1.6145833333333335},{"$f":"SUM(M21:M27)","v":0},null,{"$f":"SUM(O21:O27)","v":0},null,null,null,null,null,null,null,null,null,null,null,null,null,null,null,null,"-"]
[null,{"$f":"B27+1","v":"2014-12-22"},null,0.5,0.65625,{"$f":"$E29-$D29+IF($D29>$E29,1)","v":0.15625},{"$f":"IF($D29<>\"\",IF($D29<Données!$C$2,1,0),0)","v":0},0.78125,1.0416666666666666E-2,{"$f":"$I29-$H29+IF($H29>$I29,1)","v":0.22916666666666663},{"$f":"IF($H29<>\"\",IF($H29<Données!$C$3,1,0),0)","v":0},{"$f":"$F29+$J29-($G29+$K29)*(\"00:30\")","v":0.38541666666666663},{"$f":"$G29+$K29","v":0},{"$f":"$D29-$I27+IF($I27>$D29,1)","v":0.5},{"$f":"IF($N29=Données!$F$12,0,IF($N29<Données!$F$11,1,0))","v":0},null,null,null,"Heure fiche de paie:",null,null,null,null,null,null,null,null,null,null,null,null,"-"]
[null,{"$f":"B29+1","v":"2014-12-23"},null,0.48958333333333298,0.63541666666666696,{"$f":"$E30-$D30+IF($D30>$E30,1)","v":0.14583333333333398},{"$f":"IF($D30<>\"\",IF($D30<Données!$C$2,1,0),0)","v":0},0.78125,0.96875,{"$f":"$I30-$H30+IF($H30>$I30,1)","v":0.1875},{"$f":"IF($H30<>\"\",IF($H30<Données!$C$3,1,0),0)","v":0},{"$f":"$F30+$J30-($G30+$K30)*(\"00:30\")","v":0.33333333333333398},{"$f":"$G30+$K30","v":0},{"$f":"$D30-$I29+IF($I29>$D30,1)","v":0.4791666666666663},{"$f":"IF($N30=Données!$F$12,0,IF($N30<Données!$F$11,1,0))","v":0},null,null,null,null,null,null,null,null,null,null,null,null,null,null,null,null,"-"]
[null,{"$f":"B30+1","v":"2014-12-24"},null,null,null,0,{"$f":"IF($D31<>\"\",IF($D31<Données!$C$2,1,0),0)","v":0},null,null,0,{"$f":"IF($H31<>\"\",IF($H31<Données!$C$3,1,0),0)","v":0},0,0,0,{"$f":"IF($N31=Données!$F$12,0,IF($N31<Données!$F$11,1,0))","v":0},null,null,null,"Dont :","-",6.3194444444444438,"Heures à taux normal",null,null,null,null,null,null,null,null,null,"-"]
[null,"2014-12-25",null,null,null,0,{"$f":"IF($D32<>\"\",IF($D32<Données!$C$2,1,0),0)","v":0},0.76041666666666696,0.96875,0.20833333333333304,0,0.20833333333333304,0,{"$f":"$D32-$I31+IF($I31>$D32,1)","v":0},{"$f":"IF($N32=Données!$F$12,0,IF($N32<Données!$F$11,1,0))","v":0},null,null,null,null,"-",0.73125000000000007,"Heures en HS 10%",null,null,null,null,null,null,null,null,null,"-"]
[null,"2014-12-26",null,0.48958333333333298,0.61458333333333304,0.12500000000000006,{"$f":"IF($D33<>\"\",IF($D33<Données!$C$2,1,0),0)","v":0},0.78125,2.0833333333333332E-2,0.23958333333333337,{"$f":"IF($H33<>\"\",IF($H33<Données!$C$3,1,0),0)","v":0},0.36458333333333343,0,0.52083333333333304,{"$f":"IF($N33=Données!$F$12,0,IF($N33<Données!$F$11,1,0))","v":0},null,null,null,null,"-",0,"Heures en HS 20%"]
[null,"2014-12-27",null,null,null,0,{"$f":"IF($D34<>\"\",IF($D34<Données!$C$2,1,0),0)","v":0},0.78125,4.1666666666666664E-2,0.26041666666666663,{"$f":"IF($H34<>\"\",IF($H34<Données!$C$3,1,0),0)","v":0},0.26041666666666663,0,0.97916666666666663,{"$f":"IF($N34=Données!$F$12,0,IF($N34<Données!$F$11,1,0))","v":0},null,null,null,null,"-",0,"Heures en HS 40%",null,null,null,null,null,null,null,null,"Total dépenses:","-",{"$f":"SUM(AG22:AG32)","v":12.4}]
[null,"2014-12-28",null,0.48958333333333298,0.66666666666666696,0.17708333333333398,{"$f":"IF($D35<>\"\",IF($D35<Données!$C$2,1,0),0)","v":0},0.78125,2.0833333333333332E-2,0.23958333333333337,{"$f":"IF($H35<>\"\",IF($H35<Données!$C$3,1,0),0)","v":0},0.41666666666666735,0,0.4479166666666663,{"$f":"IF($N35=Données!$F$12,0,IF($N35<Données!$F$11,1,0))","v":1},null,null,null,null,"-",0,"Nombre de repas"]
[null,"Total Semaine",null,null,{"$f":"WEEKNUM(B29,21)","v":52},{"$f":"SUM($F29:$F35)","v":0.60416666666666807},{"$f":"G29+G30+G31+G32+G33+G34+G35","v":0},null,null,{"$f":"SUM(J29:J35)","v":1.364583333333333},{"$f":"K29+K30+K31+K32+K33+K34+K35","v":0},{"$f":"SUM(L29:L35)","v":1.9687500000000013},{"$f":"SUM(M29:M35)","v":0},null,{"$f":"SUM(O29:O35)","v":1}]
[null,{"$f":"B35+1","v":"2014-12-29"},null,0.48958333333333298,0.625,{"$f":"$E37-$D37+IF($D37>$E37,1)","v":0.13541666666666702},{"$f":"IF($D37<>\"\",IF($D37<Données!$C$2,1,0),0)","v":0},0.78125,0,{"$f":"$I37-$H37+IF($H37>$I37,1)","v":0.21875},{"$f":"IF($H37<>\"\",IF($H37<Données!$C$3,1,0),0)","v":0},{"$f":"$F37+$J37-($G37+$K37)*(\"00:30\")","v":0.35416666666666702},{"$f":"$G37+$K37","v":0},{"$f":"$D37-$I35+IF($I35>$D37,1)","v":0.46874999999999967},{"$f":"IF($N37=Données!$F$12,0,IF($N37<Données!$F$11,1,0))","v":0},null,null,null,"Différence:"]
[null,{"$f":"B37+1","v":"2014-12-30"},null,0.48958333333333298,0.64583333333333304,{"$f":"$E38-$D38+IF($D38>$E38,1)","v":0.15625000000000006},{"$f":"IF($D38<>\"\",IF($D38<Données!$C$2,1,0),0)","v":0},0.78125,0,{"$f":"$I38-$H38+IF($H38>$I38,1)","v":0.21875},{"$f":"IF($H38<>\"\",IF($H38<Données!$C$3,1,0),0)","v":0},{"$f":"$F38+$J38-($G38+$K38)*(\"00:30\")","v":0.37500000000000006},{"$f":"$G38+$K38","v":0},{"$f":"$D38-$I37+IF($I37>$D38,1)","v":0.48958333333333298},{"$f":"IF($N38=Données!$F$12,0,IF($N38<Données!$F$11,1,0))","v":0}]
[null,{"$f":"B38+1","v":"2014-12-31"},null,null,null,0,{"$f":"IF($D39<>\"\",IF($D39<Données!$C$2,1,0),0)","v":0},null,null,0,{"$f":"IF($H39<>\"\",IF($H39<Données!$C$3,1,0),0)","v":0},0,0,{"$f":"$D39-$I38+IF($I38>$D39,1)","v":0},{"$f":"IF($N39=Données!$F$12,0,IF($N39<Données!$F$11,1,0))","v":0},null,null,null,"Dont :","-",{"$f":"$U31-$U23+IF($U23>$U31,1)","v":0.75694444444444375},"Heures à taux normal"]
[null,"2015-01-01",null,null,null,0,{"$f":"IF($D40<>\"\",IF($D40<Données!$C$2,1,0),0)","v":0},null,null,0,{"$f":"IF($H40<>\"\",IF($H40<Données!$C$3,1,0),0)","v":0},0,0,0,{"$f":"IF($N40=Données!$F$12,0,IF($N40<Données!$F$11,1,0))","v":0},null,null,null,null,"-",{"$f":"$U32-$U24+IF($U24>$U32,1)","v":9.583333333333266E-2},"Heures en HS 10%"]
[null,"2015-01-02",null,null,null,0,{"$f":"IF($D41<>\"\",IF($D41<Données!$C$2,1,0),0)","v":0},null,null,0,{"$f":"IF($H41<>\"\",IF($H41<Données!$C$3,1,0),0)","v":0},0,0,0,{"$f":"IF($N41=Données!$F$12,0,IF($N41<Données!$F$11,1,0))","v":0},null,null,null,null,"-",{"$f":"$U33-$U25+IF($U25>$U33,1)","v":0.83333333333333326},"Heures en HS 20%"]
[null,"2015-01-03",null,null,null,0,{"$f":"IF($D42<>\"\",IF($D42<Données!$C$2,1,0),0)","v":0},null,null,0,{"$f":"IF($H42<>\"\",IF($H42<Données!$C$3,1,0),0)","v":0},0,0,0,{"$f":"IF($N42=Données!$F$12,0,IF($N42<Données!$F$11,1,0))","v":0},null,null,null,null,"-",{"$f":"$U34-$U26+IF($U26>$U34,1)","v":0.82291666666666541},"Heures en HS 40%"]
[null,"2015-01-04",null,null,null,0,{"$f":"IF($D43<>\"\",IF($D43<Données!$C$2,1,0),0)","v":0},null,null,0,{"$f":"IF($H43<>\"\",IF($H43<Données!$C$3,1,0),0)","v":0},0,0,0,{"$f":"IF($N43=Données!$F$12,0,IF($N43<Données!$F$11,1,0))","v":0},null,null,null,null,"-",{"$f":"SUM(U35-U27)","v":0},"Nombre de repas"]
[null,"Total Semaine",null,null,{"$f":"WEEKNUM(B37,21)","v":1},{"$f":"SUM($F37:$F43)","v":0.29166666666666707},{"$f":"G37+G38+G39+G40+G41+G42+G43","v":0},null,null,{"$f":"SUM(J37:J43)","v":0.4375},{"$f":"K37+K38+K39+K40+K41+K42+K43","v":0},{"$f":"SUM(L37:L43)","v":0.72916666666666707},{"$f":"SUM(M37:M43)","v":0},null,{"$f":"SUM(O37:O43)","v":0}]
[null,{"$f":"B43+1","v":"2015-01-05"},null,null,null,{"$f":"$E45-$D45+IF($D45>$E45,1)","v":0},{"$f":"IF($D45<>\"\",IF($D45<Données!$C$2,1,0),0)","v":0},null,null,{"$f":"$I45-$H45+IF($H45>$I45,1)","v":0},{"$f":"IF($H45<>\"\",IF($H45<Données!$C$3,1,0),0)","v":0},{"$f":"$F45+$J45-($G45+$K45)*(\"00:30\")","v":0},{"$f":"$G45+$K45","v":0},{"$f":"$D45-$I43+IF($I43>$D45,1)","v":0},{"$f":"IF($N45=Données!$F$12,0,IF($N45<Données!$F$11,1,0))","v":0}]
[null,{"$f":"B45+1","v":"2015-01-06"},null,null,null,0,{"$f":"IF($D46<>\"\",IF($D46<Données!$C$2,1,0),0)","v":0},null,null,{"$f":"$I46-$H46+IF($H46>$I46,1)","v":0},{"$f":"IF($H46<>\"\",IF($H46<Données!$C$3,1,0),0)","v":0},{"$f":"$F46+$J46-($G46+$K46)*(\"00:30\")","v":0},{"$f":"$G46+$K46","v":0},{"$f":"$D46-$I45+IF($I45>$D46,1)","v":0},{"$f":"IF($N46=Données!$F$12,0,IF($N46<Données!$F$11,1,0))","v":0}]
[null,{"$f":"B46+1","v":"2015-01-07"},null,null,null,0,{"$f":"IF($D47<>\"\",IF($D47<Données!$C$2,1,0),0)","v":0},null,null,0,{"$f":"IF($H47<>\"\",IF($H47<Données!$C$3,1,0),0)","v":0},0,0,{"$f":"$D47-$I46+IF($I46>$D47,1)","v":0},{"$f":"IF($N47=Données!$F$12,0,IF($N47<Données!$F$11,1,0))","v":0}]
[null,"2015-01-08",null,null,null,0,{"$f":"IF($D48<>\"\",IF($D48<Données!$C$2,1,0),0)","v":0},null,null,0,{"$f":"IF($H48<>\"\",IF($H48<Données!$C$3,1,0),0)","v":0},0,0,0,{"$f":"IF($N48=Données!$F$12,0,IF($N48<Données!$F$11,1,0))","v":0}]
[null,"2015-01-09",null,null,null,0,{"$f":"IF($D49<>\"\",IF($D49<Données!$C$2,1,0),0)","v":0},null,null,0,{"$f":"IF($H49<>\"\",IF($H49<Données!$C$3,1,0),0)","v":0},0,0,0,{"$f":"IF($N49=Données!$F$12,0,IF($N49<Données!$F$11,1,0))","v":0}]
[null,"2015-01-10",null,null,null,0,{"$f":"IF($D50<>\"\",IF($D50<Données!$C$2,1,0),0)","v":0},null,null,0,{"$f":"IF($H50<>\"\",IF($H50<Données!$C$3,1,0),0)","v":0},0,0,0,{"$f":"IF($N50=Données!$F$12,0,IF($N50<Données!$F$11,1,0))","v":0}]
[null,"2015-01-11",null,null,null,0,{"$f":"IF($D51<>\"\",IF($D51<Données!$C$2,1,0),0)","v":0},null,null,0,{"$f":"IF($H51<>\"\",IF($H51<Données!$C$3,1,0),0)","v":0},0,0,0,{"$f":"IF($N51=Données!$F$12,0,IF($N51<Données!$F$11,1,0))","v":0}]
[null,"Total semaine",null,null,{"$f":"WEEKNUM(B45,21)","v":2},{"$f":"SUM($F45:$F51)","v":0},{"$f":"G45+G46+G47+G48+G49+G50+G51","v":0},null,null,{"$f":"SUM(J45:J51)","v":0},{"$f":"K45+K46+K47+K48+K49+K50+K51","v":0},{"$f":"SUM(L45:L51)","v":0},{"$f":"SUM(M45:M51)","v":0},null,{"$f":"SUM(O45:O51)","v":0}]
[null,null,null,null,null,null,null,null,null,null,null,null,null,7.041666666666667]
[null,null,null,null,null,null,null,null,null,null,null,{"$f":"CodeCouleur(M54)","v":50},null,"REPOS"]
[null,null,null,null,null,null,null,null,null,null,null,{"$f":"CodeCouleur(M55)","v":42},null,"Récup"]
[null,null,null,null,null,null,null,null,null,null,null,48,null,"JFG"]
[null,null,null,null,null,null,null,null,null,null,null,44,null,"VAC"]
[null,null,null,null,null,null,null,null,null,null,null,3,null,"MAL"]
[null,null,null,null,null,null,null,null,null,null,null,{"$f":"CodeCouleur(M59)","v":40},null,"Jf Taf"]
["Heures",null,1.4583333333333333,1.625,1.7916666666666667,"Total"]
["Taux",1,1.1000000000000001,1.2,1.4]
["S 1",{"$f":"IF($L$12<=$C$60,$L$12,$C$60)","v":1.4583333333333333},{"$f":"IF($L$12<=$C$60,0,IF($L$12<=$D$60,$L$12,$D$60)-$C$60)","v":0.15625000000000022},{"$f":"IF($L$12<=$D$60,0,IF($L$12<=$E$60,$L$12,$D$60)-$C$60)","v":0},{"$f":"IF($L$12<=$E$60,0,IF($L$12>$E$60,$L$12,$E$60)-$E$60)","v":0},{"$f":"B62+C62+D62+E62","v":1.6145833333333335}]
["S 2",{"$f":"IF($L$20<=$C$60,$L$20,$C$60)","v":1.4583333333333333},{"$f":"IF($L$20<=$C$60,0,IF($L$20<=$D$60,$L$20,$D$60)-$C$60)","v":0.15625000000000022},{"$f":"IF($L$20<=$D$60,0,IF($L$20<=$E$60,$L$20,$D$60)-$C$60)","v":0},{"$f":"IF($L$20<=$E$60,0,IF($L$20>$E$60,$L$20,$E$60)-$E$60)","v":0},1.6145833333333335]
["S 3",{"$f":"IF($L$28<=$C$60,$L$28,$C$60)","v":1.4583333333333333},{"$f":"IF($L$28<=$C$60,0,IF($L$28<=$D$60,$L$28,$D$60)-$C$60)","v":0.15625000000000022},{"$f":"IF($L$28<=$D$60,0,IF($L$28<=$E$60,$L$28,$D$60)-$C$60)","v":0},{"$f":"IF($L$28<=$E$60,0,IF($L$28>$E$60,$L$28,$E$60)-$E$60)","v":0},1.6145833333333335]
["S 4",{"$f":"IF($L$36<=$C$60,$L$36,$C$60)","v":1.4583333333333333},{"$f":"IF($L$36<=$C$60,0,IF($L$36<=$D$60,$L$36,$D$60)-$C$60)","v":0.16666666666666674},{"$f":"IF($L$36<=$D$60,0,IF($L$36<=$E$60,$L$36,$D$60)-$C$60)","v":0.16666666666666674},{"$f":"IF($L$36<=$E$60,0,IF($L$36>$E$60,$L$36,$E$60)-$E$60)","v":0.17708333333333459},1.9687500000000013]
["S 5",{"$f":"IF($L$44<=$C$60,$L$44,$C$60)","v":0.72916666666666707},{"$f":"IF($L$44<=$C$60,0,IF($L$44<=$D$60,$L$44,$D$60)-$C$60)","v":0},{"$f":"IF($L$44<=$D$60,0,IF($L$44<=$E$60,$L$44,$D$60)-$C$60)","v":0},{"$f":"IF($L$44<=$E$60,0,IF($L$44>$E$60,$L$44,$E$60)-$E$60)","v":0},0.72916666666666707]
["S 6",{"$f":"IF($L$52<=$C$60,$L$52,$C$60)","v":0},{"$f":"IF($L$52<=$C$60,0,IF($L$52<=$D$60,$L$52,$D$60)-$C$60)","v":0},{"$f":"IF($L$52<=$D$60,0,IF($L$52<=$E$60,$L$52,$D$60)-$C$60)","v":0},{"$f":"IF($L$52<=$E$60,0,IF($L$52>$E$60,$L$52,$E$60)-$E$60)","v":0},0]
["Total",{"$f":"SUM(B62:B67)","v":6.5625},{"$f":"SUM(C62:C67)","v":0.63541666666666741},{"$f":"SUM(D62:D67)","v":0.16666666666666674},{"$f":"SUM(E62:E67)","v":0.17708333333333459},7.5416666666666696]
[]
[]
["Jours","Repos","Récup","Jfg","Vac","Mal","Vides","Taf","Jf Taf","<11h"]
["S 1",{"$f":"NbCellsCoul($D$5:$I$11,50)*0.25","v":2},{"$f":"NbCellsCoul($D$5:$I$11,42)*0.25","v":0},{"$f":"NbCellsCoul($D$5:$I$11,48)*0.25","v":0},{"$f":"NbCellsCoul($D$5:$I$11,44)*0.25","v":5},{"$f":"NbCellsCoul($D$5:$I$11,3)*0.25","v":0},{"$f":"+COUNTBLANK(E5:H11)/2","v":7},{"$f":"7-$G72","v":0},{"$f":"NbCellsCoul($D$5:$I$11,40)*0.25","v":0},{"$f":"SUM($O$6:$O$11)","v":0}]
["S 2",{"$f":"NbCellsCoul($D$13:$I$19,50)*0.25","v":2},{"$f":"NbCellsCoul($D$13:$I$19,42)*0.25","v":0},{"$f":"NbCellsCoul($D$13:$I$19,48)*0.25","v":0},{"$f":"NbCellsCoul($D$13:$I$19,44)*0.25","v":5},{"$f":"NbCellsCoul($D$13:$I$19,3)*0.25","v":0},{"$f":"+COUNTBLANK(E13:H19)/2","v":7},0,{"$f":"NbCellsCoul($D$13:$I$19,40)*0.25","v":0},{"$f":"SUM($O$13:$O$19)","v":0}]
["S 3",{"$f":"NbCellsCoul($D$21:$I$27,50)*0.25","v":2},{"$f":"NbCellsCoul($D$21:$I$27,42)*0.25","v":0},{"$f":"NbCellsCoul($D$21:$I$27,48)*0.25","v":0},{"$f":"NbCellsCoul($D$21:$I$27,44)*0.25","v":5},{"$f":"NbCellsCoul($D$21:$I$27,3)*0.25","v":0},{"$f":"+COUNTBLANK(E21:H27)/2","v":7},0,{"$f":"NbCellsCoul($D$21:$I$27,40)*0.25","v":0},{"$f":"SUM($O$21:$O$27)","v":0}]
["S 4",{"$f":"NbCellsCoul($D$29:$I$35,50)*0.25","v":2},{"$f":"NbCellsCoul($D$29:$I$35,42)*0.25","v":0},{"$f":"NbCellsCoul($D$29:$I$35,48)*0.25","v":0},{"$f":"NbCellsCoul($D$29:$I$35,44)*0.25","v":0},{"$f":"NbCellsCoul($D$29:$I$35,3)*0.25","v":0},{"$f":"+COUNTBLANK(E29:H35)/2","v":2},5,{"$f":"NbCellsCoul($D$29:$I$35,40)*0.25","v":0},{"$f":"SUM($O$29:$O$35)","v":1}]
["S 5",{"$f":"NbCellsCoul($D$37:$I$43,50)*0.25","v":0},{"$f":"NbCellsCoul($D$37:$I$43,42)*0.25","v":0},{"$f":"NbCellsCoul($D$37:$I$43,48)*0.25","v":0},{"$f":"NbCellsCoul($D$37:$I$43,44)*0.25","v":0},{"$f":"NbCellsCoul($D$37:$I$43,3)*0.25","v":0},{"$f":"+COUNTBLANK(E37:H43)/2","v":5},2,{"$f":"NbCellsCoul($D$37:$I$43,40)*0.25","v":0},{"$f":"SUM($O$37:$O$43)","v":0}]
["S 6",{"$f":"NbCellsCoul($D$45:$I$51,50)*0.25","v":0},{"$f":"NbCellsCoul($D$45:$I$51,42)*0.25","v":0},{"$f":"NbCellsCoul($D$45:$I$51,48)*0.25","v":0},{"$f":"NbCellsCoul($D$45:$I$51,44)*0.25","v":0},{"$f":"NbCellsCoul($D$45:$I$51,3)*0.25","v":0},{"$f":"+COUNTBLANK(E45:H51)/2","v":7},0,{"$f":"NbCellsCoul($D$45:$I$51,40)*0.25","v":0},{"$f":"SUM($O$45:$O$51)","v":0}]
["Total",{"$f":"SUM(B$72:B$77)","v":8},0,0,15,{"$f":"SUM(F$72:F$77)","v":0},{"$f":"SUM(G$72:G$77)","v":35},{"$f":"SUM(H$72:H$77)","v":7},{"$f":"SUM(I$72:I$77)","v":0},{"$f":"SUM(J$72:J$77)","v":1}]

{"sheet":"Oct 14","index":12,"n_rows":78,"n_cols":36,"rows_kept":78,"cut":false,"hidden":false,"merged":[[50,1,50,2],[51,1,51,3],[59,0,59,1],[108,5,108,8],[44,1,44,2],[45,1,45,2],[46,1,46,2],[47,1,47,2],[48,1,48,2],[49,1,49,2],[43,1,43,3],[32,1,32,2],[33,1,33,2],[34,1,34,2],[35,1,35,3],[36,1,36,2],[37,1,37,2],[38,1,38,2],[39,1,39,2],[40,1,40,2],[41,1,41,2],[42,1,42,2],[31,1,31,2],[20,1,20,2],[21,1,21,2],[22,1,22,2],[23,1,23,2],[24,1,24,2],[25,1,25,2],[26,1,26,2],[27,1,27,3],[28,1,28,2],[29,1,29,2],[30,1,30,2],[19,1,19,3],[8,1,8,2],[9,1,9,2],[10,1,10,2],[11,1,11,3],[12,1,12,2],[13,1,13,2],[14,1,14,2],[15,1,15,2],[16,1,16,2],[17,1,17,2],[18,1,18,2],[7,1,7,2],[0,3,0,9],[0,18,0,21],[0,30,0,32],[2,1,3,2],[2,3,2,4],[2,5,3,5],[2,6,3,6],[2,7,2,8],[2,9,3,9],[2,10,3,10],[2,11,3,11],[2,12,3,12],[4,1,4,2],[5,1,5,2],[6,1,6,2]]}
[null,null,null,"TEMPS DE TRAVAIL",null,null,null,null,null,null,null,null,null,null,null,null,null,null,"RÉCAPITULATIF",null,null,null,null,null,null,null,null,null,null,null,"IMPÔTS"]
[null,null,null,null,null,{"$f":"Données!G14","v":12},null,null,null,{"$f":"Données!C15","v":2014}]
[null,"Jour",null,"Midi",null,"Cumul Midi","Repas","Soir",null,"Cumul Soir","Repas","Totaux","Total Repas"]
[null,null,null,"Début","Fin",null,null,"Début","Fin",null,null,null,null,null,null,null,null,null,null,null,null,null,null,null,null,null,null,null,null,null,null,{"$f":"VLOOKUP(F2,Données!E15:F26,2)","v":"Décembre"},{"$f":"J2","v":2014}]
[null,{"$f":"Données!I15-WEEKDAY(Données!I15-1)+1","v":"2014-12-01"},null,null,null,{"$f":"$E5-$D5+IF($D5>$E5,1)","v":0},{"$f":"IF($D5<>\"\",IF($D5<Données!$C$2,1,0),0)","v":0},null,null,{"$f":"$I5-$H5+IF($H5>$I5,1)","v":0},{"$f":"IF($H5<>\"\",IF($H5<Données!$C$3,1,0),0)","v":0},{"$f":"$F5+$J5-($G5+$K5)*(\"00:30\")","v":0},{"$f":"$G5+$K5","v":0}]
[null,{"$f":"B5+1","v":"2014-12-02"},null,null,null,{"$f":"$E6-$D6+IF($D6>$E6,1)","v":0},{"$f":"IF($D6<>\"\",IF($D6<Données!$C$2,1,0),0)","v":0},null,null,{"$f":"$I6-$H6+IF($H6>$I6,1)","v":0},{"$f":"IF($H6<>\"\",IF($H6<Données!$C$3,1,0),0)","v":0},{"$f":"$F6+$J6-($G6+$K6)*(\"00:30\")","v":0},{"$f":"$G6+$K6","v":0},{"$f":"$D6-$I5+IF($I5>$D6,1)","v":0},{"$f":"IF($N6=Données!$F$12,0,IF($N6<Données!$F$11,1,0))","v":0},null,null,null,"Soit au total pour le mois de :",null,{"$f":"VLOOKUP(F2,Données!E15:F26,2)","v":"Décembre"},{"$f":"J2","v":2014}]
[null,{"$f":"B6+1","v":"2014-12-03"},null,null,null,0,{"$f":"IF($D7<>\"\",IF($D7<Données!$C$2,1,0),0)","v":0},null,null,0,{"$f":"IF($H7<>\"\",IF($H7<Données!$C$3,1,0),0)","v":0},0,0,{"$f":"$D7-$I6+IF($I6>$D7,1)","v":0},{"$f":"IF($N7=Données!$F$12,0,IF($N7<Données!$F$11,1,0))","v":0}]
[null,"2014-12-04",null,null,null,0,{"$f":"IF($D8<>\"\",IF($D8<Données!$C$2,1,0),0)","v":0},null,null,0,{"$f":"IF($H8<>\"\",IF($H8<Données!$C$3,1,0),0)","v":0},0,0,{"$f":"$D8-$I7+IF($I7>$D8,1)","v":0},{"$f":"IF($N8=Données!$F$12,0,IF($N8<Données!$F$11,1,0))","v":0},null,null,null,null,null,null,null,null,null,null,null,null,null,null,null,"Numéro Fiscal :"]
[null,"2014-12-05",null,0.48958333333333298,0.66666666666666696,0.17708333333333398,{"$f":"IF($D9<>\"\",IF($D9<Données!$C$2,1,0),0)","v":0},0.78125,4.1666666666666664E-2,0.26041666666666663,{"$f":"IF($H9<>\"\",IF($H9<Données!$C$3,1,0),0)","v":0},0.43750000000000061,0,0.48958333333333298,{"$f":"IF($N9=Données!$F$12,0,IF($N9<Données!$F$11,1,0))","v":0},null,null,null,"Nombre de jours travaillés :",null,{"$f":"H78","v":21},null,null,null,null,null,null,null,null,null,"MDP:"]
[null,"2014-12-06",null,0.48958333333333298,0.64583333333333304,0.15625000000000006,{"$f":"IF($D10<>\"\",IF($D10<Données!$C$2,1,0),0)","v":0},0.78125,7.2916666666666671E-2,0.29166666666666663,{"$f":"IF($H10<>\"\",IF($H10<Données!$C$3,1,0),0)","v":0},0.44791666666666669,0,{"$f":"$D10-$I9+IF($I9>$D10,1)","v":0.4479166666666663},{"$f":"IF($N10=Données!$F$12,0,IF($N10<Données!$F$11,1,0))","v":1},null,null,null,"Nombre de jours repos :",null,{"$f":"B78","v":10}]
[null,"2014-12-07",null,0.48958333333333298,0.66666666666666696,0.17708333333333398,{"$f":"IF($D11<>\"\",IF($D11<Données!$C$2,1,0),0)","v":0},0.78125,2.0833333333333332E-2,0.23958333333333337,{"$f":"IF($H11<>\"\",IF($H11<Données!$C$3,1,0),0)","v":0},0.41666666666666735,0,{"$f":"$D11-$I10+IF($I10>$D11,1)","v":0.4166666666666663},{"$f":"IF($N11=Données!$F$12,0,IF($N11<Données!$F$11,1,0))","v":1},null,null,null,"Nombre de jours récup :",null,{"$f":"C$78","v":0},null,null,null,null,null,null,null,null,null,"Adresse domicile:","-"]
[null,"Total Semaine",null,null,{"$f":"WEEKNUM(B5,21)","v":49},{"$f":"SUM($F5:$F11)","v":0.51041666666666807},{"$f":"G5+G6+G7+G8+G9+G10+G11","v":0},null,null,{"$f":"SUM(J5:J11)","v":0.79166666666666663},{"$f":"K5+K6+K7+K8+K9+K10+K11","v":0},{"$f":"SUM(L5:L11)","v":1.3020833333333346},{"$f":"SUM(M5:M11)","v":0},null,{"$f":"SUM(O6:O11)","v":2},null,null,null,"Nombre de jfg :",null,{"$f":"D$78","v":0}]
[null,{"$f":"B11+1","v":"2014-12-08"},null,0.48958333333333298,0.64583333333333304,{"$f":"$E13-$D13+IF($D13>$E13,1)","v":0.15625000000000006},{"$f":"IF($D13<>\"\",IF($D13<Données!$C$2,1,0),0)","v":0},0.78125,4.1666666666666664E-2,{"$f":"$I13-$H13+IF($H13>$I13,1)","v":0.26041666666666663},{"$f":"IF($H13<>\"\",IF($H13<Données!$C$3,1,0),0)","v":0},{"$f":"$F13+$J13-($G13+$K13)*(\"00:30\")","v":0.41666666666666669},{"$f":"$G13+$K13","v":0},{"$f":"$D13-$I11+IF($I11>$D13,1)","v":0.46874999999999967},{"$f":"IF($N13=Données!$F$12,0,IF($N13<Données!$F$11,1,0))","v":0},null,null,null,"Nombre de jours de vacances :",null,{"$f":"E$78","v":0}]
[null,{"$f":"B13+1","v":"2014-12-09"},null,0.48958333333333298,0.625,{"$f":"$E14-$D14+IF($D14>$E14,1)","v":0.13541666666666702},{"$f":"IF($D14<>\"\",IF($D14<Données!$C$2,1,0),0)","v":0},0.78125,0.95833333333333304,{"$f":"$I14-$H14+IF($H14>$I14,1)","v":0.17708333333333304},{"$f":"IF($H14<>\"\",IF($H14<Données!$C$3,1,0),0)","v":0},{"$f":"$F14+$J14-($G14+$K14)*(\"00:30\")","v":0.31250000000000006},{"$f":"$G14+$K14","v":0},{"$f":"$D14-$I13+IF($I13>$D14,1)","v":0.4479166666666663},{"$f":"IF($N14=Données!$F$12,0,IF($N14<Données!$F$11,1,0))","v":1},null,null,null,"Nombre de jours de maladie :",null,{"$f":"F$78","v":0}]
[null,{"$f":"B14+1","v":"2014-12-10"},null,null,null,0,{"$f":"IF($D15<>\"\",IF($D15<Données!$C$2,1,0),0)","v":0},null,null,0,{"$f":"IF($H15<>\"\",IF($H15<Données!$C$3,1,0),0)","v":0},0,0,0,{"$f":"IF($N15=Données!$F$12,0,IF($N15<Données!$F$11,1,0))","v":0},null,null,null,"Nombre jours fériées travaillés :",null,{"$f":"I78","v":0},null,null,null,null,null,null,null,null,null,"Adresse lieu de travail:","-"]
[null,"2014-12-11",null,null,null,0,{"$f":"IF($D16<>\"\",IF($D16<Données!$C$2,1,0),0)","v":0},null,null,0,{"$f":"IF($H16<>\"\",IF($H16<Données!$C$3,1,0),0)","v":0},0,0,{"$f":"$D16-$I15+IF($I15>$D16,1)","v":0},{"$f":"IF($N16=Données!$F$12,0,IF($N16<Données!$F$11,1,0))","v":0},null,null,null,"Nombre de fois 11h de batement non respecté :",null,{"$f":"J78","v":5}]
[null,"2014-12-12",null,0.48958333333333298,0.625,0.13541666666666702,{"$f":"IF($D17<>\"\",IF($D17<Données!$C$2,1,0),0)","v":0},0.78125,4.1666666666666664E-2,0.26041666666666663,{"$f":"IF($H17<>\"\",IF($H17<Données!$C$3,1,0),0)","v":0},0.39583333333333365,0,0.48958333333333298,{"$f":"IF($N17=Données!$F$12,0,IF($N17<Données!$F$11,1,0))","v":0}]
[null,"2014-12-13",null,0.48958333333333298,0.66666666666666696,0.17708333333333398,{"$f":"IF($D18<>\"\",IF($D18<Données!$C$2,1,0),0)","v":0},0.83333333333333304,1.0416666666666666E-2,0.17708333333333359,{"$f":"IF($H18<>\"\",IF($H18<Données!$C$3,1,0),0)","v":0},0.35416666666666757,0,0.4479166666666663,{"$f":"IF($N18=Données!$F$12,0,IF($N18<Données!$F$11,1,0))","v":1},null,null,null,null,null,null,null,null,null,null,null,null,null,null,null,"Distance ( Source Mappy) :","-","7,4 KM"]
[null,"2014-12-14",null,0.48958333333333298,0.66666666666666696,0.17708333333333398,{"$f":"IF($D19<>\"\",IF($D19<Données!$C$2,1,0),0)","v":0},0.78125,0.98958333333333304,0.20833333333333304,{"$f":"IF($H19<>\"\",IF($H19<Données!$C$3,1,0),0)","v":0},0.38541666666666702,0,0.4791666666666663,{"$f":"IF($N19=Données!$F$12,0,IF($N19<Données!$F$11,1,0))","v":0},null,null,null,null,null,{"$f":"SUM(L12+L20+L28+L36+L44+L52)","v":7.9375000000000089},"Heures effectués"]
[null,"Total Semaine",null,null,{"$f":"WEEKNUM(B13,21)","v":50},{"$f":"SUM($F13:$F19)","v":0.781250000000002},{"$f":"G13+G14+G15+G16+G17+G18+G19","v":0},null,null,{"$f":"SUM(J13:J19)","v":1.083333333333333},{"$f":"K13+K14+K15+K16+K17+K18+K19","v":0},{"$f":"SUM(L13:L19)","v":1.864583333333335},{"$f":"SUM(M13:M19)","v":0},null,{"$f":"SUM(O13:O19)","v":2},null,null,null,null,null,{"$f":"IF(U19<N53,\"- \"&TEXT(ABS(N53-U19),\"[hh]:mm\"),U19-N53)","v":0.89583333333334192},"Heures dues/supp",null,null,null,null,null,null,null,null,"Nombre Aller-Retour :","-",{"$f":"COUNT(E5:E11,I5:I11,E13:E19,I13:I19,E21:E27,I21:I27,E29:E35,I29:I35,E37:E43,I37:I43,E45:E51,I45:I51)","v":42}]
[null,{"$f":"B19+1","v":"2014-12-15"},null,0.48958333333333298,0.625,{"$f":"$E21-$D21+IF($D21>$E21,1)","v":0.13541666666666702},{"$f":"IF($D21<>\"\",IF($D21<Données!$C$2,1,0),0)","v":0},0.78125,0,{"$f":"$I21-$H21+IF($H21>$I21,1)","v":0.21875},{"$f":"IF($H21<>\"\",IF($H21<Données!$C$3,1,0),0)","v":0},{"$f":"$F21+$J21-($G21+$K21)*(\"00:30\")","v":0.35416666666666702},{"$f":"$G21+$K21","v":0},{"$f":"$D21-$I19+IF($I19>$D21,1)","v":0.5},{"$f":"IF($N21=Données!$F$12,0,IF($N21<Données!$F$11,1,0))","v":0},null,null,null,null,null,null,null,null,null,null,null,null,null,null,null,"Km Parcourue :","-",{"$f":"SUM(AG20*14.8)","v":621.6},"Km"]
[null,{"$f":"B21+1","v":"2014-12-16"},null,0.48958333333333298,0.625,{"$f":"$E22-$D22+IF($D22>$E22,1)","v":0.13541666666666702},{"$f":"IF($D22<>\"\",IF($D22<Données!$C$2,1,0),0)","v":0},0.78125,4.1666666666666664E-2,{"$f":"$I22-$H22+IF($H22>$I22,1)","v":0.26041666666666663},{"$f":"IF($H22<>\"\",IF($H22<Données!$C$3,1,0),0)","v":0},{"$f":"$F22+$J22-($G22+$K22)*(\"00:30\")","v":0.39583333333333365},{"$f":"$G22+$K22","v":0},{"$f":"$D22-$I21+IF($I21>$D22,1)","v":0.48958333333333298},{"$f":"IF($N22=Données!$F$12,0,IF($N22<Données!$F$11,1,0))","v":0},null,null,null,null,null,null,null,null,null,null,null,null,null,null,null,"Horodateur Payé :","-",24.4]
[null,{"$f":"B22+1","v":"2014-12-17"},null,null,null,0,{"$f":"IF($D23<>\"\",IF($D23<Données!$C$2,1,0),0)","v":0},null,null,0,{"$f":"IF($H23<>\"\",IF($H23<Données!$C$3,1,0),0)","v":0},0,0,{"$f":"$D23-$I22+IF($I22>$D23,1)","v":0.95833333333333337},{"$f":"IF($N23=Données!$F$12,0,IF($N23<Données!$F$11,1,0))","v":0},null,null,null,"Dont :","-",{"$f":"$B$68","v":6.7812500000000018},"Heures à taux normal ( 35h )",null,null,null,null,null,null,null,null,"Achat divers pour le travail :","-"]
[null,"2014-12-18",null,null,null,0,{"$f":"IF($D24<>\"\",IF($D24<Données!$C$2,1,0),0)","v":0},null,null,0,{"$f":"IF($H24<>\"\",IF($H24<Données!$C$3,1,0),0)","v":0},0,0,0,{"$f":"IF($N24=Données!$F$12,0,IF($N24<Données!$F$11,1,0))","v":0},null,null,null,null,"-",{"$f":"$C$68","v":0.50000000000000022},"Heures en HS 10%         ( 35h à 39h )",null,null,null,null,null,null,null,null,null,"-",null,null,null,{"$f":"NbCellsCoul($D$5:$I$11,50)*0.25","v":2}]
[null,"2014-12-19",null,0.48958333333333298,0.64583333333333304,0.15625000000000006,{"$f":"IF($D25<>\"\",IF($D25<Données!$C$2,1,0),0)","v":0},0.78125,6.25E-2,0.28125,{"$f":"IF($H25<>\"\",IF($H25<Données!$C$3,1,0),0)","v":0},0.43750000000000006,0,0.48958333333333298,{"$f":"IF($N25=Données!$F$12,0,IF($N25<Données!$F$11,1,0))","v":0},null,null,null,null,"-",{"$f":"$D$68","v":0.48958333333333348},"Heures en HS 20%         (39h à 43h )",null,null,null,null,null,null,null,null,null,"-"]
[null,"2014-12-20",null,0.48958333333333298,0.6875,0.19791666666666702,{"$f":"IF($D26<>\"\",IF($D26<Données!$C$2,1,0),0)","v":0},0.78125,2.0833333333333332E-2,0.23958333333333337,{"$f":"IF($H26<>\"\",IF($H26<Données!$C$3,1,0),0)","v":0},0.43750000000000039,0,0.42708333333333298,{"$f":"IF($N26=Données!$F$12,0,IF($N26<Données!$F$11,1,0))","v":1},null,null,null,null,"-",{"$f":"$E$68","v":0.16666666666667052},"Heures en HS 40%         ( 43h et plus )",null,null,null,null,null,null,null,null,null,"-"]
[null,"2014-12-21",null,0.48958333333333298,0.60416666666666696,0.11458333333333398,{"$f":"IF($D27<>\"\",IF($D27<Données!$C$2,1,0),0)","v":0},0.83333333333333304,0.97916666666666696,0.14583333333333393,{"$f":"IF($H27<>\"\",IF($H27<Données!$C$3,1,0),0)","v":0},0.26041666666666791,0,0.46874999999999967,{"$f":"IF($N27=Données!$F$12,0,IF($N27<Données!$F$11,1,0))","v":0},null,null,null,null,"-",{"$f":"SUM(M12+M20+M28+M36+M44+M52)","v":0},"Nombre de repas",null,null,null,null,null,null,null,null,null,"-"]
[null,"Total Semaine",null,null,{"$f":"WEEKNUM(B21,21)","v":51},{"$f":"SUM($F21:$F27)","v":0.73958333333333504},{"$f":"G21+G22+G23+G24+G25+G26+G27","v":0},null,null,{"$f":"SUM(J21:J27)","v":1.1458333333333339},{"$f":"K21+K22+K23+K24+K25+K26+K27","v":0},{"$f":"SUM(L21:L27)","v":1.885416666666669},{"$f":"SUM(M21:M27)","v":0},null,{"$f":"SUM(O21:O27)","v":1},null,null,null,null,null,null,null,null,null,null,null,null,null,null,null,null,"-"]
[null,{"$f":"B27+1","v":"2014-12-22"},null,0.48958333333333298,0.625,{"$f":"$E29-$D29+IF($D29>$E29,1)","v":0.13541666666666702},{"$f":"IF($D29<>\"\",IF($D29<Données!$C$2,1,0),0)","v":0},0.78125,1.0416666666666666E-2,{"$f":"$I29-$H29+IF($H29>$I29,1)","v":0.22916666666666663},{"$f":"IF($H29<>\"\",IF($H29<Données!$C$3,1,0),0)","v":0},{"$f":"$F29+$J29-($G29+$K29)*(\"00:30\")","v":0.36458333333333365},{"$f":"$G29+$K29","v":0},{"$f":"$D29-$I27+IF($I27>$D29,1)","v":0.51041666666666607},{"$f":"IF($N29=Données!$F$12,0,IF($N29<Données!$F$11,1,0))","v":0},null,null,null,"Heure fiche de paie:",null,null,null,null,null,null,null,null,null,null,null,null,"-"]
[null,{"$f":"B29+1","v":"2014-12-23"},null,0.48958333333333298,0.625,{"$f":"$E30-$D30+IF($D30>$E30,1)","v":0.13541666666666702},{"$f":"IF($D30<>\"\",IF($D30<Données!$C$2,1,0),0)","v":0},0.78125,0.98958333333333304,{"$f":"$I30-$H30+IF($H30>$I30,1)","v":0.20833333333333304},{"$f":"IF($H30<>\"\",IF($H30<Données!$C$3,1,0),0)","v":0},{"$f":"$F30+$J30-($G30+$K30)*(\"00:30\")","v":0.34375000000000006},{"$f":"$G30+$K30","v":0},{"$f":"$D30-$I29+IF($I29>$D30,1)","v":0.4791666666666663},{"$f":"IF($N30=Données!$F$12,0,IF($N30<Données!$F$11,1,0))","v":0},null,null,null,null,null,null,null,null,null,null,null,null,null,null,null,null,"-"]
[null,{"$f":"B30+1","v":"2014-12-24"},null,null,null,0,{"$f":"IF($D31<>\"\",IF($D31<Données!$C$2,1,0),0)","v":0},null,null,0,{"$f":"IF($H31<>\"\",IF($H31<Données!$C$3,1,0),0)","v":0},0,0,0,{"$f":"IF($N31=Données!$F$12,0,IF($N31<Données!$F$11,1,0))","v":0},null,null,null,"Dont :","-",6.3194444444444438,"Heures à taux normal",null,null,null,null,null,null,null,null,null,"-"]
[null,"2014-12-25",null,null,null,0,{"$f":"IF($D32<>\"\",IF($D32<Données!$C$2,1,0),0)","v":0},null,null,0,{"$f":"IF($H32<>\"\",IF($H32<Données!$C$3,1,0),0)","v":0},0,0,{"$f":"$D32-$I31+IF($I31>$D32,1)","v":0},{"$f":"IF($N32=Données!$F$12,0,IF($N32<Données!$F$11,1,0))","v":0},null,null,null,null,"-",0.73125000000000007,"Heures en HS 10%",null,null,null,null,null,null,null,null,null,"-"]
[null,"2014-12-26",null,0.48958333333333298,0.63541666666666696,0.14583333333333398,{"$f":"IF($D33<>\"\",IF($D33<Données!$C$2,1,0),0)","v":0},0.78125,0.97916666666666696,0.19791666666666696,{"$f":"IF($H33<>\"\",IF($H33<Données!$C$3,1,0),0)","v":0},0.34375000000000094,0,0.48958333333333298,{"$f":"IF($N33=Données!$F$12,0,IF($N33<Données!$F$11,1,0))","v":0},null,null,null,null,"-",0,"Heures en HS 20%"]
[null,"2014-12-27",null,0.48958333333333298,0.66666666666666696,0.17708333333333398,{"$f":"IF($D34<>\"\",IF($D34<Données!$C$2,1,0),0)","v":0},0.78125,0.98958333333333304,0.20833333333333304,{"$f":"IF($H34<>\"\",IF($H34<Données!$C$3,1,0),0)","v":0},0.38541666666666702,0,0.51041666666666607,{"$f":"IF($N34=Données!$F$12,0,IF($N34<Données!$F$11,1,0))","v":0},null,null,null,null,"-",0,"Heures en HS 40%",null,null,null,null,null,null,null,null,"Total dépenses:","-",{"$f":"SUM(AG22:AG32)","v":24.4}]
[null,"2014-12-28",null,0.48958333333333298,0.6875,0.19791666666666702,{"$f":"IF($D35<>\"\",IF($D35<Données!$C$2,1,0),0)","v":0},0.83333333333333304,0.97916666666666696,0.14583333333333393,{"$f":"IF($H35<>\"\",IF($H35<Données!$C$3,1,0),0)","v":0},0.34375000000000094,0,0.5,{"$f":"IF($N35=Données!$F$12,0,IF($N35<Données!$F$11,1,0))","v":0},null,null,null,null,"-",0,"Nombre de repas"]
[null,"Total Semaine",null,null,{"$f":"WEEKNUM(B29,21)","v":52},{"$f":"SUM($F29:$F35)","v":0.79166666666666896},{"$f":"G29+G30+G31+G32+G33+G34+G35","v":0},null,null,{"$f":"SUM(J29:J35)","v":0.98958333333333359},{"$f":"K29+K30+K31+K32+K33+K34+K35","v":0},{"$f":"SUM(L29:L35)","v":1.7812500000000024},{"$f":"SUM(M29:M35)","v":0},null,{"$f":"SUM(O29:O35)","v":0}]
[null,{"$f":"B35+1","v":"2014-12-29"},null,0.48958333333333298,0.625,{"$f":"$E37-$D37+IF($D37>$E37,1)","v":0.13541666666666702},{"$f":"IF($D37<>\"\",IF($D37<Données!$C$2,1,0),0)","v":0},0.78125,0,{"$f":"$I37-$H37+IF($H37>$I37,1)","v":0.21875},{"$f":"IF($H37<>\"\",IF($H37<Données!$C$3,1,0),0)","v":0},{"$f":"$F37+$J37-($G37+$K37)*(\"00:30\")","v":0.35416666666666702},{"$f":"$G37+$K37","v":0},{"$f":"$D37-$I35+IF($I35>$D37,1)","v":0.51041666666666607},{"$f":"IF($N37=Données!$F$12,0,IF($N37<Données!$F$11,1,0))","v":0},null,null,null,"Différence:"]
[null,{"$f":"B37+1","v":"2014-12-30"},null,0.48958333333333298,0.63541666666666696,{"$f":"$E38-$D38+IF($D38>$E38,1)","v":0.14583333333333398},{"$f":"IF($D38<>\"\",IF($D38<Données!$C$2,1,0),0)","v":0},0.78125,1.0416666666666666E-2,{"$f":"$I38-$H38+IF($H38>$I38,1)","v":0.22916666666666663},{"$f":"IF($H38<>\"\",IF($H38<Données!$C$3,1,0),0)","v":0},{"$f":"$F38+$J38-($G38+$K38)*(\"00:30\")","v":0.37500000000000061},{"$f":"$G38+$K38","v":0},{"$f":"$D38-$I37+IF($I37>$D38,1)","v":0.48958333333333298},{"$f":"IF($N38=Données!$F$12,0,IF($N38<Données!$F$11,1,0))","v":0}]
[null,{"$f":"B38+1","v":"2014-12-31"},null,null,null,0,{"$f":"IF($D39<>\"\",IF($D39<Données!$C$2,1,0),0)","v":0},null,null,0,{"$f":"IF($H39<>\"\",IF($H39<Données!$C$3,1,0),0)","v":0},0,0,{"$f":"$D39-$I38+IF($I38>$D39,1)","v":0.98958333333333337},{"$f":"IF($N39=Données!$F$12,0,IF($N39<Données!$F$11,1,0))","v":0},null,null,null,"Dont :","-",{"$f":"$U31-$U23+IF($U23>$U31,1)","v":0.53819444444444198},"Heures à taux normal"]
[null,"2015-01-01",null,null,null,0,{"$f":"IF($D40<>\"\",IF($D40<Données!$C$2,1,0),0)","v":0},null,null,0,{"$f":"IF($H40<>\"\",IF($H40<Données!$C$3,1,0),0)","v":0},0,0,0,{"$f":"IF($N40=Données!$F$12,0,IF($N40<Données!$F$11,1,0))","v":0},null,null,null,null,"-",{"$f":"$U32-$U24+IF($U24>$U32,1)","v":0.23124999999999984},"Heures en HS 10%"]
[null,"2015-01-02",null,0.48958333333333298,0.61458333333333304,0.12500000000000006,{"$f":"IF($D41<>\"\",IF($D41<Données!$C$2,1,0),0)","v":0},0.78125,3.125E-2,0.25,{"$f":"IF($H41<>\"\",IF($H41<Données!$C$3,1,0),0)","v":0},0.37500000000000006,0,0.48958333333333298,{"$f":"IF($N41=Données!$F$12,0,IF($N41<Données!$F$11,1,0))","v":0},null,null,null,null,"-",{"$f":"$U33-$U25+IF($U25>$U33,1)","v":0.51041666666666652},"Heures en HS 20%"]
[null,"2015-01-03",null,null,null,0,{"$f":"IF($D42<>\"\",IF($D42<Données!$C$2,1,0),0)","v":0},null,null,0,{"$f":"IF($H42<>\"\",IF($H42<Données!$C$3,1,0),0)","v":0},0,0,0.96875,{"$f":"IF($N42=Données!$F$12,0,IF($N42<Données!$F$11,1,0))","v":0},null,null,null,null,"-",{"$f":"$U34-$U26+IF($U26>$U34,1)","v":0.83333333333332948},"Heures en HS 40%"]
[null,"2015-01-04",null,null,null,0,{"$f":"IF($D43<>\"\",IF($D43<Données!$C$2,1,0),0)","v":0},null,null,0,{"$f":"IF($H43<>\"\",IF($H43<Données!$C$3,1,0),0)","v":0},0,0,0,{"$f":"IF($N43=Données!$F$12,0,IF($N43<Données!$F$11,1,0))","v":0},null,null,null,null,"-",{"$f":"SUM(U35-U27)","v":0},"Nombre de repas"]
[null,"Total Semaine",null,null,{"$f":"WEEKNUM(B37,21)","v":1},{"$f":"SUM($F37:$F43)","v":0.40625000000000105},{"$f":"G37+G38+G39+G40+G41+G42+G43","v":0},null,null,{"$f":"SUM(J37:J43)","v":0.69791666666666663},{"$f":"K37+K38+K39+K40+K41+K42+K43","v":0},{"$f":"SUM(L37:L43)","v":1.1041666666666676},{"$f":"SUM(M37:M43)","v":0},null,{"$f":"SUM(O37:O43)","v":0}]
[null,{"$f":"B43+1","v":"2015-01-05"},null,null,null,{"$f":"$E45-$D45+IF($D45>$E45,1)","v":0},{"$f":"IF($D45<>\"\",IF($D45<Données!$C$2,1,0),0)","v":0},null,null,{"$f":"$I45-$H45+IF($H45>$I45,1)","v":0},{"$f":"IF($H45<>\"\",IF($H45<Données!$C$3,1,0),0)","v":0},{"$f":"$F45+$J45-($G45+$K45)*(\"00:30\")","v":0},{"$f":"$G45+$K45","v":0},{"$f":"$D45-$I43+IF($I43>$D45,1)","v":0},{"$f":"IF($N45=Données!$F$12,0,IF($N45<Données!$F$11,1,0))","v":0}]
[null,{"$f":"B45+1","v":"2015-01-06"},null,null,null,0,{"$f":"IF($D46<>\"\",IF($D46<Données!$C$2,1,0),0)","v":0},null,null,{"$f":"$I46-$H46+IF($H46>$I46,1)","v":0},{"$f":"IF($H46<>\"\",IF($H46<Données!$C$3,1,0),0)","v":0},{"$f":"$F46+$J46-($G46+$K46)*(\"00:30\")","v":0},{"$f":"$G46+$K46","v":0},{"$f":"$D46-$I45+IF($I45>$D46,1)","v":0},{"$f":"IF($N46=Données!$F$12,0,IF($N46<Données!$F$11,1,0))","v":0}]
[null,{"$f":"B46+1","v":"2015-01-07"},null,null,null,0,{"$f":"IF($D47<>\"\",IF($D47<Données!$C$2,1,0),0)","v":0},null,null,0,{"$f":"IF($H47<>\"\",IF($H47<Données!$C$3,1,0),0)","v":0},0,0,{"$f":"$D47-$I46+IF($I46>$D47,1)","v":0},{"$f":"IF($N47=Données!$F$12,0,IF($N47<Données!$F$11,1,0))","v":0}]
[null,"2015-01-08",null,null,null,0,{"$f":"IF($D48<>\"\",IF($D48<Données!$C$2,1,0),0)","v":0},null,null,0,{"$f":"IF($H48<>\"\",IF($H48<Données!$C$3,1,0),0)","v":0},0,0,0,{"$f":"IF($N48=Données!$F$12,0,IF($N48<Données!$F$11,1,0))","v":0}]
[null,"2015-01-09",null,null,null,0,{"$f":"IF($D49<>\"\",IF($D49<Données!$C$2,1,0),0)","v":0},null,null,0,{"$f":"IF($H49<>\"\",IF($H49<Données!$C$3,1,0),0)","v":0},0,0,0,{"$f":"IF($N49=Données!$F$12,0,IF($N49<Données!$F$11,1,0))","v":0}]
[null,"2015-01-10",null,null,null,0,{"$f":"IF($D50<>\"\",IF($D50<Données!$C$2,1,0),0)","v":0},null,null,0,{"$f":"IF($H50<>\"\",IF($H50<Données!$C$3,1,0),0)","v":0},0,0,0,{"$f":"IF($N50=Données!$F$12,0,IF($N50<Données!$F$11,1,0))","v":0}]
[null,"2015-01-11",null,null,null,0,{"$f":"IF($D51<>\"\",IF($D51<Données!$C$2,1,0),0)","v":0},null,null,0,{"$f":"IF($H51<>\"\",IF($H51<Données!$C$3,1,0),0)","v":0},0,0,0,{"$f":"IF($N51=Données!$F$12,0,IF($N51<Données!$F$11,1,0))","v":0}]
[null,"Total semaine",null,null,{"$f":"WEEKNUM(B45,21)","v":2},{"$f":"SUM($F45:$F51)","v":0},{"$f":"G45+G46+G47+G48+G49+G50+G51","v":0},null,null,{"$f":"SUM(J45:J51)","v":0},{"$f":"K45+K46+K47+K48+K49+K50+K51","v":0},{"$f":"SUM(L45:L51)","v":0},{"$f":"SUM(M45:M51)","v":0},null,{"$f":"SUM(O45:O51)","v":0}]
[null,null,null,null,null,null,null,null,null,null,null,null,null,7.041666666666667]
[null,null,null,null,null,null,null,null,null,null,null,{"$f":"CodeCouleur(M54)","v":50},null,"REPOS"]
[null,null,null,null,null,null,null,null,null,null,null,{"$f":"CodeCouleur(M55)","v":42},null,"Récup"]
[null,null,null,null,null,null,null,null,null,null,null,48,null,"JFG"]
[null,null,null,null,null,null,null,null,null,null,null,44,null,"VAC"]
[null,null,null,null,null,null,null,null,null,null,null,3,null,"MAL"]
[null,null,null,null,null,null,null,null,null,null,null,{"$f":"CodeCouleur(M59)","v":40},null,"Jf Taf"]
["Heures",null,1.4583333333333333,1.625,1.7916666666666667,"Total"]
["Taux",1,1.1000000000000001,1.2,1.4]
["S 1",{"$f":"IF($L$12<=$C$60,$L$12,$C$60)","v":1.3020833333333346},{"$f":"IF($L$12<=$C$60,0,IF($L$12<=$D$60,$L$12,$D$60)-$C$60)","v":0},{"$f":"IF($L$12<=$D$60,0,IF($L$12<=$E$60,$L$12,$D$60)-$C$60)","v":0},{"$f":"IF($L$12<=$E$60,0,IF($L$12>$E$60,$L$12,$E$60)-$E$60)","v":0},{"$f":"B62+C62+D62+E62","v":1.3020833333333346}]
["S 2",{"$f":"IF($L$20<=$C$60,$L$20,$C$60)","v":1.4583333333333333},{"$f":"IF($L$20<=$C$60,0,IF($L$20<=$D$60,$L$20,$D$60)-$C$60)","v":0.16666666666666674},{"$f":"IF($L$20<=$D$60,0,IF($L$20<=$E$60,$L$20,$D$60)-$C$60)","v":0.16666666666666674},{"$f":"IF($L$20<=$E$60,0,IF($L$20>$E$60,$L$20,$E$60)-$E$60)","v":7.2916666666668295E-2},1.864583333333335]
["S 3",{"$f":"IF($L$28<=$C$60,$L$28,$C$60)","v":1.4583333333333333},{"$f":"IF($L$28<=$C$60,0,IF($L$28<=$D$60,$L$28,$D$60)-$C$60)","v":0.16666666666666674},{"$f":"IF($L$28<=$D$60,0,IF($L$28<=$E$60,$L$28,$D$60)-$C$60)","v":0.16666666666666674},{"$f":"IF($L$28<=$E$60,0,IF($L$28>$E$60,$L$28,$E$60)-$E$60)","v":9.375000000000222E-2},1.885416666666669]
["S 4",{"$f":"IF($L$36<=$C$60,$L$36,$C$60)","v":1.4583333333333333},{"$f":"IF($L$36<=$C$60,0,IF($L$36<=$D$60,$L$36,$D$60)-$C$60)","v":0.16666666666666674},0.15625,{"$f":"IF($L$36<=$E$60,0,IF($L$36>$E$60,$L$36,$E$60)-$E$60)","v":0},1.78125]
["S 5",{"$f":"IF($L$44<=$C$60,$L$44,$C$60)","v":1.1041666666666676},{"$f":"IF($L$44<=$C$60,0,IF($L$44<=$D$60,$L$44,$D$60)-$C$60)","v":0},{"$f":"IF($L$44<=$D$60,0,IF($L$44<=$E$60,$L$44,$D$60)-$C$60)","v":0},{"$f":"IF($L$44<=$E$60,0,IF($L$44>$E$60,$L$44,$E$60)-$E$60)","v":0},1.1041666666666676]
["S 6",{"$f":"IF($L$52<=$C$60,$L$52,$C$60)","v":0},{"$f":"IF($L$52<=$C$60,0,IF($L$52<=$D$60,$L$52,$D$60)-$C$60)","v":0},{"$f":"IF($L$52<=$D$60,0,IF($L$52<=$E$60,$L$52,$D$60)-$C$60)","v":0},{"$f":"IF($L$52<=$E$60,0,IF($L$52>$E$60,$L$52,$E$60)-$E$60)","v":0},0]
["Total",{"$f":"SUM(B62:B67)","v":6.7812500000000018},{"$f":"SUM(C62:C67)","v":0.50000000000000022},{"$f":"SUM(D62:D67)","v":0.48958333333333348},{"$f":"SUM(E62:E67)","v":0.16666666666667052},7.9375000000000062]
[]
[]
["Jours","Repos","Récup","Jfg","Vac","Mal","Vides","Taf","Jf Taf","<11h"]
["S 1",{"$f":"NbCellsCoul($D$5:$I$11,50)*0.25","v":2},{"$f":"NbCellsCoul($D$5:$I$11,42)*0.25","v":0},{"$f":"NbCellsCoul($D$5:$I$11,48)*0.25","v":0},{"$f":"NbCellsCoul($D$5:$I$11,44)*0.25","v":0},{"$f":"NbCellsCoul($D$5:$I$11,3)*0.25","v":0},{"$f":"+COUNTBLANK(E5:H11)/2","v":4},{"$f":"7-$G72","v":3},{"$f":"NbCellsCoul($D$5:$I$11,40)*0.25","v":0},{"$f":"SUM($O$6:$O$11)","v":2}]
["S 2",{"$f":"NbCellsCoul($D$13:$I$19,50)*0.25","v":2},{"$f":"NbCellsCoul($D$13:$I$19,42)*0.25","v":0},{"$f":"NbCellsCoul($D$13:$I$19,48)*0.25","v":0},{"$f":"NbCellsCoul($D$13:$I$19,44)*0.25","v":0},{"$f":"NbCellsCoul($D$13:$I$19,3)*0.25","v":0},{"$f":"+COUNTBLANK(E13:H19)/2","v":2},5,{"$f":"NbCellsCoul($D$13:$I$19,40)*0.25","v":0},{"$f":"SUM($O$13:$O$19)","v":2}]
["S 3",{"$f":"NbCellsCoul($D$21:$I$27,50)*0.25","v":2},{"$f":"NbCellsCoul($D$21:$I$27,42)*0.25","v":0},{"$f":"NbCellsCoul($D$21:$I$27,48)*0.25","v":0},{"$f":"NbCellsCoul($D$21:$I$27,44)*0.25","v":0},{"$f":"NbCellsCoul($D$21:$I$27,3)*0.25","v":0},{"$f":"+COUNTBLANK(E21:H27)/2","v":2},5,{"$f":"NbCellsCoul($D$21:$I$27,40)*0.25","v":0},{"$f":"SUM($O$21:$O$27)","v":1}]
["S 4",{"$f":"NbCellsCoul($D$29:$I$35,50)*0.25","v":2},{"$f":"NbCellsCoul($D$29:$I$35,42)*0.25","v":0},{"$f":"NbCellsCoul($D$29:$I$35,48)*0.25","v":0},{"$f":"NbCellsCoul($D$29:$I$35,44)*0.25","v":0},{"$f":"NbCellsCoul($D$29:$I$35,3)*0.25","v":0},{"$f":"+COUNTBLANK(E29:H35)/2","v":2},5,{"$f":"NbCellsCoul($D$29:$I$35,40)*0.25","v":0},{"$f":"SUM($O$29:$O$35)","v":0}]
["S 5",{"$f":"NbCellsCoul($D$37:$I$43,50)*0.25","v":2},{"$f":"NbCellsCoul($D$37:$I$43,42)*0.25","v":0},{"$f":"NbCellsCoul($D$37:$I$43,48)*0.25","v":0},{"$f":"NbCellsCoul($D$37:$I$43,44)*0.25","v":0},{"$f":"NbCellsCoul($D$37:$I$43,3)*0.25","v":0},{"$f":"+COUNTBLANK(E37:H43)/2","v":4},3,{"$f":"NbCellsCoul($D$37:$I$43,40)*0.25","v":0},{"$f":"SUM($O$37:$O$43)","v":0}]
["S 6",{"$f":"NbCellsCoul($D$45:$I$51,50)*0.25","v":0},{"$f":"NbCellsCoul($D$45:$I$51,42)*0.25","v":0},{"$f":"NbCellsCoul($D$45:$I$51,48)*0.25","v":0},{"$f":"NbCellsCoul($D$45:$I$51,44)*0.25","v":0},{"$f":"NbCellsCoul($D$45:$I$51,3)*0.25","v":0},{"$f":"+COUNTBLANK(E45:H51)/2","v":7},0,{"$f":"NbCellsCoul($D$45:$I$51,40)*0.25","v":0},{"$f":"SUM($O$45:$O$51)","v":0}]
["Total",{"$f":"SUM(B$72:B$77)","v":10},0,0,0,{"$f":"SUM(F$72:F$77)","v":0},{"$f":"SUM(G$72:G$77)","v":21},{"$f":"SUM(H$72:H$77)","v":21},{"$f":"SUM(I$72:I$77)","v":0},{"$f":"SUM(J$72:J$77)","v":5}]

{"sheet":"Nov 14","index":13,"n_rows":78,"n_cols":34,"rows_kept":78,"cut":false,"hidden":false,"merged":[[50,1,50,2],[51,1,51,3],[59,0,59,1],[108,5,108,8],[44,1,44,2],[45,1,45,2],[46,1,46,2],[47,1,47,2],[48,1,48,2],[49,1,49,2],[43,1,43,3],[32,1,32,2],[33,1,33,2],[34,1,34,2],[35,1,35,3],[36,1,36,2],[37,1,37,2],[38,1,38,2],[39,1,39,2],[40,1,40,2],[41,1,41,2],[42,1,42,2],[31,1,31,2],[20,1,20,2],[21,1,21,2],[22,1,22,2],[23,1,23,2],[24,1,24,2],[25,1,25,2],[26,1,26,2],[27,1,27,3],[28,1,28,2],[29,1,29,2],[30,1,30,2],[19,1,19,3],[8,1,8,2],[9,1,9,2],[10,1,10,2],[11,1,11,3],[12,1,12,2],[13,1,13,2],[14,1,14,2],[15,1,15,2],[16,1,16,2],[17,1,17,2],[18,1,18,2],[7,1,7,2],[0,3,0,9],[0,18,0,21],[0,30,0,32],[2,1,3,2],[2,3,2,4],[2,5,3,5],[2,6,3,6],[2,7,2,8],[2,9,3,9],[2,10,3,10],[2,11,3,11],[2,12,3,12],[4,1,4,2],[5,1,5,2],[6,1,6,2]]}
[null,null,null,"TEMPS DE TRAVAIL",null,null,null,null,null,null,null,null,null,null,null,null,null,null,"RÉCAPITULATIF",null,null,null,null,null,null,null,null,null,null,null,"IMPÔTS"]
[null,null,null,null,null,{"$f":"Données!G14","v":12},null,null,null,{"$f":"Données!C15","v":2014}]
[null,"Jour",null,"Midi",null,"Cumul Midi","Repas","Soir",null,"Cumul Soir","Repas","Totaux","Total Repas"]
[null,null,null,"Début","Fin",null,null,"Début","Fin",null,null,null,null,null,null,null,null,null,null,null,null,null,null,null,null,null,null,null,null,null,null,{"$f":"VLOOKUP(F2,Données!E15:F26,2)","v":"Décembre"},{"$f":"J2","v":2014}]
[null,{"$f":"Données!I15-WEEKDAY(Données!I15-1)+1","v":"2014-12-01"},null,null,null,{"$f":"$E5-$D5+IF($D5>$E5,1)","v":0},{"$f":"IF($D5<>\"\",IF($D5<Données!$C$2,1,0),0)","v":0},null,null,{"$f":"$I5-$H5+IF($H5>$I5,1)","v":0},{"$f":"IF($H5<>\"\",IF($H5<Données!$C$3,1,0),0)","v":0},{"$f":"$F5+$J5-($G5+$K5)*(\"00:30\")","v":0},{"$f":"$G5+$K5","v":0}]
[null,{"$f":"B5+1","v":"2014-12-02"},null,null,null,{"$f":"$E6-$D6+IF($D6>$E6,1)","v":0},{"$f":"IF($D6<>\"\",IF($D6<Données!$C$2,1,0),0)","v":0},null,null,{"$f":"$I6-$H6+IF($H6>$I6,1)","v":0},{"$f":"IF($H6<>\"\",IF($H6<Données!$C$3,1,0),0)","v":0},{"$f":"$F6+$J6-($G6+$K6)*(\"00:30\")","v":0},{"$f":"$G6+$K6","v":0},{"$f":"$D6-$I5+IF($I5>$D6,1)","v":0},{"$f":"IF($N6=Données!$F$12,0,IF($N6<Données!$F$11,1,0))","v":0},null,null,null,"Soit au total pour le mois de :",null,{"$f":"VLOOKUP(F2,Données!E15:F26,2)","v":"Décembre"},{"$f":"J2","v":2014}]
[null,{"$f":"B6+1","v":"2014-12-03"},null,null,null,0,{"$f":"IF($D7<>\"\",IF($D7<Données!$C$2,1,0),0)","v":0},null,null,0,{"$f":"IF($H7<>\"\",IF($H7<Données!$C$3,1,0),0)","v":0},0,0,{"$f":"$D7-$I6+IF($I6>$D7,1)","v":0},{"$f":"IF($N7=Données!$F$12,0,IF($N7<Données!$F$11,1,0))","v":0}]
[null,"2014-12-04",null,null,null,0,{"$f":"IF($D8<>\"\",IF($D8<Données!$C$2,1,0),0)","v":0},null,null,0,{"$f":"IF($H8<>\"\",IF($H8<Données!$C$3,1,0),0)","v":0},0,0,{"$f":"$D8-$I7+IF($I7>$D8,1)","v":0},{"$f":"IF($N8=Données!$F$12,0,IF($N8<Données!$F$11,1,0))","v":0},null,null,null,null,null,null,null,null,null,null,null,null,null,null,null,"Numéro Fiscal :"]
[null,"2014-12-05",null,null,null,0,{"$f":"IF($D9<>\"\",IF($D9<Données!$C$2,1,0),0)","v":0},null,null,0,{"$f":"IF($H9<>\"\",IF($H9<Données!$C$3,1,0),0)","v":0},0,0,0,{"$f":"IF($N9=Données!$F$12,0,IF($N9<Données!$F$11,1,0))","v":0},null,null,null,"Nombre de jours travaillés :",null,{"$f":"H78","v":19},null,null,null,null,null,null,null,null,null,"MDP:"]
[null,"2014-12-06",null,0.48958333333333298,0.6875,0.19791666666666702,{"$f":"IF($D10<>\"\",IF($D10<Données!$C$2,1,0),0)","v":0},0.78125,2.0833333333333332E-2,0.23958333333333337,{"$f":"IF($H10<>\"\",IF($H10<Données!$C$3,1,0),0)","v":0},0.43750000000000039,0,{"$f":"$D10-$I9+IF($I9>$D10,1)","v":0.48958333333333298},{"$f":"IF($N10=Données!$F$12,0,IF($N10<Données!$F$11,1,0))","v":0},null,null,null,"Nombre de jours repos :",null,{"$f":"B78","v":8}]
[null,"2014-12-07",null,0.48958333333333298,0.66666666666666696,0.17708333333333398,{"$f":"IF($D11<>\"\",IF($D11<Données!$C$2,1,0),0)","v":0},0.8125,0.96875,0.15625,{"$f":"IF($H11<>\"\",IF($H11<Données!$C$3,1,0),0)","v":0},0.33333333333333398,0,{"$f":"$D11-$I10+IF($I10>$D11,1)","v":0.46874999999999967},{"$f":"IF($N11=Données!$F$12,0,IF($N11<Données!$F$11,1,0))","v":0},null,null,null,"Nombre de jours récup :",null,{"$f":"C$78","v":0},null,null,null,null,null,null,null,null,null,"Adresse domicile:","-"]
[null,"Total Semaine",null,null,{"$f":"WEEKNUM(B5,21)","v":49},{"$f":"SUM($F5:$F11)","v":0.375000000000001},{"$f":"G5+G6+G7+G8+G9+G10+G11","v":0},null,null,{"$f":"SUM(J5:J11)","v":0.39583333333333337},{"$f":"K5+K6+K7+K8+K9+K10+K11","v":0},{"$f":"SUM(L5:L11)","v":0.77083333333333437},{"$f":"SUM(M5:M11)","v":0},null,{"$f":"SUM(O6:O11)","v":0},null,null,null,"Nombre de jfg :",null,{"$f":"D$78","v":0}]
[null,{"$f":"B11+1","v":"2014-12-08"},null,0.48958333333333298,0.64583333333333304,{"$f":"$E13-$D13+IF($D13>$E13,1)","v":0.15625000000000006},{"$f":"IF($D13<>\"\",IF($D13<Données!$C$2,1,0),0)","v":0},0.78125,6.25E-2,{"$f":"$I13-$H13+IF($H13>$I13,1)","v":0.28125},{"$f":"IF($H13<>\"\",IF($H13<Données!$C$3,1,0),0)","v":0},{"$f":"$F13+$J13-($G13+$K13)*(\"00:30\")","v":0.43750000000000006},{"$f":"$G13+$K13","v":0},{"$f":"$D13-$I11+IF($I11>$D13,1)","v":0.52083333333333304},{"$f":"IF($N13=Données!$F$12,0,IF($N13<Données!$F$11,1,0))","v":0},null,null,null,"Nombre de jours de vacances :",null,{"$f":"E$78","v":0}]
[null,{"$f":"B13+1","v":"2014-12-09"},null,0.48958333333333298,0.625,{"$f":"$E14-$D14+IF($D14>$E14,1)","v":0.13541666666666702},{"$f":"IF($D14<>\"\",IF($D14<Données!$C$2,1,0),0)","v":0},0.78125,0.96875,{"$f":"$I14-$H14+IF($H14>$I14,1)","v":0.1875},{"$f":"IF($H14<>\"\",IF($H14<Données!$C$3,1,0),0)","v":0},{"$f":"$F14+$J14-($G14+$K14)*(\"00:30\")","v":0.32291666666666702},{"$f":"$G14+$K14","v":0},{"$f":"$D14-$I13+IF($I13>$D14,1)","v":0.42708333333333298},{"$f":"IF($N14=Données!$F$12,0,IF($N14<Données!$F$11,1,0))","v":1},null,null,null,"Nombre de jours de maladie :",null,{"$f":"F$78","v":3}]
[null,{"$f":"B14+1","v":"2014-12-10"},null,null,null,0,{"$f":"IF($D15<>\"\",IF($D15<Données!$C$2,1,0),0)","v":0},null,null,0,{"$f":"IF($H15<>\"\",IF($H15<Données!$C$3,1,0),0)","v":0},0,0,0,{"$f":"IF($N15=Données!$F$12,0,IF($N15<Données!$F$11,1,0))","v":0},null,null,null,"Nombre jours fériées travaillés :",null,{"$f":"I78","v":0},null,null,null,null,null,null,null,null,null,"Adresse lieu de travail:","-"]
[null,"2014-12-11",null,null,null,0,{"$f":"IF($D16<>\"\",IF($D16<Données!$C$2,1,0),0)","v":0},null,null,0,{"$f":"IF($H16<>\"\",IF($H16<Données!$C$3,1,0),0)","v":0},0,0,{"$f":"$D16-$I15+IF($I15>$D16,1)","v":0},{"$f":"IF($N16=Données!$F$12,0,IF($N16<Données!$F$11,1,0))","v":0},null,null,null,"Nombre de fois 11h de batement non respecté :",null,{"$f":"J78","v":6}]
[null,"2014-12-12",null,0.48958333333333298,0.625,0.13541666666666702,{"$f":"IF($D17<>\"\",IF($D17<Données!$C$2,1,0),0)","v":0},0.78125,0.94791666666666696,0.16666666666666696,{"$f":"IF($H17<>\"\",IF($H17<Données!$C$3,1,0),0)","v":0},0.30208333333333398,0,0.48958333333333298,{"$f":"IF($N17=Données!$F$12,0,IF($N17<Données!$F$11,1,0))","v":0}]
[null,"2014-12-13",null,0.48958333333333298,0.66666666666666696,0.17708333333333398,{"$f":"IF($D18<>\"\",IF($D18<Données!$C$2,1,0),0)","v":0},0.78125,4.1666666666666664E-2,0.26041666666666663,{"$f":"IF($H18<>\"\",IF($H18<Données!$C$3,1,0),0)","v":0},0.43750000000000061,0,0.54166666666666607,{"$f":"IF($N18=Données!$F$12,0,IF($N18<Données!$F$11,1,0))","v":0},null,null,null,null,null,null,null,null,null,null,null,null,null,null,null,"Distance ( Source Mappy) :","-","7,4 KM"]
[null,"2014-12-14",null,0.48958333333333298,0.66666666666666696,0.17708333333333398,{"$f":"IF($D19<>\"\",IF($D19<Données!$C$2,1,0),0)","v":0},0.78125,1.0416666666666666E-2,0.22916666666666663,{"$f":"IF($H19<>\"\",IF($H19<Données!$C$3,1,0),0)","v":0},0.40625000000000061,0,0.4479166666666663,{"$f":"IF($N19=Données!$F$12,0,IF($N19<Données!$F$11,1,0))","v":1},null,null,null,null,null,{"$f":"SUM(L12+L20+L28+L36+L44+L52)","v":8.270833333333341},"Heures effectués"]
[null,"Total Semaine",null,null,{"$f":"WEEKNUM(B13,21)","v":50},{"$f":"SUM($F13:$F19)","v":0.781250000000002},{"$f":"G13+G14+G15+G16+G17+G18+G19","v":0},null,null,{"$f":"SUM(J13:J19)","v":1.1250000000000002},{"$f":"K13+K14+K15+K16+K17+K18+K19","v":0},{"$f":"SUM(L13:L19)","v":1.9062500000000024},{"$f":"SUM(M13:M19)","v":0},null,{"$f":"SUM(O13:O19)","v":2},null,null,null,null,null,{"$f":"IF(U19<N53,\"- \"&TEXT(ABS(N53-U19),\"[hh]:mm\"),U19-N53)","v":1.2291666666666741},"Heures dues/supp",null,null,null,null,null,null,null,null,"Nombre Aller-Retour :","-",{"$f":"COUNT(E5:E11,I5:I11,E13:E19,I13:I19,E21:E27,I21:I27,E29:E35,I29:I35,E37:E43,I37:I43,E45:E51,I45:I51)","v":38}]
[null,{"$f":"B19+1","v":"2014-12-15"},null,0.48958333333333298,0.67708333333333304,{"$f":"$E21-$D21+IF($D21>$E21,1)","v":0.18750000000000006},{"$f":"IF($D21<>\"\",IF($D21<Données!$C$2,1,0),0)","v":0},0.78125,2.0833333333333332E-2,{"$f":"$I21-$H21+IF($H21>$I21,1)","v":0.23958333333333337},{"$f":"IF($H21<>\"\",IF($H21<Données!$C$3,1,0),0)","v":0},{"$f":"$F21+$J21-($G21+$K21)*(\"00:30\")","v":0.42708333333333343},{"$f":"$G21+$K21","v":0},{"$f":"$D21-$I19+IF($I19>$D21,1)","v":0.4791666666666663},{"$f":"IF($N21=Données!$F$12,0,IF($N21<Données!$F$11,1,0))","v":0},null,null,null,null,null,null,null,null,null,null,null,null,null,null,null,"Km Parcourue :","-",{"$f":"SUM(AG20*14.8)","v":562.4},"Km"]
[null,{"$f":"B21+1","v":"2014-12-16"},null,0.48958333333333298,0.60416666666666696,{"$f":"$E22-$D22+IF($D22>$E22,1)","v":0.11458333333333398},{"$f":"IF($D22<>\"\",IF($D22<Données!$C$2,1,0),0)","v":0},0.78125,2.0833333333333332E-2,{"$f":"$I22-$H22+IF($H22>$I22,1)","v":0.23958333333333337},{"$f":"IF($H22<>\"\",IF($H22<Données!$C$3,1,0),0)","v":0},{"$f":"$F22+$J22-($G22+$K22)*(\"00:30\")","v":0.35416666666666735},{"$f":"$G22+$K22","v":0},{"$f":"$D22-$I21+IF($I21>$D22,1)","v":0.46874999999999967},{"$f":"IF($N22=Données!$F$12,0,IF($N22<Données!$F$11,1,0))","v":0},null,null,null,null,null,null,null,null,null,null,null,null,null,null,null,"Horodateur Payé :","-",30.1]
[null,{"$f":"B22+1","v":"2014-12-17"},null,null,null,0,{"$f":"IF($D23<>\"\",IF($D23<Données!$C$2,1,0),0)","v":0},null,null,0,{"$f":"IF($H23<>\"\",IF($H23<Données!$C$3,1,0),0)","v":0},0,0,{"$f":"$D23-$I22+IF($I22>$D23,1)","v":0.97916666666666663},{"$f":"IF($N23=Données!$F$12,0,IF($N23<Données!$F$11,1,0))","v":0},null,null,null,"Dont :","-",{"$f":"$B$68","v":6.604166666666667},"Heures à taux normal ( 35h )",null,null,null,null,null,null,null,null,"Achat divers pour le travail :","-"]
[null,"2014-12-18",null,null,null,0,{"$f":"IF($D24<>\"\",IF($D24<Données!$C$2,1,0),0)","v":0},null,null,0,{"$f":"IF($H24<>\"\",IF($H24<Données!$C$3,1,0),0)","v":0},0,0,0,{"$f":"IF($N24=Données!$F$12,0,IF($N24<Données!$F$11,1,0))","v":0},null,null,null,null,"-",{"$f":"$C$68","v":0.66666666666666696},"Heures en HS 10%         ( 35h à 39h )",null,null,null,null,null,null,null,null,null,"-"]
[null,"2014-12-19",null,0.48958333333333298,0.61458333333333304,0.12500000000000006,{"$f":"IF($D25<>\"\",IF($D25<Données!$C$2,1,0),0)","v":0},0.78125,0.97916666666666696,0.19791666666666696,{"$f":"IF($H25<>\"\",IF($H25<Données!$C$3,1,0),0)","v":0},0.32291666666666702,0,0.48958333333333298,{"$f":"IF($N25=Données!$F$12,0,IF($N25<Données!$F$11,1,0))","v":0},null,null,null,null,"-",{"$f":"$D$68","v":0.54166666666666685},"Heures en HS 20%         (39h à 43h )",null,null,null,null,null,null,null,null,null,"-"]
[null,"2014-12-20",null,0.48958333333333298,0.625,0.13541666666666702,{"$f":"IF($D26<>\"\",IF($D26<Données!$C$2,1,0),0)","v":0},0.78125,5.2083333333333336E-2,0.27083333333333337,{"$f":"IF($H26<>\"\",IF($H26<Données!$C$3,1,0),0)","v":0},0.40625000000000039,0,0.51041666666666607,{"$f":"IF($N26=Données!$F$12,0,IF($N26<Données!$F$11,1,0))","v":0},null,null,null,null,"-",{"$f":"$E$68","v":0.45833333333333925},"Heures en HS 40%         ( 43h et plus )",null,null,null,null,null,null,null,null,null,"-"]
[null,"2014-12-21",null,0.48958333333333298,0.65625,0.16666666666666702,{"$f":"IF($D27<>\"\",IF($D27<Données!$C$2,1,0),0)","v":0},0.83333333333333304,0.98958333333333304,0.15625,{"$f":"IF($H27<>\"\",IF($H27<Données!$C$3,1,0),0)","v":0},0.32291666666666702,0,0.43749999999999967,{"$f":"IF($N27=Données!$F$12,0,IF($N27<Données!$F$11,1,0))","v":1},null,null,null,null,"-",{"$f":"SUM(M12+M20+M28+M36+M44+M52)","v":0},"Nombre de repas",null,null,null,null,null,null,null,null,null,"-"]
[null,"Total Semaine",null,null,{"$f":"WEEKNUM(B21,21)","v":51},{"$f":"SUM($F21:$F27)","v":0.72916666666666807},{"$f":"G21+G22+G23+G24+G25+G26+G27","v":0},null,null,{"$f":"SUM(J21:J27)","v":1.104166666666667},{"$f":"K21+K22+K23+K24+K25+K26+K27","v":0},{"$f":"SUM(L21:L27)","v":1.8333333333333353},{"$f":"SUM(M21:M27)","v":0},null,{"$f":"SUM(O21:O27)","v":1},null,null,null,null,null,null,null,null,null,null,null,null,null,null,null,null,"-"]
[null,{"$f":"B27+1","v":"2014-12-22"},null,0.48958333333333298,0.63541666666666696,{"$f":"$E29-$D29+IF($D29>$E29,1)","v":0.14583333333333398},{"$f":"IF($D29<>\"\",IF($D29<Données!$C$2,1,0),0)","v":0},0.78125,6.25E-2,{"$f":"$I29-$H29+IF($H29>$I29,1)","v":0.28125},{"$f":"IF($H29<>\"\",IF($H29<Données!$C$3,1,0),0)","v":0},{"$f":"$F29+$J29-($G29+$K29)*(\"00:30\")","v":0.42708333333333398},{"$f":"$G29+$K29","v":0},{"$f":"$D29-$I27+IF($I27>$D29,1)","v":0.5},{"$f":"IF($N29=Données!$F$12,0,IF($N29<Données!$F$11,1,0))","v":0},null,null,null,"Heure fiche de paie:",null,null,null,null,null,null,null,null,null,null,null,null,"-"]
[null,{"$f":"B29+1","v":"2014-12-23"},null,0.48958333333333298,0.64583333333333304,{"$f":"$E30-$D30+IF($D30>$E30,1)","v":0.15625000000000006},{"$f":"IF($D30<>\"\",IF($D30<Données!$C$2,1,0),0)","v":0},0.78125,1.0416666666666666E-2,{"$f":"$I30-$H30+IF($H30>$I30,1)","v":0.22916666666666663},{"$f":"IF($H30<>\"\",IF($H30<Données!$C$3,1,0),0)","v":0},{"$f":"$F30+$J30-($G30+$K30)*(\"00:30\")","v":0.38541666666666669},{"$f":"$G30+$K30","v":0},{"$f":"$D30-$I29+IF($I29>$D30,1)","v":0.42708333333333298},{"$f":"IF($N30=Données!$F$12,0,IF($N30<Données!$F$11,1,0))","v":1},null,null,null,null,null,null,null,null,null,null,null,null,null,null,null,null,"-"]
[null,{"$f":"B30+1","v":"2014-12-24"},null,null,null,0,{"$f":"IF($D31<>\"\",IF($D31<Données!$C$2,1,0),0)","v":0},null,null,0,{"$f":"IF($H31<>\"\",IF($H31<Données!$C$3,1,0),0)","v":0},0,0,{"$f":"$D31-$I30+IF($I30>$D31,1)","v":0.98958333333333337},{"$f":"IF($N31=Données!$F$12,0,IF($N31<Données!$F$11,1,0))","v":0},null,null,null,"Dont :","-",6.3194444444444438,"Heures à taux normal",null,null,null,null,null,null,null,null,null,"-"]
[null,"2014-12-25",null,null,null,0,{"$f":"IF($D32<>\"\",IF($D32<Données!$C$2,1,0),0)","v":0},null,null,0,{"$f":"IF($H32<>\"\",IF($H32<Données!$C$3,1,0),0)","v":0},0,0,0,{"$f":"IF($N32=Données!$F$12,0,IF($N32<Données!$F$11,1,0))","v":0},null,null,null,null,"-",0.73125000000000007,"Heures en HS 10%",null,null,null,null,null,null,null,null,null,"-"]
[null,"2014-12-26",null,0.48958333333333298,0.59375,0.10416666666666702,{"$f":"IF($D33<>\"\",IF($D33<Données!$C$2,1,0),0)","v":0},0.77083333333333304,9.375E-2,0.32291666666666696,0,0.42708333333333398,0,0.48958333333333298,{"$f":"IF($N33=Données!$F$12,0,IF($N33<Données!$F$11,1,0))","v":0},null,null,null,null,"-",0,"Heures en HS 20%"]
[null,"2014-12-27",null,0.48958333333333298,0.64583333333333304,0.15625000000000006,{"$f":"IF($D34<>\"\",IF($D34<Données!$C$2,1,0),0)","v":0},0.78125,5.2083333333333336E-2,0.27083333333333337,{"$f":"IF($H34<>\"\",IF($H34<Données!$C$3,1,0),0)","v":0},0.42708333333333343,0,0.39583333333333298,{"$f":"IF($N34=Données!$F$12,0,IF($N34<Données!$F$11,1,0))","v":1},null,null,null,null,"-",0,"Heures en HS 40%",null,null,null,null,null,null,null,null,"Total dépenses:","-",{"$f":"SUM(AG22:AG32)","v":30.1}]
[null,"2014-12-28",null,0.48958333333333298,0.6875,0.19791666666666702,{"$f":"IF($D35<>\"\",IF($D35<Données!$C$2,1,0),0)","v":0},0.78125,1.0416666666666666E-2,0.22916666666666663,{"$f":"IF($H35<>\"\",IF($H35<Données!$C$3,1,0),0)","v":0},0.42708333333333365,0,0.43749999999999967,{"$f":"IF($N35=Données!$F$12,0,IF($N35<Données!$F$11,1,0))","v":1},null,null,null,null,"-",0,"Nombre de repas"]
[null,"Total Semaine",null,null,{"$f":"WEEKNUM(B29,21)","v":52},{"$f":"SUM($F29:$F35)","v":0.76041666666666807},{"$f":"G29+G30+G31+G32+G33+G34+G35","v":0},null,null,{"$f":"SUM(J29:J35)","v":1.3333333333333335},{"$f":"K29+K30+K31+K32+K33+K34+K35","v":0},{"$f":"SUM(L29:L35)","v":2.0937500000000018},{"$f":"SUM(M29:M35)","v":0},null,{"$f":"SUM(O29:O35)","v":3}]
[null,{"$f":"B35+1","v":"2014-12-29"},null,0.48958333333333298,0.625,{"$f":"$E37-$D37+IF($D37>$E37,1)","v":0.13541666666666702},{"$f":"IF($D37<>\"\",IF($D37<Données!$C$2,1,0),0)","v":0},0.78125,0.98958333333333304,{"$f":"$I37-$H37+IF($H37>$I37,1)","v":0.20833333333333304},{"$f":"IF($H37<>\"\",IF($H37<Données!$C$3,1,0),0)","v":0},{"$f":"$F37+$J37-($G37+$K37)*(\"00:30\")","v":0.34375000000000006},{"$f":"$G37+$K37","v":0},{"$f":"$D37-$I35+IF($I35>$D37,1)","v":0.4791666666666663},{"$f":"IF($N37=Données!$F$12,0,IF($N37<Données!$F$11,1,0))","v":0},null,null,null,"Différence:"]
[null,{"$f":"B37+1","v":"2014-12-30"},null,0.48958333333333298,0.63541666666666696,{"$f":"$E38-$D38+IF($D38>$E38,1)","v":0.14583333333333398},{"$f":"IF($D38<>\"\",IF($D38<Données!$C$2,1,0),0)","v":0},0.78125,0.98958333333333304,{"$f":"$I38-$H38+IF($H38>$I38,1)","v":0.20833333333333304},{"$f":"IF($H38<>\"\",IF($H38<Données!$C$3,1,0),0)","v":0},{"$f":"$F38+$J38-($G38+$K38)*(\"00:30\")","v":0.35416666666666702},{"$f":"$G38+$K38","v":0},{"$f":"$D38-$I37+IF($I37>$D38,1)","v":0.5},{"$f":"IF($N38=Données!$F$12,0,IF($N38<Données!$F$11,1,0))","v":0}]
[null,{"$f":"B38+1","v":"2014-12-31"},null,null,null,0,{"$f":"IF($D39<>\"\",IF($D39<Données!$C$2,1,0),0)","v":0},null,null,0,{"$f":"IF($H39<>\"\",IF($H39<Données!$C$3,1,0),0)","v":0},0,0,0,{"$f":"IF($N39=Données!$F$12,0,IF($N39<Données!$F$11,1,0))","v":0},null,null,null,"Dont :","-",{"$f":"$U31-$U23+IF($U23>$U31,1)","v":0.71527777777777679},"Heures à taux normal"]
[null,"2015-01-01",null,null,null,0,{"$f":"IF($D40<>\"\",IF($D40<Données!$C$2,1,0),0)","v":0},null,null,0,{"$f":"IF($H40<>\"\",IF($H40<Données!$C$3,1,0),0)","v":0},0,0,{"$f":"$D40-$I39+IF($I39>$D40,1)","v":0},{"$f":"IF($N40=Données!$F$12,0,IF($N40<Données!$F$11,1,0))","v":0},null,null,null,null,"-",{"$f":"$U32-$U24+IF($U24>$U32,1)","v":6.4583333333333104E-2},"Heures en HS 10%"]
[null,"2015-01-02",null,null,null,0,{"$f":"IF($D41<>\"\",IF($D41<Données!$C$2,1,0),0)","v":0},null,null,0,{"$f":"IF($H41<>\"\",IF($H41<Données!$C$3,1,0),0)","v":0},0.32291666666666669,0,0,{"$f":"IF($N41=Données!$F$12,0,IF($N41<Données!$F$11,1,0))","v":0},null,null,null,null,"-",{"$f":"$U33-$U25+IF($U25>$U33,1)","v":0.45833333333333315},"Heures en HS 20%"]
[null,"2015-01-03",null,null,null,0,{"$f":"IF($D42<>\"\",IF($D42<Données!$C$2,1,0),0)","v":0},null,null,0,{"$f":"IF($H42<>\"\",IF($H42<Données!$C$3,1,0),0)","v":0},0.32291666666666669,0,0,{"$f":"IF($N42=Données!$F$12,0,IF($N42<Données!$F$11,1,0))","v":0},null,null,null,null,"-",{"$f":"$U34-$U26+IF($U26>$U34,1)","v":0.54166666666666075},"Heures en HS 40%"]
[null,"2015-01-04",null,null,null,0,{"$f":"IF($D43<>\"\",IF($D43<Données!$C$2,1,0),0)","v":0},null,null,0,{"$f":"IF($H43<>\"\",IF($H43<Données!$C$3,1,0),0)","v":0},0.32291666666666669,0,0,{"$f":"IF($N43=Données!$F$12,0,IF($N43<Données!$F$11,1,0))","v":0},null,null,null,null,"-",{"$f":"SUM(U35-U27)","v":0},"Nombre de repas"]
[null,"Total Semaine",null,null,{"$f":"WEEKNUM(B37,21)","v":1},{"$f":"SUM($F37:$F43)","v":0.281250000000001},{"$f":"G37+G38+G39+G40+G41+G42+G43","v":0},null,null,{"$f":"SUM(J37:J43)","v":0.41666666666666607},{"$f":"K37+K38+K39+K40+K41+K42+K43","v":0},{"$f":"SUM(L37:L43)","v":1.6666666666666672},{"$f":"SUM(M37:M43)","v":0},null,{"$f":"SUM(O37:O43)","v":0}]
[null,{"$f":"B43+1","v":"2015-01-05"},null,null,null,{"$f":"$E45-$D45+IF($D45>$E45,1)","v":0},{"$f":"IF($D45<>\"\",IF($D45<Données!$C$2,1,0),0)","v":0},null,null,{"$f":"$I45-$H45+IF($H45>$I45,1)","v":0},{"$f":"IF($H45<>\"\",IF($H45<Données!$C$3,1,0),0)","v":0},{"$f":"$F45+$J45-($G45+$K45)*(\"00:30\")","v":0},{"$f":"$G45+$K45","v":0},{"$f":"$D45-$I43+IF($I43>$D45,1)","v":0},{"$f":"IF($N45=Données!$F$12,0,IF($N45<Données!$F$11,1,0))","v":0}]
[null,{"$f":"B45+1","v":"2015-01-06"},null,null,null,0,{"$f":"IF($D46<>\"\",IF($D46<Données!$C$2,1,0),0)","v":0},null,null,{"$f":"$I46-$H46+IF($H46>$I46,1)","v":0},{"$f":"IF($H46<>\"\",IF($H46<Données!$C$3,1,0),0)","v":0},{"$f":"$F46+$J46-($G46+$K46)*(\"00:30\")","v":0},{"$f":"$G46+$K46","v":0},{"$f":"$D46-$I45+IF($I45>$D46,1)","v":0},{"$f":"IF($N46=Données!$F$12,0,IF($N46<Données!$F$11,1,0))","v":0}]
[null,{"$f":"B46+1","v":"2015-01-07"},null,null,null,0,{"$f":"IF($D47<>\"\",IF($D47<Données!$C$2,1,0),0)","v":0},null,null,0,{"$f":"IF($H47<>\"\",IF($H47<Données!$C$3,1,0),0)","v":0},0,0,{"$f":"$D47-$I46+IF($I46>$D47,1)","v":0},{"$f":"IF($N47=Données!$F$12,0,IF($N47<Données!$F$11,1,0))","v":0}]
[null,"2015-01-08",null,null,null,0,{"$f":"IF($D48<>\"\",IF($D48<Données!$C$2,1,0),0)","v":0},null,null,0,{"$f":"IF($H48<>\"\",IF($H48<Données!$C$3,1,0),0)","v":0},0,0,0,{"$f":"IF($N48=Données!$F$12,0,IF($N48<Données!$F$11,1,0))","v":0}]
[null,"2015-01-09",null,null,null,0,{"$f":"IF($D49<>\"\",IF($D49<Données!$C$2,1,0),0)","v":0},null,null,0,{"$f":"IF($H49<>\"\",IF($H49<Données!$C$3,1,0),0)","v":0},0,0,0,{"$f":"IF($N49=Données!$F$12,0,IF($N49<Données!$F$11,1,0))","v":0}]
[null,"2015-01-10",null,null,null,0,{"$f":"IF($D50<>\"\",IF($D50<Données!$C$2,1,0),0)","v":0},null,null,0,{"$f":"IF($H50<>\"\",IF($H50<Données!$C$3,1,0),0)","v":0},0,0,0,{"$f":"IF($N50=Données!$F$12,0,IF($N50<Données!$F$11,1,0))","v":0}]
[null,"2015-01-11",null,null,null,0,{"$f":"IF($D51<>\"\",IF($D51<Données!$C$2,1,0),0)","v":0},null,null,0,{"$f":"IF($H51<>\"\",IF($H51<Données!$C$3,1,0),0)","v":0},0,0,0,{"$f":"IF($N51=Données!$F$12,0,IF($N51<Données!$F$11,1,0))","v":0}]
[null,"Total semaine",null,null,{"$f":"WEEKNUM(B45,21)","v":2},{"$f":"SUM($F45:$F51)","v":0},{"$f":"G45+G46+G47+G48+G49+G50+G51","v":0},null,null,{"$f":"SUM(J45:J51)","v":0},{"$f":"K45+K46+K47+K48+K49+K50+K51","v":0},{"$f":"SUM(L45:L51)","v":0},{"$f":"SUM(M45:M51)","v":0},null,{"$f":"SUM(O45:O51)","v":0}]
[null,null,null,null,null,null,null,null,null,null,null,null,null,7.041666666666667]
[null,null,null,null,null,null,null,null,null,null,null,{"$f":"CodeCouleur(M54)","v":50},null,"REPOS"]
[null,null,null,null,null,null,null,null,null,null,null,{"$f":"CodeCouleur(M55)","v":42},null,"Récup"]
[null,null,null,null,null,null,null,null,null,null,null,48,null,"JFG"]
[null,null,null,null,null,null,null,null,null,null,null,44,null,"VAC"]
[null,null,null,null,null,null,null,null,null,null,null,3,null,"MAL"]
[null,null,null,null,null,null,null,null,null,null,null,{"$f":"CodeCouleur(M59)","v":40},null,"Jf Taf"]
["Heures",null,1.4583333333333333,1.625,1.7916666666666667,"Total"]
["Taux",1,1.1000000000000001,1.2,1.4]
["S 1",{"$f":"IF($L$12<=$C$60,$L$12,$C$60)","v":0.77083333333333437},{"$f":"IF($L$12<=$C$60,0,IF($L$12<=$D$60,$L$12,$D$60)-$C$60)","v":0},{"$f":"IF($L$12<=$D$60,0,IF($L$12<=$E$60,$L$12,$D$60)-$C$60)","v":0},{"$f":"IF($L$12<=$E$60,0,IF($L$12>$E$60,$L$12,$E$60)-$E$60)","v":0},{"$f":"B62+C62+D62+E62","v":0.77083333333333437}]
["S 2",{"$f":"IF($L$20<=$C$60,$L$20,$C$60)","v":1.4583333333333333},{"$f":"IF($L$20<=$C$60,0,IF($L$20<=$D$60,$L$20,$D$60)-$C$60)","v":0.16666666666666674},{"$f":"IF($L$20<=$D$60,0,IF($L$20<=$E$60,$L$20,$D$60)-$C$60)","v":0.16666666666666674},{"$f":"IF($L$20<=$E$60,0,IF($L$20>$E$60,$L$20,$E$60)-$E$60)","v":0.1145833333333357},1.9062500000000024]
["S 3",{"$f":"IF($L$28<=$C$60,$L$28,$C$60)","v":1.4583333333333333},{"$f":"IF($L$28<=$C$60,0,IF($L$28<=$D$60,$L$28,$D$60)-$C$60)","v":0.16666666666666674},{"$f":"IF($L$28<=$D$60,0,IF($L$28<=$E$60,$L$28,$D$60)-$C$60)","v":0.16666666666666674},{"$f":"IF($L$28<=$E$60,0,IF($L$28>$E$60,$L$28,$E$60)-$E$60)","v":4.1666666666668517E-2},1.8333333333333353]
["S 4",{"$f":"IF($L$36<=$C$60,$L$36,$C$60)","v":1.4583333333333333},{"$f":"IF($L$36<=$C$60,0,IF($L$36<=$D$60,$L$36,$D$60)-$C$60)","v":0.16666666666666674},{"$f":"IF($L$36<=$D$60,0,IF($L$36<=$E$60,$L$36,$D$60)-$C$60)","v":0.16666666666666674},{"$f":"IF($L$36<=$E$60,0,IF($L$36>$E$60,$L$36,$E$60)-$E$60)","v":0.30208333333333504},2.0937500000000018]
["S 5",{"$f":"IF($L$44<=$C$60,$L$44,$C$60)","v":1.4583333333333333},{"$f":"IF($L$44<=$C$60,0,IF($L$44<=$D$60,$L$44,$D$60)-$C$60)","v":0.16666666666666674},4.1666666666666664E-2,{"$f":"IF($L$44<=$E$60,0,IF($L$44>$E$60,$L$44,$E$60)-$E$60)","v":0},1.6666666666666667]
["S 6",{"$f":"IF($L$52<=$C$60,$L$52,$C$60)","v":0},{"$f":"IF($L$52<=$C$60,0,IF($L$52<=$D$60,$L$52,$D$60)-$C$60)","v":0},{"$f":"NbCellsCoul($D$5:$I$11,50)*0.25","v":0},{"$f":"IF($L$52<=$E$60,0,IF($L$52>$E$60,$L$52,$E$60)-$E$60)","v":0},0]
["Total",{"$f":"SUM(B62:B67)","v":6.604166666666667},{"$f":"SUM(C62:C67)","v":0.66666666666666696},{"$f":"SUM(D62:D67)","v":0.54166666666666685},{"$f":"SUM(E62:E67)","v":0.45833333333333925},8.2708333333333393]
[]
[]
["Jours","Repos","Récup","Jfg","Vac","Mal","Vides","Taf","Jf Taf","<11h"]
["S 1",{"$f":"NbCellsCoul($D$5:$I$11,50)*0.25","v":0},{"$f":"NbCellsCoul($D$5:$I$11,42)*0.25","v":0},{"$f":"NbCellsCoul($D$5:$I$11,48)*0.25","v":0},{"$f":"NbCellsCoul($D$5:$I$11,44)*0.25","v":0},{"$f":"NbCellsCoul($D$5:$I$11,3)*0.25","v":0},{"$f":"+COUNTBLANK(E5:H11)/2","v":5},{"$f":"7-$G72","v":2},{"$f":"NbCellsCoul($D$5:$I$11,40)*0.25","v":0},{"$f":"SUM($O$6:$O$11)","v":0}]
["S 2",{"$f":"NbCellsCoul($D$13:$I$19,50)*0.25","v":2},{"$f":"NbCellsCoul($D$13:$I$19,42)*0.25","v":0},{"$f":"NbCellsCoul($D$13:$I$19,48)*0.25","v":0},{"$f":"NbCellsCoul($D$13:$I$19,44)*0.25","v":0},{"$f":"NbCellsCoul($D$13:$I$19,3)*0.25","v":0},{"$f":"+COUNTBLANK(E13:H19)/2","v":2},5,{"$f":"NbCellsCoul($D$13:$I$19,40)*0.25","v":0},{"$f":"SUM($O$13:$O$19)","v":2}]
["S 3",{"$f":"NbCellsCoul($D$21:$I$27,50)*0.25","v":2},{"$f":"NbCellsCoul($D$21:$I$27,42)*0.25","v":0},{"$f":"NbCellsCoul($D$21:$I$27,48)*0.25","v":0},{"$f":"NbCellsCoul($D$21:$I$27,44)*0.25","v":0},{"$f":"NbCellsCoul($D$21:$I$27,3)*0.25","v":0},{"$f":"+COUNTBLANK(E21:H27)/2","v":2},5,{"$f":"NbCellsCoul($D$21:$I$27,40)*0.25","v":0},{"$f":"SUM($O$21:$O$27)","v":1}]
["S 4",{"$f":"NbCellsCoul($D$29:$I$35,50)*0.25","v":2},{"$f":"NbCellsCoul($D$29:$I$35,42)*0.25","v":0},{"$f":"NbCellsCoul($D$29:$I$35,48)*0.25","v":0},{"$f":"NbCellsCoul($D$29:$I$35,44)*0.25","v":0},{"$f":"NbCellsCoul($D$29:$I$35,3)*0.25","v":0},{"$f":"+COUNTBLANK(E29:H35)/2","v":2},5,{"$f":"NbCellsCoul($D$29:$I$35,40)*0.25","v":0},{"$f":"SUM($O$29:$O$35)","v":3}]
["S 5",{"$f":"NbCellsCoul($D$37:$I$43,50)*0.25","v":2},{"$f":"NbCellsCoul($D$37:$I$43,42)*0.25","v":0},{"$f":"NbCellsCoul($D$37:$I$43,48)*0.25","v":0},{"$f":"NbCellsCoul($D$37:$I$43,44)*0.25","v":0},{"$f":"NbCellsCoul($D$37:$I$43,3)*0.25","v":3},{"$f":"+COUNTBLANK(E37:H43)/2","v":5},2,{"$f":"NbCellsCoul($D$37:$I$43,40)*0.25","v":0},{"$f":"SUM($O$37:$O$43)","v":0}]
["S 6",{"$f":"NbCellsCoul($D$45:$I$51,50)*0.25","v":0},{"$f":"NbCellsCoul($D$45:$I$51,42)*0.25","v":0},{"$f":"NbCellsCoul($D$45:$I$51,48)*0.25","v":0},{"$f":"NbCellsCoul($D$45:$I$51,44)*0.25","v":0},{"$f":"NbCellsCoul($D$45:$I$51,3)*0.25","v":0},{"$f":"+COUNTBLANK(E45:H51)/2","v":7},0,{"$f":"NbCellsCoul($D$45:$I$51,40)*0.25","v":0},{"$f":"SUM($O$45:$O$51)","v":0}]
["Total",{"$f":"SUM(B$72:B$77)","v":8},0,0,0,{"$f":"SUM(F$72:F$77)","v":3},{"$f":"SUM(G$72:G$77)","v":23},{"$f":"SUM(H$72:H$77)","v":19},{"$f":"SUM(I$72:I$77)","v":0},{"$f":"SUM(J$72:J$77)","v":6}]

{"sheet":"Déc 14","index":14,"n_rows":78,"n_cols":34,"rows_kept":78,"cut":false,"hidden":false,"merged":[[50,1,50,2],[51,1,51,3],[59,0,59,1],[108,5,108,8],[44,1,44,2],[45,1,45,2],[46,1,46,2],[47,1,47,2],[48,1,48,2],[49,1,49,2],[43,1,43,3],[32,1,32,2],[33,1,33,2],[34,1,34,2],[35,1,35,3],[36,1,36,2],[37,1,37,2],[38,1,38,2],[39,1,39,2],[40,1,40,2],[41,1,41,2],[42,1,42,2],[31,1,31,2],[20,1,20,2],[21,1,21,2],[22,1,22,2],[23,1,23,2],[24,1,24,2],[25,1,25,2],[26,1,26,2],[27,1,27,3],[28,1,28,2],[29,1,29,2],[30,1,30,2],[19,1,19,3],[8,1,8,2],[9,1,9,2],[10,1,10,2],[11,1,11,3],[12,1,12,2],[13,1,13,2],[14,1,14,2],[15,1,15,2],[16,1,16,2],[17,1,17,2],[18,1,18,2],[7,1,7,2],[0,3,0,9],[0,18,0,21],[0,30,0,32],[2,1,3,2],[2,3,2,4],[2,5,3,5],[2,6,3,6],[2,7,2,8],[2,9,3,9],[2,10,3,10],[2,11,3,11],[2,12,3,12],[4,1,4,2],[5,1,5,2],[6,1,6,2]]}
[null,null,null,"TEMPS DE TRAVAIL",null,null,null,null,null,null,null,null,null,null,null,null,null,null,"RÉCAPITULATIF",null,null,null,null,null,null,null,null,null,null,null,"IMPÔTS"]
[null,null,null,null,null,{"$f":"Données!G14","v":12},null,null,null,{"$f":"Données!C15","v":2014}]
[null,"Jour",null,"Midi",null,"Cumul Midi","Repas","Soir",null,"Cumul Soir","Repas","Totaux","Total Repas"]
[null,null,null,"Début","Fin",null,null,"Début","Fin",null,null,null,null,null,null,null,null,null,null,null,null,null,null,null,null,null,null,null,null,null,null,{"$f":"VLOOKUP(F2,Données!E15:F26,2)","v":"Décembre"},{"$f":"J2","v":2014}]
[null,{"$f":"Données!I15-WEEKDAY(Données!I15-1)+1","v":"2014-12-01"},null,0.48958333333333298,0.63541666666666696,{"$f":"$E5-$D5+IF($D5>$E5,1)","v":0.14583333333333398},{"$f":"IF($D5<>\"\",IF($D5<Données!$C$2,1,0),0)","v":0},0.78125,0.97916666666666696,{"$f":"$I5-$H5+IF($H5>$I5,1)","v":0.19791666666666696},{"$f":"IF($H5<>\"\",IF($H5<Données!$C$3,1,0),0)","v":0},{"$f":"$F5+$J5-($G5+$K5)*(\"00:30\")","v":0.34375000000000094},{"$f":"$G5+$K5","v":0}]
[null,{"$f":"B5+1","v":"2014-12-02"},null,0.48958333333333298,0.63541666666666696,{"$f":"$E6-$D6+IF($D6>$E6,1)","v":0.14583333333333398},{"$f":"IF($D6<>\"\",IF($D6<Données!$C$2,1,0),0)","v":0},0.78125,0,{"$f":"$I6-$H6+IF($H6>$I6,1)","v":0.21875},{"$f":"IF($H6<>\"\",IF($H6<Données!$C$3,1,0),0)","v":0},{"$f":"$F6+$J6-($G6+$K6)*(\"00:30\")","v":0.36458333333333398},{"$f":"$G6+$K6","v":0},{"$f":"$D6-$I5+IF($I5>$D6,1)","v":0.51041666666666607},{"$f":"IF($N6=Données!$F$12,0,IF($N6<Données!$F$11,1,0))","v":0},null,null,null,"Soit au total pour le mois de :",null,{"$f":"VLOOKUP(F2,Données!E15:F26,2)","v":"Décembre"},{"$f":"J2","v":2014}]
[null,{"$f":"B6+1","v":"2014-12-03"},null,null,null,0,{"$f":"IF($D7<>\"\",IF($D7<Données!$C$2,1,0),0)","v":0},0.79166666666666696,0.98958333333333304,0.19791666666666607,{"$f":"IF($H7<>\"\",IF($H7<Données!$C$3,1,0),0)","v":0},0.19791666666666607,0,{"$f":"$D7-$I6+IF($I6>$D7,1)","v":0},{"$f":"IF($N7=Données!$F$12,0,IF($N7<Données!$F$11,1,0))","v":0}]
[null,"2014-12-04",null,null,null,0,{"$f":"IF($D8<>\"\",IF($D8<Données!$C$2,1,0),0)","v":0},null,null,0,{"$f":"IF($H8<>\"\",IF($H8<Données!$C$3,1,0),0)","v":0},0,0,0,{"$f":"IF($N8=Données!$F$12,0,IF($N8<Données!$F$11,1,0))","v":0},null,null,null,null,null,null,null,null,null,null,null,null,null,null,null,"Numéro Fiscal :"]
[null,"2014-12-05",null,null,null,0,{"$f":"IF($D9<>\"\",IF($D9<Données!$C$2,1,0),0)","v":0},0.78125,3.125E-2,0.25,{"$f":"IF($H9<>\"\",IF($H9<Données!$C$3,1,0),0)","v":0},0.25,0,{"$f":"$D9-$I8+IF($I8>$D9,1)","v":0},{"$f":"IF($N9=Données!$F$12,0,IF($N9<Données!$F$11,1,0))","v":0},null,null,null,"Nombre de jours travaillés :",null,{"$f":"H78","v":22.5},null,null,null,null,null,null,null,null,null,"MDP:"]
[null,"2014-12-06",null,0.48958333333333298,0.64583333333333304,0.15625000000000006,{"$f":"IF($D10<>\"\",IF($D10<Données!$C$2,1,0),0)","v":0},0.78125,0,0.21875,{"$f":"IF($H10<>\"\",IF($H10<Données!$C$3,1,0),0)","v":0},0.37500000000000006,0,{"$f":"$D10-$I9+IF($I9>$D10,1)","v":0.45833333333333298},{"$f":"IF($N10=Données!$F$12,0,IF($N10<Données!$F$11,1,0))","v":0},null,null,null,"Nombre de jours repos :",null,{"$f":"B78","v":6.5}]
[null,"2014-12-07",null,0.48958333333333298,0.67708333333333304,0.18750000000000006,{"$f":"IF($D11<>\"\",IF($D11<Données!$C$2,1,0),0)","v":0},0.78125,2.0833333333333332E-2,0.23958333333333337,{"$f":"IF($H11<>\"\",IF($H11<Données!$C$3,1,0),0)","v":0},0.42708333333333343,0,{"$f":"$D11-$I10+IF($I10>$D11,1)","v":0.48958333333333298},{"$f":"IF($N11=Données!$F$12,0,IF($N11<Données!$F$11,1,0))","v":0},null,null,null,"Nombre de jours récup :",null,{"$f":"C$78","v":0},null,null,null,null,null,null,null,null,null,"Adresse domicile:","-"]
[null,"Total Semaine",null,null,{"$f":"WEEKNUM(B5,21)","v":49},{"$f":"SUM($F5:$F11)","v":0.63541666666666807},{"$f":"G5+G6+G7+G8+G9+G10+G11","v":0},null,null,{"$f":"SUM(J5:J11)","v":1.3229166666666665},{"$f":"K5+K6+K7+K8+K9+K10+K11","v":0},{"$f":"SUM(L5:L11)","v":1.9583333333333344},{"$f":"SUM(M5:M11)","v":0},null,{"$f":"SUM(O6:O11)","v":0},null,null,null,"Nombre de jfg :",null,{"$f":"D$78","v":0}]
[null,{"$f":"B11+1","v":"2014-12-08"},null,0.48958333333333298,0.61458333333333304,{"$f":"$E13-$D13+IF($D13>$E13,1)","v":0.12500000000000006},{"$f":"IF($D13<>\"\",IF($D13<Données!$C$2,1,0),0)","v":0},0.78125,0.97916666666666696,{"$f":"$I13-$H13+IF($H13>$I13,1)","v":0.19791666666666696},{"$f":"IF($H13<>\"\",IF($H13<Données!$C$3,1,0),0)","v":0},{"$f":"$F13+$J13-($G13+$K13)*(\"00:30\")","v":0.32291666666666702},{"$f":"$G13+$K13","v":0},{"$f":"$D13-$I11+IF($I11>$D13,1)","v":0.46874999999999967},{"$f":"IF($N13=Données!$F$12,0,IF($N13<Données!$F$11,1,0))","v":0},null,null,null,"Nombre de jours de vacances :",null,{"$f":"E$78","v":0}]
[null,{"$f":"B13+1","v":"2014-12-09"},null,0.48958333333333298,0.64583333333333304,{"$f":"$E14-$D14+IF($D14>$E14,1)","v":0.15625000000000006},{"$f":"IF($D14<>\"\",IF($D14<Données!$C$2,1,0),0)","v":0},0.78125,2.0833333333333332E-2,{"$f":"$I14-$H14+IF($H14>$I14,1)","v":0.23958333333333337},{"$f":"IF($H14<>\"\",IF($H14<Données!$C$3,1,0),0)","v":0},{"$f":"$F14+$J14-($G14+$K14)*(\"00:30\")","v":0.39583333333333343},{"$f":"$G14+$K14","v":0},{"$f":"$D14-$I13+IF($I13>$D14,1)","v":0.51041666666666607},{"$f":"IF($N14=Données!$F$12,0,IF($N14<Données!$F$11,1,0))","v":0},null,null,null,"Nombre de jours de maladie :",null,{"$f":"F$78","v":0}]
[null,{"$f":"B14+1","v":"2014-12-10"},null,null,null,0,{"$f":"IF($D15<>\"\",IF($D15<Données!$C$2,1,0),0)","v":0},null,null,0,{"$f":"IF($H15<>\"\",IF($H15<Données!$C$3,1,0),0)","v":0},0,0,{"$f":"$D15-$I14+IF($I14>$D15,1)","v":0.97916666666666663},{"$f":"IF($N15=Données!$F$12,0,IF($N15<Données!$F$11,1,0))","v":0},null,null,null,"Nombre jours fériées travaillés :",null,{"$f":"I78","v":1.5},null,null,null,null,null,null,null,null,null,"Adresse lieu de travail:","-"]
[null,"2014-12-11",null,null,null,0,{"$f":"IF($D16<>\"\",IF($D16<Données!$C$2,1,0),0)","v":0},null,null,0,{"$f":"IF($H16<>\"\",IF($H16<Données!$C$3,1,0),0)","v":0},0,0,0,{"$f":"IF($N16=Données!$F$12,0,IF($N16<Données!$F$11,1,0))","v":0},null,null,null,"Nombre de fois 11h de batement non respecté :",null,{"$f":"J78","v":3}]
[null,"2014-12-12",null,0.48958333333333298,0.64583333333333304,0.15625000000000006,{"$f":"IF($D17<>\"\",IF($D17<Données!$C$2,1,0),0)","v":0},0.78125,8.3333333333333329E-2,0.30208333333333337,{"$f":"IF($H17<>\"\",IF($H17<Données!$C$3,1,0),0)","v":0},0.45833333333333343,0,0.48958333333333298,{"$f":"IF($N17=Données!$F$12,0,IF($N17<Données!$F$11,1,0))","v":0}]
[null,"2014-12-13",null,0.48958333333333298,0.66666666666666696,0.17708333333333398,{"$f":"IF($D18<>\"\",IF($D18<Données!$C$2,1,0),0)","v":0},0.78125,2.0833333333333332E-2,0.23958333333333337,{"$f":"IF($H18<>\"\",IF($H18<Données!$C$3,1,0),0)","v":0},0.41666666666666735,0,0.40624999999999967,{"$f":"IF($N18=Données!$F$12,0,IF($N18<Données!$F$11,1,0))","v":1},null,null,null,null,null,null,null,null,null,null,null,null,null,null,null,"Distance ( Source Mappy) :","-","7,4 KM"]
[null,"2014-12-14",null,0.48958333333333298,0.65625,0.16666666666666702,{"$f":"IF($D19<>\"\",IF($D19<Données!$C$2,1,0),0)","v":0},0.78125,0.97916666666666696,0.19791666666666696,{"$f":"IF($H19<>\"\",IF($H19<Données!$C$3,1,0),0)","v":0},0.36458333333333398,0,0.46874999999999967,{"$f":"IF($N19=Données!$F$12,0,IF($N19<Données!$F$11,1,0))","v":0},null,null,null,null,null,{"$f":"SUM(L12+L20+L28+L36+L44+L52)","v":8.958333333333341},"Heures effectués"]
[null,"Total Semaine",null,null,{"$f":"WEEKNUM(B13,21)","v":50},{"$f":"SUM($F13:$F19)","v":0.78125000000000111},{"$f":"G13+G14+G15+G16+G17+G18+G19","v":0},null,null,{"$f":"SUM(J13:J19)","v":1.1770833333333339},{"$f":"K13+K14+K15+K16+K17+K18+K19","v":0},{"$f":"SUM(L13:L19)","v":1.9583333333333353},{"$f":"SUM(M13:M19)","v":0},null,{"$f":"SUM(O13:O19)","v":1},null,null,null,null,null,{"$f":"IF(U19<N53,\"- \"&TEXT(ABS(N53-U19),\"[hh]:mm\"),U19-N53)","v":1.9166666666666741},"Heures dues/supp",null,null,null,null,null,null,null,null,"Nombre Aller-Retour :","-",{"$f":"COUNT(E5:E11,I5:I11,E13:E19,I13:I19,E21:E27,I21:I27,E29:E35,I29:I35,E37:E43,I37:I43,E45:E51,I45:I51)","v":45}]
[null,{"$f":"B19+1","v":"2014-12-15"},null,0.48958333333333298,0.625,{"$f":"$E21-$D21+IF($D21>$E21,1)","v":0.13541666666666702},{"$f":"IF($D21<>\"\",IF($D21<Données!$C$2,1,0),0)","v":0},0.78125,0.97916666666666696,{"$f":"$I21-$H21+IF($H21>$I21,1)","v":0.19791666666666696},{"$f":"IF($H21<>\"\",IF($H21<Données!$C$3,1,0),0)","v":0},{"$f":"$F21+$J21-($G21+$K21)*(\"00:30\")","v":0.33333333333333398},{"$f":"$G21+$K21","v":0},{"$f":"$D21-$I19+IF($I19>$D21,1)","v":0.51041666666666607},{"$f":"IF($N21=Données!$F$12,0,IF($N21<Données!$F$11,1,0))","v":0},null,null,null,null,null,null,null,null,null,null,null,null,null,null,null,"Km Parcourue :","-",{"$f":"SUM(AG20*14.8)","v":666},"Km"]
[null,{"$f":"B21+1","v":"2014-12-16"},null,0.48958333333333298,0.625,{"$f":"$E22-$D22+IF($D22>$E22,1)","v":0.13541666666666702},{"$f":"IF($D22<>\"\",IF($D22<Données!$C$2,1,0),0)","v":0},0.78125,0.92708333333333304,{"$f":"$I22-$H22+IF($H22>$I22,1)","v":0.14583333333333304},{"$f":"IF($H22<>\"\",IF($H22<Données!$C$3,1,0),0)","v":0},{"$f":"$F22+$J22-($G22+$K22)*(\"00:30\")","v":0.28125000000000006},{"$f":"$G22+$K22","v":0},{"$f":"$D22-$I21+IF($I21>$D22,1)","v":0.51041666666666607},{"$f":"IF($N22=Données!$F$12,0,IF($N22<Données!$F$11,1,0))","v":0},null,null,null,null,null,null,null,null,null,null,null,null,null,null,null,"Horodateur Payé :","-",36]
[null,{"$f":"B22+1","v":"2014-12-17"},null,null,null,0,{"$f":"IF($D23<>\"\",IF($D23<Données!$C$2,1,0),0)","v":0},null,null,0,{"$f":"IF($H23<>\"\",IF($H23<Données!$C$3,1,0),0)","v":0},0,0,0,{"$f":"IF($N23=Données!$F$12,0,IF($N23<Données!$F$11,1,0))","v":0},null,null,null,"Dont :","-",{"$f":"$B$68","v":6.9895833333333339},"Heures à taux normal ( 35h )",null,null,null,null,null,null,null,null,"Achat divers pour le travail :","-"]
[null,"2014-12-18",null,null,null,0,{"$f":"IF($D24<>\"\",IF($D24<Données!$C$2,1,0),0)","v":0},null,null,0,{"$f":"IF($H24<>\"\",IF($H24<Données!$C$3,1,0),0)","v":0},0,0,{"$f":"$D24-$I23+IF($I23>$D24,1)","v":0},{"$f":"IF($N24=Données!$F$12,0,IF($N24<Données!$F$11,1,0))","v":0},null,null,null,null,"-",{"$f":"$C$68","v":0.66666666666666696},"Heures en HS 10%         ( 35h à 39h )",null,null,null,null,null,null,null,null,null,"-"]
[null,"2014-12-19",null,0.48958333333333298,0.66666666666666696,0.17708333333333398,{"$f":"IF($D25<>\"\",IF($D25<Données!$C$2,1,0),0)","v":0},0.78125,3.125E-2,0.25,{"$f":"IF($H25<>\"\",IF($H25<Données!$C$3,1,0),0)","v":0},0.42708333333333398,0,0.48958333333333298,{"$f":"IF($N25=Données!$F$12,0,IF($N25<Données!$F$11,1,0))","v":0},null,null,null,null,"-",{"$f":"$D$68","v":0.66666666666666696},"Heures en HS 20%         (39h à 43h )",null,null,null,null,null,null,null,null,null,"-"]
[null,"2014-12-20",null,0.48958333333333298,0.67708333333333304,0.18750000000000006,{"$f":"IF($D26<>\"\",IF($D26<Données!$C$2,1,0),0)","v":0},0.78125,6.25E-2,0.28125,{"$f":"IF($H26<>\"\",IF($H26<Données!$C$3,1,0),0)","v":0},0.46875000000000006,0,0.45833333333333298,{"$f":"IF($N26=Données!$F$12,0,IF($N26<Données!$F$11,1,0))","v":0},null,null,null,null,"-",{"$f":"$E$68","v":0.63541666666667251},"Heures en HS 40%         ( 43h et plus )",null,null,null,null,null,null,null,null,null,"-"]
[null,"2014-12-21",null,0.48958333333333298,0.6875,0.19791666666666702,{"$f":"IF($D27<>\"\",IF($D27<Données!$C$2,1,0),0)","v":0},0.78125,0,0.21875,{"$f":"IF($H27<>\"\",IF($H27<Données!$C$3,1,0),0)","v":0},0.41666666666666702,0,0.42708333333333298,{"$f":"IF($N27=Données!$F$12,0,IF($N27<Données!$F$11,1,0))","v":1},null,null,null,null,"-",{"$f":"SUM(M12+M20+M28+M36+M44+M52)","v":1},"Nombre de repas",null,null,null,null,null,null,null,null,null,"-"]
[null,"Total Semaine",null,null,{"$f":"WEEKNUM(B21,21)","v":51},{"$f":"SUM($F21:$F27)","v":0.83333333333333504},{"$f":"G21+G22+G23+G24+G25+G26+G27","v":0},null,null,{"$f":"SUM(J21:J27)","v":1.09375},{"$f":"K21+K22+K23+K24+K25+K26+K27","v":0},{"$f":"SUM(L21:L27)","v":1.927083333333335},{"$f":"SUM(M21:M27)","v":0},null,{"$f":"SUM(O21:O27)","v":1},null,null,null,null,null,null,null,null,null,null,null,null,null,null,null,null,"-"]
[null,{"$f":"B27+1","v":"2014-12-22"},null,0.48958333333333298,0.64583333333333304,{"$f":"$E29-$D29+IF($D29>$E29,1)","v":0.15625000000000006},{"$f":"IF($D29<>\"\",IF($D29<Données!$C$2,1,0),0)","v":0},0.78125,1.0416666666666666E-2,{"$f":"$I29-$H29+IF($H29>$I29,1)","v":0.22916666666666663},{"$f":"IF($H29<>\"\",IF($H29<Données!$C$3,1,0),0)","v":0},{"$f":"$F29+$J29-($G29+$K29)*(\"00:30\")","v":0.38541666666666669},{"$f":"$G29+$K29","v":0},{"$f":"$D29-$I27+IF($I27>$D29,1)","v":0.48958333333333298},{"$f":"IF($N29=Données!$F$12,0,IF($N29<Données!$F$11,1,0))","v":0},null,null,null,"Heure fiche de paie:",null,null,null,null,null,null,null,null,null,null,null,null,"-"]
[null,{"$f":"B29+1","v":"2014-12-23"},null,0.48958333333333298,0.63541666666666696,{"$f":"$E30-$D30+IF($D30>$E30,1)","v":0.14583333333333398},{"$f":"IF($D30<>\"\",IF($D30<Données!$C$2,1,0),0)","v":0},0.78125,0,{"$f":"$I30-$H30+IF($H30>$I30,1)","v":0.21875},{"$f":"IF($H30<>\"\",IF($H30<Données!$C$3,1,0),0)","v":0},{"$f":"$F30+$J30-($G30+$K30)*(\"00:30\")","v":0.36458333333333398},{"$f":"$G30+$K30","v":0},{"$f":"$D30-$I29+IF($I29>$D30,1)","v":0.4791666666666663},{"$f":"IF($N30=Données!$F$12,0,IF($N30<Données!$F$11,1,0))","v":0},null,null,null,null,null,null,null,null,null,null,null,null,null,null,null,null,"-"]
[null,{"$f":"B30+1","v":"2014-12-24"},null,null,null,0,{"$f":"IF($D31<>\"\",IF($D31<Données!$C$2,1,0),0)","v":0},0.75,0,0.25,{"$f":"IF($H31<>\"\",IF($H31<Données!$C$3,1,0),0)","v":1},0.22916666666666666,1,{"$f":"$D31-$I30+IF($I30>$D31,1)","v":0},{"$f":"IF($N31=Données!$F$12,0,IF($N31<Données!$F$11,1,0))","v":0},null,null,null,"Dont :","-",6.3194444444444438,"Heures à taux normal",null,null,null,null,null,null,null,null,null,"-"]
[null,"2014-12-25",null,0.47916666666666702,0.6875,0.20833333333333298,0,null,null,0,{"$f":"IF($H32<>\"\",IF($H32<Données!$C$3,1,0),0)","v":0},0.20833333333333298,0,0.47916666666666702,{"$f":"IF($N32=Données!$F$12,0,IF($N32<Données!$F$11,1,0))","v":0},null,null,null,null,"-",0.73125000000000007,"Heures en HS 10%",null,null,null,null,null,null,null,null,null,"-"]
[null,"2014-12-26",null,0.48958333333333298,0.65625,0.16666666666666702,{"$f":"IF($D33<>\"\",IF($D33<Données!$C$2,1,0),0)","v":0},0.83333333333333304,0,0.16666666666666696,{"$f":"IF($H33<>\"\",IF($H33<Données!$C$3,1,0),0)","v":0},0.33333333333333398,0,0.48958333333333298,{"$f":"IF($N33=Données!$F$12,0,IF($N33<Données!$F$11,1,0))","v":0},null,null,null,null,"-",0,"Heures en HS 20%"]
[null,"2014-12-27",null,null,null,0,{"$f":"IF($D34<>\"\",IF($D34<Données!$C$2,1,0),0)","v":0},0.78125,1.0416666666666666E-2,0.22916666666666663,{"$f":"IF($H34<>\"\",IF($H34<Données!$C$3,1,0),0)","v":0},0.22916666666666663,0,0,{"$f":"IF($N34=Données!$F$12,0,IF($N34<Données!$F$11,1,0))","v":0},null,null,null,null,"-",0,"Heures en HS 40%",null,null,null,null,null,null,null,null,"Total dépenses:","-",{"$f":"SUM(AG22:AG32)","v":36}]
[null,"2014-12-28",null,0.48958333333333298,0.69791666666666696,0.20833333333333398,{"$f":"IF($D35<>\"\",IF($D35<Données!$C$2,1,0),0)","v":0},null,null,0,{"$f":"IF($H35<>\"\",IF($H35<Données!$C$3,1,0),0)","v":0},0.20833333333333398,0,0.4791666666666663,{"$f":"IF($N35=Données!$F$12,0,IF($N35<Données!$F$11,1,0))","v":0},null,null,null,null,"-",0,"Nombre de repas"]
[null,"Total Semaine",null,null,{"$f":"WEEKNUM(B29,21)","v":52},{"$f":"SUM($F29:$F35)","v":0.88541666666666785},{"$f":"G29+G30+G31+G32+G33+G34+G35","v":0},null,null,{"$f":"SUM(J29:J35)","v":1.0937500000000002},{"$f":"K29+K30+K31+K32+K33+K34+K35","v":1},{"$f":"SUM(L29:L35)","v":1.9583333333333348},{"$f":"SUM(M29:M35)","v":1},null,{"$f":"SUM(O29:O35)","v":0}]
[null,{"$f":"B35+1","v":"2014-12-29"},null,0.48958333333333298,0.625,{"$f":"$E37-$D37+IF($D37>$E37,1)","v":0.13541666666666702},{"$f":"IF($D37<>\"\",IF($D37<Données!$C$2,1,0),0)","v":0},0.78125,2.0833333333333332E-2,{"$f":"$I37-$H37+IF($H37>$I37,1)","v":0.23958333333333337},{"$f":"IF($H37<>\"\",IF($H37<Données!$C$3,1,0),0)","v":0},{"$f":"$F37+$J37-($G37+$K37)*(\"00:30\")","v":0.37500000000000039},{"$f":"$G37+$K37","v":0},{"$f":"$D37-$I35+IF($I35>$D37,1)","v":0.48958333333333298},{"$f":"IF($N37=Données!$F$12,0,IF($N37<Données!$F$11,1,0))","v":0},null,null,null,"Différence:"]
[null,{"$f":"B37+1","v":"2014-12-30"},null,0.48958333333333298,0.66666666666666696,{"$f":"$E38-$D38+IF($D38>$E38,1)","v":0.17708333333333398},{"$f":"IF($D38<>\"\",IF($D38<Données!$C$2,1,0),0)","v":0},0.78125,1.0416666666666666E-2,{"$f":"$I38-$H38+IF($H38>$I38,1)","v":0.22916666666666663},{"$f":"IF($H38<>\"\",IF($H38<Données!$C$3,1,0),0)","v":0},{"$f":"$F38+$J38-($G38+$K38)*(\"00:30\")","v":0.40625000000000061},{"$f":"$G38+$K38","v":0},{"$f":"$D38-$I37+IF($I37>$D38,1)","v":0.46874999999999967},{"$f":"IF($N38=Données!$F$12,0,IF($N38<Données!$F$11,1,0))","v":0}]
[null,{"$f":"B38+1","v":"2014-12-31"},null,null,null,0,{"$f":"IF($D39<>\"\",IF($D39<Données!$C$2,1,0),0)","v":0},0.77083333333333304,0.14583333333333334,0.37500000000000033,0,0.37500000000000033,0,{"$f":"$D39-$I38+IF($I38>$D39,1)","v":0.98958333333333337},{"$f":"IF($N39=Données!$F$12,0,IF($N39<Données!$F$11,1,0))","v":0},null,null,null,"Dont :","-",{"$f":"$U31-$U23+IF($U23>$U31,1)","v":0.32986111111110983},"Heures à taux normal"]
[null,"2015-01-01",null,null,null,0,{"$f":"IF($D40<>\"\",IF($D40<Données!$C$2,1,0),0)","v":0},null,null,0,{"$f":"IF($H40<>\"\",IF($H40<Données!$C$3,1,0),0)","v":0},0,0,0.85416666666666663,1,null,null,null,null,"-",{"$f":"$U32-$U24+IF($U24>$U32,1)","v":6.4583333333333104E-2},"Heures en HS 10%"]
[null,"2015-01-02",null,null,null,0,{"$f":"IF($D41<>\"\",IF($D41<Données!$C$2,1,0),0)","v":0},null,null,0,{"$f":"IF($H41<>\"\",IF($H41<Données!$C$3,1,0),0)","v":0},0,0,0,{"$f":"IF($N41=Données!$F$12,0,IF($N41<Données!$F$11,1,0))","v":0},null,null,null,null,"-",{"$f":"$U33-$U25+IF($U25>$U33,1)","v":0.33333333333333304},"Heures en HS 20%"]
[null,"2015-01-03",null,null,null,0,{"$f":"IF($D42<>\"\",IF($D42<Données!$C$2,1,0),0)","v":0},null,null,0,{"$f":"IF($H42<>\"\",IF($H42<Données!$C$3,1,0),0)","v":0},0,0,0,{"$f":"IF($N42=Données!$F$12,0,IF($N42<Données!$F$11,1,0))","v":0},null,null,null,null,"-",{"$f":"$U34-$U26+IF($U26>$U34,1)","v":0.36458333333332749},"Heures en HS 40%"]
[null,"2015-01-04",null,null,null,0,{"$f":"IF($D43<>\"\",IF($D43<Données!$C$2,1,0),0)","v":0},null,null,0,{"$f":"IF($H43<>\"\",IF($H43<Données!$C$3,1,0),0)","v":0},0,0,0,{"$f":"IF($N43=Données!$F$12,0,IF($N43<Données!$F$11,1,0))","v":0},null,null,null,null,"-",{"$f":"SUM(U35-U27)","v":-1},"Nombre de repas"]
[null,"Total Semaine",null,null,{"$f":"WEEKNUM(B37,21)","v":1},{"$f":"SUM($F37:$F43)","v":0.312500000000001},{"$f":"G37+G38+G39+G40+G41+G42+G43","v":0},null,null,{"$f":"SUM(J37:J43)","v":0.84375000000000033},{"$f":"K37+K38+K39+K40+K41+K42+K43","v":0},{"$f":"SUM(L37:L43)","v":1.1562500000000013},{"$f":"SUM(M37:M43)","v":0},null,{"$f":"SUM(O37:O43)","v":1}]
[null,{"$f":"B43+1","v":"2015-01-05"},null,null,null,{"$f":"$E45-$D45+IF($D45>$E45,1)","v":0},{"$f":"IF($D45<>\"\",IF($D45<Données!$C$2,1,0),0)","v":0},null,null,{"$f":"$I45-$H45+IF($H45>$I45,1)","v":0},{"$f":"IF($H45<>\"\",IF($H45<Données!$C$3,1,0),0)","v":0},{"$f":"$F45+$J45-($G45+$K45)*(\"00:30\")","v":0},{"$f":"$G45+$K45","v":0},{"$f":"$D45-$I43+IF($I43>$D45,1)","v":0},{"$f":"IF($N45=Données!$F$12,0,IF($N45<Données!$F$11,1,0))","v":0}]
[null,{"$f":"B45+1","v":"2015-01-06"},null,null,null,0,{"$f":"IF($D46<>\"\",IF($D46<Données!$C$2,1,0),0)","v":0},null,null,{"$f":"$I46-$H46+IF($H46>$I46,1)","v":0},{"$f":"IF($H46<>\"\",IF($H46<Données!$C$3,1,0),0)","v":0},{"$f":"$F46+$J46-($G46+$K46)*(\"00:30\")","v":0},{"$f":"$G46+$K46","v":0},{"$f":"$D46-$I45+IF($I45>$D46,1)","v":0},{"$f":"IF($N46=Données!$F$12,0,IF($N46<Données!$F$11,1,0))","v":0}]
[null,{"$f":"B46+1","v":"2015-01-07"},null,null,null,0,{"$f":"IF($D47<>\"\",IF($D47<Données!$C$2,1,0),0)","v":0},null,null,0,{"$f":"IF($H47<>\"\",IF($H47<Données!$C$3,1,0),0)","v":0},0,0,{"$f":"$D47-$I46+IF($I46>$D47,1)","v":0},{"$f":"IF($N47=Données!$F$12,0,IF($N47<Données!$F$11,1,0))","v":0}]
[null,"2015-01-08",null,null,null,0,{"$f":"IF($D48<>\"\",IF($D48<Données!$C$2,1,0),0)","v":0},null,null,0,{"$f":"IF($H48<>\"\",IF($H48<Données!$C$3,1,0),0)","v":0},0,0,0,{"$f":"IF($N48=Données!$F$12,0,IF($N48<Données!$F$11,1,0))","v":0}]
[null,"2015-01-09",null,null,null,0,{"$f":"IF($D49<>\"\",IF($D49<Données!$C$2,1,0),0)","v":0},null,null,0,{"$f":"IF($H49<>\"\",IF($H49<Données!$C$3,1,0),0)","v":0},0,0,0,{"$f":"IF($N49=Données!$F$12,0,IF($N49<Données!$F$11,1,0))","v":0}]
[null,"2015-01-10",null,null,null,0,{"$f":"IF($D50<>\"\",IF($D50<Données!$C$2,1,0),0)","v":0},null,null,0,{"$f":"IF($H50<>\"\",IF($H50<Données!$C$3,1,0),0)","v":0},0,0,0,{"$f":"IF($N50=Données!$F$12,0,IF($N50<Données!$F$11,1,0))","v":0}]
[null,"2015-01-11",null,null,null,0,{"$f":"IF($D51<>\"\",IF($D51<Données!$C$2,1,0),0)","v":0},null,null,0,{"$f":"IF($H51<>\"\",IF($H51<Données!$C$3,1,0),0)","v":0},0,0,0,{"$f":"IF($N51=Données!$F$12,0,IF($N51<Données!$F$11,1,0))","v":0}]
[null,"Total semaine",null,null,{"$f":"WEEKNUM(B45,21)","v":2},{"$f":"SUM($F45:$F51)","v":0},{"$f":"G45+G46+G47+G48+G49+G50+G51","v":0},null,null,{"$f":"SUM(J45:J51)","v":0},{"$f":"K45+K46+K47+K48+K49+K50+K51","v":0},{"$f":"SUM(L45:L51)","v":0},{"$f":"SUM(M45:M51)","v":0},null,{"$f":"SUM(O45:O51)","v":0}]
[null,null,null,null,null,null,null,null,null,null,null,null,null,7.041666666666667]
[null,null,null,null,null,null,null,null,null,null,null,{"$f":"CodeCouleur(M54)","v":50},null,"REPOS"]
[null,null,null,null,null,null,null,null,null,null,null,{"$f":"CodeCouleur(M55)","v":42},null,"Récup"]
[null,null,null,null,null,null,null,null,null,null,null,48,null,"JFG"]
[null,null,null,null,null,null,null,null,null,null,null,44,null,"VAC"]
[null,null,null,null,null,null,null,null,null,null,null,3,null,"MAL"]
[null,null,null,null,null,null,null,null,null,null,null,{"$f":"CodeCouleur(M59)","v":40},null,"Jf Taf"]
["Heures",null,1.4583333333333333,1.625,1.7916666666666667,"Total"]
["Taux",1,1.1000000000000001,1.2,1.4]
["S 1",{"$f":"IF($L$12<=$C$60,$L$12,$C$60)","v":1.4583333333333333},{"$f":"IF($L$12<=$C$60,0,IF($L$12<=$D$60,$L$12,$D$60)-$C$60)","v":0.16666666666666674},{"$f":"IF($L$12<=$D$60,0,IF($L$12<=$E$60,$L$12,$D$60)-$C$60)","v":0.16666666666666674},{"$f":"IF($L$12<=$E$60,0,IF($L$12>$E$60,$L$12,$E$60)-$E$60)","v":0.16666666666666763},{"$f":"B62+C62+D62+E62","v":1.9583333333333344}]
["S 2",{"$f":"IF($L$20<=$C$60,$L$20,$C$60)","v":1.4583333333333333},{"$f":"IF($L$20<=$C$60,0,IF($L$20<=$D$60,$L$20,$D$60)-$C$60)","v":0.16666666666666674},{"$f":"IF($L$20<=$D$60,0,IF($L$20<=$E$60,$L$20,$D$60)-$C$60)","v":0.16666666666666674},{"$f":"IF($L$20<=$E$60,0,IF($L$20>$E$60,$L$20,$E$60)-$E$60)","v":0.16666666666666852},1.9583333333333353]
["S 3",{"$f":"IF($L$28<=$C$60,$L$28,$C$60)","v":1.4583333333333333},{"$f":"IF($L$28<=$C$60,0,IF($L$28<=$D$60,$L$28,$D$60)-$C$60)","v":0.16666666666666674},{"$f":"IF($L$28<=$D$60,0,IF($L$28<=$E$60,$L$28,$D$60)-$C$60)","v":0.16666666666666674},{"$f":"IF($L$28<=$E$60,0,IF($L$28>$E$60,$L$28,$E$60)-$E$60)","v":0.13541666666666829},1.927083333333335]
["S 4",{"$f":"IF($L$36<=$C$60,$L$36,$C$60)","v":1.4583333333333333},{"$f":"IF($L$36<=$C$60,0,IF($L$36<=$D$60,$L$36,$D$60)-$C$60)","v":0.16666666666666674},{"$f":"IF($L$36<=$D$60,0,IF($L$36<=$E$60,$L$36,$D$60)-$C$60)","v":0.16666666666666674},{"$f":"IF($L$36<=$E$60,0,IF($L$36>$E$60,$L$36,$E$60)-$E$60)","v":0.16666666666666807},1.9583333333333348]
["S 5",{"$f":"IF($L$44<=$C$60,$L$44,$C$60)","v":1.1562500000000013},{"$f":"IF($L$44<=$C$60,0,IF($L$44<=$D$60,$L$44,$D$60)-$C$60)","v":0},{"$f":"IF($L$44<=$D$60,0,IF($L$44<=$E$60,$L$44,$D$60)-$C$60)","v":0},{"$f":"IF($L$44<=$E$60,0,IF($L$44>$E$60,$L$44,$E$60)-$E$60)","v":0},1.1562500000000013]
["S 6",{"$f":"IF($L$52<=$C$60,$L$52,$C$60)","v":0},{"$f":"IF($L$52<=$C$60,0,IF($L$52<=$D$60,$L$52,$D$60)-$C$60)","v":0},{"$f":"IF($L$52<=$D$60,0,IF($L$52<=$E$60,$L$52,$D$60)-$C$60)","v":0},{"$f":"IF($L$52<=$E$60,0,IF($L$52>$E$60,$L$52,$E$60)-$E$60)","v":0},0]
["Total",{"$f":"SUM(B62:B67)","v":6.9895833333333339},{"$f":"SUM(C62:C67)","v":0.66666666666666696},{"$f":"SUM(D62:D67)","v":0.66666666666666696},{"$f":"SUM(E62:E67)","v":0.63541666666667251},8.958333333333341]
[]
[]
["Jours","Repos","Récup","Jfg","Vac","Mal","Vides","Taf","Jf Taf","<11h"]
["S 1",{"$f":"NbCellsCoul($D$5:$I$11,50)*0.25","v":0},{"$f":"NbCellsCoul($D$5:$I$11,42)*0.25","v":0},{"$f":"NbCellsCoul($D$5:$I$11,48)*0.25","v":0},{"$f":"NbCellsCoul($D$5:$I$11,44)*0.25","v":0},{"$f":"NbCellsCoul($D$5:$I$11,3)*0.25","v":0},{"$f":"+COUNTBLANK(E5:H11)/2","v":2},{"$f":"7-$G72","v":5},{"$f":"NbCellsCoul($D$5:$I$11,40)*0.25","v":0},{"$f":"SUM($O$6:$O$11)","v":0}]
["S 2",{"$f":"NbCellsCoul($D$13:$I$19,50)*0.25","v":2},{"$f":"NbCellsCoul($D$13:$I$19,42)*0.25","v":0},{"$f":"NbCellsCoul($D$13:$I$19,48)*0.25","v":0},{"$f":"NbCellsCoul($D$13:$I$19,44)*0.25","v":0},{"$f":"NbCellsCoul($D$13:$I$19,3)*0.25","v":0},{"$f":"+COUNTBLANK(E13:H19)/2","v":2},5,{"$f":"NbCellsCoul($D$13:$I$19,40)*0.25","v":0},{"$f":"SUM($O$13:$O$19)","v":1}]
["S 3",{"$f":"NbCellsCoul($D$21:$I$27,50)*0.25","v":2},{"$f":"NbCellsCoul($D$21:$I$27,42)*0.25","v":0},{"$f":"NbCellsCoul($D$21:$I$27,48)*0.25","v":0},{"$f":"NbCellsCoul($D$21:$I$27,44)*0.25","v":0},{"$f":"NbCellsCoul($D$21:$I$27,3)*0.25","v":0},{"$f":"+COUNTBLANK(E21:H27)/2","v":2},5,{"$f":"NbCellsCoul($D$21:$I$27,40)*0.25","v":0},{"$f":"SUM($O$21:$O$27)","v":1}]
["S 4",{"$f":"NbCellsCoul($D$29:$I$35,50)*0.25","v":2},{"$f":"NbCellsCoul($D$29:$I$35,42)*0.25","v":0},{"$f":"NbCellsCoul($D$29:$I$35,48)*0.25","v":0},{"$f":"NbCellsCoul($D$29:$I$35,44)*0.25","v":0},{"$f":"NbCellsCoul($D$29:$I$35,3)*0.25","v":0},{"$f":"+COUNTBLANK(E29:H35)/2","v":2},5,{"$f":"NbCellsCoul($D$29:$I$35,40)*0.25","v":1.5},{"$f":"SUM($O$29:$O$35)","v":0}]
["S 5",{"$f":"NbCellsCoul($D$37:$I$43,50)*0.25","v":0.5},{"$f":"NbCellsCoul($D$37:$I$43,42)*0.25","v":0},{"$f":"NbCellsCoul($D$37:$I$43,48)*0.25","v":0},{"$f":"NbCellsCoul($D$37:$I$43,44)*0.25","v":0},{"$f":"NbCellsCoul($D$37:$I$43,3)*0.25","v":0},{"$f":"+COUNTBLANK(E37:H43)/2","v":4.5},2.5,{"$f":"NbCellsCoul($D$37:$I$43,40)*0.25","v":0},{"$f":"SUM($O$37:$O$43)","v":1}]
["S 6",{"$f":"NbCellsCoul($D$45:$I$51,50)*0.25","v":0},{"$f":"NbCellsCoul($D$45:$I$51,42)*0.25","v":0},{"$f":"NbCellsCoul($D$45:$I$51,48)*0.25","v":0},{"$f":"NbCellsCoul($D$45:$I$51,44)*0.25","v":0},{"$f":"NbCellsCoul($D$45:$I$51,3)*0.25","v":0},{"$f":"+COUNTBLANK(E45:H51)/2","v":7},0,{"$f":"NbCellsCoul($D$45:$I$51,40)*0.25","v":0},{"$f":"SUM($O$45:$O$51)","v":0}]
["Total",{"$f":"SUM(B$72:B$77)","v":6.5},0,0,0,{"$f":"SUM(F$72:F$77)","v":0},{"$f":"SUM(G$72:G$77)","v":19.5},{"$f":"SUM(H$72:H$77)","v":22.5},{"$f":"SUM(I$72:I$77)","v":1.5},{"$f":"SUM(J$72:J$77)","v":3}]