{"text_format":"1","workbook":"xlsx","n_sheets":5,"sheets":["MENUS","CALCUL EFFECTIFS","QUANTITES TOTAL","FEUILLE FAB","BL"],"not_rendered":{"charts":0,"images":0,"macros":1,"external_links":0,"defined_names":5,"comments":0,"pivot_tables":0},"unopened":[],"bounds":{"document_bytes":16777216,"sheet_cells":100000,"rows_first":2000,"rows_last":500,"rows_between":2000,"halvings":0,"cell_chars":16384,"cell_head_chars":4096},"cells_cut":0,"cells_raw":0,"read":"whole","date_system":"1900"}

{"sheet":"MENUS","index":0,"n_rows":44,"n_cols":5,"rows_kept":44,"cut":false,"hidden":false,"merged":[[26,4,27,7]]}
[]
[]
[null,"NORMAL"]
[null,"MACEDOINE CŒUR PALMOIER"]
[null,"SAUCISSE DE TOULOUSE"]
[null,"BROCOLIS",null,null,"!!!!RENTRER LE MENU NORMAL!!!!"]
[null,"YAOURT"]
[null,"RIZ AU CARAMEL"]
[null,null,null,null,"!!!!!CELLULE POUR LE POTAGE!!!!!"]
[]
[null,"S.SEL"]
[null,{"$f":"B4","v":"MACEDOINE CŒUR PALMOIER"}]
[null,"ESCALOPE DE DINDE"]
[null,{"$f":"B6","v":"BROCOLIS"}]
[null,"YAOURT"]
[null,"RIZ AU CARAMEL"]
[]
[null,"S.SUCRE"]
[null,{"$f":"B4","v":"MACEDOINE CŒUR PALMOIER"}]
[null,{"$f":"B5","v":"SAUCISSE DE TOULOUSE"}]
[null,"BROCOLIS"]
[null,"YAOURT"]
[null,"KIWI"]
[]
[null,"S.SEL / S.SUCRE / ALLEGE"]
[null,{"$f":"B4","v":"MACEDOINE CŒUR PALMOIER"}]
[null,"ESCALOPE DE DINDE",null,null,"!!! FAIRE MODIFS SI BESOINS !!!"]
[null,{"$f":"B6","v":"BROCOLIS"}]
[null,"YAOURT"]
[null,"KIWI"]
[]
[null,"S.PORC"]
[null,{"$f":"B4","v":"MACEDOINE CŒUR PALMOIER"}]
[null,"ESCALOPE DE DINDE"]
[null,"BROCOLIS"]
[null,"YAOURT"]
[null,"RIZ AU CARAMEL"]
[]
[null,"REPAS FROIDS"]
[null,{"$f":"B4","v":"MACEDOINE CŒUR PALMOIER"}]
[null,{"$f":"B5","v":"SAUCISSE DE TOULOUSE"}]
[null,"BROCOLIS"]
[null,"YAOURT"]
[null,"RIZ AU CARAMEL"]

{"sheet":"CALCUL EFFECTIFS","index":1,"n_rows":90,"n_cols":39,"rows_kept":90,"cut":false,"hidden":false,"merged":[[33,17,33,29],[1,11,1,18],[2,11,2,18],[1,19,1,31],[2,19,2,31],[34,30,35,31],[5,37,6,37],[19,37,20,37],[34,37,35,37],[5,34,6,34],[5,32,6,32],[33,30,33,36],[18,17,18,29],[48,37,49,37],[59,37,60,37],[70,37,71,37],[81,37,82,37],[34,32,35,32],[34,33,35,33],[34,34,35,34],[34,35,35,35],[34,36,35,36],[70,34,71,34],[70,35,71,35],[70,36,71,36],[81,34,82,34],[81,35,82,35],[81,36,82,36],[48,35,49,35],[48,36,49,36],[34,3,35,3],[34,4,35,4],[34,5,35,5],[34,6,35,6],[34,7,35,7],[34,8,35,8],[34,9,35,9],[34,10,35,10],[34,11,35,11],[4,5,4,7],[4,8,4,16],[4,17,4,29],[4,30,4,36],[5,7,6,7],[5,8,6,8],[5,9,6,9],[5,10,6,10],[5,11,6,11],[5,12,6,12],[5,13,6,13],[5,14,6,14],[5,15,6,15],[5,16,6,16],[5,35,6,35],[5,36,6,36],[5,24,6,25],[5,26,5,29],[5,30,6,31],[5,22,6,23],[5,3,6,3],[5,4,6,4],[5,5,6,5],[5,6,6,6],[5,17,5,21],[18,30,18,36],[19,3,20,3],[19,4,20,4],[19,5,20,5],[19,6,20,6],[19,7,20,7],[19,8,20,8],[19,9,20,9],[19,10,20,10],[19,11,20,11],[19,12,20,12],[19,13,20,13],[19,14,20,14],[19,15,20,15],[19,16,20,16],[19,36,20,36],[5,33,6,33],[18,5,18,7],[18,8,18,16],[47,17,47,29],[47,30,47,36],[19,30,20,31],[19,32,20,32],[19,33,20,33],[19,34,20,34],[19,35,20,35],[33,5,33,7],[33,8,33,16],[19,22,20,23],[19,24,20,25],[19,26,19,29],[34,26,34,29],[34,12,35,12],[34,13,35,13],[34,14,35,14],[34,15,35,15],[34,16,35,16],[34,17,34,21],[34,22,35,23],[34,24,35,25],[19,17,19,21],[47,5,47,7],[47,8,47,16],[59,3,60,3],[59,4,60,4],[59,5,60,5],[59,6,60,6],[48,3,49,3],[48,4,49,4],[48,5,49,5],[48,6,49,6],[48,34,49,34],[58,5,58,7],[58,8,58,16],[59,13,60,13],[59,14,60,14],[58,17,58,29],[58,30,58,36],[48,24,49,25],[48,26,48,29],[48,30,49,31],[48,32,49,32],[48,33,49,33],[48,16,49,16],[48,17,48,21],[48,22,49,23],[48,13,49,13],[48,14,49,14],[48,15,49,15],[48,12,49,12],[48,8,49,8],[48,9,49,9],[48,10,49,10],[48,11,49,11],[48,7,49,7],[69,5,69,7],[69,8,69,16],[59,12,60,12],[59,7,60,7],[59,8,60,8],[59,9,60,9],[59,10,60,10],[59,11,60,11],[59,15,60,15],[69,17,69,29],[69,30,69,36],[59,24,60,25],[59,26,59,29],[59,30,60,31],[59,32,60,32],[59,33,60,33],[59,16,60,16],[59,17,59,21],[59,22,60,23],[59,34,60,34],[59,35,60,35],[59,36,60,36],[70,10,71,10],[70,11,71,11],[81,3,82,3],[81,4,82,4],[81,5,82,5],[81,6,82,6],[81,7,82,7],[81,8,82,8],[81,9,82,9],[81,10,82,10],[81,11,82,11],[70,3,71,3],[70,4,71,4],[70,5,71,5],[70,6,71,6],[70,7,71,7],[70,8,71,8],[70,9,71,9],[70,24,71,25],[70,26,70,29],[70,30,71,31],[70,32,71,32],[70,33,71,33],[70,16,71,16],[70,17,70,21],[70,22,71,23],[70,12,71,12],[70,15,71,15],[70,13,71,13],[70,14,71,14],[81,24,82,25],[81,26,81,29],[81,30,82,31],[81,32,82,32],[81,33,82,33],[81,16,82,16],[81,17,81,21],[81,22,82,23],[80,5,80,7],[80,8,80,16],[80,17,80,29],[80,30,80,36],[81,12,82,12],[81,13,82,13],[81,14,82,14],[81,15,82,15]]}
[]
[null,null,null,null,null,null,null,null,null,null,null,"REPAS DU :",null,null,null,null,null,null,null,"2015-11-05"]
[null,null,null,null,null,null,null,null,null,null,null,"FABRIQUE LE :",null,null,null,null,null,null,null,"2015-11-03"]
[]
[null,null,null,null,null,"MONTR.",null,null,"MONTR.",null,null,null,null,null,null,null,null,"ROMO",null,null,null,null,null,null,null,null,null,null,null,null,"SALBRIS"]
[null,null,null,"ADMR","ETS","U1","U2","U3","2RA",425,"4RL",2114,"8RA",1005,1015,"10RA","Educ","FO / FAM",null,null,null,null,"ESAT",null,"FH",null,"IME",null,null,null,"ESAT",null,"CORM","HIRO","CHEV","SARC","FOYER","H.C"]
[null,null,null,null,null,null,null,null,null,null,null,null,null,null,null,null,null,"U1","U2","U3","U4","U5",null,null,null,null,"U1","U2","U3","U4",null,null,null,null,null,null,null,"CHIENS"]
[null,null,"NORMAUX",26,21,10,7,10,null,null,null,1,null,null,null,null,null,6,7,6,4,null,null,null,24,null,null,null,null,null,null,null,3,null,3,3,5]
[null,null,"SANS SEL",4]
[null,null,"SANS SUCRE",3,null,1,null,null,null,null,null,null,null,null,null,null,null,null,null,null,null,null,null,null,null,null,null,null,null,null,null,null,1]
[null,null,"HYPO",1,null,null,2,2,null,null,null,null,null,null,null,null,null,2,1,2,2,null,null,null,1,null,null,null,null,null,null,null,null,null,null,null,1]
[null,null,"S.PORC",null,null,null,1]
[null,null,"REPAS FROID"]
[null,null,"TOTAL",{"$f":"SUM(D8:D13)","v":34},{"$f":"SUM(E8:E13)","v":21},11,10,12,0,0,0,1,0,0,0,0,0,8,8,8,6,0,0,0,25,0,0,0,0,0,0,0,4,0,3,3,6,0]
[null,null,"CADEAUX",34]
[]
[]
[]
[null,null,null,null,null,"MONTR.",null,null,"MONTR.",null,null,null,null,null,null,null,null,"ROMO",null,null,null,null,null,null,null,null,null,null,null,null,"SALBRIS"]
[null,null,null,"ADMR","ETS","U1","U2","U3","2RA",425,"4RL",2114,"8RA",1005,1015,"10RA","Educ","FO / FAM",null,null,null,null,"ESAT",null,"FH",null,"IME",null,null,null,"ESAT",null,"CORM","HIRO","CHEV","SARC","FOYER","H.C"]
[null,null,"ENTREE",null,null,null,null,null,null,null,null,null,null,null,null,null,null,"U1","U2","U3","U4","U5",null,null,null,null,"U1","U2","U3","U4",null,null,null,null,null,null,null,"CHIENS","TOTAL"]
[null,{"$f":"MENUS!B4","v":"MACEDOINE CŒUR PALMOIER"},"NORMAUX",{"$f":"$D$8","v":26},{"$f":"$E$8","v":21},{"$f":"$F$14-F25-F27-F29-F31","v":11},{"$f":"$G$14-G25-G27-G29-G31","v":10},{"$f":"$H$14-H25-H27-H29-H31","v":12},{"$f":"$I$14-I25-I27-I29-I31","v":0},{"$f":"$J$14-J25-J27-J29-J31","v":0},{"$f":"$K$14-K25-K27-K29-K31","v":0},{"$f":"$L$14-L25-L27-L29-L31","v":1},{"$f":"$M$14-M25-M27-M29-M31","v":0},{"$f":"$N$14-N25-N27-N29-N31","v":0},{"$f":"$O$14-O25-O27-O29-O31","v":0},{"$f":"$P$14-P25-P27-P29-P31","v":0},{"$f":"$Q$14-Q25-Q27-Q29-Q31","v":0},{"$f":"$R$14-R25-R27-R29-R31","v":8},{"$f":"$S$14-S25-S27-S29-S31","v":8},{"$f":"$T$14-T25-T27-T29-T31","v":8},{"$f":"$U$14-U25-U27-U29-U31","v":6},{"$f":"$V$14-V25-V27-V29-V31","v":0},{"$f":"$W$14-W25-W27-W29-W31","v":0},{"$f":"$X$14-X25-X27-X29-X31","v":0},{"$f":"$Y$14-Y25-Y27-Y29-Y31","v":25},{"$f":"$Z$14-Z25-Z27-Z29-Z31","v":0},{"$f":"$AA$14-AA25-AA27-AA29-AA31","v":0},{"$f":"$AB$14-AB25-AB27-AB29-AB31","v":0},{"$f":"$AC$14-AC25-AC27-AC29-AC31","v":0},{"$f":"$AD$14-AD25-AD27-AD29-AD31","v":0},{"$f":"$AE$14-AE25-AE27-AE29-AE31","v":0},{"$f":"$AF$8","v":0},{"$f":"$AG$14-AG25-AG27-AG29-AG31","v":4},{"$f":"$AH$14-AH25-AH27-AH29-AH31","v":0},{"$f":"$AI$14-AI25-AI27-AI29-AI31","v":3},{"$f":"$AJ$14-AJ25-AJ27-AJ29-AJ31","v":3},{"$f":"$AK$14-AK25-AK27-AK29-AK31","v":6},{"$f":"$AL$14-AL25-AL27-AL29-AL31","v":0},{"$f":"SUM(D22:AK22)","v":152}]
[null,"FEUILLE FAB",null,null,null,{"$f":"IF(F22>0,F22,$A$2&\"\")","v":11},{"$f":"IF(G22>0,G22,$A$2&\"\")","v":10},12,"","","",1,"","","","","",8,8,8,6,"","","",25,"","","","","","","",4,"",{"$f":"IF(AI22>0,AI22,$A$2&\"\")","v":3},3,6,{"$f":"IF(AL22>0,AL22,$A$2&\"\")","v":""},105]
[null,{"$f":"MENUS!B12","v":"MACEDOINE CŒUR PALMOIER"},"SANS SEL",{"$f":"$D$9","v":4},null,null,null,null,null,null,null,null,null,null,null,null,null,null,null,null,null,null,null,null,null,null,null,null,null,null,null,null,null,null,null,null,null,null,4]
[null,{"$f":"MENUS!B19","v":"MACEDOINE CŒUR PALMOIER"},"SANS SUCRE",{"$f":"$D$10","v":3},null,{"$f":"IF($B$25=$B$22,0,F10)","v":0},{"$f":"IF($B$25=$B$22,0,G10)","v":0},{"$f":"IF($B$25=$B$22,0,H10)","v":0},null,null,null,null,null,null,null,null,null,{"$f":"IF($B$25=$B$22,0,R10)","v":0},0,0,0,0,0,0,0,null,0,0,0,0,0,null,0,0,0,0,0,{"$f":"IF($B$25=$B$22,0,AL10)","v":0},3]
[null,"FEUILLE FAB",null,null,null,{"$f":"IF(F25>0,F25,$A$2&\"\")","v":""},{"$f":"IF(G25>0,G25,$A$2&\"\")","v":""},"","","","","","","","","","","","","","","","","",{"$f":"IF(Y25>0,Y25,$A$2&\"\")","v":""},"","","","","","","",{"$f":"IF(AG25>0,AG25,$A$2&\"\")","v":""},"","","","",{"$f":"IF(AL25>0,AL25,$A$2&\"\")","v":""},{"$f":"SUM(D26:AK26)","v":0}]
[null,{"$f":"MENUS!B26","v":"MACEDOINE CŒUR PALMOIER"},"HYPO",{"$f":"$D$11","v":1},null,{"$f":"IF($B$27=$B$22,0,F11)","v":0},{"$f":"IF($B$27=$B$22,0,G11)","v":0},{"$f":"IF($B$27=$B$22,0,H11)","v":0},null,null,null,null,null,null,null,null,null,{"$f":"IF($B$27=$B$22,0,R11)","v":0},0,0,0,0,0,0,0,0,0,0,0,0,0,null,{"$f":"IF($B$27=$B$22,0,AG11)","v":0},0,0,0,0,0,1]
[null,"FEUILLE FAB",null,null,null,{"$f":"IF(F27>0,F27,$A$2&\"\")","v":""},"","","","","","","","","","","","","","","","","","","","","","","","","","","","","","","","",0]
[null,{"$f":"MENUS!B33","v":"MACEDOINE CŒUR PALMOIER"},"S.PORC",null,null,{"$f":"IF($B$29=$B$22,0,F12)","v":0},{"$f":"IF($B$29=$B$22,0,G12)","v":0},0,null,null,null,null,null,null,null,null,null,{"$f":"IF($B$29=$B$22,0,R12)","v":0},0,0,0,0,0,0,0,null,{"$f":"IF($B$29=$B$22,0,AA12)","v":0},0,0,0,0,null,{"$f":"IF($B$29=$B$22,0,AG12)","v":0},0,0,0,0,0,0]
[null,"FEUILLE FAB",null,null,null,{"$f":"IF(F29>0,F29,$A$2&\"\")","v":""},{"$f":"IF(G29>0,G29,$A$2&\"\")","v":""},"","","","","","","","","","","","","","","","","","","","","","","","","","","","","","","",0]
[null,{"$f":"MENUS!B40","v":"MACEDOINE CŒUR PALMOIER"},"REPAS FROID",null,null,{"$f":"$F$13","v":0},{"$f":"$G$13","v":0},{"$f":"$H$13","v":0},null,null,null,null,null,null,null,null,null,{"$f":"$R$13","v":0},{"$f":"$S$13","v":0},{"$f":"$T$13","v":0},{"$f":"$U$13","v":0},{"$f":"$V$13","v":0},{"$f":"$W$13","v":0},{"$f":"$X$13","v":0},{"$f":"$Y$13","v":0},null,{"$f":"$AA$13","v":0},{"$f":"$AB$13","v":0},{"$f":"$AC$13","v":0},{"$f":"$AD$13","v":0},{"$f":"$AE$13","v":0},{"$f":"$AF$13","v":0},{"$f":"$AG$13","v":0},{"$f":"$AH$13","v":0},{"$f":"$AI$13","v":0},{"$f":"$AJ$13","v":0},{"$f":"$AK$13","v":0},{"$f":"$AK$13","v":0},0]
[null,null,"TOTAL",{"$f":"D22+D24+D25+D27","v":34},{"$f":"E22","v":21},{"$f":"F22+F25+F27+F29+F31","v":11},10,12,0,0,0,1,0,0,0,0,0,8,8,8,6,0,0,0,25,0,0,0,0,0,0,0,4,0,3,3,6,{"$f":"AL22+AL25+AL27+AL29+AL31","v":0},160]
[]
[null,null,null,null,null,"MONTR.",null,null,"MONTR.",null,null,null,null,null,null,null,null,"ROMO",null,null,null,null,null,null,null,null,null,null,null,null,"SALBRIS"]
[null,null,null,"ADMR","ETS","U1","U2","U3","2RA",425,"4RL",2114,"8RA",1005,1015,"10RA","Educ","FO / FAM",null,null,null,null,"ESAT",null,"FH",null,"IME",null,null,null,"ESAT",null,"CORM","HIRO","CHEV","SARC","FOYER","H.C"]
[null,null,"ENTREE",null,null,null,null,null,null,null,null,null,null,null,null,null,null,"U1","U2","U3","U4","U5",null,null,null,null,"U1","U2","U3","U4",null,null,null,null,null,null,null,"CHIENS","TOTAL"]
[null,{"$f":"IF(B43=\"POTAGE\",B43,B22)","v":"MACEDOINE CŒUR PALMOIER"},"NORMAUX",{"$f":"$D$8","v":26},{"$f":"$E$8","v":21},{"$f":"$F$14-F39-F40-F41-F42","v":11},{"$f":"$G$14-G39-G40-G41-G42","v":10},{"$f":"$H$14-H39-H40-H41-H42","v":12},{"$f":"$I$14-I39-I40-I41-I42","v":0},{"$f":"$J$14-J39-J40-J41-J42","v":0},{"$f":"$K$14-K39-K40-K41-K42","v":0},{"$f":"$L$14-L39-L40-L41-L42","v":1},{"$f":"$M$14-M39-M40-M41-M42","v":0},{"$f":"$N$14-N39-N40-N41-N42","v":0},{"$f":"$O$14-O39-O40-O41-O42","v":0},{"$f":"$P$14-P39-P40-P41-P42","v":0},{"$f":"$Q$14-Q39-Q40-Q41-Q42","v":0},{"$f":"$R$14-R39-R40-R41-R42","v":8},{"$f":"$S$14-S39-S40-S41-S42","v":8},{"$f":"$T$14-T39-T40-T41-T42","v":8},{"$f":"$U$14-U39-U40-U41-U42","v":6},{"$f":"$V$14-V39-V40-V41-V42","v":0},{"$f":"$W$14-W39-W40-W41-W42","v":0},{"$f":"$X$14-X39-X40-X41-X42","v":0},{"$f":"$Y$14-Y39-Y40-Y41-Y42","v":25},{"$f":"$Z$14-Z39-Z40-Z41-Z42","v":0},{"$f":"$AA$14-AA39-AA40-AA41-AA42","v":0},{"$f":"$AB$14-AB39-AB40-AB41-AB42","v":0},{"$f":"$AC$14-AC39-AC40-AC41-AC42","v":0},{"$f":"$AD$14-AD39-AD40-AD41-AD42","v":0},{"$f":"$AE$14-AE39-AE40-AE41-AE42","v":0},{"$f":"$AF$8","v":0},{"$f":"$AG$14-AG39-AG40-AG41-AG42","v":4},{"$f":"$AH$14-AH39-AH40-AH41-AH42","v":0},{"$f":"$AI$14-AI39-AI40-AI41-AI42","v":3},{"$f":"$AJ$14-AJ39-AJ40-AJ41-AJ42","v":3},{"$f":"$AK$14-AK39-AK40-AK41-AK42","v":6},{"$f":"$AL$14-AL39-AL40-AL41-AL42","v":0},{"$f":"SUM(D37:AK37)","v":152}]
[null,{"$f":"IF(B43=\"POTAGE\",B43,B24)","v":"MACEDOINE CŒUR PALMOIER"},"SANS SEL",{"$f":"$D$9","v":4},null,null,null,null,null,null,null,null,null,null,null,null,null,null,null,null,null,null,null,null,null,null,null,null,null,null,null,null,null,null,null,null,null,null,4]
[null,{"$f":"IF(B43=\"POTAGE\",B43,B25)","v":"MACEDOINE CŒUR PALMOIER"},"SANS SUCRE",{"$f":"$D$10","v":3},null,{"$f":"IF($B$39=$B$37,0,F10)","v":0},{"$f":"IF($B$39=$B$37,0,G10)","v":0},0,null,null,null,null,null,null,null,null,null,{"$f":"IF($B$39=$B$37,0,R10)","v":0},0,0,0,0,0,0,0,null,{"$f":"IF($B$39=$B$37,0,AA10)","v":0},0,0,0,0,null,{"$f":"IF($B$39=$B$37,0,AG10)","v":0},0,0,0,0,{"$f":"IF($B$39=$B$37,0,AL10)","v":0},3]
[null,{"$f":"IF(B43=\"POTAGE\",B43,B27)","v":"MACEDOINE CŒUR PALMOIER"},"HYPO",{"$f":"$D$11","v":1},null,{"$f":"IF($B$40=$B$37,0,F11)","v":0},0,0,null,null,null,null,null,null,null,null,null,{"$f":"IF($B$40=$B$37,0,R11)","v":0},0,0,0,0,0,0,0,0,0,0,0,0,0,null,{"$f":"IF($B$40=$B$37,0,AG11)","v":0},0,0,0,0,{"$f":"IF($B$40=$B$37,0,AL11)","v":0},1]
[null,{"$f":"IF(B43=\"POTAGE\",B43,B29)","v":"MACEDOINE CŒUR PALMOIER"},"S.PORC",null,null,{"$f":"IF($B$41=$B$37,0,F12)","v":0},{"$f":"IF($B$41=$B$37,0,G12)","v":0},0,null,null,null,null,null,null,null,null,null,{"$f":"IF($B$41=$B$37,0,R12)","v":0},0,0,0,0,0,0,0,null,{"$f":"IF($B$41=$B$37,0,AA12)","v":0},0,0,0,0,null,{"$f":"IF($B$41=$B$37,0,AG12)","v":0},0,0,0,0,0,0]
[null,{"$f":"B31","v":"MACEDOINE CŒUR PALMOIER"},"REPAS FROID",null,null,{"$f":"$F$13","v":0},{"$f":"$G$13","v":0},{"$f":"$H$13","v":0},null,null,null,null,null,null,null,null,null,{"$f":"$R$13","v":0},{"$f":"$S$13","v":0},{"$f":"$T$13","v":0},{"$f":"$U$13","v":0},{"$f":"$V$13","v":0},{"$f":"$W$13","v":0},{"$f":"$X$13","v":0},{"$f":"$Y$13","v":0},null,{"$f":"$AA$13","v":0},{"$f":"$AB$13","v":0},{"$f":"$AC$13","v":0},{"$f":"$AD$13","v":0},{"$f":"$AE$13","v":0},{"$f":"$AF$13","v":0},{"$f":"$AG$13","v":0},{"$f":"$AH$13","v":0},{"$f":"$AI$13","v":0},{"$f":"$AJ$13","v":0},{"$f":"$AK$13","v":0},{"$f":"$AK$13","v":0},0]
[null,{"$f":"IF(MENUS!B9=\"POTAGE\",MENUS!B9,MENUS!B4)","v":"MACEDOINE CŒUR PALMOIER"},"AUTRE",null,null,{"$f":"IF($B$43=\"POTAGE\",F37)","v":false},{"$f":"IF($B$43=\"POTAGE\",G37)","v":false},{"$f":"IF($B$43=\"POTAGE\",H37)","v":false},false,false,false,false,false,false,false,false,false,false,false,false,false,false,false,false,false,false,false,false,false,false,false,false,{"$f":"IF($B$43=\"POTAGE\",AG37)","v":false},false,false,false,false,{"$f":"IF($B$43=\"POTAGE\",AL37)","v":false},0]
[null,null,"FEUILLE FAB",null,null,{"$f":"IF(F43>0,F43,$A$5&\"\")","v":false},{"$f":"IF(G43>0,G43,$A$5&\"\")","v":false},{"$f":"IF(H43>0,H43,$A$5&\"\")","v":false},false,false,false,false,false,false,false,false,false,false,false,false,false,false,false,false,false,false,false,false,false,false,false,false,false,false,false,false,false,{"$f":"IF(AL43>0,AL43,$A$5&\"\")","v":false},0]
[null,null,"TOTAL",{"$f":"SUM(D37:D42)","v":34},21,11,10,12,0,0,0,1,0,0,0,0,0,8,8,8,6,0,0,0,25,0,0,0,0,0,0,0,4,0,3,3,6,{"$f":"SUM(AL37:AL42)","v":0},160]
[]
[]
[null,null,null,null,null,"MONTR.",null,null,"MONTR.",null,null,null,null,null,null,null,null,"ROMO",null,null,null,null,null,null,null,null,null,null,null,null,"SALBRIS"]
[null,null,null,"ADMR","ETS","U1","U2","U3","2RA",425,"4RL",2114,"8RA",1005,1015,"10RA","Educ","FO / FAM",null,null,null,null,"ESAT",null,"FH",null,"IME",null,null,null,"ESAT",null,"CORM","HIRO","CHEV","SARC","FOYER","H.C"]
[null,null,"PLAT",null,null,null,null,null,null,null,null,null,null,null,null,null,null,"U1","U2","U3","U4","U5",null,null,null,null,"U1","U2","U3","U4",null,null,null,null,null,null,null,"CHIENS","TOTAL"]
[null,{"$f":"MENUS!B5","v":"SAUCISSE DE TOULOUSE"},"NORMAUX",{"$f":"$D$8","v":26},{"$f":"$E$8","v":21},{"$f":"$F$14-F53-F54-F55-F56","v":11},{"$f":"$G$14-G53-G54-G55-G56","v":7},{"$f":"$H$14-H53-H54-H55-H56","v":10},{"$f":"$I$8","v":0},{"$f":"$J$8","v":0},{"$f":"$K$8","v":0},{"$f":"$L$8","v":1},{"$f":"$M$8","v":0},{"$f":"$N$8","v":0},{"$f":"$O$8","v":0},{"$f":"$P$8","v":0},{"$f":"$Q$8","v":0},{"$f":"$R$14-R53-R54-R55-R56","v":6},{"$f":"$S$14-S53-S54-S55-S56","v":7},{"$f":"$T$14-T53-T54-T55-T56","v":6},{"$f":"$U$14-U53-U54-U55-U56","v":4},{"$f":"$V$14-V53-V54-V55-V56","v":0},{"$f":"$W$14-W53-W54-W55-W56","v":0},{"$f":"$X$14-X53-X54-X55-X56","v":0},{"$f":"$Y$14-Y53-Y54-Y55-Y56","v":24},{"$f":"$Z$14-Z53-Z54-Z55-Z56","v":0},{"$f":"$AA$14-AA53-AA54-AA55-AA56","v":0},{"$f":"$AB$14-AB53-AB54-AB55-AB56","v":0},{"$f":"$AC$14-AC53-AC54-AC55-AC56","v":0},{"$f":"$AD$14-AD53-AD54-AD55-AD56","v":0},{"$f":"$AE$14-AE53-AE54-AE55-AE56","v":0},{"$f":"$AF$8","v":0},{"$f":"$AG$14-AG53-AG54-AG55-AG56","v":4},{"$f":"$AH$14-AH53-AH54-AH55-AH56","v":0},{"$f":"$AI$14-AI53-AI54-AI55-AI56","v":3},{"$f":"$AJ$14-AJ53-AJ54-AJ55-AJ56","v":3},{"$f":"$AK$14-AK53-AK54-AK55-AK56","v":5},{"$f":"$AL$14-AL53-AL54-AL55-AL56","v":0},{"$f":"SUM(D51:AK51)","v":138}]
[null,{"$f":"MENUS!B13","v":"ESCALOPE DE DINDE"},"SANS SEL",{"$f":"$D$9","v":4},null,null,null,null,null,null,null,null,null,null,null,null,null,null,null,null,null,null,null,null,null,null,null,null,null,null,null,null,null,null,null,null,null,null,4]
[null,{"$f":"MENUS!B20","v":"SAUCISSE DE TOULOUSE"},"SANS SUCRE",{"$f":"$D$10","v":3},null,{"$f":"IF($B$53=$B$51,0,F10)","v":0},{"$f":"IF($B$53=$B$51,0,G10)","v":0},0,null,null,null,null,null,null,null,null,null,{"$f":"IF($B$53=$B$51,0,R10)","v":0},0,0,0,0,0,0,0,null,{"$f":"IF($B$53=$B$51,0,AA10)","v":0},0,0,0,0,null,{"$f":"IF($B$53=$B$51,0,AG10)","v":0},0,0,0,0,{"$f":"IF($B$53=$B$51,0,AL10)","v":0},3]
[null,{"$f":"MENUS!B27","v":"ESCALOPE DE DINDE"},"HYPO",{"$f":"$D$11","v":1},null,{"$f":"IF($B$54=$B$51,0,F11)","v":0},{"$f":"IF($B$54=$B$51,0,G11)","v":2},2,null,null,null,null,null,null,null,null,null,{"$f":"IF($B$54=$B$51,0,R11)","v":2},1,2,2,0,0,0,1,0,{"$f":"IF($B$54=$B$51,0,AA11)","v":0},0,0,0,0,null,{"$f":"IF($B$54=$B$51,0,AG11)","v":0},0,0,0,1,{"$f":"IF($B$54=$B$51,0,AL11)","v":0},14]
[null,{"$f":"MENUS!B34","v":"ESCALOPE DE DINDE"},"S.PORC",null,null,{"$f":"IF($B$55=$B$51,0,F12)","v":0},{"$f":"IF($B$55=$B$51,0,G12)","v":1},0,null,null,null,null,null,null,null,null,null,{"$f":"IF($B$55=$B$51,0,R12)","v":0},0,0,0,0,0,0,0,null,{"$f":"IF($B$55=$B$51,0,AA12)","v":0},0,0,0,0,null,{"$f":"IF($B$55=$B$51,0,AG12)","v":0},0,0,0,0,{"$f":"IF($B$55=$B$51,0,AL12)","v":0},1]
[null,{"$f":"MENUS!B41","v":"SAUCISSE DE TOULOUSE"},"REPAS FROID",null,null,{"$f":"$F$13","v":0},{"$f":"$G$13","v":0},{"$f":"$H$13","v":0},null,null,null,null,null,null,null,null,null,{"$f":"$R$13","v":0},{"$f":"$S$13","v":0},{"$f":"$T$13","v":0},{"$f":"$U$13","v":0},{"$f":"$V$13","v":0},{"$f":"$W$13","v":0},{"$f":"$X$13","v":0},{"$f":"$Y$13","v":0},null,{"$f":"$AA$13","v":0},{"$f":"$AB$13","v":0},{"$f":"$AC$13","v":0},{"$f":"$AD$13","v":0},{"$f":"$AE$13","v":0},{"$f":"$AF$13","v":0},{"$f":"$AG$13","v":0},{"$f":"$AH$13","v":0},{"$f":"$AI$13","v":0},{"$f":"$AJ$13","v":0},{"$f":"$AK$13","v":0},{"$f":"$AK$13","v":0},0]
[null,null,"TOTAL",{"$f":"SUM(D51:D56)","v":34},{"$f":"SUM(E51:E56)","v":21},11,10,12,0,0,0,1,0,0,0,0,0,8,8,8,6,0,0,0,25,0,0,0,0,0,0,0,4,0,3,3,6,{"$f":"SUM(AL51:AL56)","v":0},160]
[]
[null,null,null,null,null,"MONTR.",null,null,"MONTR.",null,null,null,null,null,null,null,null,"ROMO",null,null,null,null,null,null,null,null,null,null,null,null,"SALBRIS"]
[null,null,null,"ADMR","ETS","U1","U2","U3","2RA",425,"4RL",2114,"8RA",1005,1015,"10RA","Educ","FO / FAM",null,null,null,null,"ESAT",null,"FH",null,"IME",null,null,null,"ESAT",null,"CORM","HIRO","CHEV","SARC","FOYER","H.C"]
[null,null,"LEGUMES",null,null,null,null,null,null,null,null,null,null,null,null,null,null,"U1","U2","U3","U4","U5",null,null,null,null,"U1","U2","U3","U4",null,null,null,null,null,null,null,"CHIENS","TOTAL"]
[null,{"$f":"MENUS!B6","v":"BROCOLIS"},"NORMAUX",{"$f":"$D$8","v":26},{"$f":"$E$8","v":21},{"$f":"$F$14-F64-F65-F66-F67","v":11},{"$f":"$G$14-G64-G65-G66-G67","v":10},{"$f":"$H$14-H64-H65-H66-H67","v":12},{"$f":"$I$8","v":0},{"$f":"$J$8","v":0},{"$f":"$K$8","v":0},{"$f":"$L$8","v":1},{"$f":"$M$8","v":0},{"$f":"$N$8","v":0},{"$f":"$O$8","v":0},{"$f":"$P$8","v":0},{"$f":"$Q$8","v":0},{"$f":"$R$14-R64-R65-R66-R67","v":8},{"$f":"$S$14-S64-S65-S66-S67","v":8},{"$f":"$T$14-T64-T65-T66-T67","v":8},{"$f":"$U$14-U64-U65-U66-U67","v":6},{"$f":"$V$14-V64-V65-V66-V67","v":0},{"$f":"$W$14-W64-W65-W66-W67","v":0},{"$f":"$X$14-X64-X65-X66-X67","v":0},{"$f":"$Y$14-Y64-Y65-Y66-Y67","v":25},{"$f":"$Z$14-Z64-Z65-Z66-Z67","v":0},{"$f":"$AA$14-AA64-AA65-AA66-AA67","v":0},{"$f":"$AB$14-AB64-AB65-AB66-AB67","v":0},{"$f":"$AC$14-AC64-AC65-AC66-AC67","v":0},{"$f":"$AD$14-AD64-AD65-AD66-AD67","v":0},{"$f":"$AE$14-AE64-AE65-AE66-AE67","v":0},{"$f":"$AF$8","v":0},{"$f":"$AG$14-AG64-AG65-AG66-AG67","v":4},{"$f":"$AH$14-AH64-AH65-AH66-AH67","v":0},{"$f":"$AI$14-AI64-AI65-AI66-AI67","v":3},{"$f":"$AJ$14-AJ64-AJ65-AJ66-AJ67","v":3},{"$f":"$AK$14-AK64-AK65-AK66-AK67","v":6},{"$f":"$AL$14-AL64-AL65-AL66-AL67","v":0},{"$f":"SUM(D62:AK62)","v":152}]
[null,{"$f":"MENUS!B14","v":"BROCOLIS"},"SANS SEL",{"$f":"$D$9","v":4},null,null,null,null,null,null,null,null,null,null,null,null,null,null,null,null,null,null,null,null,null,null,null,null,null,null,null,null,null,null,null,null,null,null,4]
[null,{"$f":"MENUS!B21","v":"BROCOLIS"},"SANS SUCRE",{"$f":"$D$10","v":3},null,{"$f":"IF($B$64=$B$62,0,F10)","v":0},{"$f":"IF($B$64=$B$62,0,G10)","v":0},0,null,null,null,null,null,null,null,null,null,{"$f":"IF($B$64=$B$62,0,R10)","v":0},0,0,0,0,0,0,0,null,{"$f":"IF($B$64=$B$62,0,AA10)","v":0},0,0,0,0,null,{"$f":"IF($B$64=$B$62,0,AG10)","v":0},0,0,0,0,{"$f":"IF($B$64=$B$62,0,AL10)","v":0},3]
[null,{"$f":"MENUS!B28","v":"BROCOLIS"},"HYPO",{"$f":"$D$11","v":1},null,{"$f":"IF($B$65=$B$62,0,F11)","v":0},{"$f":"IF($B$65=$B$62,0,G11)","v":0},0,null,null,null,null,null,null,null,null,null,{"$f":"IF($B$65=$B$62,0,R11)","v":0},0,0,0,0,0,0,0,0,{"$f":"IF($B$65=$B$62,0,AA11)","v":0},0,0,0,0,null,{"$f":"IF($B$65=$B$62,0,AG11)","v":0},0,0,0,0,{"$f":"IF($B$65=$B$62,0,AL11)","v":0},1]
[null,{"$f":"MENUS!B35","v":"BROCOLIS"},"S.PORC",null,null,{"$f":"IF($B$66=$B$62,0,F12)","v":0},{"$f":"IF($B$66=$B$62,0,G12)","v":0},0,null,null,null,null,null,null,null,null,null,{"$f":"IF($B$66=$B$62,0,R12)","v":0},0,0,0,0,0,0,0,null,{"$f":"IF($B$66=$B$62,0,AA12)","v":0},0,0,0,0,null,{"$f":"IF($B$66=$B$62,0,AG12)","v":0},0,0,0,0,{"$f":"IF($B$66=$B$62,0,AL12)","v":0},0]
[null,{"$f":"MENUS!B42","v":"BROCOLIS"},"REPAS FROID",null,null,{"$f":"$F$13","v":0},{"$f":"$G$13","v":0},{"$f":"$H$13","v":0},null,null,null,null,null,null,null,null,null,{"$f":"$R$13","v":0},{"$f":"$S$13","v":0},{"$f":"$T$13","v":0},{"$f":"$U$13","v":0},{"$f":"$V$13","v":0},{"$f":"$W$13","v":0},{"$f":"$X$13","v":0},{"$f":"$Y$13","v":0},null,{"$f":"$AA$13","v":0},{"$f":"$AB$13","v":0},{"$f":"$AC$13","v":0},{"$f":"$AD$13","v":0},{"$f":"$AE$13","v":0},{"$f":"$AF$13","v":0},{"$f":"$AG$13","v":0},{"$f":"$AH$13","v":0},{"$f":"$AI$13","v":0},{"$f":"$AJ$13","v":0},{"$f":"$AK$13","v":0},{"$f":"$AK$13","v":0},0]
[null,null,"TOTAL",{"$f":"SUM(D62:D67)","v":34},{"$f":"SUM(E62:E67)","v":21},11,10,12,0,0,0,1,0,0,0,0,0,8,8,8,6,0,0,0,25,0,0,0,0,0,0,0,4,0,3,3,6,{"$f":"SUM(AL62:AL67)","v":0},160]
[]
[null,null,null,null,null,"MONTR.",null,null,"MONTR.",null,null,null,null,null,null,null,null,"ROMO",null,null,null,null,null,null,null,null,null,null,null,null,"SALBRIS"]
[null,null,null,"ADMR","ETS","U1","U2","U3","2RA",425,"4RL",2114,"8RA",1005,1015,"10RA","Educ","FO / FAM",null,null,null,null,"ESAT",null,"FH",null,"IME",null,null,null,"ESAT",null,"CORM","HIRO","CHEV","SARC","FOYER","H.C"]
[null,null,"FROMAGE",null,null,null,null,null,null,null,null,null,null,null,null,null,null,"U1","U2","U3","U4","U5",null,null,null,null,"U1","U2","U3","U4",null,null,null,null,null,null,null,"CHIENS","TOTAL"]
[null,{"$f":"MENUS!B7","v":"YAOURT"},"NORMAUX",{"$f":"$D$8","v":26},{"$f":"$E$8","v":21},{"$f":"$F$14-F75-F76-F77-F78","v":11},{"$f":"$G$14-G75-G76-G77-G78","v":10},{"$f":"$H$14-H75-H76-H77-H78","v":12},{"$f":"$I$8","v":0},{"$f":"$J$8","v":0},{"$f":"$K$8","v":0},{"$f":"$L$8","v":1},{"$f":"$M$8","v":0},{"$f":"$N$8","v":0},{"$f":"$O$8","v":0},{"$f":"$P$8","v":0},{"$f":"$Q$8","v":0},{"$f":"$R$14-R75-R76-R77-R78","v":8},{"$f":"$S$14-S75-S76-S77-S78","v":8},{"$f":"$T$14-T75-T76-T77-T78","v":8},{"$f":"$U$14-U75-U76-U77-U78","v":6},{"$f":"$V$14-V75-V76-V77-V78","v":0},{"$f":"$W$14-W75-W76-W77-W78","v":0},{"$f":"$X$14-X75-X76-X77-X78","v":0},{"$f":"$Y$14-Y75-Y76-Y77-Y78","v":25},{"$f":"$Z$14-Z75-Z76-Z77-Z78","v":0},{"$f":"$AA$14-AA75-AA76-AA77-AA78","v":0},{"$f":"$AB$14-AB75-AB76-AB77-AB78","v":0},{"$f":"$AC$14-AC75-AC76-AC77-AC78","v":0},{"$f":"$AD$14-AD75-AD76-AD77-AD78","v":0},{"$f":"$AE$14-AE75-AE76-AE77-AE78","v":0},{"$f":"$AF$8","v":0},{"$f":"$AG$14-AG75-AG76-AG77-AG78","v":4},{"$f":"$AH$14-AH75-AH76-AH77-AH78","v":0},{"$f":"$AI$14-AI75-AI76-AI77-AI78","v":3},{"$f":"$AJ$14-AJ75-AJ76-AJ77-AJ78","v":3},{"$f":"$AK$14-AK75-AK76-AK77-AK78","v":6},{"$f":"$AL$14-AL75-AL76-AL77-AL78","v":0},{"$f":"SUM(D73:AK73)","v":152}]
[null,{"$f":"MENUS!B15","v":"YAOURT"},"SANS SEL",{"$f":"$D$9","v":4},null,null,null,null,null,null,null,null,null,null,null,null,null,null,null,null,null,null,null,null,null,null,null,null,null,null,null,null,null,null,null,null,null,null,4]
[null,{"$f":"MENUS!B22","v":"YAOURT"},"SANS SUCRE",{"$f":"$D$10","v":3},null,{"$f":"IF($B$75=$B$73,0,F10)","v":0},{"$f":"IF($B$75=$B$73,0,G10)","v":0},0,null,null,null,null,null,null,null,null,null,{"$f":"IF($B$75=$B$73,0,R10)","v":0},0,0,0,0,0,0,0,null,{"$f":"IF($B$75=$B$73,0,AA10)","v":0},0,0,0,0,null,{"$f":"IF($B$75=$B$73,0,AG10)","v":0},0,0,0,0,{"$f":"IF($B$75=$B$73,0,AL10)","v":0},3]
[null,{"$f":"MENUS!B29","v":"YAOURT"},"HYPO",{"$f":"$D$11","v":1},null,{"$f":"IF($B$76=$B$73,0,F11)","v":0},{"$f":"IF($B$76=$B$73,0,G11)","v":0},0,null,null,null,null,null,null,null,null,null,{"$f":"IF($B$76=$B$73,0,R11)","v":0},0,0,0,0,0,0,0,0,{"$f":"IF($B$76=$B$73,0,AA11)","v":0},0,0,0,0,null,{"$f":"IF($B$76=$B$73,0,AG11)","v":0},0,0,0,0,{"$f":"IF($B$76=$B$73,0,AL11)","v":0},1]
[null,{"$f":"MENUS!B36","v":"YAOURT"},"S.PORC",null,null,{"$f":"IF($B$77=$B$73,0,F12)","v":0},{"$f":"IF($B$77=$B$73,0,G12)","v":0},0,null,null,null,null,null,null,null,null,null,{"$f":"IF($B$77=$B$73,0,R12)","v":0},0,0,0,0,0,0,0,null,{"$f":"IF($B$77=$B$73,0,AA12)","v":0},0,0,0,0,null,{"$f":"IF($B$77=$B$73,0,AG12)","v":0},0,0,0,0,{"$f":"IF($B$77=$B$73,0,AL12)","v":0},0]
[null,{"$f":"MENUS!B43","v":"YAOURT"},"REPAS FROID",null,null,{"$f":"$F$13","v":0},{"$f":"$G$13","v":0},{"$f":"$H$13","v":0},null,null,null,null,null,null,null,null,null,{"$f":"$R$13","v":0},{"$f":"$S$13","v":0},{"$f":"$T$13","v":0},{"$f":"$U$13","v":0},{"$f":"$V$13","v":0},{"$f":"$W$13","v":0},{"$f":"$X$13","v":0},{"$f":"$Y$13","v":0},null,{"$f":"$AA$13","v":0},{"$f":"$AB$13","v":0},{"$f":"$AC$13","v":0},{"$f":"$AD$13","v":0},{"$f":"$AE$13","v":0},{"$f":"$AF$13","v":0},{"$f":"$AG$13","v":0},{"$f":"$AH$13","v":0},{"$f":"$AI$13","v":0},{"$f":"$AJ$13","v":0},{"$f":"$AK$13","v":0},{"$f":"$AK$13","v":0},0]
[null,null,"TOTAL",{"$f":"SUM(D73:D78)","v":34},{"$f":"SUM(E73:E78)","v":21},11,10,12,0,0,0,1,0,0,0,0,0,8,8,8,6,0,0,0,25,0,0,0,0,0,0,0,4,0,3,3,6,{"$f":"SUM(AL73:AL78)","v":0},160]
[]
[null,null,null,null,null,"MONTR.",null,null,"MONTR.",null,null,null,null,null,null,null,null,"ROMO",null,null,null,null,null,null,null,null,null,null,null,null,"SALBRIS"]
[null,null,null,"ADMR","ETS","U1","U2","U3","2RA",425,"4RL",2114,"8RA",1005,1015,"10RA","Educ","FO / FAM",null,null,null,null,"ESAT",null,"FH",null,"IME",null,null,null,"ESAT",null,"CORM","HIRO","CHEV","SARC","FOYER","H.C"]
[null,null,"DESSERT",null,null,null,null,null,null,null,null,null,null,null,null,null,null,"U1","U2","U3","U4","U5",null,null,null,null,"U1","U2","U3","U4",null,null,null,null,null,null,null,"CHIENS","TOTAL"]
[null,{"$f":"MENUS!B8","v":"RIZ AU CARAMEL"},"NORMAUX",{"$f":"$D$8","v":26},{"$f":"$E$8","v":21},{"$f":"$F$14-F86-F87-F88-F89","v":10},{"$f":"$G$14-G86-G87-G88-G89","v":8},{"$f":"$H$14-H86-H87-H88-H89","v":10},{"$f":"$I$8","v":0},{"$f":"$J$8","v":0},{"$f":"$K$8","v":0},{"$f":"$L$8","v":1},{"$f":"$M$8","v":0},{"$f":"$N$8","v":0},{"$f":"$O$8","v":0},{"$f":"$P$8","v":0},{"$f":"$Q$8","v":0},{"$f":"$R$14-R86-R87-R88-R89","v":6},{"$f":"$S$14-S86-S87-S88-S89","v":7},{"$f":"$T$14-T86-T87-T88-T89","v":6},{"$f":"$U$14-U86-U87-U88-U89","v":4},{"$f":"$V$14-V86-V87-V88-V89","v":0},{"$f":"$W$14-W86-W87-W88-W89","v":0},{"$f":"$X$14-X86-X87-X88-X89","v":0},{"$f":"$Y$14-Y86-Y87-Y88-Y89","v":24},{"$f":"$Z$14-Z86-Z87-Z88-Z89","v":0},{"$f":"$AA$14-AA86-AA87-AA88-AA89","v":0},{"$f":"$AB$14-AB86-AB87-AB88-AB89","v":0},{"$f":"$AC$14-AC86-AC87-AC88-AC89","v":0},{"$f":"$AD$14-AD86-AD87-AD88-AD89","v":0},{"$f":"$AE$14-AE86-AE87-AE88-AE89","v":0},{"$f":"$AF$8","v":0},{"$f":"$AG$14-AG86-AG87-AG88-AG89","v":3},{"$f":"$AH$14-AH86-AH87-AH88-AH89","v":0},{"$f":"$AI$14-AI86-AI87-AI88-AI89","v":3},{"$f":"$AJ$14-AJ86-AJ87-AJ88-AJ89","v":3},{"$f":"$AK$14-AK86-AK87-AK88-AK89","v":5},{"$f":"$AL$14-AL86-AL87-AL88-AL89","v":0},{"$f":"SUM(D84:AK84)","v":137}]
[null,{"$f":"MENUS!B16","v":"RIZ AU CARAMEL"},"SANS SEL",{"$f":"$D$9","v":4},null,null,null,null,null,null,null,null,null,null,null,null,null,null,null,null,null,null,null,null,null,null,null,null,null,null,null,null,null,null,null,null,null,null,4]
[null,{"$f":"MENUS!B23","v":"KIWI"},"SANS SUCRE",{"$f":"$D$10","v":3},null,{"$f":"IF($B$86=$B$84,0,F10)","v":1},{"$f":"IF($B$86=$B$84,0,G10)","v":0},0,null,null,null,null,null,null,null,null,null,{"$f":"IF($B$86=$B$84,0,R10)","v":0},0,0,0,0,0,0,0,null,{"$f":"IF($B$86=$B$84,0,AA10)","v":0},0,0,0,0,null,{"$f":"IF($B$86=$B$84,0,AG10)","v":1},0,0,0,0,{"$f":"IF($B$86=$B$84,0,AL10)","v":0},5]
[null,{"$f":"MENUS!B30","v":"KIWI"},"HYPO",{"$f":"$D$11","v":1},null,{"$f":"IF($B$87=$B$84,0,F11)","v":0},{"$f":"IF($B$87=$B$84,0,G11)","v":2},2,null,null,null,null,null,null,null,null,null,{"$f":"IF($B$87=$B$84,0,R11)","v":2},1,2,2,0,0,0,1,0,{"$f":"IF($B$87=$B$84,0,AA11)","v":0},0,0,0,0,null,{"$f":"IF($B$87=$B$84,0,AG11)","v":0},0,0,0,1,{"$f":"IF($B$87=$B$84,0,AL11)","v":0},14]
[null,{"$f":"MENUS!B37","v":"RIZ AU CARAMEL"},"S.PORC",null,null,{"$f":"IF($B$88=$B$84,0,F12)","v":0},{"$f":"IF($B$88=$B$84,0,G12)","v":0},0,null,null,null,null,null,null,null,null,null,{"$f":"IF($B$88=$B$84,0,R12)","v":0},0,0,0,0,0,0,0,null,{"$f":"IF($B$88=$B$84,0,AA12)","v":0},0,0,0,0,null,{"$f":"IF($B$88=$B$84,0,AG12)","v":0},0,0,0,0,{"$f":"IF($B$88=$B$84,0,AL12)","v":0},0]
[null,{"$f":"MENUS!B44","v":"RIZ AU CARAMEL"},"REPAS FROID",null,null,{"$f":"$F$13","v":0},{"$f":"$G$13","v":0},{"$f":"$H$13","v":0},null,null,null,null,null,null,null,null,null,{"$f":"$R$13","v":0},{"$f":"$S$13","v":0},{"$f":"$T$13","v":0},{"$f":"$U$13","v":0},{"$f":"$V$13","v":0},{"$f":"$W$13","v":0},{"$f":"$X$13","v":0},{"$f":"$Y$13","v":0},null,{"$f":"$AA$13","v":0},{"$f":"$AB$13","v":0},{"$f":"$AC$13","v":0},{"$f":"$AD$13","v":0},{"$f":"$AE$13","v":0},{"$f":"$AF$13","v":0},{"$f":"$AG$13","v":0},{"$f":"$AH$13","v":0},{"$f":"$AI$13","v":0},{"$f":"$AJ$13","v":0},{"$f":"$AK$13","v":0},{"$f":"$AK$13","v":0},0]
[null,null,"TOTAL",{"$f":"SUM(D84:D89)","v":34},{"$f":"SUM(E84:E89)","v":21},11,10,12,0,0,0,1,0,0,0,0,0,8,8,8,6,0,0,0,25,0,0,0,0,0,0,0,4,0,3,3,6,{"$f":"SUM(AL84:AL89)","v":0},160]

{"sheet":"QUANTITES TOTAL","index":2,"n_rows":23,"n_cols":8,"rows_kept":23,"cut":false,"hidden":false,"merged":[]}
[]
[]
[]
[]
[null,"NORMAUX","S.SEL","S.SUCRE","ALLEGE","S.PORC","FROIDS","TOTAL"]
[{"$f":"MENUS!B4","v":"MACEDOINE CŒUR PALMOIER"},{"$f":"'FEUILLE FAB'!B12","v":152},{"$f":"IF(MENUS!B12=MENUS!B4,'FEUILLE FAB'!B25,0)","v":4},{"$f":"IF(MENUS!B19=MENUS!B4,'FEUILLE FAB'!B30,0)","v":3},{"$f":"IF(MENUS!B26=MENUS!B4,'FEUILLE FAB'!B35,0)","v":1},{"$f":"IF(MENUS!B33=MENUS!B4,'FEUILLE FAB'!B40,0)","v":0},{"$f":"IF(MENUS!B40=MENUS!B4,'FEUILLE FAB'!B43,0)","v":0},{"$f":"SUM(B6:G6)","v":160}]
[{"$f":"MENUS!B5","v":"SAUCISSE DE TOULOUSE"},{"$f":"'FEUILLE FAB'!B13","v":138},{"$f":"IF(MENUS!B13=MENUS!B5,'FEUILLE FAB'!B26,0)","v":0},{"$f":"IF(MENUS!B20=MENUS!B5,'FEUILLE FAB'!B31,0)","v":3},{"$f":"IF(MENUS!B27=MENUS!B5,'FEUILLE FAB'!B36,0)","v":0},{"$f":"IF(MENUS!B34=MENUS!B5,'FEUILLE FAB'!B41,0)","v":0},{"$f":"IF(MENUS!B41=MENUS!B5,'FEUILLE FAB'!B44,0)","v":0},{"$f":"SUM(B7:G7)","v":141}]
[{"$f":"MENUS!B6","v":"BROCOLIS"},{"$f":"'FEUILLE FAB'!B14","v":152},{"$f":"IF(MENUS!B14=MENUS!B6,'FEUILLE FAB'!B27,0)","v":4},{"$f":"IF(MENUS!B21=MENUS!B6,'FEUILLE FAB'!B32,0)","v":3},{"$f":"IF(MENUS!B28=MENUS!B6,'FEUILLE FAB'!B37,0)","v":1},{"$f":"IF(MENUS!B35=MENUS!B6,'FEUILLE FAB'!B42,0)","v":0},{"$f":"IF(MENUS!B42=MENUS!B6,'FEUILLE FAB'!B45,0)","v":0},160]
[{"$f":"MENUS!B7","v":"YAOURT"},{"$f":"'FEUILLE FAB'!B15","v":119},{"$f":"IF(MENUS!B15=MENUS!B7,'FEUILLE FAB'!B28,0)","v":4},{"$f":"IF(MENUS!B22=MENUS!B7,'FEUILLE FAB'!B33,0)","v":3},{"$f":"IF(MENUS!B29=MENUS!B7,'FEUILLE FAB'!B38,0)","v":1},null,{"$f":"IF(MENUS!B43=MENUS!B7,'FEUILLE FAB'!B46,0)","v":0},127]
[{"$f":"MENUS!B8","v":"RIZ AU CARAMEL"},{"$f":"'FEUILLE FAB'!B16","v":137},{"$f":"IF(MENUS!B16=MENUS!B8,'FEUILLE FAB'!B29,0)","v":4},{"$f":"IF(MENUS!B23=MENUS!B8,'FEUILLE FAB'!B34,0)","v":0},{"$f":"IF(MENUS!B30=MENUS!B8,'FEUILLE FAB'!B39,0)","v":0},null,{"$f":"IF(MENUS!B44=MENUS!B8,'FEUILLE FAB'!B47,0)","v":0},141]
[{"$f":"IF(MENUS!B26=MENUS!B4,$A$1&\"\",MENUS!B26)","v":""},null,{"$f":"IF(MENUS!B12<>MENUS!B4,'FEUILLE FAB'!B25,0)","v":0},{"$f":"IF(MENUS!B19<>MENUS!B4,'FEUILLE FAB'!B30,0)","v":0},{"$f":"IF(MENUS!B26<>MENUS!B4,'FEUILLE FAB'!B35,0)","v":0},{"$f":"IF(MENUS!B33<>MENUS!B26,0,'FEUILLE FAB'!B40)","v":0},null,0]
[{"$f":"IF(MENUS!B27=MENUS!B5,$A$1&\"\",MENUS!B27)","v":"ESCALOPE DE DINDE"},null,{"$f":"IF(MENUS!B13<>MENUS!B5,'FEUILLE FAB'!B26,0)","v":4},{"$f":"IF(MENUS!B20<>MENUS!B5,'FEUILLE FAB'!B31,0)","v":0},{"$f":"IF(MENUS!B27<>MENUS!B5,'FEUILLE FAB'!B36,0)","v":14},{"$f":"IF(MENUS!B34<>MENUS!B27,0,'FEUILLE FAB'!B41)","v":1},null,19]
[{"$f":"IF(MENUS!B28=MENUS!B6,$A$1&\"\",MENUS!B28)","v":""},null,{"$f":"IF(MENUS!B14<>MENUS!B6,'FEUILLE FAB'!B27,0)","v":0},{"$f":"IF(MENUS!B21<>MENUS!B6,'FEUILLE FAB'!B32,0)","v":0},{"$f":"IF(MENUS!B28<>MENUS!B6,'FEUILLE FAB'!B37,0)","v":0},{"$f":"IF(MENUS!B35<>MENUS!B28,0,'FEUILLE FAB'!B42)","v":0},null,0]
[{"$f":"IF(MENUS!B29=MENUS!B7,$A$1&\"\",MENUS!B29)","v":""},null,{"$f":"IF(MENUS!B15<>MENUS!B7,'FEUILLE FAB'!B28,0)","v":0},{"$f":"IF(MENUS!B22<>MENUS!B7,'FEUILLE FAB'!B33,0)","v":0},{"$f":"IF(MENUS!B29<>MENUS!B7,'FEUILLE FAB'!B38,0)","v":0},null,null,0]
[{"$f":"IF(MENUS!B30=MENUS!B8,$A$1&\"\",MENUS!B30)","v":"KIWI"},null,{"$f":"IF(MENUS!B16<>MENUS!B8,'FEUILLE FAB'!B29,0)","v":0},{"$f":"IF(MENUS!B23<>MENUS!B8,'FEUILLE FAB'!B34,0)","v":5},{"$f":"IF(MENUS!B30<>MENUS!B8,'FEUILLE FAB'!B39,0)","v":14},null,null,19]
[{"$f":"IF(MENUS!B33=MENUS!B26,$A$1&\"\",MENUS!B33)","v":""},null,null,null,null,{"$f":"IF(MENUS!B33<>MENUS!B26,'FEUILLE FAB'!B40,0)","v":0},null,0]
[{"$f":"IF(MENUS!B34=MENUS!B27,$A$1&\"\",MENUS!B34)","v":""},null,null,null,null,{"$f":"IF(MENUS!B34<>MENUS!B27,'FEUILLE FAB'!B41,0)","v":0},null,0]
[{"$f":"IF(MENUS!B35=MENUS!B28,$A$1&\"\",MENUS!B35)","v":""},null,null,null,null,{"$f":"IF(MENUS!B35<>MENUS!B28,'FEUILLE FAB'!B42,0)","v":0},null,0]
[{"$f":"IF(MENUS!B40=MENUS!B4,$A$1&\"\",MENUS!B40)","v":""},null,null,null,null,null,{"$f":"IF(MENUS!B40<>MENUS!B4,'FEUILLE FAB'!B43,0)","v":0},0]
[{"$f":"IF(MENUS!B41=MENUS!B5,$A$1&\"\",MENUS!B41)","v":""},null,null,null,null,null,{"$f":"IF(MENUS!B41<>MENUS!B5,'FEUILLE FAB'!B44,0)","v":0},0]
[{"$f":"IF(MENUS!B42=MENUS!B6,$A$1&\"\",MENUS!B42)","v":""},null,null,null,null,null,{"$f":"IF(MENUS!B42<>MENUS!B6,'FEUILLE FAB'!B45,0)","v":0},0]
[{"$f":"IF(MENUS!B43=MENUS!B7,$A$1&\"\",MENUS!B43)","v":""},null,null,null,null,null,{"$f":"IF(MENUS!B43<>MENUS!B7,'FEUILLE FAB'!B46,0)","v":0},0]
[{"$f":"IF(MENUS!B44=MENUS!B8,$A$1&\"\",MENUS!B44)","v":""},null,null,null,null,null,{"$f":"IF(MENUS!B44<>MENUS!B8,'FEUILLE FAB'!B47,0)","v":0},0]

{"sheet":"FEUILLE FAB","index":3,"n_rows":56,"n_cols":39,"rows_kept":56,"cut":false,"hidden":false,"merged":[[4,14,4,25],[6,14,6,25],[6,26,6,37],[8,30,8,36],[9,5,9,7],[9,8,9,16],[54,18,54,25],[54,2,54,16],[1,0,2,0],[9,32,9,36],[9,17,9,21],[9,22,10,23],[9,24,10,25],[9,26,9,29],[9,30,9,31],[9,0,10,0],[4,26,4,32],[8,5,8,16],[8,17,8,29],[4,33,4,35],[6,1,6,12],[4,1,4,12],[49,2,49,16],[50,2,50,16],[51,2,51,16],[52,2,52,16],[53,2,53,16],[54,26,54,27],[49,36,49,37],[50,36,50,37],[51,36,51,37],[49,26,49,27],[50,26,50,27],[51,26,51,27],[52,26,52,27],[53,26,53,27],[52,36,52,37],[53,36,53,37],[54,36,54,37],[55,36,55,37],[49,29,49,35],[50,29,50,35],[51,29,51,35],[52,29,52,35],[53,29,53,35],[54,29,54,35],[55,29,55,35],[49,18,49,25],[50,18,50,25],[51,18,51,25],[52,18,52,25],[53,18,53,25]]}
[]
[]
[]
[]
["REPAS DU :",{"$f":"'CALCUL EFFECTIFS'!T2","v":"2015-11-05"},null,null,null,null,null,null,null,null,null,null,null,null,"POTAGE OU ENTREE",null,null,null,null,null,null,null,null,null,null,null,{"$f":"A10","v":"JEUDI SOIR"},null,null,null,null,null,null,{"$f":"'CALCUL EFFECTIFS'!D15","v":34}]
[]
["FABRIQUE LE :",{"$f":"'CALCUL EFFECTIFS'!T3","v":"2015-11-03"},null,null,null,null,null,null,null,null,null,null,null,null,"A CONSOMMER JUSQU'AU :",null,null,null,null,null,null,null,null,null,null,null,{"$f":"B7+3","v":"2015-11-06"}]
[]
[null,null,null,null,null,"MONTRICHARD",null,null,null,null,null,null,null,null,null,null,null,"ROMORANTIN",null,null,null,null,null,null,null,null,null,null,null,null,"SALBRIS"]
["JEUDI SOIR",null,null,null,null,"F.OCC",null,null,"FOYER HEB.",null,null,null,null,null,null,null,null,"FO / FAM",null,null,null,null,"ESAT",null,"FH ",null,"IME",null,null,null,"ESAT",null,"FOYER HEB."]
[null,"TOTAL","SELF","ADMR","ETS","U1","U2","U3","2RA",425,"4RL",2114,"8RA",1005,1015,"10RA","Educ","U1","U2","U3","U4","U5",null,null,null,null,"U1","U2","U3","U4","COL","IND","CO","HI","CH","SA","FOY","H.C","……."]
[{"$f":"IF(B12>0,'CALCUL EFFECTIFS'!B22&\"\",$A$6&\"\")","v":"MACEDOINE CŒUR PALMOIER"},{"$f":"SUM(C12:AM12)","v":152},null,{"$f":"IF('CALCUL EFFECTIFS'!D22>0,'CALCUL EFFECTIFS'!D22,$A$6&\"\")","v":26},{"$f":"IF('CALCUL EFFECTIFS'!E22>0,'CALCUL EFFECTIFS'!E22,$A$6&\"\")","v":21},{"$f":"IF('CALCUL EFFECTIFS'!$B$37=\"POTAGE\",$A$6&\"\",'CALCUL EFFECTIFS'!F23)","v":11},{"$f":"IF('CALCUL EFFECTIFS'!$B$37=\"POTAGE\",$A$6&\"\",'CALCUL EFFECTIFS'!G23)","v":10},{"$f":"IF('CALCUL EFFECTIFS'!$B$37=\"POTAGE\",$A$6&\"\",'CALCUL EFFECTIFS'!H23)","v":12},{"$f":"IF('CALCUL EFFECTIFS'!$B$37=\"POTAGE\",$A$6&\"\",'CALCUL EFFECTIFS'!I23)","v":""},{"$f":"IF('CALCUL EFFECTIFS'!$B$37=\"POTAGE\",$A$6&\"\",'CALCUL EFFECTIFS'!J23)","v":""},{"$f":"IF('CALCUL EFFECTIFS'!$B$37=\"POTAGE\",$A$6&\"\",'CALCUL EFFECTIFS'!K23)","v":""},{"$f":"IF('CALCUL EFFECTIFS'!$B$37=\"POTAGE\",$A$6&\"\",'CALCUL EFFECTIFS'!L23)","v":1},{"$f":"IF('CALCUL EFFECTIFS'!$B$37=\"POTAGE\",$A$6&\"\",'CALCUL EFFECTIFS'!M23)","v":""},{"$f":"IF('CALCUL EFFECTIFS'!$B$37=\"POTAGE\",$A$6&\"\",'CALCUL EFFECTIFS'!N23)","v":""},{"$f":"IF('CALCUL EFFECTIFS'!$B$37=\"POTAGE\",$A$6&\"\",'CALCUL EFFECTIFS'!O23)","v":""},{"$f":"IF('CALCUL EFFECTIFS'!$B$37=\"POTAGE\",$A$6&\"\",'CALCUL EFFECTIFS'!P23)","v":""},{"$f":"IF('CALCUL EFFECTIFS'!$B$37=\"POTAGE\",$A$6&\"\",'CALCUL EFFECTIFS'!Q23)","v":""},{"$f":"IF('CALCUL EFFECTIFS'!$B$37=\"POTAGE\",$A$6&\"\",'CALCUL EFFECTIFS'!R23)","v":8},{"$f":"IF('CALCUL EFFECTIFS'!$B$37=\"POTAGE\",$A$6&\"\",'CALCUL EFFECTIFS'!S23)","v":8},{"$f":"IF('CALCUL EFFECTIFS'!$B$37=\"POTAGE\",$A$6&\"\",'CALCUL EFFECTIFS'!T23)","v":8},{"$f":"IF('CALCUL EFFECTIFS'!$B$37=\"POTAGE\",$A$6&\"\",'CALCUL EFFECTIFS'!U23)","v":6},{"$f":"IF('CALCUL EFFECTIFS'!$B$37=\"POTAGE\",$A$6&\"\",'CALCUL EFFECTIFS'!V23)","v":""},{"$f":"IF('CALCUL EFFECTIFS'!W22>0,'CALCUL EFFECTIFS'!W22,$A$6&\"\")","v":""},{"$f":"IF('CALCUL EFFECTIFS'!X22>0,'CALCUL EFFECTIFS'!X22,$A$6&\"\")","v":""},{"$f":"IF('CALCUL EFFECTIFS'!$B$37=\"POTAGE\",$A$6&\"\",'CALCUL EFFECTIFS'!Y23)","v":25},{"$f":"IF('CALCUL EFFECTIFS'!$B$37=\"POTAGE\",$A$6&\"\",'CALCUL EFFECTIFS'!Z23)","v":""},{"$f":"IF('CALCUL EFFECTIFS'!$B$37=\"POTAGE\",$A$6&\"\",'CALCUL EFFECTIFS'!AA23)","v":""},{"$f":"IF('CALCUL EFFECTIFS'!$B$37=\"POTAGE\",$A$6&\"\",'CALCUL EFFECTIFS'!AB23)","v":""},{"$f":"IF('CALCUL EFFECTIFS'!$B$37=\"POTAGE\",$A$6&\"\",'CALCUL EFFECTIFS'!AC23)","v":""},{"$f":"IF('CALCUL EFFECTIFS'!$B$37=\"POTAGE\",$A$6&\"\",'CALCUL EFFECTIFS'!AD23)","v":""},{"$f":"IF('CALCUL EFFECTIFS'!AE22>0,'CALCUL EFFECTIFS'!AE22,$A$6&\"\")","v":""},{"$f":"IF('CALCUL EFFECTIFS'!AF22>0,'CALCUL EFFECTIFS'!AF22,$A$6&\"\")","v":""},{"$f":"IF('CALCUL EFFECTIFS'!$B$37=\"POTAGE\",$A$6&\"\",'CALCUL EFFECTIFS'!AG23)","v":4},{"$f":"IF('CALCUL EFFECTIFS'!$B$37=\"POTAGE\",$A$6&\"\",'CALCUL EFFECTIFS'!AH23)","v":""},{"$f":"IF('CALCUL EFFECTIFS'!$B$37=\"POTAGE\",$A$6&\"\",'CALCUL EFFECTIFS'!AI23)","v":3},{"$f":"IF('CALCUL EFFECTIFS'!$B$37=\"POTAGE\",$A$6&\"\",'CALCUL EFFECTIFS'!AJ23)","v":3},{"$f":"IF('CALCUL EFFECTIFS'!$B$37=\"POTAGE\",$A$6&\"\",'CALCUL EFFECTIFS'!AK23)","v":6},{"$f":"IF('CALCUL EFFECTIFS'!$B$37=\"POTAGE\",$A$6&\"\",'CALCUL EFFECTIFS'!AL23)","v":""}]
[{"$f":"IF(B13>0,'CALCUL EFFECTIFS'!B51&\"\",$A$6&\"\")","v":"SAUCISSE DE TOULOUSE"},138,null,{"$f":"IF('CALCUL EFFECTIFS'!D51>0,'CALCUL EFFECTIFS'!D51,$A$6&\"\")","v":26},{"$f":"IF('CALCUL EFFECTIFS'!E51>0,'CALCUL EFFECTIFS'!E51,$A$6&\"\")","v":21},{"$f":"IF('CALCUL EFFECTIFS'!F51>0,'CALCUL EFFECTIFS'!F51,$A$6&\"\")","v":11},{"$f":"IF('CALCUL EFFECTIFS'!G51>0,'CALCUL EFFECTIFS'!G51,$A$6&\"\")","v":7},{"$f":"IF('CALCUL EFFECTIFS'!H51>0,'CALCUL EFFECTIFS'!H51,$A$6&\"\")","v":10},{"$f":"IF('CALCUL EFFECTIFS'!I51>0,'CALCUL EFFECTIFS'!I51,$A$6&\"\")","v":""},{"$f":"IF('CALCUL EFFECTIFS'!J51>0,'CALCUL EFFECTIFS'!J51,$A$6&\"\")","v":""},{"$f":"IF('CALCUL EFFECTIFS'!K51>0,'CALCUL EFFECTIFS'!K51,$A$6&\"\")","v":""},{"$f":"IF('CALCUL EFFECTIFS'!L51>0,'CALCUL EFFECTIFS'!L51,$A$6&\"\")","v":1},{"$f":"IF('CALCUL EFFECTIFS'!M51>0,'CALCUL EFFECTIFS'!M51,$A$6&\"\")","v":""},{"$f":"IF('CALCUL EFFECTIFS'!N51>0,'CALCUL EFFECTIFS'!N51,$A$6&\"\")","v":""},{"$f":"IF('CALCUL EFFECTIFS'!O51>0,'CALCUL EFFECTIFS'!O51,$A$6&\"\")","v":""},{"$f":"IF('CALCUL EFFECTIFS'!P51>0,'CALCUL EFFECTIFS'!P51,$A$6&\"\")","v":""},{"$f":"IF('CALCUL EFFECTIFS'!Q51>0,'CALCUL EFFECTIFS'!Q51,$A$6&\"\")","v":""},{"$f":"IF('CALCUL EFFECTIFS'!R51>0,'CALCUL EFFECTIFS'!R51,$A$6&\"\")","v":6},{"$f":"IF('CALCUL EFFECTIFS'!S51>0,'CALCUL EFFECTIFS'!S51,$A$6&\"\")","v":7},{"$f":"IF('CALCUL EFFECTIFS'!T51>0,'CALCUL EFFECTIFS'!T51,$A$6&\"\")","v":6},{"$f":"IF('CALCUL EFFECTIFS'!U51>0,'CALCUL EFFECTIFS'!U51,$A$6&\"\")","v":4},{"$f":"IF('CALCUL EFFECTIFS'!V51>0,'CALCUL EFFECTIFS'!V51,$A$6&\"\")","v":""},{"$f":"IF('CALCUL EFFECTIFS'!W51>0,'CALCUL EFFECTIFS'!W51,$A$6&\"\")","v":""},{"$f":"IF('CALCUL EFFECTIFS'!X51>0,'CALCUL EFFECTIFS'!X51,$A$6&\"\")","v":""},{"$f":"IF('CALCUL EFFECTIFS'!Y51>0,'CALCUL EFFECTIFS'!Y51,$A$6&\"\")","v":24},{"$f":"IF('CALCUL EFFECTIFS'!Z51>0,'CALCUL EFFECTIFS'!Z51,$A$6&\"\")","v":""},{"$f":"IF('CALCUL EFFECTIFS'!AA51>0,'CALCUL EFFECTIFS'!AA51,$A$6&\"\")","v":""},{"$f":"IF('CALCUL EFFECTIFS'!AB51>0,'CALCUL EFFECTIFS'!AB51,$A$6&\"\")","v":""},{"$f":"IF('CALCUL EFFECTIFS'!AC51>0,'CALCUL EFFECTIFS'!AC51,$A$6&\"\")","v":""},{"$f":"IF('CALCUL EFFECTIFS'!AD51>0,'CALCUL EFFECTIFS'!AD51,$A$6&\"\")","v":""},{"$f":"IF('CALCUL EFFECTIFS'!AE51>0,'CALCUL EFFECTIFS'!AE51,$A$6&\"\")","v":""},{"$f":"IF('CALCUL EFFECTIFS'!AF51>0,'CALCUL EFFECTIFS'!AF51,$A$6&\"\")","v":""},{"$f":"IF('CALCUL EFFECTIFS'!AG51>0,'CALCUL EFFECTIFS'!AG51,$A$6&\"\")","v":4},{"$f":"IF('CALCUL EFFECTIFS'!AH51>0,'CALCUL EFFECTIFS'!AH51,$A$6&\"\")","v":""},{"$f":"IF('CALCUL EFFECTIFS'!AI51>0,'CALCUL EFFECTIFS'!AI51,$A$6&\"\")","v":3},{"$f":"IF('CALCUL EFFECTIFS'!AJ51>0,'CALCUL EFFECTIFS'!AJ51,$A$6&\"\")","v":3},{"$f":"IF('CALCUL EFFECTIFS'!AK51>0,'CALCUL EFFECTIFS'!AK51,$A$6&\"\")","v":5},{"$f":"IF('CALCUL EFFECTIFS'!AL51>0,'CALCUL EFFECTIFS'!AL51,$A$6&\"\")","v":""}]
[{"$f":"IF(B14>0,'CALCUL EFFECTIFS'!B62&\"\",$A$6&\"\")","v":"BROCOLIS"},152,null,{"$f":"IF('CALCUL EFFECTIFS'!D62>0,'CALCUL EFFECTIFS'!D62,$A$6&\"\")","v":26},{"$f":"IF('CALCUL EFFECTIFS'!E62>0,'CALCUL EFFECTIFS'!E62,$A$6&\"\")","v":21},{"$f":"IF('CALCUL EFFECTIFS'!F62>0,'CALCUL EFFECTIFS'!F62,$A$6&\"\")","v":11},{"$f":"IF('CALCUL EFFECTIFS'!G62>0,'CALCUL EFFECTIFS'!G62,$A$6&\"\")","v":10},{"$f":"IF('CALCUL EFFECTIFS'!H62>0,'CALCUL EFFECTIFS'!H62,$A$6&\"\")","v":12},{"$f":"IF('CALCUL EFFECTIFS'!I62>0,'CALCUL EFFECTIFS'!I62,$A$6&\"\")","v":""},{"$f":"IF('CALCUL EFFECTIFS'!J62>0,'CALCUL EFFECTIFS'!J62,$A$6&\"\")","v":""},{"$f":"IF('CALCUL EFFECTIFS'!K62>0,'CALCUL EFFECTIFS'!K62,$A$6&\"\")","v":""},{"$f":"IF('CALCUL EFFECTIFS'!L62>0,'CALCUL EFFECTIFS'!L62,$A$6&\"\")","v":1},{"$f":"IF('CALCUL EFFECTIFS'!M62>0,'CALCUL EFFECTIFS'!M62,$A$6&\"\")","v":""},{"$f":"IF('CALCUL EFFECTIFS'!N62>0,'CALCUL EFFECTIFS'!N62,$A$6&\"\")","v":""},{"$f":"IF('CALCUL EFFECTIFS'!O62>0,'CALCUL EFFECTIFS'!O62,$A$6&\"\")","v":""},{"$f":"IF('CALCUL EFFECTIFS'!P62>0,'CALCUL EFFECTIFS'!P62,$A$6&\"\")","v":""},{"$f":"IF('CALCUL EFFECTIFS'!Q62>0,'CALCUL EFFECTIFS'!Q62,$A$6&\"\")","v":""},{"$f":"IF('CALCUL EFFECTIFS'!R62>0,'CALCUL EFFECTIFS'!R62,$A$6&\"\")","v":8},{"$f":"IF('CALCUL EFFECTIFS'!S62>0,'CALCUL EFFECTIFS'!S62,$A$6&\"\")","v":8},{"$f":"IF('CALCUL EFFECTIFS'!T62>0,'CALCUL EFFECTIFS'!T62,$A$6&\"\")","v":8},{"$f":"IF('CALCUL EFFECTIFS'!U62>0,'CALCUL EFFECTIFS'!U62,$A$6&\"\")","v":6},{"$f":"IF('CALCUL EFFECTIFS'!V62>0,'CALCUL EFFECTIFS'!V62,$A$6&\"\")","v":""},{"$f":"IF('CALCUL EFFECTIFS'!W62>0,'CALCUL EFFECTIFS'!W62,$A$6&\"\")","v":""},{"$f":"IF('CALCUL EFFECTIFS'!X62>0,'CALCUL EFFECTIFS'!X62,$A$6&\"\")","v":""},{"$f":"IF('CALCUL EFFECTIFS'!Y62>0,'CALCUL EFFECTIFS'!Y62,$A$6&\"\")","v":25},{"$f":"IF('CALCUL EFFECTIFS'!Z62>0,'CALCUL EFFECTIFS'!Z62,$A$6&\"\")","v":""},{"$f":"IF('CALCUL EFFECTIFS'!AA62>0,'CALCUL EFFECTIFS'!AA62,$A$6&\"\")","v":""},{"$f":"IF('CALCUL EFFECTIFS'!AB62>0,'CALCUL EFFECTIFS'!AB62,$A$6&\"\")","v":""},{"$f":"IF('CALCUL EFFECTIFS'!AC62>0,'CALCUL EFFECTIFS'!AC62,$A$6&\"\")","v":""},{"$f":"IF('CALCUL EFFECTIFS'!AD62>0,'CALCUL EFFECTIFS'!AD62,$A$6&\"\")","v":""},{"$f":"IF('CALCUL EFFECTIFS'!AE62>0,'CALCUL EFFECTIFS'!AE62,$A$6&\"\")","v":""},{"$f":"IF('CALCUL EFFECTIFS'!AF62>0,'CALCUL EFFECTIFS'!AF62,$A$6&\"\")","v":""},{"$f":"IF('CALCUL EFFECTIFS'!AG62>0,'CALCUL EFFECTIFS'!AG62,$A$6&\"\")","v":4},{"$f":"IF('CALCUL EFFECTIFS'!AH62>0,'CALCUL EFFECTIFS'!AH62,$A$6&\"\")","v":""},{"$f":"IF('CALCUL EFFECTIFS'!AI62>0,'CALCUL EFFECTIFS'!AI62,$A$6&\"\")","v":3},{"$f":"IF('CALCUL EFFECTIFS'!AJ62>0,'CALCUL EFFECTIFS'!AJ62,$A$6&\"\")","v":3},{"$f":"IF('CALCUL EFFECTIFS'!AK62>0,'CALCUL EFFECTIFS'!AK62,$A$6&\"\")","v":6},{"$f":"IF('CALCUL EFFECTIFS'!AL62>0,'CALCUL EFFECTIFS'!AL62,$A$6&\"\")","v":""}]
[{"$f":"IF(B15>0,'CALCUL EFFECTIFS'!B73&\"\",$A$6&\"\")","v":"YAOURT"},119,null,{"$f":"IF('CALCUL EFFECTIFS'!D73>0,'CALCUL EFFECTIFS'!D73,$A$6&\"\")","v":26},{"$f":"IF('CALCUL EFFECTIFS'!E73>0,'CALCUL EFFECTIFS'!E73,$A$6&\"\")","v":21},null,null,null,{"$f":"IF('CALCUL EFFECTIFS'!I73>0,'CALCUL EFFECTIFS'!I73,$A$6&\"\")","v":""},{"$f":"IF('CALCUL EFFECTIFS'!J73>0,'CALCUL EFFECTIFS'!J73,$A$6&\"\")","v":""},{"$f":"IF('CALCUL EFFECTIFS'!K73>0,'CALCUL EFFECTIFS'!K73,$A$6&\"\")","v":""},{"$f":"IF('CALCUL EFFECTIFS'!L73>0,'CALCUL EFFECTIFS'!L73,$A$6&\"\")","v":1},{"$f":"IF('CALCUL EFFECTIFS'!M73>0,'CALCUL EFFECTIFS'!M73,$A$6&\"\")","v":""},{"$f":"IF('CALCUL EFFECTIFS'!N73>0,'CALCUL EFFECTIFS'!N73,$A$6&\"\")","v":""},{"$f":"IF('CALCUL EFFECTIFS'!O73>0,'CALCUL EFFECTIFS'!O73,$A$6&\"\")","v":""},{"$f":"IF('CALCUL EFFECTIFS'!P73>0,'CALCUL EFFECTIFS'!P73,$A$6&\"\")","v":""},{"$f":"IF('CALCUL EFFECTIFS'!Q73>0,'CALCUL EFFECTIFS'!Q73,$A$6&\"\")","v":""},{"$f":"IF('CALCUL EFFECTIFS'!R73>0,'CALCUL EFFECTIFS'!R73,$A$6&\"\")","v":8},{"$f":"IF('CALCUL EFFECTIFS'!S73>0,'CALCUL EFFECTIFS'!S73,$A$6&\"\")","v":8},{"$f":"IF('CALCUL EFFECTIFS'!T73>0,'CALCUL EFFECTIFS'!T73,$A$6&\"\")","v":8},{"$f":"IF('CALCUL EFFECTIFS'!U73>0,'CALCUL EFFECTIFS'!U73,$A$6&\"\")","v":6},{"$f":"IF('CALCUL EFFECTIFS'!V73>0,'CALCUL EFFECTIFS'!V73,$A$6&\"\")","v":""},{"$f":"IF('CALCUL EFFECTIFS'!W73>0,'CALCUL EFFECTIFS'!W73,$A$6&\"\")","v":""},{"$f":"IF('CALCUL EFFECTIFS'!X73>0,'CALCUL EFFECTIFS'!X73,$A$6&\"\")","v":""},{"$f":"IF('CALCUL EFFECTIFS'!Y73>0,'CALCUL EFFECTIFS'!Y73,$A$6&\"\")","v":25},{"$f":"IF('CALCUL EFFECTIFS'!Z73>0,'CALCUL EFFECTIFS'!Z73,$A$6&\"\")","v":""},{"$f":"IF('CALCUL EFFECTIFS'!AA73>0,'CALCUL EFFECTIFS'!AA73,$A$6&\"\")","v":""},{"$f":"IF('CALCUL EFFECTIFS'!AB73>0,'CALCUL EFFECTIFS'!AB73,$A$6&\"\")","v":""},{"$f":"IF('CALCUL EFFECTIFS'!AC73>0,'CALCUL EFFECTIFS'!AC73,$A$6&\"\")","v":""},{"$f":"IF('CALCUL EFFECTIFS'!AD73>0,'CALCUL EFFECTIFS'!AD73,$A$6&\"\")","v":""},{"$f":"IF('CALCUL EFFECTIFS'!AE73>0,'CALCUL EFFECTIFS'!AE73,$A$6&\"\")","v":""},{"$f":"IF('CALCUL EFFECTIFS'!AF73>0,'CALCUL EFFECTIFS'!AF73,$A$6&\"\")","v":""},{"$f":"IF('CALCUL EFFECTIFS'!AG73>0,'CALCUL EFFECTIFS'!AG73,$A$6&\"\")","v":4},{"$f":"IF('CALCUL EFFECTIFS'!AH73>0,'CALCUL EFFECTIFS'!AH73,$A$6&\"\")","v":""},{"$f":"IF('CALCUL EFFECTIFS'!AI73>0,'CALCUL EFFECTIFS'!AI73,$A$6&\"\")","v":3},{"$f":"IF('CALCUL EFFECTIFS'!AJ73>0,'CALCUL EFFECTIFS'!AJ73,$A$6&\"\")","v":3},{"$f":"IF('CALCUL EFFECTIFS'!AK73>0,'CALCUL EFFECTIFS'!AK73,$A$6&\"\")","v":6},{"$f":"IF('CALCUL EFFECTIFS'!AL73>0,'CALCUL EFFECTIFS'!AL73,$A$6&\"\")","v":""}]
[{"$f":"IF(B16>0,'CALCUL EFFECTIFS'!B84&\"\",$A$6&\"\")","v":"RIZ AU CARAMEL"},137,null,{"$f":"IF('CALCUL EFFECTIFS'!D84>0,'CALCUL EFFECTIFS'!D84,$A$6&\"\")","v":26},{"$f":"IF('CALCUL EFFECTIFS'!E84>0,'CALCUL EFFECTIFS'!E84,$A$6&\"\")","v":21},{"$f":"IF('CALCUL EFFECTIFS'!F84>0,'CALCUL EFFECTIFS'!F84,$A$6&\"\")","v":10},{"$f":"IF('CALCUL EFFECTIFS'!G84>0,'CALCUL EFFECTIFS'!G84,$A$6&\"\")","v":8},{"$f":"IF('CALCUL EFFECTIFS'!H84>0,'CALCUL EFFECTIFS'!H84,$A$6&\"\")","v":10},{"$f":"IF('CALCUL EFFECTIFS'!I84>0,'CALCUL EFFECTIFS'!I84,$A$6&\"\")","v":""},{"$f":"IF('CALCUL EFFECTIFS'!J84>0,'CALCUL EFFECTIFS'!J84,$A$6&\"\")","v":""},{"$f":"IF('CALCUL EFFECTIFS'!K84>0,'CALCUL EFFECTIFS'!K84,$A$6&\"\")","v":""},{"$f":"IF('CALCUL EFFECTIFS'!L84>0,'CALCUL EFFECTIFS'!L84,$A$6&\"\")","v":1},{"$f":"IF('CALCUL EFFECTIFS'!M84>0,'CALCUL EFFECTIFS'!M84,$A$6&\"\")","v":""},{"$f":"IF('CALCUL EFFECTIFS'!N84>0,'CALCUL EFFECTIFS'!N84,$A$6&\"\")","v":""},{"$f":"IF('CALCUL EFFECTIFS'!O84>0,'CALCUL EFFECTIFS'!O84,$A$6&\"\")","v":""},{"$f":"IF('CALCUL EFFECTIFS'!P84>0,'CALCUL EFFECTIFS'!P84,$A$6&\"\")","v":""},{"$f":"IF('CALCUL EFFECTIFS'!Q84>0,'CALCUL EFFECTIFS'!Q84,$A$6&\"\")","v":""},{"$f":"IF('CALCUL EFFECTIFS'!R84>0,'CALCUL EFFECTIFS'!R84,$A$6&\"\")","v":6},{"$f":"IF('CALCUL EFFECTIFS'!S84>0,'CALCUL EFFECTIFS'!S84,$A$6&\"\")","v":7},{"$f":"IF('CALCUL EFFECTIFS'!T84>0,'CALCUL EFFECTIFS'!T84,$A$6&\"\")","v":6},{"$f":"IF('CALCUL EFFECTIFS'!U84>0,'CALCUL EFFECTIFS'!U84,$A$6&\"\")","v":4},{"$f":"IF('CALCUL EFFECTIFS'!V84>0,'CALCUL EFFECTIFS'!V84,$A$6&\"\")","v":""},{"$f":"IF('CALCUL EFFECTIFS'!W84>0,'CALCUL EFFECTIFS'!W84,$A$6&\"\")","v":""},{"$f":"IF('CALCUL EFFECTIFS'!X84>0,'CALCUL EFFECTIFS'!X84,$A$6&\"\")","v":""},{"$f":"IF('CALCUL EFFECTIFS'!Y84>0,'CALCUL EFFECTIFS'!Y84,$A$6&\"\")","v":24},{"$f":"IF('CALCUL EFFECTIFS'!Z84>0,'CALCUL EFFECTIFS'!Z84,$A$6&\"\")","v":""},{"$f":"IF('CALCUL EFFECTIFS'!AA84>0,'CALCUL EFFECTIFS'!AA84,$A$6&\"\")","v":""},{"$f":"IF('CALCUL EFFECTIFS'!AB84>0,'CALCUL EFFECTIFS'!AB84,$A$6&\"\")","v":""},{"$f":"IF('CALCUL EFFECTIFS'!AC84>0,'CALCUL EFFECTIFS'!AC84,$A$6&\"\")","v":""},{"$f":"IF('CALCUL EFFECTIFS'!AD84>0,'CALCUL EFFECTIFS'!AD84,$A$6&\"\")","v":""},{"$f":"IF('CALCUL EFFECTIFS'!AE84>0,'CALCUL EFFECTIFS'!AE84,$A$6&\"\")","v":""},{"$f":"IF('CALCUL EFFECTIFS'!AF84>0,'CALCUL EFFECTIFS'!AF84,$A$6&\"\")","v":""},{"$f":"IF('CALCUL EFFECTIFS'!AG84>0,'CALCUL EFFECTIFS'!AG84,$A$6&\"\")","v":3},{"$f":"IF('CALCUL EFFECTIFS'!AH84>0,'CALCUL EFFECTIFS'!AH84,$A$6&\"\")","v":""},{"$f":"IF('CALCUL EFFECTIFS'!AI84>0,'CALCUL EFFECTIFS'!AI84,$A$6&\"\")","v":3},{"$f":"IF('CALCUL EFFECTIFS'!AJ84>0,'CALCUL EFFECTIFS'!AJ84,$A$6&\"\")","v":3},{"$f":"IF('CALCUL EFFECTIFS'!AK84>0,'CALCUL EFFECTIFS'!AK84,$A$6&\"\")","v":5},{"$f":"IF('CALCUL EFFECTIFS'!AL84>0,'CALCUL EFFECTIFS'!AL84,$A$6&\"\")","v":""}]
[{"$f":"IF(MENUS!B9=\"POTAGE\",'CALCUL EFFECTIFS'!B43,A6&\"\")","v":""},0,null,null,null,{"$f":"IF($A$17=\"POTAGE\",'CALCUL EFFECTIFS'!F44,$A$6&\"\")","v":""},{"$f":"IF($A$17=\"POTAGE\",'CALCUL EFFECTIFS'!G44,$A$6&\"\")","v":""},{"$f":"IF($A$17=\"POTAGE\",'CALCUL EFFECTIFS'!H44,$A$6&\"\")","v":""},{"$f":"IF($A$17=\"POTAGE\",'CALCUL EFFECTIFS'!I44,$A$6&\"\")","v":""},{"$f":"IF($A$17=\"POTAGE\",'CALCUL EFFECTIFS'!J44,$A$6&\"\")","v":""},{"$f":"IF($A$17=\"POTAGE\",'CALCUL EFFECTIFS'!K44,$A$6&\"\")","v":""},{"$f":"IF($A$17=\"POTAGE\",'CALCUL EFFECTIFS'!L44,$A$6&\"\")","v":""},{"$f":"IF($A$17=\"POTAGE\",'CALCUL EFFECTIFS'!M44,$A$6&\"\")","v":""},{"$f":"IF($A$17=\"POTAGE\",'CALCUL EFFECTIFS'!N44,$A$6&\"\")","v":""},{"$f":"IF($A$17=\"POTAGE\",'CALCUL EFFECTIFS'!O44,$A$6&\"\")","v":""},{"$f":"IF($A$17=\"POTAGE\",'CALCUL EFFECTIFS'!P44,$A$6&\"\")","v":""},{"$f":"IF($A$17=\"POTAGE\",'CALCUL EFFECTIFS'!Q44,$A$6&\"\")","v":""},{"$f":"IF($A$17=\"POTAGE\",'CALCUL EFFECTIFS'!R44,$A$6&\"\")","v":""},{"$f":"IF($A$17=\"POTAGE\",'CALCUL EFFECTIFS'!S44,$A$6&\"\")","v":""},{"$f":"IF($A$17=\"POTAGE\",'CALCUL EFFECTIFS'!T44,$A$6&\"\")","v":""},{"$f":"IF($A$17=\"POTAGE\",'CALCUL EFFECTIFS'!U44,$A$6&\"\")","v":""},{"$f":"IF($A$17=\"POTAGE\",'CALCUL EFFECTIFS'!V44,$A$6&\"\")","v":""},{"$f":"IF($A$17=\"POTAGE\",'CALCUL EFFECTIFS'!W44,$A$6&\"\")","v":""},{"$f":"IF($A$17=\"POTAGE\",'CALCUL EFFECTIFS'!X44,$A$6&\"\")","v":""},{"$f":"IF($A$17=\"POTAGE\",'CALCUL EFFECTIFS'!Y44,$A$6&\"\")","v":""},{"$f":"IF($A$17=\"POTAGE\",'CALCUL EFFECTIFS'!Z44,$A$6&\"\")","v":""},{"$f":"IF($A$17=\"POTAGE\",'CALCUL EFFECTIFS'!AA44,$A$6&\"\")","v":""},{"$f":"IF($A$17=\"POTAGE\",'CALCUL EFFECTIFS'!AB44,$A$6&\"\")","v":""},{"$f":"IF($A$17=\"POTAGE\",'CALCUL EFFECTIFS'!AC44,$A$6&\"\")","v":""},{"$f":"IF($A$17=\"POTAGE\",'CALCUL EFFECTIFS'!AD44,$A$6&\"\")","v":""},{"$f":"IF($A$17=\"POTAGE\",'CALCUL EFFECTIFS'!AE44,$A$6&\"\")","v":""},{"$f":"IF($A$17=\"POTAGE\",'CALCUL EFFECTIFS'!AF44,$A$6&\"\")","v":""},{"$f":"IF($A$17=\"POTAGE\",'CALCUL EFFECTIFS'!AG44,$A$6&\"\")","v":""},{"$f":"IF($A$17=\"POTAGE\",'CALCUL EFFECTIFS'!AH44,$A$6&\"\")","v":""},{"$f":"IF($A$17=\"POTAGE\",'CALCUL EFFECTIFS'!AI44,$A$6&\"\")","v":""},{"$f":"IF($A$17=\"POTAGE\",'CALCUL EFFECTIFS'!AJ44,$A$6&\"\")","v":""},{"$f":"IF($A$17=\"POTAGE\",'CALCUL EFFECTIFS'!AK44,$A$6&\"\")","v":""},{"$f":"IF($A$17=\"POTAGE\",'CALCUL EFFECTIFS'!AL44,$A$6&\"\")","v":""}]
["LEGUMES VERTS REMY",1,null,null,null,1]
["LEGUMES VERTS",2,null,null,null,null,null,null,null,null,null,null,null,null,null,null,null,null,null,null,null,null,null,null,null,null,null,null,null,null,null,null,1,null,null,null,1]
["FECULENT",3,null,null,null,1,null,null,null,null,null,null,null,null,null,null,null,null,null,null,null,null,null,null,null,null,null,null,null,null,null,null,1,null,null,null,1]
[null,0]
[null,0]
[null,0]
[null,0]
[{"$f":"IF(B25>0,'CALCUL EFFECTIFS'!B24&\"\",$A$6&\"\")","v":"MACEDOINE CŒUR PALMOIER"},4,null,{"$f":"IF('CALCUL EFFECTIFS'!D24>0,'CALCUL EFFECTIFS'!D24,$A$6&\"\")","v":4}]
[{"$f":"IF(B26>0,'CALCUL EFFECTIFS'!B52&\"\",$A$6&\"\")","v":"ESCALOPE DE DINDE"},4,null,{"$f":"IF('CALCUL EFFECTIFS'!D52>0,'CALCUL EFFECTIFS'!D52,$A$6&\"\")","v":4}]
[{"$f":"IF(B27>0,'CALCUL EFFECTIFS'!B63&\"\",$A$6&\"\")","v":"BROCOLIS"},4,null,{"$f":"IF('CALCUL EFFECTIFS'!D63>0,'CALCUL EFFECTIFS'!D63,$A$6&\"\")","v":4}]
[{"$f":"IF(B28>0,'CALCUL EFFECTIFS'!B74&\"\",$A$6&\"\")","v":"YAOURT"},4,null,{"$f":"IF('CALCUL EFFECTIFS'!D74>0,'CALCUL EFFECTIFS'!D74,$A$6&\"\")","v":4}]
[{"$f":"IF(B29>0,'CALCUL EFFECTIFS'!B85&\"\",$A$6&\"\")","v":"RIZ AU CARAMEL"},4,null,{"$f":"IF('CALCUL EFFECTIFS'!D85>0,'CALCUL EFFECTIFS'!D85,$A$6&\"\")","v":4}]
[{"$f":"IF(B30>0,'CALCUL EFFECTIFS'!B25&\"\",$A$6&\"\")","v":"MACEDOINE CŒUR PALMOIER"},3,null,{"$f":"IF('CALCUL EFFECTIFS'!D25>0,'CALCUL EFFECTIFS'!D25,$A$6&\"\")","v":3},null,{"$f":"IF(MENUS!$B$9=\"POTAGE\",$A$6&\"\",'CALCUL EFFECTIFS'!F26)","v":""},{"$f":"IF(MENUS!$B$9=\"POTAGE\",$A$6&\"\",'CALCUL EFFECTIFS'!G26)","v":""},{"$f":"IF(MENUS!$B$9=\"POTAGE\",$A$6&\"\",'CALCUL EFFECTIFS'!H26)","v":""},{"$f":"IF(MENUS!$B$9=\"POTAGE\",$A$6&\"\",'CALCUL EFFECTIFS'!I26)","v":""},{"$f":"IF(MENUS!$B$9=\"POTAGE\",$A$6&\"\",'CALCUL EFFECTIFS'!J26)","v":""},{"$f":"IF(MENUS!$B$9=\"POTAGE\",$A$6&\"\",'CALCUL EFFECTIFS'!K26)","v":""},{"$f":"IF(MENUS!$B$9=\"POTAGE\",$A$6&\"\",'CALCUL EFFECTIFS'!L26)","v":""},{"$f":"IF(MENUS!$B$9=\"POTAGE\",$A$6&\"\",'CALCUL EFFECTIFS'!M26)","v":""},{"$f":"IF(MENUS!$B$9=\"POTAGE\",$A$6&\"\",'CALCUL EFFECTIFS'!N26)","v":""},{"$f":"IF(MENUS!$B$9=\"POTAGE\",$A$6&\"\",'CALCUL EFFECTIFS'!O26)","v":""},{"$f":"IF(MENUS!$B$9=\"POTAGE\",$A$6&\"\",'CALCUL EFFECTIFS'!P26)","v":""},{"$f":"IF(MENUS!$B$9=\"POTAGE\",$A$6&\"\",'CALCUL EFFECTIFS'!Q26)","v":""},{"$f":"IF(MENUS!$B$9=\"POTAGE\",$A$6&\"\",'CALCUL EFFECTIFS'!R26)","v":""},{"$f":"IF(MENUS!$B$9=\"POTAGE\",$A$6&\"\",'CALCUL EFFECTIFS'!S26)","v":""},{"$f":"IF(MENUS!$B$9=\"POTAGE\",$A$6&\"\",'CALCUL EFFECTIFS'!T26)","v":""},{"$f":"IF(MENUS!$B$9=\"POTAGE\",$A$6&\"\",'CALCUL EFFECTIFS'!U26)","v":""},{"$f":"IF(MENUS!$B$9=\"POTAGE\",$A$6&\"\",'CALCUL EFFECTIFS'!V26)","v":""},{"$f":"IF(MENUS!$B$9=\"POTAGE\",$A$6&\"\",'CALCUL EFFECTIFS'!W26)","v":""},{"$f":"IF(MENUS!$B$9=\"POTAGE\",$A$6&\"\",'CALCUL EFFECTIFS'!X26)","v":""},{"$f":"IF(MENUS!$B$9=\"POTAGE\",$A$6&\"\",'CALCUL EFFECTIFS'!Y26)","v":""},{"$f":"IF(MENUS!$B$9=\"POTAGE\",$A$6&\"\",'CALCUL EFFECTIFS'!Z26)","v":""},{"$f":"IF(MENUS!$B$9=\"POTAGE\",$A$6&\"\",'CALCUL EFFECTIFS'!AA26)","v":""},{"$f":"IF(MENUS!$B$9=\"POTAGE\",$A$6&\"\",'CALCUL EFFECTIFS'!AB26)","v":""},{"$f":"IF(MENUS!$B$9=\"POTAGE\",$A$6&\"\",'CALCUL EFFECTIFS'!AC26)","v":""},{"$f":"IF(MENUS!$B$9=\"POTAGE\",$A$6&\"\",'CALCUL EFFECTIFS'!AD26)","v":""},{"$f":"IF(MENUS!$B$9=\"POTAGE\",$A$6&\"\",'CALCUL EFFECTIFS'!AE26)","v":""},{"$f":"IF(MENUS!$B$9=\"POTAGE\",$A$6&\"\",'CALCUL EFFECTIFS'!AF26)","v":""},{"$f":"IF(MENUS!$B$9=\"POTAGE\",$A$6&\"\",'CALCUL EFFECTIFS'!AG26)","v":""},{"$f":"IF(MENUS!$B$9=\"POTAGE\",$A$6&\"\",'CALCUL EFFECTIFS'!AH26)","v":""},{"$f":"IF(MENUS!$B$9=\"POTAGE\",$A$6&\"\",'CALCUL EFFECTIFS'!AI26)","v":""},{"$f":"IF(MENUS!$B$9=\"POTAGE\",$A$6&\"\",'CALCUL EFFECTIFS'!AJ26)","v":""},{"$f":"IF(MENUS!$B$9=\"POTAGE\",$A$6&\"\",'CALCUL EFFECTIFS'!AK26)","v":""}]
[{"$f":"IF(B31>0,'CALCUL EFFECTIFS'!B53&\"\",$A$6&\"\")","v":"SAUCISSE DE TOULOUSE"},3,null,{"$f":"IF('CALCUL EFFECTIFS'!D53>0,'CALCUL EFFECTIFS'!D53,$A$6&\"\")","v":3},null,{"$f":"IF('CALCUL EFFECTIFS'!F53>0,'CALCUL EFFECTIFS'!F53,$A$6&\"\")","v":""},{"$f":"IF('CALCUL EFFECTIFS'!G53>0,'CALCUL EFFECTIFS'!G53,$A$6&\"\")","v":""},{"$f":"IF('CALCUL EFFECTIFS'!H53>0,'CALCUL EFFECTIFS'!H53,$A$6&\"\")","v":""},null,null,null,null,null,null,null,null,null,{"$f":"IF('CALCUL EFFECTIFS'!R53>0,'CALCUL EFFECTIFS'!R53,$A$6&\"\")","v":""},{"$f":"IF('CALCUL EFFECTIFS'!S53>0,'CALCUL EFFECTIFS'!S53,$A$6&\"\")","v":""},{"$f":"IF('CALCUL EFFECTIFS'!T53>0,'CALCUL EFFECTIFS'!T53,$A$6&\"\")","v":""},{"$f":"IF('CALCUL EFFECTIFS'!U53>0,'CALCUL EFFECTIFS'!U53,$A$6&\"\")","v":""},{"$f":"IF('CALCUL EFFECTIFS'!V53>0,'CALCUL EFFECTIFS'!V53,$A$6&\"\")","v":""},{"$f":"IF('CALCUL EFFECTIFS'!W53>0,'CALCUL EFFECTIFS'!W53,$A$6&\"\")","v":""},{"$f":"IF('CALCUL EFFECTIFS'!X53>0,'CALCUL EFFECTIFS'!X53,$A$6&\"\")","v":""},{"$f":"IF('CALCUL EFFECTIFS'!Y53>0,'CALCUL EFFECTIFS'!Y53,$A$6&\"\")","v":""},{"$f":"IF('CALCUL EFFECTIFS'!Z53>0,'CALCUL EFFECTIFS'!Z53,$A$6&\"\")","v":""},{"$f":"IF('CALCUL EFFECTIFS'!AA53>0,'CALCUL EFFECTIFS'!AA53,$A$6&\"\")","v":""},{"$f":"IF('CALCUL EFFECTIFS'!AB53>0,'CALCUL EFFECTIFS'!AB53,$A$6&\"\")","v":""},{"$f":"IF('CALCUL EFFECTIFS'!AC53>0,'CALCUL EFFECTIFS'!AC53,$A$6&\"\")","v":""},{"$f":"IF('CALCUL EFFECTIFS'!AD53>0,'CALCUL EFFECTIFS'!AD53,$A$6&\"\")","v":""},{"$f":"IF('CALCUL EFFECTIFS'!AE53>0,'CALCUL EFFECTIFS'!AE53,$A$6&\"\")","v":""},{"$f":"IF('CALCUL EFFECTIFS'!AF53>0,'CALCUL EFFECTIFS'!AF53,$A$6&\"\")","v":""},{"$f":"IF('CALCUL EFFECTIFS'!AG53>0,'CALCUL EFFECTIFS'!AG53,$A$6&\"\")","v":""},{"$f":"IF('CALCUL EFFECTIFS'!AH53>0,'CALCUL EFFECTIFS'!AH53,$A$6&\"\")","v":""},{"$f":"IF('CALCUL EFFECTIFS'!AI53>0,'CALCUL EFFECTIFS'!AI53,$A$6&\"\")","v":""},{"$f":"IF('CALCUL EFFECTIFS'!AJ53>0,'CALCUL EFFECTIFS'!AJ53,$A$6&\"\")","v":""},{"$f":"IF('CALCUL EFFECTIFS'!AK53>0,'CALCUL EFFECTIFS'!AK53,$A$6&\"\")","v":""}]
[{"$f":"IF(B32>0,'CALCUL EFFECTIFS'!B64&\"\",$A$6&\"\")","v":"BROCOLIS"},3,null,{"$f":"IF('CALCUL EFFECTIFS'!D64>0,'CALCUL EFFECTIFS'!D64,$A$6&\"\")","v":3},null,{"$f":"IF('CALCUL EFFECTIFS'!F64>0,'CALCUL EFFECTIFS'!F64,$A$6&\"\")","v":""},{"$f":"IF('CALCUL EFFECTIFS'!G64>0,'CALCUL EFFECTIFS'!G64,$A$6&\"\")","v":""},{"$f":"IF('CALCUL EFFECTIFS'!H64>0,'CALCUL EFFECTIFS'!H64,$A$6&\"\")","v":""},null,null,null,null,null,null,null,null,null,{"$f":"IF('CALCUL EFFECTIFS'!R64>0,'CALCUL EFFECTIFS'!R64,$A$6&\"\")","v":""},{"$f":"IF('CALCUL EFFECTIFS'!S64>0,'CALCUL EFFECTIFS'!S64,$A$6&\"\")","v":""},{"$f":"IF('CALCUL EFFECTIFS'!T64>0,'CALCUL EFFECTIFS'!T64,$A$6&\"\")","v":""},{"$f":"IF('CALCUL EFFECTIFS'!U64>0,'CALCUL EFFECTIFS'!U64,$A$6&\"\")","v":""},{"$f":"IF('CALCUL EFFECTIFS'!V64>0,'CALCUL EFFECTIFS'!V64,$A$6&\"\")","v":""},{"$f":"IF('CALCUL EFFECTIFS'!W64>0,'CALCUL EFFECTIFS'!W64,$A$6&\"\")","v":""},{"$f":"IF('CALCUL EFFECTIFS'!X64>0,'CALCUL EFFECTIFS'!X64,$A$6&\"\")","v":""},{"$f":"IF('CALCUL EFFECTIFS'!Y64>0,'CALCUL EFFECTIFS'!Y64,$A$6&\"\")","v":""},{"$f":"IF('CALCUL EFFECTIFS'!Z64>0,'CALCUL EFFECTIFS'!Z64,$A$6&\"\")","v":""},{"$f":"IF('CALCUL EFFECTIFS'!AA64>0,'CALCUL EFFECTIFS'!AA64,$A$6&\"\")","v":""},{"$f":"IF('CALCUL EFFECTIFS'!AB64>0,'CALCUL EFFECTIFS'!AB64,$A$6&\"\")","v":""},{"$f":"IF('CALCUL EFFECTIFS'!AC64>0,'CALCUL EFFECTIFS'!AC64,$A$6&\"\")","v":""},{"$f":"IF('CALCUL EFFECTIFS'!AD64>0,'CALCUL EFFECTIFS'!AD64,$A$6&\"\")","v":""},{"$f":"IF('CALCUL EFFECTIFS'!AE64>0,'CALCUL EFFECTIFS'!AE64,$A$6&\"\")","v":""},{"$f":"IF('CALCUL EFFECTIFS'!AF64>0,'CALCUL EFFECTIFS'!AF64,$A$6&\"\")","v":""},{"$f":"IF('CALCUL EFFECTIFS'!AG64>0,'CALCUL EFFECTIFS'!AG64,$A$6&\"\")","v":""},{"$f":"IF('CALCUL EFFECTIFS'!AH64>0,'CALCUL EFFECTIFS'!AH64,$A$6&\"\")","v":""},{"$f":"IF('CALCUL EFFECTIFS'!AI64>0,'CALCUL EFFECTIFS'!AI64,$A$6&\"\")","v":""},{"$f":"IF('CALCUL EFFECTIFS'!AJ64>0,'CALCUL EFFECTIFS'!AJ64,$A$6&\"\")","v":""},{"$f":"IF('CALCUL EFFECTIFS'!AK64>0,'CALCUL EFFECTIFS'!AK64,$A$6&\"\")","v":""}]
[{"$f":"IF(B33>0,'CALCUL EFFECTIFS'!B75&\"\",$A$6&\"\")","v":"YAOURT"},3,null,{"$f":"IF('CALCUL EFFECTIFS'!D75>0,'CALCUL EFFECTIFS'!D75,$A$6&\"\")","v":3},null,{"$f":"IF('CALCUL EFFECTIFS'!F75>0,'CALCUL EFFECTIFS'!F75,$A$6&\"\")","v":""},{"$f":"IF('CALCUL EFFECTIFS'!G75>0,'CALCUL EFFECTIFS'!G75,$A$6&\"\")","v":""},{"$f":"IF('CALCUL EFFECTIFS'!H75>0,'CALCUL EFFECTIFS'!H75,$A$6&\"\")","v":""},null,null,null,null,null,null,null,null,null,{"$f":"IF('CALCUL EFFECTIFS'!R75>0,'CALCUL EFFECTIFS'!R75,$A$6&\"\")","v":""},{"$f":"IF('CALCUL EFFECTIFS'!S75>0,'CALCUL EFFECTIFS'!S75,$A$6&\"\")","v":""},{"$f":"IF('CALCUL EFFECTIFS'!T75>0,'CALCUL EFFECTIFS'!T75,$A$6&\"\")","v":""},{"$f":"IF('CALCUL EFFECTIFS'!U75>0,'CALCUL EFFECTIFS'!U75,$A$6&\"\")","v":""},{"$f":"IF('CALCUL EFFECTIFS'!V75>0,'CALCUL EFFECTIFS'!V75,$A$6&\"\")","v":""},{"$f":"IF('CALCUL EFFECTIFS'!W75>0,'CALCUL EFFECTIFS'!W75,$A$6&\"\")","v":""},{"$f":"IF('CALCUL EFFECTIFS'!X75>0,'CALCUL EFFECTIFS'!X75,$A$6&\"\")","v":""},{"$f":"IF('CALCUL EFFECTIFS'!Y75>0,'CALCUL EFFECTIFS'!Y75,$A$6&\"\")","v":""},{"$f":"IF('CALCUL EFFECTIFS'!Z75>0,'CALCUL EFFECTIFS'!Z75,$A$6&\"\")","v":""},{"$f":"IF('CALCUL EFFECTIFS'!AA75>0,'CALCUL EFFECTIFS'!AA75,$A$6&\"\")","v":""},{"$f":"IF('CALCUL EFFECTIFS'!AB75>0,'CALCUL EFFECTIFS'!AB75,$A$6&\"\")","v":""},{"$f":"IF('CALCUL EFFECTIFS'!AC75>0,'CALCUL EFFECTIFS'!AC75,$A$6&\"\")","v":""},{"$f":"IF('CALCUL EFFECTIFS'!AD75>0,'CALCUL EFFECTIFS'!AD75,$A$6&\"\")","v":""},{"$f":"IF('CALCUL EFFECTIFS'!AE75>0,'CALCUL EFFECTIFS'!AE75,$A$6&\"\")","v":""},{"$f":"IF('CALCUL EFFECTIFS'!AF75>0,'CALCUL EFFECTIFS'!AF75,$A$6&\"\")","v":""},{"$f":"IF('CALCUL EFFECTIFS'!AG75>0,'CALCUL EFFECTIFS'!AG75,$A$6&\"\")","v":""},{"$f":"IF('CALCUL EFFECTIFS'!AH75>0,'CALCUL EFFECTIFS'!AH75,$A$6&\"\")","v":""},{"$f":"IF('CALCUL EFFECTIFS'!AI75>0,'CALCUL EFFECTIFS'!AI75,$A$6&\"\")","v":""},{"$f":"IF('CALCUL EFFECTIFS'!AJ75>0,'CALCUL EFFECTIFS'!AJ75,$A$6&\"\")","v":""},{"$f":"IF('CALCUL EFFECTIFS'!AK75>0,'CALCUL EFFECTIFS'!AK75,$A$6&\"\")","v":""}]
[{"$f":"IF(B34>0,'CALCUL EFFECTIFS'!B86&\"\",$A$6&\"\")","v":"KIWI"},5,null,{"$f":"IF('CALCUL EFFECTIFS'!D86>0,'CALCUL EFFECTIFS'!D86,$A$6&\"\")","v":3},null,{"$f":"IF('CALCUL EFFECTIFS'!F86>0,'CALCUL EFFECTIFS'!F86,$A$6&\"\")","v":1},{"$f":"IF('CALCUL EFFECTIFS'!G86>0,'CALCUL EFFECTIFS'!G86,$A$6&\"\")","v":""},{"$f":"IF('CALCUL EFFECTIFS'!H86>0,'CALCUL EFFECTIFS'!H86,$A$6&\"\")","v":""},null,null,null,null,null,null,null,null,null,{"$f":"IF('CALCUL EFFECTIFS'!R86>0,'CALCUL EFFECTIFS'!R86,$A$6&\"\")","v":""},{"$f":"IF('CALCUL EFFECTIFS'!S86>0,'CALCUL EFFECTIFS'!S86,$A$6&\"\")","v":""},{"$f":"IF('CALCUL EFFECTIFS'!T86>0,'CALCUL EFFECTIFS'!T86,$A$6&\"\")","v":""},{"$f":"IF('CALCUL EFFECTIFS'!U86>0,'CALCUL EFFECTIFS'!U86,$A$6&\"\")","v":""},{"$f":"IF('CALCUL EFFECTIFS'!V86>0,'CALCUL EFFECTIFS'!V86,$A$6&\"\")","v":""},{"$f":"IF('CALCUL EFFECTIFS'!W86>0,'CALCUL EFFECTIFS'!W86,$A$6&\"\")","v":""},{"$f":"IF('CALCUL EFFECTIFS'!X86>0,'CALCUL EFFECTIFS'!X86,$A$6&\"\")","v":""},{"$f":"IF('CALCUL EFFECTIFS'!Y86>0,'CALCUL EFFECTIFS'!Y86,$A$6&\"\")","v":""},{"$f":"IF('CALCUL EFFECTIFS'!Z86>0,'CALCUL EFFECTIFS'!Z86,$A$6&\"\")","v":""},{"$f":"IF('CALCUL EFFECTIFS'!AA86>0,'CALCUL EFFECTIFS'!AA86,$A$6&\"\")","v":""},{"$f":"IF('CALCUL EFFECTIFS'!AB86>0,'CALCUL EFFECTIFS'!AB86,$A$6&\"\")","v":""},{"$f":"IF('CALCUL EFFECTIFS'!AC86>0,'CALCUL EFFECTIFS'!AC86,$A$6&\"\")","v":""},{"$f":"IF('CALCUL EFFECTIFS'!AD86>0,'CALCUL EFFECTIFS'!AD86,$A$6&\"\")","v":""},{"$f":"IF('CALCUL EFFECTIFS'!AE86>0,'CALCUL EFFECTIFS'!AE86,$A$6&\"\")","v":""},{"$f":"IF('CALCUL EFFECTIFS'!AF86>0,'CALCUL EFFECTIFS'!AF86,$A$6&\"\")","v":""},{"$f":"IF('CALCUL EFFECTIFS'!AG86>0,'CALCUL EFFECTIFS'!AG86,$A$6&\"\")","v":1},{"$f":"IF('CALCUL EFFECTIFS'!AH86>0,'CALCUL EFFECTIFS'!AH86,$A$6&\"\")","v":""},{"$f":"IF('CALCUL EFFECTIFS'!AI86>0,'CALCUL EFFECTIFS'!AI86,$A$6&\"\")","v":""},{"$f":"IF('CALCUL EFFECTIFS'!AJ86>0,'CALCUL EFFECTIFS'!AJ86,$A$6&\"\")","v":""},{"$f":"IF('CALCUL EFFECTIFS'!AK86>0,'CALCUL EFFECTIFS'!AK86,$A$6&\"\")","v":""}]
[{"$f":"IF(B35>0,'CALCUL EFFECTIFS'!B27&\"\",$A$6&\"\")","v":"MACEDOINE CŒUR PALMOIER"},1,null,{"$f":"IF('CALCUL EFFECTIFS'!D27>0,'CALCUL EFFECTIFS'!D27,$A$6&\"\")","v":1},null,{"$f":"IF(MENUS!$B$9=\"POTAGE\",$A$6&\"\",'CALCUL EFFECTIFS'!F28)","v":""},{"$f":"IF(MENUS!$B$9=\"POTAGE\",$A$6&\"\",'CALCUL EFFECTIFS'!G28)","v":""},{"$f":"IF(MENUS!$B$9=\"POTAGE\",$A$6&\"\",'CALCUL EFFECTIFS'!H28)","v":""},{"$f":"IF(MENUS!$B$9=\"POTAGE\",$A$6&\"\",'CALCUL EFFECTIFS'!I28)","v":""},{"$f":"IF(MENUS!$B$9=\"POTAGE\",$A$6&\"\",'CALCUL EFFECTIFS'!J28)","v":""},{"$f":"IF(MENUS!$B$9=\"POTAGE\",$A$6&\"\",'CALCUL EFFECTIFS'!K28)","v":""},{"$f":"IF(MENUS!$B$9=\"POTAGE\",$A$6&\"\",'CALCUL EFFECTIFS'!L28)","v":""},{"$f":"IF(MENUS!$B$9=\"POTAGE\",$A$6&\"\",'CALCUL EFFECTIFS'!M28)","v":""},{"$f":"IF(MENUS!$B$9=\"POTAGE\",$A$6&\"\",'CALCUL EFFECTIFS'!N28)","v":""},{"$f":"IF(MENUS!$B$9=\"POTAGE\",$A$6&\"\",'CALCUL EFFECTIFS'!O28)","v":""},{"$f":"IF(MENUS!$B$9=\"POTAGE\",$A$6&\"\",'CALCUL EFFECTIFS'!P28)","v":""},{"$f":"IF(MENUS!$B$9=\"POTAGE\",$A$6&\"\",'CALCUL EFFECTIFS'!Q28)","v":""},{"$f":"IF(MENUS!$B$9=\"POTAGE\",$A$6&\"\",'CALCUL EFFECTIFS'!R28)","v":""},{"$f":"IF(MENUS!$B$9=\"POTAGE\",$A$6&\"\",'CALCUL EFFECTIFS'!S28)","v":""},{"$f":"IF(MENUS!$B$9=\"POTAGE\",$A$6&\"\",'CALCUL EFFECTIFS'!T28)","v":""},{"$f":"IF(MENUS!$B$9=\"POTAGE\",$A$6&\"\",'CALCUL EFFECTIFS'!U28)","v":""},{"$f":"IF(MENUS!$B$9=\"POTAGE\",$A$6&\"\",'CALCUL EFFECTIFS'!V28)","v":""},{"$f":"IF(MENUS!$B$9=\"POTAGE\",$A$6&\"\",'CALCUL EFFECTIFS'!W28)","v":""},{"$f":"IF(MENUS!$B$9=\"POTAGE\",$A$6&\"\",'CALCUL EFFECTIFS'!X28)","v":""},{"$f":"IF(MENUS!$B$9=\"POTAGE\",$A$6&\"\",'CALCUL EFFECTIFS'!Y28)","v":""},{"$f":"IF(MENUS!$B$9=\"POTAGE\",$A$6&\"\",'CALCUL EFFECTIFS'!Z28)","v":""},{"$f":"IF(MENUS!$B$9=\"POTAGE\",$A$6&\"\",'CALCUL EFFECTIFS'!AA28)","v":""},{"$f":"IF(MENUS!$B$9=\"POTAGE\",$A$6&\"\",'CALCUL EFFECTIFS'!AB28)","v":""},{"$f":"IF(MENUS!$B$9=\"POTAGE\",$A$6&\"\",'CALCUL EFFECTIFS'!AC28)","v":""},{"$f":"IF(MENUS!$B$9=\"POTAGE\",$A$6&\"\",'CALCUL EFFECTIFS'!AD28)","v":""},{"$f":"IF(MENUS!$B$9=\"POTAGE\",$A$6&\"\",'CALCUL EFFECTIFS'!AE28)","v":""},{"$f":"IF(MENUS!$B$9=\"POTAGE\",$A$6&\"\",'CALCUL EFFECTIFS'!AF28)","v":""},{"$f":"IF(MENUS!$B$9=\"POTAGE\",$A$6&\"\",'CALCUL EFFECTIFS'!AG28)","v":""},{"$f":"IF(MENUS!$B$9=\"POTAGE\",$A$6&\"\",'CALCUL EFFECTIFS'!AH28)","v":""},{"$f":"IF(MENUS!$B$9=\"POTAGE\",$A$6&\"\",'CALCUL EFFECTIFS'!AI28)","v":""},{"$f":"IF(MENUS!$B$9=\"POTAGE\",$A$6&\"\",'CALCUL EFFECTIFS'!AJ28)","v":""},{"$f":"IF(MENUS!$B$9=\"POTAGE\",$A$6&\"\",'CALCUL EFFECTIFS'!AK28)","v":""}]
[{"$f":"IF(B36>0,'CALCUL EFFECTIFS'!B54&\"\",$A$6&\"\")","v":"ESCALOPE DE DINDE"},14,null,{"$f":"IF('CALCUL EFFECTIFS'!D54>0,'CALCUL EFFECTIFS'!D54,$A$6&\"\")","v":1},null,{"$f":"IF('CALCUL EFFECTIFS'!F54>0,'CALCUL EFFECTIFS'!F54,$A$6&\"\")","v":""},{"$f":"IF('CALCUL EFFECTIFS'!G54>0,'CALCUL EFFECTIFS'!G54,$A$6&\"\")","v":2},{"$f":"IF('CALCUL EFFECTIFS'!H54>0,'CALCUL EFFECTIFS'!H54,$A$6&\"\")","v":2},null,null,null,null,null,null,null,null,null,{"$f":"IF('CALCUL EFFECTIFS'!R54>0,'CALCUL EFFECTIFS'!R54,$A$6&\"\")","v":2},{"$f":"IF('CALCUL EFFECTIFS'!S54>0,'CALCUL EFFECTIFS'!S54,$A$6&\"\")","v":1},{"$f":"IF('CALCUL EFFECTIFS'!T54>0,'CALCUL EFFECTIFS'!T54,$A$6&\"\")","v":2},{"$f":"IF('CALCUL EFFECTIFS'!U54>0,'CALCUL EFFECTIFS'!U54,$A$6&\"\")","v":2},{"$f":"IF('CALCUL EFFECTIFS'!V54>0,'CALCUL EFFECTIFS'!V54,$A$6&\"\")","v":""},{"$f":"IF('CALCUL EFFECTIFS'!W54>0,'CALCUL EFFECTIFS'!W54,$A$6&\"\")","v":""},{"$f":"IF('CALCUL EFFECTIFS'!X54>0,'CALCUL EFFECTIFS'!X54,$A$6&\"\")","v":""},{"$f":"IF('CALCUL EFFECTIFS'!Y54>0,'CALCUL EFFECTIFS'!Y54,$A$6&\"\")","v":1},{"$f":"IF('CALCUL EFFECTIFS'!Z54>0,'CALCUL EFFECTIFS'!Z54,$A$6&\"\")","v":""},{"$f":"IF('CALCUL EFFECTIFS'!AA54>0,'CALCUL EFFECTIFS'!AA54,$A$6&\"\")","v":""},{"$f":"IF('CALCUL EFFECTIFS'!AB54>0,'CALCUL EFFECTIFS'!AB54,$A$6&\"\")","v":""},{"$f":"IF('CALCUL EFFECTIFS'!AC54>0,'CALCUL EFFECTIFS'!AC54,$A$6&\"\")","v":""},{"$f":"IF('CALCUL EFFECTIFS'!AD54>0,'CALCUL EFFECTIFS'!AD54,$A$6&\"\")","v":""},{"$f":"IF('CALCUL EFFECTIFS'!AE54>0,'CALCUL EFFECTIFS'!AE54,$A$6&\"\")","v":""},{"$f":"IF('CALCUL EFFECTIFS'!AF54>0,'CALCUL EFFECTIFS'!AF54,$A$6&\"\")","v":""},{"$f":"IF('CALCUL EFFECTIFS'!AG54>0,'CALCUL EFFECTIFS'!AG54,$A$6&\"\")","v":""},{"$f":"IF('CALCUL EFFECTIFS'!AH54>0,'CALCUL EFFECTIFS'!AH54,$A$6&\"\")","v":""},{"$f":"IF('CALCUL EFFECTIFS'!AI54>0,'CALCUL EFFECTIFS'!AI54,$A$6&\"\")","v":""},{"$f":"IF('CALCUL EFFECTIFS'!AJ54>0,'CALCUL EFFECTIFS'!AJ54,$A$6&\"\")","v":""},{"$f":"IF('CALCUL EFFECTIFS'!AK54>0,'CALCUL EFFECTIFS'!AK54,$A$6&\"\")","v":1}]
[{"$f":"IF(B37>0,'CALCUL EFFECTIFS'!B65&\"\",$A$6&\"\")","v":"BROCOLIS"},1,null,{"$f":"IF('CALCUL EFFECTIFS'!D65>0,'CALCUL EFFECTIFS'!D65,$A$6&\"\")","v":1},null,{"$f":"IF('CALCUL EFFECTIFS'!F65>0,'CALCUL EFFECTIFS'!F65,$A$6&\"\")","v":""},{"$f":"IF('CALCUL EFFECTIFS'!G65>0,'CALCUL EFFECTIFS'!G65,$A$6&\"\")","v":""},{"$f":"IF('CALCUL EFFECTIFS'!H65>0,'CALCUL EFFECTIFS'!H65,$A$6&\"\")","v":""},null,null,null,null,null,null,null,null,null,{"$f":"IF('CALCUL EFFECTIFS'!R65>0,'CALCUL EFFECTIFS'!R65,$A$6&\"\")","v":""},{"$f":"IF('CALCUL EFFECTIFS'!S65>0,'CALCUL EFFECTIFS'!S65,$A$6&\"\")","v":""},{"$f":"IF('CALCUL EFFECTIFS'!T65>0,'CALCUL EFFECTIFS'!T65,$A$6&\"\")","v":""},{"$f":"IF('CALCUL EFFECTIFS'!U65>0,'CALCUL EFFECTIFS'!U65,$A$6&\"\")","v":""},{"$f":"IF('CALCUL EFFECTIFS'!V65>0,'CALCUL EFFECTIFS'!V65,$A$6&\"\")","v":""},{"$f":"IF('CALCUL EFFECTIFS'!W65>0,'CALCUL EFFECTIFS'!W65,$A$6&\"\")","v":""},{"$f":"IF('CALCUL EFFECTIFS'!X65>0,'CALCUL EFFECTIFS'!X65,$A$6&\"\")","v":""},{"$f":"IF('CALCUL EFFECTIFS'!Y65>0,'CALCUL EFFECTIFS'!Y65,$A$6&\"\")","v":""},{"$f":"IF('CALCUL EFFECTIFS'!Z65>0,'CALCUL EFFECTIFS'!Z65,$A$6&\"\")","v":""},{"$f":"IF('CALCUL EFFECTIFS'!AA65>0,'CALCUL EFFECTIFS'!AA65,$A$6&\"\")","v":""},{"$f":"IF('CALCUL EFFECTIFS'!AB65>0,'CALCUL EFFECTIFS'!AB65,$A$6&\"\")","v":""},{"$f":"IF('CALCUL EFFECTIFS'!AC65>0,'CALCUL EFFECTIFS'!AC65,$A$6&\"\")","v":""},{"$f":"IF('CALCUL EFFECTIFS'!AD65>0,'CALCUL EFFECTIFS'!AD65,$A$6&\"\")","v":""},{"$f":"IF('CALCUL EFFECTIFS'!AE65>0,'CALCUL EFFECTIFS'!AE65,$A$6&\"\")","v":""},{"$f":"IF('CALCUL EFFECTIFS'!AF65>0,'CALCUL EFFECTIFS'!AF65,$A$6&\"\")","v":""},{"$f":"IF('CALCUL EFFECTIFS'!AG65>0,'CALCUL EFFECTIFS'!AG65,$A$6&\"\")","v":""},{"$f":"IF('CALCUL EFFECTIFS'!AH65>0,'CALCUL EFFECTIFS'!AH65,$A$6&\"\")","v":""},{"$f":"IF('CALCUL EFFECTIFS'!AI65>0,'CALCUL EFFECTIFS'!AI65,$A$6&\"\")","v":""},{"$f":"IF('CALCUL EFFECTIFS'!AJ65>0,'CALCUL EFFECTIFS'!AJ65,$A$6&\"\")","v":""},{"$f":"IF('CALCUL EFFECTIFS'!AK65>0,'CALCUL EFFECTIFS'!AK65,$A$6&\"\")","v":""}]
[{"$f":"IF(B38>0,'CALCUL EFFECTIFS'!B76&\"\",$A$6&\"\")","v":"YAOURT"},1,null,{"$f":"IF('CALCUL EFFECTIFS'!D76>0,'CALCUL EFFECTIFS'!D76,$A$6&\"\")","v":1},null,{"$f":"IF('CALCUL EFFECTIFS'!F76>0,'CALCUL EFFECTIFS'!F76,$A$6&\"\")","v":""},{"$f":"IF('CALCUL EFFECTIFS'!G76>0,'CALCUL EFFECTIFS'!G76,$A$6&\"\")","v":""},{"$f":"IF('CALCUL EFFECTIFS'!H76>0,'CALCUL EFFECTIFS'!H76,$A$6&\"\")","v":""},null,null,null,null,null,null,null,null,null,{"$f":"IF('CALCUL EFFECTIFS'!R76>0,'CALCUL EFFECTIFS'!R76,$A$6&\"\")","v":""},{"$f":"IF('CALCUL EFFECTIFS'!S76>0,'CALCUL EFFECTIFS'!S76,$A$6&\"\")","v":""},{"$f":"IF('CALCUL EFFECTIFS'!T76>0,'CALCUL EFFECTIFS'!T76,$A$6&\"\")","v":""},{"$f":"IF('CALCUL EFFECTIFS'!U76>0,'CALCUL EFFECTIFS'!U76,$A$6&\"\")","v":""},{"$f":"IF('CALCUL EFFECTIFS'!V76>0,'CALCUL EFFECTIFS'!V76,$A$6&\"\")","v":""},{"$f":"IF('CALCUL EFFECTIFS'!W76>0,'CALCUL EFFECTIFS'!W76,$A$6&\"\")","v":""},{"$f":"IF('CALCUL EFFECTIFS'!X76>0,'CALCUL EFFECTIFS'!X76,$A$6&\"\")","v":""},{"$f":"IF('CALCUL EFFECTIFS'!Y76>0,'CALCUL EFFECTIFS'!Y76,$A$6&\"\")","v":""},{"$f":"IF('CALCUL EFFECTIFS'!Z76>0,'CALCUL EFFECTIFS'!Z76,$A$6&\"\")","v":""},{"$f":"IF('CALCUL EFFECTIFS'!AA76>0,'CALCUL EFFECTIFS'!AA76,$A$6&\"\")","v":""},{"$f":"IF('CALCUL EFFECTIFS'!AB76>0,'CALCUL EFFECTIFS'!AB76,$A$6&\"\")","v":""},{"$f":"IF('CALCUL EFFECTIFS'!AC76>0,'CALCUL EFFECTIFS'!AC76,$A$6&\"\")","v":""},{"$f":"IF('CALCUL EFFECTIFS'!AD76>0,'CALCUL EFFECTIFS'!AD76,$A$6&\"\")","v":""},{"$f":"IF('CALCUL EFFECTIFS'!AE76>0,'CALCUL EFFECTIFS'!AE76,$A$6&\"\")","v":""},{"$f":"IF('CALCUL EFFECTIFS'!AF76>0,'CALCUL EFFECTIFS'!AF76,$A$6&\"\")","v":""},{"$f":"IF('CALCUL EFFECTIFS'!AG76>0,'CALCUL EFFECTIFS'!AG76,$A$6&\"\")","v":""},{"$f":"IF('CALCUL EFFECTIFS'!AH76>0,'CALCUL EFFECTIFS'!AH76,$A$6&\"\")","v":""},{"$f":"IF('CALCUL EFFECTIFS'!AI76>0,'CALCUL EFFECTIFS'!AI76,$A$6&\"\")","v":""},{"$f":"IF('CALCUL EFFECTIFS'!AJ76>0,'CALCUL EFFECTIFS'!AJ76,$A$6&\"\")","v":""},{"$f":"IF('CALCUL EFFECTIFS'!AK76>0,'CALCUL EFFECTIFS'!AK76,$A$6&\"\")","v":""}]
[{"$f":"IF(B39>0,'CALCUL EFFECTIFS'!B87&\"\",$A$6&\"\")","v":"KIWI"},14,null,{"$f":"IF('CALCUL EFFECTIFS'!D87>0,'CALCUL EFFECTIFS'!D87,$A$6&\"\")","v":1},null,{"$f":"IF('CALCUL EFFECTIFS'!F87>0,'CALCUL EFFECTIFS'!F87,$A$6&\"\")","v":""},{"$f":"IF('CALCUL EFFECTIFS'!G87>0,'CALCUL EFFECTIFS'!G87,$A$6&\"\")","v":2},{"$f":"IF('CALCUL EFFECTIFS'!H87>0,'CALCUL EFFECTIFS'!H87,$A$6&\"\")","v":2},null,null,null,null,null,null,null,null,null,{"$f":"IF('CALCUL EFFECTIFS'!R87>0,'CALCUL EFFECTIFS'!R87,$A$6&\"\")","v":2},{"$f":"IF('CALCUL EFFECTIFS'!S87>0,'CALCUL EFFECTIFS'!S87,$A$6&\"\")","v":1},{"$f":"IF('CALCUL EFFECTIFS'!T87>0,'CALCUL EFFECTIFS'!T87,$A$6&\"\")","v":2},{"$f":"IF('CALCUL EFFECTIFS'!U87>0,'CALCUL EFFECTIFS'!U87,$A$6&\"\")","v":2},{"$f":"IF('CALCUL EFFECTIFS'!V87>0,'CALCUL EFFECTIFS'!V87,$A$6&\"\")","v":""},{"$f":"IF('CALCUL EFFECTIFS'!W87>0,'CALCUL EFFECTIFS'!W87,$A$6&\"\")","v":""},{"$f":"IF('CALCUL EFFECTIFS'!X87>0,'CALCUL EFFECTIFS'!X87,$A$6&\"\")","v":""},{"$f":"IF('CALCUL EFFECTIFS'!Y87>0,'CALCUL EFFECTIFS'!Y87,$A$6&\"\")","v":1},{"$f":"IF('CALCUL EFFECTIFS'!Z87>0,'CALCUL EFFECTIFS'!Z87,$A$6&\"\")","v":""},{"$f":"IF('CALCUL EFFECTIFS'!AA87>0,'CALCUL EFFECTIFS'!AA87,$A$6&\"\")","v":""},{"$f":"IF('CALCUL EFFECTIFS'!AB87>0,'CALCUL EFFECTIFS'!AB87,$A$6&\"\")","v":""},{"$f":"IF('CALCUL EFFECTIFS'!AC87>0,'CALCUL EFFECTIFS'!AC87,$A$6&\"\")","v":""},{"$f":"IF('CALCUL EFFECTIFS'!AD87>0,'CALCUL EFFECTIFS'!AD87,$A$6&\"\")","v":""},{"$f":"IF('CALCUL EFFECTIFS'!AE87>0,'CALCUL EFFECTIFS'!AE87,$A$6&\"\")","v":""},{"$f":"IF('CALCUL EFFECTIFS'!AF87>0,'CALCUL EFFECTIFS'!AF87,$A$6&\"\")","v":""},{"$f":"IF('CALCUL EFFECTIFS'!AG87>0,'CALCUL EFFECTIFS'!AG87,$A$6&\"\")","v":""},{"$f":"IF('CALCUL EFFECTIFS'!AH87>0,'CALCUL EFFECTIFS'!AH87,$A$6&\"\")","v":""},{"$f":"IF('CALCUL EFFECTIFS'!AI87>0,'CALCUL EFFECTIFS'!AI87,$A$6&\"\")","v":""},{"$f":"IF('CALCUL EFFECTIFS'!AJ87>0,'CALCUL EFFECTIFS'!AJ87,$A$6&\"\")","v":""},{"$f":"IF('CALCUL EFFECTIFS'!AK87>0,'CALCUL EFFECTIFS'!AK87,$A$6&\"\")","v":1}]
[{"$f":"IF(B40>0,'CALCUL EFFECTIFS'!B29&\"\",$A$6&\"\")","v":""},0,null,null,null,{"$f":"IF(MENUS!$B$9=\"POTAGE\",$A$6&\"\",'CALCUL EFFECTIFS'!F30)","v":""},{"$f":"IF(MENUS!$B$9=\"POTAGE\",$A$6&\"\",'CALCUL EFFECTIFS'!G30)","v":""},{"$f":"IF(MENUS!$B$9=\"POTAGE\",$A$6&\"\",'CALCUL EFFECTIFS'!H30)","v":""},{"$f":"IF(MENUS!$B$9=\"POTAGE\",$A$6&\"\",'CALCUL EFFECTIFS'!I30)","v":""},{"$f":"IF(MENUS!$B$9=\"POTAGE\",$A$6&\"\",'CALCUL EFFECTIFS'!J30)","v":""},{"$f":"IF(MENUS!$B$9=\"POTAGE\",$A$6&\"\",'CALCUL EFFECTIFS'!K30)","v":""},{"$f":"IF(MENUS!$B$9=\"POTAGE\",$A$6&\"\",'CALCUL EFFECTIFS'!L30)","v":""},{"$f":"IF(MENUS!$B$9=\"POTAGE\",$A$6&\"\",'CALCUL EFFECTIFS'!M30)","v":""},{"$f":"IF(MENUS!$B$9=\"POTAGE\",$A$6&\"\",'CALCUL EFFECTIFS'!N30)","v":""},{"$f":"IF(MENUS!$B$9=\"POTAGE\",$A$6&\"\",'CALCUL EFFECTIFS'!O30)","v":""},{"$f":"IF(MENUS!$B$9=\"POTAGE\",$A$6&\"\",'CALCUL EFFECTIFS'!P30)","v":""},{"$f":"IF(MENUS!$B$9=\"POTAGE\",$A$6&\"\",'CALCUL EFFECTIFS'!Q30)","v":""},{"$f":"IF(MENUS!$B$9=\"POTAGE\",$A$6&\"\",'CALCUL EFFECTIFS'!R30)","v":""},{"$f":"IF(MENUS!$B$9=\"POTAGE\",$A$6&\"\",'CALCUL EFFECTIFS'!S30)","v":""},{"$f":"IF(MENUS!$B$9=\"POTAGE\",$A$6&\"\",'CALCUL EFFECTIFS'!T30)","v":""},{"$f":"IF(MENUS!$B$9=\"POTAGE\",$A$6&\"\",'CALCUL EFFECTIFS'!U30)","v":""},{"$f":"IF(MENUS!$B$9=\"POTAGE\",$A$6&\"\",'CALCUL EFFECTIFS'!V30)","v":""},{"$f":"IF(MENUS!$B$9=\"POTAGE\",$A$6&\"\",'CALCUL EFFECTIFS'!W30)","v":""},{"$f":"IF(MENUS!$B$9=\"POTAGE\",$A$6&\"\",'CALCUL EFFECTIFS'!X30)","v":""},{"$f":"IF(MENUS!$B$9=\"POTAGE\",$A$6&\"\",'CALCUL EFFECTIFS'!Y30)","v":""},{"$f":"IF(MENUS!$B$9=\"POTAGE\",$A$6&\"\",'CALCUL EFFECTIFS'!Z30)","v":""},{"$f":"IF(MENUS!$B$9=\"POTAGE\",$A$6&\"\",'CALCUL EFFECTIFS'!AA30)","v":""},{"$f":"IF(MENUS!$B$9=\"POTAGE\",$A$6&\"\",'CALCUL EFFECTIFS'!AB30)","v":""},{"$f":"IF(MENUS!$B$9=\"POTAGE\",$A$6&\"\",'CALCUL EFFECTIFS'!AC30)","v":""},{"$f":"IF(MENUS!$B$9=\"POTAGE\",$A$6&\"\",'CALCUL EFFECTIFS'!AD30)","v":""},{"$f":"IF(MENUS!$B$9=\"POTAGE\",$A$6&\"\",'CALCUL EFFECTIFS'!AE30)","v":""},{"$f":"IF(MENUS!$B$9=\"POTAGE\",$A$6&\"\",'CALCUL EFFECTIFS'!AF30)","v":""},{"$f":"IF(MENUS!$B$9=\"POTAGE\",$A$6&\"\",'CALCUL EFFECTIFS'!AG30)","v":""},{"$f":"IF(MENUS!$B$9=\"POTAGE\",$A$6&\"\",'CALCUL EFFECTIFS'!AH30)","v":""},{"$f":"IF(MENUS!$B$9=\"POTAGE\",$A$6&\"\",'CALCUL EFFECTIFS'!AI30)","v":""},{"$f":"IF(MENUS!$B$9=\"POTAGE\",$A$6&\"\",'CALCUL EFFECTIFS'!AJ30)","v":""},{"$f":"IF(MENUS!$B$9=\"POTAGE\",$A$6&\"\",'CALCUL EFFECTIFS'!AK30)","v":""}]
[{"$f":"IF(B41>0,'CALCUL EFFECTIFS'!B55&\"\",$A$6&\"\")","v":"ESCALOPE DE DINDE"},1,null,null,null,{"$f":"IF('CALCUL EFFECTIFS'!F55>0,'CALCUL EFFECTIFS'!F55,$A$6&\"\")","v":""},{"$f":"IF('CALCUL EFFECTIFS'!G55>0,'CALCUL EFFECTIFS'!G55,$A$6&\"\")","v":1},{"$f":"IF('CALCUL EFFECTIFS'!H55>0,'CALCUL EFFECTIFS'!H55,$A$6&\"\")","v":""},null,null,null,null,null,null,null,null,null,{"$f":"IF('CALCUL EFFECTIFS'!R55>0,'CALCUL EFFECTIFS'!R55,$A$6&\"\")","v":""},{"$f":"IF('CALCUL EFFECTIFS'!S55>0,'CALCUL EFFECTIFS'!S55,$A$6&\"\")","v":""},{"$f":"IF('CALCUL EFFECTIFS'!T55>0,'CALCUL EFFECTIFS'!T55,$A$6&\"\")","v":""},{"$f":"IF('CALCUL EFFECTIFS'!U55>0,'CALCUL EFFECTIFS'!U55,$A$6&\"\")","v":""},{"$f":"IF('CALCUL EFFECTIFS'!V55>0,'CALCUL EFFECTIFS'!V55,$A$6&\"\")","v":""},{"$f":"IF('CALCUL EFFECTIFS'!W55>0,'CALCUL EFFECTIFS'!W55,$A$6&\"\")","v":""},{"$f":"IF('CALCUL EFFECTIFS'!X55>0,'CALCUL EFFECTIFS'!X55,$A$6&\"\")","v":""},{"$f":"IF('CALCUL EFFECTIFS'!Y55>0,'CALCUL EFFECTIFS'!Y55,$A$6&\"\")","v":""},{"$f":"IF('CALCUL EFFECTIFS'!Z55>0,'CALCUL EFFECTIFS'!Z55,$A$6&\"\")","v":""},{"$f":"IF('CALCUL EFFECTIFS'!AA55>0,'CALCUL EFFECTIFS'!AA55,$A$6&\"\")","v":""},{"$f":"IF('CALCUL EFFECTIFS'!AB55>0,'CALCUL EFFECTIFS'!AB55,$A$6&\"\")","v":""},{"$f":"IF('CALCUL EFFECTIFS'!AC55>0,'CALCUL EFFECTIFS'!AC55,$A$6&\"\")","v":""},{"$f":"IF('CALCUL EFFECTIFS'!AD55>0,'CALCUL EFFECTIFS'!AD55,$A$6&\"\")","v":""},{"$f":"IF('CALCUL EFFECTIFS'!AE55>0,'CALCUL EFFECTIFS'!AE55,$A$6&\"\")","v":""},{"$f":"IF('CALCUL EFFECTIFS'!AF55>0,'CALCUL EFFECTIFS'!AF55,$A$6&\"\")","v":""},{"$f":"IF('CALCUL EFFECTIFS'!AG55>0,'CALCUL EFFECTIFS'!AG55,$A$6&\"\")","v":""},{"$f":"IF('CALCUL EFFECTIFS'!AH55>0,'CALCUL EFFECTIFS'!AH55,$A$6&\"\")","v":""},{"$f":"IF('CALCUL EFFECTIFS'!AI55>0,'CALCUL EFFECTIFS'!AI55,$A$6&\"\")","v":""},{"$f":"IF('CALCUL EFFECTIFS'!AJ55>0,'CALCUL EFFECTIFS'!AJ55,$A$6&\"\")","v":""},{"$f":"IF('CALCUL EFFECTIFS'!AK55>0,'CALCUL EFFECTIFS'!AK55,$A$6&\"\")","v":""}]
[{"$f":"IF(B42>0,'CALCUL EFFECTIFS'!B66&\"\",$A$6&\"\")","v":""},0,null,null,null,{"$f":"IF('CALCUL EFFECTIFS'!F66>0,'CALCUL EFFECTIFS'!F66,$A$6&\"\")","v":""},{"$f":"IF('CALCUL EFFECTIFS'!G66>0,'CALCUL EFFECTIFS'!G66,$A$6&\"\")","v":""},{"$f":"IF('CALCUL EFFECTIFS'!H66>0,'CALCUL EFFECTIFS'!H66,$A$6&\"\")","v":""},null,null,null,null,null,null,null,null,null,{"$f":"IF('CALCUL EFFECTIFS'!R66>0,'CALCUL EFFECTIFS'!R66,$A$6&\"\")","v":""},{"$f":"IF('CALCUL EFFECTIFS'!S66>0,'CALCUL EFFECTIFS'!S66,$A$6&\"\")","v":""},{"$f":"IF('CALCUL EFFECTIFS'!T66>0,'CALCUL EFFECTIFS'!T66,$A$6&\"\")","v":""},{"$f":"IF('CALCUL EFFECTIFS'!U66>0,'CALCUL EFFECTIFS'!U66,$A$6&\"\")","v":""},{"$f":"IF('CALCUL EFFECTIFS'!V66>0,'CALCUL EFFECTIFS'!V66,$A$6&\"\")","v":""},{"$f":"IF('CALCUL EFFECTIFS'!W66>0,'CALCUL EFFECTIFS'!W66,$A$6&\"\")","v":""},{"$f":"IF('CALCUL EFFECTIFS'!X66>0,'CALCUL EFFECTIFS'!X66,$A$6&\"\")","v":""},{"$f":"IF('CALCUL EFFECTIFS'!Y66>0,'CALCUL EFFECTIFS'!Y66,$A$6&\"\")","v":""},{"$f":"IF('CALCUL EFFECTIFS'!Z66>0,'CALCUL EFFECTIFS'!Z66,$A$6&\"\")","v":""},{"$f":"IF('CALCUL EFFECTIFS'!AA66>0,'CALCUL EFFECTIFS'!AA66,$A$6&\"\")","v":""},{"$f":"IF('CALCUL EFFECTIFS'!AB66>0,'CALCUL EFFECTIFS'!AB66,$A$6&\"\")","v":""},{"$f":"IF('CALCUL EFFECTIFS'!AC66>0,'CALCUL EFFECTIFS'!AC66,$A$6&\"\")","v":""},{"$f":"IF('CALCUL EFFECTIFS'!AD66>0,'CALCUL EFFECTIFS'!AD66,$A$6&\"\")","v":""},{"$f":"IF('CALCUL EFFECTIFS'!AE66>0,'CALCUL EFFECTIFS'!AE66,$A$6&\"\")","v":""},{"$f":"IF('CALCUL EFFECTIFS'!AF66>0,'CALCUL EFFECTIFS'!AF66,$A$6&\"\")","v":""},{"$f":"IF('CALCUL EFFECTIFS'!AG66>0,'CALCUL EFFECTIFS'!AG66,$A$6&\"\")","v":""},{"$f":"IF('CALCUL EFFECTIFS'!AH66>0,'CALCUL EFFECTIFS'!AH66,$A$6&\"\")","v":""},{"$f":"IF('CALCUL EFFECTIFS'!AI66>0,'CALCUL EFFECTIFS'!AI66,$A$6&\"\")","v":""},{"$f":"IF('CALCUL EFFECTIFS'!AJ66>0,'CALCUL EFFECTIFS'!AJ66,$A$6&\"\")","v":""},{"$f":"IF('CALCUL EFFECTIFS'!AK66>0,'CALCUL EFFECTIFS'!AK66,$A$6&\"\")","v":""}]
[{"$f":"IF(B43>0,'CALCUL EFFECTIFS'!B31&\"\",$A$6&\"\")","v":""},0,null,null,null,{"$f":"IF('CALCUL EFFECTIFS'!F31>0,'CALCUL EFFECTIFS'!F31,$A$6&\"\")","v":""},{"$f":"IF('CALCUL EFFECTIFS'!G31>0,'CALCUL EFFECTIFS'!G31,$A$6&\"\")","v":""},{"$f":"IF('CALCUL EFFECTIFS'!H31>0,'CALCUL EFFECTIFS'!H31,$A$6&\"\")","v":""},{"$f":"IF('CALCUL EFFECTIFS'!I31>0,'CALCUL EFFECTIFS'!I31,$A$6&\"\")","v":""},{"$f":"IF('CALCUL EFFECTIFS'!J31>0,'CALCUL EFFECTIFS'!J31,$A$6&\"\")","v":""},{"$f":"IF('CALCUL EFFECTIFS'!K31>0,'CALCUL EFFECTIFS'!K31,$A$6&\"\")","v":""},{"$f":"IF('CALCUL EFFECTIFS'!L31>0,'CALCUL EFFECTIFS'!L31,$A$6&\"\")","v":""},{"$f":"IF('CALCUL EFFECTIFS'!M31>0,'CALCUL EFFECTIFS'!M31,$A$6&\"\")","v":""},{"$f":"IF('CALCUL EFFECTIFS'!N31>0,'CALCUL EFFECTIFS'!N31,$A$6&\"\")","v":""},{"$f":"IF('CALCUL EFFECTIFS'!O31>0,'CALCUL EFFECTIFS'!O31,$A$6&\"\")","v":""},{"$f":"IF('CALCUL EFFECTIFS'!P31>0,'CALCUL EFFECTIFS'!P31,$A$6&\"\")","v":""},{"$f":"IF('CALCUL EFFECTIFS'!Q31>0,'CALCUL EFFECTIFS'!Q31,$A$6&\"\")","v":""},{"$f":"IF('CALCUL EFFECTIFS'!R31>0,'CALCUL EFFECTIFS'!R31,$A$6&\"\")","v":""},{"$f":"IF('CALCUL EFFECTIFS'!S31>0,'CALCUL EFFECTIFS'!S31,$A$6&\"\")","v":""},{"$f":"IF('CALCUL EFFECTIFS'!T31>0,'CALCUL EFFECTIFS'!T31,$A$6&\"\")","v":""},{"$f":"IF('CALCUL EFFECTIFS'!U31>0,'CALCUL EFFECTIFS'!U31,$A$6&\"\")","v":""},{"$f":"IF('CALCUL EFFECTIFS'!V31>0,'CALCUL EFFECTIFS'!V31,$A$6&\"\")","v":""},{"$f":"IF('CALCUL EFFECTIFS'!W31>0,'CALCUL EFFECTIFS'!W31,$A$6&\"\")","v":""},{"$f":"IF('CALCUL EFFECTIFS'!X31>0,'CALCUL EFFECTIFS'!X31,$A$6&\"\")","v":""},{"$f":"IF('CALCUL EFFECTIFS'!Y31>0,'CALCUL EFFECTIFS'!Y31,$A$6&\"\")","v":""},{"$f":"IF('CALCUL EFFECTIFS'!Z31>0,'CALCUL EFFECTIFS'!Z31,$A$6&\"\")","v":""},{"$f":"IF('CALCUL EFFECTIFS'!AA31>0,'CALCUL EFFECTIFS'!AA31,$A$6&\"\")","v":""},{"$f":"IF('CALCUL EFFECTIFS'!AB31>0,'CALCUL EFFECTIFS'!AB31,$A$6&\"\")","v":""},{"$f":"IF('CALCUL EFFECTIFS'!AC31>0,'CALCUL EFFECTIFS'!AC31,$A$6&\"\")","v":""},{"$f":"IF('CALCUL EFFECTIFS'!AD31>0,'CALCUL EFFECTIFS'!AD31,$A$6&\"\")","v":""},{"$f":"IF('CALCUL EFFECTIFS'!AE31>0,'CALCUL EFFECTIFS'!AE31,$A$6&\"\")","v":""},{"$f":"IF('CALCUL EFFECTIFS'!AF31>0,'CALCUL EFFECTIFS'!AF31,$A$6&\"\")","v":""},{"$f":"IF('CALCUL EFFECTIFS'!AG31>0,'CALCUL EFFECTIFS'!AG31,$A$6&\"\")","v":""},{"$f":"IF('CALCUL EFFECTIFS'!AH31>0,'CALCUL EFFECTIFS'!AH31,$A$6&\"\")","v":""},{"$f":"IF('CALCUL EFFECTIFS'!AI31>0,'CALCUL EFFECTIFS'!AI31,$A$6&\"\")","v":""},{"$f":"IF('CALCUL EFFECTIFS'!AJ31>0,'CALCUL EFFECTIFS'!AJ31,$A$6&\"\")","v":""},{"$f":"IF('CALCUL EFFECTIFS'!AK31>0,'CALCUL EFFECTIFS'!AK31,$A$6&\"\")","v":""}]
[{"$f":"IF(B44>0,'CALCUL EFFECTIFS'!B56&\"\",$A$6&\"\")","v":""},0,null,null,null,{"$f":"IF('CALCUL EFFECTIFS'!F56>0,'CALCUL EFFECTIFS'!F56,$A$6&\"\")","v":""},{"$f":"IF('CALCUL EFFECTIFS'!G56>0,'CALCUL EFFECTIFS'!G56,$A$6&\"\")","v":""},{"$f":"IF('CALCUL EFFECTIFS'!H56>0,'CALCUL EFFECTIFS'!H56,$A$6&\"\")","v":""},{"$f":"IF('CALCUL EFFECTIFS'!I56>0,'CALCUL EFFECTIFS'!I56,$A$6&\"\")","v":""},{"$f":"IF('CALCUL EFFECTIFS'!J56>0,'CALCUL EFFECTIFS'!J56,$A$6&\"\")","v":""},{"$f":"IF('CALCUL EFFECTIFS'!K56>0,'CALCUL EFFECTIFS'!K56,$A$6&\"\")","v":""},{"$f":"IF('CALCUL EFFECTIFS'!L56>0,'CALCUL EFFECTIFS'!L56,$A$6&\"\")","v":""},{"$f":"IF('CALCUL EFFECTIFS'!M56>0,'CALCUL EFFECTIFS'!M56,$A$6&\"\")","v":""},{"$f":"IF('CALCUL EFFECTIFS'!N56>0,'CALCUL EFFECTIFS'!N56,$A$6&\"\")","v":""},{"$f":"IF('CALCUL EFFECTIFS'!O56>0,'CALCUL EFFECTIFS'!O56,$A$6&\"\")","v":""},{"$f":"IF('CALCUL EFFECTIFS'!P56>0,'CALCUL EFFECTIFS'!P56,$A$6&\"\")","v":""},{"$f":"IF('CALCUL EFFECTIFS'!Q56>0,'CALCUL EFFECTIFS'!Q56,$A$6&\"\")","v":""},{"$f":"IF('CALCUL EFFECTIFS'!R56>0,'CALCUL EFFECTIFS'!R56,$A$6&\"\")","v":""},{"$f":"IF('CALCUL EFFECTIFS'!S56>0,'CALCUL EFFECTIFS'!S56,$A$6&\"\")","v":""},{"$f":"IF('CALCUL EFFECTIFS'!T56>0,'CALCUL EFFECTIFS'!T56,$A$6&\"\")","v":""},{"$f":"IF('CALCUL EFFECTIFS'!U56>0,'CALCUL EFFECTIFS'!U56,$A$6&\"\")","v":""},{"$f":"IF('CALCUL EFFECTIFS'!V56>0,'CALCUL EFFECTIFS'!V56,$A$6&\"\")","v":""},{"$f":"IF('CALCUL EFFECTIFS'!W56>0,'CALCUL EFFECTIFS'!W56,$A$6&\"\")","v":""},{"$f":"IF('CALCUL EFFECTIFS'!X56>0,'CALCUL EFFECTIFS'!X56,$A$6&\"\")","v":""},{"$f":"IF('CALCUL EFFECTIFS'!Y56>0,'CALCUL EFFECTIFS'!Y56,$A$6&\"\")","v":""},{"$f":"IF('CALCUL EFFECTIFS'!Z56>0,'CALCUL EFFECTIFS'!Z56,$A$6&\"\")","v":""},{"$f":"IF('CALCUL EFFECTIFS'!AA56>0,'CALCUL EFFECTIFS'!AA56,$A$6&\"\")","v":""},{"$f":"IF('CALCUL EFFECTIFS'!AB56>0,'CALCUL EFFECTIFS'!AB56,$A$6&\"\")","v":""},{"$f":"IF('CALCUL EFFECTIFS'!AC56>0,'CALCUL EFFECTIFS'!AC56,$A$6&\"\")","v":""},{"$f":"IF('CALCUL EFFECTIFS'!AD56>0,'CALCUL EFFECTIFS'!AD56,$A$6&\"\")","v":""},{"$f":"IF('CALCUL EFFECTIFS'!AE56>0,'CALCUL EFFECTIFS'!AE56,$A$6&\"\")","v":""},{"$f":"IF('CALCUL EFFECTIFS'!AF56>0,'CALCUL EFFECTIFS'!AF56,$A$6&\"\")","v":""},{"$f":"IF('CALCUL EFFECTIFS'!AG56>0,'CALCUL EFFECTIFS'!AG56,$A$6&\"\")","v":""},{"$f":"IF('CALCUL EFFECTIFS'!AH56>0,'CALCUL EFFECTIFS'!AH56,$A$6&\"\")","v":""},{"$f":"IF('CALCUL EFFECTIFS'!AI56>0,'CALCUL EFFECTIFS'!AI56,$A$6&\"\")","v":""},{"$f":"IF('CALCUL EFFECTIFS'!AJ56>0,'CALCUL EFFECTIFS'!AJ56,$A$6&\"\")","v":""},{"$f":"IF('CALCUL EFFECTIFS'!AK56>0,'CALCUL EFFECTIFS'!AK56,$A$6&\"\")","v":""}]
[{"$f":"IF(B45>0,'CALCUL EFFECTIFS'!B67&\"\",$A$6&\"\")","v":""},0,null,null,null,{"$f":"IF('CALCUL EFFECTIFS'!F67>0,'CALCUL EFFECTIFS'!F67,$A$6&\"\")","v":""},{"$f":"IF('CALCUL EFFECTIFS'!G67>0,'CALCUL EFFECTIFS'!G67,$A$6&\"\")","v":""},{"$f":"IF('CALCUL EFFECTIFS'!H67>0,'CALCUL EFFECTIFS'!H67,$A$6&\"\")","v":""},{"$f":"IF('CALCUL EFFECTIFS'!I67>0,'CALCUL EFFECTIFS'!I67,$A$6&\"\")","v":""},{"$f":"IF('CALCUL EFFECTIFS'!J67>0,'CALCUL EFFECTIFS'!J67,$A$6&\"\")","v":""},{"$f":"IF('CALCUL EFFECTIFS'!K67>0,'CALCUL EFFECTIFS'!K67,$A$6&\"\")","v":""},{"$f":"IF('CALCUL EFFECTIFS'!L67>0,'CALCUL EFFECTIFS'!L67,$A$6&\"\")","v":""},{"$f":"IF('CALCUL EFFECTIFS'!M67>0,'CALCUL EFFECTIFS'!M67,$A$6&\"\")","v":""},{"$f":"IF('CALCUL EFFECTIFS'!N67>0,'CALCUL EFFECTIFS'!N67,$A$6&\"\")","v":""},{"$f":"IF('CALCUL EFFECTIFS'!O67>0,'CALCUL EFFECTIFS'!O67,$A$6&\"\")","v":""},{"$f":"IF('CALCUL EFFECTIFS'!P67>0,'CALCUL EFFECTIFS'!P67,$A$6&\"\")","v":""},{"$f":"IF('CALCUL EFFECTIFS'!Q67>0,'CALCUL EFFECTIFS'!Q67,$A$6&\"\")","v":""},{"$f":"IF('CALCUL EFFECTIFS'!R67>0,'CALCUL EFFECTIFS'!R67,$A$6&\"\")","v":""},{"$f":"IF('CALCUL EFFECTIFS'!S67>0,'CALCUL EFFECTIFS'!S67,$A$6&\"\")","v":""},{"$f":"IF('CALCUL EFFECTIFS'!T67>0,'CALCUL EFFECTIFS'!T67,$A$6&\"\")","v":""},{"$f":"IF('CALCUL EFFECTIFS'!U67>0,'CALCUL EFFECTIFS'!U67,$A$6&\"\")","v":""},{"$f":"IF('CALCUL EFFECTIFS'!V67>0,'CALCUL EFFECTIFS'!V67,$A$6&\"\")","v":""},{"$f":"IF('CALCUL EFFECTIFS'!W67>0,'CALCUL EFFECTIFS'!W67,$A$6&\"\")","v":""},{"$f":"IF('CALCUL EFFECTIFS'!X67>0,'CALCUL EFFECTIFS'!X67,$A$6&\"\")","v":""},{"$f":"IF('CALCUL EFFECTIFS'!Y67>0,'CALCUL EFFECTIFS'!Y67,$A$6&\"\")","v":""},{"$f":"IF('CALCUL EFFECTIFS'!Z67>0,'CALCUL EFFECTIFS'!Z67,$A$6&\"\")","v":""},{"$f":"IF('CALCUL EFFECTIFS'!AA67>0,'CALCUL EFFECTIFS'!AA67,$A$6&\"\")","v":""},{"$f":"IF('CALCUL EFFECTIFS'!AB67>0,'CALCUL EFFECTIFS'!AB67,$A$6&\"\")","v":""},{"$f":"IF('CALCUL EFFECTIFS'!AC67>0,'CALCUL EFFECTIFS'!AC67,$A$6&\"\")","v":""},{"$f":"IF('CALCUL EFFECTIFS'!AD67>0,'CALCUL EFFECTIFS'!AD67,$A$6&\"\")","v":""},{"$f":"IF('CALCUL EFFECTIFS'!AE67>0,'CALCUL EFFECTIFS'!AE67,$A$6&\"\")","v":""},{"$f":"IF('CALCUL EFFECTIFS'!AF67>0,'CALCUL EFFECTIFS'!AF67,$A$6&\"\")","v":""},{"$f":"IF('CALCUL EFFECTIFS'!AG67>0,'CALCUL EFFECTIFS'!AG67,$A$6&\"\")","v":""},{"$f":"IF('CALCUL EFFECTIFS'!AH67>0,'CALCUL EFFECTIFS'!AH67,$A$6&\"\")","v":""},{"$f":"IF('CALCUL EFFECTIFS'!AI67>0,'CALCUL EFFECTIFS'!AI67,$A$6&\"\")","v":""},{"$f":"IF('CALCUL EFFECTIFS'!AJ67>0,'CALCUL EFFECTIFS'!AJ67,$A$6&\"\")","v":""},{"$f":"IF('CALCUL EFFECTIFS'!AK67>0,'CALCUL EFFECTIFS'!AK67,$A$6&\"\")","v":""}]
[{"$f":"IF(B46>0,'CALCUL EFFECTIFS'!B78&\"\",$A$6&\"\")","v":""},0,null,null,null,{"$f":"IF('CALCUL EFFECTIFS'!F78>0,'CALCUL EFFECTIFS'!F78,$A$6&\"\")","v":""},{"$f":"IF('CALCUL EFFECTIFS'!G78>0,'CALCUL EFFECTIFS'!G78,$A$6&\"\")","v":""},{"$f":"IF('CALCUL EFFECTIFS'!H78>0,'CALCUL EFFECTIFS'!H78,$A$6&\"\")","v":""},{"$f":"IF('CALCUL EFFECTIFS'!I78>0,'CALCUL EFFECTIFS'!I78,$A$6&\"\")","v":""},{"$f":"IF('CALCUL EFFECTIFS'!J78>0,'CALCUL EFFECTIFS'!J78,$A$6&\"\")","v":""},{"$f":"IF('CALCUL EFFECTIFS'!K78>0,'CALCUL EFFECTIFS'!K78,$A$6&\"\")","v":""},{"$f":"IF('CALCUL EFFECTIFS'!L78>0,'CALCUL EFFECTIFS'!L78,$A$6&\"\")","v":""},{"$f":"IF('CALCUL EFFECTIFS'!M78>0,'CALCUL EFFECTIFS'!M78,$A$6&\"\")","v":""},{"$f":"IF('CALCUL EFFECTIFS'!N78>0,'CALCUL EFFECTIFS'!N78,$A$6&\"\")","v":""},{"$f":"IF('CALCUL EFFECTIFS'!O78>0,'CALCUL EFFECTIFS'!O78,$A$6&\"\")","v":""},{"$f":"IF('CALCUL EFFECTIFS'!P78>0,'CALCUL EFFECTIFS'!P78,$A$6&\"\")","v":""},{"$f":"IF('CALCUL EFFECTIFS'!Q78>0,'CALCUL EFFECTIFS'!Q78,$A$6&\"\")","v":""},{"$f":"IF('CALCUL EFFECTIFS'!R78>0,'CALCUL EFFECTIFS'!R78,$A$6&\"\")","v":""},{"$f":"IF('CALCUL EFFECTIFS'!S78>0,'CALCUL EFFECTIFS'!S78,$A$6&\"\")","v":""},{"$f":"IF('CALCUL EFFECTIFS'!T78>0,'CALCUL EFFECTIFS'!T78,$A$6&\"\")","v":""},{"$f":"IF('CALCUL EFFECTIFS'!U78>0,'CALCUL EFFECTIFS'!U78,$A$6&\"\")","v":""},{"$f":"IF('CALCUL EFFECTIFS'!V78>0,'CALCUL EFFECTIFS'!V78,$A$6&\"\")","v":""},{"$f":"IF('CALCUL EFFECTIFS'!W78>0,'CALCUL EFFECTIFS'!W78,$A$6&\"\")","v":""},{"$f":"IF('CALCUL EFFECTIFS'!X78>0,'CALCUL EFFECTIFS'!X78,$A$6&\"\")","v":""},{"$f":"IF('CALCUL EFFECTIFS'!Y78>0,'CALCUL EFFECTIFS'!Y78,$A$6&\"\")","v":""},{"$f":"IF('CALCUL EFFECTIFS'!Z78>0,'CALCUL EFFECTIFS'!Z78,$A$6&\"\")","v":""},{"$f":"IF('CALCUL EFFECTIFS'!AA78>0,'CALCUL EFFECTIFS'!AA78,$A$6&\"\")","v":""},{"$f":"IF('CALCUL EFFECTIFS'!AB78>0,'CALCUL EFFECTIFS'!AB78,$A$6&\"\")","v":""},{"$f":"IF('CALCUL EFFECTIFS'!AC78>0,'CALCUL EFFECTIFS'!AC78,$A$6&\"\")","v":""},{"$f":"IF('CALCUL EFFECTIFS'!AD78>0,'CALCUL EFFECTIFS'!AD78,$A$6&\"\")","v":""},{"$f":"IF('CALCUL EFFECTIFS'!AE78>0,'CALCUL EFFECTIFS'!AE78,$A$6&\"\")","v":""},{"$f":"IF('CALCUL EFFECTIFS'!AF78>0,'CALCUL EFFECTIFS'!AF78,$A$6&\"\")","v":""},{"$f":"IF('CALCUL EFFECTIFS'!AG78>0,'CALCUL EFFECTIFS'!AG78,$A$6&\"\")","v":""},{"$f":"IF('CALCUL EFFECTIFS'!AH78>0,'CALCUL EFFECTIFS'!AH78,$A$6&\"\")","v":""},{"$f":"IF('CALCUL EFFECTIFS'!AI78>0,'CALCUL EFFECTIFS'!AI78,$A$6&\"\")","v":""},{"$f":"IF('CALCUL EFFECTIFS'!AJ78>0,'CALCUL EFFECTIFS'!AJ78,$A$6&\"\")","v":""},{"$f":"IF('CALCUL EFFECTIFS'!AK78>0,'CALCUL EFFECTIFS'!AK78,$A$6&\"\")","v":""}]
[{"$f":"IF(B47>0,'CALCUL EFFECTIFS'!B89&\"\",$A$6&\"\")","v":""},0,null,null,null,{"$f":"IF('CALCUL EFFECTIFS'!F89>0,'CALCUL EFFECTIFS'!F89,$A$6&\"\")","v":""},{"$f":"IF('CALCUL EFFECTIFS'!G89>0,'CALCUL EFFECTIFS'!G89,$A$6&\"\")","v":""},{"$f":"IF('CALCUL EFFECTIFS'!H89>0,'CALCUL EFFECTIFS'!H89,$A$6&\"\")","v":""},{"$f":"IF('CALCUL EFFECTIFS'!I89>0,'CALCUL EFFECTIFS'!I89,$A$6&\"\")","v":""},{"$f":"IF('CALCUL EFFECTIFS'!J89>0,'CALCUL EFFECTIFS'!J89,$A$6&\"\")","v":""},{"$f":"IF('CALCUL EFFECTIFS'!K89>0,'CALCUL EFFECTIFS'!K89,$A$6&\"\")","v":""},{"$f":"IF('CALCUL EFFECTIFS'!L89>0,'CALCUL EFFECTIFS'!L89,$A$6&\"\")","v":""},{"$f":"IF('CALCUL EFFECTIFS'!M89>0,'CALCUL EFFECTIFS'!M89,$A$6&\"\")","v":""},{"$f":"IF('CALCUL EFFECTIFS'!N89>0,'CALCUL EFFECTIFS'!N89,$A$6&\"\")","v":""},{"$f":"IF('CALCUL EFFECTIFS'!O89>0,'CALCUL EFFECTIFS'!O89,$A$6&\"\")","v":""},{"$f":"IF('CALCUL EFFECTIFS'!P89>0,'CALCUL EFFECTIFS'!P89,$A$6&\"\")","v":""},{"$f":"IF('CALCUL EFFECTIFS'!Q89>0,'CALCUL EFFECTIFS'!Q89,$A$6&\"\")","v":""},{"$f":"IF('CALCUL EFFECTIFS'!R89>0,'CALCUL EFFECTIFS'!R89,$A$6&\"\")","v":""},{"$f":"IF('CALCUL EFFECTIFS'!S89>0,'CALCUL EFFECTIFS'!S89,$A$6&\"\")","v":""},{"$f":"IF('CALCUL EFFECTIFS'!T89>0,'CALCUL EFFECTIFS'!T89,$A$6&\"\")","v":""},{"$f":"IF('CALCUL EFFECTIFS'!U89>0,'CALCUL EFFECTIFS'!U89,$A$6&\"\")","v":""},{"$f":"IF('CALCUL EFFECTIFS'!V89>0,'CALCUL EFFECTIFS'!V89,$A$6&\"\")","v":""},{"$f":"IF('CALCUL EFFECTIFS'!W89>0,'CALCUL EFFECTIFS'!W89,$A$6&\"\")","v":""},{"$f":"IF('CALCUL EFFECTIFS'!X89>0,'CALCUL EFFECTIFS'!X89,$A$6&\"\")","v":""},{"$f":"IF('CALCUL EFFECTIFS'!Y89>0,'CALCUL EFFECTIFS'!Y89,$A$6&\"\")","v":""},{"$f":"IF('CALCUL EFFECTIFS'!Z89>0,'CALCUL EFFECTIFS'!Z89,$A$6&\"\")","v":""},{"$f":"IF('CALCUL EFFECTIFS'!AA89>0,'CALCUL EFFECTIFS'!AA89,$A$6&\"\")","v":""},{"$f":"IF('CALCUL EFFECTIFS'!AB89>0,'CALCUL EFFECTIFS'!AB89,$A$6&\"\")","v":""},{"$f":"IF('CALCUL EFFECTIFS'!AC89>0,'CALCUL EFFECTIFS'!AC89,$A$6&\"\")","v":""},{"$f":"IF('CALCUL EFFECTIFS'!AD89>0,'CALCUL EFFECTIFS'!AD89,$A$6&\"\")","v":""},{"$f":"IF('CALCUL EFFECTIFS'!AE89>0,'CALCUL EFFECTIFS'!AE89,$A$6&\"\")","v":""},{"$f":"IF('CALCUL EFFECTIFS'!AF89>0,'CALCUL EFFECTIFS'!AF89,$A$6&\"\")","v":""},{"$f":"IF('CALCUL EFFECTIFS'!AG89>0,'CALCUL EFFECTIFS'!AG89,$A$6&\"\")","v":""},{"$f":"IF('CALCUL EFFECTIFS'!AH89>0,'CALCUL EFFECTIFS'!AH89,$A$6&\"\")","v":""},{"$f":"IF('CALCUL EFFECTIFS'!AI89>0,'CALCUL EFFECTIFS'!AI89,$A$6&\"\")","v":""},{"$f":"IF('CALCUL EFFECTIFS'!AJ89>0,'CALCUL EFFECTIFS'!AJ89,$A$6&\"\")","v":""},{"$f":"IF('CALCUL EFFECTIFS'!AK89>0,'CALCUL EFFECTIFS'!AK89,$A$6&\"\")","v":""}]
[]
[]
[null,"TOTAL","ACHATS PRINCIPAUX",null,null,null,null,null,null,null,null,null,null,null,null,null,null,null,{"$f":"'QUANTITES TOTAL'!A11","v":""},null,null,null,null,null,null,null,{"$f":"'QUANTITES TOTAL'!H11","v":0},null,null,{"$f":"'QUANTITES TOTAL'!A17","v":""},null,null,null,null,null,null,{"$f":"'QUANTITES TOTAL'!H17","v":0}]
[{"$f":"'QUANTITES TOTAL'!A6","v":"MACEDOINE CŒUR PALMOIER"},{"$f":"'QUANTITES TOTAL'!H6","v":160},"25 KG MACEDOINE ",null,null,null,null,null,null,null,null,null,null,null,null,null,null,null,{"$f":"'QUANTITES TOTAL'!A12","v":"ESCALOPE DE DINDE"},null,null,null,null,null,null,null,{"$f":"'QUANTITES TOTAL'!H12","v":19},null,null,{"$f":"'QUANTITES TOTAL'!A18","v":""},null,null,null,null,null,null,{"$f":"'QUANTITES TOTAL'!H18","v":0}]
[{"$f":"'QUANTITES TOTAL'!A7","v":"SAUCISSE DE TOULOUSE"},{"$f":"'QUANTITES TOTAL'!H7","v":141},"160 U",null,null,null,null,null,null,null,null,null,null,null,null,null,null,null,{"$f":"'QUANTITES TOTAL'!A13","v":""},null,null,null,null,null,null,null,{"$f":"'QUANTITES TOTAL'!H13","v":0},null,null,{"$f":"'QUANTITES TOTAL'!A19","v":""},null,null,null,null,null,null,{"$f":"'QUANTITES TOTAL'!H19","v":0}]
[{"$f":"'QUANTITES TOTAL'!A8","v":"BROCOLIS"},{"$f":"'QUANTITES TOTAL'!H8","v":160},"40 KG",null,null,null,null,null,null,null,null,null,null,null,null,null,null,null,{"$f":"'QUANTITES TOTAL'!A14","v":""},null,null,null,null,null,null,null,{"$f":"'QUANTITES TOTAL'!H14","v":0},null,null,{"$f":"'QUANTITES TOTAL'!A20","v":""},null,null,null,null,null,null,{"$f":"'QUANTITES TOTAL'!H20","v":0}]
[{"$f":"'QUANTITES TOTAL'!A9","v":"YAOURT"},{"$f":"'QUANTITES TOTAL'!H9","v":127},"144 U",null,null,null,null,null,null,null,null,null,null,null,null,null,null,null,{"$f":"'QUANTITES TOTAL'!A15","v":"KIWI"},null,null,null,null,null,null,null,{"$f":"'QUANTITES TOTAL'!H15","v":19},null,null,{"$f":"'QUANTITES TOTAL'!A21","v":""},null,null,null,null,null,null,{"$f":"'QUANTITES TOTAL'!H21","v":0}]
[{"$f":"'QUANTITES TOTAL'!A10","v":"RIZ AU CARAMEL"},{"$f":"'QUANTITES TOTAL'!H10","v":141},"168 U",null,null,null,null,null,null,null,null,null,null,null,null,null,null,null,{"$f":"'QUANTITES TOTAL'!A16","v":""},null,null,null,null,null,null,null,{"$f":"'QUANTITES TOTAL'!H16","v":0},null,null,{"$f":"'QUANTITES TOTAL'!A22","v":""},null,null,null,null,null,null,{"$f":"'QUANTITES TOTAL'!H22","v":0}]
[null,null,null,null,null,null,null,null,null,null,null,null,null,null,null,null,null,null,null,null,null,null,null,null,null,null,null,null,null,{"$f":"'QUANTITES TOTAL'!A23","v":""},null,null,null,null,null,null,{"$f":"'QUANTITES TOTAL'!H23","v":0}]

{"sheet":"BL","index":4,"n_rows":29,"n_cols":105,"rows_kept":29,"cut":false,"hidden":false,"merged":[[0,73,0,74],[0,76,0,77],[0,79,0,80],[0,82,0,83],[0,85,0,86],[0,97,0,98],[0,100,0,101],[0,103,0,104],[2,103,2,104],[0,88,0,89],[0,91,0,92],[0,94,0,95],[0,67,0,68],[0,70,0,71],[0,43,0,44],[0,46,0,47],[0,49,0,50],[0,52,0,53],[0,55,0,56],[0,58,0,59],[0,61,0,62],[0,64,0,65],[0,40,0,41],[0,22,0,23],[0,25,0,26],[0,28,0,29],[0,31,0,32],[0,34,0,35],[0,1,0,2],[0,4,0,5],[2,1,2,2],[2,4,2,5],[0,37,0,38],[0,7,0,8],[0,10,0,11],[0,13,0,14],[0,16,0,17],[0,19,0,20]]}
[null,"BON DE LIVRAISON",null,null,"BON DE LIVRAISON",null,null,"BON DE LIVRAISON",null,null,"BON DE LIVRAISON",null,null,"BON DE LIVRAISON",null,null,"BON DE LIVRAISON",null,null,"BON DE LIVRAISON",null,null,"BON DE LIVRAISON",null,null,"BON DE LIVRAISON",null,null,"BON DE LIVRAISON",null,null,"BON DE LIVRAISON",null,null,"BON DE LIVRAISON",null,null,"BON DE LIVRAISON",null,null,"BON DE LIVRAISON",null,null,"BON DE LIVRAISON",null,null,"BON DE LIVRAISON",null,null,"BON DE LIVRAISON",null,null,"BON DE LIVRAISON",null,null,"BON DE LIVRAISON",null,null,"BON DE LIVRAISON",null,null,"BON DE LIVRAISON",null,null,"BON DE LIVRAISON",null,null,"BON DE LIVRAISON",null,null,"BON DE LIVRAISON",null,null,"BON DE LIVRAISON",null,null,"BON DE LIVRAISON",null,null,"BON DE LIVRAISON",null,null,"BON DE LIVRAISON",null,null,"BON DE LIVRAISON",null,null,"BON DE LIVRAISON",null,null,"BON DE LIVRAISON",null,null,"BON DE LIVRAISON",null,null,"BON DE LIVRAISON",null,null,"BON DE LIVRAISON",null,null,"BON DE LIVRAISON"]
[]
[null,"ADMR",null,null,"ENTREPRISES",null,null,"FO MONTRICHARD","UNITE 1",null,"FO MONTRICHARD","UNITE 2",null,"FO MONTRICHARD","UNITE 3",null,"FH MONTRICHARD","2 RA",null,"FH MONTRICHARD",425,null,"FH MONTRICHARD","4 RL",null,"FH MONTRICHARD",2114,null,"FH MONTRICHARD","8 RA",null,"FH MONTRICHARD",1005,null,"FH MONTRICHARD",1015,null,"FH MONTRICHARD","10 RA",null,"FH MONTRICHARD","EDUC",null,"FO / FAM ROMORANTIN","UNITE 1",null,"FO / FAM ROMORANTIN","UNITE 2",null,"FO / FAM ROMORANTIN","UNITE 3",null,"FO / FAM ROMORANTIN","UNITE 4",null,"FO / FAM ROMORANTIN","UNITE 5",null,"ESAT ROMORANTIN","COLL.",null,"ESAT ROMORANTIN","IND.",null,"FH ROMORANTIN","COLL.",null,"FH ROMORANTIN","IND.",null,"IME ROMORANTIN","UNITE 1",null,"IME ROMORANTIN","UNITE 2",null,"IME ROMORANTIN","UNITE 3",null,"IME ROMORANTIN","UNITE 4",null,"ESAT SALBRIS","COLL.",null,"ESAT SALBRIS","IND.",null,"FH SALBRIS","COR",null,"FH SALBRIS","HIR",null,"FH SALBRIS","CHE",null,"FH SALBRIS","SAR",null,"FH SALBRIS","FOYER",null,"HANDI'CHIENS"]
[null,null,"ID01",null,null,"ID02",null,null,"ID01",null,null,"ID02",null,null,"ID01",null,null,"ID02",null,null,"ID01",null,null,"ID02",null,null,"ID01",null,null,"ID02",null,null,"ID01",null,null,"ID02",null,null,"ID01",null,null,"ID02",null,null,"ID01",null,null,"ID02",null,null,"ID01",null,null,"ID02",null,null,"ID02",null,null,"ID02",null,null,"ID01",null,null,"ID02",null,null,"ID01",null,null,"ID02",null,null,"ID01",null,null,"ID02",null,null,"ID01",null,null,"ID02",null,null,"ID01",null,null,"ID02",null,null,"ID01",null,null,"ID02",null,null,"ID01",null,null,"ID02",null,null,"ID01"]
[null,{"$f":"'FEUILLE FAB'!$A$10","v":"JEUDI SOIR"},{"$f":"'FEUILLE FAB'!$B$5","v":"2015-11-05"},null,{"$f":"'FEUILLE FAB'!$A$10","v":"JEUDI SOIR"},{"$f":"'FEUILLE FAB'!$B$5","v":"2015-11-05"},null,{"$f":"'FEUILLE FAB'!$A$10","v":"JEUDI SOIR"},{"$f":"'FEUILLE FAB'!$B$5","v":"2015-11-05"},null,{"$f":"'FEUILLE FAB'!$A$10","v":"JEUDI SOIR"},{"$f":"'FEUILLE FAB'!$B$5","v":"2015-11-05"},null,{"$f":"'FEUILLE FAB'!$A$10","v":"JEUDI SOIR"},{"$f":"'FEUILLE FAB'!$B$5","v":"2015-11-05"},null,{"$f":"'FEUILLE FAB'!$A$10","v":"JEUDI SOIR"},{"$f":"'FEUILLE FAB'!$B$5","v":"2015-11-05"},null,{"$f":"'FEUILLE FAB'!$A$10","v":"JEUDI SOIR"},{"$f":"'FEUILLE FAB'!$B$5","v":"2015-11-05"},null,{"$f":"'FEUILLE FAB'!$A$10","v":"JEUDI SOIR"},{"$f":"'FEUILLE FAB'!$B$5","v":"2015-11-05"},null,{"$f":"'FEUILLE FAB'!$A$10","v":"JEUDI SOIR"},{"$f":"'FEUILLE FAB'!$B$5","v":"2015-11-05"},null,{"$f":"'FEUILLE FAB'!$A$10","v":"JEUDI SOIR"},{"$f":"'FEUILLE FAB'!$B$5","v":"2015-11-05"},null,{"$f":"'FEUILLE FAB'!$A$10","v":"JEUDI SOIR"},{"$f":"'FEUILLE FAB'!$B$5","v":"2015-11-05"},null,{"$f":"'FEUILLE FAB'!$A$10","v":"JEUDI SOIR"},{"$f":"'FEUILLE FAB'!$B$5","v":"2015-11-05"},null,{"$f":"'FEUILLE FAB'!$A$10","v":"JEUDI SOIR"},{"$f":"'FEUILLE FAB'!$B$5","v":"2015-11-05"},null,{"$f":"'FEUILLE FAB'!$A$10","v":"JEUDI SOIR"},{"$f":"'FEUILLE FAB'!$B$5","v":"2015-11-05"},null,{"$f":"'FEUILLE FAB'!$A$10","v":"JEUDI SOIR"},{"$f":"'FEUILLE FAB'!$B$5","v":"2015-11-05"},null,{"$f":"'FEUILLE FAB'!$A$10","v":"JEUDI SOIR"},{"$f":"'FEUILLE FAB'!$B$5","v":"2015-11-05"},null,{"$f":"'FEUILLE FAB'!$A$10","v":"JEUDI SOIR"},{"$f":"'FEUILLE FAB'!$B$5","v":"2015-11-05"},null,{"$f":"'FEUILLE FAB'!$A$10","v":"JEUDI SOIR"},{"$f":"'FEUILLE FAB'!$B$5","v":"2015-11-05"},null,{"$f":"'FEUILLE FAB'!$A$10","v":"JEUDI SOIR"},{"$f":"'FEUILLE FAB'!$B$5","v":"2015-11-05"},null,{"$f":"'FEUILLE FAB'!$A$10","v":"JEUDI SOIR"},{"$f":"'FEUILLE FAB'!$B$5","v":"2015-11-05"},null,{"$f":"'FEUILLE FAB'!$A$10","v":"JEUDI SOIR"},{"$f":"'FEUILLE FAB'!$B$5","v":"2015-11-05"},null,{"$f":"'FEUILLE FAB'!$A$10","v":"JEUDI SOIR"},{"$f":"'FEUILLE FAB'!$B$5","v":"2015-11-05"},null,{"$f":"'FEUILLE FAB'!$A$10","v":"JEUDI SOIR"},{"$f":"'FEUILLE FAB'!$B$5","v":"2015-11-05"},null,{"$f":"'FEUILLE FAB'!$A$10","v":"JEUDI SOIR"},{"$f":"'FEUILLE FAB'!$B$5","v":"2015-11-05"},null,{"$f":"'FEUILLE FAB'!$A$10","v":"JEUDI SOIR"},{"$f":"'FEUILLE FAB'!$B$5","v":"2015-11-05"},null,{"$f":"'FEUILLE FAB'!$A$10","v":"JEUDI SOIR"},{"$f":"'FEUILLE FAB'!$B$5","v":"2015-11-05"},null,{"$f":"'FEUILLE FAB'!$A$10","v":"JEUDI SOIR"},{"$f":"'FEUILLE FAB'!$B$5","v":"2015-11-05"},null,{"$f":"'FEUILLE FAB'!$A$10","v":"JEUDI SOIR"},{"$f":"'FEUILLE FAB'!$B$5","v":"2015-11-05"},null,{"$f":"'FEUILLE FAB'!$A$10","v":"JEUDI SOIR"},{"$f":"'FEUILLE FAB'!$B$5","v":"2015-11-05"},null,{"$f":"'FEUILLE FAB'!$A$10","v":"JEUDI SOIR"},{"$f":"'FEUILLE FAB'!$B$5","v":"2015-11-05"},null,{"$f":"'FEUILLE FAB'!$A$10","v":"JEUDI SOIR"},{"$f":"'FEUILLE FAB'!$B$5","v":"2015-11-05"},null,{"$f":"'FEUILLE FAB'!$A$10","v":"JEUDI SOIR"},{"$f":"'FEUILLE FAB'!$B$5","v":"2015-11-05"},null,{"$f":"'FEUILLE FAB'!$A$10","v":"JEUDI SOIR"},{"$f":"'FEUILLE FAB'!$B$5","v":"2015-11-05"},null,{"$f":"'FEUILLE FAB'!$A$10","v":"JEUDI SOIR"},{"$f":"'FEUILLE FAB'!$B$5","v":"2015-11-05"},null,{"$f":"'FEUILLE FAB'!$A$10","v":"JEUDI SOIR"},{"$f":"'FEUILLE FAB'!$B$5","v":"2015-11-05"}]
[]
[null,"NOMBRE DE REPAS",{"$f":"'CALCUL EFFECTIFS'!D14","v":34},null,"NOMBRE DE REPAS",{"$f":"'CALCUL EFFECTIFS'!E14","v":21},null,"NOMBRE DE REPAS",{"$f":"'CALCUL EFFECTIFS'!F14","v":11},null,"NOMBRE DE REPAS",{"$f":"'CALCUL EFFECTIFS'!G14","v":10},null,"NOMBRE DE REPAS",{"$f":"'CALCUL EFFECTIFS'!H14","v":12},null,"NOMBRE DE REPAS",{"$f":"'CALCUL EFFECTIFS'!I14","v":0},null,"NOMBRE DE REPAS",{"$f":"'CALCUL EFFECTIFS'!J14","v":0},null,"NOMBRE DE REPAS",{"$f":"'CALCUL EFFECTIFS'!K14","v":0},null,"NOMBRE DE REPAS",{"$f":"'CALCUL EFFECTIFS'!L14","v":1},null,"NOMBRE DE REPAS",{"$f":"'CALCUL EFFECTIFS'!M14","v":0},null,"NOMBRE DE REPAS",{"$f":"'CALCUL EFFECTIFS'!N14","v":0},null,"NOMBRE DE REPAS",{"$f":"'CALCUL EFFECTIFS'!O14","v":0},null,"NOMBRE DE REPAS",{"$f":"'CALCUL EFFECTIFS'!P14","v":0},null,"NOMBRE DE REPAS",{"$f":"'CALCUL EFFECTIFS'!Q14","v":0},null,"NOMBRE DE REPAS",{"$f":"'CALCUL EFFECTIFS'!R14","v":8},null,"NOMBRE DE REPAS",{"$f":"'CALCUL EFFECTIFS'!S14","v":8},null,"NOMBRE DE REPAS",{"$f":"'CALCUL EFFECTIFS'!T14","v":8},null,"NOMBRE DE REPAS",{"$f":"'CALCUL EFFECTIFS'!U14","v":6},null,"NOMBRE DE REPAS",{"$f":"'CALCUL EFFECTIFS'!V14","v":0},null,"NOMBRE DE REPAS",{"$f":"'CALCUL EFFECTIFS'!W14","v":0},null,"NOMBRE DE REPAS",{"$f":"'CALCUL EFFECTIFS'!X14","v":0},null,"NOMBRE DE REPAS",{"$f":"'CALCUL EFFECTIFS'!Y14","v":25},null,"NOMBRE DE REPAS",{"$f":"'CALCUL EFFECTIFS'!Z14","v":0},null,"NOMBRE DE REPAS",{"$f":"'CALCUL EFFECTIFS'!AA14","v":0},null,"NOMBRE DE REPAS",{"$f":"'CALCUL EFFECTIFS'!AB14","v":0},null,"NOMBRE DE REPAS",{"$f":"'CALCUL EFFECTIFS'!AC14","v":0},null,"NOMBRE DE REPAS",{"$f":"'CALCUL EFFECTIFS'!AD14","v":0},null,"NOMBRE DE REPAS",{"$f":"'CALCUL EFFECTIFS'!AE14","v":0},null,"NOMBRE DE REPAS",{"$f":"'CALCUL EFFECTIFS'!AF14","v":0},null,"NOMBRE DE REPAS",{"$f":"'CALCUL EFFECTIFS'!AG14","v":4},null,"NOMBRE DE REPAS",{"$f":"'CALCUL EFFECTIFS'!AH14","v":0},null,"NOMBRE DE REPAS",{"$f":"'CALCUL EFFECTIFS'!AI14","v":3},null,"NOMBRE DE REPAS",{"$f":"'CALCUL EFFECTIFS'!AJ14","v":3},null,"NOMBRE DE REPAS",{"$f":"'CALCUL EFFECTIFS'!AK14","v":6},null,"NOMBRE DE REPAS",{"$f":"'CALCUL EFFECTIFS'!AL14","v":0}]
[]
[null,"PLATS","NOMBRE DE PERS",null,"PLATS","NOMBRE DE PERS",null,"PLATS","NOMBRE DE PERS",null,"PLATS","NOMBRE DE PERS",null,"PLATS","NOMBRE DE PERS",null,"PLATS","NOMBRE DE PERS",null,"PLATS","NOMBRE DE PERS",null,"PLATS","NOMBRE DE PERS",null,"PLATS","NOMBRE DE PERS",null,"PLATS","NOMBRE DE PERS",null,"PLATS","NOMBRE DE PERS",null,"PLATS","NOMBRE DE PERS",null,"PLATS","NOMBRE DE PERS",null,"PLATS","NOMBRE DE PERS",null,"PLATS","NOMBRE DE PERS",null,"PLATS","NOMBRE DE PERS",null,"PLATS","NOMBRE DE PERS",null,"PLATS","NOMBRE DE PERS",null,"PLATS","NOMBRE DE PERS",null,"PLATS","NOMBRE DE PERS",null,"PLATS","NOMBRE DE PERS",null,"PLATS","NOMBRE DE PERS",null,"PLATS","NOMBRE DE PERS",null,"PLATS","NOMBRE DE PERS",null,"PLATS","NOMBRE DE PERS",null,"PLATS","NOMBRE DE PERS",null,"PLATS","NOMBRE DE PERS",null,"PLATS","NOMBRE DE PERS",null,"PLATS","NOMBRE DE PERS",null,"PLATS","NOMBRE DE PERS",null,"PLATS","NOMBRE DE PERS",null,"PLATS","NOMBRE DE PERS",null,"PLATS","NOMBRE DE PERS",null,"PLATS","NOMBRE DE PERS",null,"PLATS","NOMBRE DE PERS"]
[null,"MACEDOINE CŒUR PALMOIER",26,null,"MACEDOINE CŒUR PALMOIER",21,null,"MACEDOINE CŒUR PALMOIER",11,null,"MACEDOINE CŒUR PALMOIER",10,null,"MACEDOINE CŒUR PALMOIER",12,null,null,null,null,null,null,null,null,null,null,"MACEDOINE CŒUR PALMOIER",1,null,null,null,null,null,null,null,null,null,null,null,null,null,null,null,null,"MACEDOINE CŒUR PALMOIER",8,null,"MACEDOINE CŒUR PALMOIER",8,null,"MACEDOINE CŒUR PALMOIER",8,null,"MACEDOINE CŒUR PALMOIER",6,null,null,null,null,null,null,null,null,null,null,"MACEDOINE CŒUR PALMOIER",25,null,null,null,null,null,null,null,null,null,null,null,null,null,null,null,null,null,null,null,null,null,null,"MACEDOINE CŒUR PALMOIER",4,null,null,null,null,"MACEDOINE CŒUR PALMOIER",3,null,"MACEDOINE CŒUR PALMOIER",3,null,"MACEDOINE CŒUR PALMOIER",6]
[null,"SAUCISSE DE TOULOUSE",26,null,"SAUCISSE DE TOULOUSE",21,null,"SAUCISSE DE TOULOUSE",11,null,"SAUCISSE DE TOULOUSE",7,null,"SAUCISSE DE TOULOUSE",10,null,null,null,null,null,null,null,null,null,null,"SAUCISSE DE TOULOUSE",1,null,null,null,null,null,null,null,null,null,null,null,null,null,null,null,null,"SAUCISSE DE TOULOUSE",6,null,"SAUCISSE DE TOULOUSE",7,null,"SAUCISSE DE TOULOUSE",6,null,"SAUCISSE DE TOULOUSE",4,null,null,null,null,null,null,null,null,null,null,"SAUCISSE DE TOULOUSE",24,null,null,null,null,null,null,null,null,null,null,null,null,null,null,null,null,null,null,null,null,null,null,"SAUCISSE DE TOULOUSE",4,null,null,null,null,"SAUCISSE DE TOULOUSE",3,null,"SAUCISSE DE TOULOUSE",3,null,"SAUCISSE DE TOULOUSE",5]
[null,"BROCOLIS",26,null,"BROCOLIS",21,null,"BROCOLIS",11,null,"BROCOLIS",10,null,"BROCOLIS",12,null,null,null,null,null,null,null,null,null,null,"BROCOLIS",1,null,null,null,null,null,null,null,null,null,null,null,null,null,null,null,null,"BROCOLIS",8,null,"BROCOLIS",8,null,"BROCOLIS",8,null,"BROCOLIS",6,null,null,null,null,null,null,null,null,null,null,"BROCOLIS",25,null,null,null,null,null,null,null,null,null,null,null,null,null,null,null,null,null,null,null,null,null,null,"BROCOLIS",4,null,null,null,null,"BROCOLIS",3,null,"BROCOLIS",3,null,"BROCOLIS",6]
[null,"YAOURT",26,null,"YAOURT",21,null,"RIZ AU CARAMEL",10,null,"RIZ AU CARAMEL",8,null,"RIZ AU CARAMEL",10,null,null,null,null,null,null,null,null,null,null,"YAOURT",1,null,null,null,null,null,null,null,null,null,null,null,null,null,null,null,null,"YAOURT",8,null,"YAOURT",8,null,"YAOURT",8,null,"YAOURT",6,null,null,null,null,null,null,null,null,null,null,"YAOURT",25,null,null,null,null,null,null,null,null,null,null,null,null,null,null,null,null,null,null,null,null,null,null,"YAOURT",4,null,null,null,null,"YAOURT",3,null,"YAOURT",3,null,"YAOURT",6]
[null,"RIZ AU CARAMEL",26,null,"RIZ AU CARAMEL",21,null,"LEGUMES VERTS REMY",1,null,"ESCALOPE DE DINDE",2,null,"ESCALOPE DE DINDE",2,null,null,null,null,null,null,null,null,null,null,"RIZ AU CARAMEL",1,null,null,null,null,null,null,null,null,null,null,null,null,null,null,null,null,"RIZ AU CARAMEL",6,null,"RIZ AU CARAMEL",7,null,"RIZ AU CARAMEL",6,null,"RIZ AU CARAMEL",4,null,null,null,null,null,null,null,null,null,null,"RIZ AU CARAMEL",24,null,null,null,null,null,null,null,null,null,null,null,null,null,null,null,null,null,null,null,null,null,null,"RIZ AU CARAMEL",3,null,null,null,null,"RIZ AU CARAMEL",3,null,"RIZ AU CARAMEL",3,null,"RIZ AU CARAMEL",5]
[null,"MACEDOINE CŒUR PALMOIER",4,null,null,null,null,"FECULENT",1,null,"KIWI",2,null,"KIWI",2,null,null,null,null,null,null,null,null,null,null,null,null,null,null,null,null,null,null,null,null,null,null,null,null,null,null,null,null,"ESCALOPE DE DINDE",2,null,"ESCALOPE DE DINDE",1,null,"ESCALOPE DE DINDE",2,null,"ESCALOPE DE DINDE",2,null,null,null,null,null,null,null,null,null,null,"ESCALOPE DE DINDE",1,null,null,null,null,null,null,null,null,null,null,null,null,null,null,null,null,null,null,null,null,null,null,"LEGUMES VERTS",1,null,null,null,null,null,null,null,null,null,null,"LEGUMES VERTS",1]
[null,"ESCALOPE DE DINDE",4,null,null,null,null,"KIWI",1,null,"ESCALOPE DE DINDE",1,null,null,null,null,null,null,null,null,null,null,null,null,null,null,null,null,null,null,null,null,null,null,null,null,null,null,null,null,null,null,null,"KIWI",2,null,"KIWI",1,null,"KIWI",2,null,"KIWI",2,null,null,null,null,null,null,null,null,null,null,"KIWI",1,null,null,null,null,null,null,null,null,null,null,null,null,null,null,null,null,null,null,null,null,null,null,"FECULENT",1,null,null,null,null,null,null,null,null,null,null,"FECULENT",1]
[null,"BROCOLIS",4,null,null,null,null,null,null,null,null,null,null,null,null,null,null,null,null,null,null,null,null,null,null,null,null,null,null,null,null,null,null,null,null,null,null,null,null,null,null,null,null,null,null,null,null,null,null,null,null,null,null,null,null,null,null,null,null,null,null,null,null,null,null,null,null,null,null,null,null,null,null,null,null,null,null,null,null,null,null,null,null,null,null,null,null,null,"KIWI",1,null,null,null,null,null,null,null,null,null,null,"ESCALOPE DE DINDE",1]
[null,"YAOURT",4,null,null,null,null,null,null,null,null,null,null,null,null,null,null,null,null,null,null,null,null,null,null,null,null,null,null,null,null,null,null,null,null,null,null,null,null,null,null,null,null,null,null,null,null,null,null,null,null,null,null,null,null,null,null,null,null,null,null,null,null,null,null,null,null,null,null,null,null,null,null,null,null,null,null,null,null,null,null,null,null,null,null,null,null,null,null,null,null,null,null,null,null,null,null,null,null,null,"KIWI",1]
[null,"RIZ AU CARAMEL",4]
[null,"MACEDOINE CŒUR PALMOIER",3]
[null,"SAUCISSE DE TOULOUSE",3]
[null,"BROCOLIS",3]
[null,"YAOURT",3]
[null,"KIWI",3]
[null,"MACEDOINE CŒUR PALMOIER",1]
[null,"ESCALOPE DE DINDE",1]
[null,"BROCOLIS",1]
[null,"YAOURT",1]
[null,"KIWI",1]