{"text_format":"1","workbook":"xlsx","n_sheets":3,"sheets":["FACTURES","DONNEES","ENCAISSEMENTS"],"not_rendered":{"charts":0,"images":0,"macros":1,"external_links":1,"defined_names":4,"comments":0,"pivot_tables":0},"unopened":[],"bounds":{"document_bytes":16777216,"sheet_cells":100000,"rows_first":2000,"rows_last":500,"rows_between":2000,"halvings":0,"cell_chars":16384,"cell_head_chars":4096},"cells_cut":0,"cells_raw":0,"read":"whole","date_system":"1900"}

{"sheet":"FACTURES","index":0,"n_rows":508,"n_cols":10,"rows_kept":508,"cut":false,"hidden":false,"merged":[]}
["Date Opération","Type","Client","MONTANT","Délai","Échéance","NB JRS RETARD","AUJOURDHUI","SOLDE","STATUT"]
["2015-09-30","Facture","00000009",400000,3,{"$f":"E2+A2","v":"2015-10-03"},{"$f":"IF(I2=0,\"\",H2-F2)","v":58},{"$f":"TODAY()","v":"2015-11-30"},{"$f":"D2","v":400000},{"$f":"IF(AND(I2<>0,F2>=H2),\"ras\",IF(I2=0,\"soldé\",\"inter\"))","v":"inter"}]
["2015-09-30","Facture","00000015",600000,3,"2015-10-03",58,"2015-11-30",600000,"inter"]
["2015-09-30","Facture","00000019",500000,3,"2015-10-03",58,"2015-11-30",500000,"inter"]
["2015-09-30","Facture","00000021",200000,3,"2015-10-03",58,"2015-11-30",200000,"inter"]
["2015-09-30","Facture","00000023",1000000,3,"2015-10-03",58,"2015-11-30",1000000,"inter"]
["2015-09-30","Facture","00000028",2500000,3,"2015-10-03",58,"2015-11-30",2500000,"inter"]
["2015-09-30","Facture","00000033",500000,3,"2015-10-03",58,"2015-11-30",500000,"inter"]
["2015-09-30","Facture","00000036",300000,3,"2015-10-03",58,"2015-11-30",300000,"inter"]
["2015-09-30","Facture","00000038",900000,3,"2015-10-03",58,"2015-11-30",900000,"inter"]
["2015-09-30","Facture","00000040",1090000,3,"2015-10-03",58,"2015-11-30",1090000,"inter"]
["2015-09-30","Facture","00000041",100000,3,"2015-10-03",58,"2015-11-30",100000,"inter"]
["2015-09-30","Facture","00000049",600000,3,"2015-10-03",58,"2015-11-30",600000,"inter"]
["2015-09-30","Facture","00000052",100000,3,"2015-10-03",58,"2015-11-30",100000,"inter"]
["2015-09-30","Facture","00000063",500000,3,"2015-10-03",58,"2015-11-30",500000,"inter"]
["2015-09-30","Facture","00000064",1000000,3,"2015-10-03",58,"2015-11-30",1000000,"inter"]
["2015-09-30","Facture","00000066",200000,3,"2015-10-03",58,"2015-11-30",200000,"inter"]
["2015-09-30","Facture","00000075",500000,3,"2015-10-03",58,"2015-11-30",500000,"inter"]
["2015-09-30","Facture","00000080",500000,3,"2015-10-03",58,"2015-11-30",500000,"inter"]
["2015-09-30","Facture","00000081",900000,3,"2015-10-03",58,"2015-11-30",900000,"inter"]
["2015-09-30","Facture","00000082",500000,3,"2015-10-03",58,"2015-11-30",500000,"inter"]
["2015-09-30","Facture","00000089",200000,3,"2015-10-03",58,"2015-11-30",200000,"inter"]
["2015-09-30","Facture","00000091",300,3,"2015-10-03",58,"2015-11-30",300,"inter"]
["2015-09-30","Facture","00000096",500000,3,"2015-10-03",58,"2015-11-30",500000,"inter"]
["2015-09-30","Facture","00000097",4515000,3,"2015-10-03",58,"2015-11-30",4515000,"inter"]
["2015-09-30","Facture","00000101",965000,3,"2015-10-03",58,"2015-11-30",965000,"inter"]
["2015-09-30","Facture","00000103",1000000,3,"2015-10-03",58,"2015-11-30",1000000,"inter"]
["2015-09-30","Facture","00000111",900000,3,"2015-10-03",58,"2015-11-30",900000,"inter"]
["2015-09-30","Facture","00000112",200000,3,"2015-10-03",58,"2015-11-30",200000,"inter"]
["2015-09-30","Facture","00000113",100000,3,"2015-10-03",58,"2015-11-30",100000,"inter"]
["2015-09-30","Facture","00000116",700000,3,"2015-10-03",58,"2015-11-30",700000,"inter"]
["2015-09-30","Facture","00000126",1235000,3,"2015-10-03",58,"2015-11-30",1235000,"inter"]
["2015-09-30","Facture","00000128",500000,3,"2015-10-03",58,"2015-11-30",500000,"inter"]
["2015-09-30","Facture","00000133",500000,3,"2015-10-03",58,"2015-11-30",500000,"inter"]
["2015-09-30","Facture","00000141",1000000,3,"2015-10-03",58,"2015-11-30",1000000,"inter"]
["2015-09-30","Facture","00000144",1930000,3,"2015-10-03",58,"2015-11-30",1930000,"inter"]
["2015-09-30","Facture","00000149",100000,3,"2015-10-03",58,"2015-11-30",100000,"inter"]
["2015-09-30","Facture","00000151",350000,3,"2015-10-03",58,"2015-11-30",350000,"inter"]
["2015-09-30","Facture","00000170",200000,3,"2015-10-03",58,"2015-11-30",200000,"inter"]
["2015-09-30","Facture","00000176",200000,3,"2015-10-03",58,"2015-11-30",200000,"inter"]
["2015-09-30","Facture","00000178",1000000,3,"2015-10-03",58,"2015-11-30",1000000,"inter"]
["2015-09-30","Facture","00000181",135000,3,"2015-10-03",58,"2015-11-30",135000,"inter"]
["2015-09-30","Facture","00000184",2000000,3,"2015-10-03",58,"2015-11-30",2000000,"inter"]
["2015-09-30","Facture","00000187",150000,3,"2015-10-03",58,"2015-11-30",150000,"inter"]
["2015-09-30","Facture","00000193",500000,3,"2015-10-03",58,"2015-11-30",500000,"inter"]
["2015-09-30","Facture","00000201",251500,3,"2015-10-03",58,"2015-11-30",251500,"inter"]
["2015-09-30","Facture","00000202",860000,3,"2015-10-03",58,"2015-11-30",860000,"inter"]
["2015-09-30","Facture","00000210",300000,3,"2015-10-03",58,"2015-11-30",300000,"inter"]
["2015-09-30","Facture","00000211",665000,3,"2015-10-03",58,"2015-11-30",665000,"inter"]
["2015-09-30","Facture","00000213",1000000,3,"2015-10-03",58,"2015-11-30",1000000,"inter"]
["2015-09-30","Facture","00000223",650000,3,"2015-10-03",58,"2015-11-30",650000,"inter"]
["2015-09-30","Facture","00000224",330000,3,"2015-10-03",58,"2015-11-30",330000,"inter"]
["2015-09-30","Facture","00000225",500000,3,"2015-10-03",58,"2015-11-30",500000,"inter"]
["2015-09-30","Facture","00000229",397000,3,"2015-10-03",58,"2015-11-30",397000,"inter"]
["2015-09-30","Facture","00000231",6385000,3,"2015-10-03",58,"2015-11-30",6385000,"inter"]
["2015-09-30","Facture","00000232",4070000,3,"2015-10-03",58,"2015-11-30",4070000,"inter"]
["2015-09-30","Facture","00000235",150000,3,"2015-10-03",58,"2015-11-30",150000,"inter"]
["2015-09-30","Facture","00000236",1400000,3,"2015-10-03",58,"2015-11-30",1400000,"inter"]
["2015-09-30","Facture","00000238",2400000,3,"2015-10-03",58,"2015-11-30",2400000,"inter"]
["2015-09-30","Facture","00000244",2000000,3,{"$f":"E60+A60","v":"2015-10-03"},{"$f":"IF(I60=0,\"\",H60-F60)","v":58},{"$f":"TODAY()","v":"2015-11-30"},2000000,{"$f":"IF(AND(I60<>0,F60>=H60),\"ras\",IF(I60=0,\"soldé\",\"inter\"))","v":"inter"}]
["2015-09-30","Facture","00000245",2000000,3,"2015-10-03",58,"2015-11-30",2000000,"inter"]
["2015-09-30","Facture","00000249",115000,3,"2015-10-03",58,"2015-11-30",115000,"inter"]
["2015-09-30","Facture","00000271",500000,3,"2015-10-03",58,"2015-11-30",{"$f":"D63","v":500000},"inter"]
["2015-09-30","Facture","00000273",1000000,3,"2015-10-03",58,"2015-11-30",1000000,"inter"]
["2015-09-30","Facture","00000275",1320000,3,"2015-10-03",58,"2015-11-30",1320000,"inter"]
["2015-09-30","Facture","00000279",2595000,3,"2015-10-03",58,"2015-11-30",2595000,"inter"]
["2015-09-30","Facture","00000283",430000,3,"2015-10-03",58,"2015-11-30",430000,"inter"]
["2015-09-30","Facture","00000285",500000,3,"2015-10-03",58,"2015-11-30",500000,"inter"]
["2015-09-30","Facture","00000293",1285000,3,"2015-10-03",58,"2015-11-30",1285000,"inter"]
["2015-09-30","Facture","00000294",3015000,3,"2015-10-03",58,"2015-11-30",3015000,"inter"]
["2015-09-30","Facture","00000305",1205000,3,"2015-10-03",58,"2015-11-30",1205000,"inter"]
["2015-09-30","Facture","00000309",1000000,3,"2015-10-03",58,"2015-11-30",1000000,"inter"]
["2015-09-30","Facture","00000312",500000,3,"2015-10-03",58,"2015-11-30",500000,"inter"]
["2015-09-30","Facture","00000313",200000,3,"2015-10-03",58,"2015-11-30",200000,"inter"]
["2015-09-30","Facture","00000319",1000000,3,"2015-10-03",58,"2015-11-30",1000000,"inter"]
["2015-09-30","Facture","00000323",1000000,3,"2015-10-03",58,"2015-11-30",1000000,"inter"]
["2015-09-30","Facture","00000327",1000000,3,"2015-10-03",58,"2015-11-30",1000000,"inter"]
["2015-09-30","Facture","00000330",200000,3,"2015-10-03",58,"2015-11-30",200000,"inter"]
["2015-09-30","Facture","00000333",300000,3,"2015-10-03",58,"2015-11-30",300000,"inter"]
["2015-09-30","Facture","00000339",150000,3,"2015-10-03",58,"2015-11-30",150000,"inter"]
["2015-09-30","Facture","00000341",1500000,3,"2015-10-03",58,"2015-11-30",1500000,"inter"]
["2015-09-30","Facture","00000346",200000,3,"2015-10-03",58,"2015-11-30",200000,"inter"]
["2015-09-30","Facture","00000349",500000,3,"2015-10-03",58,"2015-11-30",500000,"inter"]
["2015-09-30","Facture","00000351",200000,3,"2015-10-03",58,"2015-11-30",200000,"inter"]
["2015-09-30","Facture","00000355",1000000,3,"2015-10-03",58,"2015-11-30",1000000,"inter"]
["2015-09-30","Facture","00000356",100000,3,"2015-10-03",58,"2015-11-30",100000,"inter"]
["2015-09-30","Facture","00000360",100000,3,"2015-10-03",58,"2015-11-30",100000,"inter"]
["2015-09-30","Facture","00000361",200000,3,"2015-10-03",58,"2015-11-30",200000,"inter"]
["2015-09-30","Facture","00000363",200000,3,"2015-10-03",58,"2015-11-30",200000,"inter"]
["2015-09-30","Facture","00000364",500000,3,"2015-10-03",58,"2015-11-30",500000,"inter"]
["2015-09-30","Facture","00000366",700000,3,"2015-10-03",58,"2015-11-30",700000,"inter"]
["2015-09-30","Facture","00000371",2000000,3,"2015-10-03",58,"2015-11-30",2000000,"inter"]
["2015-09-30","Facture","00000379",700000,3,"2015-10-03",58,"2015-11-30",700000,"inter"]
["2015-09-30","Facture","00000380",300000,3,"2015-10-03",58,"2015-11-30",300000,"inter"]
["2015-09-30","Facture","00000385",200000,3,"2015-10-03",58,"2015-11-30",200000,"inter"]
["2015-09-30","Facture","00000386",600000,3,"2015-10-03",58,"2015-11-30",600000,"inter"]
["2015-09-30","Facture","00000387",895000,3,"2015-10-03",58,"2015-11-30",895000,"inter"]
["2015-09-30","Facture","00000389",1800000,3,"2015-10-03",58,"2015-11-30",1800000,"inter"]
["2015-09-30","Facture","00000391",200000,3,"2015-10-03",58,"2015-11-30",200000,"inter"]
["2015-09-30","Facture","00000392",2500000,3,"2015-10-03",58,"2015-11-30",2500000,"inter"]
["2015-09-30","Facture","00000399",995000,3,"2015-10-03",58,"2015-11-30",995000,"inter"]
["2015-09-30","Facture","00000401",375000,3,"2015-10-03",58,"2015-11-30",375000,"inter"]
["2015-09-30","Facture","00000402",1500000,3,"2015-10-03",58,"2015-11-30",1500000,"inter"]
["2015-09-30","Facture","00000406",630000,3,"2015-10-03",58,"2015-11-30",630000,"inter"]
["2015-09-30","Facture","00000407",100000,3,"2015-10-03",58,"2015-11-30",100000,"inter"]
["2015-09-30","Facture","00000412",500000,3,"2015-10-03",58,"2015-11-30",500000,"inter"]
["2015-09-30","Facture","00000424",50000,3,"2015-10-03",58,"2015-11-30",50000,"inter"]
["2015-09-30","Facture","00000442",380000,3,"2015-10-03",58,"2015-11-30",380000,"inter"]
["2015-09-30","Facture","00000461",500000,3,"2015-10-03",58,"2015-11-30",500000,"inter"]
["2015-09-30","Facture","00000467",355000,3,"2015-10-03",58,"2015-11-30",355000,"inter"]
["2015-09-30","Facture","00000480",975000,3,"2015-10-03",58,"2015-11-30",975000,"inter"]
["2015-09-30","Facture","00000485",1000000,3,"2015-10-03",58,"2015-11-30",1000000,"inter"]
["2015-09-30","Facture","00000490",500000,3,"2015-10-03",58,"2015-11-30",500000,"inter"]
["2015-09-30","Facture","00000491",500000,3,"2015-10-03",58,"2015-11-30",500000,"inter"]
["2015-09-30","Facture","00000492",50000,3,"2015-10-03",58,"2015-11-30",50000,"inter"]
["2015-09-30","Facture","00000513",150000,3,"2015-10-03",58,"2015-11-30",150000,"inter"]
["2015-09-30","Facture","00000515",300000,3,"2015-10-03",58,"2015-11-30",300000,"inter"]
["2015-09-30","Facture","00000517",700000,3,"2015-10-03",58,"2015-11-30",700000,"inter"]
["2015-09-30","Facture","00000518",200000,3,"2015-10-03",58,"2015-11-30",200000,"inter"]
["2015-09-30","Facture","00000520",220000,3,"2015-10-03",58,"2015-11-30",220000,"inter"]
["2015-09-30","Facture","00000523",600000,3,"2015-10-03",58,"2015-11-30",600000,"inter"]
["2015-09-30","Facture","00000524",80000,3,"2015-10-03",58,"2015-11-30",80000,"inter"]
["2015-09-30","Facture","00000526",600000,3,"2015-10-03",58,"2015-11-30",600000,"inter"]
["2015-09-30","Facture","00000529",5000000,3,{"$f":"E124+A124","v":"2015-10-03"},{"$f":"IF(I124=0,\"\",H124-F124)","v":58},{"$f":"TODAY()","v":"2015-11-30"},5000000,{"$f":"IF(AND(I124<>0,F124>=H124),\"ras\",IF(I124=0,\"soldé\",\"inter\"))","v":"inter"}]
["2015-09-30","Facture","00000531",500000,3,"2015-10-03",58,"2015-11-30",500000,"inter"]
["2015-09-30","Facture","00000543",90000,3,"2015-10-03",58,"2015-11-30",90000,"inter"]
["2015-09-30","Facture","00000545",200000,3,"2015-10-03",58,"2015-11-30",{"$f":"D127","v":200000},"inter"]
["2015-09-30","Facture","00000547",50000,3,"2015-10-03",58,"2015-11-30",50000,"inter"]
["2015-09-30","Facture","00000548",145000,3,"2015-10-03",58,"2015-11-30",145000,"inter"]
["2015-09-30","Facture","00000550",400000,3,"2015-10-03",58,"2015-11-30",400000,"inter"]
["2015-09-30","Facture","00000551",500000,3,"2015-10-03",58,"2015-11-30",500000,"inter"]
["2015-09-30","Facture","00000557",235000,3,"2015-10-03",58,"2015-11-30",235000,"inter"]
["2015-09-30","Facture","00000559",666900,3,"2015-10-03",58,"2015-11-30",666900,"inter"]
["2015-09-30","Facture","00000560",438700,3,"2015-10-03",58,"2015-11-30",438700,"inter"]
["2015-09-30","Facture","00000561",10400,3,"2015-10-03",58,"2015-11-30",10400,"inter"]
["2015-09-30","Facture","00000562",407500,3,"2015-10-03",58,"2015-11-30",407500,"inter"]
["2015-09-30","Facture","00000563",494000,3,"2015-10-03",58,"2015-11-30",494000,"inter"]
["2015-09-30","Facture","00000564",77500,3,"2015-10-03",58,"2015-11-30",77500,"inter"]
["2015-09-30","Facture","00000566",2650000,3,"2015-10-03",58,"2015-11-30",2650000,"inter"]
["2015-09-30","Facture","00000567",500000,3,"2015-10-03",58,"2015-11-30",500000,"inter"]
["2015-09-30","Facture","00000568",28000,3,"2015-10-03",58,"2015-11-30",28000,"inter"]
["2015-09-30","Facture","00000569",108000,3,"2015-10-03",58,"2015-11-30",108000,"inter"]
["2015-09-30","Facture","00000570",115000,3,"2015-10-03",58,"2015-11-30",115000,"inter"]
["2015-09-30","Facture","00000572",323000,3,"2015-10-03",58,"2015-11-30",323000,"inter"]
["2015-09-30","Facture","00000573",36000,3,"2015-10-03",58,"2015-11-30",36000,"inter"]
["2015-09-30","Facture","00000574",159000,3,"2015-10-03",58,"2015-11-30",159000,"inter"]
["2015-09-30","Facture","00000575",79500,3,"2015-10-03",58,"2015-11-30",79500,"inter"]
["2015-09-30","Facture","00000576",200000,3,"2015-10-03",58,"2015-11-30",200000,"inter"]
["2015-09-30","Facture","00000578",465000,3,"2015-10-03",58,"2015-11-30",465000,"inter"]
["2015-09-30","Facture","00000580",48000,3,"2015-10-03",58,"2015-11-30",48000,"inter"]
["2015-09-30","Facture","00000581",1940000,3,"2015-10-03",58,"2015-11-30",1940000,"inter"]
["2015-09-30","Facture","00000612",2455000,3,"2015-10-03",58,"2015-11-30",2455000,"inter"]
["2015-09-30","Facture","00000614",2649550,3,"2015-10-03",58,"2015-11-30",2649550,"inter"]
["2015-09-30","Facture","00000615",5830300,3,"2015-10-03",58,"2015-11-30",5830300,"inter"]
["2015-09-30","Facture","00000616",25776000,3,"2015-10-03",58,"2015-11-30",25776000,"inter"]
["2015-09-30","Facture","00000618",500000,3,"2015-10-03",58,"2015-11-30",500000,"inter"]
["2015-09-30","Facture","00000619",40094500,3,"2015-10-03",58,"2015-11-30",40094500,"inter"]
["2015-09-30","Facture","00000620",41209000,3,"2015-10-03",58,"2015-11-30",41209000,"inter"]
["2015-09-30","Facture","00000622",350000,3,"2015-10-03",58,"2015-11-30",350000,"inter"]
["2015-09-30","Facture","00000624",568000,3,"2015-10-03",58,"2015-11-30",568000,"inter"]
["2015-09-30","Facture","00000626",57000,3,"2015-10-03",58,"2015-11-30",57000,"inter"]
["2015-09-30","Facture","00000628",650000,3,"2015-10-03",58,"2015-11-30",650000,"inter"]
["2015-09-30","Facture","00000629",2159000,3,"2015-10-03",58,"2015-11-30",2159000,"inter"]
["2015-09-30","Facture","00000632",5000,3,"2015-10-03",58,"2015-11-30",5000,"inter"]
["2015-09-30","Facture","00000636",250000,3,"2015-10-03",58,"2015-11-30",250000,"inter"]
["2015-09-30","Facture","00000637",200000,3,"2015-10-03",58,"2015-11-30",200000,"inter"]
["2015-09-30","Facture","00000638",5000,3,"2015-10-03",58,"2015-11-30",5000,"inter"]
["2015-09-30","Facture","00000639",19291000,3,"2015-10-03",58,"2015-11-30",19291000,"inter"]
["2015-09-30","Facture","00000641",100000,3,"2015-10-03",58,"2015-11-30",100000,"inter"]
["2015-09-30","Facture","00000647",700000,3,"2015-10-03",58,"2015-11-30",700000,"inter"]
["2015-09-30","Facture","00000650",900000,3,"2015-10-03",58,"2015-11-30",900000,"inter"]
["2015-09-30","Facture","00000651",458150,3,"2015-10-03",58,"2015-11-30",458150,"inter"]
["2015-09-30","Facture","00000653",300000,3,"2015-10-03",58,"2015-11-30",300000,"inter"]
["2015-09-30","Facture","00000655",4660000,3,"2015-10-03",58,"2015-11-30",4660000,"inter"]
["2015-09-30","Facture","00000657",300000,3,"2015-10-03",58,"2015-11-30",300000,"inter"]
["2015-09-30","Facture","00000658",300000,3,"2015-10-03",58,"2015-11-30",300000,"inter"]
["2015-09-30","Facture","00000660",300000,3,"2015-10-03",58,"2015-11-30",300000,"inter"]
["2015-09-30","Facture","00000661",160000,3,"2015-10-03",58,"2015-11-30",160000,"inter"]
["2015-09-30","Facture","00000668",1275000,3,"2015-10-03",58,"2015-11-30",1275000,"inter"]
["2015-09-30","Facture","00000673",2000000,3,"2015-10-03",58,"2015-11-30",2000000,"inter"]
["2015-09-30","Facture","00000677",500000,3,"2015-10-03",58,"2015-11-30",500000,"inter"]
["2015-09-30","Facture","00000678",200000,3,"2015-10-03",58,"2015-11-30",200000,"inter"]
["2015-09-30","Facture","00000682",600000,3,"2015-10-03",58,"2015-11-30",600000,"inter"]
["2015-09-30","Facture","00000683",200000,3,"2015-10-03",58,"2015-11-30",200000,"inter"]
["2015-09-30","Facture","00000686",200000,3,"2015-10-03",58,"2015-11-30",200000,"inter"]
["2015-09-30","Facture","00000687",300000,3,"2015-10-03",58,"2015-11-30",300000,"inter"]
["2015-09-30","Facture","00000690",300000,3,"2015-10-03",58,"2015-11-30",300000,"inter"]
["2015-09-30","Facture","00000692",500000,3,{"$f":"E188+A188","v":"2015-10-03"},{"$f":"IF(I188=0,\"\",H188-F188)","v":58},{"$f":"TODAY()","v":"2015-11-30"},500000,{"$f":"IF(AND(I188<>0,F188>=H188),\"ras\",IF(I188=0,\"soldé\",\"inter\"))","v":"inter"}]
["2015-09-30","Facture","00000694",100000,3,"2015-10-03",58,"2015-11-30",100000,"inter"]
["2015-09-30","Facture","00000697",200000,3,"2015-10-03",58,"2015-11-30",200000,"inter"]
["2015-09-30","Facture","00000705",100000,3,"2015-10-03",58,"2015-11-30",{"$f":"D191","v":100000},"inter"]
["2015-09-30","Facture","00000709",250000,3,"2015-10-03",58,"2015-11-30",250000,"inter"]
["2015-09-30","Facture","00000713",300000,3,"2015-10-03",58,"2015-11-30",300000,"inter"]
["2015-09-30","Facture","00000714",2000,3,"2015-10-03",58,"2015-11-30",2000,"inter"]
["2015-09-30","Facture","00000715",300000,3,"2015-10-03",58,"2015-11-30",300000,"inter"]
["2015-09-30","Facture","00000716",300000,3,"2015-10-03",58,"2015-11-30",300000,"inter"]
["2015-09-30","Facture","00000718",40000,3,"2015-10-03",58,"2015-11-30",40000,"inter"]
["2015-09-30","Facture","00000719",500000,3,"2015-10-03",58,"2015-11-30",500000,"inter"]
["2015-09-30","Facture","00000720",300000,3,"2015-10-03",58,"2015-11-30",300000,"inter"]
["2015-09-30","Facture","00000724",300000,3,"2015-10-03",58,"2015-11-30",300000,"inter"]
["2015-09-30","Facture","00000725",200000,3,"2015-10-03",58,"2015-11-30",200000,"inter"]
["2015-09-30","Facture","00000728",300000,3,"2015-10-03",58,"2015-11-30",300000,"inter"]
["2015-09-30","Facture","00000730",310000,3,"2015-10-03",58,"2015-11-30",310000,"inter"]
["2015-09-30","Facture","00000731",200000,3,"2015-10-03",58,"2015-11-30",200000,"inter"]
["2015-09-30","Facture","00000734",100000,3,"2015-10-03",58,"2015-11-30",100000,"inter"]
["2015-09-30","Facture","00000735",105000,3,"2015-10-03",58,"2015-11-30",105000,"inter"]
["2015-09-30","Facture","00000736",1000000,3,"2015-10-03",58,"2015-11-30",1000000,"inter"]
["2015-09-30","Facture","00000739",70000,3,"2015-10-03",58,"2015-11-30",70000,"inter"]
["2015-09-30","Facture","00000741",600000,3,"2015-10-03",58,"2015-11-30",600000,"inter"]
["2015-09-30","Facture","00000742",200000,3,"2015-10-03",58,"2015-11-30",200000,"inter"]
["2015-09-30","Facture","00000744",10000,3,"2015-10-03",58,"2015-11-30",10000,"inter"]
["2015-09-30","Facture","00000745",500000,3,"2015-10-03",58,"2015-11-30",500000,"inter"]
["2015-09-30","Facture","00000746",1000000,3,"2015-10-03",58,"2015-11-30",1000000,"inter"]
["2015-09-30","Facture","00000747",4000000,3,"2015-10-03",58,"2015-11-30",4000000,"inter"]
["2015-09-30","Facture","00000748",3010000,3,"2015-10-03",58,"2015-11-30",3010000,"inter"]
["2015-09-30","Facture","00000749",25000,3,"2015-10-03",58,"2015-11-30",25000,"inter"]
["2015-09-30","Facture","00000750",3000000,3,"2015-10-03",58,"2015-11-30",3000000,"inter"]
["2015-09-30","Facture","00000751",200000,3,"2015-10-03",58,"2015-11-30",200000,"inter"]
["2015-09-30","Facture","00000752",1500000,3,"2015-10-03",58,"2015-11-30",1500000,"inter"]
["2015-09-30","Facture","00000754",200000,3,"2015-10-03",58,"2015-11-30",200000,"inter"]
["2015-09-30","Facture","00000758",100000,3,"2015-10-03",58,"2015-11-30",100000,"inter"]
["2015-09-30","Facture","00000763",350000,3,"2015-10-03",58,"2015-11-30",350000,"inter"]
["2015-09-30","Facture","00000773",200000,3,"2015-10-03",58,"2015-11-30",200000,"inter"]
["2015-09-30","Facture","00000774",200000,3,"2015-10-03",58,"2015-11-30",200000,"inter"]
["2015-09-30","Facture","00000776",100000,3,"2015-10-03",58,"2015-11-30",100000,"inter"]
["2015-09-30","Facture","00000780",200000,3,"2015-10-03",58,"2015-11-30",200000,"inter"]
["2015-09-30","Facture","00000781",500000,3,"2015-10-03",58,"2015-11-30",500000,"inter"]
["2015-09-30","Facture","00000786",8500000,3,"2015-10-03",58,"2015-11-30",8500000,"inter"]
["2015-10-01","Facture","00000014",2000000,3,"2015-10-04",57,"2015-11-30",2000000,"inter"]
["2015-10-01","Facture","00000015",600000,3,"2015-10-04",57,"2015-11-30",600000,"inter"]
["2015-10-01","Facture","00000016",1000000,3,"2015-10-04",57,"2015-11-30",1000000,"inter"]
["2015-10-01","Facture","00000028",2400000,3,"2015-10-04",57,"2015-11-30",2400000,"inter"]
["2015-10-01","Facture","00000036",300000,3,"2015-10-04",57,"2015-11-30",300000,"inter"]
["2015-10-01","Facture","00000039",200000,3,"2015-10-04",57,"2015-11-30",200000,"inter"]
["2015-10-01","Facture","00000041",200000,3,"2015-10-04",57,"2015-11-30",200000,"inter"]
["2015-10-01","Facture","00000061",100000,3,"2015-10-04",57,"2015-11-30",100000,"inter"]
["2015-10-01","Facture","00000063",500000,3,"2015-10-04",57,"2015-11-30",500000,"inter"]
["2015-10-01","Facture","00000075",500000,3,"2015-10-04",57,"2015-11-30",500000,"inter"]
["2015-10-01","Facture","00000080",500000,3,"2015-10-04",57,"2015-11-30",500000,"inter"]
["2015-10-01","Facture","00000081",900000,3,"2015-10-04",57,"2015-11-30",900000,"inter"]
["2015-10-01","Facture","00000103",1000000,3,"2015-10-04",57,"2015-11-30",1000000,"inter"]
["2015-10-01","Facture","00000116",800000,3,"2015-10-04",57,"2015-11-30",800000,"inter"]
["2015-10-01","Facture","00000126",650000,3,"2015-10-04",57,"2015-11-30",650000,"inter"]
["2015-10-01","Facture","00000133",500000,3,"2015-10-04",57,"2015-11-30",500000,"inter"]
["2015-10-01","Facture","00000143",300000,3,"2015-10-04",57,"2015-11-30",300000,"inter"]
["2015-10-01","Facture","00000151",100000,3,"2015-10-04",57,"2015-11-30",100000,"inter"]
["2015-10-01","Facture","00000170",200000,3,"2015-10-04",57,"2015-11-30",200000,"inter"]
["2015-10-01","Facture","00000178",1500000,3,"2015-10-04",57,"2015-11-30",1500000,"inter"]
["2015-10-01","Facture","00000179",1000000,3,"2015-10-04",57,"2015-11-30",1000000,"inter"]
["2015-10-01","Facture","00000184",1500000,3,"2015-10-04",57,"2015-11-30",1500000,"inter"]
["2015-10-01","Facture","00000187",150000,3,"2015-10-04",57,"2015-11-30",150000,"inter"]
["2015-10-01","Facture","00000197",500000,3,{"$f":"E252+A252","v":"2015-10-04"},{"$f":"IF(I252=0,\"\",H252-F252)","v":57},{"$f":"TODAY()","v":"2015-11-30"},500000,{"$f":"IF(AND(I252<>0,F252>=H252),\"ras\",IF(I252=0,\"soldé\",\"inter\"))","v":"inter"}]
["2015-10-01","Facture","00000202",1000000,3,"2015-10-04",57,"2015-11-30",1000000,"inter"]
["2015-10-01","Facture","00000232",1000000,3,"2015-10-04",57,"2015-11-30",1000000,"inter"]
["2015-10-01","Facture","00000236",650000,3,"2015-10-04",57,"2015-11-30",{"$f":"D255","v":650000},"inter"]
["2015-10-01","Facture","00000244",910000,3,"2015-10-04",57,"2015-11-30",910000,"inter"]
["2015-10-01","Facture","00000253",100000,3,"2015-10-04",57,"2015-11-30",100000,"inter"]
["2015-10-01","Facture","00000266",200000,3,"2015-10-04",57,"2015-11-30",200000,"inter"]
["2015-10-01","Facture","00000293",200000,3,"2015-10-04",57,"2015-11-30",200000,"inter"]
["2015-10-01","Facture","00000305",400000,3,"2015-10-04",57,"2015-11-30",400000,"inter"]
["2015-10-01","Facture","00000309",1000000,3,"2015-10-04",57,"2015-11-30",1000000,"inter"]
["2015-10-01","Facture","00000312",500000,3,"2015-10-04",57,"2015-11-30",500000,"inter"]
["2015-10-01","Facture","00000313",200000,3,"2015-10-04",57,"2015-11-30",200000,"inter"]
["2015-10-01","Facture","00000327",1000000,3,"2015-10-04",57,"2015-11-30",1000000,"inter"]
["2015-10-01","Facture","00000336",200000,3,"2015-10-04",57,"2015-11-30",200000,"inter"]
["2015-10-01","Facture","00000339",150000,3,"2015-10-04",57,"2015-11-30",150000,"inter"]
["2015-10-01","Facture","00000349",500000,3,"2015-10-04",57,"2015-11-30",500000,"inter"]
["2015-10-01","Facture","00000351",200000,3,"2015-10-04",57,"2015-11-30",200000,"inter"]
["2015-10-01","Facture","00000364",500000,3,"2015-10-04",57,"2015-11-30",500000,"inter"]
["2015-10-01","Facture","00000371",3000000,3,"2015-10-04",57,"2015-11-30",3000000,"inter"]
["2015-10-01","Facture","00000389",800000,3,"2015-10-04",57,"2015-11-30",800000,"inter"]
["2015-10-01","Facture","00000391",150000,3,"2015-10-04",57,"2015-11-30",150000,"inter"]
["2015-10-01","Facture","00000392",400000,3,"2015-10-04",57,"2015-11-30",400000,"inter"]
["2015-10-01","Facture","00000402",1500000,3,"2015-10-04",57,"2015-11-30",1500000,"inter"]
["2015-10-01","Facture","00000406",900000,3,"2015-10-04",57,"2015-11-30",900000,"inter"]
["2015-10-01","Facture","00000409",1000000,3,"2015-10-04",57,"2015-11-30",1000000,"inter"]
["2015-10-01","Facture","00000442",150000,3,"2015-10-04",57,"2015-11-30",150000,"inter"]
["2015-10-01","Facture","00000491",500000,3,"2015-10-04",57,"2015-11-30",500000,"inter"]
["2015-10-01","Facture","00000517",500000,3,"2015-10-04",57,"2015-11-30",500000,"inter"]
["2015-10-01","Facture","00000526",600000,3,"2015-10-04",57,"2015-11-30",600000,"inter"]
["2015-10-01","Facture","00000527",500000,3,"2015-10-04",57,"2015-11-30",500000,"inter"]
["2015-10-01","Facture","00000566",120000,3,"2015-10-04",57,"2015-11-30",120000,"inter"]
["2015-10-01","Facture","00000581",250000,3,"2015-10-04",57,"2015-11-30",250000,"inter"]
["2015-10-01","Facture","00000616",4650000,3,"2015-10-04",57,"2015-11-30",4650000,"inter"]
["2015-10-01","Facture","00000622",300000,3,"2015-10-04",57,"2015-11-30",300000,"inter"]
["2015-10-01","Facture","00000639",3000000,3,"2015-10-04",57,"2015-11-30",3000000,"inter"]
["2015-10-01","Facture","00000655",350000,3,"2015-10-04",57,"2015-11-30",350000,"inter"]
["2015-10-01","Facture","00000673",1500000,3,"2015-10-04",57,"2015-11-30",1500000,"inter"]
["2015-10-01","Facture","00000682",300000,3,"2015-10-04",57,"2015-11-30",300000,"inter"]
["2015-10-01","Facture","00000692",100000,3,"2015-10-04",57,"2015-11-30",100000,"inter"]
["2015-10-01","Facture","00000694",100000,3,"2015-10-04",57,"2015-11-30",100000,"inter"]
["2015-10-01","Facture","00000705",200000,3,"2015-10-04",57,"2015-11-30",200000,"inter"]
["2015-10-01","Facture","00000709",250000,3,"2015-10-04",57,"2015-11-30",250000,"inter"]
["2015-10-01","Facture","00000713",500000,3,"2015-10-04",57,"2015-11-30",500000,"inter"]
["2015-10-01","Facture","00000718",200000,3,"2015-10-04",57,"2015-11-30",200000,"inter"]
["2015-10-01","Facture","00000727",200000,3,"2015-10-04",57,"2015-11-30",200000,"inter"]
["2015-10-01","Facture","00000732",200000,3,"2015-10-04",57,"2015-11-30",200000,"inter"]
["2015-10-01","Facture","00000735",200000,3,"2015-10-04",57,"2015-11-30",200000,"inter"]
["2015-10-01","Facture","00000741",600000,3,"2015-10-04",57,"2015-11-30",600000,"inter"]
["2015-10-01","Facture","00000742",200000,3,"2015-10-04",57,"2015-11-30",200000,"inter"]
["2015-10-01","Facture","00000773",100000,3,"2015-10-04",57,"2015-11-30",100000,"inter"]
["2015-10-01","Facture","00000776",600000,3,"2015-10-04",57,"2015-11-30",600000,"inter"]
["2015-10-01","Facture","00000778",500000,3,"2015-10-04",57,"2015-11-30",500000,"inter"]
["2015-10-01","Facture","00000780",150000,3,"2015-10-04",57,"2015-11-30",150000,"inter"]
["2015-10-01","Facture","00000783",100000,3,"2015-10-04",57,"2015-11-30",100000,"inter"]
["2015-10-01","Facture","00000786",3900000,3,"2015-10-04",57,"2015-11-30",3900000,"inter"]
["2015-10-01","Facture","00000788",200000,3,"2015-10-04",57,"2015-11-30",200000,"inter"]
["2015-10-01","Facture","00000789",200000,3,"2015-10-04",57,"2015-11-30",200000,"inter"]
["2015-10-01","Facture","00000790",200000,3,"2015-10-04",57,"2015-11-30",200000,"inter"]
["2015-10-01","Facture","00000791",200000,3,"2015-10-04",57,"2015-11-30",200000,"inter"]
["2015-10-01","Facture","00000792",200000,3,"2015-10-04",57,"2015-11-30",200000,"inter"]
["2015-10-02","Facture","00000008",200000,3,{"$f":"E312+A312","v":"2015-10-05"},{"$f":"IF(I312=0,\"\",H312-F312)","v":56},{"$f":"TODAY()","v":"2015-11-30"},{"$f":"D312","v":200000},{"$f":"IF(AND(I312<>0,F312>=H312),\"ras\",IF(I312=0,\"soldé\",\"inter\"))","v":"inter"}]
["2015-10-02","Facture","00000013",1000000,3,"2015-10-05",56,"2015-11-30",1000000,"inter"]
["2015-10-02","Facture","00000016",1000000,3,"2015-10-05",56,"2015-11-30",1000000,"inter"]
["2015-10-02","Facture","00000028",2000000,3,"2015-10-05",56,"2015-11-30",2000000,"inter"]
["2015-10-02","Facture","00000033",500000,3,"2015-10-05",56,"2015-11-30",500000,"inter"]
["2015-10-02","Facture","00000038",1000000,3,"2015-10-05",56,"2015-11-30",1000000,"inter"]
["2015-10-02","Facture","00000040",500000,3,"2015-10-05",56,"2015-11-30",500000,"inter"]
["2015-10-02","Facture","00000041",200000,3,"2015-10-05",56,"2015-11-30",200000,"inter"]
["2015-10-02","Facture","00000052",300000,3,"2015-10-05",56,"2015-11-30",300000,"inter"]
["2015-10-02","Facture","00000064",1000000,3,"2015-10-05",56,"2015-11-30",1000000,"inter"]
["2015-10-02","Facture","00000089",200000,3,"2015-10-05",56,"2015-11-30",200000,"inter"]
["2015-10-02","Facture","00000097",2200000,3,"2015-10-05",56,"2015-11-30",2200000,"inter"]
["2015-10-02","Facture","00000101",100000,3,"2015-10-05",56,"2015-11-30",100000,"inter"]
["2015-10-02","Facture","00000104",300000,3,"2015-10-05",56,"2015-11-30",300000,"inter"]
["2015-10-02","Facture","00000116",2000000,3,"2015-10-05",56,"2015-11-30",2000000,"inter"]
["2015-10-02","Facture","00000128",900000,3,"2015-10-05",56,"2015-11-30",900000,"inter"]
["2015-10-02","Facture","00000133",850000,3,"2015-10-05",56,"2015-11-30",850000,"inter"]
["2015-10-02","Facture","00000137",100000,3,"2015-10-05",56,"2015-11-30",100000,"inter"]
["2015-10-02","Facture","00000141",1000000,3,"2015-10-05",56,"2015-11-30",1000000,"inter"]
["2015-10-02","Facture","00000144",500000,3,"2015-10-05",56,"2015-11-30",500000,"inter"]
["2015-10-02","Facture","00000151",500000,3,"2015-10-05",56,"2015-11-30",500000,"inter"]
["2015-10-02","Facture","00000179",1500000,3,"2015-10-05",56,"2015-11-30",1500000,"inter"]
["2015-10-02","Facture","00000187",150000,3,"2015-10-05",56,"2015-11-30",150000,"inter"]
["2015-10-02","Facture","00000202",1000000,3,"2015-10-05",56,"2015-11-30",1000000,"inter"]
["2015-10-02","Facture","00000223",800000,3,"2015-10-05",56,"2015-11-30",800000,"inter"]
["2015-10-02","Facture","00000231",3200000,3,"2015-10-05",56,"2015-11-30",3200000,"inter"]
["2015-10-02","Facture","00000232",5000000,3,"2015-10-05",56,"2015-11-30",5000000,"inter"]
["2015-10-02","Facture","00000236",1500000,3,"2015-10-05",56,"2015-11-30",1500000,"inter"]
["2015-10-02","Facture","00000244",2500000,3,"2015-10-05",56,"2015-11-30",2500000,"inter"]
["2015-10-02","Facture","00000271",500000,3,"2015-10-05",56,"2015-11-30",500000,"inter"]
["2015-10-02","Facture","00000275",400000,3,"2015-10-05",56,"2015-11-30",400000,"inter"]
["2015-10-02","Facture","00000293",2000000,3,"2015-10-05",56,"2015-11-30",2000000,"inter"]
["2015-10-02","Facture","00000294",950000,3,{"$f":"E344+A344","v":"2015-10-05"},{"$f":"IF(I344=0,\"\",H344-F344)","v":56},{"$f":"TODAY()","v":"2015-11-30"},{"$f":"D344","v":950000},{"$f":"IF(AND(I344<>0,F344>=H344),\"ras\",IF(I344=0,\"soldé\",\"inter\"))","v":"inter"}]
["2015-10-02","Facture","00000305",400000,3,"2015-10-05",56,"2015-11-30",400000,"inter"]
["2015-10-02","Facture","00000323",1500000,3,"2015-10-05",56,"2015-11-30",1500000,"inter"]
["2015-10-02","Facture","00000339",150000,3,"2015-10-05",56,"2015-11-30",150000,"inter"]
["2015-10-02","Facture","00000349",500000,3,"2015-10-05",56,"2015-11-30",500000,"inter"]
["2015-10-02","Facture","00000355",700000,3,"2015-10-05",56,"2015-11-30",700000,"inter"]
["2015-10-02","Facture","00000361",300000,3,"2015-10-05",56,"2015-11-30",300000,"inter"]
["2015-10-02","Facture","00000363",300000,3,"2015-10-05",56,"2015-11-30",300000,"inter"]
["2015-10-02","Facture","00000366",700000,3,"2015-10-05",56,"2015-11-30",700000,"inter"]
["2015-10-02","Facture","00000379",500000,3,"2015-10-05",56,"2015-11-30",500000,"inter"]
["2015-10-02","Facture","00000385",200000,3,"2015-10-05",56,"2015-11-30",200000,"inter"]
["2015-10-02","Facture","00000389",2800000,3,"2015-10-05",56,"2015-11-30",2800000,"inter"]
["2015-10-02","Facture","00000391",150000,3,"2015-10-05",56,"2015-11-30",150000,"inter"]
["2015-10-02","Facture","00000392",2100000,3,"2015-10-05",56,"2015-11-30",2100000,"inter"]
["2015-10-02","Facture","00000406",700000,3,"2015-10-05",56,"2015-11-30",700000,"inter"]
["2015-10-02","Facture","00000412",500000,3,"2015-10-05",56,"2015-11-30",500000,"inter"]
["2015-10-02","Facture","00000442",200000,3,"2015-10-05",56,"2015-11-30",200000,"inter"]
["2015-10-02","Facture","00000480",1000000,3,"2015-10-05",56,"2015-11-30",1000000,"inter"]
["2015-10-02","Facture","00000491",500000,3,"2015-10-05",56,"2015-11-30",500000,"inter"]
["2015-10-02","Facture","00000520",300000,3,"2015-10-05",56,"2015-11-30",300000,"inter"]
["2015-10-02","Facture","00000526",900000,3,"2015-10-05",56,"2015-11-30",900000,"inter"]
["2015-10-02","Facture","00000527",500000,3,"2015-10-05",56,"2015-11-30",500000,"inter"]
["2015-10-02","Facture","00000550",200000,3,"2015-10-05",56,"2015-11-30",200000,"inter"]
["2015-10-02","Facture","00000551",500000,3,"2015-10-05",56,"2015-11-30",500000,"inter"]
["2015-10-02","Facture","00000566",220000,3,"2015-10-05",56,"2015-11-30",220000,"inter"]
["2015-10-02","Facture","00000581",1000000,3,"2015-10-05",56,"2015-11-30",1000000,"inter"]
["2015-10-02","Facture","00000612",1000000,3,"2015-10-05",56,"2015-11-30",1000000,"inter"]
["2015-10-02","Facture","00000616",3550000,3,"2015-10-05",56,"2015-11-30",3550000,"inter"]
["2015-10-02","Facture","00000622",500000,3,"2015-10-05",56,"2015-11-30",500000,"inter"]
["2015-10-02","Facture","00000638",85000,3,"2015-10-05",56,"2015-11-30",85000,"inter"]
["2015-10-02","Facture","00000639",5700000,3,"2015-10-05",56,"2015-11-30",5700000,"inter"]
["2015-10-02","Facture","00000650",600000,3,"2015-10-05",56,"2015-11-30",600000,"inter"]
["2015-10-02","Facture","00000653",300000,3,{"$f":"E376+A376","v":"2015-10-05"},{"$f":"IF(I376=0,\"\",H376-F376)","v":56},{"$f":"TODAY()","v":"2015-11-30"},{"$f":"D376","v":300000},{"$f":"IF(AND(I376<>0,F376>=H376),\"ras\",IF(I376=0,\"soldé\",\"inter\"))","v":"inter"}]
["2015-10-02","Facture","00000655",1400000,3,"2015-10-05",56,"2015-11-30",1400000,"inter"]
["2015-10-02","Facture","00000658",300000,3,"2015-10-05",56,"2015-11-30",300000,"inter"]
["2015-10-02","Facture","00000668",700000,3,"2015-10-05",56,"2015-11-30",700000,"inter"]
["2015-10-02","Facture","00000677",480000,3,"2015-10-05",56,"2015-11-30",480000,"inter"]
["2015-10-02","Facture","00000678",200000,3,"2015-10-05",56,"2015-11-30",200000,"inter"]
["2015-10-02","Facture","00000683",200000,3,"2015-10-05",56,"2015-11-30",200000,"inter"]
["2015-10-02","Facture","00000686",200000,3,"2015-10-05",56,"2015-11-30",200000,"inter"]
["2015-10-02","Facture","00000687",300000,3,"2015-10-05",56,"2015-11-30",300000,"inter"]
["2015-10-02","Facture","00000690",300000,3,"2015-10-05",56,"2015-11-30",300000,"inter"]
["2015-10-02","Facture","00000692",1500000,3,"2015-10-05",56,"2015-11-30",1500000,"inter"]
["2015-10-02","Facture","00000694",200000,3,"2015-10-05",56,"2015-11-30",200000,"inter"]
["2015-10-02","Facture","00000697",200000,3,"2015-10-05",56,"2015-11-30",200000,"inter"]
["2015-10-02","Facture","00000715",300000,3,"2015-10-05",56,"2015-11-30",300000,"inter"]
["2015-10-02","Facture","00000716",600000,3,"2015-10-05",56,"2015-11-30",600000,"inter"]
["2015-10-02","Facture","00000720",400000,3,"2015-10-05",56,"2015-11-30",400000,"inter"]
["2015-10-02","Facture","00000724",300000,3,"2015-10-05",56,"2015-11-30",300000,"inter"]
["2015-10-02","Facture","00000725",100000,3,"2015-10-05",56,"2015-11-30",100000,"inter"]
["2015-10-02","Facture","00000728",400000,3,"2015-10-05",56,"2015-11-30",400000,"inter"]
["2015-10-02","Facture","00000729",100000,3,"2015-10-05",56,"2015-11-30",100000,"inter"]
["2015-10-02","Facture","00000730",400000,3,"2015-10-05",56,"2015-11-30",400000,"inter"]
["2015-10-02","Facture","00000736",1000000,3,"2015-10-05",56,"2015-11-30",1000000,"inter"]
["2015-10-02","Facture","00000746",500000,3,"2015-10-05",56,"2015-11-30",500000,"inter"]
["2015-10-02","Facture","00000748",1000000,3,"2015-10-05",56,"2015-11-30",1000000,"inter"]
["2015-10-02","Facture","00000752",1500000,3,"2015-10-05",56,"2015-11-30",1500000,"inter"]
["2015-10-02","Facture","00000758",100000,3,"2015-10-05",56,"2015-11-30",100000,"inter"]
["2015-10-02","Facture","00000763",360000,3,"2015-10-05",56,"2015-11-30",360000,"inter"]
["2015-10-02","Facture","00000780",250000,3,"2015-10-05",56,"2015-11-30",250000,"inter"]
["2015-10-02","Facture","00000785",500000,3,"2015-10-05",56,"2015-11-30",500000,"inter"]
["2015-10-02","Facture","00000786",2300000,3,"2015-10-05",56,"2015-11-30",2300000,"inter"]
["2015-10-03","Facture","00000008",500000,3,{"$f":"E406+A406","v":"2015-10-06"},{"$f":"IF(I406=0,\"\",H406-F406)","v":55},{"$f":"TODAY()","v":"2015-11-30"},{"$f":"D406","v":500000},{"$f":"IF(AND(I406<>0,F406>=H406),\"ras\",IF(I406=0,\"soldé\",\"inter\"))","v":"inter"}]
["2015-10-03","Facture","00000014",2000000,3,"2015-10-06",55,"2015-11-30",2000000,"inter"]
["2015-10-03","Facture","00000015",500000,3,"2015-10-06",55,"2015-11-30",500000,"inter"]
["2015-10-03","Facture","00000028",4000000,3,"2015-10-06",55,"2015-11-30",4000000,"inter"]
["2015-10-03","Facture","00000029",1000000,3,"2015-10-06",55,"2015-11-30",1000000,"inter"]
["2015-10-03","Facture","00000040",300000,3,"2015-10-06",55,"2015-11-30",300000,"inter"]
["2015-10-03","Facture","00000041",200000,3,"2015-10-06",55,"2015-11-30",200000,"inter"]
["2015-10-03","Facture","00000063",500000,3,"2015-10-06",55,"2015-11-30",500000,"inter"]
["2015-10-03","Facture","00000064",1000000,3,"2015-10-06",55,"2015-11-30",1000000,"inter"]
["2015-10-03","Facture","00000080",1000000,3,"2015-10-06",55,"2015-11-30",1000000,"inter"]
["2015-10-03","Facture","00000082",500000,3,"2015-10-06",55,"2015-11-30",500000,"inter"]
["2015-10-03","Facture","00000089",1000000,3,"2015-10-06",55,"2015-11-30",1000000,"inter"]
["2015-10-03","Facture","00000101",500000,3,"2015-10-06",55,"2015-11-30",500000,"inter"]
["2015-10-03","Facture","00000103",1500000,3,"2015-10-06",55,"2015-11-30",1500000,"inter"]
["2015-10-03","Facture","00000111",600000,3,"2015-10-06",55,"2015-11-30",600000,"inter"]
["2015-10-03","Facture","00000116",300000,3,"2015-10-06",55,"2015-11-30",300000,"inter"]
["2015-10-03","Facture","00000143",500000,3,"2015-10-06",55,"2015-11-30",500000,"inter"]
["2015-10-03","Facture","00000144",1000000,3,"2015-10-06",55,"2015-11-30",1000000,"inter"]
["2015-10-03","Facture","00000151",750000,3,"2015-10-06",55,"2015-11-30",750000,"inter"]
["2015-10-03","Facture","00000170",200000,3,"2015-10-06",55,"2015-11-30",200000,"inter"]
["2015-10-03","Facture","00000176",200000,3,"2015-10-06",55,"2015-11-30",200000,"inter"]
["2015-10-03","Facture","00000178",1800000,3,"2015-10-06",55,"2015-11-30",1800000,"inter"]
["2015-10-03","Facture","00000179",1400000,3,"2015-10-06",55,"2015-11-30",1400000,"inter"]
["2015-10-03","Facture","00000184",1000000,3,"2015-10-06",55,"2015-11-30",1000000,"inter"]
["2015-10-03","Facture","00000187",350000,3,"2015-10-06",55,"2015-11-30",350000,"inter"]
["2015-10-03","Facture","00000197",500000,3,"2015-10-06",55,"2015-11-30",500000,"inter"]
["2015-10-03","Facture","00000202",1300000,3,"2015-10-06",55,"2015-11-30",1300000,"inter"]
["2015-10-03","Facture","00000231",800000,3,"2015-10-06",55,"2015-11-30",800000,"inter"]
["2015-10-03","Facture","00000236",600000,3,"2015-10-06",55,"2015-11-30",600000,"inter"]
["2015-10-03","Facture","00000238",2500000,3,"2015-10-06",55,"2015-11-30",2500000,"inter"]
["2015-10-03","Facture","00000245",2000000,3,"2015-10-06",55,"2015-11-30",2000000,"inter"]
["2015-10-03","Facture","00000273",1000000,3,"2015-10-06",55,"2015-11-30",1000000,"inter"]
["2015-10-03","Facture","00000275",600000,3,{"$f":"E438+A438","v":"2015-10-06"},{"$f":"IF(I438=0,\"\",H438-F438)","v":55},{"$f":"TODAY()","v":"2015-11-30"},{"$f":"D438","v":600000},{"$f":"IF(AND(I438<>0,F438>=H438),\"ras\",IF(I438=0,\"soldé\",\"inter\"))","v":"inter"}]
["2015-10-03","Facture","00000283",300000,3,"2015-10-06",55,"2015-11-30",300000,"inter"]
["2015-10-03","Facture","00000294",1900000,3,"2015-10-06",55,"2015-11-30",1900000,"inter"]
["2015-10-03","Facture","00000305",600000,3,"2015-10-06",55,"2015-11-30",600000,"inter"]
["2015-10-03","Facture","00000309",1000000,3,"2015-10-06",55,"2015-11-30",1000000,"inter"]
["2015-10-03","Facture","00000319",1000000,3,"2015-10-06",55,"2015-11-30",1000000,"inter"]
["2015-10-03","Facture","00000327",1000000,3,"2015-10-06",55,"2015-11-30",1000000,"inter"]
["2015-10-03","Facture","00000336",200000,3,"2015-10-06",55,"2015-11-30",200000,"inter"]
["2015-10-03","Facture","00000339",150000,3,"2015-10-06",55,"2015-11-30",150000,"inter"]
["2015-10-03","Facture","00000341",2000000,3,"2015-10-06",55,"2015-11-30",2000000,"inter"]
["2015-10-03","Facture","00000349",1000000,3,"2015-10-06",55,"2015-11-30",1000000,"inter"]
["2015-10-03","Facture","00000355",1100000,3,"2015-10-06",55,"2015-11-30",1100000,"inter"]
["2015-10-03","Facture","00000356",400000,3,"2015-10-06",55,"2015-11-30",400000,"inter"]
["2015-10-03","Facture","00000364",1000000,3,"2015-10-06",55,"2015-11-30",1000000,"inter"]
["2015-10-03","Facture","00000379",900000,3,"2015-10-06",55,"2015-11-30",900000,"inter"]
["2015-10-03","Facture","00000406",1500000,3,"2015-10-06",55,"2015-11-30",1500000,"inter"]
["2015-10-03","Facture","00000442",300000,3,"2015-10-06",55,"2015-11-30",300000,"inter"]
["2015-10-03","Facture","00000491",1000000,3,"2015-10-06",55,"2015-11-30",1000000,"inter"]
["2015-10-03","Facture","00000520",450000,3,"2015-10-06",55,"2015-11-30",450000,"inter"]
["2015-10-03","Facture","00000526",1200000,3,"2015-10-06",55,"2015-11-30",1200000,"inter"]
["2015-10-03","Facture","00000550",300000,3,"2015-10-06",55,"2015-11-30",300000,"inter"]
["2015-10-03","Facture","00000612",1000000,3,"2015-10-06",55,"2015-11-30",1000000,"inter"]
["2015-10-03","Facture","00000616",15400000,3,"2015-10-06",55,"2015-11-30",15400000,"inter"]
["2015-10-03","Facture","00000628",600000,3,"2015-10-06",55,"2015-11-30",600000,"inter"]
["2015-10-03","Facture","00000637",200000,3,"2015-10-06",55,"2015-11-30",200000,"inter"]
["2015-10-03","Facture","00000639",5650000,3,"2015-10-06",55,"2015-11-30",5650000,"inter"]
["2015-10-03","Facture","00000653",500000,3,"2015-10-06",55,"2015-11-30",500000,"inter"]
["2015-10-03","Facture","00000655",1200000,3,"2015-10-06",55,"2015-11-30",1200000,"inter"]
["2015-10-03","Facture","00000673",750000,3,"2015-10-06",55,"2015-11-30",750000,"inter"]
["2015-10-03","Facture","00000676",200000,3,"2015-10-06",55,"2015-11-30",200000,"inter"]
["2015-10-03","Facture","00000682",1000000,3,"2015-10-06",55,"2015-11-30",1000000,"inter"]
["2015-10-03","Facture","00000683",200000,3,"2015-10-06",55,"2015-11-30",200000,"inter"]
["2015-10-03","Facture","00000686",150000,3,{"$f":"E470+A470","v":"2015-10-06"},{"$f":"IF(I470=0,\"\",H470-F470)","v":55},{"$f":"TODAY()","v":"2015-11-30"},{"$f":"D470","v":150000},{"$f":"IF(AND(I470<>0,F470>=H470),\"ras\",IF(I470=0,\"soldé\",\"inter\"))","v":"inter"}]
["2015-10-03","Facture","00000694",200000,3,"2015-10-06",55,"2015-11-30",200000,"inter"]
["2015-10-03","Facture","00000697",200000,3,"2015-10-06",55,"2015-11-30",200000,"inter"]
["2015-10-03","Facture","00000698",200000,3,"2015-10-06",55,"2015-11-30",200000,"inter"]
["2015-10-03","Facture","00000705",200000,3,"2015-10-06",55,"2015-11-30",200000,"inter"]
["2015-10-03","Facture","00000715",300000,3,"2015-10-06",55,"2015-11-30",300000,"inter"]
["2015-10-03","Facture","00000716",700000,3,"2015-10-06",55,"2015-11-30",700000,"inter"]
["2015-10-03","Facture","00000724",300000,3,"2015-10-06",55,"2015-11-30",300000,"inter"]
["2015-10-03","Facture","00000725",500000,3,"2015-10-06",55,"2015-11-30",500000,"inter"]
["2015-10-03","Facture","00000735",200000,3,"2015-10-06",55,"2015-11-30",200000,"inter"]
["2015-10-03","Facture","00000739",50000,3,"2015-10-06",55,"2015-11-30",50000,"inter"]
["2015-10-03","Facture","00000741",700000,3,"2015-10-06",55,"2015-11-30",700000,"inter"]
["2015-10-03","Facture","00000742",300000,3,"2015-10-06",55,"2015-11-30",300000,"inter"]
["2015-10-03","Facture","00000748",2000000,3,"2015-10-06",55,"2015-11-30",2000000,"inter"]
["2015-10-03","Facture","00000754",100000,3,"2015-10-06",55,"2015-11-30",100000,"inter"]
["2015-10-03","Facture","00000763",600000,3,"2015-10-06",55,"2015-11-30",600000,"inter"]
["2015-10-03","Facture","00000769",200000,3,"2015-10-06",55,"2015-11-30",200000,"inter"]
["2015-10-03","Facture","00000774",200000,3,"2015-10-06",55,"2015-11-30",200000,"inter"]
["2015-10-03","Facture","00000776",500000,3,"2015-10-06",55,"2015-11-30",500000,"inter"]
["2015-10-03","Facture","00000781",500000,3,"2015-10-06",55,"2015-11-30",500000,"inter"]
["2015-10-03","Facture","00000783",150000,3,"2015-10-06",55,"2015-11-30",150000,"inter"]
["2015-10-03","Facture","00000785",200000,3,"2015-10-06",55,"2015-11-30",200000,"inter"]
["2015-10-03","Facture","00000786",3500000,3,"2015-10-06",55,"2015-11-30",3500000,"inter"]
["2015-10-03","Facture","00000789",200000,3,"2015-10-06",55,"2015-11-30",200000,"inter"]
["2015-10-03","Facture","00000790",200000,3,"2015-10-06",55,"2015-11-30",200000,"inter"]
["2015-10-03","Facture","00000792",200000,3,"2015-10-06",55,"2015-11-30",200000,"inter"]
["2015-10-04","Facture","00000081",1000000,3,{"$f":"E496+A496","v":"2015-10-07"},{"$f":"IF(I496=0,\"\",H496-F496)","v":54},{"$f":"TODAY()","v":"2015-11-30"},{"$f":"D496","v":1000000},{"$f":"IF(AND(I496<>0,F496>=H496),\"ras\",IF(I496=0,\"soldé\",\"inter\"))","v":"inter"}]
["2015-10-04","Facture","00000141",1000000,3,"2015-10-07",54,"2015-11-30",1000000,"inter"]
["2015-10-04","Facture","00000232",500000,3,"2015-10-07",54,"2015-11-30",500000,"inter"]
["2015-10-04","Facture","00000313",200000,3,"2015-10-07",54,"2015-11-30",200000,"inter"]
["2015-10-04","Facture","00000339",150000,3,"2015-10-07",54,"2015-11-30",150000,"inter"]
["2015-10-04","Facture","00000371",3000000,3,"2015-10-07",54,"2015-11-30",3000000,"inter"]
["2015-10-04","Facture","00000391",200000,3,"2015-10-07",54,"2015-11-30",200000,"inter"]
["2015-10-04","Facture","00000480",1000000,3,"2015-10-07",54,"2015-11-30",1000000,"inter"]
["2015-10-04","Facture","00000527",500000,3,"2015-10-07",54,"2015-11-30",500000,"inter"]
["2015-10-04","Facture","00000581",500000,3,"2015-10-07",54,"2015-11-30",500000,"inter"]
["2015-10-04","Facture","00000677",300000,3,"2015-10-07",54,"2015-11-30",300000,"inter"]
["2015-10-04","Facture","00000709",200000,3,"2015-10-07",54,"2015-11-30",200000,"inter"]
["2015-10-04","Facture","00000718",200000,3,"2015-10-07",54,"2015-11-30",200000,"inter"]

{"sheet":"DONNEES","index":1,"n_rows":0,"n_cols":0,"rows_kept":0,"cut":false,"hidden":false,"merged":[]}

{"sheet":"ENCAISSEMENTS","index":2,"n_rows":1,"n_cols":3,"rows_kept":1,"cut":false,"hidden":false,"merged":[]}
["Date","Client","Montant"]