{"text_format":"1","workbook":"xlsx","n_sheets":45,"sheets":["Formulaire","Informations","Chambres positives","Chambres négative","Clim existante","Production positive","Production négative","Zones climatique","Puissances MFV","Décompo Projet","Table condenseur","DATA","Decompo DB recup","Table Meubles","Table évap","Decompo DB","Puissance unitaire","Selection compresseurs","Récap centrale ","Besoins frigo","Centrale -","Centrale +","Table CFP 1","Table CFP 2","Table CFP 3","Table CFP 4","Table CFP 5","Table CFP 6","Table CFP 7","Table CFP 8","Table CFN 1","Table CFN 2","Table CFN 3","Table CFN 4","Table CFN 5","Table CFN 6","Table CFN 7","Table CFN 8","Devis","Sélection Comp. négatif","Tableau synthèse","Sélection Comp.positif","Tableau synthèse (2)","formulaire1","Explication"],"not_rendered":{"charts":0,"images":23,"macros":1,"external_links":6,"defined_names":8074,"comments":4,"pivot_tables":0},"unopened":[],"bounds":{"document_bytes":16777216,"sheet_cells":100000,"rows_first":2000,"rows_last":500,"rows_between":2000,"halvings":0,"cell_chars":16384,"cell_head_chars":4096},"cells_cut":0,"cells_raw":0,"read":"whole","date_system":"1900"}

{"sheet":"Formulaire","index":0,"n_rows":49,"n_cols":7,"rows_kept":49,"cut":false,"hidden":false,"merged":[[36,4,36,8],[48,4,48,8],[0,3,2,8],[4,6,4,10],[14,6,14,10],[25,6,25,10],[4,0,4,4],[14,0,14,4],[25,0,25,4]]}
[null,null,null,"Bienvenue dans l'outil de dimensionnement \nde magasin de la grande distribution alimentaire\nSuivez les étapes pas à pas et obtenez votre devis !\nCliquez sur les images pour accéder à la saisie"]
["validé"]
["non terminé"]
[]
["Étape 1 : Saisissez les informations concernant votre futur magasin ",null,null,null,null,null,"Étape 4 : Établissez votre sélection de chambre(s) froide positive"]
[]
[]
[]
[]
[]
[]
[]
[]
[]
["Étape 2 : Établissez votre sélection de meuble(s) frigorifiques positifs",null,null,null,null,null,"Étape 5 : Établissez votre sélection de chambre(s) froide négative"]
[]
[]
[]
[]
[]
[]
[]
[]
[]
[]
["Étape 3 : Établissez votre sélection de meuble(s) frigorifiques Négatifs",null,null,null,null,null,"Étape 6 : Renseignez vos climatisations existantes "]
[]
[]
[]
[]
[]
[]
[]
[]
[]
[]
[null,null,null,null,"Étape 7 : Établissez votre sélection de compresseurs POSITIF"]
[]
[]
[]
[]
[]
[]
[]
[]
[]
[]
[]
[null,null,null,null,"Étape 8 : Établissez votre sélection de compresseurs NÉGATIF"]

{"sheet":"Informations","index":1,"n_rows":46,"n_cols":12,"rows_kept":46,"cut":false,"hidden":true,"merged":[[7,2,7,5],[1,0,2,1],[1,2,2,6],[4,2,4,6],[5,2,5,5],[6,2,6,5],[19,2,19,5],[8,2,8,5],[9,2,9,5],[10,2,10,5],[11,2,11,5],[12,2,12,5],[13,2,13,5],[14,2,14,5],[15,2,15,5],[16,2,16,5],[17,2,17,5],[18,2,18,6],[22,1,23,1],[22,2,22,5],[23,2,23,5],[24,2,24,5],[26,2,26,6],[38,2,38,6],[33,2,33,5],[31,2,31,6],[20,2,20,5],[21,2,21,5],[27,2,27,5],[28,2,28,5],[29,2,29,5],[30,2,30,5],[32,2,32,5],[34,2,34,5],[35,2,35,6],[36,2,36,5],[37,2,37,5],[42,2,42,6],[43,2,43,5],[44,2,44,6],[45,2,45,5],[39,2,39,5],[40,2,40,6],[41,2,41,5]]}
[]
[null,null,"1 : INFORMATIONS GÉNÉRALE"]
[null,null,null,null,null,null,null,null,"Case à remplir"]
[]
[null,null,"RENSEIGNEMENTS"]
[null,null,"Adresse du site (N°, rue)",null,null,null,null,null,null,null,null,1]
[null,null,"Ville"]
[null,null,"Code postal"]
[null,null,"Pays",null,null,null,null,null,null,null,null,"Suisse"]
[null,null,"Département",null,null,null,{"$f":"VALUE(LEFT(G8,2))","v":{"$error":"#VALUE!"}},null,null,null,null,"France"]
[null,null,"Superficie SDV (en m2)",null,null,null,null,null,null,null,null,"Russie"]
[null,null,"Hauteur Sous Plafond (m)",null,null,null,null,null,null,null,null,"Angleterre"]
[null,null,"Volume SDV  (m3)",null,null,null,{"$f":"G11*G12","v":0},null,null,null,null,"Allemagne"]
[null,null,"Activité du magasin",null,null,null,null,null,null,null,null,"Espagne"]
[null,null,"Superficie Réserve   (en m2)"]
[null,null,"Batiment"]
[null,null,"Année de construction"]
[null,null,"Année de rénovation"]
[null,null,"ENVELOPPE THERMIQUE"]
[null,null,"Orientation façade principale (entrée)"]
[null,null,"Isolation du bâtiment"]
[null,null,"Zone climatique",null,null,null,{"$f":"VLOOKUP(G10,'Zones climatique'!BB2:BC97,2,FALSE)","v":{"$error":"#VALUE!"}},null,null,{"$f":"IF(AND(G22=\"H1\",G22=\"H2\",G22=\"H3\"),\"H1\",\"H2\")","v":{"$error":"#VALUE!"}}]
[null,"HIVER","Température de base",null,null,null,{"$f":"VLOOKUP(G22,'Zones climatique'!C60:E62,2,FALSE)","v":{"$error":"#VALUE!"}}]
[null,null,"Température de base ajustée",null,null,null,{"$f":"IF(G28>200,G23-0.01*G28,G23)","v":{"$error":"#VALUE!"}}]
[null,"ÉTÉ","Température de base ajustée",null,null,null,{"$f":"VLOOKUP(G22,'Zones climatique'!C60:E62,3,FALSE)","v":{"$error":"#VALUE!"}}]
[]
[null,null,"CONTRAINTES"]
[null,null,"Altitude  (en m)"]
[null,null,"Distance mer / océan  (en km)"]
[null,null,"Distance SDV / tiers voisinage  (en m)"]
[null,null,"Bruit ambiant"]
[null,null,"CLIMATISATION"]
[null,null,"Avez-vous un(des) groupe(s) de climatisation que vous voulez récupérer ?"]
[null,null,"Si oui, combien de clim récupéré ?"]
[null,null,"Si oui, quelle est la puissance froide totale de ce(s) groupe(s) ? (kW)"]
[null,null,"SALLE DES MACHINES"]
[null,null,"Y aura-t'il une salle des machines ?"]
[null,null,"Si oui, sera-t-elle équipée de grilles de ventilation ?"]
[null,null,"CENTRALE POSITIVE"]
[null,null,"Nombre de compresseurs minimum souhaité ?"]
[null,null,"CENTRALE NEGATIVE"]
[null,null,"Nombre de compresseurs minimum souhaité ?"]
[null,null,"Chambre froide positive"]
[null,null,"nombre de chambre froide positive souhaité ?",null,null,null,5]
[null,null,"Chambre froide négative"]
[null,null,"nombre de chambre froide négative souhaité ?"]

{"sheet":"Chambres positives","index":2,"n_rows":25,"n_cols":12,"rows_kept":25,"cut":false,"hidden":true,"merged":[[20,6,21,6],[20,7,21,7],[22,0,23,3],[22,4,23,4],[22,5,23,5],[22,6,23,6],[22,7,23,7],[18,0,18,3],[19,0,19,3],[20,0,21,3],[20,4,21,4],[20,5,21,5],[13,0,13,11],[2,0,2,3],[3,0,3,3],[20,8,21,8],[20,9,21,9],[20,10,21,10],[20,11,21,11],[11,6,11,7],[14,0,14,3],[15,0,15,3],[17,0,17,3],[7,0,7,3],[8,0,8,3],[9,0,9,3],[10,0,10,3],[6,0,6,11],[22,8,23,8],[22,9,23,9],[22,10,23,10],[22,11,23,11],[24,0,24,3]]}
[]
[]
["Chambre",null,null,null,1,2,3,4,5,6,7,8]
["Existera t'elle ? (Réfection ou création)"]
["Utilisation de la chambre"]
[]
["                                                                               DIMENSIONS"]
["Largeur"]
["Longueur"]
["Hauteur sous plafond"]
["Température extérieure",null,null,null,{"$f":"Informations!$G$25","v":{"$error":"#VALUE!"}},{"$f":"Informations!$G$25","v":{"$error":"#VALUE!"}},{"$f":"Informations!$G$25","v":{"$error":"#VALUE!"}},{"$f":"Informations!$G$25","v":{"$error":"#VALUE!"}},{"$f":"Informations!$G$25","v":{"$error":"#VALUE!"}},{"$f":"Informations!$G$25","v":{"$error":"#VALUE!"}},{"$f":"Informations!$G$25","v":{"$error":"#VALUE!"}},{"$f":"Informations!$G$25","v":{"$error":"#VALUE!"}}]
[]
[]
["Possibilité de récupérer l'ÉVAPORATEUR d'une chambre existante (si en bon état)"]
["Évaporateur existant"]
["Action"]
[]
["Puissance",null,null,null,{"$f":"IF(E4=\"oui\",'Table CFP 1'!$K$82,\"\")","v":""},{"$f":"IF(F4=\"oui\",'Table CFP 2'!$K$82,\"\")","v":""},{"$f":"IF(G4=\"oui\",'Table CFP 3'!$K$82,\"\")","v":""},{"$f":"IF(H4=\"oui\",'Table CFP 4'!$K$82,\"\")","v":""},{"$f":"IF(I4=\"oui\",'Table CFP 5'!$K$82,\"\")","v":""},{"$f":"IF(J4=\"oui\",'Table CFP 6'!$K$82,\"\")","v":""},{"$f":"IF(K4=\"oui\",'Table CFP 7'!$K$82,\"\")","v":""},{"$f":"IF(L4=\"oui\",'Table CFP 8'!$K$82,\"\")","v":""}]
["Valeur la + proche à masquer",null,null,null,{"$f":"MIN(IF('Table évap'!$D$5:$D$16>'Chambres positives'!E18,'Table évap'!$D$5:$D$16))","v":0},{"$f":"MIN(IF('Table évap'!$D$5:$D$16>'Chambres positives'!F18,'Table évap'!$D$5:$D$16))","v":0},{"$f":"MIN(IF('Table évap'!D5:D16>'Chambres positives'!G18,'Table évap'!$D$5:$D$16))","v":0},{"$f":"MIN(IF('Table évap'!$D$5:$D$16>'Chambres positives'!H18,'Table évap'!$D$5:$D$16))","v":0},{"$f":"MIN(IF('Table évap'!$D$5:$D$16>'Chambres positives'!I18,'Table évap'!$D$5:$D$16))","v":0},{"$f":"MIN(IF('Table évap'!$D$5:$D$16>'Chambres positives'!J18,'Table évap'!$D$5:$D$16))","v":0},{"$f":"MIN(IF('Table évap'!$D$5:$D$16>'Chambres positives'!K18,'Table évap'!$D$5:$D$16))","v":0},{"$f":"MIN(IF('Table évap'!$D$5:$D$16>'Chambres positives'!L18,'Table évap'!$D$5:$D$16))","v":0}]
["Type",null,null,null,{"$f":"IF(E4=\"oui\",'Table CFP 1'!$Q$82,\"\")","v":""},{"$f":"IF(F4=\"oui\",'Table CFP 2'!Q82,\"\")","v":""},{"$f":"IF(G4=\"oui\",'Table CFP 3'!Q82,\"\")","v":""},{"$f":"IF(H4=\"oui\",'Table CFP 4'!Q82,\"\")","v":""},{"$f":"IF(I4=\"oui\",'Table CFP 5'!Q82,\"\")","v":""},{"$f":"IF(J4=\"oui\",'Table CFP 6'!Q82,\"\")","v":""},{"$f":"IF(K4=\"oui\",'Table CFP 7'!Q82,\"\")","v":""},{"$f":"IF(L4=\"oui\",'Table CFP 8'!Q82,\"\")","v":""}]
["Modèle",null,null,null,{"$f":"IF(E4=\"oui\",IF(E16=\"récupéré\",\"Vérifiez que votre évaporateur fait bien cette puissance\",INDEX('Table évap'!$B$5:$B$16,MATCH(E19,'Table évap'!$D$5:$D$16,0))),\"\")","v":""},{"$f":"IF(F4=\"oui\",IF(F16=\"récupéré\",\"Vérifiez que votre évaporateur fait bien cette puissance\",INDEX('Table évap'!$B$5:$B$16,MATCH(F19,'Table évap'!$D$5:$D$16,0))),\"\")","v":""},{"$f":"IF(G4=\"oui\",IF(G16=\"récupéré\",\"Vérifiez que votre évaporateur fait bien cette puissance\",INDEX('Table évap'!$B$5:$B$16,MATCH(G19,'Table évap'!$D$5:$D$16,0))),\"\")","v":""},{"$f":"IF(H4=\"oui\",IF(H16=\"récupéré\",\"Vérifiez que votre évaporateur fait bien cette puissance\",INDEX('Table évap'!$B$5:$B$16,MATCH(H19,'Table évap'!$D$5:$D$16,0))),\"\")","v":""},{"$f":"IF(I4=\"oui\",IF(I16=\"récupéré\",\"Vérifiez que votre évaporateur fait bien cette puissance\",INDEX('Table évap'!$B$5:$B$16,MATCH(I19,'Table évap'!$D$5:$D$16,0))),\"\")","v":""},{"$f":"IF(J4=\"oui\",IF(J16=\"récupéré\",\"Vérifiez que votre évaporateur fait bien cette puissance\",INDEX('Table évap'!$B$5:$B$16,MATCH(J19,'Table évap'!$D$5:$D$16,0))),\"\")","v":""},{"$f":"IF(K4=\"oui\",IF(K16=\"récupéré\",\"Vérifiez que votre évaporateur fait bien cette puissance\",INDEX('Table évap'!$B$5:$B$16,MATCH(K19,'Table évap'!$D$5:$D$16,0))),\"\")","v":""},{"$f":"IF(L4=\"oui\",IF(L16=\"récupéré\",\"Vérifiez que votre évaporateur fait bien cette puissance\",INDEX('Table évap'!$B$5:$B$16,MATCH(L19,'Table évap'!$D$5:$D$16,0))),\"\")","v":""}]
[]
["Budget",null,null,null,{"$f":"IF(E4=\"oui\",IF(E16=\"récupéré\",\"\",VLOOKUP(E21,'Table évap'!$H$5:$I$16,2,FALSE)),\"\")","v":""},{"$f":"IF(F4=\"oui\",IF(F16=\"récupéré\",\"\",VLOOKUP(F21,'Table évap'!$H$5:$I$16,2,FALSE)),\"\")","v":""},{"$f":"IF(G4=\"oui\",IF(G16=\"récupéré\",\"\",VLOOKUP(G21,'Table évap'!$H$5:$I$16,2,FALSE)),\"\")","v":""},{"$f":"IF(H4=\"oui\",IF(H16=\"récupéré\",\"\",VLOOKUP(H21,'Table évap'!$H$5:$I$16,2,FALSE)),\"\")","v":""},{"$f":"IF(I4=\"oui\",IF(I16=\"récupéré\",\"\",VLOOKUP(I21,'Table évap'!$H$5:$I$16,2,FALSE)),\"\")","v":""},{"$f":"IF(J4=\"oui\",IF(J16=\"récupéré\",\"\",VLOOKUP(J21,'Table évap'!$H$5:$I$16,2,FALSE)),\"\")","v":""},{"$f":"IF(K4=\"oui\",IF(K16=\"récupéré\",\"\",VLOOKUP(K21,'Table évap'!$H$5:$I$16,2,FALSE)),\"\")","v":""},{"$f":"IF(L4=\"oui\",IF(L16=\"récupéré\",\"\",VLOOKUP(L21,'Table évap'!$H$5:$I$16,2,FALSE)),\"\")","v":""}]
[]
["Nombre d'évaporateurs conseillés"]

{"sheet":"Chambres négative","index":3,"n_rows":25,"n_cols":12,"rows_kept":25,"cut":false,"hidden":true,"merged":[[22,7,23,7],[24,0,24,3],[22,0,23,3],[22,4,23,4],[22,5,23,5],[22,6,23,6],[20,11,21,11],[22,8,23,8],[22,9,23,9],[22,10,23,10],[22,11,23,11],[20,6,21,6],[10,0,10,3],[11,6,11,7],[13,0,13,11],[14,0,14,3],[15,0,15,3],[17,0,17,3],[18,0,18,3],[19,0,19,3],[20,0,21,3],[20,4,21,4],[20,5,21,5],[20,7,21,7],[20,8,21,8],[20,9,21,9],[20,10,21,10],[9,0,9,3],[2,0,2,3],[3,0,3,3],[6,0,6,11],[7,0,7,3],[8,0,8,3]]}
[]
[]
["Chambre",null,null,null,1,2,3,4,5,6,7,8]
["Existera t'elle ? (Réfection ou création)"]
["Utilisation de la chambre"]
[]
["                                                                               DIMENSIONS"]
["Largeur"]
["Longueur"]
["Hauteur sous plafond"]
["Température extérieure",null,null,null,{"$f":"Informations!$G$25","v":{"$error":"#VALUE!"}},{"$f":"Informations!$G$25","v":{"$error":"#VALUE!"}},{"$f":"Informations!$G$25","v":{"$error":"#VALUE!"}},{"$f":"Informations!$G$25","v":{"$error":"#VALUE!"}},{"$f":"Informations!$G$25","v":{"$error":"#VALUE!"}},{"$f":"Informations!$G$25","v":{"$error":"#VALUE!"}},{"$f":"Informations!$G$25","v":{"$error":"#VALUE!"}},{"$f":"Informations!$G$25","v":{"$error":"#VALUE!"}}]
[]
[]
["Possibilité de récupérer l'ÉVAPORATEUR d'une chambre existante (si en bon état)"]
["Évaporateur existant"]
["Action"]
[]
["Puissance",null,null,null,{"$f":"IF(E4=\"oui\",'Table CFN 1'!$K$82,\"\")","v":""},{"$f":"IF(F4=\"oui\",'Table CFN 2'!$K$82,\"\")","v":""},{"$f":"IF(G4=\"oui\",'Table CFN 3'!$K$82,\"\")","v":""},{"$f":"IF(H4=\"oui\",'Table CFN 4'!$K$82,\"\")","v":""},{"$f":"IF(I4=\"oui\",'Table CFN 5'!$K$82,\"\")","v":""},{"$f":"IF(J4=\"oui\",'Table CFN 6'!$K$82,\"\")","v":""},{"$f":"IF(K4=\"oui\",'Table CFN 7'!$K$82,\"\")","v":""},{"$f":"IF(L4=\"oui\",'Table CFN 8'!$K$82,\"\")","v":""}]
["Valeur la + proche à masquer",null,null,null,{"$f":"MIN(IF('Table évap'!$D$5:$D$16>'Chambres négative'!E18,'Table évap'!$D$5:$D$16))","v":0},{"$f":"MIN(IF('Table évap'!$D$5:$D$16>'Chambres négative'!F18,'Table évap'!$D$5:$D$16))","v":0},{"$f":"MIN(IF('Table évap'!D5:D16>'Chambres négative'!G18,'Table évap'!$D$5:$D$16))","v":0},{"$f":"MIN(IF('Table évap'!$D$5:$D$16>'Chambres négative'!H18,'Table évap'!$D$5:$D$16))","v":0},{"$f":"MIN(IF('Table évap'!$D$5:$D$16>'Chambres négative'!I18,'Table évap'!$D$5:$D$16))","v":0},{"$f":"MIN(IF('Table évap'!$D$5:$D$16>'Chambres négative'!J18,'Table évap'!$D$5:$D$16))","v":0},{"$f":"MIN(IF('Table évap'!$D$5:$D$16>'Chambres négative'!K18,'Table évap'!$D$5:$D$16))","v":0},{"$f":"MIN(IF('Table évap'!$D$5:$D$16>'Chambres négative'!L18,'Table évap'!$D$5:$D$16))","v":0}]
["Type",null,null,null,{"$f":"IF(E4=\"oui\",'Table CFN 1'!$Q$82,\"\")","v":""},{"$f":"IF(F4=\"oui\",'Table CFN 2'!Q82,\"\")","v":""},{"$f":"IF(G4=\"oui\",'Table CFN 3'!Q82,\"\")","v":""},{"$f":"IF(H4=\"oui\",'Table CFN 4'!Q82,\"\")","v":""},{"$f":"IF(I4=\"oui\",'Table CFN 5'!Q82,\"\")","v":""},{"$f":"IF(J4=\"oui\",'Table CFN 6'!Q82,\"\")","v":""},{"$f":"IF(K4=\"oui\",'Table CFN 7'!Q82,\"\")","v":""},{"$f":"IF(L4=\"oui\",'Table CFN 8'!Q82,\"\")","v":""}]
["Modèle",null,null,null,{"$f":"IF(E4=\"oui\",IF(E16=\"récupéré\",\"Vérifiez que votre évaporateur fait bien cette puissance\",INDEX('Table évap'!$B$5:$B$16,MATCH(E19,'Table évap'!$D$5:$D$16,0))),\"\")","v":""},{"$f":"IF(F4=\"oui\",IF(F16=\"récupéré\",\"Vérifiez que votre évaporateur fait bien cette puissance\",INDEX('Table évap'!$B$5:$B$16,MATCH(F19,'Table évap'!$D$5:$D$16,0))),\"\")","v":""},{"$f":"IF(G4=\"oui\",IF(G16=\"récupéré\",\"Vérifiez que votre évaporateur fait bien cette puissance\",INDEX('Table évap'!$B$5:$B$16,MATCH(G19,'Table évap'!$D$5:$D$16,0))),\"\")","v":""},{"$f":"IF(H4=\"oui\",IF(H16=\"récupéré\",\"Vérifiez que votre évaporateur fait bien cette puissance\",INDEX('Table évap'!$B$5:$B$16,MATCH(H19,'Table évap'!$D$5:$D$16,0))),\"\")","v":""},{"$f":"IF(I4=\"oui\",IF(I16=\"récupéré\",\"Vérifiez que votre évaporateur fait bien cette puissance\",INDEX('Table évap'!$B$5:$B$16,MATCH(I19,'Table évap'!$D$5:$D$16,0))),\"\")","v":""},{"$f":"IF(J4=\"oui\",IF(J16=\"récupéré\",\"Vérifiez que votre évaporateur fait bien cette puissance\",INDEX('Table évap'!$B$5:$B$16,MATCH(J19,'Table évap'!$D$5:$D$16,0))),\"\")","v":""},{"$f":"IF(K4=\"oui\",IF(K16=\"récupéré\",\"Vérifiez que votre évaporateur fait bien cette puissance\",INDEX('Table évap'!$B$5:$B$16,MATCH(K19,'Table évap'!$D$5:$D$16,0))),\"\")","v":""},{"$f":"IF(L4=\"oui\",IF(L16=\"récupéré\",\"Vérifiez que votre évaporateur fait bien cette puissance\",INDEX('Table évap'!$B$5:$B$16,MATCH(L19,'Table évap'!$D$5:$D$16,0))),\"\")","v":""}]
[]
["Budget",null,null,null,{"$f":"IF(E4=\"oui\",IF(E16=\"récupéré\",\"\",VLOOKUP(E21,'Table évap'!$H$5:$I$16,2,FALSE)),\"\")","v":""},{"$f":"IF(F4=\"oui\",IF(F16=\"récupéré\",\"\",VLOOKUP(F21,'Table évap'!$H$5:$I$16,2,FALSE)),\"\")","v":""},{"$f":"IF(G4=\"oui\",IF(G16=\"récupéré\",\"\",VLOOKUP(G21,'Table évap'!$H$5:$I$16,2,FALSE)),\"\")","v":""},{"$f":"IF(H4=\"oui\",IF(H16=\"récupéré\",\"\",VLOOKUP(H21,'Table évap'!$H$5:$I$16,2,FALSE)),\"\")","v":""},{"$f":"IF(I4=\"oui\",IF(I16=\"récupéré\",\"\",VLOOKUP(I21,'Table évap'!$H$5:$I$16,2,FALSE)),\"\")","v":""},{"$f":"IF(J4=\"oui\",IF(J16=\"récupéré\",\"\",VLOOKUP(J21,'Table évap'!$H$5:$I$16,2,FALSE)),\"\")","v":""},{"$f":"IF(K4=\"oui\",IF(K16=\"récupéré\",\"\",VLOOKUP(K21,'Table évap'!$H$5:$I$16,2,FALSE)),\"\")","v":""},{"$f":"IF(L4=\"oui\",IF(L16=\"récupéré\",\"\",VLOOKUP(L21,'Table évap'!$H$5:$I$16,2,FALSE)),\"\")","v":""}]
[]
["Nombre d'évaporateurs conseillés"]

{"sheet":"Clim existante","index":4,"n_rows":41,"n_cols":13,"rows_kept":41,"cut":false,"hidden":true,"merged":[[2,0,2,3],[2,4,2,9],[5,0,5,9],[0,0,0,9],[1,0,1,3],[1,4,1,9],[9,0,9,9],[10,0,10,3],[10,4,10,9],[6,0,6,3],[6,4,6,9],[7,0,7,3],[7,4,7,9],[13,0,13,9],[14,0,14,3],[14,4,14,9],[11,0,11,3],[11,4,11,9],[18,0,18,3],[18,4,18,9],[19,0,19,3],[19,4,19,9],[15,0,15,3],[15,4,15,9],[17,0,17,9],[24,0,24,3],[24,4,24,9],[22,0,22,9],[23,0,23,3],[23,4,23,9],[28,0,28,3],[28,4,28,9],[30,0,30,9],[26,0,26,9],[27,0,27,3],[27,4,27,9],[40,0,40,3],[40,4,40,9],[5,12,6,17],[7,12,8,17],[38,0,38,9],[39,0,39,3],[39,4,39,9],[36,0,36,3],[36,4,36,9],[34,0,34,9],[35,0,35,3],[35,4,35,9],[31,0,31,3],[31,4,31,9],[32,0,32,3],[32,4,32,9]]}
["UNITÉ 1"]
["Fluide utilisé"]
["Puissance frigorifique [kW]"]
[]
[]
["UNITÉ 2",null,null,null,null,null,null,null,null,null,null,null,"TOTAL"]
["Fluide utilisé"]
["Puissance frigorifique [kW]",null,null,null,null,null,null,null,null,null,null,null,{"$f":"E3+E8+E12+E16+E20+E25+E29+E33+E37+E41","v":0}]
[]
["UNITÉ 3"]
["Fluide utilisé"]
["Puissance frigorifique [kW]"]
[]
["UNITÉ 4"]
["Fluide utilisé"]
["Puissance frigorifique [kW]"]
[]
["UNITÉ 5"]
["Fluide utilisé"]
["Puissance frigorifique [kW]"]
[]
[]
["UNITÉ 6"]
["Fluide utilisé"]
["Puissance frigorifique [kW]"]
[]
["UNITÉ 7"]
["Fluide utilisé"]
["Puissance frigorifique [kW]"]
[]
["UNITÉ 8"]
["Fluide utilisé"]
["Puissance frigorifique [kW]"]
[]
["UNITÉ 9"]
["Fluide utilisé"]
["Puissance frigorifique [kW]"]
[]
["UNITÉ 10"]
["Fluide utilisé"]
["Puissance frigorifique [kW]"]

{"sheet":"Production positive","index":5,"n_rows":34,"n_cols":13,"rows_kept":34,"cut":false,"hidden":true,"merged":[[32,0,32,1],[32,3,32,4],[33,0,33,1],[33,3,33,4],[29,0,29,1],[29,3,29,4],[30,0,30,1],[30,3,30,4],[31,0,31,1],[31,3,31,4],[28,0,28,1],[28,3,28,4],[22,0,22,2],[22,3,22,4],[22,6,22,7],[23,0,23,2],[23,3,23,4],[23,6,23,7],[24,3,24,4],[26,0,26,1],[26,3,26,4],[27,0,27,1],[27,3,27,4],[20,0,20,2],[20,3,20,4],[20,6,20,7],[20,8,20,9],[21,0,21,2],[21,3,21,4],[21,6,21,7],[21,8,21,9],[18,0,18,2],[18,3,18,4],[18,6,18,7],[18,8,18,9],[19,0,19,2],[19,3,19,4],[19,6,19,7],[16,0,16,2],[16,3,16,4],[16,6,16,7],[16,8,16,9],[17,0,17,2],[17,3,17,4],[17,6,17,7],[17,8,17,9],[14,0,14,2],[14,3,14,4],[14,6,14,7],[14,8,14,9],[15,0,15,2],[15,3,15,4],[15,6,15,7],[15,8,15,9],[12,0,12,2],[12,3,12,4],[12,6,12,7],[12,8,12,9],[13,0,13,2],[13,3,13,4],[13,6,13,7],[13,8,13,9],[10,0,10,2],[10,3,10,4],[10,6,10,7],[10,8,10,9],[11,0,11,2],[11,3,11,4],[11,6,11,7],[11,8,11,9],[8,0,8,2],[8,3,8,4],[8,6,8,7],[8,8,8,9],[9,0,9,2],[9,3,9,4],[9,6,9,7],[9,8,9,9],[6,0,6,2],[6,3,6,4],[6,6,6,7],[6,8,6,9],[7,0,7,2],[7,3,7,4],[7,6,7,7],[7,8,7,9],[1,0,1,14],[2,12,2,14],[3,12,3,14],[5,0,5,4],[5,6,5,9]]}
[]
["CENTRALE POSITIVE"]
["Appel de puissance nominal","Principe","Variateur","Fluide","Marque","Régime T°C","Fréquence \nde variation","P Frigo \ncompresseur\nsélectionné (KW)","P abs compresseur sélectionné (KW)","Modèle","Prix","Rejet de \nChaleur (KW)","COP"]
[{"$f":"'Besoins frigo'!E19/1000","v":0},{"$f":"INDEX('Selection compresseurs'!C71:C297,MATCH(H4,'Selection compresseurs'!I72:I297,0))","v":"Principe"},{"$f":"INDEX('Selection compresseurs'!D72:D297,MATCH(H4,'Selection compresseurs'!I72:I297,0))","v":"Non"},{"$f":"INDEX('Selection compresseurs'!E72:E297,MATCH(H4,'Selection compresseurs'!I72:I297,0))","v":"R134A"},{"$f":"INDEX('Selection compresseurs'!F72:F297,MATCH(H4,'Selection compresseurs'!I72:I297,0))","v":"BITZER"},{"$f":"INDEX('Selection compresseurs'!G72:G297,MATCH(H4,'Selection compresseurs'!I72:I297,0))","v":"-10/+45°C"},{"$f":"INDEX('Selection compresseurs'!H72:H297,MATCH(H4,'Selection compresseurs'!I72:I297,0))","v":"Pas de variation"},{"$f":"MIN(IF('Selection compresseurs'!I72:I297>A4,'Selection compresseurs'!I72:I297))","v":1},{"$f":"INDEX('Selection compresseurs'!J72:J269,MATCH(H4,'Selection compresseurs'!I72:I297,0))","v":0.53},{"$f":"DGET('Selection compresseurs'!C72:L297,'Selection compresseurs'!K72,'Production positive'!B3:I4)","v":{"$error":"#VALUE!"}},{"$f":"DGET('Selection compresseurs'!C72:L297,'Selection compresseurs'!L72,'Production positive'!B3:J4)","v":{"$error":"#VALUE!"}},{"$f":"INDEX('Selection compresseurs'!M72:M297,MATCH(H4,'Selection compresseurs'!I72:I297,0))","v":1.53},{"$f":"H4/I4","v":1.8867924528301885}]
[]
["CENTRALE POSITIVE\nRÉSUMÉ",null,null,null,null,"Salle des\n machines","CONDENSEUR POSITIF"]
["Marque compresseur",null,null,{"$f":"E4","v":"BITZER"},null,{"$f":"Informations!G37","v":0},"Distance > Emplacement condenseur / tiers",null,{"$f":"Informations!G30","v":0}]
["Modèle",null,null,{"$f":"J4","v":{"$error":"#VALUE!"}},null,null,"Puissance sonore brut",null,60]
["Principe de fonctionnement",null,null,{"$f":"B4","v":"Principe"},null,null,"Puissance sonore atténuée",null,{"$f":"IF(I7<50,(I8-20*LOG(I7/1))*66%,(I8-23*LOG(I7/1))*66%)","v":{"$error":"#NUM!"}}]
["Prix",null,null,{"$f":"K4","v":{"$error":"#VALUE!"}},null,null,"Bruit ambiant (environnement extérieur)",null,{"$f":"Informations!G31","v":0}]
["Appel de puissance nominal",null,null,{"$f":"'Besoins frigo'!E19/1000","v":0},null,null,"Bruit résiduel",null,{"$f":"IF(I10=\"Faible\",10,IF(I10=\"Moyen\",12,20))","v":20}]
["Température d'évaporation",null,null,{"$f":"'Selection compresseurs'!V17","v":-10},null,null,"Émergence\n(3 dB(A) en période nocturne) > décret n°2006-1009 du 31 août 2006",null,{"$f":"IF(I9-I11<0,0,I9-I11)","v":{"$error":"#NUM!"}}]
["Température sèche extérieur",null,null,{"$f":"Informations!G25","v":{"$error":"#VALUE!"}},null,null,"Nuisance sonore",null,{"$f":"IF(I12>3,\"OUI\",\"NON\")","v":{"$error":"#NUM!"}}]
["Température de condensation",null,null,{"$f":"D12+D13","v":{"$error":"#VALUE!"}},null,null,"Emplacement prévu",null,"Extérieur"]
["Compresseurs",null,null,null,null,null,null,null,{"$f":"CONCATENATE(I13, I14)","v":{"$error":"#NUM!"}}]
["Nombre de compresseurs minimum souhaités ? (Renvoi vers tableur de sélection)",null,null,{"$f":"Informations!G40","v":0},null,null,"Grilles à ventelles\n(non intégrées au bordereau de prix)",null,{"$f":"IF(I14=\"Intérieur\",\"Prévoir grilles à ventelles\",\"Pas de grille à ventelles\")","v":"Pas de grille à ventelles"}]
["Fluide",null,null,{"$f":"D4","v":"R134A"},null,null,"Équipement retenu",null,{"$f":"IF(I15=\"NONIntérieur\",\"Centrifuge base\",IF(I15=\"OUIIntérieur\",\"Centrifuge optimisé\",IF(I15=\"NONExtérieur\",\"Hélicoïde base\",\"Hélicoïde optimisé\")))","v":{"$error":"#NUM!"}}]
["Sous refroidissement",null,null,{"$f":"'Selection compresseurs'!V19","v":3},null,null,null,null,{"$f":"IF(I17=\"Hélicoïde optimisé\",\"Hélicoïde\",IF(I17=\"Centrifuge optimisé\",\"Centrifuge\",IF(I17=\"Centrifuge base\",\"centrifuge\",\"Hélicoïde\")))","v":{"$error":"#NUM!"}}]
["Température des gaz à l'aspiration",null,null,4,null,null,"Spécificité",null,{"$f":"IF(I17=\"Centrifuge optimisé\", \"Piège à son + Variateur avec horloge\",IF(I17=\"Centrifuge base\", \"Piège à son\",IF(I17=\"Hélicoïde optimisé\", \"Moteurs EC + horloge\",\"Moteurs EC\")))","v":{"$error":"#NUM!"}}]
["Température d'évaporation (y compris perte de charge)",null,null,{"$f":"D12","v":-10},null,null,"Puissance de sélection",null,{"$f":"L4","v":1.53},"DT 10"]
["Puissance froid évaporateur",null,null,{"$f":"H4","v":1},null,null,"Modèle",null,{"$f":"IF(I18=\"Hélicoïde\",I23,J23)","v":{"$error":"#NUM!"}}]
["Puissance absorbée compresseur",null,null,{"$f":"I4","v":0.53},null,null,"BUDGET (hors pose)",null,{"$f":"IF(I18=\"Hélicoïde\",I24,J24)","v":{"$error":"#NUM!"}}]
["Coefficient de performance",null,null,{"$f":"M4","v":1.8867924528301885},null,null,"Modèle",null,{"$f":"IF(P48<'Table condenseur'!D3,'Table condenseur'!B3,IF(P48<'Table condenseur'!D4,'Table condenseur'!B4,IF(P48<'Table condenseur'!D5,'Table condenseur'!B5,IF(P48<'Table condenseur'!D6,'Table condenseur'!B6,IF(P48<'Table condenseur'!D7,'Table condenseur'!B7,IF(P48<'Table condenseur'!D8,'Table condenseur'!B8,IF(P48<'Table condenseur'!D9,'Table condenseur'!B9,IF(P48<'Table condenseur'!D10,'Table condenseur'!B10,IF(P48<'Table condenseur'!D11,'Table condenseur'!B11,IF(P48<'Table condenseur'!D12,'Table condenseur'!B12,IF(P48<'Table condenseur'!D13,'Table condenseur'!B13,IF(P48<'Table condenseur'!D14,'Table condenseur'!B14,IF(P48<'Table condenseur'!D15,'Table condenseur'!B15,IF(P48<'Table condenseur'!D16,'Table condenseur'!B16,IF(P48<'Table condenseur'!D17,'Table condenseur'!B17,IF(P48<'Table condenseur'!D18,'Table condenseur'!B18,IF(P48<'Table condenseur'!D19,'Table condenseur'!B19,IF(P48<'Table condenseur'!D20,'Table condenseur'!B20,IF(P48<'Table condenseur'!D21,'Table condenseur'!B21,IF(P48<'Table condenseur'!D22,'Table condenseur'!B22,IF(P48<'Table condenseur'!D23,'Table condenseur'!B23,IF(P48<'Table condenseur'!D24,'Table condenseur'!B24,IF(P48<'Table condenseur'!D25,'Table condenseur'!B25,IF(P48<'Table condenseur'!D26,'Table condenseur'!B26,IF(P48<'Table condenseur'!D27,'Table condenseur'!B27,IF(P48<'Table condenseur'!D28,'Table condenseur'!B28,IF(P48<'Table condenseur'!D29,'Table condenseur'!B29,IF(P48<'Table condenseur'!D30,'Table condenseur'!B30,IF($D$21<'Table condenseur'!D31,'Table condenseur'!B31,IF(P48<'Table condenseur'!D32,'Table condenseur'!B32,IF(P48<'Table condenseur'!D33,'Table condenseur'!B33,IF(P48<'Table condenseur'!D34,'Table condenseur'!B34,IF(P48<'Table condenseur'!D35,'Table condenseur'!B35,IF(P48<'Table condenseur'!D36,'Table condenseur'!B36,IF(P48<'Table condenseur'!D37,'Table condenseur'!BSI37*(P48<'Table condenseur'!D38,'Table condenseur'!B38,IF(P48<'Table condenseur'!D39,'Table condenseur'!B39,IF(P48<'Table condenseur'!D40,'Table condenseur'!B40,IF(P48<'Table condenseur'!D41,'Table condenseur'!B41,IF(P48<'Table condenseur'!D42,'Table condenseur'!B42,IF(P48<'Table condenseur'!D43,'Table condenseur'!B43,IF(P48<'Table condenseur'!D44,'Table condenseur'!B44,IF(P48<'Table condenseur'!D45,'Table condenseur'!B45,IF(P48<'Table condenseur'!D46,'Table condenseur'!B46,IF(P48<'Table condenseur'!D47,'Table condenseur'!B47,IF(P48<'Table condenseur'!D48,'Table condenseur'!B48,IF(P48<'Table condenseur'!D49,'Table condenseur'!B49,IF(P48<'Table condenseur'!D50,'Table condenseur'!B50,IF(P48<'Table condenseur'!D51,'Table condenseur'!B51,IF(P48<'Table condenseur'!D52,'Table condenseur'!B52,IF(P48<'Table condenseur'!D53,'Table condenseur'!B53,IF(P48<'Table condenseur'!D54,'Table condenseur'!B54,IF(P48<'Table condenseur'!D55,'Table condenseur'!B55,IF(P48<'Table condenseur'!D56,'Table condenseur'!B56,IF(P48<'Table condenseur'!D57,'Table condenseur'!B57,IF(P48<'Table condenseur'!D58,'Table condenseur'!B58,IF(P48<'Table condenseur'!D59,'Table condenseur'!B59,IF(P48<'Table condenseur'!D60,'Table condenseur'!B60,IF(P48<'Table condenseur'!D61,'Table condenseur'!B61,IF(P48<'Table condenseur'!D62,'Table condenseur'!B62,IF(P48<'Table condenseur'!D63,'Table condenseur'!B63,IF(P48<'Table condenseur'!D64,'Table condenseur'!B64))))))))))))))))))))))))))))))))))))))))))))))))))))))))))))))","v":"SAV5R 4510 H 230V"},{"$f":"IF(P48<'Table condenseur'!O51,'Table condenseur'!N51,IF(P48<'Table condenseur'!O52,'Table condenseur'!N52,IF(P48<'Table condenseur'!O53,'Table condenseur'!N53,IF(P48<'Table condenseur'!O54,'Table condenseur'!N54,IF(P48<'Table condenseur'!O55,'Table condenseur'!N55,IF(P48<'Table condenseur'!O56,'Table condenseur'!N56,IF(P48<'Table condenseur'!O57,'Table condenseur'!N57,IF(P48<'Table condenseur'!O58,'Table condenseur'!N58,IF(P48<'Table condenseur'!O59,'Table condenseur'!N59,IF(P48<'Table condenseur'!O60,'Table condenseur'!N60,IF(P48<'Table condenseur'!O61,'Table condenseur'!N61,IF(P48<'Table condenseur'!O62,'Table condenseur'!N62,IF(P48<'Table condenseur'!O63,'Table condenseur'!N63,IF(P48<'Table condenseur'!O64,'Table condenseur'!N64,IF(P48<'Table condenseur'!O65,'Table condenseur'!N65,IF(P48<'Table condenseur'!O66,'Table condenseur'!N66))))))))))))))))","v":"CAC 143-8P-2"}]
["Puissance rejetée condenseur",null,null,{"$f":"L4","v":1.53},null,null,"BUGDET (hors pose)",null,{"$f":"VLOOKUP(I23,'Table condenseur'!$B$3:O141,9,FALSE)","v":1678},{"$f":"VLOOKUP(J23,'Table condenseur'!G22:O37,9,FALSE)","v":{"$error":"#N/A"}}]
["Sur puissance",null,3.6906167122881639E-2,{"$f":"D21/D11","v":{"$error":"#DIV/0!"}}]
[]
["Altitude",null,{"$f":"Informations!G28","v":0},{"$f":"1-0.000075*C27","v":1}]
["Fluide",null,{"$f":"D4","v":"R134A"},0.93]
["Température ambiante",null,35,0.96]
["Delta T",null,{"$f":"IF(Informations!N26=37,8,10)","v":10},{"$f":"C30/10","v":1}]
[null,null,"coeff. DT 10",{"$f":"D27*D28*D29*D30","v":0.89280000000000004}]
[null,null,"Puissance de sélection à DT 10",{"$f":"D24/D31","v":1.7137096774193548}]
[null,null,"Nombre d'appareil",1]
[null,null,"Puissance de sélection unitaire DT 10",{"$f":"D32/D33","v":1.7137096774193548}]

{"sheet":"Production négative","index":6,"n_rows":34,"n_cols":13,"rows_kept":34,"cut":false,"hidden":true,"merged":[[30,2,30,3],[31,2,31,3],[32,2,32,3],[33,2,33,3],[24,2,24,3],[26,2,26,3],[27,2,27,3],[28,2,28,3],[29,2,29,3],[22,0,22,1],[22,2,22,3],[22,5,22,6],[23,0,23,1],[23,2,23,3],[23,5,23,6],[20,0,20,1],[20,2,20,3],[20,5,20,6],[20,7,20,8],[21,0,21,1],[21,2,21,3],[21,5,21,6],[21,7,21,8],[18,0,18,1],[18,2,18,3],[18,5,18,6],[18,7,18,8],[19,0,19,1],[19,2,19,3],[19,5,19,6],[16,0,16,1],[16,2,16,3],[16,5,16,6],[16,7,16,8],[17,0,17,1],[17,2,17,3],[17,5,17,6],[17,7,17,8],[14,0,14,1],[14,2,14,3],[14,5,14,6],[14,7,14,8],[15,0,15,1],[15,2,15,3],[15,5,15,6],[15,7,15,8],[12,0,12,1],[12,2,12,3],[12,5,12,6],[12,7,12,8],[13,0,13,1],[13,2,13,3],[13,5,13,6],[13,7,13,8],[10,0,10,1],[10,2,10,3],[10,5,10,6],[10,7,10,8],[11,0,11,1],[11,2,11,3],[11,5,11,6],[11,7,11,8],[8,0,8,1],[8,2,8,3],[8,5,8,6],[8,7,8,8],[9,0,9,1],[9,2,9,3],[9,5,9,6],[9,7,9,8],[6,0,6,1],[6,2,6,3],[6,5,6,6],[6,7,6,8],[7,0,7,1],[7,2,7,3],[7,5,7,6],[7,7,7,8],[0,0,0,13],[1,12,1,13],[2,12,2,13],[5,0,5,3],[5,5,5,8]]}
["CENTRALE NÉGATIVE"]
["Appel de puissance nominal","Principe","Variateur","Fluide","Marque","Régime T°C","Fréquence \nde variation","P Frigo \ncompresseur\nsélectionné (KW)","P abs compresseur sélectionné (KW)","Modèle","Prix","Rejet de \nChaleur (KW)","COP"]
[{"$f":"'Besoins frigo'!E35/1000","v":0},{"$f":"INDEX('Selection compresseurs'!C27:C71,MATCH(H3,'Selection compresseurs'!I27:I71,0))","v":"Scroll"},{"$f":"INDEX('Selection compresseurs'!D27:D71,MATCH(H3,'Selection compresseurs'!I27:I71,0))","v":"Non"},{"$f":"INDEX('Selection compresseurs'!E27:E71,MATCH(H3,'Selection compresseurs'!I27:I71,0))","v":"R134A"},{"$f":"INDEX('Selection compresseurs'!F27:F71,MATCH(H3,'Selection compresseurs'!I27:I71,0))","v":"COPELAND"},{"$f":"INDEX('Selection compresseurs'!G27:G71,MATCH(H3,'Selection compresseurs'!I27:I71,0))","v":"-5/-36°C"},{"$f":"INDEX('Selection compresseurs'!H27:H71,MATCH(H3,'Selection compresseurs'!I27:I71,0))","v":"Pas de variation"},{"$f":"MIN(IF('Selection compresseurs'!I27:I71>A3,'Selection compresseurs'!I27:I71))","v":2.5},{"$f":"INDEX('Selection compresseurs'!J27:J71,MATCH(H3,'Selection compresseurs'!I27:I71,0))","v":1},{"$f":"INDEX('Selection compresseurs'!K27:K71,MATCH(H3,'Selection compresseurs'!I27:I71,0))","v":"ZR18 K3E PFJ 522"},{"$f":"INDEX('Selection compresseurs'!L27:L71,MATCH(H3,'Selection compresseurs'!I27:I71,0))","v":1418},{"$f":"INDEX('Selection compresseurs'!M27:M71,MATCH(H3,'Selection compresseurs'!I27:I71,0))","v":3.5},{"$f":"H3/I3","v":2.5}]
[]
[]
["CENTRALE NÉGATIVE\nRÉSUMÉ",null,null,null,"Salle des\n machines","CONDENSEUR NÉGATIF"]
["Marque compresseur",null,{"$f":"E3","v":"COPELAND"},null,{"$f":"Informations!G37","v":0},"Distance > Emplacement condenseur / tiers",null,{"$f":"Informations!G30","v":0}]
["Modèle",null,{"$f":"J3","v":"ZR18 K3E PFJ 522"},null,null,"Puissance sonore brut",null,60]
["Principe de fonctionnement",null,{"$f":"B3","v":"Scroll"},null,null,"Puissance sonore atténuée",null,{"$f":"IF(H7<50,(H8-20*LOG(H7/1))*66%,(H8-23*LOG(H7/1))*66%)","v":{"$error":"#NUM!"}}]
["Prix",null,{"$f":"K3","v":1418},null,null,"Bruit ambiant (environnement extérieur)",null,{"$f":"Informations!G31","v":0}]
["Appel de puissance nominal",null,{"$f":"'Besoins frigo'!E35/1000","v":0},null,null,"Bruit résiduel",null,{"$f":"IF(H10=\"Faible\",10,IF(H10=\"Moyen\",12,20))","v":20}]
["Température d'évaporation",null,{"$f":"'Selection compresseurs'!AA17","v":-5},null,null,"Émergence\n(3 dB(A) en période nocturne) > décret n°2006-1009 du 31 août 2006",null,{"$f":"IF(H9-H11<0,0,H9-H11)","v":{"$error":"#NUM!"}}]
["Température sèche extérieur",null,{"$f":"Informations!G25","v":{"$error":"#VALUE!"}},null,null,"Nuisance sonore",null,{"$f":"IF(H12>3,\"OUI\",\"NON\")","v":{"$error":"#NUM!"}}]
["Température de condensation",null,{"$f":"C12+C13","v":{"$error":"#VALUE!"}},null,null,"Emplacement prévu",null,"Extérieur"]
["Compresseurs",null,null,null,null,null,null,{"$f":"CONCATENATE(H13, H14)","v":{"$error":"#NUM!"}}]
["Nombre de compresseurs minimum souhaités\n (Renvoi vers tableur de sélection)",null,{"$f":"Informations!G42","v":0},null,null,"Grilles à ventelles\n(non intégrées au bordereau de prix)",null,{"$f":"IF(H14=\"Intérieur\",\"Prévoir grilles à ventelles\",\"Pas de grille à ventelles\")","v":"Pas de grille à ventelles"}]
["Fluide",null,{"$f":"D3","v":"R134A"},null,null,"Équipement retenu",null,{"$f":"IF(H15=\"NONIntérieur\",\"Centrifuge base\",IF(H15=\"OUIIntérieur\",\"Centrifuge optimisé\",IF(H15=\"NONExtérieur\",\"Hélicoïde base\",\"Hélicoïde optimisé\")))","v":{"$error":"#NUM!"}}]
["Sous refroidissement",null,{"$f":"'Selection compresseurs'!AA19","v":0},null,null,null,null,{"$f":"IF(H17=\"Hélicoïde optimisé\",\"Hélicoïde\",IF(H17=\"Centrifuge optimisé\",\"Centrifuge\",IF(H17=\"Centrifuge base\",\"centrifuge\",\"Hélicoïde\")))","v":{"$error":"#NUM!"}}]
["Température des gaz à l'aspiration",null,0,null,null,"Spécificité",null,{"$f":"IF(H17=\"Centrifuge optimisé\", \"Piège à son + Variateur avec horloge\",IF(H17=\"Centrifuge base\", \"Piège à son\",IF(H17=\"Hélicoïde optimisé\", \"Moteurs EC + horloge\",\"Moteurs EC\")))","v":{"$error":"#NUM!"}}]
["Température d'évaporation (y compris perte de charge)",null,{"$f":"C12","v":-5},null,null,"Puissance de sélection",null,{"$f":"L3","v":3.5},"DT 10"]
["Puissance froid évaporateur",null,{"$f":"H3","v":2.5},null,null,"Modèle",null,{"$f":"IF(H18=\"Hélicoïde\",H23,I23)","v":{"$error":"#NUM!"}}]
["Puissance absorbée compresseur",null,{"$f":"I3","v":1},null,null,"BUGDET (hors pose)",null,{"$f":"IF(H18=\"Hélicoïde\",H24,I24)","v":{"$error":"#NUM!"}}]
["Coefficient de performance",null,{"$f":"M3","v":2.5},null,null,"Modèle",null,{"$f":"IF(O90<'Table condenseur'!D3,'Table condenseur'!B3,IF(O90<'Table condenseur'!D4,'Table condenseur'!B4,IF(O90<'Table condenseur'!D5,'Table condenseur'!B5,IF(O90<'Table condenseur'!D6,'Table condenseur'!B6,IF(O90<'Table condenseur'!D7,'Table condenseur'!B7,IF(O90<'Table condenseur'!D8,'Table condenseur'!B8,IF(O90<'Table condenseur'!D9,'Table condenseur'!B9,IF(O90<'Table condenseur'!D10,'Table condenseur'!B10,IF(O90<'Table condenseur'!D11,'Table condenseur'!B11,IF(O90<'Table condenseur'!D12,'Table condenseur'!B12,IF(O90<'Table condenseur'!D13,'Table condenseur'!B13,IF(O90<'Table condenseur'!D14,'Table condenseur'!B14,IF(O90<'Table condenseur'!D15,'Table condenseur'!B15,IF(O90<'Table condenseur'!D16,'Table condenseur'!B16,IF(O90<'Table condenseur'!D17,'Table condenseur'!B17,IF(O90<'Table condenseur'!D18,'Table condenseur'!B18,IF(O90<'Table condenseur'!D19,'Table condenseur'!B19,IF(O90<'Table condenseur'!D20,'Table condenseur'!B20,IF(O90<'Table condenseur'!D21,'Table condenseur'!B21,IF(O90<'Table condenseur'!D22,'Table condenseur'!B22,IF(O90<'Table condenseur'!D23,'Table condenseur'!B23,IF(O90<'Table condenseur'!D24,'Table condenseur'!B24,IF(O90<'Table condenseur'!D25,'Table condenseur'!B25,IF(O90<'Table condenseur'!D26,'Table condenseur'!B26,IF(O90<'Table condenseur'!D27,'Table condenseur'!B27,IF(O90<'Table condenseur'!D28,'Table condenseur'!B28,IF(O90<'Table condenseur'!D29,'Table condenseur'!B29,IF(O90<'Table condenseur'!D30,'Table condenseur'!B30,IF(O90<'Table condenseur'!D31,'Table condenseur'!B31,IF(O90<'Table condenseur'!D32,'Table condenseur'!B32,IF(O90<'Table condenseur'!D33,'Table condenseur'!B33,IF(O90<'Table condenseur'!D34,'Table condenseur'!B34,IF(O90<'Table condenseur'!D35,'Table condenseur'!B35,IF(O90<'Table condenseur'!D36,'Table condenseur'!B36,IF(O90<'Table condenseur'!D37,'Table condenseur'!BSI37*(O90<'Table condenseur'!D38,'Table condenseur'!B38,IF(O90<'Table condenseur'!D39,'Table condenseur'!B39,IF(O90<'Table condenseur'!D40,'Table condenseur'!B40,IF(O90<'Table condenseur'!D41,'Table condenseur'!B41,IF(O90<'Table condenseur'!D42,'Table condenseur'!B42,IF(O90<'Table condenseur'!D43,'Table condenseur'!B43,IF(O90<'Table condenseur'!D44,'Table condenseur'!B44,IF(O90<'Table condenseur'!D45,'Table condenseur'!B45,IF(O90<'Table condenseur'!D46,'Table condenseur'!B46,IF(O90<'Table condenseur'!D47,'Table condenseur'!B47,IF(O90<'Table condenseur'!D48,'Table condenseur'!B48,IF(O90<'Table condenseur'!D49,'Table condenseur'!B49,IF(O90<'Table condenseur'!D50,'Table condenseur'!B50,IF(O90<'Table condenseur'!D51,'Table condenseur'!B51,IF(O90<'Table condenseur'!D52,'Table condenseur'!B52,IF(O90<'Table condenseur'!D53,'Table condenseur'!B53,IF(O90<'Table condenseur'!D54,'Table condenseur'!B54,IF(O90<'Table condenseur'!D55,'Table condenseur'!B55,IF(O90<'Table condenseur'!D56,'Table condenseur'!B56,IF(O90<'Table condenseur'!D57,'Table condenseur'!B57,IF(O90<'Table condenseur'!D58,'Table condenseur'!B58,IF(O90<'Table condenseur'!D59,'Table condenseur'!B59,IF(O90<'Table condenseur'!D60,'Table condenseur'!B60,IF(O90<'Table condenseur'!D61,'Table condenseur'!B61,IF(O90<'Table condenseur'!D62,'Table condenseur'!B62,IF(O90<'Table condenseur'!D63,'Table condenseur'!B63,IF(O90<'Table condenseur'!D64,'Table condenseur'!B64))))))))))))))))))))))))))))))))))))))))))))))))))))))))))))))","v":"SAV5R 4510 H 230V"},{"$f":"IF(O90<'Table condenseur'!O51,'Table condenseur'!N51,IF(O90<'Table condenseur'!O52,'Table condenseur'!N52,IF(O90<'Table condenseur'!O53,'Table condenseur'!N53,IF(O90<'Table condenseur'!O54,'Table condenseur'!N54,IF(O90<'Table condenseur'!O55,'Table condenseur'!N55,IF(O90<'Table condenseur'!O56,'Table condenseur'!N56,IF(O90<'Table condenseur'!O57,'Table condenseur'!N57,IF(O90<'Table condenseur'!O58,'Table condenseur'!N58,IF(O90<'Table condenseur'!O59,'Table condenseur'!N59,IF(O90<'Table condenseur'!O60,'Table condenseur'!N60,IF(O90<'Table condenseur'!O61,'Table condenseur'!N61,IF(O90<'Table condenseur'!O62,'Table condenseur'!N62,IF(O90<'Table condenseur'!O63,'Table condenseur'!N63,IF(O90<'Table condenseur'!O64,'Table condenseur'!N64,IF(O90<'Table condenseur'!O65,'Table condenseur'!N65,IF(O90<'Table condenseur'!O66,'Table condenseur'!N66))))))))))))))))","v":"CAC 143-8P-2"}]
["Puissance rejetée condenseur",null,{"$f":"L3","v":3.5},null,null,"BUGDET (hors pose)",null,{"$f":"VLOOKUP(H23,'Table condenseur'!$B$3:O141,9,FALSE)","v":1678},{"$f":"VLOOKUP(I23,'Table condenseur'!N50:V65,9,FALSE)","v":2396.5921440000002}]
["Sur puissance",3.6906167122881639E-2,{"$f":"C21/C11","v":{"$error":"#DIV/0!"}}]
[]
["Altitude",{"$f":"Informations!G28","v":0},{"$f":"1-0.000075*B27","v":1}]
["Fluide",{"$f":"D3","v":"R134A"},0.93]
["Température ambiante",35,0.96]
["Delta T",{"$f":"IF(Informations!N26=37,8,10)","v":10},{"$f":"B30/10","v":1}]
[null,"coeff. DT 10",{"$f":"C27*C28*C29*C30","v":0.89280000000000004}]
[null,"Puissance de sélection à DT 10",{"$f":"C24/C31","v":3.9202508960573477}]
[null,"Nombre d'appareil",1]
[null,"Puissance de sélection unitaire DT 10",{"$f":"C32/C33","v":3.9202508960573477}]

{"sheet":"Zones climatique","index":7,"n_rows":107,"n_cols":55,"rows_kept":107,"cut":false,"hidden":true,"merged":[[0,1,1,18],[6,9,7,10],[6,11,7,12],[7,1,7,3],[8,9,9,10],[8,11,9,12],[10,11,10,12],[12,9,13,10],[12,11,13,12],[18,9,19,17],[20,9,21,14],[20,15,21,17],[31,9,32,10],[31,11,32,12],[31,14,32,15],[31,16,32,17],[22,9,23,14],[22,15,23,17],[24,9,26,14],[24,15,26,17],[27,9,27,12],[27,14,27,17],[28,1,28,3],[28,9,29,10],[28,11,29,12],[28,14,29,15],[28,16,29,17],[34,9,35,10],[34,11,35,12],[34,14,35,15],[34,16,35,17],[36,9,37,10],[36,11,37,12],[36,14,37,15],[36,16,37,17],[45,16,46,17],[39,9,40,10],[39,11,40,12],[39,14,39,15],[39,16,39,17],[40,14,40,15],[40,16,40,17],[42,9,43,10],[42,11,43,12],[43,14,44,15],[43,16,44,17],[44,1,44,3],[56,1,56,2],[56,14,57,15],[56,16,57,17],[47,14,49,15],[47,16,49,17],[48,9,50,9],[48,10,50,10],[51,14,51,15],[51,16,51,17],[52,1,52,2],[53,14,54,15],[53,16,54,17],[54,1,54,2],[55,1,55,2],[45,14,46,15],[70,9,71,17],[73,9,73,16],[59,9,60,17],[62,9,62,15],[63,9,63,15],[64,9,64,15],[65,9,65,15],[66,9,66,16]]}
[null,"ZONES CLIMATIQUES & RT2012 (informations)"]
[null,null,null,null,null,null,null,null,null,null,null,null,null,null,null,null,null,null,null,null,null,null,null,null,null,null,null,null,null,null,null,null,null,null,null,null,null,null,null,null,null,null,null,null,null,null,null,null,null,null,null,null,null,1,"H1"]
[null,null,null,null,null,null,null,null,null,null,null,null,null,null,null,null,null,null,null,null,null,null,null,null,null,null,null,null,null,null,null,null,null,null,null,null,null,null,null,null,null,null,null,null,null,null,null,null,null,null,null,null,null,2,"H1"]
[null,null,null,null,null,null,null,null,null,null,null,null,null,null,null,null,null,null,null,null,null,null,null,null,null,null,null,null,null,null,null,null,null,null,null,null,null,null,null,null,null,null,null,null,null,null,null,null,null,null,null,null,null,3,"H1"]
[null,null,null,null,null,null,null,null,null,null,null,null,null,null,null,null,null,null,null,null,null,null,null,null,"ALL","Zones",null,null,"ALL","Bbio",null,"ALL","CEP",null,"Zone","Mcgéo",null,"altiture","Mcbalt",null,"H1A","H1B","H1C","H2A","H2B","H2C","H2D","H3",null,null,null,null,null,4,"H2"]
[null,null,null,null,null,null,null,null,null,null,null,null,null,null,null,null,null,null,null,null,null,null,null,null,1,"H1C",null,null,1,72,null,1,60,null,"H1C",1.2,null,"0 à 400m",0,null,1,1.1000000000000001,1,1,1,0.9,0.9,0.9,"CE1",null,null,null,null,5,"H1"]
[null,null,null,null,null,null,null,null,null,"Département ?",null,{"$f":"Informations!G10","v":{"$error":"#VALUE!"}},null,null,null,null,null,null,null,null,null,null,null,null,2,"H1A",null,null,2,72,null,2,60,null,"H1A",1.2,null,"401 à 800m",0.2,null,0.9,1,1,1,1,1,1.1000000000000001,1.1000000000000001,"CE2",null,null,null,null,6,"H3"]
[null,"Départements en zone H1 : ",null,null,null,null,null,null,null,null,null,null,null,null,null,null,null,null,null,null,null,null,null,null,3,"H1C",null,null,3,72,null,3,60,null,"H2D",0.8,null,"801  m et plus",0.4,null,null,null,null,null,null,null,null,null,null,null,null,null,null,7,"H2"]
[null,null,null,null,null,null,null,null,null,"Zone climatique",null,{"$f":"VLOOKUP(L7,Y6:Z107,2)","v":{"$error":"#VALUE!"}},null,null,null,null,null,null,null,null,null,null,null,null,4,"H2D",null,null,4,48,null,4,45,null,"H1B",1.4,null,null,null,null,null,null,null,null,null,null,null,null,null,null,null,null,null,8,"H1"]
[null,1,"Ain",43,"Haute Loire",71,"Saône et Loire",null,null,null,null,null,null,null,null,null,null,null,null,null,null,null,null,null,5,"H1C",null,null,5,72,null,5,60,null,"H2C",0.9,null,null,null,null,null,null,null,null,null,null,null,null,null,null,null,null,null,9,"H2"]
[null,2,"Aisne",45,"Loiret",73,"Savoie",null,null,null,null,{"$f":"IF(AND(L9=\"H1C\"),\"H1\",IF(AND(L9=\"H1B\"),\"H1\",IF(AND(L9=\"H1A\"),\"H1\",IF(AND(L9=\"H2A\"),\"H2\",IF(AND(L9=\"H2B\"),\"H2\",IF(AND(L9=\"H2C\"),\"H2\",IF(AND(L9=\"H2D\"),\"H2\",IF(AND(L9=\"H3\"),\"H3\"))))))))","v":{"$error":"#VALUE!"}},null,null,null,null,null,null,null,null,null,null,null,null,null,null,null,null,null,null,null,null,null,null,null,null,null,null,null,null,null,null,null,null,null,null,null,null,null,null,null,null,null,10,"H1"]
[null,3,"Allier",51,"Marne",74,"Haute Savoie",null,null,null,null,null,null,null,null,null,null,null,null,null,null,null,null,null,null,null,null,null,null,null,null,null,null,null,null,null,null,null,null,null,null,null,null,null,null,null,null,null,null,null,null,null,null,11,"H3"]
[null,5,"Hautes Alpes",52,"Haute Marne",75,"Paris",null,null,"CEP max moyen\n(maison individuelle)",null,{"$f":"VLOOKUP(L7,AF5:AG107,2)","v":{"$error":"#VALUE!"}},null,null,null,null,null,null,null,null,null,null,null,null,6,"H3",null,null,6,42,null,6,40,null,"H3",0.7,null,null,null,null,null,null,null,null,null,null,null,null,null,null,null,null,null,12,"H2"]
[null,8,"Ardennes",54,"Meurthe et Moselle",76,"Seine Maritime",null,null,null,null,null,null,null,null,null,null,null,null,null,null,null,null,null,7,"H2D",null,null,7,48,null,7,45,null,"H2A",1.1000000000000001,null,null,null,null,null,null,null,null,null,null,null,null,null,null,null,null,null,13,"H3"]
[null,10,"Aube",55,"Meuse",77,"Seine et Marne",null,null,null,null,null,null,null,null,null,null,null,null,null,null,null,null,null,8,"H1B",null,null,8,84,null,8,65,null,"H2B",1,null,null,null,null,null,null,null,null,null,null,null,null,null,null,null,null,null,14,"H1"]
[null,14,"Calvados",57,"Moselle",78,"Yvelines",null,null,null,"Case à remplir",null,null,null,null,null,null,null,null,null,null,null,null,null,9,"H2C",null,null,9,54,null,9,45,null,null,null,null,null,null,null,null,null,null,null,null,null,null,null,null,null,null,null,null,15,"H1"]
[null,15,"Cantal",58,"Nièvre",80,"Somme",null,null,null,null,null,null,null,null,null,null,null,null,null,null,null,null,null,10,"H1B",null,null,10,84,null,10,65,null,null,null,null,null,null,null,null,null,null,null,null,null,null,null,null,null,null,null,null,16,"H2"]
[null,19,"Corrèze",59,"Nord",87,"Haute Vienne",null,null,null,null,null,null,null,null,null,null,null,null,null,null,null,null,null,11,"H3",null,null,11,42,null,11,40,null,null,null,null,null,null,null,null,null,null,null,null,null,null,null,null,null,null,null,null,17,"H2"]
[null,21,"Cote d'or",60,"Oise",88,"Vosges",null,null,"Bâtiment tertiaire (commerce)",null,null,null,null,null,null,null,null,null,null,null,null,null,null,12,"H2C",null,null,12,54,null,12,45,null,null,null,null,null,null,null,null,null,null,null,null,null,null,null,null,null,null,null,null,18,"H2"]
[null,23,"Creuse",61,"Orne",89,"Yonne",null,null,null,null,null,null,null,null,null,null,null,null,null,null,null,null,null,13,"H3",null,null,13,42,null,13,40,null,null,null,null,null,null,null,null,null,null,null,null,null,null,null,null,null,null,null,null,19,"H1"]
[null,25,"Doubs",62,"Pas de Calais",90,"Territoire de Belfort",null,null,"Chauffage seul ?",null,null,null,null,null,1,null,null,null,null,null,null,null,null,14,"H1A",null,null,14,72,null,14,60,null,null,null,null,null,null,null,null,null,null,null,null,null,null,null,null,null,null,null,null,21,"H1"]
[null,27,"Eure",63,"Puy de Dôme",91,"Essonne",null,null,null,null,null,null,null,null,null,null,null,null,null,null,null,null,null,15,"H1C",null,null,15,72,null,15,60,null,null,null,null,null,null,null,null,null,null,null,null,null,null,null,null,null,null,null,null,22,"H2"]
[null,28,"Eure et Loir",67,"Bas Rhin",92,"Hauts de Seine",null,null,"Chauffage & refroidissement",null,null,null,null,null,0,null,null,null,null,null,null,null,null,16,"H2B",null,null,16,60,null,16,50,null,"0 à 400m",null,null,null,null,null,null,null,null,null,null,null,null,null,null,null,null,null,null,23,"H1"]
[null,38,"Isère",68,"Haut Rhin",93,"Seine Saint Denis",null,null,null,null,null,null,null,null,null,null,null,null,null,null,null,null,null,17,"H2B",null,null,17,60,null,17,50,null,"401 à 800m",null,null,null,null,null,null,null,null,null,null,null,null,null,null,null,null,null,null,24,"H2"]
[null,39,"Jura",69,"Rhône",94,"Val de Marne",null,null,"Catégorie",null,null,null,null,null,{"$f":"IF(AND(P21=1,P23=0),\"CE1\",\"CE2\")","v":"CE1"},null,null,null,null,null,null,null,null,18,"H2B",null,null,18,60,null,18,50,null,"801 et plus",null,null,null,null,null,null,null,null,null,null,null,null,null,null,null,null,null,null,25,"H1"]
[null,42,"Loire",70,"Haute Saône",95,"Val d'Oise",null,null,null,null,null,null,null,null,null,null,null,null,null,null,null,null,null,19,"H1C",null,null,19,72,null,19,60,null,null,null,null,null,null,null,null,null,null,null,null,null,null,null,null,null,null,null,null,26,"H2"]
[null,null,null,null,null,null,null,null,null,null,null,null,null,null,null,null,null,null,null,null,null,null,null,null,21,"H1C",null,null,21,72,null,21,60,null,null,null,null,null,null,null,null,null,null,null,null,null,null,null,null,null,null,null,null,27,"H1"]
[null,null,null,null,null,null,null,null,null,"Calcul du Bbio max",null,null,null,null,"Calcul du CEP max",null,null,null,null,null,null,null,null,null,null,null,null,null,null,null,null,null,null,null,null,null,null,null,null,null,null,null,null,null,null,null,null,null,null,null,null,null,null,28,"H1"]
[null,"Départements en zone H2 :",null,null,null,null,null,null,null,"Bbio maxmoyen",null,{"$f":"IF(AND(P21=1,P23=0),\"140\",\"250\")","v":"140"},null,null,"Mctype",null,{"$f":"IF(AND(P25=\"CE1\"),\"6,4\",IF(AND(P25=\"CE2\"),\"10,4\"))","v":"6,4"},null,null,null,null,null,null,null,22,"H2A",null,null,22,66,null,22,55,null,null,null,null,null,null,null,null,null,null,null,null,null,null,null,null,null,null,null,null,29,"H2"]
[null,null,null,null,null,null,null,null,null,null,null,null,null,null,null,null,null,null,null,null,null,null,null,null,23,"H1C",null,null,23,72,null,23,60,null,"< 50",null,null,null,null,null,null,null,null,null,null,null,null,null,null,null,null,null,null,30,"H3"]
[null,4,"Alpes Haute Provence",32,"Gers",50,"Manche",null,null,null,null,null,null,null,null,null,null,null,null,null,null,null,null,null,24,"H2C",null,null,24,54,null,24,45,null,"50 < 100",null,null,null,null,null,null,null,null,null,null,null,null,null,null,null,null,null,null,31,"H2"]
[null,7,"Ardèche",33,"Gironde",53,"Mayenne",null,null,"MBgéo",null,{"$f":"IF(AND(L9=\"H1A\",P25=\"CE1\"),\"1\",IF(AND(L9=\"H1B\",P25=\"CE1\"),\"1,1\",IF(AND(L9=\"H1C\",P25=\"CE1\"),\"1\",IF(AND(L9=\"H2A\",P25=\"CE1\"),\"1\",IF(AND(L9=\"H2B\",P25=\"CE1\"),\"1\",IF(AND(L9=\"H2C\",P25=\"CE1\"),\"0,9\",IF(AND(L9=\"H2D\",P25=\"CE1\"),\"0,9\",IF(AND(L9=\"H3\",P25=\"CE1\"),\"0,9\",IF(AND(L9=\"H1A\",P25=\"CE2\"),\"0,9\",IF(AND(L9=\"H1B\",P25=\"CE2\"),\"1\",IF(AND(L9=\"H1C\",P25=\"CE2\"),\"1\",IF(AND(L9=\"H2A\",P25=\"CE2\"),\"1\",IF(AND(L9=\"H2B\",P25=\"CE2\"),\"1\",IF(AND(L9=\"H2C\",P25=\"CE2\"),\"1\",IF(AND(L9=\"H2D\",P25=\"CE2\"),\"1,1\",IF(AND(L9=\"H3\",P25=\"CE2\"),\"1,1\",))))))))))))))))","v":{"$error":"#VALUE!"}},null,null,"MCgéo",null,{"$f":"IF(AND(L9=\"H1A\",P25=\"CE1\"),\"1\",IF(AND(L9=\"H1B\",P25=\"CE1\"),\"1\",IF(AND(L9=\"H1C\",P25=\"CE1\"),\"1\",IF(AND(L9=\"H2A\",P25=\"CE1\"),\"1\",IF(AND(L9=\"H2B\",P25=\"CE1\"),\"1\",IF(AND(L9=\"H2C\",P25=\"CE1\"),\"1\",IF(AND(L9=\"H2D\",P25=\"CE1\"),\"1\",IF(AND(L9=\"H3\",P25=\"CE1\"),\"1\",IF(AND(L9=\"H1A\",P25=\"CE2\"),\"1\",IF(AND(L9=\"H1B\",P25=\"CE2\"),\"1\",IF(AND(L9=\"H1C\",P25=\"CE2\"),\"1\",IF(AND(L9=\"H2A\",P25=\"CE2\"),\"1\",IF(AND(L9=\"H2B\",P25=\"CE2\"),\"1\",IF(AND(L9=\"H2C\",P25=\"CE2\"),\"1\",IF(AND(L9=\"H2D\",P25=\"CE2\"),\"1,1\",IF(AND(L9=\"H3\",P25=\"CE2\"),\"1,1\",))))))))))))))))","v":{"$error":"#VALUE!"}},null,null,null,null,null,null,null,25,"H1C",null,null,25,72,null,25,60,null,"100 < 150",null,null,null,null,null,null,null,null,null,null,null,null,null,null,null,null,null,null,32,"H2"]
[null,9,"Ariège",35,"Ile et Vilaine",56,"Morbihan",null,null,null,null,null,null,null,null,null,null,null,null,null,null,null,null,null,26,"H2D",null,null,26,48,null,26,45,null,"> 150",null,null,null,null,null,null,null,null,null,null,null,null,null,null,null,null,null,null,33,"H2"]
[null,12,"Aveyron",36,"Indre",64,"Pyrénées Atlantiques",null,null,null,null,null,null,null,null,null,null,null,null,null,null,null,null,null,27,"H1A",null,null,27,72,null,27,60,null,null,null,null,null,null,null,null,null,null,null,null,null,null,null,null,null,null,null,null,34,"H3"]
[null,16,"Charente",37,"Indre et Loire",65,"Hautes Pyrénées",null,null,"Altitude",null,"0 à 400m",null,null,"Altitude",null,"401 à 800m",null,null,null,null,null,null,null,28,"H1A",null,null,28,72,null,28,60,null,null,null,null,null,null,null,null,null,null,null,null,null,null,null,null,null,null,null,null,35,"H2"]
[null,17,"Charente Maritime",40,"Landes",72,"Sarthe",null,null,null,null,null,null,null,null,null,null,null,null,null,null,null,null,null,29,"H2A",null,null,29,66,null,29,55,null,null,null,null,null,null,null,null,null,null,null,null,null,null,null,null,null,null,null,null,36,"H2"]
[null,18,"Cher",41,"Loir et Cher",79,"Deux Sèvres",null,null,"MBalt",null,{"$f":"IF(AND(P25=\"CE2\"),\"0\",IF(AND(P25=\"CE1\",L35=\"0 à 400m\"),\"0\",IF(AND(P25=\"CE1\",L35=\"401 à 800m\"),\"0,1\",IF(AND(P25=\"CE1\",L35=\"801 et plus\"),\"0,2\"))))","v":"0"},null,null,"MCalt",null,{"$f":"IF(AND(P25=\"CE2\"),\"0\",IF(AND(P25=\"CE1\",Q35=\"0 à 400m\"),\"0\",IF(AND(P25=\"CE1\",Q35=\"401 à 800m\"),\"0\",IF(AND(P25=\"CE1\",Q35=\"801 et plus\"),\"0\"))))","v":"0"},null,null,null,null,null,null,null,30,"H3",null,null,30,42,null,30,40,null,null,null,null,null,null,null,null,null,null,null,null,null,null,null,null,null,null,null,null,37,"H2"]
[null,22,"Cotes d'Armor",44,"Loire Atlantique",81,"Tarn",null,null,null,null,null,null,null,null,null,null,null,null,null,null,null,null,null,31,"H2C",null,null,31,54,null,31,45,null,null,null,null,null,null,null,null,null,null,null,null,null,null,null,null,null,null,null,null,38,"H1"]
[null,24,"Dordogne",46,"Lot",82,"Tarn et Garonne",null,null,null,null,null,null,null,null,null,null,null,null,null,null,null,null,null,32,"H2C",null,null,32,54,null,32,45,null,null,null,null,null,null,null,null,null,null,null,null,null,null,null,null,null,null,null,null,39,"H1"]
[null,26,"Drome",47,"Lot et Garonne",84,"Vaucluse",null,null,"MBsurf ",null,0,null,null,"Surface ",null,5000,null,null,null,null,null,null,null,33,"H2C",null,null,33,54,null,33,45,null,null,null,null,null,null,null,null,null,null,null,null,null,null,null,null,null,null,null,null,40,"H2"]
[null,29,"Finistère",48,"Lozère",85,"Vendée",null,null,null,null,null,null,null,"Mcsurf",null,{"$f":"IF(AND(Q40<=1000,P25=\"CE1\"),((Q40-1000)/6270),IF(AND(Q40>1000,P25=\"CE1\"),\"0\",IF(AND(Q40<=500,P25=\"CE2\"),((500-Q40)/2400),IF(AND(Q40>500,P25=\"CE2\"),\"0\",))))","v":"0"},null,null,null,null,null,null,null,34,"H3",null,null,34,42,null,34,40,null,null,null,null,null,null,null,null,null,null,null,null,null,null,null,null,null,null,null,null,41,"H2"]
[null,31,"Haute Garonne",49,"Maine et Loire",86,"Vienne",null,null,null,null,null,null,null,null,null,null,null,null,null,null,null,null,null,35,"H2A",null,null,35,66,null,35,55,null,null,null,null,null,null,null,null,null,null,null,null,null,null,null,null,null,null,null,null,42,"H1"]
[null,null,null,null,null,null,null,null,null,"Bbio MAX \n(tertiaire)",null,{"$f":"(L29)*(L32+L37+L40)","v":{"$error":"#VALUE!"}},null,null,null,null,null,null,null,null,null,null,null,null,36,"H2B",null,null,36,60,null,36,50,null,null,null,null,null,null,null,null,null,null,null,null,null,null,null,null,null,null,null,null,43,"H1"]
[null,null,null,null,null,null,null,null,null,null,null,null,null,null,"Raccordement à un \nréseau de FROID ?",null,1,null,null,null,null,null,null,null,37,"H2B",null,null,37,60,null,37,50,null,null,null,null,null,null,null,null,null,null,null,null,null,null,null,null,null,null,null,null,44,"H2"]
[null,"Départements en zone H3 :",null,null,null,null,null,null,null,null,null,null,null,null,null,null,null,null,null,null,null,null,null,null,38,"H1C",null,null,38,72,null,38,60,null,null,null,null,null,null,null,null,null,null,null,null,null,null,null,null,null,null,null,null,45,"H1"]
[null,null,null,null,null,null,null,null,null,null,null,null,null,null,"Raccordement à un \nréseau de CHAUD ?",null,0,null,null,null,null,null,null,null,39,"H1C",null,null,39,72,null,39,60,null,null,null,null,null,null,null,null,null,null,null,null,null,null,null,null,null,null,null,null,46,"H2"]
[null,6,"Alpes Maritimes",30,"Gard",null,null,null,null,null,"Valeur à choisir dans \nla liste déroulante","( renseigner\n 0 = non \net 1= oui)",null,null,null,null,null,null,null,null,null,null,null,null,40,"H2C",null,null,40,54,null,40,45,null,null,null,null,null,null,null,null,null,null,null,null,null,null,null,null,null,null,null,null,47,"H2"]
[null,11,"Aude",34,"Hérault",null,null,null,null,null,null,null,null,null,"Présence de GES ?",null,{"$f":"IF(AND(Q44=1,Q46=0),\"OUI\",\"NON\")","v":"OUI"},null,null,null,null,null,null,null,41,"H2B",null,null,41,60,null,41,50,null,null,null,null,null,null,null,null,null,null,null,null,null,null,null,null,null,null,null,null,48,"H2"]
[null,13,"Bouches Du Rhône",66,"Pyrénées Orientales",null,null,null,null,null,"Saisir\n manuellement",null,null,null,null,null,null,null,null,null,null,null,null,null,42,"H1C",null,null,42,72,null,42,60,null,null,null,null,null,null,null,null,null,null,null,null,null,null,null,null,null,null,null,null,49,"H2"]
[null,20,"Corse (1)",83,"Var",null,null,null,null,null,null,null,null,null,null,null,null,null,null,null,null,null,null,null,43,"H1C",null,null,43,72,null,43,60,null,null,null,null,null,null,null,null,null,null,null,null,null,null,null,null,null,null,null,null,50,"H2"]
[null,null,null,null,null,null,null,null,null,null,null,null,null,null,null,null,null,null,null,null,null,null,null,null,null,null,null,null,null,null,null,null,null,null,null,null,null,null,null,null,null,null,null,null,null,null,null,null,null,null,null,null,null,51,"H1"]
[null,null,null,null,null,null,null,null,null,null,null,null,null,null,"Contenu de CO2 des \nréseaux de froid \n(g/KWh)",null,"50 < 100",null,null,null,null,null,null,null,null,null,null,null,null,null,null,null,null,null,null,null,null,null,null,null,null,null,null,null,null,null,null,null,null,null,null,null,null,52,"H1"]
[null,"DOM-TOM",null,null,null,null,null,null,null,null,null,null,null,null,null,null,null,null,null,null,null,null,null,null,44,"H2B",null,null,44,60,null,44,50,null,null,null,null,null,null,null,null,null,null,null,null,null,null,null,null,null,null,null,null,53,"H2"]
[null,null,null,null,null,null,null,null,null,null,null,null,null,null,"McGES",null,{"$f":"IF(AND(Q48=\"OUI\",Q52=\"< 50\"),\"0,15\",IF(AND(Q48=\"OUI\",Q52=\"50 < 100\"),\"0,1\",IF(AND(Q48=\"OUI\",Q52=\"100 < 150\"),\"0,05\",IF(AND(Q48=\"OUI\",Q52=\"> 150\"),\"0\"))))","v":"0,1"},null,null,null,null,null,null,null,45,"H1B",null,null,45,84,null,45,65,null,null,null,null,null,null,null,null,null,null,null,null,null,null,null,null,null,null,null,null,54,"H1"]
[null,971,null,"Guadeloupe",974,"Réunion",null,null,null,null,null,null,null,null,null,null,null,null,null,null,null,null,null,null,46,"H2C",null,null,46,54,null,46,45,null,null,null,null,null,null,null,null,null,null,null,null,null,null,null,null,null,null,null,null,55,"H1"]
[null,972,null,"Martinique",976,"Mayotte",null,null,null,null,null,null,null,null,null,null,null,null,null,null,null,null,null,null,47,"H2C",null,null,47,54,null,47,45,null,null,null,null,null,null,null,null,null,null,null,null,null,null,null,null,null,null,null,null,56,"H2"]
[null,973,null,"Guyane",975,"Saint-Pierre\net-Miquelon",null,null,null,null,null,null,null,null,"CEP MAX\n(tertiaire)",null,{"$f":"(L13)*Q29*(Q32+Q37+Q41+Q54)","v":{"$error":"#VALUE!"}},null,null,null,null,null,null,null,48,"H2D",null,null,48,48,null,48,45,null,null,null,null,null,null,null,null,null,null,null,null,null,null,null,null,null,null,null,null,57,"H1"]
[null,null,null,null,null,null,null,null,null,null,null,null,null,null,null,null,null,null,null,null,null,null,null,null,49,"H2B",null,null,49,60,null,49,50,null,null,null,null,null,null,null,null,null,null,null,null,null,null,null,null,null,null,null,null,58,"H1"]
[null,null,"Zone climatique","Température extérieure\nHiver","Température extérieure\nÉté",null,null,null,null,null,null,null,null,null,null,null,null,null,null,null,null,null,null,null,50,"H2A",null,null,50,66,null,50,55,null,null,null,null,null,null,null,null,null,null,null,null,null,null,null,null,null,null,null,null,59,"H1"]
[null,null,"H1",-9,32,null,null,null,null,"Informations",null,null,null,null,null,null,null,null,null,null,null,null,null,null,51,"H1B",null,null,51,84,null,51,65,null,null,null,null,null,null,null,null,null,null,null,null,null,null,null,null,null,null,null,null,60,"H1"]
[null,null,"H2",-6,35,null,null,null,null,null,null,null,null,null,null,null,null,null,null,null,null,null,null,null,52,"H1B",null,null,52,84,null,52,65,null,null,null,null,null,null,null,null,null,null,null,null,null,null,null,null,null,null,null,null,61,"H1"]
[null,null,"H3",-3,37,null,null,null,null,null,null,null,null,null,null,null,null,null,null,null,null,null,null,null,53,"H2B",null,null,53,60,null,53,50,null,null,null,null,null,null,null,null,null,null,null,null,null,null,null,null,null,null,null,null,62,"H1"]
[null,null,null,null,null,null,null,null,null,"Mctype : Coefficient de modulation selon le type de bâtiment et sa catégorie CE1  / CE2",null,null,null,null,null,null,null,null,null,null,null,null,null,null,54,"H1B",null,null,54,84,null,54,65,null,null,null,null,null,null,null,null,null,null,null,null,null,null,null,null,null,null,null,null,63,"H1"]
[null,null,null,null,null,null,null,null,null,"Mcgéo : Coefficient de modulation selon la zone géographique",null,null,null,null,null,null,null,null,null,null,null,null,null,null,55,"H1B",null,null,55,84,null,55,65,null,null,null,null,null,null,null,null,null,null,null,null,null,null,null,null,null,null,null,null,64,"H2"]
[null,null,null,null,null,null,null,null,null,"Mcalt : Coefficient de modulation selon l'altitude",null,null,null,null,null,null,null,null,null,null,null,null,null,null,56,"H2A",null,null,56,66,null,56,55,null,null,null,null,null,null,null,null,null,null,null,null,null,null,null,null,null,null,null,null,65,"H2"]
[null,null,null,null,null,null,null,null,null,"Mcsurf : Coefficient de modulation selon la surface moyenne des bâtiments",null,null,null,null,null,null,null,null,null,null,null,null,null,null,57,"H1B",null,null,57,84,null,57,65,null,null,null,null,null,null,null,null,null,null,null,null,null,null,null,null,null,null,null,null,66,"H3"]
[null,null,null,null,null,null,null,null,null,"McGES : Coefficient de modulation selon les émissions de gaz à effet de serre des énergies utilisées",null,null,null,null,null,null,null,null,null,null,null,null,null,null,58,"H1B",null,null,58,84,null,58,65,null,null,null,null,null,null,null,null,null,null,null,null,null,null,null,null,null,null,null,null,67,"H1"]
[null,null,null,null,null,null,null,null,null,null,null,null,null,null,null,null,null,null,null,null,null,null,null,null,null,null,null,null,null,null,null,null,null,null,null,null,null,null,null,null,null,null,null,null,null,null,null,null,null,null,null,null,null,68,"H1"]
[null,null,null,null,null,null,null,null,null,"Le valeur du Bbio final devra être inférieure ou égal à la valeur du BbioMAX. Idem pour le CEPmax.",null,null,null,null,null,null,null,null,null,null,null,null,null,null,null,null,null,null,null,null,null,null,null,null,null,null,null,null,null,null,null,null,null,null,null,null,null,null,null,null,null,null,null,69,"H1"]
[null,null,null,null,null,null,null,null,null,null,null,null,null,null,null,null,null,null,null,null,null,null,null,null,null,null,null,null,null,null,null,null,null,null,null,null,null,null,null,null,null,null,null,null,null,null,null,null,null,null,null,null,null,70,"H1"]
[null,null,null,null,null,null,null,null,null,"Les valeurs fournis dans ce tableur sont purements indicatives et permettent de donner un aperçu des valeurs maximales pouvant atteindre le bâtiment étudié afin de respecter la RT2012. \nElles ne peuvent en aucun cas ce substituer à une vrai étude thermique RT2012.",null,null,null,null,null,null,null,null,null,null,null,null,null,null,null,null,null,null,null,null,null,null,null,null,null,null,null,null,null,null,null,null,null,null,null,null,null,null,null,null,null,null,null,71,"H1"]
[null,null,null,null,null,null,null,null,null,null,null,null,null,null,null,null,null,null,null,null,null,null,null,null,null,null,null,null,null,null,null,null,null,null,null,null,null,null,null,null,null,null,null,null,null,null,null,null,null,null,null,null,null,72,"H2"]
[null,null,null,null,null,null,null,null,null,null,null,null,null,null,null,null,null,null,null,null,null,null,null,null,59,"H1A",null,null,59,72,null,59,60,null,null,null,null,null,null,null,null,null,null,null,null,null,null,null,null,null,null,null,null,73,"H1"]
[null,null,null,null,null,null,null,null,null,"Pour plus d'informations sur ces coefficients :  ",null,null,null,null,null,null,null,null,null,null,null,null,null,null,60,"H1A",null,null,60,72,null,60,60,null,null,null,null,null,null,null,null,null,null,null,null,null,null,null,null,null,null,null,null,74,"H1"]
[null,null,null,null,null,null,null,null,null,null,null,null,null,"C'est par ICI !",null,null,null,null,null,null,null,null,null,null,61,"H1A",null,null,61,72,null,61,60,null,null,null,null,null,null,null,null,null,null,null,null,null,null,null,null,null,null,null,null,75,"H1"]
[null,null,null,null,null,null,null,null,null,null,null,null,null,null,null,null,null,null,null,null,null,null,null,null,62,"H1A",null,null,62,72,null,62,60,null,null,null,null,null,null,null,null,null,null,null,null,null,null,null,null,null,null,null,null,76,"H1"]
[null,null,null,null,null,null,null,null,null,null,null,null,null,null,null,null,null,null,null,null,null,null,null,null,63,"H1C",null,null,63,72,null,63,60,null,null,null,null,null,null,null,null,null,null,null,null,null,null,null,null,null,null,null,null,77,"H1"]
[null,null,null,null,null,null,null,null,null,null,null,null,null,null,null,null,null,null,null,null,null,null,null,null,64,"H2C",null,null,64,54,null,64,45,null,null,null,null,null,null,null,null,null,null,null,null,null,null,null,null,null,null,null,null,78,"H1"]
[null,null,null,null,null,null,null,null,null,null,null,null,null,null,null,null,null,null,null,null,null,null,null,null,65,"H2C",null,null,65,54,null,65,45,null,null,null,null,null,null,null,null,null,null,null,null,null,null,null,null,null,null,null,null,79,"H2"]
[null,null,null,null,null,null,null,null,null,null,null,null,null,null,null,null,null,null,null,null,null,null,null,null,66,"H3",null,null,66,42,null,66,40,null,null,null,null,null,null,null,null,null,null,null,null,null,null,null,null,null,null,null,null,80,"H1"]
[null,null,null,null,null,null,null,null,null,null,null,null,null,null,null,null,null,null,null,null,null,null,null,null,67,"H1B",null,null,67,84,null,67,65,null,null,null,null,null,null,null,null,null,null,null,null,null,null,null,null,null,null,null,null,81,"H2"]
[null,null,null,null,null,null,null,null,null,null,null,null,null,null,null,null,null,null,null,null,null,null,null,null,68,"H1B",null,null,68,84,null,68,65,null,null,null,null,null,null,null,null,null,null,null,null,null,null,null,null,null,null,null,null,82,"H2"]
[null,null,null,null,null,null,null,null,null,null,null,null,null,null,null,null,null,null,null,null,null,null,null,null,69,"H1C",null,null,69,72,null,69,60,null,null,null,null,null,null,null,null,null,null,null,null,null,null,null,null,null,null,null,null,83,"H3"]
[null,null,null,null,null,null,null,null,null,null,null,null,null,null,null,null,null,null,null,null,null,null,null,null,70,"H1B",null,null,70,84,null,70,65,null,null,null,null,null,null,null,null,null,null,null,null,null,null,null,null,null,null,null,null,84,"H2"]
[null,null,null,null,null,null,null,null,null,null,null,null,null,null,null,null,null,null,null,null,null,null,null,null,71,"H1C",null,null,71,72,null,71,60,null,null,null,null,null,null,null,null,null,null,null,null,null,null,null,null,null,null,null,null,85,"H2"]
[null,null,null,null,null,null,null,null,null,null,null,null,null,null,null,null,null,null,null,null,null,null,null,null,72,"H2B",null,null,72,60,null,72,50,null,null,null,null,null,null,null,null,null,null,null,null,null,null,null,null,null,null,null,null,86,"H2"]
[null,null,null,null,null,null,null,null,null,null,null,null,null,null,null,null,null,null,null,null,null,null,null,null,73,"H1C",null,null,73,72,null,73,60,null,null,null,null,null,null,null,null,null,null,null,null,null,null,null,null,null,null,null,null,87,"H1"]
[null,null,null,null,null,null,null,null,null,null,null,null,null,null,null,null,null,null,null,null,null,null,null,null,74,"H1C",null,null,74,72,null,74,60,null,null,null,null,null,null,null,null,null,null,null,null,null,null,null,null,null,null,null,null,88,"H1"]
[null,null,null,null,null,null,null,null,null,null,null,null,null,null,null,null,null,null,null,null,null,null,null,null,76,"H1A",null,null,76,72,null,76,60,null,null,null,null,null,null,null,null,null,null,null,null,null,null,null,null,null,null,null,null,89,"H1"]
[null,null,null,null,null,null,null,null,null,null,null,null,null,null,null,null,null,null,null,null,null,null,null,null,77,"H1A",null,null,77,72,null,77,60,null,null,null,null,null,null,null,null,null,null,null,null,null,null,null,null,null,null,null,null,90,"H1"]
[null,null,null,null,null,null,null,null,null,null,null,null,null,null,null,null,null,null,null,null,null,null,null,null,78,"H1A",null,null,78,72,null,78,60,null,null,null,null,null,null,null,null,null,null,null,null,null,null,null,null,null,null,null,null,91,"H1"]
[null,null,null,null,null,null,null,null,null,null,null,null,null,null,null,null,null,null,null,null,null,null,null,null,79,"H2B",null,null,79,60,null,79,50,null,null,null,null,null,null,null,null,null,null,null,null,null,null,null,null,null,null,null,null,92,"H1"]
[null,null,null,null,null,null,null,null,null,null,null,null,null,null,null,null,null,null,null,null,null,null,null,null,80,"H1A",null,null,80,72,null,80,60,null,null,null,null,null,null,null,null,null,null,null,null,null,null,null,null,null,null,null,null,93,"H1"]
[null,null,null,null,null,null,null,null,null,null,null,null,null,null,null,null,null,null,null,null,null,null,null,null,81,"H2C",null,null,81,54,null,81,45,null,null,null,null,null,null,null,null,null,null,null,null,null,null,null,null,null,null,null,null,94,"H1"]
[null,null,null,null,null,null,null,null,null,null,null,null,null,null,null,null,null,null,null,null,null,null,null,null,82,"H2C",null,null,82,54,null,82,45,null,null,null,null,null,null,null,null,null,null,null,null,null,null,null,null,null,null,null,null,95,"H1"]
[null,null,null,null,null,null,null,null,null,null,null,null,null,null,null,null,null,null,null,null,null,null,null,null,83,"H3",null,null,83,42,null,83,40,null,null,null,null,null,null,null,null,null,null,null,null,null,null,null,null,null,null,null,null,"2A","H3"]
[null,null,null,null,null,null,null,null,null,null,null,null,null,null,null,null,null,null,null,null,null,null,null,null,84,"H2D",null,null,84,48,null,84,45,null,null,null,null,null,null,null,null,null,null,null,null,null,null,null,null,null,null,null,null,"2B","H3"]
[null,null,null,null,null,null,null,null,null,null,null,null,null,null,null,null,null,null,null,null,null,null,null,null,85,"H2B",null,null,85,60,null,85,50]
[null,null,null,null,null,null,null,null,null,null,null,null,null,null,null,null,null,null,null,null,null,null,null,null,86,"H2B",null,null,86,60,null,86,50]
[null,null,null,null,null,null,null,null,null,null,null,null,null,null,null,null,null,null,null,null,null,null,null,null,87,"H1C",null,null,87,72,null,87,60]
[null,null,null,null,null,null,null,null,null,null,null,null,null,null,null,null,null,null,null,null,null,null,null,null,88,"H1B",null,null,88,84,null,88,65]
[null,null,null,null,null,null,null,null,null,null,null,null,null,null,null,null,null,null,null,null,null,null,null,null,89,"H1B",null,null,89,84,null,89,65]
[null,null,null,null,null,null,null,null,null,null,null,null,null,null,null,null,null,null,null,null,null,null,null,null,90,"H1B",null,null,90,84,null,90,65]
[null,null,null,null,null,null,null,null,null,null,null,null,null,null,null,null,null,null,null,null,null,null,null,null,91,"H1A",null,null,91,72,null,91,60]
[null,null,null,null,null,null,null,null,null,null,null,null,null,null,null,null,null,null,null,null,null,null,null,null,95,"H1A",null,null,95,72,null,95,60]
[null,null,null,null,null,null,null,null,null,null,null,null,null,null,null,null,null,null,null,null,null,null,null,null,"2A","H3",null,null,"2A",42,null,"2A",40]
[null,null,null,null,null,null,null,null,null,null,null,null,null,null,null,null,null,null,null,null,null,null,null,null,"2B","H3",null,null,"2B",42,null,"2B",40]

{"sheet":"Puissances MFV","index":8,"n_rows":148,"n_cols":17,"rows_kept":148,"cut":false,"hidden":true,"merged":[[116,4,117,8],[71,0,71,14]]}
[]
[11,"AERIA"]
[12,"AGATE"]
[36,"AGORA"]
[46,"AGORAII"]
[85,"AGORAPOS"]
[86,"AIS"]
[800,"AMARANTE"]
["B 09 DR","AMPHI"]
["B 09 RF","AMPLEO"]
["B 10 DR","ARCADE"]
["B 10 RF","ARCHE"]
["B 11 DR","ARN"]
["B 11 RF","ATR"]
["BAC","AZURII"]
["BR","BERLINO"]
["CM446","COLISEUM"]
["CVA","COLISEUM-R"]
["EFFICIA","CORALIS"]
["EU","COSMOS"]
["EUS","COSMOSPOS"]
["F","DAFNE"]
["GH74","DOME"]
["II","DUO"]
["III","ELLIPSE"]
["L","EMERAUDE"]
["LC2","ENVERGURE"]
["LDCLS","FORUM"]
["LMS","GRENAT"]
["LS","KOXKA bacpos"]
["M 09 DR","KOXKA SURGELE MIXTE"]
["M 09 RF","KOXKA SURGELEE BAC DOUBLE"]
["M 10 DR","KOXKA SV LS"]
["M 10 RF","KOXKA Vertical LS"]
["M 11 DR","KOXKA Vertical LS"]
["M 11 RF","KOXKA Vertical LS"]
["MCD216","LOGIA"]
["MCD226","MAXIMA"]
["MCP226","NACRE"]
["MMT","ONYX-F"]
["MODULAR","PATARA"]
["MODULARLS","PATNOS"]
["MODULARSV","PERLE"]
["MPN","PROXIMA"]
["MT","TG ROTTONDE"]
["MUS","TOPAZE"]
["NEG","TRADEO"]
["NEGECO","TRIBUNE"]
["NEGECOR","TURQUOISE"]
["NEGR","VELANDO"]
["PLACARD","VISEO"]
["PORTE","VISEOL"]
["POS"]
["POSECO"]
["POSECOR"]
["POSR"]
["PROXI"]
["R"]
["RD"]
["RD5"]
["S"]
["SG"]
["SL"]
["SVS724"]
["TPP"]
["VE"]
["VOLUM"]
["VOLUMLS"]
["VSS726"]
["XU.GD"]
[]
["MEUBLES FRIGORIFIQUES DE VENTE"]
["REPERE","POSITIF","Réseaux","TOTAL NOMBRE DE MODULES","Température produits","Température d'évaporation","Coefficient THACCP","Température d'évaporation corrigée THACCP","Longueur linéaire","Type de dégivrage","Type de meuble","Modèle","Concaténer","W/ml","Puissance frigorifique","Coefficient HACCP","Puissance corrigée"]
[{"$f":"'Décompo Projet'!B7","v":"MFVP 01"},{"$f":"'Décompo Projet'!C7","v":0},null,{"$f":"'Décompo Projet'!AM7","v":{"$error":"#N/A"}}," 0 / +2 °C",{"$f":"VLOOKUP(M74,'Puissance unitaire'!$D$2:$H$128,5,FALSE)","v":{"$error":"#N/A"}},{"$f":"VLOOKUP(M74,'Puissance unitaire'!$D$2:$L$128,4,FALSE)","v":{"$error":"#N/A"}},{"$f":"F74+G74","v":{"$error":"#N/A"}},{"$f":"'Décompo Projet'!F7","v":0},"Naturel",null,null,{"$f":"'Décompo Projet'!M7","v":0},{"$f":"O74/I74","v":{"$error":"#N/A"}},{"$f":"VLOOKUP(M74,'Puissance unitaire'!$D$2:$L$128,2,FALSE)*I74","v":{"$error":"#N/A"}},{"$f":"VLOOKUP(M74,'Puissance unitaire'!$D$2:$L$128,3,FALSE)","v":{"$error":"#N/A"}},{"$f":"P74*O74","v":{"$error":"#N/A"}}]
[{"$f":"'Décompo Projet'!B8","v":"MFVP 02"},{"$f":"'Décompo Projet'!C8","v":0},null,{"$f":"'Décompo Projet'!AM8","v":{"$error":"#N/A"}}," 0 / +2 °C",{"$f":"VLOOKUP(M75,'Puissance unitaire'!$D$2:$H$128,5,FALSE)","v":{"$error":"#N/A"}},{"$f":"VLOOKUP(M75,'Puissance unitaire'!$D$2:$L$128,4,FALSE)","v":{"$error":"#N/A"}},null,{"$f":"'Décompo Projet'!F8","v":0},"Naturel",null,null,{"$f":"'Décompo Projet'!M8","v":0},{"$error":"#N/A"},{"$f":"VLOOKUP(M75,'Puissance unitaire'!$D$2:$L$128,2,FALSE)*I75","v":{"$error":"#N/A"}},{"$f":"VLOOKUP(M75,'Puissance unitaire'!$D$2:$L$128,3,FALSE)","v":{"$error":"#N/A"}},{"$f":"P75*O75","v":{"$error":"#N/A"}}]
[{"$f":"'Décompo Projet'!B9","v":"MFVP 03"},{"$f":"'Décompo Projet'!C9","v":0},null,{"$f":"'Décompo Projet'!AM9","v":{"$error":"#N/A"}}," 0 / +2 °C",{"$f":"VLOOKUP(M76,'Puissance unitaire'!$D$2:$H$128,5,FALSE)","v":{"$error":"#N/A"}},{"$f":"VLOOKUP(M76,'Puissance unitaire'!$D$2:$L$128,4,FALSE)","v":{"$error":"#N/A"}},null,{"$f":"'Décompo Projet'!F9","v":0},"Naturel",null,null,{"$f":"'Décompo Projet'!M9","v":0},{"$error":"#N/A"},{"$f":"VLOOKUP(M76,'Puissance unitaire'!$D$2:$L$128,2,FALSE)*I76","v":{"$error":"#N/A"}},{"$f":"VLOOKUP(M76,'Puissance unitaire'!$D$2:$L$128,3,FALSE)","v":{"$error":"#N/A"}},{"$error":"#N/A"}]
[{"$f":"'Décompo Projet'!B10","v":"MFVP 04"},{"$f":"'Décompo Projet'!C10","v":0},null,{"$f":"'Décompo Projet'!AM10","v":{"$error":"#N/A"}}," 0 / +2 °C",{"$f":"VLOOKUP(M77,'Puissance unitaire'!$D$2:$H$128,5,FALSE)","v":{"$error":"#N/A"}},{"$f":"VLOOKUP(M77,'Puissance unitaire'!$D$2:$L$128,4,FALSE)","v":{"$error":"#N/A"}},null,{"$f":"'Décompo Projet'!F10","v":0},"Naturel",null,null,{"$f":"'Décompo Projet'!M10","v":0},{"$error":"#N/A"},{"$f":"VLOOKUP(M77,'Puissance unitaire'!$D$2:$L$128,2,FALSE)*I77","v":{"$error":"#N/A"}},{"$f":"VLOOKUP(M77,'Puissance unitaire'!$D$2:$L$128,3,FALSE)","v":{"$error":"#N/A"}},{"$error":"#N/A"}]
[{"$f":"'Décompo Projet'!B11","v":"MFVP 05"},{"$f":"'Décompo Projet'!C11","v":0},null,{"$f":"'Décompo Projet'!AM11","v":{"$error":"#N/A"}}," 0 / +2 °C",{"$f":"VLOOKUP(M78,'Puissance unitaire'!$D$2:$H$128,5,FALSE)","v":{"$error":"#N/A"}},{"$f":"VLOOKUP(M78,'Puissance unitaire'!$D$2:$L$128,4,FALSE)","v":{"$error":"#N/A"}},null,{"$f":"'Décompo Projet'!F11","v":0},"Naturel",null,null,{"$f":"'Décompo Projet'!M11","v":0},{"$error":"#N/A"},{"$f":"VLOOKUP(M78,'Puissance unitaire'!$D$2:$L$128,2,FALSE)*I78","v":{"$error":"#N/A"}},{"$f":"VLOOKUP(M78,'Puissance unitaire'!$D$2:$L$128,3,FALSE)","v":{"$error":"#N/A"}},{"$error":"#N/A"}]
[{"$f":"'Décompo Projet'!B12","v":"MFVP 06"},{"$f":"'Décompo Projet'!C12","v":0},null,{"$f":"'Décompo Projet'!AM12","v":{"$error":"#N/A"}}," 0 / +2 °C",{"$f":"VLOOKUP(M79,'Puissance unitaire'!$D$2:$H$128,5,FALSE)","v":{"$error":"#N/A"}},{"$f":"VLOOKUP(M79,'Puissance unitaire'!$D$2:$L$128,4,FALSE)","v":{"$error":"#N/A"}},null,{"$f":"'Décompo Projet'!F12","v":0},"Naturel",null,null,{"$f":"'Décompo Projet'!M12","v":0},{"$error":"#N/A"},{"$f":"VLOOKUP(M79,'Puissance unitaire'!$D$2:$L$128,2,FALSE)*I79","v":{"$error":"#N/A"}},{"$f":"VLOOKUP(M79,'Puissance unitaire'!$D$2:$L$128,3,FALSE)","v":{"$error":"#N/A"}},{"$error":"#N/A"}]
[{"$f":"'Décompo Projet'!B13","v":"MFVP 07"},{"$f":"'Décompo Projet'!C13","v":0},null,{"$f":"'Décompo Projet'!AM13","v":{"$error":"#N/A"}}," 0 / +2 °C",{"$f":"VLOOKUP(M80,'Puissance unitaire'!$D$2:$H$128,5,FALSE)","v":{"$error":"#N/A"}},{"$f":"VLOOKUP(M80,'Puissance unitaire'!$D$2:$L$128,4,FALSE)","v":{"$error":"#N/A"}},null,{"$f":"'Décompo Projet'!F13","v":0},"Naturel",null,null,{"$f":"'Décompo Projet'!M13","v":0},{"$error":"#N/A"},{"$f":"VLOOKUP(M80,'Puissance unitaire'!$D$2:$L$128,2,FALSE)*I80","v":{"$error":"#N/A"}},{"$f":"VLOOKUP(M80,'Puissance unitaire'!$D$2:$L$128,3,FALSE)","v":{"$error":"#N/A"}},{"$error":"#N/A"}]
[{"$f":"'Décompo Projet'!B14","v":"MFVP 08"},{"$f":"'Décompo Projet'!C14","v":0},null,{"$f":"'Décompo Projet'!AM14","v":{"$error":"#N/A"}}," 0 / +2 °C",{"$f":"VLOOKUP(M81,'Puissance unitaire'!$D$2:$H$128,5,FALSE)","v":{"$error":"#N/A"}},{"$f":"VLOOKUP(M81,'Puissance unitaire'!$D$2:$L$128,4,FALSE)","v":{"$error":"#N/A"}},{"$f":"F81+G81","v":{"$error":"#N/A"}},{"$f":"'Décompo Projet'!F14","v":0},"Naturel",null,null,{"$f":"'Décompo Projet'!M14","v":0},{"$error":"#N/A"},{"$f":"VLOOKUP(M81,'Puissance unitaire'!$D$2:$L$128,2,FALSE)*I81","v":{"$error":"#N/A"}},{"$f":"VLOOKUP(M81,'Puissance unitaire'!$D$2:$L$128,3,FALSE)","v":{"$error":"#N/A"}},{"$error":"#N/A"}]
[{"$f":"'Décompo Projet'!B15","v":"MFVP 09"},{"$f":"'Décompo Projet'!C15","v":0},null,{"$f":"'Décompo Projet'!AM15","v":{"$error":"#N/A"}}," 0 / +2 °C",{"$f":"VLOOKUP(M82,'Puissance unitaire'!$D$2:$H$128,5,FALSE)","v":{"$error":"#N/A"}},{"$f":"VLOOKUP(M82,'Puissance unitaire'!$D$2:$L$128,4,FALSE)","v":{"$error":"#N/A"}},null,{"$f":"'Décompo Projet'!F15","v":0},"Naturel",null,null,{"$f":"'Décompo Projet'!M15","v":0},{"$error":"#N/A"},{"$f":"VLOOKUP(M82,'Puissance unitaire'!$D$2:$L$128,2,FALSE)*I82","v":{"$error":"#N/A"}},{"$f":"VLOOKUP(M82,'Puissance unitaire'!$D$2:$L$128,3,FALSE)","v":{"$error":"#N/A"}},{"$error":"#N/A"}]
[{"$f":"'Décompo Projet'!B16","v":"MFVP 10"},{"$f":"'Décompo Projet'!C16","v":0},null,{"$f":"'Décompo Projet'!AM16","v":{"$error":"#N/A"}}," 0 / +2 °C",{"$f":"VLOOKUP(M83,'Puissance unitaire'!$D$2:$H$128,5,FALSE)","v":{"$error":"#N/A"}},{"$f":"VLOOKUP(M83,'Puissance unitaire'!$D$2:$L$128,4,FALSE)","v":{"$error":"#N/A"}},null,{"$f":"'Décompo Projet'!F16","v":0},"Naturel",null,null,{"$f":"'Décompo Projet'!M16","v":0},{"$error":"#N/A"},{"$f":"VLOOKUP(M83,'Puissance unitaire'!$D$2:$L$128,2,FALSE)*I83","v":{"$error":"#N/A"}},{"$f":"VLOOKUP(M83,'Puissance unitaire'!$D$2:$L$128,3,FALSE)","v":{"$error":"#N/A"}},{"$error":"#N/A"}]
[{"$f":"'Décompo Projet'!B17","v":"MFVP 11"},{"$f":"'Décompo Projet'!C17","v":0},null,{"$f":"'Décompo Projet'!AM17","v":{"$error":"#N/A"}}," 0 / +2 °C",{"$f":"VLOOKUP(M84,'Puissance unitaire'!$D$2:$H$128,5,FALSE)","v":{"$error":"#N/A"}},{"$f":"VLOOKUP(M84,'Puissance unitaire'!$D$2:$L$128,4,FALSE)","v":{"$error":"#N/A"}},null,{"$f":"'Décompo Projet'!F17","v":0},"Naturel",null,null,{"$f":"'Décompo Projet'!M17","v":0},{"$error":"#N/A"},{"$f":"VLOOKUP(M84,'Puissance unitaire'!$D$2:$L$128,2,FALSE)*I84","v":{"$error":"#N/A"}},{"$f":"VLOOKUP(M84,'Puissance unitaire'!$D$2:$L$128,3,FALSE)","v":{"$error":"#N/A"}},{"$error":"#N/A"}]
[{"$f":"'Décompo Projet'!B18","v":"MFVP 12"},{"$f":"'Décompo Projet'!C18","v":0},null,{"$f":"'Décompo Projet'!AM18","v":{"$error":"#N/A"}}," 0 / +2 °C",{"$f":"VLOOKUP(M85,'Puissance unitaire'!$D$2:$H$128,5,FALSE)","v":{"$error":"#N/A"}},{"$f":"VLOOKUP(M85,'Puissance unitaire'!$D$2:$L$128,4,FALSE)","v":{"$error":"#N/A"}},null,{"$f":"'Décompo Projet'!F18","v":0},"Naturel",null,null,{"$f":"'Décompo Projet'!M18","v":0},{"$error":"#N/A"},{"$f":"VLOOKUP(M85,'Puissance unitaire'!$D$2:$L$128,2,FALSE)*I85","v":{"$error":"#N/A"}},{"$f":"VLOOKUP(M85,'Puissance unitaire'!$D$2:$L$128,3,FALSE)","v":{"$error":"#N/A"}},{"$error":"#N/A"}]
[{"$f":"'Décompo Projet'!B19","v":"MFVP 13"},{"$f":"'Décompo Projet'!C19","v":0},null,{"$f":"'Décompo Projet'!AM19","v":{"$error":"#N/A"}}," 0 / +2 °C",{"$f":"VLOOKUP(M86,'Puissance unitaire'!$D$2:$H$128,5,FALSE)","v":{"$error":"#N/A"}},{"$f":"VLOOKUP(M86,'Puissance unitaire'!$D$2:$L$128,4,FALSE)","v":{"$error":"#N/A"}},null,{"$f":"'Décompo Projet'!F19","v":0},"Naturel",null,null,{"$f":"'Décompo Projet'!M19","v":0},{"$error":"#N/A"},{"$f":"VLOOKUP(M86,'Puissance unitaire'!$D$2:$L$128,2,FALSE)*I86","v":{"$error":"#N/A"}},{"$f":"VLOOKUP(M86,'Puissance unitaire'!$D$2:$L$128,3,FALSE)","v":{"$error":"#N/A"}},{"$error":"#N/A"}]
[{"$f":"'Décompo Projet'!B20","v":"MFVP 14"},{"$f":"'Décompo Projet'!C20","v":0},null,{"$f":"'Décompo Projet'!AM20","v":{"$error":"#N/A"}}," 0 / +2 °C",{"$f":"VLOOKUP(M87,'Puissance unitaire'!$D$2:$H$128,5,FALSE)","v":{"$error":"#N/A"}},{"$f":"VLOOKUP(M87,'Puissance unitaire'!$D$2:$L$128,4,FALSE)","v":{"$error":"#N/A"}},null,{"$f":"'Décompo Projet'!F20","v":0},"Naturel",null,null,{"$f":"'Décompo Projet'!M20","v":0},{"$error":"#N/A"},{"$f":"VLOOKUP(M87,'Puissance unitaire'!$D$2:$L$128,2,FALSE)*I87","v":{"$error":"#N/A"}},{"$f":"VLOOKUP(M87,'Puissance unitaire'!$D$2:$L$128,3,FALSE)","v":{"$error":"#N/A"}},{"$error":"#N/A"}]
[{"$f":"'Décompo Projet'!B21","v":"MFVP 15"},{"$f":"'Décompo Projet'!C21","v":0},null,{"$f":"'Décompo Projet'!AM21","v":{"$error":"#N/A"}}," 0 / +2 °C",{"$f":"VLOOKUP(M88,'Puissance unitaire'!$D$2:$H$128,5,FALSE)","v":{"$error":"#N/A"}},{"$f":"VLOOKUP(M88,'Puissance unitaire'!$D$2:$L$128,4,FALSE)","v":{"$error":"#N/A"}},null,{"$f":"'Décompo Projet'!F21","v":0},"Naturel",null,null,{"$f":"'Décompo Projet'!M21","v":0},{"$error":"#N/A"},{"$f":"VLOOKUP(M88,'Puissance unitaire'!$D$2:$L$128,2,FALSE)*I88","v":{"$error":"#N/A"}},{"$f":"VLOOKUP(M88,'Puissance unitaire'!$D$2:$L$128,3,FALSE)","v":{"$error":"#N/A"}},{"$error":"#N/A"}]
[{"$f":"'Décompo Projet'!B22","v":"MFVP 16"},{"$f":"'Décompo Projet'!C22","v":0},null,{"$f":"'Décompo Projet'!AM22","v":{"$error":"#N/A"}}," 0 / +2 °C",{"$f":"VLOOKUP(M89,'Puissance unitaire'!$D$2:$H$128,5,FALSE)","v":{"$error":"#N/A"}},{"$f":"VLOOKUP(M89,'Puissance unitaire'!$D$2:$L$128,4,FALSE)","v":{"$error":"#N/A"}},null,{"$f":"'Décompo Projet'!F22","v":0},"Naturel",null,null,{"$f":"'Décompo Projet'!M22","v":0},{"$error":"#N/A"},{"$f":"VLOOKUP(M89,'Puissance unitaire'!$D$2:$L$128,2,FALSE)*I89","v":{"$error":"#N/A"}},{"$f":"VLOOKUP(M89,'Puissance unitaire'!$D$2:$L$128,3,FALSE)","v":{"$error":"#N/A"}},{"$error":"#N/A"}]
[{"$f":"'Décompo Projet'!B23","v":"MFVP 17"},{"$f":"'Décompo Projet'!C23","v":0},null,{"$f":"'Décompo Projet'!AM23","v":{"$error":"#N/A"}}," 0 / +2 °C",{"$f":"VLOOKUP(M90,'Puissance unitaire'!$D$2:$H$128,5,FALSE)","v":{"$error":"#N/A"}},{"$f":"VLOOKUP(M90,'Puissance unitaire'!$D$2:$L$128,4,FALSE)","v":{"$error":"#N/A"}},null,{"$f":"'Décompo Projet'!F23","v":0},"Naturel",null,null,{"$f":"'Décompo Projet'!M23","v":0},{"$error":"#N/A"},{"$f":"VLOOKUP(M90,'Puissance unitaire'!$D$2:$L$128,2,FALSE)*I90","v":{"$error":"#N/A"}},{"$f":"VLOOKUP(M90,'Puissance unitaire'!$D$2:$L$128,3,FALSE)","v":{"$error":"#N/A"}},{"$error":"#N/A"}]
[{"$f":"'Décompo Projet'!B24","v":"MFVP 18"},{"$f":"'Décompo Projet'!C24","v":0},null,{"$f":"'Décompo Projet'!AM24","v":{"$error":"#N/A"}}," 0 / +2 °C",{"$f":"VLOOKUP(M91,'Puissance unitaire'!$D$2:$H$128,5,FALSE)","v":{"$error":"#N/A"}},{"$f":"VLOOKUP(M91,'Puissance unitaire'!$D$2:$L$128,4,FALSE)","v":{"$error":"#N/A"}},null,{"$f":"'Décompo Projet'!F24","v":0},"Naturel",null,null,{"$f":"'Décompo Projet'!M24","v":0},{"$error":"#N/A"},{"$f":"VLOOKUP(M91,'Puissance unitaire'!$D$2:$L$128,2,FALSE)*I91","v":{"$error":"#N/A"}},{"$f":"VLOOKUP(M91,'Puissance unitaire'!$D$2:$L$128,3,FALSE)","v":{"$error":"#N/A"}},{"$error":"#N/A"}]
[{"$f":"'Décompo Projet'!B25","v":"MFVP 19"},{"$f":"'Décompo Projet'!C25","v":0},null,{"$f":"'Décompo Projet'!AM25","v":{"$error":"#N/A"}}," 0 / +2 °C",{"$f":"VLOOKUP(M92,'Puissance unitaire'!$D$2:$H$128,5,FALSE)","v":{"$error":"#N/A"}},{"$f":"VLOOKUP(M92,'Puissance unitaire'!$D$2:$L$128,4,FALSE)","v":{"$error":"#N/A"}},{"$f":"F92+G92","v":{"$error":"#N/A"}},{"$f":"'Décompo Projet'!F25","v":0},"Naturel",null,null,{"$f":"'Décompo Projet'!M25","v":0},{"$f":"O92/I92","v":{"$error":"#N/A"}},{"$f":"VLOOKUP(M92,'Puissance unitaire'!$D$2:$L$128,2,FALSE)*I92","v":{"$error":"#N/A"}},{"$f":"VLOOKUP(M92,'Puissance unitaire'!$D$2:$L$128,3,FALSE)","v":{"$error":"#N/A"}},{"$error":"#N/A"}]
[{"$f":"'Décompo Projet'!B26","v":"MFVP 20"},{"$f":"'Décompo Projet'!C26","v":0},null,{"$f":"'Décompo Projet'!AM26","v":{"$error":"#N/A"}}," 0 / +2 °C",{"$f":"VLOOKUP(M93,'Puissance unitaire'!$D$2:$H$128,5,FALSE)","v":{"$error":"#N/A"}},{"$f":"VLOOKUP(M93,'Puissance unitaire'!$D$2:$L$128,4,FALSE)","v":{"$error":"#N/A"}},{"$f":"F93+G93","v":{"$error":"#N/A"}},{"$f":"'Décompo Projet'!F26","v":0},"Naturel",null,null,{"$f":"'Décompo Projet'!M26","v":0},{"$f":"O93/I93","v":{"$error":"#N/A"}},{"$f":"VLOOKUP(M93,'Puissance unitaire'!$D$2:$L$128,2,FALSE)*I93","v":{"$error":"#N/A"}},{"$f":"VLOOKUP(M93,'Puissance unitaire'!$D$2:$L$128,3,FALSE)","v":{"$error":"#N/A"}},{"$error":"#N/A"}]
[null,"TOTAUX LINÉAIRE POSITIF",null,{"$f":"SUM(D74:D93)","v":{"$error":"#N/A"}},null,{"$f":"MIN(F74:F93)","v":{"$error":"#N/A"}},null,{"$f":"MIN(H74:H93)","v":{"$error":"#N/A"}},{"$f":"SUM(I74:I93)","v":0},null,null,null,null,{"$f":"AVERAGE(N74:N93)","v":{"$error":"#N/A"}},{"$f":"SUMIF(O74:O93,\"<>#N/A\",O74:O93)","v":0},null,{"$f":"SUMIF(Q74:Q93,\"<>#N/A\",Q74:Q93)","v":0}]
[null,"NÉGATIF"]
[{"$f":"'Décompo Projet'!B29","v":"MFVN 01"},{"$f":"'Décompo Projet'!C29","v":0},null,{"$f":"'Décompo Projet'!AM29","v":{"$error":"#N/A"}},"-25/-23°C",{"$f":"VLOOKUP(M96,'Puissance unitaire'!$D$2:$H$128,5,FALSE)","v":{"$error":"#N/A"}},{"$f":"VLOOKUP(M96,'Puissance unitaire'!$D$2:$L$128,4,FALSE)","v":{"$error":"#N/A"}},{"$f":"+F96+G96","v":{"$error":"#N/A"}},{"$f":"'Décompo Projet'!G29","v":0.14000000000000001},"Electrique",null,null,{"$f":"'Décompo Projet'!M29","v":0},{"$f":"O96/I96","v":{"$error":"#N/A"}},{"$f":"VLOOKUP(M96,'Puissance unitaire'!$D$2:$L$128,2,FALSE)*I96","v":{"$error":"#N/A"}},{"$f":"VLOOKUP(M96,'Puissance unitaire'!$D$2:$L$128,3,FALSE)","v":{"$error":"#N/A"}},{"$f":"P96*O96","v":{"$error":"#N/A"}}]
[{"$f":"'Décompo Projet'!B30","v":"MFVN 02"},{"$f":"'Décompo Projet'!C30","v":0},null,{"$f":"'Décompo Projet'!AM30","v":{"$error":"#N/A"}},"-25/-23°C",{"$f":"VLOOKUP(M97,'Puissance unitaire'!$D$2:$H$128,5,FALSE)","v":{"$error":"#N/A"}},{"$f":"VLOOKUP(M97,'Puissance unitaire'!$D$2:$L$128,4,FALSE)","v":{"$error":"#N/A"}},{"$error":"#N/A"},{"$f":"'Décompo Projet'!G30","v":0.14000000000000001},"Electrique",null,null,{"$f":"'Décompo Projet'!M30","v":0},{"$error":"#N/A"},{"$f":"VLOOKUP(M97,'Puissance unitaire'!$D$2:$L$128,2,FALSE)*I97","v":{"$error":"#N/A"}},{"$f":"VLOOKUP(M97,'Puissance unitaire'!$D$2:$L$128,3,FALSE)","v":{"$error":"#N/A"}},{"$error":"#N/A"}]
[{"$f":"'Décompo Projet'!B31","v":"MFVN 03"},{"$f":"'Décompo Projet'!C31","v":0},null,{"$f":"'Décompo Projet'!AM31","v":{"$error":"#N/A"}},"-25/-23°C",{"$f":"VLOOKUP(M98,'Puissance unitaire'!$D$2:$H$128,5,FALSE)","v":{"$error":"#N/A"}},{"$f":"VLOOKUP(M98,'Puissance unitaire'!$D$2:$L$128,4,FALSE)","v":{"$error":"#N/A"}},{"$error":"#N/A"},{"$f":"'Décompo Projet'!G31","v":0.14000000000000001},"Electrique",null,null,{"$f":"'Décompo Projet'!M31","v":0},{"$error":"#N/A"},{"$f":"VLOOKUP(M98,'Puissance unitaire'!$D$2:$L$128,2,FALSE)*I98","v":{"$error":"#N/A"}},{"$f":"VLOOKUP(M98,'Puissance unitaire'!$D$2:$L$128,3,FALSE)","v":{"$error":"#N/A"}},{"$error":"#N/A"}]
[{"$f":"'Décompo Projet'!B32","v":"MFVN 04"},{"$f":"'Décompo Projet'!C32","v":0},null,{"$f":"'Décompo Projet'!AM32","v":{"$error":"#N/A"}},"-25/-23°C",{"$f":"VLOOKUP(M99,'Puissance unitaire'!$D$2:$H$128,5,FALSE)","v":{"$error":"#N/A"}},{"$f":"VLOOKUP(M99,'Puissance unitaire'!$D$2:$L$128,4,FALSE)","v":{"$error":"#N/A"}},{"$error":"#N/A"},{"$f":"'Décompo Projet'!G32","v":0.14000000000000001},"Electrique",null,null,{"$f":"'Décompo Projet'!M32","v":0},{"$error":"#N/A"},{"$f":"VLOOKUP(M99,'Puissance unitaire'!$D$2:$L$128,2,FALSE)*I99","v":{"$error":"#N/A"}},{"$f":"VLOOKUP(M99,'Puissance unitaire'!$D$2:$L$128,3,FALSE)","v":{"$error":"#N/A"}},{"$error":"#N/A"}]
[{"$f":"'Décompo Projet'!B33","v":"MFVN 05"},{"$f":"'Décompo Projet'!C33","v":0},null,{"$f":"'Décompo Projet'!AM33","v":{"$error":"#N/A"}},"-25/-23°C",{"$f":"VLOOKUP(M100,'Puissance unitaire'!$D$2:$H$128,5,FALSE)","v":{"$error":"#N/A"}},{"$f":"VLOOKUP(M100,'Puissance unitaire'!$D$2:$L$128,4,FALSE)","v":{"$error":"#N/A"}},{"$error":"#N/A"},{"$f":"'Décompo Projet'!G33","v":0.14000000000000001},"Electrique",null,null,{"$f":"'Décompo Projet'!M33","v":0},{"$error":"#N/A"},{"$f":"VLOOKUP(M100,'Puissance unitaire'!$D$2:$L$128,2,FALSE)*I100","v":{"$error":"#N/A"}},{"$f":"VLOOKUP(M100,'Puissance unitaire'!$D$2:$L$128,3,FALSE)","v":{"$error":"#N/A"}},{"$error":"#N/A"}]
[{"$f":"'Décompo Projet'!B34","v":"MFVN 06"},{"$f":"'Décompo Projet'!C34","v":0},null,{"$f":"'Décompo Projet'!AM34","v":{"$error":"#N/A"}},"-25/-23°C",{"$f":"VLOOKUP(M101,'Puissance unitaire'!$D$2:$H$128,5,FALSE)","v":{"$error":"#N/A"}},{"$f":"VLOOKUP(M101,'Puissance unitaire'!$D$2:$L$128,4,FALSE)","v":{"$error":"#N/A"}},{"$error":"#N/A"},{"$f":"'Décompo Projet'!G34","v":0.14000000000000001},"Electrique",null,null,{"$f":"'Décompo Projet'!M34","v":0},{"$error":"#N/A"},{"$f":"VLOOKUP(M101,'Puissance unitaire'!$D$2:$L$128,2,FALSE)*I101","v":{"$error":"#N/A"}},{"$f":"VLOOKUP(M101,'Puissance unitaire'!$D$2:$L$128,3,FALSE)","v":{"$error":"#N/A"}},{"$error":"#N/A"}]
[{"$f":"'Décompo Projet'!B35","v":"MFVN 07"},{"$f":"'Décompo Projet'!C35","v":0},null,{"$f":"'Décompo Projet'!AM35","v":{"$error":"#N/A"}},"-25/-23°C",{"$f":"VLOOKUP(M102,'Puissance unitaire'!$D$2:$H$128,5,FALSE)","v":{"$error":"#N/A"}},{"$f":"VLOOKUP(M102,'Puissance unitaire'!$D$2:$L$128,4,FALSE)","v":{"$error":"#N/A"}},{"$error":"#N/A"},{"$f":"'Décompo Projet'!G35","v":0.14000000000000001},"Electrique",null,null,{"$f":"'Décompo Projet'!M35","v":0},{"$error":"#N/A"},{"$f":"VLOOKUP(M102,'Puissance unitaire'!$D$2:$L$128,2,FALSE)*I102","v":{"$error":"#N/A"}},{"$f":"VLOOKUP(M102,'Puissance unitaire'!$D$2:$L$128,3,FALSE)","v":{"$error":"#N/A"}},{"$error":"#N/A"}]
[{"$f":"'Décompo Projet'!B36","v":"MFVN 08"},{"$f":"'Décompo Projet'!C36","v":0},null,{"$f":"'Décompo Projet'!AM36","v":{"$error":"#N/A"}},"-25/-23°C",{"$f":"VLOOKUP(M103,'Puissance unitaire'!$D$2:$H$128,5,FALSE)","v":{"$error":"#N/A"}},{"$f":"VLOOKUP(M103,'Puissance unitaire'!$D$2:$L$128,4,FALSE)","v":{"$error":"#N/A"}},{"$error":"#N/A"},{"$f":"'Décompo Projet'!G36","v":0.14000000000000001},"Electrique",null,null,{"$f":"'Décompo Projet'!M36","v":0},{"$error":"#N/A"},{"$f":"VLOOKUP(M103,'Puissance unitaire'!$D$2:$L$128,2,FALSE)*I103","v":{"$error":"#N/A"}},{"$f":"VLOOKUP(M103,'Puissance unitaire'!$D$2:$L$128,3,FALSE)","v":{"$error":"#N/A"}},{"$error":"#N/A"}]
[{"$f":"'Décompo Projet'!B37","v":"MFVN 09"},{"$f":"'Décompo Projet'!C37","v":0},null,{"$f":"'Décompo Projet'!AM37","v":{"$error":"#N/A"}},"-25/-23°C",{"$f":"VLOOKUP(M104,'Puissance unitaire'!$D$2:$H$128,5,FALSE)","v":{"$error":"#N/A"}},{"$f":"VLOOKUP(M104,'Puissance unitaire'!$D$2:$L$128,4,FALSE)","v":{"$error":"#N/A"}},{"$error":"#N/A"},{"$f":"'Décompo Projet'!G37","v":0.14000000000000001},"Electrique",null,null,{"$f":"'Décompo Projet'!M37","v":0},{"$error":"#N/A"},{"$f":"VLOOKUP(M104,'Puissance unitaire'!$D$2:$L$128,2,FALSE)*I104","v":{"$error":"#N/A"}},{"$f":"VLOOKUP(M104,'Puissance unitaire'!$D$2:$L$128,3,FALSE)","v":{"$error":"#N/A"}},{"$error":"#N/A"}]
[{"$f":"'Décompo Projet'!B38","v":"MFVN 10"},{"$f":"'Décompo Projet'!C38","v":0},null,{"$f":"'Décompo Projet'!AM38","v":{"$error":"#N/A"}},"-25/-23°C",{"$f":"VLOOKUP(M105,'Puissance unitaire'!$D$2:$H$128,5,FALSE)","v":{"$error":"#N/A"}},{"$f":"VLOOKUP(M105,'Puissance unitaire'!$D$2:$L$128,4,FALSE)","v":{"$error":"#N/A"}},{"$error":"#N/A"},{"$f":"'Décompo Projet'!G38","v":0.14000000000000001},"Electrique",null,null,{"$f":"'Décompo Projet'!M38","v":0},{"$error":"#N/A"},{"$f":"VLOOKUP(M105,'Puissance unitaire'!$D$2:$L$128,2,FALSE)*I105","v":{"$error":"#N/A"}},{"$f":"VLOOKUP(M105,'Puissance unitaire'!$D$2:$L$128,3,FALSE)","v":{"$error":"#N/A"}},{"$error":"#N/A"}]
[{"$f":"'Décompo Projet'!B39","v":"MFVN 11"},{"$f":"'Décompo Projet'!C39","v":0},null,{"$f":"'Décompo Projet'!AM39","v":{"$error":"#N/A"}},"-25/-23°C",{"$f":"VLOOKUP(M106,'Puissance unitaire'!$D$2:$H$128,5,FALSE)","v":{"$error":"#N/A"}},{"$f":"VLOOKUP(M106,'Puissance unitaire'!$D$2:$L$128,4,FALSE)","v":{"$error":"#N/A"}},{"$error":"#N/A"},{"$f":"'Décompo Projet'!G39","v":0.14000000000000001},"Electrique",null,null,{"$f":"'Décompo Projet'!M39","v":0},{"$error":"#N/A"},{"$f":"VLOOKUP(M106,'Puissance unitaire'!$D$2:$L$128,2,FALSE)*I106","v":{"$error":"#N/A"}},{"$f":"VLOOKUP(M106,'Puissance unitaire'!$D$2:$L$128,3,FALSE)","v":{"$error":"#N/A"}},{"$error":"#N/A"}]
[{"$f":"'Décompo Projet'!B40","v":"MFVN 12"},{"$f":"'Décompo Projet'!C40","v":0},null,{"$f":"'Décompo Projet'!AM40","v":{"$error":"#N/A"}},"-25/-23°C",{"$f":"VLOOKUP(M107,'Puissance unitaire'!$D$2:$H$128,5,FALSE)","v":{"$error":"#N/A"}},{"$f":"VLOOKUP(M107,'Puissance unitaire'!$D$2:$L$128,4,FALSE)","v":{"$error":"#N/A"}},{"$error":"#N/A"},{"$f":"'Décompo Projet'!G40","v":0.14000000000000001},"Electrique",null,null,{"$f":"'Décompo Projet'!M40","v":0},{"$error":"#N/A"},{"$f":"VLOOKUP(M107,'Puissance unitaire'!$D$2:$L$128,2,FALSE)*I107","v":{"$error":"#N/A"}},{"$f":"VLOOKUP(M107,'Puissance unitaire'!$D$2:$L$128,3,FALSE)","v":{"$error":"#N/A"}},{"$error":"#N/A"}]
[{"$f":"'Décompo Projet'!B41","v":"MFVN 13"},{"$f":"'Décompo Projet'!C41","v":0},null,{"$f":"'Décompo Projet'!AM41","v":{"$error":"#N/A"}},"-25/-23°C",{"$f":"VLOOKUP(M108,'Puissance unitaire'!$D$2:$H$128,5,FALSE)","v":{"$error":"#N/A"}},{"$f":"VLOOKUP(M108,'Puissance unitaire'!$D$2:$L$128,4,FALSE)","v":{"$error":"#N/A"}},{"$error":"#N/A"},{"$f":"'Décompo Projet'!G41","v":0.14000000000000001},"Electrique",null,null,{"$f":"'Décompo Projet'!M41","v":0},{"$error":"#N/A"},{"$f":"VLOOKUP(M108,'Puissance unitaire'!$D$2:$L$128,2,FALSE)*I108","v":{"$error":"#N/A"}},{"$f":"VLOOKUP(M108,'Puissance unitaire'!$D$2:$L$128,3,FALSE)","v":{"$error":"#N/A"}},{"$error":"#N/A"}]
[{"$f":"'Décompo Projet'!B42","v":"MFVN 14"},{"$f":"'Décompo Projet'!C42","v":0},null,{"$f":"'Décompo Projet'!AM42","v":{"$error":"#N/A"}},"-25/-23°C",{"$f":"VLOOKUP(M109,'Puissance unitaire'!$D$2:$H$128,5,FALSE)","v":{"$error":"#N/A"}},{"$f":"VLOOKUP(M109,'Puissance unitaire'!$D$2:$L$128,4,FALSE)","v":{"$error":"#N/A"}},{"$error":"#N/A"},{"$f":"'Décompo Projet'!G42","v":0.14000000000000001},"Electrique",null,null,{"$f":"'Décompo Projet'!M42","v":0},{"$error":"#N/A"},{"$f":"VLOOKUP(M109,'Puissance unitaire'!$D$2:$L$128,2,FALSE)*I109","v":{"$error":"#N/A"}},{"$f":"VLOOKUP(M109,'Puissance unitaire'!$D$2:$L$128,3,FALSE)","v":{"$error":"#N/A"}},{"$error":"#N/A"}]
[{"$f":"'Décompo Projet'!B43","v":"MFVN 15"},{"$f":"'Décompo Projet'!C43","v":0},null,{"$f":"'Décompo Projet'!AM43","v":{"$error":"#N/A"}},"-25/-23°C",{"$f":"VLOOKUP(M110,'Puissance unitaire'!$D$2:$H$128,5,FALSE)","v":{"$error":"#N/A"}},{"$f":"VLOOKUP(M110,'Puissance unitaire'!$D$2:$L$128,4,FALSE)","v":{"$error":"#N/A"}},{"$error":"#N/A"},{"$f":"'Décompo Projet'!G43","v":0.14000000000000001},"Electrique",null,null,{"$f":"'Décompo Projet'!M43","v":0},{"$error":"#N/A"},{"$f":"VLOOKUP(M110,'Puissance unitaire'!$D$2:$L$128,2,FALSE)*I110","v":{"$error":"#N/A"}},{"$f":"VLOOKUP(M110,'Puissance unitaire'!$D$2:$L$128,3,FALSE)","v":{"$error":"#N/A"}},{"$error":"#N/A"}]
[{"$f":"'Décompo Projet'!B44","v":"MFVN 16"},{"$f":"'Décompo Projet'!C44","v":0},null,{"$f":"'Décompo Projet'!AM44","v":{"$error":"#N/A"}},"-25/-23°C",{"$f":"VLOOKUP(M111,'Puissance unitaire'!$D$2:$H$128,5,FALSE)","v":{"$error":"#N/A"}},{"$f":"VLOOKUP(M111,'Puissance unitaire'!$D$2:$L$128,4,FALSE)","v":{"$error":"#N/A"}},{"$error":"#N/A"},{"$f":"'Décompo Projet'!G44","v":0.14000000000000001},"Electrique",null,null,{"$f":"'Décompo Projet'!M44","v":0},{"$error":"#N/A"},{"$f":"VLOOKUP(M111,'Puissance unitaire'!$D$2:$L$128,2,FALSE)*I111","v":{"$error":"#N/A"}},{"$f":"VLOOKUP(M111,'Puissance unitaire'!$D$2:$L$128,3,FALSE)","v":{"$error":"#N/A"}},{"$error":"#N/A"}]
[{"$f":"'Décompo Projet'!B45","v":"MFVN 17"},{"$f":"'Décompo Projet'!C45","v":0},null,{"$f":"'Décompo Projet'!AM45","v":{"$error":"#N/A"}},"-25/-23°C",{"$f":"VLOOKUP(M112,'Puissance unitaire'!$D$2:$H$128,5,FALSE)","v":{"$error":"#N/A"}},{"$f":"VLOOKUP(M112,'Puissance unitaire'!$D$2:$L$128,4,FALSE)","v":{"$error":"#N/A"}},{"$f":"+F112+G112","v":{"$error":"#N/A"}},{"$f":"'Décompo Projet'!G45","v":0.14000000000000001},"Electrique",null,null,{"$f":"'Décompo Projet'!M45","v":0},{"$error":"#N/A"},{"$f":"VLOOKUP(M112,'Puissance unitaire'!$D$2:$L$128,2,FALSE)*I112","v":{"$error":"#N/A"}},{"$f":"VLOOKUP(M112,'Puissance unitaire'!$D$2:$L$128,3,FALSE)","v":{"$error":"#N/A"}},{"$error":"#N/A"}]
[{"$f":"'Décompo Projet'!B46","v":"MFVN 18"},{"$f":"'Décompo Projet'!C46","v":0},null,{"$f":"'Décompo Projet'!AM46","v":{"$error":"#N/A"}},"-25/-23°C",{"$f":"VLOOKUP(M113,'Puissance unitaire'!$D$2:$H$128,5,FALSE)","v":{"$error":"#N/A"}},{"$f":"VLOOKUP(M113,'Puissance unitaire'!$D$2:$L$128,4,FALSE)","v":{"$error":"#N/A"}},{"$f":"+F113+G113","v":{"$error":"#N/A"}},{"$f":"'Décompo Projet'!G46","v":0.14000000000000001},"Electrique",null,null,{"$f":"'Décompo Projet'!M46","v":0},{"$error":"#N/A"},{"$f":"VLOOKUP(M113,'Puissance unitaire'!$D$2:$L$128,2,FALSE)*I113","v":{"$error":"#N/A"}},{"$f":"VLOOKUP(M113,'Puissance unitaire'!$D$2:$L$128,3,FALSE)","v":{"$error":"#N/A"}},{"$error":"#N/A"}]
[{"$f":"'Décompo Projet'!B47","v":"MFVN 19"},{"$f":"'Décompo Projet'!C47","v":0},null,{"$f":"'Décompo Projet'!AM47","v":{"$error":"#N/A"}},"-25/-23°C",{"$f":"VLOOKUP(M114,'Puissance unitaire'!$D$2:$H$128,5,FALSE)","v":{"$error":"#N/A"}},{"$f":"VLOOKUP(M114,'Puissance unitaire'!$D$2:$L$128,4,FALSE)","v":{"$error":"#N/A"}},{"$f":"+F114+G114","v":{"$error":"#N/A"}},{"$f":"'Décompo Projet'!G47","v":0.14000000000000001},"Electrique",null,null,{"$f":"'Décompo Projet'!M47","v":0},{"$error":"#N/A"},{"$f":"VLOOKUP(M114,'Puissance unitaire'!$D$2:$L$128,2,FALSE)*I114","v":{"$error":"#N/A"}},{"$f":"VLOOKUP(M114,'Puissance unitaire'!$D$2:$L$128,3,FALSE)","v":{"$error":"#N/A"}},{"$error":"#N/A"}]
[{"$f":"'Décompo Projet'!B48","v":"MFVN 20"},{"$f":"'Décompo Projet'!C48","v":0},null,{"$f":"'Décompo Projet'!AM48","v":{"$error":"#N/A"}},"-25/-23°C",{"$f":"VLOOKUP(M115,'Puissance unitaire'!$D$2:$H$128,5,FALSE)","v":{"$error":"#N/A"}},{"$f":"VLOOKUP(M115,'Puissance unitaire'!$D$2:$L$128,4,FALSE)","v":{"$error":"#N/A"}},{"$f":"+F115+G115","v":{"$error":"#N/A"}},{"$f":"'Décompo Projet'!G48","v":0.14000000000000001},"Electrique",null,null,{"$f":"'Décompo Projet'!M48","v":0},{"$f":"O115/I115","v":{"$error":"#N/A"}},{"$f":"VLOOKUP(M115,'Puissance unitaire'!$D$2:$L$128,2,FALSE)*I115","v":{"$error":"#N/A"}},{"$f":"VLOOKUP(M115,'Puissance unitaire'!$D$2:$L$128,3,FALSE)","v":{"$error":"#N/A"}},{"$error":"#N/A"}]
[null,"TOTAUX LINEAIRE NÉGATIF",null,{"$f":"SUM(D112:D115)","v":{"$error":"#N/A"}},null,{"$f":"MIN(F112:F115)","v":{"$error":"#N/A"}},null,{"$f":"MIN(H112:H115)","v":{"$error":"#N/A"}},{"$f":"SUM(I112:I115)","v":0.56000000000000005},null,null,null,null,{"$f":"AVERAGE(N112:N115)","v":{"$error":"#N/A"}},{"$f":"SUMIF(O96:O115,\"<>#N/A\",O96:O115)","v":0},{"$f":"AVERAGE(P112:P115)","v":{"$error":"#N/A"}},{"$f":"SUM(Q112:Q115)","v":{"$error":"#N/A"}}]
[null,null,null,null,"Ce total de sonde ne tient pas compte des sondes de régulation au soufflage des meuble"]
[]
[]
[]
[]
[]
[]
[]
[]
[]
[]
[]
[]
[]
[]
[]
[]
[]
[]
[]
[]
[]
[]
[]
[]
[]
[]
[]
[]
[]
[null,null,null,null,null,null,null,null,null,null,null,null,null,null,1.2,305]
[null,null,null,null,null,null,null,null,null,null,null,null,null,null,4.8,{"$f":"P147*O148/O147","v":1220}]

{"sheet":"Décompo Projet","index":9,"n_rows":83,"n_cols":50,"rows_kept":83,"cut":false,"hidden":true,"merged":[]}
[]
[null,null,null,null,"OUI"]
[null,null,null,null,"NON"]
[null,null,null,null,"PARTIEL"]
[null,"REPERE"," MEUBLES FRIGORIFIQUES DE VENTE CONFIGURATION FUTURE","MEUBLES NEUFS","MEUBLES RÉCUPÈRÉS","Longueur intérieure linéaire ","Longueur hors tout du linéaire ","Largeur au sol de meuble","Hauteur de meuble","Cuve","Hauteur de façade","Étagères","Modèle meuble","Nombre de plans de chargement (bac inclus)","Longueur développée",63,94,125,187.5,200,234,250,312,375,390,"AO 45","A0 90","AF 90","TG 125","TG 140","TG 156","TG 187.5","TG 200","TG 220","TG 230","Séparation","Joue Gauche\nMiroir / Vitrée","Joue Droite\nMiroir / Vitrée","TOTAL NOMBRE\nDE MODULES","MODULES NEUFS","MODULES RECUPERES","SORTIE DE TUBES","DÉGIVRAGE","SUPPORT PORTE ETIQUETTE+ PORTE ETIQUETTE","ARRET PRODUITS / CLAYETTES DE CUVE","PLATEAUX D'EXPOSITION","SOUBASSEMENT PLEIN","SOUBASSEMENT A PIED"]
[null,null,"POSITIF",{"$f":"SUM(P6:X6)+SUM(Y6:AA6)","v":0}]
[null,"MFVP 01",null,null,"NON",null,{"$f":"F7+0.14","v":0.14000000000000001},0.9,2.0499999999999998,null,null,null,null,2,{"$f":"F7*N7","v":0},null,null,{"$f":"VLOOKUP($F7,'Decompo DB'!$A$3:$G$70,4,FALSE)","v":{"$error":"#N/A"}},{"$f":"VLOOKUP($F7,'Decompo DB'!$A$3:$G$70,5,FALSE)","v":{"$error":"#N/A"}},null,null,{"$f":"VLOOKUP($F7,'Decompo DB'!$A$3:$G$70,6,FALSE)","v":{"$error":"#N/A"}},null,{"$f":"VLOOKUP($F7,'Decompo DB'!$A$3:$G$70,7,FALSE)","v":{"$error":"#N/A"}},null,null,null,null,null,null,null,null,null,null,null,null,null,null,{"$f":"SUM(P7:AI7)","v":{"$error":"#N/A"}},{"$f":"IF(D7=\"OUI\",AM7,0.000001)","v":9.9999999999999995E-7},{"$f":"IF(D7=\"OUI\",0.0000001,AM7-AN7)","v":{"$error":"#N/A"}}]
[null,"MFVP 02",null,null,"NON",null,{"$f":"F8+0.14","v":0.14000000000000001},0.9,2.0499999999999998,null,null,null,null,2,{"$f":"F8*N8","v":0},null,null,{"$f":"VLOOKUP($F8,'Decompo DB'!$A$3:$G$70,4,FALSE)","v":{"$error":"#N/A"}},{"$f":"VLOOKUP($F8,'Decompo DB'!$A$3:$G$70,5,FALSE)","v":{"$error":"#N/A"}},null,null,{"$f":"VLOOKUP($F8,'Decompo DB'!$A$3:$G$70,6,FALSE)","v":{"$error":"#N/A"}},null,{"$f":"VLOOKUP($F8,'Decompo DB'!$A$3:$G$70,7,FALSE)","v":{"$error":"#N/A"}},null,null,null,null,null,null,null,null,null,null,null,null,null,null,{"$f":"SUM(P8:AI8)","v":{"$error":"#N/A"}},{"$f":"IF(D8=\"OUI\",AM8,0.000001)","v":9.9999999999999995E-7},{"$f":"IF(D8=\"OUI\",0.0000001,AM8-AN8)","v":{"$error":"#N/A"}}]
[null,"MFVP 03",null,null,null,null,{"$f":"F9+0.14","v":0.14000000000000001},0.9,2.0499999999999998,null,null,null,null,2,0,null,null,{"$f":"VLOOKUP($F9,'Decompo DB'!$A$3:$G$70,4,FALSE)","v":{"$error":"#N/A"}},{"$f":"VLOOKUP($F9,'Decompo DB'!$A$3:$G$70,5,FALSE)","v":{"$error":"#N/A"}},null,null,{"$f":"VLOOKUP($F9,'Decompo DB'!$A$3:$G$70,6,FALSE)","v":{"$error":"#N/A"}},null,{"$f":"VLOOKUP($F9,'Decompo DB'!$A$3:$G$70,7,FALSE)","v":{"$error":"#N/A"}},null,null,null,null,null,null,null,null,null,null,null,null,null,null,{"$error":"#N/A"},9.9999999999999995E-7,{"$error":"#N/A"}]
[null,"MFVP 04",null,null,null,null,0.14000000000000001,0.9,2.0499999999999998,null,null,null,null,2,0,null,null,{"$f":"VLOOKUP($F10,'Decompo DB'!$A$3:$G$70,4,FALSE)","v":{"$error":"#N/A"}},{"$f":"VLOOKUP($F10,'Decompo DB'!$A$3:$G$70,5,FALSE)","v":{"$error":"#N/A"}},null,null,{"$f":"VLOOKUP($F10,'Decompo DB'!$A$3:$G$70,6,FALSE)","v":{"$error":"#N/A"}},null,{"$f":"VLOOKUP($F10,'Decompo DB'!$A$3:$G$70,7,FALSE)","v":{"$error":"#N/A"}},null,null,null,null,null,null,null,null,null,null,null,null,null,null,{"$error":"#N/A"},9.9999999999999995E-7,{"$error":"#N/A"}]
[null,"MFVP 05",null,null,null,null,0.14000000000000001,0.9,2.0499999999999998,null,null,null,null,2,0,null,null,{"$f":"VLOOKUP($F11,'Decompo DB'!$A$3:$G$70,4,FALSE)","v":{"$error":"#N/A"}},{"$f":"VLOOKUP($F11,'Decompo DB'!$A$3:$G$70,5,FALSE)","v":{"$error":"#N/A"}},null,null,{"$f":"VLOOKUP($F11,'Decompo DB'!$A$3:$G$70,6,FALSE)","v":{"$error":"#N/A"}},null,{"$f":"VLOOKUP($F11,'Decompo DB'!$A$3:$G$70,7,FALSE)","v":{"$error":"#N/A"}},null,null,null,null,null,null,null,null,null,null,null,null,null,null,{"$error":"#N/A"},9.9999999999999995E-7,{"$error":"#N/A"}]
[null,"MFVP 06",null,null,null,null,0.14000000000000001,0.9,2.0499999999999998,null,null,null,null,2,0,null,null,{"$f":"VLOOKUP($F12,'Decompo DB'!$A$3:$G$70,4,FALSE)","v":{"$error":"#N/A"}},{"$f":"VLOOKUP($F12,'Decompo DB'!$A$3:$G$70,5,FALSE)","v":{"$error":"#N/A"}},null,null,{"$f":"VLOOKUP($F12,'Decompo DB'!$A$3:$G$70,6,FALSE)","v":{"$error":"#N/A"}},null,{"$f":"VLOOKUP($F12,'Decompo DB'!$A$3:$G$70,7,FALSE)","v":{"$error":"#N/A"}},null,null,null,null,null,null,null,null,null,null,null,null,null,null,{"$error":"#N/A"},9.9999999999999995E-7,{"$error":"#N/A"}]
[null,"MFVP 07",null,null,null,null,0.14000000000000001,0.9,2.0499999999999998,null,null,null,null,2,0,null,null,{"$f":"VLOOKUP($F13,'Decompo DB'!$A$3:$G$70,4,FALSE)","v":{"$error":"#N/A"}},{"$f":"VLOOKUP($F13,'Decompo DB'!$A$3:$G$70,5,FALSE)","v":{"$error":"#N/A"}},null,null,{"$f":"VLOOKUP($F13,'Decompo DB'!$A$3:$G$70,6,FALSE)","v":{"$error":"#N/A"}},null,{"$f":"VLOOKUP($F13,'Decompo DB'!$A$3:$G$70,7,FALSE)","v":{"$error":"#N/A"}},null,null,null,null,null,null,null,null,null,null,null,null,null,null,{"$error":"#N/A"},9.9999999999999995E-7,{"$error":"#N/A"}]
[null,"MFVP 08",null,null,null,null,0.14000000000000001,0.9,2.0499999999999998,null,null,null,null,2,0,null,null,{"$f":"VLOOKUP($F14,'Decompo DB'!$A$3:$G$70,4,FALSE)","v":{"$error":"#N/A"}},{"$f":"VLOOKUP($F14,'Decompo DB'!$A$3:$G$70,5,FALSE)","v":{"$error":"#N/A"}},null,null,{"$f":"VLOOKUP($F14,'Decompo DB'!$A$3:$G$70,6,FALSE)","v":{"$error":"#N/A"}},null,{"$f":"VLOOKUP($F14,'Decompo DB'!$A$3:$G$70,7,FALSE)","v":{"$error":"#N/A"}},null,null,null,null,null,null,null,null,null,null,null,null,null,null,{"$error":"#N/A"},9.9999999999999995E-7,{"$error":"#N/A"}]
[null,"MFVP 09",null,null,null,null,0.14000000000000001,0.9,2.0499999999999998,null,null,null,null,2,0,null,null,{"$f":"VLOOKUP($F15,'Decompo DB'!$A$3:$G$70,4,FALSE)","v":{"$error":"#N/A"}},{"$f":"VLOOKUP($F15,'Decompo DB'!$A$3:$G$70,5,FALSE)","v":{"$error":"#N/A"}},null,null,{"$f":"VLOOKUP($F15,'Decompo DB'!$A$3:$G$70,6,FALSE)","v":{"$error":"#N/A"}},null,{"$f":"VLOOKUP($F15,'Decompo DB'!$A$3:$G$70,7,FALSE)","v":{"$error":"#N/A"}},null,null,null,null,null,null,null,null,null,null,null,null,null,null,{"$error":"#N/A"},9.9999999999999995E-7,{"$error":"#N/A"}]
[null,"MFVP 10",null,null,null,null,0.14000000000000001,0.9,2.0499999999999998,null,null,null,null,2,0,null,null,{"$f":"VLOOKUP($F16,'Decompo DB'!$A$3:$G$70,4,FALSE)","v":{"$error":"#N/A"}},{"$f":"VLOOKUP($F16,'Decompo DB'!$A$3:$G$70,5,FALSE)","v":{"$error":"#N/A"}},null,null,{"$f":"VLOOKUP($F16,'Decompo DB'!$A$3:$G$70,6,FALSE)","v":{"$error":"#N/A"}},null,{"$f":"VLOOKUP($F16,'Decompo DB'!$A$3:$G$70,7,FALSE)","v":{"$error":"#N/A"}},null,null,null,null,null,null,null,null,null,null,null,null,null,null,{"$error":"#N/A"},9.9999999999999995E-7,{"$error":"#N/A"}]
[null,"MFVP 11",null,null,null,null,0.14000000000000001,0.9,2.0499999999999998,null,null,null,null,2,0,null,null,{"$f":"VLOOKUP($F17,'Decompo DB'!$A$3:$G$70,4,FALSE)","v":{"$error":"#N/A"}},{"$f":"VLOOKUP($F17,'Decompo DB'!$A$3:$G$70,5,FALSE)","v":{"$error":"#N/A"}},null,null,{"$f":"VLOOKUP($F17,'Decompo DB'!$A$3:$G$70,6,FALSE)","v":{"$error":"#N/A"}},null,{"$f":"VLOOKUP($F17,'Decompo DB'!$A$3:$G$70,7,FALSE)","v":{"$error":"#N/A"}},null,null,null,null,null,null,null,null,null,null,null,null,null,null,{"$error":"#N/A"},9.9999999999999995E-7,{"$error":"#N/A"}]
[null,"MFVP 12",null,null,null,null,0.14000000000000001,0.9,2.0499999999999998,null,null,null,null,2,0,null,null,{"$f":"VLOOKUP($F18,'Decompo DB'!$A$3:$G$70,4,FALSE)","v":{"$error":"#N/A"}},{"$f":"VLOOKUP($F18,'Decompo DB'!$A$3:$G$70,5,FALSE)","v":{"$error":"#N/A"}},null,null,{"$f":"VLOOKUP($F18,'Decompo DB'!$A$3:$G$70,6,FALSE)","v":{"$error":"#N/A"}},null,{"$f":"VLOOKUP($F18,'Decompo DB'!$A$3:$G$70,7,FALSE)","v":{"$error":"#N/A"}},null,null,null,null,null,null,null,null,null,null,null,null,null,null,{"$error":"#N/A"},9.9999999999999995E-7,{"$error":"#N/A"}]
[null,"MFVP 13",null,null,null,null,0.14000000000000001,0.9,2.0499999999999998,null,null,null,null,2,0,null,null,{"$f":"VLOOKUP($F19,'Decompo DB'!$A$3:$G$70,4,FALSE)","v":{"$error":"#N/A"}},{"$f":"VLOOKUP($F19,'Decompo DB'!$A$3:$G$70,5,FALSE)","v":{"$error":"#N/A"}},null,null,{"$f":"VLOOKUP($F19,'Decompo DB'!$A$3:$G$70,6,FALSE)","v":{"$error":"#N/A"}},null,{"$f":"VLOOKUP($F19,'Decompo DB'!$A$3:$G$70,7,FALSE)","v":{"$error":"#N/A"}},null,null,null,null,null,null,null,null,null,null,null,null,null,null,{"$error":"#N/A"},9.9999999999999995E-7,{"$error":"#N/A"}]
[null,"MFVP 14",null,null,null,null,0.14000000000000001,0.9,2.0499999999999998,null,null,null,null,2,0,null,null,{"$f":"VLOOKUP($F20,'Decompo DB'!$A$3:$G$70,4,FALSE)","v":{"$error":"#N/A"}},{"$f":"VLOOKUP($F20,'Decompo DB'!$A$3:$G$70,5,FALSE)","v":{"$error":"#N/A"}},null,null,{"$f":"VLOOKUP($F20,'Decompo DB'!$A$3:$G$70,6,FALSE)","v":{"$error":"#N/A"}},null,{"$f":"VLOOKUP($F20,'Decompo DB'!$A$3:$G$70,7,FALSE)","v":{"$error":"#N/A"}},null,null,null,null,null,null,null,null,null,null,null,null,null,null,{"$error":"#N/A"},9.9999999999999995E-7,{"$error":"#N/A"}]
[null,"MFVP 15",null,null,null,null,0.14000000000000001,0.9,2.0499999999999998,null,null,null,null,2,0,null,null,{"$f":"VLOOKUP($F21,'Decompo DB'!$A$3:$G$70,4,FALSE)","v":{"$error":"#N/A"}},{"$f":"VLOOKUP($F21,'Decompo DB'!$A$3:$G$70,5,FALSE)","v":{"$error":"#N/A"}},null,null,{"$f":"VLOOKUP($F21,'Decompo DB'!$A$3:$G$70,6,FALSE)","v":{"$error":"#N/A"}},null,{"$f":"VLOOKUP($F21,'Decompo DB'!$A$3:$G$70,7,FALSE)","v":{"$error":"#N/A"}},null,null,null,null,null,null,null,null,null,null,null,null,null,null,{"$error":"#N/A"},9.9999999999999995E-7,{"$error":"#N/A"}]
[null,"MFVP 16",null,null,null,null,0.14000000000000001,0.9,2.0499999999999998,null,null,null,null,2,0,null,null,{"$f":"VLOOKUP($F22,'Decompo DB'!$A$3:$G$70,4,FALSE)","v":{"$error":"#N/A"}},{"$f":"VLOOKUP($F22,'Decompo DB'!$A$3:$G$70,5,FALSE)","v":{"$error":"#N/A"}},null,null,{"$f":"VLOOKUP($F22,'Decompo DB'!$A$3:$G$70,6,FALSE)","v":{"$error":"#N/A"}},null,{"$f":"VLOOKUP($F22,'Decompo DB'!$A$3:$G$70,7,FALSE)","v":{"$error":"#N/A"}},null,null,null,null,null,null,null,null,null,null,null,null,null,null,{"$error":"#N/A"},9.9999999999999995E-7,{"$error":"#N/A"}]
[null,"MFVP 17",null,null,null,null,0.14000000000000001,0.9,2.0499999999999998,null,null,null,null,2,0,null,null,{"$f":"VLOOKUP($F23,'Decompo DB'!$A$3:$G$70,4,FALSE)","v":{"$error":"#N/A"}},{"$f":"VLOOKUP($F23,'Decompo DB'!$A$3:$G$70,5,FALSE)","v":{"$error":"#N/A"}},null,null,{"$f":"VLOOKUP($F23,'Decompo DB'!$A$3:$G$70,6,FALSE)","v":{"$error":"#N/A"}},null,{"$f":"VLOOKUP($F23,'Decompo DB'!$A$3:$G$70,7,FALSE)","v":{"$error":"#N/A"}},null,null,null,null,null,null,null,null,null,null,null,null,null,null,{"$error":"#N/A"},9.9999999999999995E-7,{"$error":"#N/A"}]
[null,"MFVP 18",null,null,null,null,0.14000000000000001,0.9,2.0499999999999998,null,null,null,null,2,0,null,null,{"$f":"VLOOKUP($F24,'Decompo DB'!$A$3:$G$70,4,FALSE)","v":{"$error":"#N/A"}},{"$f":"VLOOKUP($F24,'Decompo DB'!$A$3:$G$70,5,FALSE)","v":{"$error":"#N/A"}},null,null,{"$f":"VLOOKUP($F24,'Decompo DB'!$A$3:$G$70,6,FALSE)","v":{"$error":"#N/A"}},null,{"$f":"VLOOKUP($F24,'Decompo DB'!$A$3:$G$70,7,FALSE)","v":{"$error":"#N/A"}},null,null,null,null,null,null,null,null,null,null,null,null,null,null,{"$error":"#N/A"},9.9999999999999995E-7,{"$error":"#N/A"}]
[null,"MFVP 19",null,null,"NON",null,0.14000000000000001,0.9,2.0499999999999998,null,null,null,null,2,0,null,null,{"$f":"VLOOKUP($F25,'Decompo DB'!$A$3:$G$70,4,FALSE)","v":{"$error":"#N/A"}},{"$f":"VLOOKUP($F25,'Decompo DB'!$A$3:$G$70,5,FALSE)","v":{"$error":"#N/A"}},null,null,{"$f":"VLOOKUP($F25,'Decompo DB'!$A$3:$G$70,6,FALSE)","v":{"$error":"#N/A"}},null,{"$f":"VLOOKUP($F25,'Decompo DB'!$A$3:$G$70,7,FALSE)","v":{"$error":"#N/A"}},null,null,null,null,null,null,null,null,null,null,null,null,null,null,{"$error":"#N/A"},9.9999999999999995E-7,{"$error":"#N/A"}]
[null,"MFVP 20",null,null,"NON",null,0.14000000000000001,0.9,2.0499999999999998,null,null,null,null,2,0,null,null,{"$f":"VLOOKUP($F26,'Decompo DB'!$A$3:$G$70,4,FALSE)","v":{"$error":"#N/A"}},{"$f":"VLOOKUP($F26,'Decompo DB'!$A$3:$G$70,5,FALSE)","v":{"$error":"#N/A"}},null,null,{"$f":"VLOOKUP($F26,'Decompo DB'!$A$3:$G$70,6,FALSE)","v":{"$error":"#N/A"}},null,{"$f":"VLOOKUP($F26,'Decompo DB'!$A$3:$G$70,7,FALSE)","v":{"$error":"#N/A"}},null,null,null,null,null,null,null,null,null,null,null,null,null,null,{"$error":"#N/A"},9.9999999999999995E-7,{"$error":"#N/A"}]
[null,null,"TOTAUX LINÉAIRE POSITIF",null,null,{"$f":"SUM(F7:F26)","v":0},{"$f":"SUM(G7:G26)","v":2.8000000000000016},null,{"$f":"SUM(I7:I26)","v":40.999999999999993},null,null,null,null,null,{"$f":"SUM(O7:O26)","v":0},0,0,{"$error":"#N/A"},{"$error":"#N/A"},0,null,{"$f":"SUM(V7:V26)","v":{"$error":"#N/A"}},0,{"$error":"#N/A"},0,0,0,0,0,0,0,0,0,0,0,0,0,0,{"$error":"#N/A"},2.0000000000000005E-5,{"$error":"#N/A"}]
[null,null,"NÉGATIF"]
[null,"MFVN 01",null,null,"NON",null,{"$f":"F29+0.14","v":0.14000000000000001},1.1000000000000001,2.1,null,null,null,null,2,{"$f":"F29*N29","v":0},null,null,null,{"$f":"VLOOKUP($F29,'Decompo DB'!$A$3:$G$70,5,FALSE)","v":{"$error":"#N/A"}},null,null,{"$f":"VLOOKUP($F29,'Decompo DB'!$A$3:$G$70,6,FALSE)","v":{"$error":"#N/A"}},null,{"$f":"VLOOKUP($F29,'Decompo DB'!$A$3:$G$70,7,FALSE)","v":{"$error":"#N/A"}},null,null,null,null,null,null,null,null,null,null,null,null,null,null,{"$f":"+SUM(P29:AI29)","v":{"$error":"#N/A"}},{"$f":"IF(D29=\"OUI\",AM29,0.000001)","v":9.9999999999999995E-7},{"$f":"IF(D29=\"OUI\",0.0000001,AM29-AN29)","v":{"$error":"#N/A"}}]
[null,"MFVN 02",null,null,"NON",null,{"$f":"F30+0.14","v":0.14000000000000001},1.1000000000000001,2.1,null,null,null,null,2,{"$f":"F30*N30","v":0},null,null,null,{"$f":"VLOOKUP($F30,'Decompo DB'!$A$3:$G$70,5,FALSE)","v":{"$error":"#N/A"}},null,null,{"$f":"VLOOKUP($F30,'Decompo DB'!$A$3:$G$70,6,FALSE)","v":{"$error":"#N/A"}},null,{"$f":"VLOOKUP($F30,'Decompo DB'!$A$3:$G$70,7,FALSE)","v":{"$error":"#N/A"}},null,null,null,null,null,null,null,null,null,null,null,null,null,null,{"$error":"#N/A"},9.9999999999999995E-7,{"$error":"#N/A"}]
[null,"MFVN 03",null,null,"NON",null,0.14000000000000001,1.1000000000000001,2.1,null,null,null,null,2,0,null,null,null,{"$f":"VLOOKUP($F31,'Decompo DB'!$A$3:$G$70,5,FALSE)","v":{"$error":"#N/A"}},null,null,{"$f":"VLOOKUP($F31,'Decompo DB'!$A$3:$G$70,6,FALSE)","v":{"$error":"#N/A"}},null,{"$f":"VLOOKUP($F31,'Decompo DB'!$A$3:$G$70,7,FALSE)","v":{"$error":"#N/A"}},null,null,null,null,null,null,null,null,null,null,null,null,null,null,{"$error":"#N/A"},9.9999999999999995E-7,{"$error":"#N/A"}]
[null,"MFVN 04",null,null,"NON",null,0.14000000000000001,1.1000000000000001,2.1,null,null,null,null,2,0,null,null,null,{"$f":"VLOOKUP($F32,'Decompo DB'!$A$3:$G$70,5,FALSE)","v":{"$error":"#N/A"}},null,null,{"$f":"VLOOKUP($F32,'Decompo DB'!$A$3:$G$70,6,FALSE)","v":{"$error":"#N/A"}},null,{"$f":"VLOOKUP($F32,'Decompo DB'!$A$3:$G$70,7,FALSE)","v":{"$error":"#N/A"}},null,null,null,null,null,null,null,null,null,null,null,null,null,null,{"$error":"#N/A"},9.9999999999999995E-7,{"$error":"#N/A"}]
[null,"MFVN 05",null,null,"NON",null,0.14000000000000001,1.1000000000000001,2.1,null,null,null,null,2,0,null,null,null,{"$f":"VLOOKUP($F33,'Decompo DB'!$A$3:$G$70,5,FALSE)","v":{"$error":"#N/A"}},null,null,{"$f":"VLOOKUP($F33,'Decompo DB'!$A$3:$G$70,6,FALSE)","v":{"$error":"#N/A"}},null,{"$f":"VLOOKUP($F33,'Decompo DB'!$A$3:$G$70,7,FALSE)","v":{"$error":"#N/A"}},null,null,null,null,null,null,null,null,null,null,null,null,null,null,{"$error":"#N/A"},9.9999999999999995E-7,{"$error":"#N/A"}]
[null,"MFVN 06",null,null,"NON",null,0.14000000000000001,1.1000000000000001,2.1,null,null,null,null,2,0,null,null,null,{"$f":"VLOOKUP($F34,'Decompo DB'!$A$3:$G$70,5,FALSE)","v":{"$error":"#N/A"}},null,null,{"$f":"VLOOKUP($F34,'Decompo DB'!$A$3:$G$70,6,FALSE)","v":{"$error":"#N/A"}},null,{"$f":"VLOOKUP($F34,'Decompo DB'!$A$3:$G$70,7,FALSE)","v":{"$error":"#N/A"}},null,null,null,null,null,null,null,null,null,null,null,null,null,null,{"$error":"#N/A"},9.9999999999999995E-7,{"$error":"#N/A"}]
[null,"MFVN 07",null,null,"NON",null,0.14000000000000001,1.1000000000000001,2.1,null,null,null,null,2,0,null,null,null,{"$f":"VLOOKUP($F35,'Decompo DB'!$A$3:$G$70,5,FALSE)","v":{"$error":"#N/A"}},null,null,{"$f":"VLOOKUP($F35,'Decompo DB'!$A$3:$G$70,6,FALSE)","v":{"$error":"#N/A"}},null,{"$f":"VLOOKUP($F35,'Decompo DB'!$A$3:$G$70,7,FALSE)","v":{"$error":"#N/A"}},null,null,null,null,null,null,null,null,null,null,null,null,null,null,{"$error":"#N/A"},9.9999999999999995E-7,{"$error":"#N/A"}]
[null,"MFVN 08",null,null,"NON",null,0.14000000000000001,1.1000000000000001,2.1,null,null,null,null,2,0,null,null,null,{"$f":"VLOOKUP($F36,'Decompo DB'!$A$3:$G$70,5,FALSE)","v":{"$error":"#N/A"}},null,null,{"$f":"VLOOKUP($F36,'Decompo DB'!$A$3:$G$70,6,FALSE)","v":{"$error":"#N/A"}},null,{"$f":"VLOOKUP($F36,'Decompo DB'!$A$3:$G$70,7,FALSE)","v":{"$error":"#N/A"}},null,null,null,null,null,null,null,null,null,null,null,null,null,null,{"$error":"#N/A"},9.9999999999999995E-7,{"$error":"#N/A"}]
[null,"MFVN 09",null,null,"NON",null,0.14000000000000001,1.1000000000000001,2.1,null,null,null,null,2,0,null,null,null,{"$f":"VLOOKUP($F37,'Decompo DB'!$A$3:$G$70,5,FALSE)","v":{"$error":"#N/A"}},null,null,{"$f":"VLOOKUP($F37,'Decompo DB'!$A$3:$G$70,6,FALSE)","v":{"$error":"#N/A"}},null,{"$f":"VLOOKUP($F37,'Decompo DB'!$A$3:$G$70,7,FALSE)","v":{"$error":"#N/A"}},null,null,null,null,null,null,null,null,null,null,null,null,null,null,{"$error":"#N/A"},9.9999999999999995E-7,{"$error":"#N/A"}]
[null,"MFVN 10",null,null,"NON",null,0.14000000000000001,1.1000000000000001,2.1,null,null,null,null,2,0,null,null,null,{"$f":"VLOOKUP($F38,'Decompo DB'!$A$3:$G$70,5,FALSE)","v":{"$error":"#N/A"}},null,null,{"$f":"VLOOKUP($F38,'Decompo DB'!$A$3:$G$70,6,FALSE)","v":{"$error":"#N/A"}},null,{"$f":"VLOOKUP($F38,'Decompo DB'!$A$3:$G$70,7,FALSE)","v":{"$error":"#N/A"}},null,null,null,null,null,null,null,null,null,null,null,null,null,null,{"$error":"#N/A"},9.9999999999999995E-7,{"$error":"#N/A"}]
[null,"MFVN 11",null,null,"NON",null,0.14000000000000001,1.1000000000000001,2.1,null,null,null,null,2,0,null,null,null,{"$f":"VLOOKUP($F39,'Decompo DB'!$A$3:$G$70,5,FALSE)","v":{"$error":"#N/A"}},null,null,{"$f":"VLOOKUP($F39,'Decompo DB'!$A$3:$G$70,6,FALSE)","v":{"$error":"#N/A"}},null,{"$f":"VLOOKUP($F39,'Decompo DB'!$A$3:$G$70,7,FALSE)","v":{"$error":"#N/A"}},null,null,null,null,null,null,null,null,null,null,null,null,null,null,{"$error":"#N/A"},9.9999999999999995E-7,{"$error":"#N/A"}]
[null,"MFVN 12",null,null,"NON",null,0.14000000000000001,1.1000000000000001,2.1,null,null,null,null,2,0,null,null,null,{"$f":"VLOOKUP($F40,'Decompo DB'!$A$3:$G$70,5,FALSE)","v":{"$error":"#N/A"}},null,null,{"$f":"VLOOKUP($F40,'Decompo DB'!$A$3:$G$70,6,FALSE)","v":{"$error":"#N/A"}},null,{"$f":"VLOOKUP($F40,'Decompo DB'!$A$3:$G$70,7,FALSE)","v":{"$error":"#N/A"}},null,null,null,null,null,null,null,null,null,null,null,null,null,null,{"$error":"#N/A"},9.9999999999999995E-7,{"$error":"#N/A"}]
[null,"MFVN 13",null,null,"NON",null,0.14000000000000001,1.1000000000000001,2.1,null,null,null,null,2,0,null,null,null,{"$f":"VLOOKUP($F41,'Decompo DB'!$A$3:$G$70,5,FALSE)","v":{"$error":"#N/A"}},null,null,{"$f":"VLOOKUP($F41,'Decompo DB'!$A$3:$G$70,6,FALSE)","v":{"$error":"#N/A"}},null,{"$f":"VLOOKUP($F41,'Decompo DB'!$A$3:$G$70,7,FALSE)","v":{"$error":"#N/A"}},null,null,null,null,null,null,null,null,null,null,null,null,null,null,{"$error":"#N/A"},9.9999999999999995E-7,{"$error":"#N/A"}]
[null,"MFVN 14",null,null,"NON",null,0.14000000000000001,1.1000000000000001,2.1,null,null,null,null,2,0,null,null,null,{"$f":"VLOOKUP($F42,'Decompo DB'!$A$3:$G$70,5,FALSE)","v":{"$error":"#N/A"}},null,null,{"$f":"VLOOKUP($F42,'Decompo DB'!$A$3:$G$70,6,FALSE)","v":{"$error":"#N/A"}},null,{"$f":"VLOOKUP($F42,'Decompo DB'!$A$3:$G$70,7,FALSE)","v":{"$error":"#N/A"}},null,null,null,null,null,null,null,null,null,null,null,null,null,null,{"$error":"#N/A"},9.9999999999999995E-7,{"$error":"#N/A"}]
[null,"MFVN 15",null,null,"NON",null,0.14000000000000001,1.1000000000000001,2.1,null,null,null,null,2,0,null,null,null,{"$f":"VLOOKUP($F43,'Decompo DB'!$A$3:$G$70,5,FALSE)","v":{"$error":"#N/A"}},null,null,{"$f":"VLOOKUP($F43,'Decompo DB'!$A$3:$G$70,6,FALSE)","v":{"$error":"#N/A"}},null,{"$f":"VLOOKUP($F43,'Decompo DB'!$A$3:$G$70,7,FALSE)","v":{"$error":"#N/A"}},null,null,null,null,null,null,null,null,null,null,null,null,null,null,{"$error":"#N/A"},9.9999999999999995E-7,{"$error":"#N/A"}]
[null,"MFVN 16",null,null,"NON",null,0.14000000000000001,1.1000000000000001,2.1,null,null,null,null,2,0,null,null,null,{"$f":"VLOOKUP($F44,'Decompo DB'!$A$3:$G$70,5,FALSE)","v":{"$error":"#N/A"}},null,null,{"$f":"VLOOKUP($F44,'Decompo DB'!$A$3:$G$70,6,FALSE)","v":{"$error":"#N/A"}},null,{"$f":"VLOOKUP($F44,'Decompo DB'!$A$3:$G$70,7,FALSE)","v":{"$error":"#N/A"}},null,null,null,null,null,null,null,null,null,null,null,null,null,null,{"$error":"#N/A"},9.9999999999999995E-7,{"$error":"#N/A"}]
[null,"MFVN 17",null,null,"NON",null,0.14000000000000001,1.1000000000000001,2.1,null,null,null,null,2,0,null,null,null,{"$f":"VLOOKUP($F45,'Decompo DB'!$A$3:$G$70,5,FALSE)","v":{"$error":"#N/A"}},null,null,{"$f":"VLOOKUP($F45,'Decompo DB'!$A$3:$G$70,6,FALSE)","v":{"$error":"#N/A"}},null,{"$f":"VLOOKUP($F45,'Decompo DB'!$A$3:$G$70,7,FALSE)","v":{"$error":"#N/A"}},null,null,null,null,null,null,null,null,null,null,null,0,null,null,{"$f":"+SUM(P45:AI45)","v":{"$error":"#N/A"}},9.9999999999999995E-7,{"$f":"IF(D45=\"OUI\",0.0000001,AM45-AN45)","v":{"$error":"#N/A"}}]
[null,"MFVN 18",null,null,"NON",null,0.14000000000000001,1.1000000000000001,2.1,null,null,null,null,2,0,null,null,null,{"$f":"VLOOKUP($F46,'Decompo DB'!$A$3:$G$70,5,FALSE)","v":{"$error":"#N/A"}},null,null,{"$f":"VLOOKUP($F46,'Decompo DB'!$A$3:$G$70,6,FALSE)","v":{"$error":"#N/A"}},null,{"$f":"VLOOKUP($F46,'Decompo DB'!$A$3:$G$70,7,FALSE)","v":{"$error":"#N/A"}},null,null,null,null,null,null,null,null,null,null,null,0,null,null,{"$f":"+SUM(P46:AI46)","v":{"$error":"#N/A"}},9.9999999999999995E-7,{"$f":"IF(D46=\"OUI\",0.0000001,AM46-AN46)","v":{"$error":"#N/A"}}]
[null,"MFVN 19",null,"oui","NON",null,0.14000000000000001,1.1000000000000001,2.1,null,null,null,null,2,0,null,null,null,{"$f":"VLOOKUP($F47,'Decompo DB'!$A$3:$G$70,5,FALSE)","v":{"$error":"#N/A"}},null,null,{"$f":"VLOOKUP($F47,'Decompo DB'!$A$3:$G$70,6,FALSE)","v":{"$error":"#N/A"}},null,{"$f":"VLOOKUP($F47,'Decompo DB'!$A$3:$G$70,7,FALSE)","v":{"$error":"#N/A"}},null,null,null,null,null,null,null,null,null,null,null,0,null,null,{"$f":"+SUM(P47:AI47)","v":{"$error":"#N/A"}},{"$error":"#N/A"},{"$f":"IF(D47=\"OUI\",0.0000001,AM47-AN47)","v":9.9999999999999995E-8}]
[null,"MFVN 20",null,null,"NON",null,0.14000000000000001,1.1000000000000001,2.1,null,null,null,null,2,0,null,null,null,{"$f":"VLOOKUP($F48,'Decompo DB'!$A$3:$G$70,5,FALSE)","v":{"$error":"#N/A"}},null,null,{"$f":"VLOOKUP($F48,'Decompo DB'!$A$3:$G$70,6,FALSE)","v":{"$error":"#N/A"}},null,{"$f":"VLOOKUP($F48,'Decompo DB'!$A$3:$G$70,7,FALSE)","v":{"$error":"#N/A"}},null,null,null,null,null,null,null,null,null,null,null,0,null,null,{"$f":"+SUM(P48:AI48)","v":{"$error":"#N/A"}},9.9999999999999995E-7,{"$f":"IF(D48=\"OUI\",0.0000001,AM48-AN48)","v":{"$error":"#N/A"}}]
[null,null,"TOTAUX LINEAIRE NÉGATIF",null,null,{"$f":"SUM(F45:F48)","v":0},{"$f":"SUM(G45:G48)","v":0.56000000000000005},null,{"$f":"SUM(I45:I48)","v":8.4},null,null,null,null,null,{"$f":"SUM(O45:O48)","v":0},0,0,0,{"$error":"#N/A"},0,null,{"$f":"SUM(V45:V48)","v":{"$error":"#N/A"}},0,{"$error":"#N/A"},0,0,0,0,0,0,0,0,0,0,0,0,0,0,{"$error":"#N/A"},{"$error":"#N/A"},{"$error":"#N/A"}]
[null,null,"TOTAUX LINÉAIRES POSITIF ET NEGATIF",null,null,{"$f":"F27+F49","v":0},{"$f":"G27+G49","v":3.3600000000000017},null,{"$f":"I27+I49","v":49.399999999999991},null,null,null,null,null,{"$f":"O27+O49","v":0},0,0,{"$error":"#N/A"},{"$error":"#N/A"},0,null,{"$f":"V27+V49","v":{"$error":"#N/A"}},0,{"$error":"#N/A"},0,0,0,0,0,0,0,0,0,0,0,0,0,0,{"$error":"#N/A"},{"$error":"#N/A"},{"$error":"#N/A"}]
[]
[]
[]
[null,null,null,null,null,{"$f":"+F65","v":0}]
[]
[]
[]
[]
[]
[null,null,null,null,null,null,null,null,null,null,null,null,null,null,null,null,null,null,null,null,null,null,null,null,null,null,null,null,null,null,null,null,null,null,null,null,null,null,null,null,null,null,null,null,null,null,null,null,null,{"$f":"AM60+AX59","v":0}]
[null,null,null,null,null,null,null,null,null,null,null,null,null,null,null,null,null,null,null,null,null,null,null,null,null,null,null,null,null,null,null,null,null,null,null,null,null,null,null,null,null,null,null,null,null,null,null,null,null,{"$f":"AM61+AX60","v":0}]
[null,null,null,null,null,null,null,null,null,null,null,null,null,null,null,null,null,null,null,null,null,null,null,null,null,null,null,null,null,null,null,null,null,null,null,null,null,null,null,null,null,null,null,null,null,null,null,null,null,0]
[null,null,null,null,null,null,null,null,null,null,null,null,null,null,null,null,null,null,null,null,null,null,null,null,null,null,null,null,null,null,null,null,null,null,null,null,null,null,null,null,null,null,null,null,0.3,null,null,null,null,0]
[null,null,null,null,null,null,null,null,null,null,null,null,null,null,null,null,null,null,null,null,null,null,null,null,null,null,null,null,null,null,null,null,null,null,null,null,null,null,null,null,null,null,null,null,null,null,null,null,null,0]
[null,null,null,null,null,null,null,null,null,null,null,null,null,null,null,null,null,null,null,null,null,null,null,null,null,null,null,null,null,null,null,null,null,null,null,null,null,null,null,null,null,null,null,null,null,null,null,null,null,0]
[null,null,null,null,null,null,null,null,null,null,null,null,null,null,null,null,null,null,null,null,null,null,null,null,null,null,null,null,null,null,null,null,null,null,null,null,null,null,null,null,null,null,null,null,null,null,null,null,null,0]
[null,null,null,null,null,null,null,null,null,null,null,null,null,null,null,null,null,null,null,null,null,null,null,null,null,null,null,null,null,null,null,null,null,null,null,null,null,null,null,null,null,null,null,null,null,null,null,null,null,0]
[null,null,null,null,null,null,null,null,null,null,null,null,null,null,null,null,null,null,null,null,null,null,null,null,null,null,null,null,null,null,null,null,null,null,null,null,null,null,null,null,null,null,null,null,null,null,null,null,null,0]
[null,null,null,null,null,null,null,null,null,null,null,null,null,null,null,null,null,null,null,null,null,null,null,null,null,null,null,null,null,null,null,null,null,null,null,null,null,null,null,null,null,null,null,null,null,null,null,null,null,0]
[null,null,null,null,null,null,null,null,null,null,null,null,null,null,null,null,null,null,null,null,null,null,null,null,null,null,null,null,null,null,null,null,null,null,null,null,null,null,null,null,null,null,null,null,null,null,null,null,null,0]
[null,null,null,null,null,null,null,null,null,null,null,null,null,null,null,null,null,null,null,null,null,null,null,null,null,null,null,null,null,null,null,null,null,null,null,null,null,null,null,null,null,null,null,null,null,null,null,null,null,0]
[null,null,null,null,null,null,null,null,null,null,null,null,null,null,null,null,null,null,null,null,null,null,null,null,null,null,null,null,null,null,null,null,null,null,null,null,null,null,null,null,null,null,null,null,null,null,null,null,null,0]
[null,null,null,null,null,null,null,null,null,null,null,null,null,null,null,null,null,null,null,null,null,null,null,null,null,null,null,null,null,null,null,null,null,null,null,null,null,null,null,null,null,null,null,null,null,null,null,null,null,0]
[null,null,null,null,null,null,null,null,null,null,null,null,null,null,null,null,null,null,null,null,null,null,null,null,null,null,null,null,null,null,null,null,null,null,null,null,null,null,null,null,null,null,null,null,null,null,null,null,null,0]
[null,null,null,null,null,null,null,null,null,null,null,null,null,null,null,null,null,null,null,null,null,null,null,null,null,null,null,null,null,null,null,null,null,null,null,null,null,null,null,null,null,null,null,null,null,null,null,null,null,0]
[null,null,null,null,null,null,null,null,null,null,null,null,null,null,null,null,null,null,null,null,null,null,null,null,null,null,null,null,null,null,null,null,null,null,null,null,null,null,null,null,null,null,null,null,null,null,null,null,null,0]
[]
[]
[]
[null,null,null,null,null,null,null,null,null,null,null,null,null,null,null,null,null,null,null,null,null,null,null,null,null,8,null,null,null,null,null,null,null,null,null,null,null,null,null,null,null,null,null,null,null,null,null,null,null,{"$f":"AM80+AX79","v":0}]
[null,null,null,null,null,null,null,null,null,null,null,null,null,null,null,null,null,null,null,null,null,null,null,null,null,null,null,null,null,null,null,null,null,null,null,null,null,null,null,4,null,null,null,null,null,null,null,null,null,{"$f":"AM81+AX80","v":0}]
[null,null,null,null,null,null,null,null,null,null,null,null,null,null,null,null,null,null,null,null,null,null,null,null,null,null,null,null,null,null,null,null,null,null,null,null,null,null,null,4,null,null,null,null,null,null,null,null,null,{"$f":"AM82+AX81","v":0}]
[null,null,null,{"$f":"SUM(D79:D82)","v":0}]

{"sheet":"Table condenseur","index":10,"n_rows":72,"n_cols":22,"rows_kept":72,"cut":false,"hidden":true,"merged":[]}
[]
["Marque","R134a Hélicoïde","Tension","P","Débit","Vitesse","dB à 10m","dB","Ventilateur","Prix","LUVE","EC"]
["LUVE","SAV5R 4510 H 230V",230,10,3720,760,32,63,1,1678,{"$f":"1040","v":1040},263,{"$f":"K3+L3","v":1303},{"$f":"B3","v":"SAV5R 4510 H 230V"},{"$f":"K3+L3","v":1303},0.55000000000000004]
["LUVE","SAV6R 6610 H 380V",380,{"$f":"D3+5","v":15},5200,640,32,63,1,1996.2,{"$f":"J4*$P$3","v":1097.9100000000001},310,{"$f":"K4+L4","v":1407.91},{"$f":"B4","v":"SAV6R 6610 H 380V"},{"$f":"K4+L4","v":1407.91}]
["LUVE","SAV7S 8511 H 380V",380,{"$f":"D4+5","v":20},5610,490,32,63,1,2597,{"$f":"J5*$P$3","v":1428.3500000000001},464,1892.3500000000001,"SAV7S 8511 H 380V",1892.3500000000001]
["LUVE","SAV6R 6620 H 380V",380,25,6200,570,32,63,2,3186,1752.3000000000002,620,2372.3000000000002,"SAV6R 6620 H 380V",2372.3000000000002]
["LUVE","EAV8T 8110 H 380V",380,30,10040,500,32,63,1,3695,1980,393,2373,"EAV8T 8110 H 380V",2373]
["LUVE","EAV9U 5110 H 230V",230,35,11400,460,32,63,1,3811,2096.0500000000002,418,2514.0500000000002,"EAV9U 5110 H 230V",2514.0500000000002]
["LUVE","XAV9X 8911 H 380V",380,40,11190,460,32,63,1,4835,2659.25,418,3077.25,"XAV9X 8911 H 380V",3077.25]
["LUVE","EAV6R 7630 H 380V",380,45,14100,550,32,64,3,5173,2845.15,930,3775.15,"EAV6R 7630 H 380V",3775.15]
["LUVE","SAV8T 3120 H 230V",230,50,16930,350,32,64,2,5906,3248.3,786,4034.3,"SAV8T 3120 H 230V",4034.3]
["LUVE","EAV8T 8120 H 380V",380,55,18430,470,32,64,2,6549,3601.9500000000003,786,4387.9500000000007,"EAV8T 8120 H 380V",4387.9500000000007]
["LUVE","EAV8T 8120 H 380V",380,60,18430,470,32,64,2,6549,3601.9500000000003,786,4387.9500000000007,"EAV8T 8120 H 380V",4387.9500000000007]
["LUVE","EAV9U 5120 H 230V",230,65,20960,430,32,64,2,6782,3730.1000000000004,836,4566.1000000000004,"EAV9U 5120 H 230V",4566.1000000000004]
["LUVE","XAV9X 7912 H 380V",380,70,21990,430,32,64,2,7592,4100,836,4936,"XAV9X 7912 H 380V",4936]
["LUVE","XAV9X 8912 H 230V",230,75,20560,430,32,64,2,8792,4835.6000000000004,836,5671.6,"XAV9X 8912 H 230V",5671.6]
["LUVE","EAV8T 8130 H 380V",380,80,25230,430,32,64,3,9426,5184.3,1179,6363.3,"EAV8T 8130 H 380V",6363.3]
["LUVE","EAV9U 5130 H 230V",230,85,28750,400,32,64,3,9775,5376.25,1254,6630.25,"EAV9U 5130 H 230V",6630.25]
["LUVE","EAV9U 5130 H 230V",230,90,28750,450,32,64,3,9775,5376.25,1254,6630.25,"EAV9U 5130 H 230V",6630.25]
["LUVE","XAV9X 7913 H 380V",380,{"$f":"D19+5","v":95},30260,400,32,64,3,11054,6000,1254,7254,"XAV9X 7913 H 380V",7254]
["LUVE","XAV9X 7913 H 380V",380,{"$f":"D20+5","v":100},30260,1000,32,64,3,11054,6079.7000000000007,1254,7333.7000000000007,{"$f":"B21","v":"XAV9X 7913 H 380V"},7333.7000000000007]
["LUVE","LMC3N1510",230,9.3000000000000007,2700,null,41,67,1,"A estimer"]
["LUVE","LMC3N1511",230,11,2500,null,41,67,1,"A estimer"]
["LUVE","LMC3N1520",230,18.600000000000001,5400,null,44,69,2,"A estimer"]
["LUVE","LMC6R3518",230,24.8,6200,null,35,65,1,"A estimer"]
["LUVE","LMC6R3519",230,27.8,5700,null,35,65,1,"A estimer"]
["LUVE","LMC3N1531",230,33,7500,null,46,71,3,"A estimer"]
["LUVE","LMC3N1540",230,37.200000000000003,10800,null,47,72,4,"A estimer"]
["LUVE","LMC3N1541",230,44,10000,null,47,72,4,"A estimer"]
["LUVE","LMC6R3528",230,49.6,12400,null,38,68,2,"A estimer"]
["LUVE","LMC5S2525",400,51.8,10400,null,45,70,2,"A estimer"]
["LUVE","SHVN54/8",230,55.2,11600,null,49,74,8,"A estimer"]
["LUVE","SAV5N5331",400,71.099999999999994,17100,null,48,73,3,"A estimer"]
["LUVE","LMC6S3527",400,69.400000000000006,15400,null,44,70,2,"A estimer"]
["LUVE","LMC5S2534",400,73.5,16800,null,46,71,3,"A estimer"]
["LUVE","LMC5S2535",400,77.7,15600,null,46,71,3,"A estimer"]
["LUVE","SAV5N4346",400,106.4,27200,null,54,75,4,"A estimer"]
["LUVE","SAV5N4465",400,101.4,28200,null,45,70,4,"A estimer"]
["LUVE","LMC6S3537",400,104.1,23100,null,45,70,3,"A estimer"]
["LUVE","SHVN5/4",230,5.7,1700,null,38,67,1,"A estimer"]
["LUVE","SHVN6/4",230,6.5,1500,null,38,67,1,"A estimer"]
["LUVE","SAV5N4466",400,116.4,25800,null,45,70,6,"A estimer"]
["LUVE","SAV6N6450",400,122.5,33000,null,40,68,5,"A estimer"]
["LUVE","SAV8S",400,136,34400,null,50,72,2,"A estimer"]
["LUVE","SAV8T3130",400,141,40200,null,46,71,3,"A estimer"]
["LUVE","SAV8S",400,150,32200,null,50,72,2,"A estimer"]
["LUVE","SAV8T3131",400,135,28200,null,40,68,3,"A estimer"]
["LUVE","SAV8T",400,160,42400,null,41,69,4,"A estimer"]
["LUVE","SAV8T3131",400,168,37800,null,46,71,3,"A estimer"]
["LUVE","SAV8S2131",400,171,39300,null,46,71,3,"A estimer",null,null,null,"R134a Centrifuge","P","P corrigé à DT10","P","Débit","Vitesse","dB à 10m","Modèle","Prix"]
["LUVE","SAV8S2132",400,177,35700,null,46,71,3,"A estimer",null,null,null,"CAC 143-8P-2",26.71,{"$f":"O51*(0.93*0.67*0.96*1)","v":15.977280960000002},15,5000,750,44,{"$f":"N51","v":"CAC 143-8P-2"},{"$f":"(P51*150)*(1-$K$47)","v":2396.5921440000002}]
["LUVE","SAV8T",400,180,34000,null,41,67,4,"A estimer",null,null,null,"CAC 144-8P-2",33.770000000000003,{"$f":"O52*(0.93*0.67*0.96*1)","v":20.200403520000002},20,6600,750,46,"CAC 144-8P-2",{"$f":"(P52*150)*(1-$K$47)","v":3030.0605280000004}]
["LUVE","SAV8T3220",400,188,53600,null,47,72,4,"A estimer",null,null,null,"CAC 154-8P-2",42.49,{"$f":"O53*(0.93*0.67*0.96*1)","v":25.416498240000003},25,7200,750,47,"CAC 154-8P-2",3812.4747360000006]
["LUVE","SAV8S2131",400,204,51600,null,52,74,3,"A estimer",null,null,null,"CAC 145-8P-2",49.78,29.777201280000003,{"$f":"CEILING(P54,5)","v":30},10600,750,52,"CAC 145-8P-2",4466.5801920000004]
["LUVE","SAV7N8466",400,207,45000,null,47,72,3,"A estimer",null,null,null,"CAC 243-8P-2",54.81,32.786026560000003,35,10000,750,47,"CAC 243-8P-2",4917.9039840000005]
["LUVE","SAV7S8585",400,236,64000,null,46,71,3,"A estimer",null,null,null,"CAC 155-8P-2",61.52,36.799787520000002,40,11100,750,53,"CAC 155-8P-2",5519.9681280000004]
["LUVE","SAV7S8586",400,272,58400,null,46,71,3,"A estimer",null,null,null,"CAC 244-8P-3",69.040000000000006,41.298071040000004,45,13200,750,49,"CAC 244-8P-3",6194.7106560000002]
["LUVE","SAV8S2142",400,300,64400,null,53,74,4,"A estimer",null,null,null,"CAC 254-8P-4",86.32,51.634552319999997,55,14400,750,50,"CAC 254-8P-4",7745.1828479999995]
["LUVE","SAV8S2151",400,340,86000,null,53,74,5,"A estimer",null,null,null,"CAC 245-8P-5",99.52,59.530475520000003,60,21200,750,55,"CAC 245-8P-5",8929.571328]
["LUVE","SAV8S2231",400,408,103200,null,54,75,6,"A estimer",null,null,null,"CAC 255-8P-6",124.4,74.413094400000006,75,22200,750,56,"CAC 255-8P-6",11161.964160000001]
["LUVE","SAV8S2241",400,456,104800,null,49,72,8,"A estimer",null,null,null,"SHVS0",141,84.342815999999999,85,42000,null,55,"SHVS0",12651.422399999999]
["LUVE","SAV8T3262",400,540,112800,null,45,70,12,"A estimer",null,null,null,"SHVS0",162,96.904512000000011,100,54000,null,61,"SHVS0",14535.676800000001]
["LUVE","SAV8T3271",400,630,131600,null,46,71,14,"A estimer",null,null,null,"SHVT0",207,123.82243200000001,125,51600,null,62,"SHVT0",18573.364799999999]
["LUVE","SAV8T3281",400,720,150400,null,46,71,16,"A estimer",null,null,null,"SHVT0",300,179.45280000000002,180,77600,null,65,"SHVT0",26917.920000000006]
["LUVE","SAV8T3272",400,812,162400,null,52,73,14,"A estimer",null,null,null,"SHVT0",375,224.316,225,97000,null,66,"SHVT0",33647.4]
["LUVE","SAV8T3271",400,784,176400,null,52,73,14,"A estimer"]
["LUVE","SAV8T3281",400,896,201600,null,52,73,16,"A estimer"]
["LUVE","SAV8T3282",400,928,185600,null,52,73,16,"A estimer"]
["LUVE","SAV8S2272",400,952,240800,null,58,78,14,"A estimer"]
["LUVE","SAV8S2272",400,1050,225400,null,58,78,14,"A estimer"]
["LUVE","SAV8S2281",400,1088,275200,null,58,78,16,"A estimer"]
["LUVE","SAV8S2282",400,1200,257600,null,58,78,16,"A estimer"]

{"sheet":"DATA","index":11,"n_rows":128,"n_cols":17,"rows_kept":128,"cut":false,"hidden":true,"merged":[[32,1,32,4],[32,6,32,9],[87,5,87,6]]}
[null,"T INT","HR INT","T INTRO","CP kcal/kg.K","Déb INTRO","Charge sol","Chaleur respiration","Dt évap"]
["VIANDES PRE EMBALLES",9.9999999999999995E-7,80,7,0.8,50,200,0,8]
["VOLAILLES PREEMBALLEES",9.9999999999999995E-7,80,7,0.8,50,200,0,8]
["CARCASSES",9.9999999999999995E-7,90,7,0.75,100,300,0,6]
["CHARCUTERIE PREEMBALLE",2,80,10,0.8,60,250,0,8]
["TRAITEUR",2,85,10,0.75,75,250,0,8]
["CHARIOTS PLATS CUISINES",9.9999999999999995E-8,80,10,0.85,75,200,0,8]
["PATISSERIE FRAICHE",1,75,25,0.7,50,200,0,8]
["POISSONS SUR GLACE",9.9999999999999995E-7,90,4,0.8,75,300,0,6]
["FRUITS ET LEGUMES",6,90,25,0.9,100,240,150,6]
["BOF EMBALLES",4,80,10,0.65,100,270,0,10]
["FROMAGE",6,85,10,0.7,70,240,0,8]
["BOISSONS",6,75,25,0.9,100,300,0,10]
["POUBELLES GRASSES",4,75,25,0.8,80,270,0,10]
["SAS",6,80,15,0.9,100,300,0,8]
["PRODUITS SURGELES",-25,90,-15,0.42,90,350,0,6]
["CREMES GLACEES",-25,90,-18,0.45,90,350,0,6]
[null,"T INT","HR INT","kW/m²","Occupations",null,null,null,"DT EVAP"]
["LABO DECOUPE",8,70,0.06,0.1,null,null,null,12]
["LABO DECOUPE EMBALLAGE",8,70,0.12,{"$f":"1/8","v":0.125},null,null,null,12]
["LABO EMBALLAGE",8,70,0.3,{"$f":"1/6","v":0.16666666666666666},null,null,null,12]
[]
[null,null,null,null,{"$f":"MAX(E2:E17)","v":0.9},{"$f":"MAX(F2:F17)","v":100}]
[]
[]
[]
[]
["TRES FORT",5]
["FORT",4]
["MOYEN",3]
["FAIBLE",2]
[]
[null,"TEMPERATURE POSITIVE",null,null,null,null,"TEMPERATURE NEGATIVE"]
["VOLUME","FAIBLE","MOYEN","FORT","TRES FORT","VOLUME","FAIBLE","MOYEN","FORT","TRES FORT"]
[2,53,83,132,176,2,46,76,114,152]
[3,75,125,188,250,3,65,108,162,216]
[4,95,159,235,316,4,82,137,285,274]
[5,114,190,239,380,5,97,161,242,322]
[6,130,216,324,432,6,110,184,275,368]
[7,144,240,360,480,7,121,192,303,404]
[8,157,262,392,524,8,131,218,327,436]
[9,165,280,420,560,9,139,232,348,464]
[10,178,297,446,594,10,146,243,364,486]
[11,187,311,467,622,11,152,254,381,508]
[12,195,325,488,650,12,158,264,396,528]
[13,204,339,509,678,13,165,274,411,548]
[14,210,350,525,700,14,171,284,425,568]
[15,215,360,540,720,15,176,293,439,576]
[16,222,370,554,740,16,180,300,450,600]
[17,227,378,567,756,17,185,308,462,615]
[18,232,387,581,774,18,189,315,473,630]
[19,237,394,591,788,19,193,321,482,642]
[20,243,405,608,810,20,196,326,489,652]
[21,248,414,621,828,21,198,331,496,662]
[22,254,424,635,848,22,202,337,505,674]
[23,259,431,647,862,23,206,343,514,686]
[24,265,442,662,884,24,209,348,522,696]
[25,270,450,675,900,25,214,356,534,712]
[26,276,460,690,920,26,220,367,550,734]
[27,284,473,709,946,27,224,373,559,746]
[28,289,482,722,964,28,228,381,571,762]
[29,296,493,740,986,29,235,392,587,784]
[30,302,503,754,1006,30,239,398,596,796]
[40,348,580,870,1160,40,271,452,678,904]
[50,375,625,938,1250,50,300,500,750,1000]
[75,473,788,1181,1576,75,360,600,900,1200]
[100,540,900,1350,1800,100,408,680,1020,1360]
[125,600,1000,1500,2000,125,450,750,1125,1500]
[150,630,1050,1575,2100,150,486,810,1215,1620]
[175,683,1138,1706,2276,175,515,858,1286,1716]
[200,720,1200,1800,2400,200,552,920,1380,1840]
[300,864,1440,2160,2880,300,666,1110,1665,2220]
[400,984,1640,2460,3280,400,744,1240,1850,2480]
[500,1080,1800,2700,3600,500,840,1400,2100,2800]
[600,1188,1980,2970,3960,600,936,1560,2340,3120]
[700,1260,2100,3150,4200,700,1008,1680,2520,3360]
[800,1344,2240,3360,4480,800,1056,1760,2640,3520]
[900,1484,2340,3510,4680,900,1080,1800,2700,3600]
[1000,1500,2500,3750,5000,1000,1140,1900,2850,3800]
[1250,1720,2870,4305,5740,1250,1278,2130,3195,4260]
[1550,1800,3000,4500,6000,1550,1392,2320,3480,4640]
[1750,1945,3240,4860,6480,1750,1554,2590,3885,5180]
[2000,2040,3400,5100,6800,2000,1680,2800,4200,5600]
[2500,2250,3750,5625,7500,2500,1860,3100,4650,6200]
[3000,2425,4050,6073,8106,3000,1980,3300,4950,6600]
[]
[]
[]
[]
[]
["DOUBLE FLUX COMMERCIAUX"]
["Type",null,"Débit d'air",null,"Nombre",null,null,"Dégivrage",null,null,"Puissance au R22"]
["désignation","Taille",null,"Surface","Nbre","Puissance","Intensité","Puissance","Intensité","Taille","DT","Température d'évaporation ",null,-7,"Taille",null,"Taille"]
[null,null,null,null,"moteur","utile","A","utile","A",null,6,7,8,9,null,10]
["Ecartement des ailettes 3,5 mm - 1000 tr/mn"]
["DFC",14,770,9,1,{"$f":"25*E96","v":25},{"$f":"0.28*E96","v":0.28000000000000003},600,2.5,14,{"$f":"M96*0.75","v":1327.5},{"$f":"0.88*M96","v":1557.6},1770,{"$f":"M96*1.12","v":1982.4},14,{"$f":"M96*1.25","v":2212.5},14]
["DFC",24,1540,18,2,{"$f":"25*E97","v":50},{"$f":"0.28*E97","v":0.56000000000000005},800,3.4,24,{"$f":"M97*0.75","v":2685},{"$f":"0.88*M97","v":3150.4},3580,{"$f":"M97*1.12","v":4009.6000000000004},24,{"$f":"M97*1.25","v":4475},24]
["DFC",34,2310,27,3,{"$f":"25*E98","v":75},{"$f":"0.28*E98","v":0.84000000000000008},1200,5,34,4050,4752,5400,{"$f":"M98*1.12","v":6048.0000000000009},34,{"$f":"M98*1.25","v":6750},34]
["DFC",44,3080,36,4,{"$f":"25*E99","v":100},{"$f":"0.28*E99","v":1.1200000000000001},1500,6.3,44,5407.5,6344.8,7210,{"$f":"M99*1.12","v":8075.2000000000007},44,{"$f":"M99*1.25","v":9012.5},44]
["DFC",54,3850,45,5,{"$f":"25*E100","v":125},{"$f":"0.28*E100","v":1.4000000000000001},2000,8.4,54,6802.5,7981.6,9070,{"$f":"M100*1.12","v":10158.400000000001},54,{"$f":"M100*1.25","v":11337.5},54]
["Ecartement des ailettes 3,5 mm - 1500 tr/mn"]
["DFC",14,1000,9,1,{"$f":"35*E102","v":35},{"$f":"0.95*E102","v":0.95},600,2.5,14,1582.5,1856.8,2110,{"$f":"M102*1.12","v":2363.2000000000003},14,{"$f":"M102*1.25","v":2637.5},14]
["DFC",24,2000,18,2,{"$f":"35*E103","v":70},{"$f":"0.95*E103","v":1.9},800,3.4,24,3225,3784,4300,{"$f":"M103*1.12","v":4816.0000000000009},24,{"$f":"M103*1.25","v":5375},24]
["DFC",34,3000,27,3,{"$f":"35*E104","v":105},{"$f":"0.95*E104","v":2.8499999999999996},1200,5,34,4867.5,5711.2,6490,{"$f":"M104*1.12","v":7268.8000000000011},34,{"$f":"M104*1.25","v":8112.5},34]
["DFC",44,4000,36,4,{"$f":"35*E105","v":140},{"$f":"0.95*E105","v":3.8},1500,6.3,44,6525,7656,8700,{"$f":"M105*1.12","v":9744.0000000000018},44,{"$f":"M105*1.25","v":10875},44]
["DFC",54,5000,45,5,{"$f":"35*E106","v":175},{"$f":"0.95*E106","v":4.75},2000,8.4,54,8025,9416,10700,{"$f":"M106*1.12","v":11984.000000000002},54,{"$f":"M106*1.25","v":13375},54]
["Ecartement des ailettes 6,3 mm - 1000 tr/mn"]
["DFC",16,810,5.5,1,{"$f":"25*E108","v":25},{"$f":"0.28*E108","v":0.28000000000000003},600,2.5,16,1087.5,1276,1450,{"$f":"M108*1.12","v":1624.0000000000002},16,{"$f":"M108*1.25","v":1812.5},16]
["DFC",26,1620,11,2,{"$f":"25*E109","v":50},{"$f":"0.28*E109","v":0.56000000000000005},800,3.4,26,2197.5,2578.4,2930,{"$f":"M109*1.12","v":3281.6000000000004},26,{"$f":"M109*1.25","v":3662.5},26]
["DFC",36,2430,16.5,3,{"$f":"25*E110","v":75},{"$f":"0.28*E110","v":0.84000000000000008},1200,5,36,3315,3889.6,4420,{"$f":"M110*1.12","v":4950.4000000000005},36,{"$f":"M110*1.25","v":5525},36]
["DFC",46,3240,22,4,{"$f":"25*E111","v":100},{"$f":"0.28*E111","v":1.1200000000000001},1500,6.3,46,4530,5315.2,6040,{"$f":"M111*1.12","v":6764.8000000000011},46,{"$f":"M111*1.25","v":7550},46]
["DFC",56,4050,27.5,5,{"$f":"25*E112","v":125},{"$f":"0.28*E112","v":1.4000000000000001},2000,8.4,56,5640,6617.6,7520,{"$f":"M112*1.12","v":8422.4000000000015},56,{"$f":"M112*1.25","v":9400},56]
["Ecartement des ailettes 6,3 mm - 1500 tr/mn"]
["DFC",16,1060,5.5,1,{"$f":"35*E114","v":35},{"$f":"0.95*E114","v":0.95},600,2.5,16,1290,1513.6,1720,{"$f":"M114*1.12","v":1926.4},16,{"$f":"M114*1.25","v":2150},16]
["DFC",26,2120,11,2,{"$f":"35*E115","v":70},{"$f":"0.95*E115","v":1.9},800,3.4,26,{"$f":"M115*0.75","v":2617.5},{"$f":"0.88*M115","v":3071.2},3490,{"$f":"M115*1.12","v":3908.8},26,{"$f":"M115*1.25","v":4362.5},26]
["DFC",36,3180,16.5,3,{"$f":"35*E116","v":105},{"$f":"0.95*E116","v":2.8499999999999996},1200,5,36,{"$f":"M116*0.75","v":3922.5},{"$f":"0.88*M116","v":4602.3999999999996},5230,{"$f":"M116*1.12","v":5857.6},36,{"$f":"M116*1.25","v":6537.5},36]
["DFC",46,4240,22,4,{"$f":"35*E117","v":140},{"$f":"0.95*E117","v":3.8},1500,6.3,46,{"$f":"M117*0.75","v":5227.5},{"$f":"0.88*M117","v":6133.6},6970,{"$f":"M117*1.12","v":7806.4000000000005},46,{"$f":"M117*1.25","v":8712.5},46]
["DFC",56,5300,27.5,5,{"$f":"35*E118","v":175},{"$f":"0.95*E118","v":4.75},2000,8.4,56,{"$f":"M118*0.75","v":6600},{"$f":"0.88*M118","v":7744},8800,{"$f":"M118*1.12","v":9856.0000000000018},56,{"$f":"M118*1.25","v":11000},56]
[]
["FRIGERST PLAFONNIER","DT 6 Fg/h","DT 6 K","Pas","Débit","Nombre ","Puissance","Surface","KS","K"]
["MP 120",720,{"$f":"B121*4.1855/3600*1000","v":837.09999999999991},6.35,850,1,110,5,{"$f":"C121/6","v":139.51666666666665},{"$f":"I121/H121","v":27.903333333333329}]
["MP 175",1050,{"$f":"B122*4.1855/3600*1000","v":1220.7708333333335},6.35,1150,1,110,8,{"$f":"C122/6","v":203.46180555555557},{"$f":"I122/H122","v":25.432725694444446}]
["MP 220",1315,1528.8701388888887,6.35,1720,2,220,13,254.8116898148148,19.600899216524216]
["MP 290",1740,2022.991666666667,6.35,2050,2,220,18,337.16527777777782,18.731404320987657]
["MP 330",1980,2302.0250000000005,6.35,2550,2,220,20,383.67083333333341,19.18354166666667]
["MP 440",2625,3051.927083333333,6.35,2750,2,220,27,508.65451388888886,18.839056069958847]
["MP 525",3150,3662.3125,6.35,4000,3,330,31,610.38541666666663,19.689852150537632]
["MP 725",4350,5057.4791666666661,6.35,5900,5,550,45,842.91319444444434,18.731404320987654]

{"sheet":"Decompo DB recup","index":12,"n_rows":72,"n_cols":13,"rows_kept":72,"cut":false,"hidden":true,"merged":[[0,0,0,8]]}
["DECOMPOSITION DES MEUBLES"]
["Longueur hors tout",75,100,125,187.5,250,375]
[{"$f":"J3/100","v":0.75},1,null,null,null,null,null,{"$f":"IF(B3=0,\"\",B3&\" x 75 / \")&IF(C3=0,\"\",C3&\" x 100 / \")&IF(D3=0,\"\",D3&\" x 125 / \")&IF(E3=0,\"\",E3&\" x 188 / \")&IF(F3=0,\"\",F3&\" x 250 / \")&IF(G3=0,\"\",G3&\" x 375 / \")","v":"1 x 75 / "},{"$f":"SUM(B3:G3)","v":1},{"$f":"B3*$B$2+C3*$C$2+D3*$D$2+E3*$E$2+F3*$F$2+G3*$G$2","v":75},{"$f":"J3/100/A3","v":1}]
[1,null,1,null,null,null,null,"1 x 100 / ",1,100,1]
[1.25,null,null,1,null,null,null,"1 x 125 / ",1,125,1]
[1.5,2,null,null,null,null,null,"2 x 75 / ",2,150,1]
[1.75,1,1,null,null,null,null,"1 x 75 / 1 x 100 / ",2,175,1]
[1.875,null,null,null,1,null,null,"1 x 188 / ",1,187.5,1]
[2.25,null,1,1,null,null,null,"1 x 100 / 1 x 125 / ",2,225,1]
[2.5,null,null,null,null,1,null,"1 x 250 / ",1,250,1]
[2.625,1,null,null,1,null,null,"1 x 75 / 1 x 188 / ",2,262.5,1]
[2.875,null,1,null,1,null,null,"1 x 100 / 1 x 188 / ",2,287.5,1]
[3.125,null,null,1,1,null,null,"1 x 125 / 1 x 188 / ",2,312.5,1]
[3.5,null,1,null,null,1,null,"1 x 100 / 1 x 250 / ",2,350,1]
[3.75,null,null,null,null,null,1,"1 x 375 / ",1,375,1]
[4.125,null,1,1,1,null,null,"1 x 100 / 1 x 125 / 1 x 188 / ",3,412.5,1]
[4.375,null,null,null,1,1,null,"1 x 188 / 1 x 250 / ",2,437.5,1]
[4.75,null,1,null,null,null,1,"1 x 100 / 1 x 375 / ",2,475,1]
[5,null,null,null,null,2,null,"2 x 250 / ",2,500,1]
[5.375,null,1,null,1,1,null,"1 x 100 / 1 x 188 / 1 x 250 / ",3,537.5,1]
[5.625,null,null,null,1,null,1,"1 x 188 / 1 x 375 / ",2,562.5,1]
[6,null,1,null,null,2,null,"1 x 100 / 2 x 250 / ",3,600,1]
[6.25,null,null,null,null,1,1,"1 x 250 / 1 x 375 / ",2,625,1]
[6.625,null,1,null,1,null,1,"1 x 100 / 1 x 188 / 1 x 375 / ",3,662.5,1]
[6.875,null,null,null,1,2,null,"1 x 188 / 2 x 250 / ",3,687.5,1]
[7.25,null,1,null,null,1,1,"1 x 100 / 1 x 250 / 1 x 375 / ",3,725,1]
[7.5,null,null,null,null,null,2,"2 x 375 / ",2,750,1]
[7.875,null,1,null,1,2,null,"1 x 100 / 1 x 188 / 2 x 250 / ",4,787.5,1]
[8.125,null,null,null,1,1,1,"1 x 188 / 1 x 250 / 1 x 375 / ",3,812.5,1]
[8.5,null,1,null,null,null,2,"1 x 100 / 2 x 375 / ",3,850,1]
[8.75,null,null,null,null,2,1,"2 x 250 / 1 x 375 / ",3,875,1]
[9.125,null,1,null,1,1,1,"1 x 100 / 1 x 188 / 1 x 250 / 1 x 375 / ",4,912.5,1]
[9.375,null,null,null,1,null,2,"1 x 188 / 2 x 375 / ",3,937.5,1]
[9.75,null,1,null,null,2,1,"1 x 100 / 2 x 250 / 1 x 375 / ",4,975,1]
[10,null,null,null,null,1,2,"1 x 250 / 2 x 375 / ",3,1000,1]
[10.375,null,1,null,1,null,2,"1 x 100 / 1 x 188 / 2 x 375 / ",4,1037.5,1]
[10.625,null,null,null,1,2,1,"1 x 188 / 2 x 250 / 1 x 375 / ",4,1062.5,1]
[11,null,1,null,null,1,2,"1 x 100 / 1 x 250 / 2 x 375 / ",4,1100,1]
[11.25,null,null,null,null,null,3,"3 x 375 / ",3,1125,1]
[11.625,null,1,1,1,null,2,"1 x 100 / 1 x 125 / 1 x 188 / 2 x 375 / ",5,1162.5,1]
[11.875,null,null,null,1,1,2,"1 x 188 / 1 x 250 / 2 x 375 / ",4,1187.5,1]
[12.25,null,1,null,null,null,3,"1 x 100 / 3 x 375 / ",4,1225,1]
[12.5,null,null,null,null,2,2,"2 x 250 / 2 x 375 / ",4,1250,1,null,{"$f":"12.5+0.625","v":13.125}]
[12.875,null,1,null,1,1,2,"1 x 100 / 1 x 188 / 1 x 250 / 2 x 375 / ",5,1287.5,1]
[13.125,null,null,null,1,null,3,"1 x 188 / 3 x 375 / ",4,1312.5,1]
[13.5,null,1,1,null,null,3,"1 x 100 / 1 x 125 / 3 x 375 / ",5,1350,1]
[13.75,null,null,null,null,1,3,"1 x 250 / 3 x 375 / ",4,1375,1]
[14.125,null,1,null,1,null,3,"1 x 100 / 1 x 188 / 3 x 375 / ",5,1412.5,1]
[14.375,null,null,null,1,2,2,"1 x 188 / 2 x 250 / 2 x 375 / ",5,1437.5,1]
[14.75,null,1,null,null,1,3,"1 x 100 / 1 x 250 / 3 x 375 / ",5,1475,1,null,{"$f":"12.5+0.75","v":13.25}]
[15,null,null,null,null,null,4,"4 x 375 / ",4,1500,1]
[15.375,null,1,1,1,null,3,"1 x 100 / 1 x 125 / 1 x 188 / 3 x 375 / ",6,1537.5,1]
[15.625,null,null,null,1,1,3,"1 x 188 / 1 x 250 / 3 x 375 / ",5,1562.5,1]
[16,null,1,null,null,null,4,"1 x 100 / 4 x 375 / ",5,1600,1]
[16.25,null,null,null,null,2,3,"2 x 250 / 3 x 375 / ",5,1625,1]
[16.625,null,1,null,1,1,3,"1 x 100 / 1 x 188 / 1 x 250 / 3 x 375 / ",6,1662.5,1]
[16.875,null,null,null,1,null,4,"1 x 188 / 4 x 375 / ",5,1687.5,1]
[17.25,null,1,1,null,null,4,"1 x 100 / 1 x 125 / 4 x 375 / ",6,1725,1]
[17.5,null,null,null,null,1,4,"1 x 250 / 4 x 375 / ",5,1750,1]
[17.625,1,null,null,1,null,4,"1 x 75 / 1 x 188 / 4 x 375 / ",6,1762.5,1]
[17.875,null,1,null,1,null,4,"1 x 100 / 1 x 188 / 4 x 375 / ",6,1787.5,1]
[18.125,null,null,null,1,2,3,"1 x 188 / 2 x 250 / 3 x 375 / ",6,1812.5,1]
[18.5,null,1,null,null,1,4,"1 x 100 / 1 x 250 / 4 x 375 / ",6,1850,1]
[18.75,null,null,null,null,null,5,"5 x 375 / ",5,1875,1]
[19.125,null,1,1,1,null,4,"1 x 100 / 1 x 125 / 1 x 188 / 4 x 375 / ",7,1912.5,1]
[19.375,null,null,null,1,1,4,"1 x 188 / 1 x 250 / 4 x 375 / ",6,1937.5,1]
[{"$f":"J67/100","v":19.75},null,1,null,null,null,5,{"$f":"IF(B67=0,\"\",B67&\" x 75 / \")&IF(C67=0,\"\",C67&\" x 100 / \")&IF(D67=0,\"\",D67&\" x 125 / \")&IF(E67=0,\"\",E67&\" x 188 / \")&IF(F67=0,\"\",F67&\" x 250 / \")&IF(G67=0,\"\",G67&\" x 375 / \")","v":"1 x 100 / 5 x 375 / "},{"$f":"SUM(B67:G67)","v":6},{"$f":"B67*$B$2+C67*$C$2+D67*$D$2+E67*$E$2+F67*$F$2+G67*$G$2","v":1975},{"$f":"J67/100/A67","v":1}]
[20,null,null,null,null,2,4,"2 x 250 / 4 x 375 / ",6,2000,1]
[20.5,1,1,null,null,null,5,"1 x 75 / 1 x 100 / 5 x 375 / ",7,2050,1]
[20.625,null,null,null,1,null,5,"1 x 188 / 5 x 375 / ",6,2062.5,1]
[22.5,null,null,null,null,null,6,"6 x 375 / ",6,2250,1]
[25,null,null,null,null,1,6,"1 x 250 / 6 x 375 / ",7,2500,1]

{"sheet":"Table Meubles","index":13,"n_rows":141,"n_cols":13,"rows_kept":141,"cut":false,"hidden":true,"merged":[]}
["meubles positifs","Type","Modele","Concaténer","Pfrigo Classe 3","HACCP","THACCP","T évap","Ventilation","Cordons chauffants","Dégivrage","Éclairage","positif ou négatif"]
["???","KOXKA SV LS","SVS724",{"$f":"CONCATENATE(B2,C2)","v":"KOXKA SV LSSVS724"},906,null,null,-8,50,15,null,145,"positif"]
["bac","KOXKA bacpos","VSS726",{"$f":"CONCATENATE(B3,\" \",C3)","v":"KOXKA bacpos VSS726"},416,null,null,-8,15,55,null,50,"positif"]
["bac large","ROTONDE POS",36,"ROTONDE POS 36",590,0.9,1,-10,100,95,880,9.9999999999999995E-7,"positif"]
["bac large","ROTONDE POS",46,"ROTONDE POS 46",600,0.9,1,-10,100,95,880,9.9999999999999995E-7,"positif"]
["bac simple","AGORAPOS",36,"AGORAPOS 36",295,0.9,1,-10,null,null,null,null,"positif"]
["bac simple","AGORAPOS",46,"AGORAPOS 46",300,0.9,1,-10,null,null,null,null,"positif"]
["bacs doubles sans couvercles","COSMOSPOS","III","COSMOSPOS III",540,0.9,1,-9,70,43,null,null,"positif"]
["semi-vertical","LOGIA",11,"LOGIA 11",1265,0.9,1,-10,64,28,745,213,"positif"]
["semi-vertical","LOGIA",12,"LOGIA 12",1370,0.9,1,-10,64,28,745,213,"positif"]
["semi-vertical ouvert étroit","AERIA","EFFICIA","AERIA EFFICIA",1260,0.9,1.5,-6,8,null,null,26,"positif"]
["semi-vertical ouvert étroit","AERIA","II","AERIA II",1800,0.9,1.5,-8,{"$f":"240/3.75","v":64},25,{"$f":"2550/3.75","v":680},148,"positif"]
["semi-vertical ouvert étroit","AERIA","MODULAR","AERIA MODULAR",1260,0.9,1.5,-6,8,null,null,26,"positif"]
["semi-vertical ouvert étroit","AERIA","VOLUM","AERIA VOLUM",1245,0.9,1.5,-6,8,null,null,26,"positif"]
["semi-vertical ouvert large","AMPHI",11,"AMPHI 11",1580,0.9,1,-10,64,28,745,213,"positif"]
["semi-vertical ouvert large","AMPHI",12,"AMPHI 12",1610,0.9,1,-10,64,28,745,213,"positif"]
["semi-vertical ouvert? étroit?","EMERAUDE","EUS","EMERAUDE EUS",1470,0.9,1.5,-7,{"$f":"(0.21*220)/2.5","v":18.479999999999997},null,{"$f":"(4.8*380)/2.5","v":729.6},{"$f":"(0.9*220)/2.5","v":79.2},"positif"]
["trad","MAXIMA","LC2","MAXIMA LC2",446,0.9,1,-9,35,35,372,42,"positif"]
["trad","MAXIMA","LDCLS","MAXIMA LDCLS",400,0.9,1,-8,35,35,372,42,"positif"]
[null,"MAXIMA","MAREE","MAXIMA MAREE",350,0.9,1,-11,40,null,310,null,"positif"]
["trad","MAXIMA","MODULAR","MAXIMA MODULAR",273,0.9,1,-6,40,null,571,77,"positif"]
["trad","MAXIMA","MODULARLS","MAXIMA MODULARLS",387,0.9,1,-6,40,null,571,77,"positif"]
["trad","MAXIMA","MODULARSV","MAXIMA MODULARSV",672,0.9,1,-7,23,null,278,25,"positif"]
["trad","MAXIMA","VOLUM","MAXIMA VOLUM",314,0.9,1,-6,40,null,571,77,"positif"]
["trad","MAXIMA","VOLUMLS","MAXIMA VOLUMLS",424,0.9,1,-6,40,null,571,77,"positif"]
["trad large","ENVERGURE","LS","ENVERGURE LS",460,0.9,1,-10,25.6,85.1,585,67,"positif"]
["trad large","ENVERGURE","VE","ENVERGURE VE",420,0.9,1,-10,25.6,85.1,585,67,"positif"]
["trad libre service","AMARANTE","LS","AMARANTE LS",480,0.9,1,-10,25.6,85.1,585,67,"positif"]
["trad libre service meuble bas","DUO","II","DUO II",800,0.9,1,-8,32,40,null,40,"positif"]
["trad libre service meuble bas","DUO","MODULAR","DUO MODULAR",330,0.9,1,-8,68,null,337,47,"positif"]
["trad service arrière","AMARANTE","VE","AMARANTE VE",345,0.9,1,-10,25.6,85.1,585,67,"positif"]
["trad service arrière","TRADEO","R","TRADEO R",{"$f":"1745+175","v":1920},0.85,1.5,-9,15,null,null,25,"positif"]
["trad service arrière","TRADEO",null,"TRADEO ",1745,0.85,1.5,-9,15,null,null,25,"positif"]
["trad service arrière","TRIBUNE","BR","TRIBUNE BR",1785,0.85,1.5,-10,100,null,null,80,"positif"]
["vertical","FORUM","B 09 DR","FORUM B 09 DR",2035,0.85,1.5,-10,96,117,855,276,"positif"]
["vertical","FORUM","B 09 RF","FORUM B 09 RF",1485,0.85,1.5,-10,96,117,855,276,"positif"]
["vertical","FORUM","B 10 DR","FORUM B 10 DR",2035,0.85,1.5,-10,96,117,855,276,"positif"]
["vertical","FORUM","B 10 RF","FORUM B 10 RF",1485,0.85,1.5,-10,96,117,855,276,"positif"]
["vertical","FORUM","B 11 DR","FORUM B 11 DR",1890,0.85,1.5,-10,96,117,855,276,"positif"]
["vertical","FORUM","B 11 RF","FORUM B 11 RF",1490,0.85,1.5,-10,96,117,855,276,"positif"]
["vertical","FORUM","M 09 DR","FORUM M 09 DR",1795,0.85,1.5,-10,96,117,855,276,"positif"]
["vertical","FORUM","M 09 RF","FORUM M 09 RF",1330,0.85,1.5,-10,96,117,855,276,"positif"]
["vertical","FORUM","M 10 DR","FORUM M 10 DR",1795,0.85,1.5,-10,96,117,855,276,"positif"]
["vertical","FORUM","M 10 RF","FORUM M 10 RF",1330,0.85,1.5,-10,96,117,855,276,"positif"]
["vertical","FORUM","M 11 DR","FORUM M 11 DR",1795,0.85,1.5,-10,96,117,855,276,"positif"]
["vertical","FORUM","M 11 RF","FORUM M 11 RF",1330,0.85,1.5,-10,96,117,855,276,"positif"]
["vertical","PERLE","EU","PERLE EU",1000,0.9,1,-8,91,null,null,252,"positif"]
["vertical","PERLE","XU.GD","PERLE XU.GD",750,0.9,1,-8,34,32,null,48,"positif"]
["vertical libre service","CORALIS","EU","CORALIS EU",1860,0.9,1,-10,60.8,null,320,36,"positif"]
["vertical libre service","KOXKA Vertical LS","MCD216","KOXKA Vertical LS MCD216",1700,null,null,-8,60,null,null,50,"positif"]
["vertical libre service","KOXKA Vertical LS","MCD226","KOXKA Vertical LS MCD226",1556,null,null,-8,85,null,null,50,"positif"]
["vertical libre service","KOXKA Vertical LS","MCP226","KOXKA Vertical LS MCP226",1843,null,null,-8,90,null,null,195,"positif"]
["vertical libre service 2,20m","VISEO","MODULAR","VISEO MODULAR",1535,0.9,1,-6,18,null,null,49,"positif"]
["vertical libre service 2,20m","VISEO","MODULARECO","VISEO MODULARECO",840,0.9,1,-6,18,null,null,49,"positif"]
["vertical libre service 2,20m","VISEO","RD5","VISEO RD5",1700,0.9,1,-6,100,null,null,414,"positif"]
["vertical libre service 2,20m","VISEOL","RD5","VISEOL RD5",1830,0.9,1,-7,100,null,null,497,"positif"]
["vertical libre service 2m","PROXIMA","EFFICIA","PROXIMA EFFICIA",1504,0.9,1.5,-7,14,null,null,49,"positif"]
["vertical libre service 2m","PROXIMA","MODULAR","PROXIMA MODULAR",1370,0.9,1.5,-6,18,null,null,49,"positif"]
[null,"PROXIMA","MODULARECO","PROXIMA MODULARECO",750,0.9,1.5,-2,13,null,null,63,"positif"]
["vertical libre service 2m","PROXIMA","PROXI","PROXIMA PROXI",620,1,null,-2,13,null,null,68,"positif"]
["vertical libre service 2m","PROXIMA","RD","PROXIMA RD",1655,0.9,1.5,-10,96,117,855,276,"positif"]
["vertical libre service 2m","PROXIMA","RD5","PROXIMA RD5",1940,0.9,1.5,-10,96,117,855,276,"positif"]
["vertical libre service à portes","AMPLEO","POS","AMPLEO POS",430,0.9,1,-7,74,311,1347,141,"positif"]
["vertical libre service à portes","AMPLEO","POSECO","AMPLEO POSECO",430,0.9,1,-7,22,76,1347,106,"positif"]
["vertical libre service à portes","AMPLEO","POSECOR","AMPLEO POSECOR",450,0.9,1,-7,22,83,1347,122,"positif"]
["vertical libre service à portes","AMPLEO","POSR","AMPLEO POSR",450,0.9,1,-7,74,335,1347,141,"positif"]
["X ?","AIS",46,{"$f":"CONCATENATE(B67,\" \",C67)","v":"AIS 46"},560,0.9,1,-10,30,60,640,null,"positif"]
["X ?","QUARTZ","CVA","QUARTZ CVA",340,0.9,1.5,-9,25.6,null,null,213,"positif"]
["X trop vieux","ARCHE","B 09 DR","ARCHE B 09 DR",2160,0.85,1.5,-10,96,117,855,276,"positif"]
["X trop vieux","ARCHE","B 09 RF","ARCHE B 09 RF",1840,0.85,1.5,-10,96,117,855,276,"positif"]
["X trop vieux","ARCHE","B 10 DR","ARCHE B 10 DR",2160,0.85,1.5,-10,96,117,855,276,"positif"]
["X trop vieux","ARCHE","B 10 RF","ARCHE B 10 RF",1700,0.85,1.5,-10,96,117,855,276,"positif"]
["X trop vieux","ARCHE","B 11 DR","ARCHE B 11 DR",2195,0.85,1.5,-10,96,117,855,276,"positif"]
["X trop vieux","ARCHE","B 11 RF","ARCHE B 11 RF",null,0.85,1.5,-10,96,117,855,276,"positif"]
["X trop vieux","ARCHE","M 09 DR","ARCHE M 09 DR",2160,0.85,1.5,-10,96,117,855,276,"positif"]
["X trop vieux","ARCHE","M 09 RF","ARCHE M 09 RF",1520,0.85,1.5,-10,96,117,855,276,"positif"]
["X trop vieux","ARCHE","M 10 DR","ARCHE M 10 DR",2080,0.85,1.5,-10,96,117,855,276,"positif"]
["X trop vieux","ARCHE","M 10 RF","ARCHE M 10 RF",1520,0.85,1.5,-10,96,117,855,276,"positif"]
["X trop vieux","ARCHE","M 11 DR","ARCHE M 11 DR",2080,0.85,1.5,-10,96,117,855,276,"positif"]
["X trop vieux","ARCHE","M 11 RF","ARCHE M 11 RF",1520,0.85,1.5,-10,96,117,855,276,"positif"]
["X trop vieux","ARN",36,"ARN 36",1436,0.9,1.5,-9.5,60,null,null,250,"positif"]
["X trop vieux","ARN",46,"ARN 46",1342,0.9,1.5,-10.5,35,15,320,216,"positif"]
["X trop vieux","AZURII","EUS","AZURII EUS",1870,0.9,1.5,-9,96,117,855,276,"positif"]
["X trop vieux","AZURII","MUS","AZURII MUS",1950,0.9,1.5,-9,96,117,855,276,"positif"]
["X trop vieux","BERLINO","MT","BERLINO MT",{"$f":"2260/1.25","v":1808},1,1.5,-10,{"$f":"(3*55)/3.75","v":44},{"$f":"44/3.75","v":11.733333333333333},{"$f":"1612/3.75","v":429.86666666666667},{"$f":"5*(3*36)/3.75","v":144},"positif"]
["X trop vieux","BERLINO","SL","BERLINO SL",{"$f":"2230/1.25","v":1784},1,1.5,-6,{"$f":"(3*55)/3.75","v":44},{"$f":"44/3.75","v":11.733333333333333},null,{"$f":"5*(3*36)/3.75","v":144},"positif"]
["X trop vieux","DAFNE","L","DAFNE L",317,0.85,1.5,-11,null,null,null,null,"positif"]
["X trop vieux","NACRE","TPP","NACRE TPP",320,0.9,1,-10,64,28,745,null,"positif"]
["X trop vieux","PATARA",800,"PATARA 800",960,0.9,1,-8,38.299999999999997,10,{"$f":"K91","v":745},15.9,"positif"]
["X trop vieux","SAPHIR","L","SAPHIR L",{"$f":"3375/3.75","v":900},0.85,1.5,-9,{"$f":"(1.4*220)/3.75","v":82.13333333333334},{"$f":"(0.33*220)/3.75","v":19.360000000000003},{"$f":"(7.28*220)/3.75","v":427.09333333333336},{"$f":"(0.94*220*3)/3.75","v":165.44},"positif"]
["X trop vieux","SAPHIR","LMS","SAPHIR LMS",1050,0.85,1,-9,64,28,745,213,"positif"]
["X trop vieux","TURQUOISE","MMT","TURQUOISE MMT",1926,0.9,1.5,-10,100,null,855,276,"positif"]
["meubles négatifs","Type","Modele","Concaténer","Classe 3","HACCP","THACCP","T évap","Ventilation","Cordons chauffants","Dégivrage","Éclairage","positif ou négatif"]
["bac","PERTH2","BAC",{"$f":"CONCATENATE(B94,\" \",C94)","v":"PERTH2 BAC"},{"$f":"1800/3.75","v":480},0.9,1,-35,{"$f":"(4*33)/3.75","v":35.200000000000003},{"$f":"(77+155+110)/3.75","v":91.2},{"$f":"(3*1215+607)/3.75","v":1133.8666666666666},{"$f":"(3*36)/3.75","v":28.8},"négatif"]
["bac + portes","KOXKA SURGELE MIXTE","CM446","KOXKA SURGELE MIXTE CM446",906,null,null,-36,45,360,2850,105,"négatif"]
["bac + portes","PERTH2","BAC+PORTE","PERTH2 BAC+PORTE",1100,0.9,1,-35,60,342,2000,91,"négatif"]
["bac large","ROTTONDE",36,"ROTTONDE 36",780,0.9,1,-35,80,196,2640,0,"négatif"]
["bac large","ROTTONDE",46,"ROTTONDE 46",800,0.9,1,-35,80,196,2640,0,"négatif"]
["bac simple","AGORA",36,"AGORA 36",390,0.9,1,-35,null,null,null,null,"négatif"]
["bac simple","AGORAII",36,"AGORAII 36",350,0.9,1,-35,null,null,null,null,"négatif"]
["bac simple","ELLIPSE",36,"ELLIPSE 36",490,0.9,1,-35,75,92,1760,0,"négatif"]
["bac simple","ELLIPSE",46,"ELLIPSE 46",490,0.9,1,-35,75,92,1760,0,"négatif"]
["bacs doubles","AGATE","II","AGATE II",650,0.9,1,-36,146,413,1746,264,"négatif"]
["bacs doubles","KOXKA SURGELEE BAC DOUBLE","GH74","KOXKA SURGELEE BAC DOUBLE GH74",980,null,null,-36,20,170,2220,null,"négatif"]
["bacs doubles sans couvercles","COSMOS",36,"COSMOS 36",740,0.9,1,-35,80,196,2640,null,"négatif"]
["bacs doubles sans couvercles","COSMOS","III","COSMOS III",800,0.9,1,-36,70,660,1584,null,"négatif"]
[null,"COSMOS","MODULAR COUVERCLE","COSMOS MODULAR COUVERCLE",325,0.9,1,-36,62,95,1500,null,"négatif"]
["bacs doubles sans couvercles","COSMOS","MODULAR","COSMOS MODULAR",750,0.9,1,-36,62,95,1500,null,"négatif"]
["vertical","PERTH2","PORTE","PERTH2 PORTE",614,0.9,1,-35,{"$f":"(6*15)/3.75","v":24},{"$f":"(6*80+330+129)/3.75","v":250.4},{"$f":"(2*1400+450)/3.75","v":866.66666666666663},{"$f":"((3*36)+(7*18))/3.75","v":62.4},"négatif"]
["vertical libre service à portes","AMPLEO","NEG","AMPLEO NEG",650,0.9,1,-30,74,311,1347,141,"négatif"]
["vertical libre service à portes","AMPLEO","NEGECO","AMPLEO NEGECO",650,0.9,1,-30,22,76,1347,106,"négatif"]
["vertical libre service à portes","AMPLEO","NEGECOR","AMPLEO NEGECOR",715,0.9,1,-30,22,83,1347,122,"négatif"]
["vertical libre service à portes","AMPLEO","NEGR","AMPLEO NEGR",715,0.9,1,-30,74,335,1347,141,"négatif"]
["vertical libre service à portes","AMPLEO","R","AMPLEO R",735,0.9,1,-34,75,333,1341,132,"négatif"]
["X ?","AIS",86,"AIS 86",{"$f":"2*396","v":792},0.9,1.5,-33,35,130,{"$f":"2*1120","v":2240},null,"négatif"]
["X ?","COLISÉE","BAC+PORTE","COLISÉE BAC+PORTE",1100,0.9,1,-35,132,1072,3960,232,"négatif"]
["X ?","COLISEUM","BAC","COLISEUM BAC",415,0.9,1,-35,66,536,1980,116,"négatif"]
["X ?","COLISEUM","II","COLISEUM II",1100,0.9,1,-35,132,1072,3960,232,"négatif"]
["X ?","COLISEUM","III","COLISEUM III",900,0.9,1,-35,40,395,1666,215,"négatif"]
["X ?","COLISEUM","MODULAR","COLISEUM MODULAR",850,0.9,1,-35,30,350,1650,26,"négatif"]
["X ?","COLISEUM","PLACARD","COLISEUM PLACARD",645,0.9,1,-36,66,536,1980,116,"négatif"]
["X ?","COLISEUM-R","PLACARD","COLISEUM-R PLACARD",1040,0.9,1,-36,66,536,1980,116,"négatif"]
["X trop vieux","ARCADE","R","ARCADE R",2400,0.95,1,-35,215,789,4200,138,"négatif"]
["X trop vieux","ARCADE","S","ARCADE S",2200,0.95,1,-35,215,789,4200,138,"négatif"]
["X trop vieux","ATR",85,"ATR 85",800,0.95,1,-39,{"$f":"180/3.75","v":48},{"$f":"1178/3.75","v":314.13333333333333},{"$f":"4650/3.75","v":1240},0,"négatif"]
["X trop vieux","DOME","II","DOME II",2420,0.95,1,-35,215,789,4200,138,"négatif"]
["X trop vieux","DOME","R","DOME R",2640,0.95,1,-35,215,789,4200,138,"négatif"]
["X trop vieux","GRENAT","II","GRENAT II",750,0.9,1,-37,70,380,900,270,"négatif"]
["X trop vieux","ONYX-F","II","ONYX-F II",750,0.9,1,-36,146,441,1746,368,"négatif"]
["X trop vieux","PATNOS","F","PATNOS F",680,0.9,1,-35,null,null,null,null,"négatif"]
["X trop vieux","SCPL","S","SCPL S",715,0.95,1,-35,null,null,null,null,"négatif"]
["X trop vieux","TOPAZE","MPN","TOPAZE MPN",920,0.95,1,-35,80,196,2640,0,"négatif"]
["X trop vieux","VELANDO","SG","VELANDO SG",697,0.9,1,-36,41,344,872,113,"négatif"]
[null,null,null,"GL",0,0,0,0,0,0,0,0]
[null,null,null,"SANS OBJET S.O",0,0,0,0,0,0,0,0]
[]
[]
["NONNON","PROXIMA","MODULAR",{"$f":"CONCATENATE(B138,C138)","v":"PROXIMAMODULAR"},1370,0.9,1.5,-6,18,null,null,49]
["OUIOUI","PROXIMA","PROXI","PROXIMAPROXI",620,1,null,-2,13,null,null,68]
["NONOUI","PROXIMA","RÉTROFITÉ","PROXIMARÉTROFITÉ",960,1,null,-2,13,null,null,68]
[null,null,null,0,0]

{"sheet":"Table évap","index":14,"n_rows":30,"n_cols":9,"rows_kept":30,"cut":false,"hidden":true,"merged":[]}
[]
[]
[]
[null,"R134a +","P","P","P","Débit","Projection d'air","Modèle","Prix"]
[null,"BP 70",854,{"$f":"C5*(0.93*0.8)","v":635.37600000000009},{"$f":"CEILING(D5,5)","v":640},500,3,{"$f":"B5","v":"BP 70"},{"$f":"0.5*D5","v":317.68800000000005}]
[null,"BP 105",1335,{"$f":"C6*(0.93*0.8)","v":993.24000000000012},{"$f":"CEILING(D6,5)","v":995},1000,4,"BP 105",{"$f":"0.5*D6","v":496.62000000000006}]
[null,"BP 145",1665,1238.7600000000002,1240,1000,4,"BP 145",619.38000000000011]
[null,"BP 215",2570,1912.0800000000004,1915,1500,4,"BP 215",956.04000000000019]
[null,"BP 290",3590,2670.9600000000005,2675,2000,4,"BP 290",1335.4800000000002]
[null,"BP 415",5520,4106.880000000001,4110,3000,5,"BP 415",2053.4400000000005]
[null,"CAN-CAE 3364",7600,5654.4000000000005,5655,3600,10,"CAN-CAE 3364",2827.2000000000003]
[null,"CAN-CAE3464",10100,7514.4000000000015,7515,4800,10,"CAN-CAE3464",3757.2000000000007]
[null,"CAN-CAE3564",12500,9300.0000000000018,9300,6000,10,"CAN-CAE3564",4650.0000000000009]
[null,"CAN-CAE-3664",15400,11457.600000000002,11460,7200,10,"CAN-CAE-3664",5728.8000000000011]
[null,"CAN-CAE4364",20900,15549.600000000002,15550,9300,14,"CAN-CAE4364",7774.8000000000011]
[null,"CAN-CAE4464",28000,20832.000000000004,20835,12400,14,"CAN-CAE4464",10416.000000000002]
[]
[]
[null,"R407F -","P","P",null,"Débit","Projection d'air","Modèle","Prix"]
[null,"CAB 3167",1600,{"$f":"C20*(0.85*(6/7))","v":1165.7142857142856},{"$f":"CEILING(D20,5)","v":1170},1200,10,{"$f":"B20","v":"CAB 3167"},{"$f":"0.8*D20","v":932.57142857142844}]
[null,"CAB 3267",3200,{"$f":"C21*(0.85*(6/7))","v":2331.4285714285711},{"$f":"CEILING(D21,5)","v":2335},2400,10,"CAB 3267",{"$f":"0.8*D21","v":1865.1428571428569}]
[null,"CAB 3367",4900,3570,3570,3600,10,"CAB 3367",2856]
[null,"CAB 3467",6700,4881.4285714285716,4885,4800,10,"CAB 3467",3905.1428571428573]
[null,"CAB 3567",8100,5901.4285714285716,5905,6350,10,"CAB 3567",4721.1428571428578]
[null,"CAB 3667",9500,{"$f":"C25*(0.85*(6/7))","v":6921.4285714285706},{"$f":"CEILING(D25,5)","v":6925},7620,10,"CAB 3667",{"$f":"0.8*D25","v":5537.1428571428569}]
[null,"CAB 4367",12100,{"$f":"C26*(0.85*(6/7))","v":8815.7142857142844},{"$f":"CEILING(D26,5)","v":8820},9750,14,"CAB 4367",{"$f":"0.8*D26","v":7052.5714285714275}]
[null,"CAB 4467",16400,{"$f":"C27*(0.85*(6/7))","v":11948.571428571428},{"$f":"CEILING(D27,5)","v":11950},13000,14,"CAB 4467",{"$f":"0.8*D27","v":9558.8571428571431}]
[null,"CAB 5367",22600,{"$f":"C28*(0.85*(6/7))","v":16465.714285714286},{"$f":"CEILING(D28,5)","v":16470},18300,20,"CAB 5367",{"$f":"0.8*D28","v":13172.571428571429}]
[]
[null,"BP 290",3590,2670.9600000000005,2675,2000,4,"BP 290",1335.4800000000002]

{"sheet":"Decompo DB","index":15,"n_rows":70,"n_cols":13,"rows_kept":70,"cut":false,"hidden":true,"merged":[[0,0,0,8]]}
["DECOMPOSITION DES MEUBLES"]
["Longueur hors tout",75,100,125,187.5,250,375]
[{"$f":"J3/100","v":0.75},1,0,0,0,0,null,{"$f":"IF(B3=0,\"\",B3&\" x 75 / \")&IF(C3=0,\"\",C3&\" x 100 / \")&IF(D3=0,\"\",D3&\" x 125 / \")&IF(E3=0,\"\",E3&\" x 200 / \")&IF(F3=0,\"\",F3&\" x 250 / \")&IF(G3=0,\"\",G3&\" x 375 / \")","v":"1 x 75 / "},{"$f":"SUM(B3:G3)","v":1},{"$f":"B3*$B$2+C3*$C$2+D3*$D$2+E3*$E$2+F3*$F$2+G3*$G$2","v":75},{"$f":"J3/100/A3","v":1}]
[{"$f":"J4/100","v":1},null,1,null,null,null,null,"1 x 100 / ",1,100,1]
[1.25,null,null,1,null,null,null,"1 x 125 / ",1,125,1]
[1.5,2,null,null,null,null,null,"2 x 75 / ",2,150,1]
[1.75,1,1,null,null,null,null,"1 x 75 / 1 x 100 / ",2,175,1]
[1.875,null,null,null,1,null,null,{"$f":"IF(B8=0,\"\",B8&\" x 75 / \")&IF(C8=0,\"\",C8&\" x 100 / \")&IF(D8=0,\"\",D8&\" x 125 / \")&IF(E8=0,\"\",E8&\" x 188 / \")&IF(F8=0,\"\",F8&\" x 250 / \")&IF(G8=0,\"\",G8&\" x 375 / \")","v":"1 x 188 / "},1,187.5,1]
[2.25,null,1,1,null,null,null,"1 x 100 / 1 x 125 / ",2,225,1]
[2.5,null,null,null,null,1,null,"1 x 250 / ",1,250,1]
[2.625,1,null,null,1,null,null,{"$f":"IF(B11=0,\"\",B11&\" x 75 / \")&IF(C11=0,\"\",C11&\" x 100 / \")&IF(D11=0,\"\",D11&\" x 125 / \")&IF(E11=0,\"\",E11&\" x 188 / \")&IF(F11=0,\"\",F11&\" x 250 / \")&IF(G11=0,\"\",G11&\" x 375 / \")","v":"1 x 75 / 1 x 188 / "},2,262.5,1]
[2.875,null,1,null,1,null,null,{"$f":"IF(B12=0,\"\",B12&\" x 75 / \")&IF(C12=0,\"\",C12&\" x 100 / \")&IF(D12=0,\"\",D12&\" x 125 / \")&IF(E12=0,\"\",E12&\" x 188 / \")&IF(F12=0,\"\",F12&\" x 250 / \")&IF(G12=0,\"\",G12&\" x 375 / \")","v":"1 x 100 / 1 x 188 / "},2,287.5,1]
[3.125,null,null,1,1,null,null,"1 x 125 / 1 x 200 / ",2,312.5,1]
[3.5,null,1,null,null,1,null,"1 x 100 / 1 x 250 / ",2,350,1]
[3.75,null,null,null,null,null,1,"1 x 375 / ",1,375,1]
[4.125,null,1,1,1,null,null,"1 x 100 / 1 x 125 / 1 x 200 / ",3,412.5,1]
[4.375,null,null,null,1,1,null,"1 x 200 / 1 x 250 / ",2,437.5,1]
[4.75,null,1,null,null,null,1,"1 x 100 / 1 x 375 / ",2,475,1]
[5,null,null,null,null,2,null,"2 x 250 / ",2,500,1]
[5.375,null,1,null,1,1,null,"1 x 100 / 1 x 200 / 1 x 250 / ",3,537.5,1]
[5.625,null,null,null,1,null,1,"1 x 200 / 1 x 375 / ",2,562.5,1]
[6,null,1,null,null,2,null,"1 x 100 / 2 x 250 / ",3,600,1]
[6.25,null,null,null,null,1,1,"1 x 250 / 1 x 375 / ",2,625,1]
[6.625,null,1,null,1,null,1,"1 x 100 / 1 x 200 / 1 x 375 / ",3,662.5,1]
[6.875,null,null,null,1,2,null,"1 x 200 / 2 x 250 / ",3,687.5,1]
[7.25,null,1,null,null,1,1,"1 x 100 / 1 x 250 / 1 x 375 / ",3,725,1]
[7.5,null,null,null,null,null,2,"2 x 375 / ",2,750,1]
[7.875,null,1,null,1,2,null,"1 x 100 / 1 x 200 / 2 x 250 / ",4,787.5,1]
[8.125,null,null,null,1,1,1,"1 x 200 / 1 x 250 / 1 x 375 / ",3,812.5,1]
[8.5,null,1,null,null,null,2,"1 x 100 / 2 x 375 / ",3,850,1]
[8.75,null,null,null,null,2,1,"2 x 250 / 1 x 375 / ",3,875,1]
[9.125,null,1,null,1,1,1,"1 x 100 / 1 x 200 / 1 x 250 / 1 x 375 / ",4,912.5,1]
[9.375,null,null,null,1,null,2,"1 x 200 / 2 x 375 / ",3,937.5,1]
[9.75,null,1,null,null,2,1,"1 x 100 / 2 x 250 / 1 x 375 / ",4,975,1]
[10,null,null,null,null,1,2,"1 x 250 / 2 x 375 / ",3,1000,1]
[10.375,null,1,null,1,null,2,"1 x 100 / 1 x 200 / 2 x 375 / ",4,1037.5,1]
[10.625,null,null,null,1,2,1,"1 x 200 / 2 x 250 / 1 x 375 / ",4,1062.5,1]
[11,null,1,null,null,1,2,"1 x 100 / 1 x 250 / 2 x 375 / ",4,1100,1]
[11.25,null,null,null,null,null,3,"3 x 375 / ",3,1125,1]
[11.625,null,1,1,1,null,2,"1 x 100 / 1 x 125 / 1 x 200 / 2 x 375 / ",5,1162.5,1]
[11.875,null,null,null,1,1,2,"1 x 200 / 1 x 250 / 2 x 375 / ",4,1187.5,1]
[12.25,null,1,null,null,null,3,"1 x 100 / 3 x 375 / ",4,1225,1]
[12.5,null,null,null,null,2,2,"2 x 250 / 2 x 375 / ",4,1250,1,null,{"$f":"12.5+0.625","v":13.125}]
[12.875,null,1,null,1,1,2,"1 x 100 / 1 x 200 / 1 x 250 / 2 x 375 / ",5,1287.5,1]
[13.125,null,null,null,1,null,3,{"$f":"IF(B45=0,\"\",B45&\" x 75 / \")&IF(C45=0,\"\",C45&\" x 100 / \")&IF(D45=0,\"\",D45&\" x 125 / \")&IF(E45=0,\"\",E45&\" x 200 / \")&IF(F45=0,\"\",F45&\" x 250 / \")&IF(G45=0,\"\",G45&\" x 375 / \")","v":"1 x 200 / 3 x 375 / "},{"$f":"SUM(B45:G45)","v":4},{"$f":"B45*$B$2+C45*$C$2+D45*$D$2+E45*$E$2+F45*$F$2+G45*$G$2","v":1312.5},{"$f":"J45/100/A45","v":1}]
[13.5,null,1,1,null,null,3,"1 x 100 / 1 x 125 / 3 x 375 / ",5,1350,1]
[13.75,null,null,null,null,1,3,"1 x 250 / 3 x 375 / ",4,1375,1]
[14.125,null,1,null,1,null,3,"1 x 100 / 1 x 200 / 3 x 375 / ",5,1412.5,1]
[14.375,null,null,null,1,2,2,"1 x 200 / 2 x 250 / 2 x 375 / ",5,1437.5,1]
[14.75,null,1,null,null,1,3,"1 x 100 / 1 x 250 / 3 x 375 / ",5,1475,1,null,{"$f":"12.5+0.75","v":13.25}]
[15,null,null,null,null,null,4,"4 x 375 / ",4,1500,1]
[15.375,null,1,1,1,null,3,"1 x 100 / 1 x 125 / 1 x 200 / 3 x 375 / ",6,1537.5,1]
[15.625,null,null,null,1,1,3,"1 x 200 / 1 x 250 / 3 x 375 / ",5,1562.5,1]
[16,null,1,null,null,null,4,"1 x 100 / 4 x 375 / ",5,1600,1]
[16.25,null,null,null,null,2,3,"2 x 250 / 3 x 375 / ",5,1625,1]
[16.625,null,1,null,1,1,3,"1 x 100 / 1 x 200 / 1 x 250 / 3 x 375 / ",6,1662.5,1]
[16.875,null,null,null,1,null,4,"1 x 200 / 4 x 375 / ",5,1687.5,1]
[17.25,null,1,1,null,null,4,"1 x 100 / 1 x 125 / 4 x 375 / ",6,1725,1]
[17.5,null,null,null,null,1,4,"1 x 250 / 4 x 375 / ",5,1750,1]
[17.625,1,null,null,1,null,4,"1 x 75 / 1 x 200 / 4 x 375 / ",6,1762.5,1]
[17.875,null,1,null,1,null,4,"1 x 100 / 1 x 200 / 4 x 375 / ",6,1787.5,1]
[18.125,null,null,null,1,2,3,"1 x 200 / 2 x 250 / 3 x 375 / ",6,1812.5,1]
[18.5,null,1,null,null,1,4,"1 x 100 / 1 x 250 / 4 x 375 / ",6,1850,1]
[18.75,null,null,null,null,null,5,"5 x 375 / ",5,1875,1]
[19.125,null,1,1,1,null,4,"1 x 100 / 1 x 125 / 1 x 200 / 4 x 375 / ",7,1912.5,1]
[19.375,null,null,null,1,1,4,"1 x 200 / 1 x 250 / 4 x 375 / ",6,1937.5,1]
[19.75,null,1,null,null,null,5,{"$f":"IF(B67=0,\"\",B67&\" x 75 / \")&IF(C67=0,\"\",C67&\" x 100 / \")&IF(D67=0,\"\",D67&\" x 125 / \")&IF(E67=0,\"\",E67&\" x 200 / \")&IF(F67=0,\"\",F67&\" x 250 / \")&IF(G67=0,\"\",G67&\" x 375 / \")","v":"1 x 100 / 5 x 375 / "},{"$f":"SUM(B67:G67)","v":6},{"$f":"B67*$B$2+C67*$C$2+D67*$D$2+E67*$E$2+F67*$F$2+G67*$G$2","v":1975},{"$f":"J67/100/A67","v":1}]
[{"$f":"J68/100","v":20},null,null,null,null,2,4,"2 x 250 / 4 x 375 / ",6,2000,1]
[20.5,1,1,null,null,null,5,"1 x 75 / 1 x 100 / 5 x 375 / ",7,2050,1]
[20.625,null,null,null,1,null,5,"1 x 200 / 5 x 375 / ",6,2062.5,1]

{"sheet":"Puissance unitaire","index":16,"n_rows":128,"n_cols":12,"rows_kept":128,"cut":false,"hidden":true,"merged":[]}
[null,"Type","Modele","Concaténer","Classe 3","HACCP","THACCP","T évap","Ventilation","Cordons chauffants","Dégivrage","Éclairage"]
[null,"AERIA","EFFICIA",{"$f":"CONCATENATE(B2,C2)","v":"AERIAEFFICIA"},1260,0.9,1.5,-6,8,null,null,26]
[null,"AERIA","II","AERIAII",1800,0.9,1.5,-8,{"$f":"240/3.75","v":64},25,{"$f":"2550/3.75","v":680},148]
[null,"AERIA","MODULAR","AERIAMODULAR",1260,0.9,1.5,-6,8,null,null,26]
[null,"AERIA","VOLUM","AERIAVOLUM",1245,0.9,1.5,-6,8,null,null,26]
[null,"AGATE","II","AGATEII",650,0.9,1,-36,146,413,1746,264]
[null,"AGORA",36,"AGORA36",390,0.9,1,-35]
[null,"AGORAII",36,"AGORAII36",350,0.9,1,-35]
[null,"AGORAPOS",36,"AGORAPOS36",295,0.9,1,-10]
[null,"AGORAPOS",46,"AGORAPOS46",300,0.9,1,-10]
[null,"AIS",46,"AIS46",560,0.9,1,-10,30,60,640]
[null,"AIS",86,"AIS86",{"$f":"2*396","v":792},0.9,1.5,-33,35,130,{"$f":"2*1120","v":2240}]
[null,"AMARANTE","LS","AMARANTELS",480,0.9,1,-10,25.6,85.1,585,67]
[null,"AMARANTE","VE","AMARANTEVE",345,0.9,1,-10,25.6,85.1,585,67]
[null,"AMPHI",11,"AMPHI11",1580,0.9,1,-10,64,28,745,213]
[null,"AMPHI",12,"AMPHI12",1610,0.9,1,-10,64,28,745,213]
[null,"AMPLEO","NEG","AMPLEONEG",650,0.9,1,-30,74,311,1347,141]
[null,"AMPLEO","NEGECO","AMPLEONEGECO",650,0.9,1,-30,22,76,1347,106]
[null,"AMPLEO","NEGECOR","AMPLEONEGECOR",715,0.9,1,-30,22,83,1347,122]
[null,"AMPLEO","NEGR","AMPLEONEGR",715,0.9,1,-30,74,335,1347,141]
[null,"AMPLEO","POS","AMPLEOPOS",430,0.9,1,-7,74,311,1347,141]
[null,"AMPLEO","POSECO","AMPLEOPOSECO",430,0.9,1,-7,22,76,1347,106]
[null,"AMPLEO","POSECOR","AMPLEOPOSECOR",450,0.9,1,-7,22,83,1347,122]
[null,"AMPLEO","POSR","AMPLEOPOSR",450,0.9,1,-7,74,335,1347,141]
[null,"AMPLEO","R","AMPLEOR",735,0.9,1,-34,75,333,1341,132]
[null,"ARCADE","R","ARCADER",2400,0.95,1,-35,215,789,4200,138]
[null,"ARCADE","S","ARCADES",2200,0.95,1,-35,215,789,4200,138]
[null,"ARCHE","B 09 DR","ARCHEB 09 DR",2160,0.85,1.5,-10,96,117,855,276]
[null,"ARCHE","B 09 RF","ARCHEB 09 RF",1840,0.85,1.5,-10,96,117,855,276]
[null,"ARCHE","B 10 DR","ARCHEB 10 DR",2160,0.85,1.5,-10,96,117,855,276]
[null,"ARCHE","B 10 RF","ARCHEB 10 RF",1700,0.85,1.5,-10,96,117,855,276]
[null,"ARCHE","B 11 DR","ARCHEB 11 DR",2195,0.85,1.5,-10,96,117,855,276]
[null,"ARCHE","B 11 RF","ARCHEB 11 RF",null,0.85,1.5,-10,96,117,855,276]
[null,"ARCHE","M 09 DR","ARCHEM 09 DR",2160,0.85,1.5,-10,96,117,855,276]
[null,"ARCHE","M 09 RF","ARCHEM 09 RF",1520,0.85,1.5,-10,96,117,855,276]
[null,"ARCHE","M 10 DR","ARCHEM 10 DR",2080,0.85,1.5,-10,96,117,855,276]
[null,"ARCHE","M 10 RF","ARCHEM 10 RF",1520,0.85,1.5,-10,96,117,855,276]
[null,"ARCHE","M 11 DR","ARCHEM 11 DR",2080,0.85,1.5,-10,96,117,855,276]
[null,"ARCHE","M 11 RF","ARCHEM 11 RF",1520,0.85,1.5,-10,96,117,855,276]
[null,"ARN",36,"ARN36",1436,0.9,1.5,-9.5,60,null,null,250]
[null,"ARN",46,"ARN46",1342,0.9,1.5,-10.5,35,15,320,216]
[null,"ATR",85,"ATR85",800,0.95,1,-39,{"$f":"180/3.75","v":48},{"$f":"1178/3.75","v":314.13333333333333},{"$f":"4650/3.75","v":1240},0]
[null,"AZURII","EUS","AZURIIEUS",1870,0.9,1.5,-9,96,117,855,276]
[null,"AZURII","MUS","AZURIIMUS",1950,0.9,1.5,-9,96,117,855,276]
[null,"BERLINO","MT","BERLINOMT",{"$f":"2260/1.25","v":1808},1,1.5,-10,{"$f":"(3*55)/3.75","v":44},{"$f":"44/3.75","v":11.733333333333333},{"$f":"1612/3.75","v":429.86666666666667},{"$f":"5*(3*36)/3.75","v":144}]
[null,"BERLINO","SL","BERLINOSL",{"$f":"2230/1.25","v":1784},1,1.5,-6,{"$f":"(3*55)/3.75","v":44},{"$f":"44/3.75","v":11.733333333333333},null,{"$f":"5*(3*36)/3.75","v":144}]
[null,"COLISÉE","BAC+PORTE","COLISÉEBAC+PORTE",1100,0.9,1,-35,132,1072,3960,232]
[null,"COLISEUM","BAC","COLISEUMBAC",415,0.9,1,-35,66,536,1980,116]
[null,"COLISEUM","II","COLISEUMII",1100,0.9,1,-35,132,1072,3960,232]
[null,"COLISEUM","III","COLISEUMIII",900,0.9,1,-35,40,395,1666,215]
[null,"COLISEUM","MODULAR","COLISEUMMODULAR",850,0.9,1,-35,30,350,1650,26]
[null,"COLISEUM","PLACARD","COLISEUMPLACARD",645,0.9,1,-36,66,536,1980,116]
[null,"COLISEUM-R","PLACARD","COLISEUM-RPLACARD",1040,0.9,1,-36,66,536,1980,116]
[null,"CORALIS","EU","CORALISEU",1860,0.9,1,-10,60.8,null,320,36]
[null,"COSMOS",36,"COSMOS36",740,0.9,1,-35,80,196,2640]
[null,"COSMOS","III","COSMOSIII",800,0.9,1,-36,70,660,1584]
[null,"COSMOS","MODULAR","COSMOSMODULAR",750,0.9,1,-36,62,95,1500]
[null,"COSMOSPOS","III","COSMOSPOSIII",540,0.9,1,-9,70,43]
[null,"DAFNE","L","DAFNEL",317,0.85,1.5,-11]
[null,"DOME","II","DOMEII",2420,0.95,1,-35,215,789,4200,138]
[null,"DOME","R","DOMER",2640,0.95,1,-35,215,789,4200,138]
[null,"DUO","II","DUOII",800,0.9,1,-8,32,40,null,40]
[null,"DUO","MODULAR","DUOMODULAR",330,0.9,1,-8,68,null,337,47]
[null,"ELLIPSE",36,"ELLIPSE36",490,0.9,1,-35,75,92,1760,0]
[null,"ELLIPSE",46,"ELLIPSE46",490,0.9,1,-35,75,92,1760,0]
[null,"EMERAUDE","EUS",{"$f":"CONCATENATE(B66,C66)","v":"EMERAUDEEUS"},1470,0.9,1.5,-7,{"$f":"(0.21*220)/2.5","v":18.479999999999997},null,{"$f":"(4.8*380)/2.5","v":729.6},{"$f":"(0.9*220)/2.5","v":79.2}]
[null,"ENVERGURE","LS","ENVERGURELS",460,0.9,1,-10,25.6,85.1,585,67]
[null,"ENVERGURE","VE","ENVERGUREVE",420,0.9,1,-10,25.6,85.1,585,67]
[null,"FORUM","B 09 DR","FORUMB 09 DR",2035,0.85,1.5,-10,96,117,855,276]
[null,"FORUM","B 09 RF","FORUMB 09 RF",1485,0.85,1.5,-10,96,117,855,276]
[null,"FORUM","B 10 DR","FORUMB 10 DR",2035,0.85,1.5,-10,96,117,855,276]
[null,"FORUM","B 10 RF","FORUMB 10 RF",1485,0.85,1.5,-10,96,117,855,276]
[null,"FORUM","B 11 DR","FORUMB 11 DR",1890,0.85,1.5,-10,96,117,855,276]
[null,"FORUM","B 11 RF","FORUMB 11 RF",1490,0.85,1.5,-10,96,117,855,276]
[null,"FORUM","M 09 DR","FORUMM 09 DR",1795,0.85,1.5,-10,96,117,855,276]
[null,"FORUM","M 09 RF","FORUMM 09 RF",1330,0.85,1.5,-10,96,117,855,276]
[null,"FORUM","M 10 DR","FORUMM 10 DR",1795,0.85,1.5,-10,96,117,855,276]
[null,"FORUM","M 10 RF","FORUMM 10 RF",1330,0.85,1.5,-10,96,117,855,276]
[null,"FORUM","M 11 DR","FORUMM 11 DR",1795,0.85,1.5,-10,96,117,855,276]
[null,"FORUM","M 11 RF","FORUMM 11 RF",1330,0.85,1.5,-10,96,117,855,276]
["GRENAT","GRENAT","II","GRENATII",750,0.9,1,-37,70,380,900,270]
[null,"KOXKA bacpos","VSS726","KOXKA bacposVSS726",416,null,null,-8,15,55,null,50]
[null,"KOXKA SURGELE MIXTE","CM446","KOXKA SURGELE MIXTECM446",906,null,null,-36,45,360,2850,105]
[null,"KOXKA SURGELEE BAC DOUBLE","GH74","KOXKA SURGELEE BAC DOUBLEGH74",980,null,null,-36,20,170,2220]
[null,"KOXKA SV LS","SVS724","KOXKA SV LSSVS724",906,null,null,-8,50,15,null,145]
[null,"KOXKA Vertical LS","MCD216","KOXKA Vertical LSMCD216",1700,null,null,-8,60,null,null,50]
[null,"KOXKA Vertical LS","MCD226","KOXKA Vertical LSMCD226",1556,null,null,-8,85,null,null,50]
[null,"KOXKA Vertical LS","MCP226","KOXKA Vertical LSMCP226",1843,null,null,-8,90,null,null,195]
[null,"LOGIA",11,"LOGIA11",1265,0.9,1,-10,64,28,745,213]
[null,"LOGIA",12,"LOGIA12",1370,0.9,1,-10,64,28,745,213]
[null,"MAXIMA","LC2","MAXIMALC2",446,0.9,1,-9,35,35,372,42]
[null,"MAXIMA","LDCLS","MAXIMALDCLS",400,0.9,1,-8,35,35,372,42]
[null,"MAXIMA","MODULAR","MAXIMAMODULAR",273,0.9,1,-6,40,null,571,77]
[null,"MAXIMA","MODULARLS","MAXIMAMODULARLS",387,0.9,1,-6,40,null,571,77]
[null,"MAXIMA","MODULARSV","MAXIMAMODULARSV",672,0.9,1,-7,23,null,278,25]
[null,"MAXIMA","VOLUM","MAXIMAVOLUM",314,0.9,1,-6,40,null,571,77]
[null,"MAXIMA","VOLUMLS","MAXIMAVOLUMLS",424,0.9,1,-6,40,null,571,77]
[null,"NACRE","TPP","NACRETPP",320,0.9,1,-10,64,28,745]
[null,"ONYX-F","II","ONYX-FII",750,0.9,1,-36,146,441,1746,368]
[null,"PATARA",800,{"$f":"CONCATENATE(B100,C100)","v":"PATARA800"},960,0.9,1,-8,38.299999999999997,10,{"$f":"K102","v":0},15.9]
[null,"PATNOS","F",{"$f":"CONCATENATE(B101,C101)","v":"PATNOSF"},680,0.9,1,-35]
[null,"PERLE","EU","PERLEEU",1000,0.9,1,-8,91,null,null,252]
["PERLE","PERLE","XU.GD","PERLEXU.GD",750,0.9,1,-8,34,32,null,48]
[null,"PERTH2","BAC","PERTH2BAC",{"$f":"1800/3.75","v":480},0.9,1,-35,{"$f":"(4*33)/3.75","v":35.200000000000003},{"$f":"(77+155+110)/3.75","v":91.2},{"$f":"(3*1215+607)/3.75","v":1133.8666666666666},{"$f":"(3*36)/3.75","v":28.8}]
[null,"PERTH2","BAC+PORTE","PERTH2BAC+PORTE",1100,0.9,1,-35,60,342,2000,91]
[null,"PERTH2","PORTE","PERTH2PORTE",614,0.9,1,-35,{"$f":"(6*15)/3.75","v":24},{"$f":"(6*80+330+129)/3.75","v":250.4},{"$f":"(2*1400+450)/3.75","v":866.66666666666663},{"$f":"((3*36)+(7*18))/3.75","v":62.4}]
[null,"PROXIMA","EFFICIA","PROXIMAEFFICIA",1504,0.9,1.5,-7,14,null,null,49]
[null,"PROXIMA","MODULAR","PROXIMAMODULAR",1370,0.9,1.5,-6,18,null,null,49]
[null,"PROXIMA","PROXI",{"$f":"CONCATENATE(B109,C109)","v":"PROXIMAPROXI"},{"$f":"550*1.15","v":632.5},0.9,0,-6,13,null,null,68]
[null,"PROXIMA","RD","PROXIMARD",1655,0.9,1.5,-10,96,117,855,276]
[null,"PROXIMA","RD5","PROXIMARD5",1940,0.9,1.5,-10,96,117,855,276]
[null,"QUARTZ","CVA","QUARTZCVA",340,0.9,1.5,-9,25.6,null,null,213]
[null,"ROTONDE POS",36,"ROTONDE POS36",590,0.9,1,-10,100,95,880,9.9999999999999995E-7]
[null,"ROTONDE POS",46,"ROTONDE POS46",600,0.9,1,-10,100,95,880,9.9999999999999995E-7]
[null,"ROTTONDE",36,"ROTTONDE36",780,0.9,1,-35,80,196,2640,0]
[null,"ROTTONDE",46,"ROTTONDE46",800,0.9,1,-35,80,196,2640,0]
[null,"SAPHIR","L","SAPHIRL",{"$f":"3375/3.75","v":900},0.85,1.5,-9,{"$f":"(1.4*220)/3.75","v":82.13333333333334},{"$f":"(0.33*220)/3.75","v":19.360000000000003},{"$f":"(7.28*220)/3.75","v":427.09333333333336},{"$f":"(0.94*220*3)/3.75","v":165.44}]
[null,"SAPHIR","LMS","SAPHIRLMS",1050,0.85,1,-9,64,28,745,213]
[null,"SCPL","S","SCPLS",715,0.95,1,-35]
[null,"TOPAZE","MPN","TOPAZEMPN",920,0.95,1,-35,80,196,2640,0]
[null,"TRADEO","R","TRADEOR",{"$f":"1745+175","v":1920},0.85,1.5,-9,15,null,null,25]
[null,"TRADEO",null,"TRADEO",1745,0.85,1.5,-9,15,null,null,25]
[null,"TRIBUNE","BR","TRIBUNEBR",1785,0.85,1.5,-10,100,null,null,80]
[null,"TURQUOISE","MMT","TURQUOISEMMT",1926,0.9,1.5,-10,100,null,855,276]
[null,"VELANDO","SG","VELANDOSG",697,0.9,1,-36,41,344,872,113]
[null,"VISEO","MODULAR","VISEOMODULAR",1535,0.9,1,-6,18,null,null,49]
[null,"VISEO","RD5","VISEORD5",1700,0.9,1,-6,100,null,null,414]
[null,"VISEOL","RD5","VISEOLRD5",1830,0.9,1,-7,100,null,null,497]

{"sheet":"Selection compresseurs","index":17,"n_rows":297,"n_cols":29,"rows_kept":297,"cut":false,"hidden":true,"merged":[[1,28,2,29],[5,28,6,29],[10,28,11,29],[12,16,12,17],[16,18,16,19],[16,23,16,24],[13,18,14,21],[13,23,14,26],[14,16,14,17],[15,18,15,21],[15,23,15,26],[23,4,23,9],[22,16,22,17],[17,16,17,17],[17,18,17,19],[17,23,17,24],[18,16,18,17],[18,18,18,19],[18,23,18,24],[19,18,19,19],[19,23,19,24],[21,16,21,17],[21,18,21,19],[21,23,21,24]]}
[]
[null,null,null,null,null,null,null,null,null,null,null,null,null,null,"P Frigo (KW)\nCalculé","Principe","Variateur","Fluide","Marque","Régime T°C","Fréquence \nde variation","P Frigo \ncompresseur\nsélectionné (KW)","P abs compresseur sélectionné (KW)","Modèle","Prix","Rejet de \nChaleur (KW)","COP",null,"POSITIF ET NEGATIF MELANGE"]
[null,null,null,null,null,null,null,null,null,null,null,null,null,null,{"$f":"('Besoins frigo'!E19/1000)+('Besoins frigo'!E35/1000)","v":0},{"$f":"INDEX($C$5:$C$23,MATCH($V$3,$I$5:$I$23,0))","v":{"$error":"#N/A"}},{"$f":"INDEX($D$5:$D$23,MATCH($V$3,$I$5:$I$23,0))","v":{"$error":"#N/A"}},{"$f":"INDEX($E$5:$E$23,MATCH($V$3,$I$5:$I$23,0))","v":{"$error":"#N/A"}},{"$f":"INDEX($F$5:$F$23,MATCH($V$3,$I$5:$I$23,0))","v":{"$error":"#N/A"}},{"$f":"INDEX($G$5:$G$23,MATCH($V$3,$I$5:$I$23,0))","v":{"$error":"#N/A"}},{"$f":"INDEX($H$5:$H$23,MATCH($V$3,$I$5:$I$23,0))","v":{"$error":"#N/A"}},{"$f":"MIN(IF($I$5:$I$23>O3,$I$5:$I$23))","v":0},{"$f":"INDEX($J$5:$J$23,MATCH($V$3,$I$5:$I$23,0))","v":{"$error":"#N/A"}},{"$f":"DGET($C$5:$L$23,#REF!,$P$2:$W$3)","v":{"$error":"#REF!"}},{"$f":"DGET($C$5:$L$23,#REF!,$P$2:$X$3)","v":{"$error":"#REF!"}},null,{"$f":"$V$3/$W$3","v":{"$error":"#N/A"}}]
[]
[]
[null,null,null,null,null,null,null,null,null,null,null,null,null,null,"P Frigo (KW)\nCalculé","Principe","Variateur","Fluide","Marque","Régime T°C","Fréquence \nde variation","P Frigo \ncompresseur\nsélectionné (KW)","P abs compresseur sélectionné (KW)","Modèle","Prix","Rejet de \nChaleur (KW)","COP",null,"Centrales POSITIVES"]
[null,null,null,null,null,null,null,null,null,null,null,null,null,null,60,{"$f":"INDEX($C$72:$C$297,MATCH($V$7,$I$72:$I$297,0))","v":"Semi-hermétique"},{"$f":"INDEX($D$72:$D$297,MATCH($V$7,$I$72:$I$297,0))","v":"Non"},{"$f":"INDEX($E$72:$E$297,MATCH($V$7,$I$72:$I$297,0))","v":"R407F"},{"$f":"INDEX($F$72:$F$297,MATCH($V$7,$I$72:$I$297,0))","v":"COPELAND"},{"$f":"INDEX($G$72:$G$297,MATCH($V$7,$I$72:$I$297,0))","v":"-10/+45°C"},{"$f":"INDEX($H$72:$H$297,MATCH($V$7,$I$72:$I$297,0))","v":"Pas de variation"},{"$f":"MIN(IF($I$73:$I$297>O7,$I$73:$I$297))","v":61.5},{"$f":"INDEX($J$72:$J$297,MATCH($V$7,$I$72:$I$297,0))","v":25.9},{"$f":"DGET($C$72:$L$297,$K$72,$P$6:$W$7)","v":"6MI1-40X"},{"$f":"DGET($C$72:$L$297,$L$72,$P$6:$X$7)","v":11270},{"$f":"INDEX($M$72:$M$297,MATCH($V$7,$I$72:$I$297,0))","v":87.4},{"$f":"V7/W7","v":2.3745173745173744}]
[]
[]
[]
[null,null,null,null,null,null,null,null,null,null,null,null,null,null,"P Frigo (KW)\nCalculé","Principe","Variateur","Fluide","Marque","Régime T°C","Fréquence \nde variation","P Frigo \ncompresseur\nsélectionné (KW)","P abs compresseur sélectionné (KW)","Modèle","Prix","Rejet de \nChaleur (KW)","COP",null,"Centrales NEGATIVES"]
[null,null,null,null,null,null,null,null,null,null,null,null,null,null,{"$f":"'Besoins frigo'!E35/1000","v":0},{"$f":"INDEX($C$27:$C$71,MATCH(V12,$I$27:$I$71,0))","v":"Scroll"},{"$f":"INDEX($D$27:$D$71,MATCH(V12,$I$27:$I$71,0))","v":"Non"},{"$f":"INDEX($E$27:$E$71,MATCH(V12,$I$27:$I$71,0))","v":"R134A"},{"$f":"INDEX($F$27:$F$71,MATCH(V12,$I$27:$I$71,0))","v":"COPELAND"},{"$f":"INDEX($G$27:$G$71,MATCH(V12,$I$27:$I$71,0))","v":"-5/-36°C"},{"$f":"INDEX($H$27:$H$71,MATCH(V12,$I$27:$I$71,0))","v":"Pas de variation"},{"$f":"MIN(IF(I28:I71>O12,I28:I71))","v":2.5},{"$f":"INDEX($J$27:$J$71,MATCH(V12,$I$27:$I$71,0))","v":1},{"$f":"DGET($C$27:$L$71,$K$27,$P$11:$W$12)","v":"ZR18 K3E PFJ 522"},{"$f":"DGET($C$27:$L$71,$L$27,$P$11:$X$12)","v":1418},{"$f":"INDEX($M$27:$M$71,MATCH(V12,$I$27:$I$71,0))","v":3.5},{"$f":"V12/W12","v":2.5}]
[]
[null,null,null,null,null,null,null,null,null,null,null,null,null,null,null,null,null,null,"POSITIF",null,null,null,null,"NEGATIF"]
[]
[null,null,null,null,null,null,null,null,null,null,null,null,null,null,null,null,null,null,"CONDITIONS DE SÉLECTION",null,null,null,null,"CONDITIONS DE SÉLECTION"]
[null,null,null,null,null,null,null,null,null,null,null,null,null,null,null,null,null,null,"Évaporation",null,":",-10,null,"Évaporation",null,":",-5]
[null,null,null,null,null,null,null,null,null,null,null,null,null,null,null,null,null,null,"Condensation",null,":",45,null,"Condensation",null,":",-36]
[null,null,null,null,null,null,null,null,null,null,null,null,null,null,null,null,null,null,"Sous-refroisidissement",null,":",3,null,"Sous-refroisidissement",null,":",0]
[null,null,null,null,null,null,null,null,null,null,null,null,null,null,null,null,null,null,"Surchauffe totale",null,":",10,null,"Surchauffe totale",null,":",10]
[]
[null,null,null,null,null,null,null,null,null,null,null,null,null,null,null,null,null,null,"Surface utile",null,":",6,null,"Surface utile",null,":",6]
[]
[null,null,null,null,"Compresseurs (+ & - RANGÉ)"]
[]
[]
[null,null,"Principe","Variateur","Fluide","Marque","Régime T°C","Fréquence \nde variation","P Frigo \ncompresseur\nsélectionné (KW)","P abs compresseur sélectionné (KW)","Modèle","Prix","Rejet de \nChaleur (KW)"]
[null,null,"Scroll","Non","R134A","COPELAND","-5/-36°C","Pas de variation",2.5,1,"ZR18 K3E PFJ 522",1418,{"$f":"I28+J28","v":3.5}]
[null,null,"Scroll","Non","R134A","COPELAND","-5/-36°C","Pas de variation",3.1,1.1200000000000001,"ZR22 K3E PFJ 522",1504,{"$f":"I29+J29","v":4.2200000000000006}]
[null,null,"Scroll","Non","R134A","COPELAND","-5/-36°C","Pas de variation",4.1100000000000003,1.41,"ZR28 K3E PFJ 522",1589,5.5200000000000005]
[null,null,"Scroll","Non","R134A","COPELAND","-5/-36°C","Pas de variation",4.91,1.6,"ZR34 K3E PFJ 522",1662,6.51]
[null,null,"Scroll","Non","R134A","COPELAND","-5/-36°C","Pas de variation",5.71,2,"ZR40 K3E PFJ 522",1779,7.71]
[null,null,"Scroll","Non","R134A","COPELAND","-5/-36°C","Pas de variation",7.2,2.5,"ZR48 K3E PFJ 522",1949,9.6999999999999993]
[null,null,"Scroll","Non","R134A","COPELAND","-5/-36°C","Pas de variation",8.81,2.73,"ZR61 KCE PFZ 522",2188,11.540000000000001]
[null,null,"Scroll","Non","R134A","COPELAND","-5/-36°C","Pas de variation",3.2,1.1000000000000001,"ZR22 K3E TFD 522",1564,4.3000000000000007]
[null,null,"Scroll","Non","R134A","COPELAND","-5/-36°C","Pas de variation",4.2,1.4,"ZR28 K3E TFD 522",1612,5.6]
[null,null,"Scroll","Non","R134A","COPELAND","-5/-36°C","Pas de variation",4.9000000000000004,1.7,"ZR34 K3E TFD 522",1725,6.6000000000000005]
[null,null,"Scroll","Non","R134A","COPELAND","-5/-36°C","Pas de variation",5.7,1.9,"ZR40 K3E TFD 522",2093,7.6]
[null,null,"Scroll","Non","R134A","COPELAND","-5/-36°C","Pas de variation",6.8,2.2999999999999998,"ZR48 K3E TFD 522",2026,9.1]
[null,null,"Scroll","Non","R134A","COPELAND","-5/-36°C","Pas de variation",8.85,2.71,"ZR61 KSE TFM 522",2254,11.559999999999999]
[null,null,"Scroll","Non","R134A","COPELAND","-5/-36°C","Pas de variation",8.8000000000000007,2.7,"ZR61 KCE TFD 522",2291,11.5]
[null,null,"Scroll","Non","R134A","COPELAND","-5/-36°C","Pas de variation",10.5,3.2,"ZR72 KCE TFD 522",2585,13.7]
[null,null,"Scroll","Non","R134A","COPELAND","-5/-36°C","Pas de variation",11.8,3.6,"ZR81 KCE TFD 522",2944,15.4]
[null,null,"Scroll","Non","R134A","COPELAND","-5/-36°C","Pas de variation",12.8,4.2,"ZR90 K3E TWD 961",5260,17]
[null,null,"Scroll","Non","R134A","COPELAND","-5/-36°C","Pas de variation",12.3,4.3,"ZR94 KCE TFD 455",3609,16.600000000000001]
[null,null,"Scroll","Non","R134A","COPELAND","-5/-36°C","Pas de variation",14.1,4.8,"ZR108 KCE TFD 455",4473,18.899999999999999]
[null,null,"Scroll","Non","R134A","COPELAND","-5/-36°C","Pas de variation",15.8,5.0999999999999996,"ZR11 M3E TWD 961",6480,20.9]
[null,null,"Scroll","Non","R134A","COPELAND","-5/-36°C","Pas de variation",18.3,5.9,"ZR12 M3E TWD 961",7050,24.200000000000003]
[null,null,"Scroll","Non","R134A","COPELAND","-5/-36°C","Pas de variation",16.2,5.6,"ZR125 KCE TFD 455",4893,21.799999999999997]
[null,null,"Scroll","Non","R134A","COPELAND","-5/-36°C","Pas de variation",20.9,6.3,"ZR144 KCE TFD 455",5250,27.2]
[null,null,"Scroll","Non","R134A","COPELAND","-5/-36°C","Pas de variation",22.4,7.2,"ZR16 M3E TWD 961",7960,29.599999999999998]
[null,null,"Scroll","Non","R134A","COPELAND","-5/-36°C","Pas de variation",22.8,6.9,"ZR160 K-E TFD 455",5570,29.700000000000003]
[null,null,"Scroll","Non","R134A","COPELAND","-5/-36°C","Pas de variation",26.8,8.6,"ZR19 M3E TWD 961",8700,35.4]
[null,null,"Scroll","Non","R134A","COPELAND","-5/-36°C","Pas de variation",27.2,8.4,"ZR190 KCE TFD 455",6060,35.6]
[null,null,"Scroll","Non","R134A","COPELAND","-5/-36°C","Pas de variation",35.4,1.21,"ZR250 KCE TWD 522",9970,36.61]
[null,null,"Scroll","Non","R134A","COPELAND","-5/-36°C","Pas de variation",45,14.5,"ZR310 KCE TWD 522",11060,59.5]
[null,null,"Scroll","Non","R134A","COPELAND","-5/-36°C","Pas de variation",55.4,17.100000000000001,"ZR380 KCE TWD 522",12610,72.5]
[null,null,"Semi-hermétique","Non","R407F","COPELAND","-5/+36°C","Pas de variation",10.25,2.78,"2DC-50X",2800,13.03]
[null,null,"Semi-hermétique","Non","R407F","COPELAND","-5/+36°C","Pas de variation",11.95,3.22,"2DD-50X",2960,15.17]
[null,null,"Semi-hermétique","Non","R407F","COPELAND","-5/+36°C","Pas de variation",14.75,3.99,"2DL-75X",3682,18.740000000000002]
[null,null,"Semi-hermétique","Non","R407F","COPELAND","-5/+36°C","Pas de variation",17.850000000000001,4.8099999999999996,"2DB-75X",6830,22.66]
[null,null,"Semi-hermétique","Non","R407F","COPELAND","-5/+36°C","Pas de variation",20.8,5.56,"3DA-75X",6950,26.36]
[null,null,"Semi-hermétique","Non","R407F","COPELAND","-5/+36°C","Pas de variation",24.7,6.52,"3DC-100X",7470,31.22]
[null,null,"Semi-hermétique","Non","R407F","COPELAND","-5/+36°C","Pas de variation",32.6,8.84,"3DS-150X",8630,41.44]
[null,null,"Semi-hermétique","Non","R407F","COPELAND","-5/+36°C","Pas de variation",94.2,27,"8DH-500X",21260,121.2]
[null,null,"Semi-hermétique","Non","R407F","COPELAND","-5/+36°C","Pas de variation",113,32.799999999999997,"8DJ-600X",25290,145.80000000000001]
[null,null,"Scroll","Non","R407F","COPELAND","-5/+36°C","Pas de variation",11.5,3.31,"ZF13KVE",3366,14.81]
[null,null,"Scroll","Non","R407F","COPELAND","-5/+36°C","Pas de variation",16,4.7,"ZF18KVE",4212,20.7]
[null,null,"Scroll","Non","R407F","COPELAND","-5/+36°C","Pas de variation",19.100000000000001,5.8,"ZF25K5E","A estimer",24.900000000000002]
[null,null,"Scroll","Non","R407F","COPELAND","-5/+36°C","Pas de variation",25.4,6.8,"ZF34K5E","A estimer",32.199999999999996]
[null,null,"Scroll","Non","R407F","COPELAND","-5/+36°C","Pas de variation",21.2,8.41,"ZF41K5E","A estimer",29.61]
[null,null,"Principe","Variateur","Fluide","Marque","Régime T°C","Fréquence \nde variation","P Frigo \ncompresseur\nsélectionné (KW)","P abs compresseur sélectionné (KW)","Modèle","Prix","Rejet de \nChaleur (KW)"]
[null,null,"Semi-hermétique","Non","R134A","BITZER","-10/+45°C","Pas de variation",1,0.53,"2KES-05Y",1791,{"$f":"I73+J73","v":1.53}]
[null,null,"Semi-hermétique","Non","R134A","BITZER","-10/+45°C","Pas de variation",1.27,0.69,"2JES-07Y",1818,{"$f":"I74+J74","v":1.96}]
[null,null,"Semi-hermétique","Non","R134A","BITZER","-10/+45°C","Pas de variation",1.83,0.87,"2HES-1Y",1845,2.7]
[null,null,"Semi-hermétique","Non","R134A","BITZER","-10/+45°C","Pas de variation",1.81,0.88,"2HES-2Y",1875,2.69]
[null,null,"Semi-hermétique","Non","R134A","BITZER","-10/+45°C","Pas de variation",2.16,1.02,"2GES-2Y",1883,3.18]
[null,null,"Semi-hermétique","Non","R134A","BITZER","-10/+45°C","Pas de variation",2.68,1.2,"2FES-2Y",2120,3.88]
[null,null,"Semi-hermétique","Non","R134A","BITZER","-10/+45°C","Pas de variation",2.67,1.29,"2FES-3Y",2224,3.96]
[null,null,"Semi-hermétique","Non","R134A","BITZER","-10/+45°C","Pas de variation",3.31,1.39,"2EES-2Y",2756,4.7]
[null,null,"Semi-hermétique","Non","R134A","BITZER","-10/+45°C","Pas de variation",3.32,1.43,"2EES-3Y",2944,4.75]
[null,null,"Semi-hermétique","Non","R134A","BITZER","-10/+45°C","Pas de variation",3.98,1.73,"2DES-2Y",2872,5.71]
[null,null,"Semi-hermétique","Non","R134A","BITZER","-10/+45°C","Pas de variation",3.99,1.69,"2DES-3Y",2993,5.68]
[null,null,"Semi-hermétique","Non","R134A","BITZER","-10/+45°C","Pas de variation",4.95,2.11,"2CES-3Y",3074,7.0600000000000005]
[null,null,"Semi-hermétique","Non","R134A","BITZER","-10/+45°C","Pas de variation",4.96,2.09,"2CES-4Y",3113,7.05]
[null,null,"Semi-hermétique","Non","R134A","BITZER","-10/+45°C","Pas de variation",5.08,2.14,"4FES-3Y",3319,7.2200000000000006]
[null,null,"Semi-hermétique","Non","R134A","BITZER","-10/+45°C","Pas de variation",5.07,2.15,"4FES-5Y",3934,7.2200000000000006]
[null,null,"Semi-hermétique","Non","R134A","BITZER","-10/+45°C","Pas de variation",6.79,2.8,"4EES-4Y",3498,9.59]
[null,null,"Semi-hermétique","Non","R134A","BITZER","-10/+45°C","Pas de variation",6.77,2.82,"4EES-6Y",3840,9.59]
[null,null,"Semi-hermétique","Non","R134A","BITZER","-10/+45°C","Pas de variation",7.82,3.24,"4DES-5Y",4400,11.06]
[null,null,"Semi-hermétique","Non","R134A","BITZER","-10/+45°C","Pas de variation",7.83,3.25,"4DES-7Y",4414,11.08]
[null,null,"Semi-hermétique","Non","R134A","BITZER","-10/+45°C","Pas de variation",9.73,4.01,"4CES-6Y",4830,13.74]
[null,null,"Semi-hermétique","Non","R134A","BITZER","-10/+45°C","Pas de variation",9.7100000000000009,4.0199999999999996,"4CES-9Y",4801,13.73]
[null,null,"Semi-hermétique","Non","R134A","BITZER","-10/+45°C","Pas de variation",10.09,3.98,"4VES-7Y",5760,14.07]
[null,null,"Semi-hermétique","Non","R134A","BITZER","-10/+45°C","Pas de variation",9.8800000000000008,3.97,"4VES-10Y",5710,13.850000000000001]
[null,null,"Semi-hermétique","Non","R134A","BITZER","-10/+45°C","Pas de variation",12.06,4.8600000000000003,"4TES-12Y",5780,16.920000000000002]
[null,null,"Semi-hermétique","Non","R134A","BITZER","-10/+45°C","Pas de variation",13.56,5.44,"4PES-15Y",6400,19]
[null,null,"Semi-hermétique","Non","R134A","BITZER","-10/+45°C","Pas de variation",16.46,6.58,"4NES-20Y",7040,23.04]
[null,null,"Semi-hermétique","Non","R134A","BITZER","-10/+45°C","Pas de variation",18.82,7.42,"4JE-22Y",9960,26.240000000000002]
[null,null,"Semi-hermétique","Non","R134A","BITZER","-10/+45°C","Pas de variation",22.5,8.8800000000000008,"4HE-25Y",10010,31.380000000000003]
[null,null,"Semi-hermétique","Non","R134A","BITZER","-10/+45°C","Pas de variation",26.3,10.33,"4GE-30Y",11110,36.630000000000003]
[null,null,"Semi-hermétique","Non","R134A","BITZER","-10/+45°C","Pas de variation",31.1,12.29,"4FE-35Y",11010,43.39]
[null,null,"Semi-hermétique","Non","R134A","BITZER","-10/+45°C","Pas de variation",28.4,11.12,"6JE-33Y.2Y",12970,39.519999999999996]
[null,null,"Semi-hermétique","Non","R134A","BITZER","-10/+45°C","Pas de variation",32.9,12.96,"6HE-35Y",13350,45.86]
[null,null,"Semi-hermétique","Non","R134A","BITZER","-10/+45°C","Pas de variation",38.799999999999997,15.6,"6GE-40Y",14390,54.4]
[null,null,"Semi-hermétique","Non","R134A","BITZER","-10/+45°C","Pas de variation",45.7,18.739999999999998,"6FE-50Y",16590,64.44]
[null,null,"Semi-hermétique","Non","R407F","BITZER","-10/+45°C","Pas de variation",1.91,0.85,"2KES-05Y",1791,2.76]
[null,null,"Semi-hermétique","Non","R407F","BITZER","-10/+45°C","Pas de variation",2.57,1.1499999999999999,"2JES-07Y",1818,3.7199999999999998]
[null,null,"Semi-hermétique","Non","R407F","BITZER","-10/+45°C","Pas de variation",3.3,1.47,"2HES-1Y",1845,4.7699999999999996]
[null,null,"Semi-hermétique","Non","R407F","BITZER","-10/+45°C","Pas de variation",3.29,1.45,"2HES-2Y",1875,4.74]
[null,null,"Semi-hermétique","Non","R407F","BITZER","-10/+45°C","Pas de variation",3.88,1.72,"2GES-2Y",1883,5.6]
[null,null,"Semi-hermétique","Non","R407F","BITZER","-10/+45°C","Pas de variation",4.92,2.21,"2FES-2Y",2120,7.13]
[null,null,"Semi-hermétique","Non","R407F","BITZER","-10/+45°C","Pas de variation",4.91,2.17,"2FES-3Y",2224,7.08]
[null,null,"Semi-hermétique","Non","R407F","BITZER","-10/+45°C","Pas de variation",5.56,2.37,"2EES-2Y",2756,7.93]
[null,null,"Semi-hermétique","Non","R407F","BITZER","-10/+45°C","Pas de variation",5.57,2.36,"2EES-3Y",2944,7.93]
[null,null,"Semi-hermétique","Non","R407F","BITZER","-10/+45°C","Pas de variation",6.67,2.93,"2DES-2Y",2872,9.6]
[null,null,"Semi-hermétique","Non","R407F","BITZER","-10/+45°C","Pas de variation",6.69,2.87,"2DES-3Y",2993,9.56]
[null,null,"Semi-hermétique","Non","R407F","BITZER","-10/+45°C","Pas de variation",8.26,3.6,"2CES-3Y",3074,11.86]
[null,null,"Semi-hermétique","Non","R407F","BITZER","-10/+45°C","Pas de variation",8.27,3.54,"2CES-4Y",3113,11.809999999999999]
[null,null,"Semi-hermétique","Non","R407F","BITZER","-10/+45°C","Pas de variation",9.0500000000000007,3.91,"4FES-3Y",3319,12.96]
[null,null,"Semi-hermétique","Non","R407F","BITZER","-10/+45°C","Pas de variation",9.06,3.83,"4FES-5Y",3934,12.89]
[null,null,"Semi-hermétique","Non","R407F","BITZER","-10/+45°C","Pas de variation",11.33,4.91,"4EES-4Y",3498,16.240000000000002]
[null,null,"Semi-hermétique","Non","R407F","BITZER","-10/+45°C","Pas de variation",11.32,4.83,"4EES-6Y",3840,16.149999999999999]
[null,null,"Semi-hermétique","Non","R407F","BITZER","-10/+45°C","Pas de variation",13.31,5.71,"4DES-5Y",4400,19.02]
[null,null,"Semi-hermétique","Non","R407F","BITZER","-10/+45°C","Pas de variation",13.32,5.59,"4DES-7Y",4414,18.91]
[null,null,"Semi-hermétique","Non","R407F","BITZER","-10/+45°C","Pas de variation",16.5,7.01,"4CES-6Y",4830,23.509999999999998]
[null,null,"Semi-hermétique","Non","R407F","BITZER","-10/+45°C","Pas de variation",16.510000000000002,7,"4CES-9Y",4801,23.51]
[null,null,"Semi-hermétique","Non","R407F","BITZER","-10/+45°C","Pas de variation",16.71,6.99,"4VES-7Y",5760,23.700000000000003]
[null,null,"Semi-hermétique","Non","R407F","BITZER","-10/+45°C","Pas de variation",16.7,6.78,"4VES-10Y",5710,23.48]
[null,null,"Semi-hermétique","Non","R407F","BITZER","-10/+45°C","Pas de variation",20.399999999999999,8.34,"4TES-12Y",5780,28.74]
[null,null,"Semi-hermétique","Non","R407F","BITZER","-10/+45°C","Pas de variation",23.2,9.39,"4PES-15Y",6400,32.590000000000003]
[null,null,"Semi-hermétique","Non","R407F","BITZER","-10/+45°C","Pas de variation",27.7,11.13,"4NES-20Y",7040,38.83]
[null,null,"Semi-hermétique","Non","R407F","BITZER","-10/+45°C","Pas de variation",31.4,12.63,"4JE-22Y",9960,44.03]
[null,null,"Semi-hermétique","Non","R407F","BITZER","-10/+45°C","Pas de variation",37.4,15.06,"4HE-25Y",10010,52.46]
[null,null,"Semi-hermétique","Non","R407F","BITZER","-10/+45°C","Pas de variation",43.3,17.28,"4GE-30Y",11110,60.58]
[null,null,"Semi-hermétique","Non","R407F","BITZER","-10/+45°C","Pas de variation",51.8,20.8,"4FE-35Y",11010,72.599999999999994]
[null,null,"Semi-hermétique","Non","R407F","BITZER","-10/+45°C","Pas de variation",46.9,18.79,"6JE-33Y.2Y",12970,65.69]
[null,null,"Semi-hermétique","Non","R407F","BITZER","-10/+45°C","Pas de variation",56,22.5,"6HE-35Y",13350,{"$f":"I138+J138","v":78.5}]
[null,null,"Semi-hermétique","Non","R407F","BITZER","-10/+45°C","Pas de variation",64.8,26,"6GE-40Y",14390,90.8]
[null,null,"Semi-hermétique","Non","R407F","BITZER","-10/+45°C","Pas de variation",77.5,31.2,"6FE-50Y",16590,108.7]
[null,null,"Semi-hermétique","Oui","R134A","BITZER","-10/+45°C","Pas de variation",3.6,1.26,"2DES-3.F1Y 40S",8190,4.8600000000000003]
[null,null,"Semi-hermétique","Oui","R134A","BITZER","-10/+45°C","Pas de variation",3.82,1.31,"4FES-5.F1Y+BCP 40S",9510,5.13]
[null,null,"Semi-hermétique","Oui","R134A","BITZER","-10/+45°C","Pas de variation",4.9400000000000004,1.68,"4EES-6.F1Y+BCP 40S",10440,6.62]
[null,null,"Semi-hermétique","Oui","R134A","BITZER","-10/+45°C","Pas de variation",5.82,1.97,"4DES-7.F3Y+BCP 40S",11070,7.79]
[null,null,"Semi-hermétique","Oui","R134A","BITZER","-10/+45°C","Pas de variation",7.17,2.42,"4CES-9.F3Y+BCP 40S","A estimer",9.59]
[null,null,"Semi-hermétique","Oui","R134A","BITZER","-10/+45°C","Pas de variation",7.44,2.4500000000000002,"4VES-10.F4Y 40S",14180,9.89]
[null,null,"Semi-hermétique","Oui","R134A","BITZER","-10/+45°C","Pas de variation",9,2.99,"4TES-12.F4Y 40S",14410,11.99]
[null,null,"Semi-hermétique","Oui","R134A","BITZER","-10/+45°C","Pas de variation",10.28,3.38,"4PES-15.F4Y 40S",15030,13.66]
[null,null,"Semi-hermétique","Oui","R134A","BITZER","-10/+45°C","Pas de variation",12.28,4.04,"4NES-20.F4Y 40S",16190,16.32]
[null,null,"Semi-hermétique","Oui","R134A","BITZER","-10/+45°C","Pas de variation",10.49,4,"2DES-3.F1Y 40S",8190,14.49]
[null,null,"Semi-hermétique","Oui","R134A","BITZER","-10/+45°C","Pas de variation",13.61,5.13,"4FES-5.F1Y+BCP 40S",9510,18.739999999999998]
[null,null,"Semi-hermétique","Oui","R134A","BITZER","-10/+45°C","Pas de variation",17.59,6.61,"4EES-6.F1Y+BCP 40S",10440,24.2]
[null,null,"Semi-hermétique","Oui","R134A","BITZER","-10/+45°C","Pas de variation",20.7,7.7,"4DES-7.F3Y+BCP 40S",11070,28.4]
[null,null,"Semi-hermétique","Oui","R134A","BITZER","-10/+45°C","Pas de variation",25.6,9.4600000000000009,"4CES-9.F3Y+BCP 40S","A estimer",35.06]
[null,null,"Semi-hermétique","Oui","R134A","BITZER","-10/+45°C","Pas de variation",26.5,9.5500000000000007,"4VES-10.F4Y 40S",14180,36.049999999999997]
[null,null,"Semi-hermétique","Oui","R134A","BITZER","-10/+45°C","Pas de variation",32.1,11.67,"4TES-12.F4Y 40S",14410,43.77]
[null,null,"Semi-hermétique","Oui","R134A","BITZER","-10/+45°C","Pas de variation",36.6,13.2,"4PES-15.F4Y 40S",15030,49.8]
[null,null,"Semi-hermétique","Oui","R134A","BITZER","-10/+45°C","Pas de variation",43.7,15.79,"4NES-20.F4Y 40S",16190,59.49]
[null,null,"Semi-hermétique","Non","R134A","COPELAND","-10/+45°C","Pas de variation",4.25,2.0099999999999998,"2DC-50X",5230,6.26]
[null,null,"Semi-hermétique","Non","R134A","COPELAND","-10/+45°C","Pas de variation",5.27,2.38,"2DD-50X",5250,7.6499999999999995]
[null,null,"Semi-hermétique","Non","R134A","COPELAND","-10/+45°C","Pas de variation",6.2,2.96,"2DL-40X",4878,9.16]
[null,null,"Semi-hermétique","Non","R134A","COPELAND","-10/+45°C","Pas de variation",6.19,2.79,"2DL-75X",5870,8.98]
[null,null,"Semi-hermétique","Non","R134A","COPELAND","-10/+45°C","Pas de variation",7.93,3.45,"2DB-50X",6250,11.379999999999999]
[null,null,"Semi-hermétique","Non","R134A","COPELAND","-10/+45°C","Pas de variation",7.51,3.37,"2DB-75X",6280,10.879999999999999]
[null,null,"Semi-hermétique","Non","R134A","COPELAND","-10/+45°C","Pas de variation",8.93,3.88,"3DA-50X",6410,12.809999999999999]
[null,null,"Semi-hermétique","Non","R134A","COPELAND","-10/+45°C","Pas de variation",8.74,3.9,"3DA-75X",6950,12.64]
[null,null,"Semi-hermétique","Non","R134A","COPELAND","-10/+45°C","Pas de variation",11.05,4.6900000000000004,"3DC-100X",7470,15.740000000000002]
[null,null,"Semi-hermétique","Non","R134A","COPELAND","-10/+45°C","Pas de variation",10.95,4.7300000000000004,"3DC-75X ",7280,15.68]
[null,null,"Semi-hermétique","Non","R134A","COPELAND","-10/+45°C","Pas de variation",14.4,6.22,"3DS-100X",8660,20.62]
[null,null,"Semi-hermétique","Non","R134A","COPELAND","-10/+45°C","Pas de variation",15.17,6.38,"3DS-150X",8630,21.55]
[null,null,"Semi-hermétique","Non","R134A","COPELAND","-10/+45°C","Pas de variation",16.8,6.96,"4DF-100X",8780,23.76]
[null,null,"Semi-hermétique","Non","R134A","COPELAND","-10/+45°C","Pas de variation",17.2,6.72,"4DA-200X ",9290,23.919999999999998]
[null,null,"Semi-hermétique","Non","R134A","COPELAND","-10/+45°C","Pas de variation",21.81,9.1199999999999992,"4DL-150X",9860,30.93]
[null,null,"Semi-hermétique","Non","R134A","COPELAND","-10/+45°C","Pas de variation",21.1,9.1,"4DH-250X",11610,30.200000000000003]
[null,null,"Semi-hermétique","Non","R134A","COPELAND","-10/+45°C","Pas de variation",26.61,11.11,"4DT-220X",11250,37.72]
[null,null,"Semi-hermétique","Non","R134A","COPELAND","-10/+45°C","Pas de variation",25.7,10.85,"4DJ-300X",13050,36.549999999999997]
[null,null,"Semi-hermétique","Non","R134A","COPELAND","-10/+45°C","Pas de variation",30.9,13.5,"6DH-350X",15650,44.4]
[null,null,"Semi-hermétique","Non","R134A","COPELAND","-10/+45°C","Pas de variation",31.7,13.15,"6DL-270X",13920,44.85]
[null,null,"Semi-hermétique","Non","R134A","COPELAND","-10/+45°C","Pas de variation",37.6,16,"6DJ-400X",17650,53.6]
[null,null,"Semi-hermétique","Non","R134A","COPELAND","-10/+45°C","Pas de variation",38.5,16.399999999999999,"6DT-320X",16370,54.9]
[null,null,"Semi-hermétique","Non","R134A","COPELAND","-10/+45°C","Pas de variation",44.4,19.75,"8DH-500X",21260,64.150000000000006]
[null,null,"Semi-hermétique","Non","R134A","COPELAND","-10/+45°C","Pas de variation",46,19.420000000000002,"8DL-370X",19410,65.42]
[null,null,"Semi-hermétique","Non","R134A","COPELAND","-10/+45°C","Pas de variation",53.3,23.3,"8DJ-600X",25290,76.599999999999994]
[null,null,"Semi-hermétique","Non","R134A","COPELAND","-10/+45°C","Pas de variation",55.5,23.71,"8DT-450X",24500,79.210000000000008]
[null,null,"Semi-hermétique","Non","R134A","COPELAND","-10/+45°C","Pas de variation",18.649999999999999,7.64,"4MA1-22X",10910,26.29]
[null,null,"Semi-hermétique","Non","R134A","COPELAND","-10/+45°C","Pas de variation",17.95,7.6,"4MF1-13X",8790,25.549999999999997]
[null,null,"Semi-hermétique","Non","R134A","COPELAND","-10/+45°C","Pas de variation",21.5,9.09,"4MH1-25X",11180,30.59]
[null,null,"Semi-hermétique","Non","R134A","COPELAND","-10/+45°C","Pas de variation",21.8,8.5299999999999994,"4ML1-15X",11180,30.33]
[null,null,"Semi-hermétique","Non","R134A","COPELAND","-10/+45°C","Pas de variation",23.8,9.8800000000000008,"4MI1-30X",8920,33.68]
[null,null,"Semi-hermétique","Non","R134A","COPELAND","-10/+45°C","Pas de variation",24.2,9.92,"4MM1-20X",10780,34.119999999999997]
[null,null,"Semi-hermétique","Non","R134A","COPELAND","-10/+45°C","Pas de variation",26.6,11.1,"4MJ1-33X",9840,37.700000000000003]
[null,null,"Semi-hermétique","Non","R134A","COPELAND","-10/+45°C","Pas de variation",27.4,11.32,"4MT1-22X",12180,38.72]
[null,null,"Semi-hermétique","Non","R134A","COPELAND","-10/+45°C","Pas de variation",29.8,12.6,"4MK1-35X",10840,42.4]
[null,null,"Semi-hermétique","Non","R134A","COPELAND","-10/+45°C","Pas de variation",30.2,12.8,"4MU1-25X",13420,43]
[null,null,"Semi-hermétique","Non","R134A","COPELAND","-10/+45°C","Pas de variation",35,15.29,"6MI1-40X",11270,50.29]
[null,null,"Semi-hermétique","Non","R134A","COPELAND","-10/+45°C","Pas de variation",36.4,15.21,"6MM1-30X",14050,51.61]
[null,null,"Semi-hermétique","Non","R134A","COPELAND","-10/+45°C","Pas de variation",39.700000000000003,16.8,"6MJ1-45X",12820,56.5]
[null,null,"Semi-hermétique","Non","R134A","COPELAND","-10/+45°C","Pas de variation",41.1,17.3,"6MT1-35X",15650,58.400000000000006]
[null,null,"Semi-hermétique","Non","R134A","COPELAND","-10/+45°C","Pas de variation",42.5,19.52,"6MK1-50X",15680,62.019999999999996]
[null,null,"Semi-hermétique","Non","R134A","COPELAND","-10/+45°C","Pas de variation",44.9,19.3,"6MU1-40X",17250,64.2]
[null,null,"Semi-hermétique","Non","R407F","COPELAND","-10/+45°C","Pas de variation",3.39,13.1,"4MA1-22X",10910,16.489999999999998]
[null,null,"Semi-hermétique","Non","R407F","COPELAND","-10/+45°C","Pas de variation",29.1,13.21,"4MF1-13X",8790,{"$f":"I202+J202","v":42.31}]
[null,null,"Semi-hermétique","Non","R407F","COPELAND","-10/+45°C","Pas de variation",36.5,15.3,"4MH1-25X",11180,51.8]
[null,null,"Semi-hermétique","Non","R407F","COPELAND","-10/+45°C","Pas de variation",36,15.5,"4ML1-15X",11180,51.5]
[null,null,"Semi-hermétique","Non","R407F","COPELAND","-10/+45°C","Pas de variation",40.200000000000003,16.75,"4MI1-30X",8920,56.95]
[null,null,"Semi-hermétique","Non","R407F","COPELAND","-10/+45°C","Pas de variation",39.4,17.05,"4MM1-20X",10780,56.45]
[null,null,"Semi-hermétique","Non","R407F","COPELAND","-10/+45°C","Pas de variation",44.8,18.899999999999999,"4MJ1-33X",9840,63.699999999999996]
[null,null,"Semi-hermétique","Non","R407F","COPELAND","-10/+45°C","Pas de variation",43.8,19.5,"4MT1-22X",12180,63.3]
[null,null,"Semi-hermétique","Non","R407F","COPELAND","-10/+45°C","Pas de variation",50,21.6,"4MK1-35X",10840,71.599999999999994]
[null,null,"Semi-hermétique","Non","R407F","COPELAND","-10/+45°C","Pas de variation",49.2,22.3,"4MU1-25X",13420,71.5]
[null,null,"Semi-hermétique","Non","R407F","COPELAND","-10/+45°C","Pas de variation",61.5,25.9,"6MI1-40X",11270,87.4]
[null,null,"Semi-hermétique","Non","R407F","COPELAND","-10/+45°C","Pas de variation",59.9,26.3,"6MM1-30X",14050,86.2]
[null,null,"Semi-hermétique","Non","R407F","COPELAND","-10/+45°C","Pas de variation",68,29.3,"6MJ1-45X",12820,97.3]
[null,null,"Semi-hermétique","Non","R407F","COPELAND","-10/+45°C","Pas de variation",66.900000000000006,29.8,"6MT1-35X",15650,96.7]
[null,null,"Semi-hermétique","Non","R407F","COPELAND","-10/+45°C","Pas de variation",76.599999999999994,33.1,"6MK1-50X",15680,109.69999999999999]
[null,null,"Semi-hermétique","Non","R407F","COPELAND","-10/+45°C","Pas de variation",72.7,33.6,"6MU1-40X",17250,106.30000000000001]
[null,null,"Scroll","Non","R134A","COPELAND","-10/+45°C","Pas de variation",3,1.5,"ZBD21KCE TFD 551",2501,4.5]
[null,null,"Scroll","Non","R134A","COPELAND","-10/+45°C","Pas de variation",4.0999999999999996,1.92,"ZBD30 KCE TFD 551",3161,6.02]
[null,null,"Scroll","Non","R134A","COPELAND","-10/+45°C","Pas de variation",5.0999999999999996,2.4,"ZBD38 KCE TFD 551",6492,7.5]
[null,null,"Scroll","Non","R134A","COPELAND","-10/+45°C","Pas de variation",5.81,2.72,"ZBD45 KCE TFD 551",4614,8.5299999999999994]
[null,null,"Scroll","Non","R134A","COPELAND","-10/+45°C","Pas de variation",7.5,3.8,"ZBD58 KCE TFD 551",5450,11.3]
[null,null,"Scroll","Non","R134A","COPELAND","-10/+45°C","Pas de variation",9.81,4.9000000000000004,"ZBD76 KCE TFD 551",6660,14.71]
[null,null,"Scroll","Non","R407F","COPELAND","-10/+45°C","Pas de variation",4.5999999999999996,2.33,"ZBD21KCE TFD 551",2501,6.93]
[null,null,"Scroll","Non","R407F","COPELAND","-10/+45°C","Pas de variation",6.7,3.1,"ZBD30 KCE TFD 551",3161,9.8000000000000007]
[null,null,"Scroll","Non","R407F","COPELAND","-10/+45°C","Pas de variation",8.1999999999999993,3.82,"ZBD38 KCE TFD 551",6492,12.02]
[null,null,"Scroll","Non","R407F","COPELAND","-10/+45°C","Pas de variation",9.8000000000000007,4.5,"ZBD45 KCE TFD 551",4614,14.3]
[null,null,"Scroll","Non","R134A","COPELAND","-10/+45°C","Pas de variation",1.98,1.03,"ZB15 KCE TFD 551 ",1851,3.01]
[null,null,"Scroll","Non","R134A","COPELAND","-10/+45°C","Pas de variation",2.29,1.19,"ZB19 KCE TFD 551",1883,3.48]
[null,null,"Scroll","Non","R134A","COPELAND","-10/+45°C","Pas de variation",2.89,1.49,"ZB21 KCE TFD 551",1921,4.38]
[null,null,"Scroll","Non","R134A","COPELAND","-10/+45°C","Pas de variation",3.34,1.67,"ZB26 KCE TFD 551",2217,5.01]
[null,null,"Scroll","Non","R134A","COPELAND","-10/+45°C","Pas de variation",3.92,1.93,"ZB30 KCE TFD 551",2445,5.85]
[null,null,"Scroll","Non","R134A","COPELAND","-10/+45°C","Pas de variation",4.87,2.39,"ZB38 KCE TFD 551",2696,7.26]
[null,null,"Scroll","Non","R134A","COPELAND","-10/+45°C","Pas de variation",5.8,2.75,"ZB45 KCE TFD 551",3000,8.5500000000000007]
[null,null,"Scroll","Non","R134A","COPELAND","-10/+45°C","Pas de variation",6.68,3.35,"ZB50 KCE TFD 551",3863,10.029999999999999]
[null,null,"Scroll","Non","R134A","COPELAND","-10/+45°C","Pas de variation",6.78,3.68,"ZB56 KCE TWD 551",4616,10.46]
[null,null,"Scroll","Non","R134A","COPELAND","-10/+45°C","Pas de variation",7.48,3.75,"ZB58 KCE TFD 551",4170,11.23]
[null,null,"Scroll","Non","R134A","COPELAND","-10/+45°C","Pas de variation",8.5500000000000007,4.1900000000000004,"ZB66 KCE TFD 551",4756,12.740000000000002]
[null,null,"Scroll","Non","R134A","COPELAND","-10/+45°C","Pas de variation",9.52,4.49,"ZB75 KCE TWD 551",5500,14.01]
[null,null,"Scroll","Non","R134A","COPELAND","-10/+45°C","Pas de variation",9.7899999999999991,4.92,"ZB76 KCE TFD 551",5110,14.709999999999999]
[null,null,"Scroll","Non","R134A","COPELAND","-10/+45°C","Pas de variation",11.85,5.88,"ZB92 KCE TWD 551",6130,17.73]
[null,null,"Scroll","Non","R134A","COPELAND","-10/+45°C","Pas de variation",12.35,6.18,"ZB95 KCE TFD 551",5700,18.53]
[null,null,"Scroll","Non","R134A","COPELAND","-10/+45°C","Pas de variation",14.65,7.17,"ZB11 MCE TWD 551",6450,21.82]
[null,null,"Scroll","Non","R134A","COPELAND","-10/+45°C","Pas de variation",14.6,7.43,"ZB114 KCE TFD 551",6220,22.03]
[null,null,"Scroll","Non","R407F","COPELAND","-10/+45°C","Pas de variation",2.94,1.85,"ZB15 KCE TFD 551 ",1851,4.79]
[null,null,"Scroll","Non","R407F","COPELAND","-10/+45°C","Pas de variation",3.71,2.13,"ZB19 KCE TFD 551",1883,5.84]
[null,null,"Scroll","Non","R407F","COPELAND","-10/+45°C","Pas de variation",4.49,2.5499999999999998,"ZB21 KCE TFD 551",1921,7.04]
[null,null,"Scroll","Non","R407F","COPELAND","-10/+45°C","Pas de variation",5.19,3.02,"ZB26 KCE TFD 551",2217,8.2100000000000009]
[null,null,"Scroll","Non","R407F","COPELAND","-10/+45°C","Pas de variation",6.46,3.3,"ZB30 KCE TFD 551",2445,9.76]
[null,null,"Scroll","Non","R407F","COPELAND","-10/+45°C","Pas de variation",8.0299999999999994,4.1399999999999997,"ZB38 KCE TFD 551",2696,12.169999999999998]
[null,null,"Scroll","Non","R407F","COPELAND","-10/+45°C","Pas de variation",9.44,4.78,"ZB45 KCE TFD 551",3000,14.219999999999999]
[null,null,"Semi-hermétique","Non","R134A","COPELAND","-10/+45°C","Pas de variation",1.08,0.57999999999999996,"KM-5X","A estimer",1.6600000000000001]
[null,null,"Semi-hermétique","Non","R134A","COPELAND","-10/+45°C","Pas de variation",1.42,0.73,"KJ-7X","A estimer",2.15]
[null,null,"Semi-hermétique","Non","R134A","COPELAND","-10/+45°C","Pas de variation",1.82,0.89,"KSJ-10X","A estimer",2.71]
[null,null,"Semi-hermétique","Non","R134A","COPELAND","-10/+45°C","Pas de variation",2.09,1.0900000000000001,"KL-15X","A estimer",3.1799999999999997]
[null,null,"Semi-hermétique","Non","R134A","COPELAND","-10/+45°C","Pas de variation",2.52,1.32,"LE-20X","A estimer",3.84]
[null,null,"Semi-hermétique","Non","R134A","COPELAND","-10/+45°C","Pas de variation",2.61,1.33,"KSL-15X","A estimer",3.94]
[null,null,"Semi-hermétique","Non","R134A","COPELAND","-10/+45°C","Pas de variation",2.69,1.28,"KSL-20X","A estimer",3.9699999999999998]
[null,null,"Semi-hermétique","Non","R134A","COPELAND","-10/+45°C","Pas de variation",3.47,1.63,"LF-20X","A estimer",5.0999999999999996]
[null,null,"Semi-hermétique","Non","R134A","COPELAND","-10/+45°C","Pas de variation",3.93,2.02,"LJ-20X","A estimer",5.95]
[null,null,"Semi-hermétique","Non","R134A","COPELAND","-10/+45°C","Pas de variation",5.03,2.44,"LL-30X","A estimer",7.4700000000000006]
[null,null,"Semi-hermétique","Non","R134A","COPELAND","-10/+45°C","Pas de variation",6.61,2.97,"2DL-40X","A estimer",9.58]
[null,null,"Semi-hermétique","Non","R134A","COPELAND","-10/+45°C","Pas de variation",6.6,2.98,"LSG-40X","A estimer",9.58]
[null,null,"Semi-hermétique","Non","R134A","COPELAND","-10/+45°C","Pas de variation",8.3699999999999992,3.46,"2DB-50X","A estimer",11.829999999999998]
[null,null,"Semi-hermétique","Non","R134A","COPELAND","-10/+45°C","Pas de variation",9.4499999999999993,3.89,"3DA-50X","A estimer",13.34]
[null,null,"Semi-hermétique","Non","R134A","COPELAND","-10/+45°C","Pas de variation",9.6300000000000008,3.92,"3DAD-50X","A estimer",13.55]
[null,null,"Semi-hermétique","Non","R134A","COPELAND","-10/+45°C","Pas de variation",11.55,4.71,"3DC-75X","A estimer",{"$f":"I266+J266","v":16.260000000000002}]
[null,null,"Semi-hermétique","Non","R134A","COPELAND","-10/+45°C","Pas de variation",11.56,4.75,"3DCD-75X","A estimer",16.310000000000002]
[null,null,"Semi-hermétique","Non","R134A","COPELAND","-10/+45°C","Pas de variation",15.15,6.19,"3DS-100X","A estimer",21.34]
[null,null,"Semi-hermétique","Non","R134A","COPELAND","-10/+45°C","Pas de variation",15.5,6.27,"3DSD-100X","A estimer",21.77]
[null,null,"Semi-hermétique","Non","R134A","COPELAND","-10/+45°C","Pas de variation",44.89,18.600000000000001,"8DH-400X","A estimer",63.49]
[null,null,"Semi-hermétique","Non","R134A","COPELAND","-10/+45°C","Pas de variation",48.2,19.399999999999999,"8DL-370X","A estimer",67.599999999999994]
[null,null,"Semi-hermétique","Non","R134A","COPELAND","-10/+45°C","Pas de variation",52,23,"8DJ-500X","A estimer",75]
[null,null,"Semi-hermétique","Non","R134A","COPELAND","-10/+45°C","Pas de variation",58.2,23.7,"8DT-450X","A estimer",81.900000000000006]
[null,null,"Semi-hermétique","Non","R744","COPELAND","-10/+45°C","Pas de variation",19.25,11.3,"4MTL-12X","A estimer",30.55]
[null,null,"Semi-hermétique","Non","R744","COPELAND","-10/+45°C","Pas de variation",19.3,11.45,"4MTL-12X [INV]","A estimer",30.75]
[null,null,"Semi-hermétique","Non","R744","COPELAND","-10/+45°C","Pas de variation",25.1,14.8,"4MTL-15X [INV]","A estimer",39.900000000000006]
[null,null,"Semi-hermétique","Non","R744","COPELAND","-10/+45°C","Pas de variation",25.2,14.35,"4MTL-15X","A estimer",39.549999999999997]
[null,null,"Semi-hermétique","Non","R744","COPELAND","-10/+45°C","Pas de variation",36.799999999999997,21,"4MTL-30X [INV]","A estimer",57.8]
[null,null,"Semi-hermétique","Non","R744","COPELAND","-10/+45°C","Pas de variation",37,20.6,"4MTL-30X","A estimer",57.6]
[null,null,"Scroll","Non","R134A","COPELAND","-10/+45°C","Pas de variation",2.2000000000000002,0.9,"ZB15KCE","A estimer",3.1]
[null,null,"Scroll","Non","R134A","COPELAND","-10/+45°C","Pas de variation",2.5099999999999998,1.1100000000000001,"ZB19KCE","A estimer",3.62]
[null,null,"Scroll","Non","R134A","COPELAND","-10/+45°C","Pas de variation",3.21,1.3,"ZB21KCE","A estimer",4.51]
[null,null,"Scroll","Non","R134A","COPELAND","-10/+45°C","Pas de variation",3.7,1.48,"ZB26KCE","A estimer",5.18]
[null,null,"Scroll","Non","R134A","COPELAND","-10/+45°C","Pas de variation",4.3099999999999996,1.8,"ZB29KCE","A estimer",6.1099999999999994]
[null,null,"Scroll","Non","R134A","COPELAND","-10/+45°C","Pas de variation",4.3,1.71,"ZB30KCE","A estimer",6.01]
[null,null,"Scroll","Non","R134A","COPELAND","-10/+45°C","Pas de variation",5.4,2.1,"ZB38KCE","A estimer",7.5]
[null,null,"Scroll","Non","R134A","COPELAND","-10/+45°C","Pas de variation",6,2.52,"ZB42KCE","A estimer",8.52]
[null,null,"Scroll","Non","R134A","COPELAND","-10/+45°C","Pas de variation",6.4,2.5099999999999998,"ZB45KCE","A estimer",8.91]
[null,null,"Scroll","Non","R134A","COPELAND","-10/+45°C","Pas de variation",7.52,2.9,"ZB48KCE","A estimer",10.42]
[null,null,"Scroll","Non","R134A","COPELAND","-10/+45°C","Pas de variation",7.4,3,"ZB50KCE","A estimer",10.4]
[null,null,"Scroll","Non","R134A","COPELAND","-10/+45°C","Pas de variation",8.1,3.4,"ZB57KCE","A estimer",11.5]
[null,null,"Scroll","Non","R134A","COPELAND","-10/+45°C","Pas de variation",8.3000000000000007,3.41,"ZB58KCE","A estimer",11.71]
[null,null,"Scroll","Non","R134A","COPELAND","-10/+45°C","Pas de variation",9.51,3.81,"ZB66KCE","A estimer",13.32]
[null,null,"Scroll","Non","R134A","COPELAND","-10/+45°C","Pas de variation",10.9,4.4000000000000004,"ZB76KCE","A estimer",15.3]
[null,null,"Scroll","Non","R134A","COPELAND","-10/+45°C","Pas de variation",13.8,5.61,"ZB95KCE","A estimer",19.41]
[null,null,"Scroll","Non","R134A","COPELAND","-10/+45°C","Pas de variation",16.3,6.6,"ZB114KCE","A estimer",22.9]
[null,null,"Scroll","Non","R134A","COPELAND","-10/+45°C","Pas de variation",34.1,13.19,"ZB220KCE","A estimer",47.29]

{"sheet":"Récap centrale ","index":18,"n_rows":16,"n_cols":10,"rows_kept":16,"cut":false,"hidden":true,"merged":[[1,9,14,11],[0,2,0,7],[1,2,1,3],[1,4,1,5],[1,6,1,7],[10,2,10,3],[10,4,10,5],[10,6,10,7],[9,2,9,7]]}
[null,null,"Positif"]
[null,null,"Solution 1",null,"Solution 2",null,"Solution 3",null,null,"Cette feuille n'est ici que pour récupérer les valeurs de la sélection multiple des compresseurs (+ & -) elle permet de donner la somme des puissance et des prix. \nNE PAS LA SUPPRIMER"]
[null,null,"puissance","Prix","puissance","Prix","puissance","Prix"]
[null,"compresseur 1",{"$f":"'Centrale +'!B26","v":{"$error":"#N/A"}},{"$f":"'Centrale +'!B27","v":{"$error":"#N/A"}},{"$f":"'Centrale +'!C26","v":{"$error":"#N/A"}},{"$f":"'Centrale +'!C27","v":{"$error":"#N/A"}},{"$f":"'Centrale +'!D26","v":{"$error":"#N/A"}},{"$f":"'Centrale +'!D27","v":{"$error":"#N/A"}}]
[null,"compresseur 2",{"$f":"'Centrale +'!B30","v":{"$error":"#N/A"}},{"$f":"'Centrale +'!B31","v":{"$error":"#N/A"}},{"$f":"'Centrale +'!C30","v":{"$error":"#N/A"}},{"$f":"'Centrale +'!C31","v":{"$error":"#N/A"}},{"$f":"'Centrale +'!D30","v":{"$error":"#N/A"}},{"$f":"'Centrale +'!D31","v":{"$error":"#N/A"}}]
[null,"compresseur 3",{"$f":"'Centrale +'!B34","v":{"$error":"#N/A"}},{"$f":"'Centrale +'!B35","v":{"$error":"#N/A"}},{"$f":"'Centrale +'!C34","v":{"$error":"#N/A"}},{"$f":"'Centrale +'!C35","v":{"$error":"#N/A"}},{"$f":"'Centrale +'!D34","v":{"$error":"#N/A"}},{"$f":"'Centrale +'!D35","v":{"$error":"#N/A"}}]
[null,"Compresseur 4",{"$f":"'Centrale +'!B38","v":{"$error":"#N/A"}},{"$f":"'Centrale +'!B39","v":{"$error":"#N/A"}},{"$f":"'Centrale +'!C38","v":{"$error":"#N/A"}},{"$f":"'Centrale +'!C39","v":{"$error":"#N/A"}},{"$f":"'Centrale +'!D38","v":{"$error":"#N/A"}},{"$f":"'Centrale +'!D39","v":{"$error":"#N/A"}}]
[]
[]
[null,null,"négatif"]
[null,null,"Solution 1",null,"Solution 2",null,"Solution 3"]
[null,null,"puissance","Prix","puissance","Prix","puissance","Prix"]
[null,"compresseur 1",{"$f":"'Centrale -'!B26","v":{"$error":"#N/A"}},{"$f":"'Centrale -'!B27","v":{"$error":"#N/A"}},{"$f":"'Centrale -'!C26","v":{"$error":"#N/A"}},{"$f":"'Centrale -'!C27","v":{"$error":"#N/A"}},{"$f":"'Centrale -'!D26","v":{"$error":"#N/A"}},{"$f":"'Centrale -'!D27","v":{"$error":"#N/A"}}]
[null,"compresseur 2",{"$f":"'Centrale -'!B30","v":{"$error":"#N/A"}},{"$f":"'Centrale -'!B31","v":{"$error":"#N/A"}},{"$f":"'Centrale -'!C30","v":{"$error":"#N/A"}},{"$f":"'Centrale -'!C31","v":{"$error":"#N/A"}},{"$f":"'Centrale -'!D30","v":{"$error":"#N/A"}},{"$f":"'Centrale -'!D31","v":{"$error":"#N/A"}}]
[null,"compresseur 3",{"$f":"'Centrale -'!B34","v":{"$error":"#N/A"}},{"$f":"'Centrale -'!B35","v":{"$error":"#N/A"}},{"$f":"'Centrale -'!C34","v":{"$error":"#N/A"}},{"$f":"'Centrale -'!C35","v":{"$error":"#N/A"}},{"$f":"'Centrale -'!D34","v":{"$error":"#N/A"}},{"$f":"'Centrale -'!D35","v":{"$error":"#N/A"}}]
[null,"Compresseur 4",{"$f":"'Centrale -'!B38","v":{"$error":"#N/A"}},{"$f":"'Centrale -'!B39","v":{"$error":"#N/A"}},{"$f":"'Centrale -'!C38","v":{"$error":"#N/A"}},{"$f":"'Centrale -'!C39","v":{"$error":"#N/A"}},{"$f":"'Centrale -'!D38","v":{"$error":"#N/A"}},{"$f":"'Centrale -'!D39","v":{"$error":"#N/A"}}]

{"sheet":"Besoins frigo","index":19,"n_rows":35,"n_cols":5,"rows_kept":35,"cut":false,"hidden":true,"merged":[[33,1,33,3],[34,1,34,3],[2,0,2,5],[27,1,27,3],[28,1,28,3],[29,1,29,3],[30,1,30,3],[31,1,31,3],[32,1,32,3],[16,1,16,3],[17,1,17,3],[23,1,23,3],[24,1,24,3],[25,1,25,3],[26,1,26,3],[18,1,18,3],[4,0,4,1],[20,0,20,1],[0,0,0,8],[12,1,12,3],[13,1,13,3],[14,1,14,3],[15,1,15,3],[7,1,7,3],[8,1,8,3],[9,1,9,3],[10,1,10,3],[11,1,11,3]]}
["Besoins frigorifiques"]
[]
["Récapitulatif de vos besoins frigorifiques"]
[]
["Centrale POSITIVE"]
[]
[null,"Centrale (+)"]
[null,"Puissance meubles frigorifiques de ventes ",null,null,{"$f":"'Puissances MFV'!O94","v":0}]
[null,"Puissance chambre froide n°1",null,null,{"$f":"'Chambres positives'!E18","v":""}]
[null,"Puissance chambre froide n°2",null,null,{"$f":"'Chambres positives'!F18","v":""}]
[null,"Puissance chambre froide n°3 ",null,null,{"$f":"'Chambres positives'!G18","v":""}]
[null,"Puissance chambre froide n°4 ",null,null,{"$f":"'Chambres positives'!H18","v":""}]
[null,"Puissance chambre froide n°5 ",null,null,{"$f":"'Chambres positives'!I18","v":""}]
[null,"Puissance chambre froide n°6 ",null,null,{"$f":"'Chambres positives'!J18","v":""}]
[null,"Puissance chambre froide n°7 ",null,null,{"$f":"'Chambres positives'!K18","v":""}]
[null,"Puissance chambre froide n°8",null,null,{"$f":"'Chambres positives'!L18","v":""}]
[null,"Puissance de déshumidification "]
[null,"Puissance de rafraîchissement "]
[null,"TOTAL",null,null,{"$f":"SUM(E8:E18)","v":0}]
[]
["Centrale NÉGATIVE"]
[]
[null,"Centrale (-)"]
[null,"Puissance meubles frigorifiques de ventes ",null,null,{"$f":"'Puissances MFV'!O116","v":0}]
[null,"Puissance chambre froide n°1",null,null,{"$f":"'Chambres négative'!E18","v":""}]
[null,"Puissance chambre froide n°2",null,null,{"$f":"'Chambres négative'!F18","v":""}]
[null,"Puissance chambre froide n°3 ",null,null,{"$f":"'Chambres négative'!G18","v":""}]
[null,"Puissance chambre froide n°4 ",null,null,{"$f":"'Chambres négative'!H18","v":""}]
[null,"Puissance chambre froide n°5 ",null,null,{"$f":"'Chambres négative'!I18","v":""}]
[null,"Puissance chambre froide n°6 ",null,null,{"$f":"'Chambres négative'!J18","v":""}]
[null,"Puissance chambre froide n°7 ",null,null,{"$f":"'Chambres négative'!K18","v":""}]
[null,"Puissance chambre froide n°8",null,null,{"$f":"'Chambres négative'!L18","v":""}]
[null,"Puissance de déshumidification "]
[null,"Puissance de rafraîchissement "]
[null,"TOTAL",null,null,{"$f":"SUM(E24:E34)","v":0}]

{"sheet":"Centrale -","index":20,"n_rows":67,"n_cols":8,"rows_kept":67,"cut":false,"hidden":true,"merged":[[0,0,0,7],[9,0,9,1],[10,0,10,1],[11,0,11,1],[12,0,12,1],[6,0,6,1],[2,0,2,7],[20,0,20,1],[4,0,4,1],[18,0,18,2],[47,0,47,7],[13,0,13,1],[14,0,14,1],[15,0,15,1],[8,0,8,2],[60,0,60,7],[62,0,62,1],[62,2,62,3],[63,0,63,1],[63,2,63,3],[64,0,64,1],[64,2,64,3],[65,0,65,1],[65,2,65,3],[66,0,66,1],[66,2,66,3]]}
["Composition de votre centrale négative"]
[]
["Compresseur(s)"]
[]
["Si un seul compresseur"]
[]
["Puissance nécessaire",null,{"$f":"'Besoins frigo'!E35/1000","v":0}]
[]
["Compresseur (positif)"]
["Appel de puissance"]
["Marque sélectionné"]
["Modèle corrrespondant"]
["Principe de fonctionement"]
["Fluide utilisé"]
["Température de condensation"]
["Rejet de chaleur"]
[]
[]
["Sélection multiple de compresseur"]
[]
["Puissance nécessaire",null,{"$f":"'Besoins frigo'!E35/1000","v":0}]
[]
[null,"Solution 1","Solution 2","Solution 3"]
["Compresseurs 1",{"$f":"'Tableau synthèse'!C4","v":""},{"$f":"'Tableau synthèse'!D4","v":""},{"$f":"'Tableau synthèse'!E4","v":""}]
["Marque",{"$f":"INDEX('Selection compresseurs'!$F$27:$F$71,MATCH(B24,'Selection compresseurs'!$K$27:$K$71,0))","v":{"$error":"#N/A"}},{"$f":"INDEX('Selection compresseurs'!$F$27:$F$71,MATCH(C24,'Selection compresseurs'!$K$27:$K$71,0))","v":{"$error":"#N/A"}},{"$f":"INDEX('Selection compresseurs'!$F$27:$F$71,MATCH(D24,'Selection compresseurs'!$K$27:$K$71,0))","v":{"$error":"#N/A"}}]
["Puissance",{"$f":"INDEX('Selection compresseurs'!$I$27:$I$71,MATCH($B$24,'Selection compresseurs'!$K$27:$K$71,0))","v":{"$error":"#N/A"}},{"$f":"INDEX('Selection compresseurs'!$I$27:$I$71,MATCH($C$24,'Selection compresseurs'!$K$27:$K$71,0))","v":{"$error":"#N/A"}},{"$f":"INDEX('Selection compresseurs'!$I$27:$I$71,MATCH($D$24,'Selection compresseurs'!$K$27:$K$71,0))","v":{"$error":"#N/A"}}]
["Prix",{"$f":"INDEX('Selection compresseurs'!$L$27:$L$71,MATCH($B$24,'Selection compresseurs'!$K$27:$K$71,0))","v":{"$error":"#N/A"}},{"$f":"INDEX('Selection compresseurs'!$L$27:$L$71,MATCH($C$24,'Selection compresseurs'!$K$27:$K$71,0))","v":{"$error":"#N/A"}},{"$f":"INDEX('Selection compresseurs'!$L$27:$L$71,MATCH($D$24,'Selection compresseurs'!$K$27:$K$71,0))","v":{"$error":"#N/A"}}]
["Compresseurs 2",{"$f":"'Tableau synthèse'!C5","v":""},{"$f":"'Tableau synthèse'!D5","v":""},{"$f":"'Tableau synthèse'!E5","v":""}]
["Marque",{"$f":"INDEX('Selection compresseurs'!$F$27:$F$71,MATCH(B28,'Selection compresseurs'!$K$27:$K$71,0))","v":{"$error":"#N/A"}},{"$f":"INDEX('Selection compresseurs'!$F$27:$F$71,MATCH(C28,'Selection compresseurs'!$K$27:$K$71,0))","v":{"$error":"#N/A"}},{"$f":"INDEX('Selection compresseurs'!$F$27:$F$71,MATCH(D28,'Selection compresseurs'!$K$27:$K$71,0))","v":{"$error":"#N/A"}}]
["Puissance",{"$f":"INDEX('Selection compresseurs'!$I$27:$I$71,MATCH(B28,'Selection compresseurs'!$K$27:$K$71,0))","v":{"$error":"#N/A"}},{"$f":"INDEX('Selection compresseurs'!$I$27:$I$71,MATCH(C28,'Selection compresseurs'!$K$27:$K$71,0))","v":{"$error":"#N/A"}},{"$f":"INDEX('Selection compresseurs'!$I$27:$I$71,MATCH(D28,'Selection compresseurs'!$K$27:$K$71,0))","v":{"$error":"#N/A"}}]
["Prix",{"$f":"INDEX('Selection compresseurs'!$L$27:$L$71,MATCH(B28,'Selection compresseurs'!$K$27:$K$71,0))","v":{"$error":"#N/A"}},{"$f":"INDEX('Selection compresseurs'!$L$27:$L$71,MATCH(C28,'Selection compresseurs'!$K$27:$K$71,0))","v":{"$error":"#N/A"}},{"$f":"INDEX('Selection compresseurs'!$L$27:$L$71,MATCH(D28,'Selection compresseurs'!$K$27:$K$71,0))","v":{"$error":"#N/A"}}]
["Compresseurs 3",{"$f":"'Tableau synthèse'!C6","v":""},{"$f":"'Tableau synthèse'!D6","v":""},{"$f":"'Tableau synthèse'!E6","v":""}]
["Marque",{"$f":"INDEX('Selection compresseurs'!$F$27:$F$71,MATCH(B32,'Selection compresseurs'!$K$27:$K$71,0))","v":{"$error":"#N/A"}},{"$f":"INDEX('Selection compresseurs'!$F$27:$F$71,MATCH(C32,'Selection compresseurs'!$K$27:$K$71,0))","v":{"$error":"#N/A"}},{"$f":"INDEX('Selection compresseurs'!$F$27:$F$71,MATCH(D32,'Selection compresseurs'!$K$27:$K$71,0))","v":{"$error":"#N/A"}}]
["Puissance",{"$f":"INDEX('Selection compresseurs'!$I$27:$I$71,MATCH(B32,'Selection compresseurs'!$K$27:$K$71,0))","v":{"$error":"#N/A"}},{"$f":"INDEX('Selection compresseurs'!$I$27:$I$71,MATCH(C32,'Selection compresseurs'!$K$27:$K$71,0))","v":{"$error":"#N/A"}},{"$f":"INDEX('Selection compresseurs'!$I$27:$I$71,MATCH(D32,'Selection compresseurs'!$K$27:$K$71,0))","v":{"$error":"#N/A"}}]
["Prix",{"$f":"INDEX('Selection compresseurs'!$L$27:$L$71,MATCH(B32,'Selection compresseurs'!$K$27:$K$71,0))","v":{"$error":"#N/A"}},{"$f":"INDEX('Selection compresseurs'!$L$27:$L$71,MATCH(C32,'Selection compresseurs'!$K$27:$K$71,0))","v":{"$error":"#N/A"}},{"$f":"INDEX('Selection compresseurs'!$L$27:$L$71,MATCH(D32,'Selection compresseurs'!$K$27:$K$71,0))","v":{"$error":"#N/A"}}]
["Compresseurs 4",{"$f":"'Tableau synthèse'!C7","v":""},{"$f":"'Tableau synthèse'!D7","v":""},{"$f":"'Tableau synthèse'!E7","v":""}]
["Marque",{"$f":"INDEX('Selection compresseurs'!$F$27:$F$71,MATCH(B36,'Selection compresseurs'!$K$27:$K$71,0))","v":{"$error":"#N/A"}},{"$f":"INDEX('Selection compresseurs'!$F$27:$F$71,MATCH(C36,'Selection compresseurs'!$K$27:$K$71,0))","v":{"$error":"#N/A"}},{"$f":"INDEX('Selection compresseurs'!$F$27:$F$71,MATCH(D36,'Selection compresseurs'!$K$27:$K$71,0))","v":{"$error":"#N/A"}}]
["Puissance",{"$f":"INDEX('Selection compresseurs'!$I$27:$I$71,MATCH(B36,'Selection compresseurs'!$K$27:$K$71,0))","v":{"$error":"#N/A"}},{"$f":"INDEX('Selection compresseurs'!$I$27:$I$71,MATCH(C36,'Selection compresseurs'!$K$27:$K$71,0))","v":{"$error":"#N/A"}},{"$f":"INDEX('Selection compresseurs'!$I$27:$I$71,MATCH(D36,'Selection compresseurs'!$K$27:$K$71,0))","v":{"$error":"#N/A"}}]
["Prix",{"$f":"INDEX('Selection compresseurs'!$L$27:$L$71,MATCH(B36,'Selection compresseurs'!$K$27:$K$71,0))","v":{"$error":"#N/A"}},{"$f":"INDEX('Selection compresseurs'!$L$27:$L$71,MATCH(C36,'Selection compresseurs'!$K$27:$K$71,0))","v":{"$error":"#N/A"}},{"$f":"INDEX('Selection compresseurs'!$L$27:$L$71,MATCH(D36,'Selection compresseurs'!$K$27:$K$71,0))","v":{"$error":"#N/A"}}]
["Puissance (KW)",{"$f":"SUMIF('Récap centrale '!C13:C16,\"<>#N/A\")","v":0},{"$f":"SUMIF('Récap centrale '!E13:E16,\"<>#N/A\")","v":0},{"$f":"SUMIF('Récap centrale '!G13:G16,\"<>#N/A\")","v":0}]
["Prix total",{"$f":"SUMIF('Récap centrale '!D13:D16,\"<>#N/A\")","v":0},{"$f":"SUMIF('Récap centrale '!F13:F16,\"<>#N/A\")","v":0},{"$f":"SUMIF('Récap centrale '!H13:H16,\"<>#N/A\")","v":0}]
[]
[]
[]
[]
[]
[]
["Évaporateur(s) : Chambre(s) froide"]
[]
[null,"Chambre froide 1","Chambre froide 2","Chambre froide 3","Chambre froide 4"]
["Puissance",{"$f":"'Chambres négative'!E18","v":""},{"$f":"'Chambres négative'!F18","v":""},{"$f":"'Chambres négative'!G18","v":""},{"$f":"'Chambres négative'!H18","v":""},{"$f":"IF(F36=\"oui\",'Table CFP 2'!$K$82,\"\")","v":""},{"$f":"IF(G36=\"oui\",'Table CFP 3'!$K$82,\"\")","v":""},{"$f":"IF(H36=\"oui\",'Table CFP 4'!$K$82,\"\")","v":""}]
["Modèle",{"$f":"'Chambres négative'!E21","v":""},{"$f":"'Chambres négative'!F21","v":""},{"$f":"'Chambres négative'!G21","v":""},{"$f":"'Chambres négative'!H21","v":""}]
["Budget",{"$f":"'Chambres négative'!E23","v":""},{"$f":"'Chambres négative'!F23","v":""},{"$f":"'Chambres négative'!G23","v":""},{"$f":"'Chambres négative'!H23","v":""}]
[]
[null,"Chambre froide 5","Chambre froide 6","Chambre froide 7","Chambre froide 8"]
["Puissance",{"$f":"'Chambres négative'!I18","v":""},{"$f":"'Chambres négative'!J18","v":""},{"$f":"'Chambres négative'!K18","v":""},{"$f":"'Chambres négative'!L18","v":""}]
["Modèle",{"$f":"'Chambres négative'!I21","v":""},{"$f":"'Chambres négative'!J21","v":""},{"$f":"'Chambres négative'!K21","v":""},{"$f":"'Chambres négative'!L21","v":""}]
["Budget",{"$f":"'Chambres négative'!I23","v":""},{"$f":"'Chambres négative'!J23","v":""},{"$f":"'Chambres négative'!K23","v":""},{"$f":"'Chambres négative'!L23","v":""}]
[]
[]
["Condenseur(s)"]
[]
["Puissance de sélection",null,{"$f":"'Production négative'!H20","v":3.5}]
["Équipement retenu",null,{"$f":"'Production négative'!H17","v":{"$error":"#NUM!"}}]
["Spécificité",null,{"$f":"'Production négative'!H19","v":{"$error":"#NUM!"}}]
["Modèle",null,{"$f":"'Production négative'!H21","v":{"$error":"#NUM!"}}]
["Prix",null,{"$f":"'Production négative'!H22","v":{"$error":"#NUM!"}}]

{"sheet":"Centrale +","index":21,"n_rows":67,"n_cols":8,"rows_kept":67,"cut":false,"hidden":true,"merged":[[47,0,47,7],[2,0,2,7],[20,0,20,1],[0,0,0,7],[8,0,8,2],[9,0,9,1],[10,0,10,1],[11,0,11,1],[6,0,6,1],[12,0,12,1],[13,0,13,1],[14,0,14,1],[15,0,15,1],[4,0,4,1],[18,0,18,2],[60,0,60,7],[62,0,62,1],[63,0,63,1],[64,0,64,1],[65,0,65,1],[66,0,66,1],[62,2,62,3],[63,2,63,3],[64,2,64,3],[65,2,65,3],[66,2,66,3]]}
["Composition de votre centrale positive"]
[]
["Compresseur(s)"]
[]
["Si un seul compresseur"]
[]
["Puissance nécessaire :",null,{"$f":"'Besoins frigo'!E19/1000","v":0}]
[]
["Compresseur (Positif)"]
["Appel de puissance"]
["Marque sélectionné"]
["Modèle corrrespondant"]
["Principe de fonctionement"]
["Fluide utilisé"]
["Température de condensation"]
["Rejet de chaleur"]
[]
[]
["Sélection multiple de compresseur"]
[]
["Puissance nécessaire :",null,{"$f":"'Besoins frigo'!E19/1000","v":0}]
[]
[null,"Solution 1","Solution 2","Solution 3"]
["Compresseurs 1",{"$f":"'Tableau synthèse (2)'!C4","v":""},{"$f":"'Tableau synthèse (2)'!D4","v":""},{"$f":"'Tableau synthèse (2)'!E4","v":""}]
["Marque",{"$f":"INDEX('Selection compresseurs'!$F$72:$F$297,MATCH(B24,'Selection compresseurs'!$K$72:$K$297,0))","v":{"$error":"#N/A"}},{"$f":"INDEX('Selection compresseurs'!$F$72:$F$297,MATCH(C24,'Selection compresseurs'!$K$72:$K$297,0))","v":{"$error":"#N/A"}},{"$f":"INDEX('Selection compresseurs'!$F$72:$F$297,MATCH(D24,'Selection compresseurs'!$K$72:$K$297,0))","v":{"$error":"#N/A"}}]
["Puissance",{"$f":"INDEX('Selection compresseurs'!$I$72:$I$297,MATCH($B$24,'Selection compresseurs'!$K$72:$K$297,0))","v":{"$error":"#N/A"}},{"$f":"INDEX('Selection compresseurs'!$I$72:$I$297,MATCH($C$24,'Selection compresseurs'!$K$72:$K$297,0))","v":{"$error":"#N/A"}},{"$f":"INDEX('Selection compresseurs'!$I$72:$I$297,MATCH($D$24,'Selection compresseurs'!$K$72:$K$297,0))","v":{"$error":"#N/A"}}]
["Prix",{"$f":"INDEX('Selection compresseurs'!$L$72:$L$297,MATCH($B$24,'Selection compresseurs'!$K$72:$K$297,0))","v":{"$error":"#N/A"}},{"$f":"INDEX('Selection compresseurs'!$L$72:$L$297,MATCH($C$24,'Selection compresseurs'!$K$72:$K$297,0))","v":{"$error":"#N/A"}},{"$f":"INDEX('Selection compresseurs'!$L$72:$L$297,MATCH($D$24,'Selection compresseurs'!$K$72:$K$297,0))","v":{"$error":"#N/A"}}]
["Compresseurs 2",{"$f":"'Tableau synthèse (2)'!C5","v":""},{"$f":"'Tableau synthèse (2)'!D5","v":""},{"$f":"'Tableau synthèse (2)'!E5","v":""}]
["Marque",{"$f":"INDEX('Selection compresseurs'!$F$72:$F$297,MATCH(B28,'Selection compresseurs'!$K$72:$K$297,0))","v":{"$error":"#N/A"}},{"$f":"INDEX('Selection compresseurs'!$F$72:$F$297,MATCH(C28,'Selection compresseurs'!$K$72:$K$297,0))","v":{"$error":"#N/A"}},{"$f":"INDEX('Selection compresseurs'!$F$72:$F$297,MATCH(D28,'Selection compresseurs'!$K$72:$K$297,0))","v":{"$error":"#N/A"}}]
["Puissance",{"$f":"INDEX('Selection compresseurs'!$I$72:$I$297,MATCH($B$28,'Selection compresseurs'!$K$72:$K$297,0))","v":{"$error":"#N/A"}},{"$f":"INDEX('Selection compresseurs'!$I$72:$I$297,MATCH($C$28,'Selection compresseurs'!$K$72:$K$297,0))","v":{"$error":"#N/A"}},{"$f":"INDEX('Selection compresseurs'!$I$72:$I$297,MATCH($D$28,'Selection compresseurs'!$K$72:$K$297,0))","v":{"$error":"#N/A"}}]
["Prix",{"$f":"INDEX('Selection compresseurs'!$L$72:$L$297,MATCH($B$28,'Selection compresseurs'!$K$72:$K$297,0))","v":{"$error":"#N/A"}},{"$f":"INDEX('Selection compresseurs'!$L$72:$L$297,MATCH($C$28,'Selection compresseurs'!$K$72:$K$297,0))","v":{"$error":"#N/A"}},{"$f":"INDEX('Selection compresseurs'!$L$72:$L$297,MATCH($D$28,'Selection compresseurs'!$K$72:$K$297,0))","v":{"$error":"#N/A"}}]
["Compresseurs 3",{"$f":"'Tableau synthèse (2)'!C6","v":""},{"$f":"'Tableau synthèse (2)'!D6","v":""},{"$f":"'Tableau synthèse (2)'!E6","v":""}]
["Marque",{"$f":"INDEX('Selection compresseurs'!$F$72:$F$297,MATCH(B32,'Selection compresseurs'!$K$72:$K$297,0))","v":{"$error":"#N/A"}},{"$f":"INDEX('Selection compresseurs'!$F$72:$F$297,MATCH(C32,'Selection compresseurs'!$K$72:$K$297,0))","v":{"$error":"#N/A"}},{"$f":"INDEX('Selection compresseurs'!$F$72:$F$297,MATCH(D32,'Selection compresseurs'!$K$72:$K$297,0))","v":{"$error":"#N/A"}}]
["Puissance",{"$f":"INDEX('Selection compresseurs'!$I$72:$I$297,MATCH($B$32,'Selection compresseurs'!$K$72:$K$297,0))","v":{"$error":"#N/A"}},{"$f":"INDEX('Selection compresseurs'!$I$72:$I$297,MATCH($C$32,'Selection compresseurs'!$K$72:$K$297,0))","v":{"$error":"#N/A"}},{"$f":"INDEX('Selection compresseurs'!$I$72:$I$297,MATCH($D$32,'Selection compresseurs'!$K$72:$K$297,0))","v":{"$error":"#N/A"}}]
["Prix",{"$f":"INDEX('Selection compresseurs'!$L$72:$L$297,MATCH($B$32,'Selection compresseurs'!$K$72:$K$297,0))","v":{"$error":"#N/A"}},{"$f":"INDEX('Selection compresseurs'!$L$72:$L$297,MATCH($C$32,'Selection compresseurs'!$K$72:$K$297,0))","v":{"$error":"#N/A"}},{"$f":"INDEX('Selection compresseurs'!$L$72:$L$297,MATCH($D$32,'Selection compresseurs'!$K$72:$K$297,0))","v":{"$error":"#N/A"}}]
["Compresseurs 4",{"$f":"'Tableau synthèse (2)'!C7","v":""},{"$f":"'Tableau synthèse (2)'!D7","v":""},{"$f":"'Tableau synthèse (2)'!E7","v":""}]
["Marque",{"$f":"INDEX('Selection compresseurs'!$F$72:$F$297,MATCH(B36,'Selection compresseurs'!$K$72:$K$297,0))","v":{"$error":"#N/A"}},{"$f":"INDEX('Selection compresseurs'!$F$72:$F$297,MATCH(C36,'Selection compresseurs'!$K$72:$K$297,0))","v":{"$error":"#N/A"}},{"$f":"INDEX('Selection compresseurs'!$F$72:$F$297,MATCH(D36,'Selection compresseurs'!$K$72:$K$297,0))","v":{"$error":"#N/A"}}]
["Puissance",{"$f":"INDEX('Selection compresseurs'!$I$72:$I$297,MATCH($B$36,'Selection compresseurs'!$K$72:$K$297,0))","v":{"$error":"#N/A"}},{"$f":"INDEX('Selection compresseurs'!$I$72:$I$297,MATCH($C$36,'Selection compresseurs'!$K$72:$K$297,0))","v":{"$error":"#N/A"}},{"$f":"INDEX('Selection compresseurs'!$I$72:$I$297,MATCH($D$36,'Selection compresseurs'!$K$72:$K$297,0))","v":{"$error":"#N/A"}}]
["Prix",{"$f":"INDEX('Selection compresseurs'!$L$72:$L$297,MATCH(B36,'Selection compresseurs'!$K$72:$K$297,0))","v":{"$error":"#N/A"}},{"$f":"INDEX('Selection compresseurs'!$L$72:$L$297,MATCH(C36,'Selection compresseurs'!$K$72:$K$297,0))","v":{"$error":"#N/A"}},{"$f":"INDEX('Selection compresseurs'!$L$72:$L$297,MATCH(D36,'Selection compresseurs'!$K$72:$K$297,0))","v":{"$error":"#N/A"}}]
["Puissance (KW)",{"$f":"SUMIF('Récap centrale '!C4:C7,\"<>#N/A\")","v":0},{"$f":"SUMIF('Récap centrale '!E4:E7,\"<>#N/A\")","v":0},{"$f":"SUMIF('Récap centrale '!G4:G7,\"<>#N/A\")","v":0}]
["Prix total",{"$f":"SUMIF('Récap centrale '!D4:D7,\"<>#N/A\")","v":0},{"$f":"SUMIF('Récap centrale '!F4:F7,\"<>#N/A\")","v":0},{"$f":"SUMIF('Récap centrale '!H4:H7,\"<>#N/A\")","v":0}]
[]
[]
[]
[]
[]
[]
["Évaporateur(s) : Chambre(s) froide"]
[]
[null,"Chambre froide 1","Chambre froide 2","Chambre froide 3","Chambre froide 4"]
["Puissance",{"$f":"'Chambres positives'!E18","v":""},{"$f":"'Chambres positives'!F18","v":""},{"$f":"'Chambres positives'!G18","v":""},{"$f":"'Chambres positives'!H18","v":""},{"$f":"IF(F36=\"oui\",'Table CFP 2'!$K$82,\"\")","v":""},{"$f":"IF(G36=\"oui\",'Table CFP 3'!$K$82,\"\")","v":""},{"$f":"IF(H36=\"oui\",'Table CFP 4'!$K$82,\"\")","v":""}]
["Modèle",{"$f":"'Chambres positives'!E21","v":""},{"$f":"'Chambres positives'!F21","v":""},{"$f":"'Chambres positives'!G21","v":""},{"$f":"'Chambres positives'!H21","v":""}]
["Prix",{"$f":"'Chambres positives'!E23","v":""},{"$f":"'Chambres positives'!F23","v":""},{"$f":"'Chambres positives'!G23","v":""},{"$f":"'Chambres positives'!H23","v":""}]
[]
[null,"Chambre froide 5","Chambre froide 6","Chambre froide 7","Chambre froide 8"]
["Puissance",{"$f":"'Chambres positives'!I18","v":""},{"$f":"'Chambres positives'!J18","v":""},{"$f":"'Chambres positives'!K18","v":""},{"$f":"'Chambres positives'!L18","v":""}]
["Modèle",{"$f":"'Chambres positives'!I21","v":""},{"$f":"'Chambres positives'!J21","v":""},{"$f":"'Chambres positives'!K21","v":""},{"$f":"'Chambres positives'!L21","v":""}]
["Prix",{"$f":"'Chambres positives'!I23","v":""},{"$f":"'Chambres positives'!J23","v":""},{"$f":"'Chambres positives'!K23","v":""},{"$f":"'Chambres positives'!L23","v":""}]
[]
[]
["Condenseur(s)"]
[]
["Puissance de sélection",null,{"$f":"'Production positive'!I20","v":1.53}]
["Équipement retenu",null,{"$f":"'Production positive'!I17","v":{"$error":"#NUM!"}}]
["Spécificité",null,{"$f":"'Production positive'!I19","v":{"$error":"#NUM!"}}]
["Modèle",null,{"$f":"'Production positive'!I21","v":{"$error":"#NUM!"}}]
["Prix",null,{"$f":"'Production positive'!I22","v":{"$error":"#NUM!"}}]

{"sheet":"Table CFP 1","index":22,"n_rows":85,"n_cols":19,"rows_kept":85,"cut":false,"hidden":true,"merged":[[17,3,18,3],[78,2,79,2],[78,3,79,3],[78,4,78,8],[78,9,78,14],[0,0,5,0],[0,1,5,1],[0,5,0,6],[0,7,0,10],[1,7,2,7],[1,9,1,10],[2,8,2,9],[3,7,4,7],[3,10,4,10]]}
["ENTREES","CALCULS","CHAMBRE FROIDE","CFP 01","FRAIS LS","PRODUITS TRAITES",null,{"$f":"'Chambres positives'!E5","v":0}]
[null,null,"Largeur",null,{"$f":"'Chambres positives'!E8","v":0},"TEMPERATURE",{"$f":"Informations!G25","v":{"$error":"#VALUE!"}},"EXT","REP"]
[null,null,"Longueur",null,{"$f":"'Chambres positives'!E9","v":0},"HUMIDITE ",50,null,"COEF TRANSMISSION",null,0.3]
[null,null,"Hauteur sous plafond",null,{"$f":"'Chambres positives'!E10","v":0},"TEMPERATURE",9.9999999999999995E-7,"INT","TEMPERATURE",10,"SAS",null,"CHARGEMENT","CHARGEMENT","NUIT"]
[null,null,"Surface",null,{"$f":"E3*E2","v":0},"HUMIDITE ",80,null,"HUMIDITE ",60,null,null,0.5,0.75,"Activité 0"]
[null,null,"Volume",null,{"$f":"E5*E4","v":0},"CAPACITE CF",6000,"LABO","NON",null,"NON"]
[null,null,"BILAN ",null,null,"Text","T in","k","Apport","Apport"]
[null,null,"Déperditions",null,"m2","°C","°C","W/m2/K","W","kJ/24h"]
[null,null,"Mur droit","S1",{"$f":"E2*E4","v":0},35,{"$f":"$G$4","v":9.9999999999999995E-7},{"$f":"$K$3","v":0.3},{"$f":"H9*E9*(F9-G9)","v":0},{"$f":"I9*3600*24/1000","v":0},null,null,null,null,{"$f":"H9*(F9-5-G9)*E9","v":0}]
[null,null,"Mur gauche","S2",{"$f":"+E9","v":0},35,9.9999999999999995E-7,{"$f":"$K$3","v":0.3},0,0,null,null,null,null,{"$f":"H10*(F10-5-G10)*E10","v":0}]
[null,null,"Mur fond","S3",{"$f":"E3*E4","v":0},15,9.9999999999999995E-7,{"$f":"$K$3","v":0.3},0,0,null,null,null,null,{"$f":"H11*(F11-5-G11)*E11","v":0}]
[null,null,"Mur avant","S4",{"$f":"E11","v":0},35,9.9999999999999995E-7,0.5,0,0,null,null,null,null,{"$f":"H12*(F12-5-G12)*E12","v":0}]
[null,null,"Plafond","S5",{"$f":"E5","v":0},35,9.9999999999999995E-7,{"$f":"$K$3","v":0.3},0,0,null,null,null,null,{"$f":"H13*(F13-5-G13)*E13","v":0}]
[null,null,"Plancher","S6",{"$f":"E5","v":0},15,9.9999999999999995E-7,0.2,0,0,null,null,null,null,{"$f":"H14*(F14-G14)*E14","v":0}]
[null,null,"Linéïques",0.1,null,null,null,null,{"$f":"D15*SUM(I9:I14)","v":0},{"$f":"D15*SUM(J9:J14)","v":0}]
[null,null,"Sous total",null,null,null,null,null,{"$f":"SUM(I9:I15)","v":0},{"$f":"I16*24*3.6","v":0},{"$f":"J16/$J$48","v":{"$error":"#VALUE!"}},null,{"$f":"J16","v":0},{"$f":"J16","v":0},{"$f":"SUM(O9:O15)*24*3.6","v":0}]
[]
[null,null,"Entrés","% de charge","kg/jour","T entrée","T stockage","Cp","Apport","Apport"]
[null,null,"Surcharge kg/jour",null,"Débit","°C","°C","kJ/kg/K","W","kJ/24h"]
[null,null,0,0.25,1500,7,{"$f":"G4","v":9.9999999999999995E-7},3.3484000000000003,{"$f":"H20*(E20+C20 )*(F20-G20)/3600/12*1000","v":813.84710595833337},{"$f":"(C20+E20)*H20*(F20-G20)","v":35158.194977400002},{"$f":"J20/$J$48","v":{"$error":"#VALUE!"}},null,{"$f":"IF(LABO=\"non\",J20/E20*G6*$M$5,0)","v":70316.389954800004},{"$f":"IF(LABO=\"non\",J20/E20*G6*$N$5,0)","v":105474.5849322},0]
[null,null,"Chaleur respiration",null,"Capacité",null,null,"Chaleur respiration","Apport","Apport"]
[null,null,{"$f":"H1","v":0},null,"Chambre",null,null,"kJ/kg en 24 h","W","kJ/24h"]
[null,null,0,null,{"$f":"capacité","v":6000},null,null,{"$f":"C23","v":0},{"$f":"J23/24/3600","v":0},{"$f":"H23*E23","v":0},{"$f":"J23/$J$48","v":{"$error":"#VALUE!"}},null,{"$f":"+J23","v":0},{"$f":"J23","v":0},{"$f":"J23","v":0}]
[]
[null,null,"Travail ventilateurs",null,"Volume chambre","Taux de brassage","Débit air brassé","Puissance ventilateur","Apport","Apport"]
[null,null,null,null,"m3","sd","m3","W","W","kJ/24h"]
[null,null,null,null,{"$f":"volume","v":0},30,{"$f":"F27*E6","v":0},{"$f":"I27","v":0},{"$f":"G27*0.1","v":0},{"$f":"I27/1000*24*3600","v":0},{"$f":"J27/$J$48","v":{"$error":"#VALUE!"}},null,{"$f":"J27","v":0},{"$f":"J27","v":0},{"$f":"J27","v":0}]
[]
[null,null,"Air neuf",null,"Renouvellement","Vol massique","Enthalpie Ext","Enthalpie Int","Apport","Apport"]
[null,null,"Activité chambre",null,"m3/24h","m3/kg","kJ/kg","kJ/kg","W","kJ/24h"]
[null,null,"FORT",null,1181,{"$f":"IF(K6=\"NON\",H69,J69)","v":{"$error":"#VALUE!"}},{"$f":"IF(K6=\"NON\",H72,J72)","v":{"$error":"#VALUE!"}},{"$f":"I72","v":7.5876900994933534},{"$f":"(G31-H31)/F31*E31/(24*3600)*1000","v":{"$error":"#VALUE!"}},{"$f":"(G31-H31)/F31*E31","v":{"$error":"#VALUE!"}},{"$f":"J31/$J$48","v":{"$error":"#VALUE!"}},null,{"$f":"J31","v":{"$error":"#VALUE!"}},{"$f":"J31","v":{"$error":"#VALUE!"}},0]
[null,null,"Taux de renouvellement",{"$f":"E31/volume","v":{"$error":"#DIV/0!"}},"Vol/jour",{"$f":"D32/24","v":{"$error":"#DIV/0!"}},"Vol/h"]
[]
[null,null,"Eclairage",null,"Surface","Ratio","Nb heures fonction",null,"Apport","Apport"]
[null,null,null,null,"m2"," W/m2","h",null,"W","kJ/24h"]
[null,null,null,null,{"$f":"surface","v":0},{"$f":"IF(LABO=\"oui\",0,10)","v":10},4,null,{"$f":"F36*E36","v":0},{"$f":"I36*3600*G36/1000","v":0},{"$f":"J36/$J$48","v":{"$error":"#VALUE!"}},null,{"$f":"J36","v":0},{"$f":"J36","v":0},"."]
[]
[null,null,"Personnel"]
[null,null,null,null,"Nombre","Ratio","Nb heures fonction",null,"Apport","Apport"]
[null,null,null,null,"personne","W/p","h",null,"W","kJ/24h"]
[null,null,null,null,0,400,4,null,{"$f":"F41*E41","v":0},{"$f":"I41*3600*G41/1000","v":0},{"$f":"J41/$J$48","v":{"$error":"#VALUE!"}},null,{"$f":"J41","v":0},{"$f":"J41","v":0},0]
[]
[null,null,"Machines",null,null,"Nb heures fonction",null,null,"Apport","Apport"]
[null,null,null,null,"W","h",null,null,"W","kJ/24h"]
[null,null,null,null,0,{"$f":"IF(I6=\"OUI\",10,0)","v":0},null,null,{"$f":"E45","v":0},{"$f":"I45*3600*F45/1000","v":0},{"$f":"J45/$J$48","v":{"$error":"#VALUE!"}},null,{"$f":"J45","v":0},{"$f":"J45","v":0},{"$f":"J45","v":0}]
[null,null,"Divers",null,0,null,null,null,{"$f":"E46","v":0},{"$f":"I46*3600*24/1000","v":0},{"$f":"J46/$J$48","v":{"$error":"#VALUE!"}},null,{"$f":"J46","v":0},{"$f":"J46","v":0},{"$f":"J46","v":0}]
[]
[null,null,"TOTAL",null,null,null,null,null,{"$f":"I16+I20+I23+I27+I31+I36+I41+I45+I46","v":{"$error":"#VALUE!"}},{"$f":"SUM(J16:J46)","v":{"$error":"#VALUE!"}},{"$f":"SUM(K16:K46)","v":{"$error":"#VALUE!"}},null,{"$f":"SUM(M16:M46)","v":{"$error":"#VALUE!"}},{"$f":"SUM(N16:N46)","v":{"$error":"#VALUE!"}},{"$f":"SUM(O16:O46)","v":0}]
[]
[null,null,null,null,"Nombres d'heures de fonctionnement groupes h/jour",null,null,null,"Bilan Chaleur Latente kW"," Bilan production kW",null,null," Bilan production kW"," Bilan production kW"," Bilan production kW"]
[null,null,"PRODUCTION",null,18,"Ratio",{"$f":"J51*1000/E14","v":{"$error":"#VALUE!"}},"W/m2",{"$f":"IF(K6=\"oui\",2501*(J67-I67)*E31/F31/E51/3600,2500.8*(H67-I67)*E31/F31/E51/3600)","v":{"$error":"#VALUE!"}},{"$f":"J48/$E$51/3600","v":{"$error":"#VALUE!"}},null,null,{"$f":"M48/$E$51/3600","v":{"$error":"#VALUE!"}},{"$f":"N48/$E$51/3600","v":{"$error":"#VALUE!"}},{"$f":"O48/$E$51/3600","v":0}]
[null,null,"EMISSION",null,16,null,{"$f":"J52*1000/E14","v":{"$error":"#VALUE!"}},null,{"$f":"I51/J51","v":{"$error":"#VALUE!"}},{"$f":"J48/$E$52/3600","v":{"$error":"#VALUE!"}},{"$f":"J52/J51-1","v":{"$error":"#VALUE!"}},null,{"$f":"M48/$E$52/3600","v":{"$error":"#VALUE!"}},{"$f":"N48/$E$52/3600","v":{"$error":"#VALUE!"}},{"$f":"O48/$E$52/3600","v":0}]
[]
[]
[null,null,null,null,null,null,null,500,500,500]
[null,null,"VIANDES PRE EMBALLES",null,"TRES FORT","ALTITUDE DU SITE (m)",null,50,50,50]
[null,null,"VOLAILLES PREEMBALLEES",null,"FORT","PRESSION TOTALE P (Pa)",null,{"$f":"1.19745*10^-8*(288.15-0.0065*H56)^5.25588","v":100726.03972155297},{"$f":"1.19745*10^-8*(288.15-0.0065*I56)^5.25588","v":100726.03972155297},{"$f":"1.19745*10^-8*(288.15-0.0065*J56)^5.25588","v":100726.03972155297}]
[null,null,"CARCASSES",null,"MOYEN","POINT",null,"EXT","INT","SAS"]
[null,null,"CHARCUTERIE PREEMBALLE",null,"FAIBLE","t","Température sèche",{"$f":"G2","v":{"$error":"#VALUE!"}},{"$f":"G4","v":9.9999999999999995E-7},{"$f":"J4","v":10}]
[null,null,"TRAITEUR",null,null,"F ( % )","Humidité relatice",50,{"$f":"G5","v":80},{"$f":"J5","v":60}]
[null,null,"CHARIOTS PLATS CUISINES",null,null,"T","Température absolue",{"$f":"H59+273.15","v":{"$error":"#VALUE!"}},{"$f":"I59+273.15","v":273.15000099999997},{"$f":"J59+273.15","v":283.14999999999998}]
[null,null,"PATISSERIE FRAICHE",null,"OUI",null,"Pvs si t<0°C",{"$f":"EXP(-5674.359/H61+6.3925247-0.009677843*H61+0.00000062215701*H61^2+0.0000000020747825*H61^3-0.0000000000009484024*H61^4+4.1635019*LN(H61))","v":{"$error":"#VALUE!"}},{"$f":"EXP(-5674.359/I61+6.3925247-0.009677843*I61+0.00000062215701*I61^2+0.0000000020747825*I61^3-0.0000000000009484024*I61^4+4.1635019*LN(I61))","v":611.54955052849118},{"$f":"EXP(-5674.359/J61+6.3925247-0.009677843*J61+0.00000062215701*J61^2+0.0000000020747825*J61^3-0.0000000000009484024*J61^4+4.1635019*LN(J61))","v":1352.9554923109872}]
[null,null,"POISSONS SUR GLACE",null,"NON",null,"Pvs si t>0°C",{"$f":"EXP(-5800.2206/H61+1.3914993-0.048640239*H61+0.000041764768*H61^2-0.000000014452093*H61^3+6.5459673*LN(H61))","v":{"$error":"#VALUE!"}},{"$f":"EXP(-5800.2206/I61+1.3914993-0.048640239*I61+0.000041764768*I61^2-0.000000014452093*I61^3+6.5459673*LN(I61))","v":611.21291185293046},{"$f":"EXP(-5800.2206/J61+1.3914993-0.048640239*J61+0.000041764768*J61^2-0.000000014452093*J61^3+6.5459673*LN(J61))","v":1227.9952754407796}]
[null,null,"FRUITS ET LEGUMES",null,null,"Pws","Pression partielle de vapeur à saturation",{"$f":"IF(H61<273.15,H62,H63)","v":{"$error":"#VALUE!"}},{"$f":"IF(I61<273.15,I62,I63)","v":611.21291185293046},{"$f":"IF(J61<273.15,J62,J63)","v":1227.9952754407796}]
[null,null,"BOF EMBALLES",null,null,"Pv","Pression partielle de vapeur non saturé",{"$f":"H64*H60/100","v":{"$error":"#VALUE!"}},{"$f":"I64*I60/100","v":488.97032948234437},{"$f":"J64*J60/100","v":736.79716526446782}]
[null,null,"FROMAGE",null,null,"Pa","Pression partielle de l'air sec",{"$f":"$H$57-H65","v":{"$error":"#VALUE!"}},{"$f":"$H$57-I65","v":100237.06939207063},{"$f":"$H$57-J65","v":99989.242556288504}]
[null,null,"BOISSONS",null,null,"w","Humidité absolue non saturée",{"$f":"0.62198*H65/($H$57-H65)","v":{"$error":"#VALUE!"}},{"$f":"0.62198*I65/($H$57-I65)","v":3.0341047216957749E-3},{"$f":"0.62198*J65/($H$57-J65)","v":4.5832240462588851E-3}]
[null,null,"POUBELLES GRASSES",null,null,"ws","Humidité absolue à saturation",{"$f":"0.62198*H64/($H$57-H64)","v":{"$error":"#VALUE!"}},{"$f":"0.62198*I64/($H$57-I64)","v":3.7972617945681957E-3},{"$f":"0.62198*J64/($H$57-J64)","v":7.676417216745615E-3}]
[null,null,"PRODUITS SURGELES",null,null,"RO","Masse volumique de l'air sec",{"$f":"(1+H67)/H70","v":{"$error":"#VALUE!"}},{"$f":"(1+I67)/I70","v":1.2820637500945116},{"$f":"(1+J67)/J70","v":1.235632662064539}]
[null,null,"CREMES GLACEES",null,null,"v'","Volume massique de l'air humide",{"$f":"0.2871*H61*(1+1.6078*H67)/$H$57*1000","v":{"$error":"#VALUE!"}},{"$f":"0.2871*I61*(1+1.6078*I67)/$H$57*1000","v":0.78235899318403923},{"$f":"0.2871*J61*(1+1.6078*J67)/$H$57*1000","v":0.81301122484716892}]
[null,null,"SAS"]
[null,null,"LABO DECOUPE",null,null,"h","Enthalpie",{"$f":"1.006*H59+H67*(2500.8+1.805*H59)","v":{"$error":"#VALUE!"}},{"$f":"1.006*I59+I67*(2500.8+1.805*I59)","v":7.5876900994933534},{"$f":"1.006*J59+J67*(2500.8+1.805*J59)","v":21.604453888919195}]
[null,null,"LABO DECOUPE EMBALLAGE"]
[null,null,"LABO EMBALLAGE"]
[]
[]
[]
[]
[null,null,"Désignation","Température","Dimensions",null,null,null,null,"Evaporateurs"]
[null,null,null,null,"Hygrométrie","Longeur","largeur","Surface","hauteur","Volume","Puissance minimum requise",{"$f":"\"à \"&ROUND(D20,0)*100 &\" % de charge en surface\"","v":"à 0 % de charge en surface"},"Maximum de charge 50 %","Minimum de charge","DT de sélection","Nbre","Type","Vitesse ventilation","Dégivrage"]
[]
[null,{"$f":"D1","v":"CFP 01"},{"$f":"E1","v":"FRAIS LS"},{"$f":"G4","v":9.9999999999999995E-7},{"$f":"G5","v":80},{"$f":"E2","v":0},{"$f":"E3","v":0},{"$f":"surface","v":0},{"$f":"hauteur","v":0},{"$f":"volume","v":0},{"$f":"J52*1000","v":{"$error":"#VALUE!"}},{"$f":"J51*1000","v":{"$error":"#VALUE!"}},{"$f":"N52*1000","v":{"$error":"#VALUE!"}},{"$f":"O52*1000","v":0},{"$error":"#N/A"},1,{"$f":"IF(OR(LABO=\"oui\",H1=\"SAS\"),\"DOUBLE FLUX\",IF(K82<2000,\"PLAFONNIER\",IF(AND(G5<80,K82<7000),\"PLAFONNIER\",\"CUBIQUE\")))","v":{"$error":"#VALUE!"}},{"$f":"IF(AND(Q82=\"DOUBLE FLUX\",LABO=\"OUI\"),1000,1500)","v":{"$error":"#VALUE!"}},{"$f":"IF(D82>1,\"Naturel\",\"Electrique\")","v":"Electrique"}]
[]
[]
[null,null,null,null,null,null,null,null,null,null,{"$f":"K82/H82","v":{"$error":"#VALUE!"}}]

{"sheet":"Table CFP 2","index":23,"n_rows":85,"n_cols":19,"rows_kept":85,"cut":false,"hidden":true,"merged":[[17,3,18,3],[78,2,79,2],[78,3,79,3],[78,4,78,8],[78,9,78,14],[0,0,5,0],[0,1,5,1],[0,5,0,6],[0,7,0,10],[1,7,2,7],[1,9,1,10],[2,8,2,9],[3,7,4,7],[3,10,4,10]]}
["ENTREES","CALCULS","CHAMBRE FROIDE","CFP 01","FRAIS LS","PRODUITS TRAITES",null,{"$f":"'Chambres positives'!F5","v":0}]
[null,null,"Largeur",null,{"$f":"'Chambres positives'!F8","v":0},"TEMPERATURE",{"$f":"Informations!G25","v":{"$error":"#VALUE!"}},"EXT","REP"]
[null,null,"Longueur",null,{"$f":"'Chambres positives'!F9","v":0},"HUMIDITE ",50,null,"COEF TRANSMISSION",null,0.3]
[null,null,"Hauteur sous plafond",null,{"$f":"'Chambres positives'!F10","v":0},"TEMPERATURE",9.9999999999999995E-7,"INT","TEMPERATURE",10,"SAS",null,"CHARGEMENT","CHARGEMENT","NUIT"]
[null,null,"Surface",null,{"$f":"E3*E2","v":0},"HUMIDITE ",80,null,"HUMIDITE ",60,null,null,0.5,0.75,"Activité 0"]
[null,null,"Volume",null,{"$f":"E5*E4","v":0},"CAPACITE CF",8000,"LABO","NON",null,"NON"]
[null,null,"BILAN ",null,null,"Text","T in","k","Apport","Apport"]
[null,null,"Déperditions",null,"m2","°C","°C","W/m2/K","W","kJ/24h"]
[null,null,"Mur droit","S1",{"$f":"E2*E4","v":0},35,{"$f":"$G$4","v":9.9999999999999995E-7},{"$f":"$K$3","v":0.3},{"$f":"H9*E9*(F9-G9)","v":0},{"$f":"I9*3600*24/1000","v":0},null,null,null,null,{"$f":"H9*(F9-5-G9)*E9","v":0}]
[null,null,"Mur gauche","S2",{"$f":"+E9","v":0},35,9.9999999999999995E-7,{"$f":"$K$3","v":0.3},0,0,null,null,null,null,{"$f":"H10*(F10-5-G10)*E10","v":0}]
[null,null,"Mur fond","S3",{"$f":"E3*E4","v":0},15,9.9999999999999995E-7,{"$f":"$K$3","v":0.3},0,0,null,null,null,null,{"$f":"H11*(F11-5-G11)*E11","v":0}]
[null,null,"Mur avant","S4",{"$f":"E11","v":0},35,9.9999999999999995E-7,0.5,0,0,null,null,null,null,{"$f":"H12*(F12-5-G12)*E12","v":0}]
[null,null,"Plafond","S5",{"$f":"E5","v":0},35,9.9999999999999995E-7,{"$f":"$K$3","v":0.3},0,0,null,null,null,null,{"$f":"H13*(F13-5-G13)*E13","v":0}]
[null,null,"Plancher","S6",{"$f":"E5","v":0},15,9.9999999999999995E-7,0.2,0,0,null,null,null,null,{"$f":"H14*(F14-G14)*E14","v":0}]
[null,null,"Linéïques",0.1,null,null,null,null,{"$f":"D15*SUM(I9:I14)","v":0},{"$f":"D15*SUM(J9:J14)","v":0}]
[null,null,"Sous total",null,null,null,null,null,{"$f":"SUM(I9:I15)","v":0},{"$f":"I16*24*3.6","v":0},{"$f":"J16/$J$48","v":{"$error":"#VALUE!"}},null,{"$f":"J16","v":0},{"$f":"J16","v":0},{"$f":"SUM(O9:O15)*24*3.6","v":0}]
[]
[null,null,"Entrés","% de charge","kg/jour","T entrée","T stockage","Cp","Apport","Apport"]
[null,null,"Surcharge kg/jour",null,"Débit","°C","°C","kJ/kg/K","W","kJ/24h"]
[null,null,0,0.25,2000,7,{"$f":"G4","v":9.9999999999999995E-7},3.3484000000000003,{"$f":"H20*(E20+C20 )*(F20-G20)/3600/12*1000","v":1085.1294746111114},{"$f":"(C20+E20)*H20*(F20-G20)","v":46877.593303200003},{"$f":"J20/$J$48","v":{"$error":"#VALUE!"}},null,{"$f":"IF(LABO=\"non\",J20/E20*G6*$M$5,0)","v":93755.186606400006},{"$f":"IF(LABO=\"non\",J20/E20*G6*$N$5,0)","v":140632.77990960001},0]
[null,null,"Chaleur respiration",null,"Capacité",null,null,"Chaleur respiration","Apport","Apport"]
[null,null,{"$f":"H1","v":0},null,"Chambre",null,null,"kJ/kg en 24 h","W","kJ/24h"]
[null,null,0,null,{"$f":"capacité","v":8000},null,null,{"$f":"C23","v":0},{"$f":"J23/24/3600","v":0},{"$f":"H23*E23","v":0},{"$f":"J23/$J$48","v":{"$error":"#VALUE!"}},null,{"$f":"+J23","v":0},{"$f":"J23","v":0},{"$f":"J23","v":0}]
[]
[null,null,"Travail ventilateurs",null,"Volume chambre","Taux de brassage","Débit air brassé","Puissance ventilateur","Apport","Apport"]
[null,null,null,null,"m3","sd","m3","W","W","kJ/24h"]
[null,null,null,null,{"$f":"volume","v":0},30,{"$f":"F27*E6","v":0},{"$f":"I27","v":0},{"$f":"G27*0.1","v":0},{"$f":"I27/1000*24*3600","v":0},{"$f":"J27/$J$48","v":{"$error":"#VALUE!"}},null,{"$f":"J27","v":0},{"$f":"J27","v":0},{"$f":"J27","v":0}]
[]
[null,null,"Air neuf",null,"Renouvellement","Vol massique","Enthalpie Ext","Enthalpie Int","Apport","Apport"]
[null,null,"Activité chambre",null,"m3/24h","m3/kg","kJ/kg","kJ/kg","W","kJ/24h"]
[null,null,"FORT",null,1350,{"$f":"IF(K6=\"NON\",H69,J69)","v":{"$error":"#VALUE!"}},{"$f":"IF(K6=\"NON\",H72,J72)","v":{"$error":"#VALUE!"}},{"$f":"I72","v":7.5876900994933534},{"$f":"(G31-H31)/F31*E31/(24*3600)*1000","v":{"$error":"#VALUE!"}},{"$f":"(G31-H31)/F31*E31","v":{"$error":"#VALUE!"}},{"$f":"J31/$J$48","v":{"$error":"#VALUE!"}},null,{"$f":"J31","v":{"$error":"#VALUE!"}},{"$f":"J31","v":{"$error":"#VALUE!"}},0]
[null,null,"Taux de renouvellement",{"$f":"E31/volume","v":{"$error":"#DIV/0!"}},"Vol/jour",{"$f":"D32/24","v":{"$error":"#DIV/0!"}},"Vol/h"]
[]
[null,null,"Eclairage",null,"Surface","Ratio","Nb heures fonction",null,"Apport","Apport"]
[null,null,null,null,"m2"," W/m2","h",null,"W","kJ/24h"]
[null,null,null,null,{"$f":"surface","v":0},{"$f":"IF(LABO=\"oui\",0,10)","v":10},4,null,{"$f":"F36*E36","v":0},{"$f":"I36*3600*G36/1000","v":0},{"$f":"J36/$J$48","v":{"$error":"#VALUE!"}},null,{"$f":"J36","v":0},{"$f":"J36","v":0},"."]
[]
[null,null,"Personnel"]
[null,null,null,null,"Nombre","Ratio","Nb heures fonction",null,"Apport","Apport"]
[null,null,null,null,"personne","W/p","h",null,"W","kJ/24h"]
[null,null,null,null,0,400,4,null,{"$f":"F41*E41","v":0},{"$f":"I41*3600*G41/1000","v":0},{"$f":"J41/$J$48","v":{"$error":"#VALUE!"}},null,{"$f":"J41","v":0},{"$f":"J41","v":0},0]
[]
[null,null,"Machines",null,null,"Nb heures fonction",null,null,"Apport","Apport"]
[null,null,null,null,"W","h",null,null,"W","kJ/24h"]
[null,null,null,null,0,{"$f":"IF(I6=\"OUI\",10,0)","v":0},null,null,{"$f":"E45","v":0},{"$f":"I45*3600*F45/1000","v":0},{"$f":"J45/$J$48","v":{"$error":"#VALUE!"}},null,{"$f":"J45","v":0},{"$f":"J45","v":0},{"$f":"J45","v":0}]
[null,null,"Divers",null,0,null,null,null,{"$f":"E46","v":0},{"$f":"I46*3600*24/1000","v":0},{"$f":"J46/$J$48","v":{"$error":"#VALUE!"}},null,{"$f":"J46","v":0},{"$f":"J46","v":0},{"$f":"J46","v":0}]
[]
[null,null,"TOTAL",null,null,null,null,null,{"$f":"I16+I20+I23+I27+I31+I36+I41+I45+I46","v":{"$error":"#VALUE!"}},{"$f":"SUM(J16:J46)","v":{"$error":"#VALUE!"}},{"$f":"SUM(K16:K46)","v":{"$error":"#VALUE!"}},null,{"$f":"SUM(M16:M46)","v":{"$error":"#VALUE!"}},{"$f":"SUM(N16:N46)","v":{"$error":"#VALUE!"}},{"$f":"SUM(O16:O46)","v":0}]
[]
[null,null,null,null,"Nombres d'heures de fonctionnement groupes h/jour",null,null,null,"Bilan Chaleur Latente kW"," Bilan production kW",null,null," Bilan production kW"," Bilan production kW"," Bilan production kW"]
[null,null,"PRODUCTION",null,18,"Ratio",{"$f":"J51*1000/E14","v":{"$error":"#VALUE!"}},"W/m2",{"$f":"IF(K6=\"oui\",2501*(J67-I67)*E31/F31/E51/3600,2500.8*(H67-I67)*E31/F31/E51/3600)","v":{"$error":"#VALUE!"}},{"$f":"J48/$E$51/3600","v":{"$error":"#VALUE!"}},null,null,{"$f":"M48/$E$51/3600","v":{"$error":"#VALUE!"}},{"$f":"N48/$E$51/3600","v":{"$error":"#VALUE!"}},{"$f":"O48/$E$51/3600","v":0}]
[null,null,"EMISSION",null,16,null,{"$f":"J52*1000/E14","v":{"$error":"#VALUE!"}},null,{"$f":"I51/J51","v":{"$error":"#VALUE!"}},{"$f":"J48/$E$52/3600","v":{"$error":"#VALUE!"}},{"$f":"J52/J51-1","v":{"$error":"#VALUE!"}},null,{"$f":"M48/$E$52/3600","v":{"$error":"#VALUE!"}},{"$f":"N48/$E$52/3600","v":{"$error":"#VALUE!"}},{"$f":"O48/$E$52/3600","v":0}]
[]
[]
[null,null,null,null,null,null,null,500,500,500]
[null,null,"VIANDES PRE EMBALLES",null,"TRES FORT","ALTITUDE DU SITE (m)",null,50,50,50]
[null,null,"VOLAILLES PREEMBALLEES",null,"FORT","PRESSION TOTALE P (Pa)",null,{"$f":"1.19745*10^-8*(288.15-0.0065*H56)^5.25588","v":100726.03972155297},{"$f":"1.19745*10^-8*(288.15-0.0065*I56)^5.25588","v":100726.03972155297},{"$f":"1.19745*10^-8*(288.15-0.0065*J56)^5.25588","v":100726.03972155297}]
[null,null,"CARCASSES",null,"MOYEN","POINT",null,"EXT","INT","SAS"]
[null,null,"CHARCUTERIE PREEMBALLE",null,"FAIBLE","t","Température sèche",{"$f":"G2","v":{"$error":"#VALUE!"}},{"$f":"G4","v":9.9999999999999995E-7},{"$f":"J4","v":10}]
[null,null,"TRAITEUR",null,null,"F ( % )","Humidité relatice",50,{"$f":"G5","v":80},{"$f":"J5","v":60}]
[null,null,"CHARIOTS PLATS CUISINES",null,null,"T","Température absolue",{"$f":"H59+273.15","v":{"$error":"#VALUE!"}},{"$f":"I59+273.15","v":273.15000099999997},{"$f":"J59+273.15","v":283.14999999999998}]
[null,null,"PATISSERIE FRAICHE",null,"OUI",null,"Pvs si t<0°C",{"$f":"EXP(-5674.359/H61+6.3925247-0.009677843*H61+0.00000062215701*H61^2+0.0000000020747825*H61^3-0.0000000000009484024*H61^4+4.1635019*LN(H61))","v":{"$error":"#VALUE!"}},{"$f":"EXP(-5674.359/I61+6.3925247-0.009677843*I61+0.00000062215701*I61^2+0.0000000020747825*I61^3-0.0000000000009484024*I61^4+4.1635019*LN(I61))","v":611.54955052849118},{"$f":"EXP(-5674.359/J61+6.3925247-0.009677843*J61+0.00000062215701*J61^2+0.0000000020747825*J61^3-0.0000000000009484024*J61^4+4.1635019*LN(J61))","v":1352.9554923109872}]
[null,null,"POISSONS SUR GLACE",null,"NON",null,"Pvs si t>0°C",{"$f":"EXP(-5800.2206/H61+1.3914993-0.048640239*H61+0.000041764768*H61^2-0.000000014452093*H61^3+6.5459673*LN(H61))","v":{"$error":"#VALUE!"}},{"$f":"EXP(-5800.2206/I61+1.3914993-0.048640239*I61+0.000041764768*I61^2-0.000000014452093*I61^3+6.5459673*LN(I61))","v":611.21291185293046},{"$f":"EXP(-5800.2206/J61+1.3914993-0.048640239*J61+0.000041764768*J61^2-0.000000014452093*J61^3+6.5459673*LN(J61))","v":1227.9952754407796}]
[null,null,"FRUITS ET LEGUMES",null,null,"Pws","Pression partielle de vapeur à saturation",{"$f":"IF(H61<273.15,H62,H63)","v":{"$error":"#VALUE!"}},{"$f":"IF(I61<273.15,I62,I63)","v":611.21291185293046},{"$f":"IF(J61<273.15,J62,J63)","v":1227.9952754407796}]
[null,null,"BOF EMBALLES",null,null,"Pv","Pression partielle de vapeur non saturé",{"$f":"H64*H60/100","v":{"$error":"#VALUE!"}},{"$f":"I64*I60/100","v":488.97032948234437},{"$f":"J64*J60/100","v":736.79716526446782}]
[null,null,"FROMAGE",null,null,"Pa","Pression partielle de l'air sec",{"$f":"$H$57-H65","v":{"$error":"#VALUE!"}},{"$f":"$H$57-I65","v":100237.06939207063},{"$f":"$H$57-J65","v":99989.242556288504}]
[null,null,"BOISSONS",null,null,"w","Humidité absolue non saturée",{"$f":"0.62198*H65/($H$57-H65)","v":{"$error":"#VALUE!"}},{"$f":"0.62198*I65/($H$57-I65)","v":3.0341047216957749E-3},{"$f":"0.62198*J65/($H$57-J65)","v":4.5832240462588851E-3}]
[null,null,"POUBELLES GRASSES",null,null,"ws","Humidité absolue à saturation",{"$f":"0.62198*H64/($H$57-H64)","v":{"$error":"#VALUE!"}},{"$f":"0.62198*I64/($H$57-I64)","v":3.7972617945681957E-3},{"$f":"0.62198*J64/($H$57-J64)","v":7.676417216745615E-3}]
[null,null,"PRODUITS SURGELES",null,null,"RO","Masse volumique de l'air sec",{"$f":"(1+H67)/H70","v":{"$error":"#VALUE!"}},{"$f":"(1+I67)/I70","v":1.2820637500945116},{"$f":"(1+J67)/J70","v":1.235632662064539}]
[null,null,"CREMES GLACEES",null,null,"v'","Volume massique de l'air humide",{"$f":"0.2871*H61*(1+1.6078*H67)/$H$57*1000","v":{"$error":"#VALUE!"}},{"$f":"0.2871*I61*(1+1.6078*I67)/$H$57*1000","v":0.78235899318403923},{"$f":"0.2871*J61*(1+1.6078*J67)/$H$57*1000","v":0.81301122484716892}]
[null,null,"SAS"]
[null,null,"LABO DECOUPE",null,null,"h","Enthalpie",{"$f":"1.006*H59+H67*(2500.8+1.805*H59)","v":{"$error":"#VALUE!"}},{"$f":"1.006*I59+I67*(2500.8+1.805*I59)","v":7.5876900994933534},{"$f":"1.006*J59+J67*(2500.8+1.805*J59)","v":21.604453888919195}]
[null,null,"LABO DECOUPE EMBALLAGE"]
[null,null,"LABO EMBALLAGE"]
[]
[]
[]
[]
[null,null,"Désignation","Température","Dimensions",null,null,null,null,"Evaporateurs"]
[null,null,null,null,"Hygrométrie","Longeur","largeur","Surface","hauteur","Volume","Puissance minimum requise",{"$f":"\"à \"&ROUND(D20,0)*100 &\" % de charge en surface\"","v":"à 0 % de charge en surface"},"Maximum de charge 50 %","Minimum de charge","DT de sélection","Nbre","Type","Vitesse ventilation","Dégivrage"]
[]
[null,{"$f":"D1","v":"CFP 01"},{"$f":"E1","v":"FRAIS LS"},{"$f":"G4","v":9.9999999999999995E-7},{"$f":"G5","v":80},{"$f":"E2","v":0},{"$f":"E3","v":0},{"$f":"surface","v":0},{"$f":"hauteur","v":0},{"$f":"volume","v":0},{"$f":"J52*1000","v":{"$error":"#VALUE!"}},{"$f":"J51*1000","v":{"$error":"#VALUE!"}},{"$f":"N52*1000","v":{"$error":"#VALUE!"}},{"$f":"O52*1000","v":0},{"$error":"#N/A"},1,{"$f":"IF(OR(LABO=\"oui\",H1=\"SAS\"),\"DOUBLE FLUX\",IF(K82<2000,\"PLAFONNIER\",IF(AND(G5<80,K82<7000),\"PLAFONNIER\",\"CUBIQUE\")))","v":{"$error":"#VALUE!"}},{"$f":"IF(AND(Q82=\"DOUBLE FLUX\",LABO=\"OUI\"),1000,1500)","v":{"$error":"#VALUE!"}},{"$f":"IF(D82>1,\"Naturel\",\"Electrique\")","v":"Electrique"}]
[]
[]
[null,null,null,null,null,null,null,null,null,null,{"$f":"K82/H82","v":{"$error":"#VALUE!"}}]

{"sheet":"Table CFP 3","index":24,"n_rows":85,"n_cols":19,"rows_kept":85,"cut":false,"hidden":true,"merged":[[17,3,18,3],[78,2,79,2],[78,3,79,3],[78,4,78,8],[78,9,78,14],[0,0,5,0],[0,1,5,1],[0,5,0,6],[0,7,0,10],[1,7,2,7],[1,9,1,10],[2,8,2,9],[3,7,4,7],[3,10,4,10]]}
["ENTREES","CALCULS","CHAMBRE FROIDE","CFP 01","FRAIS LS","PRODUITS TRAITES",null,{"$f":"'Chambres positives'!G5","v":0}]
[null,null,"Largeur",null,{"$f":"'Chambres positives'!G8","v":0},"TEMPERATURE",{"$f":"Informations!G25","v":{"$error":"#VALUE!"}},"EXT","REP"]
[null,null,"Longueur",null,{"$f":"'Chambres positives'!G9","v":0},"HUMIDITE ",50,null,"COEF TRANSMISSION",null,0.3]
[null,null,"Hauteur sous plafond",null,{"$f":"'Chambres positives'!G10","v":0},"TEMPERATURE",9.9999999999999995E-7,"INT","TEMPERATURE",10,"SAS",null,"CHARGEMENT","CHARGEMENT","NUIT"]
[null,null,"Surface",null,{"$f":"E3*E2","v":0},"HUMIDITE ",80,null,"HUMIDITE ",60,null,null,0.5,0.75,"Activité 0"]
[null,null,"Volume",null,{"$f":"E5*E4","v":0},"CAPACITE CF",8400,"LABO","NON",null,"NON"]
[null,null,"BILAN ",null,null,"Text","T in","k","Apport","Apport"]
[null,null,"Déperditions",null,"m2","°C","°C","W/m2/K","W","kJ/24h"]
[null,null,"Mur droit","S1",{"$f":"E2*E4","v":0},35,{"$f":"$G$4","v":9.9999999999999995E-7},{"$f":"$K$3","v":0.3},{"$f":"H9*E9*(F9-G9)","v":0},{"$f":"I9*3600*24/1000","v":0},null,null,null,null,{"$f":"H9*(F9-5-G9)*E9","v":0}]
[null,null,"Mur gauche","S2",{"$f":"+E9","v":0},35,9.9999999999999995E-7,{"$f":"$K$3","v":0.3},0,0,null,null,null,null,{"$f":"H10*(F10-5-G10)*E10","v":0}]
[null,null,"Mur fond","S3",{"$f":"E3*E4","v":0},15,9.9999999999999995E-7,{"$f":"$K$3","v":0.3},0,0,null,null,null,null,{"$f":"H11*(F11-5-G11)*E11","v":0}]
[null,null,"Mur avant","S4",{"$f":"E11","v":0},35,9.9999999999999995E-7,0.5,0,0,null,null,null,null,{"$f":"H12*(F12-5-G12)*E12","v":0}]
[null,null,"Plafond","S5",{"$f":"E5","v":0},35,9.9999999999999995E-7,{"$f":"$K$3","v":0.3},0,0,null,null,null,null,{"$f":"H13*(F13-5-G13)*E13","v":0}]
[null,null,"Plancher","S6",{"$f":"E5","v":0},15,9.9999999999999995E-7,0.2,0,0,null,null,null,null,{"$f":"H14*(F14-G14)*E14","v":0}]
[null,null,"Linéïques",0.1,null,null,null,null,{"$f":"D15*SUM(I9:I14)","v":0},{"$f":"D15*SUM(J9:J14)","v":0}]
[null,null,"Sous total",null,null,null,null,null,{"$f":"SUM(I9:I15)","v":0},{"$f":"I16*24*3.6","v":0},{"$f":"J16/$J$48","v":{"$error":"#VALUE!"}},null,{"$f":"J16","v":0},{"$f":"J16","v":0},{"$f":"SUM(O9:O15)*24*3.6","v":0}]
[]
[null,null,"Entrés","% de charge","kg/jour","T entrée","T stockage","Cp","Apport","Apport"]
[null,null,"Surcharge kg/jour",null,"Débit","°C","°C","kJ/kg/K","W","kJ/24h"]
[null,null,0,0.25,2100,7,{"$f":"G4","v":9.9999999999999995E-7},3.3484000000000003,{"$f":"H20*(E20+C20 )*(F20-G20)/3600/12*1000","v":1139.3859483416666},{"$f":"(C20+E20)*H20*(F20-G20)","v":49221.472968360002},{"$f":"J20/$J$48","v":{"$error":"#VALUE!"}},null,{"$f":"IF(LABO=\"non\",J20/E20*G6*$M$5,0)","v":98442.945936720003},{"$f":"IF(LABO=\"non\",J20/E20*G6*$N$5,0)","v":147664.41890508001},0]
[null,null,"Chaleur respiration",null,"Capacité",null,null,"Chaleur respiration","Apport","Apport"]
[null,null,{"$f":"H1","v":0},null,"Chambre",null,null,"kJ/kg en 24 h","W","kJ/24h"]
[null,null,0,null,{"$f":"capacité","v":8400},null,null,{"$f":"C23","v":0},{"$f":"J23/24/3600","v":0},{"$f":"H23*E23","v":0},{"$f":"J23/$J$48","v":{"$error":"#VALUE!"}},null,{"$f":"+J23","v":0},{"$f":"J23","v":0},{"$f":"J23","v":0}]
[]
[null,null,"Travail ventilateurs",null,"Volume chambre","Taux de brassage","Débit air brassé","Puissance ventilateur","Apport","Apport"]
[null,null,null,null,"m3","sd","m3","W","W","kJ/24h"]
[null,null,null,null,{"$f":"volume","v":0},30,{"$f":"F27*E6","v":0},{"$f":"I27","v":0},{"$f":"G27*0.1","v":0},{"$f":"I27/1000*24*3600","v":0},{"$f":"J27/$J$48","v":{"$error":"#VALUE!"}},null,{"$f":"J27","v":0},{"$f":"J27","v":0},{"$f":"J27","v":0}]
[]
[null,null,"Air neuf",null,"Renouvellement","Vol massique","Enthalpie Ext","Enthalpie Int","Apport","Apport"]
[null,null,"Activité chambre",null,"m3/24h","m3/kg","kJ/kg","kJ/kg","W","kJ/24h"]
[null,null,"FORT",null,1500,{"$f":"IF(K6=\"NON\",H69,J69)","v":{"$error":"#VALUE!"}},{"$f":"IF(K6=\"NON\",H72,J72)","v":{"$error":"#VALUE!"}},{"$f":"I72","v":7.5876900994933534},{"$f":"(G31-H31)/F31*E31/(24*3600)*1000","v":{"$error":"#VALUE!"}},{"$f":"(G31-H31)/F31*E31","v":{"$error":"#VALUE!"}},{"$f":"J31/$J$48","v":{"$error":"#VALUE!"}},null,{"$f":"J31","v":{"$error":"#VALUE!"}},{"$f":"J31","v":{"$error":"#VALUE!"}},0]
[null,null,"Taux de renouvellement",{"$f":"E31/volume","v":{"$error":"#DIV/0!"}},"Vol/jour",{"$f":"D32/24","v":{"$error":"#DIV/0!"}},"Vol/h"]
[]
[null,null,"Eclairage",null,"Surface","Ratio","Nb heures fonction",null,"Apport","Apport"]
[null,null,null,null,"m2"," W/m2","h",null,"W","kJ/24h"]
[null,null,null,null,{"$f":"surface","v":0},{"$f":"IF(LABO=\"oui\",0,10)","v":10},4,null,{"$f":"F36*E36","v":0},{"$f":"I36*3600*G36/1000","v":0},{"$f":"J36/$J$48","v":{"$error":"#VALUE!"}},null,{"$f":"J36","v":0},{"$f":"J36","v":0},"."]
[]
[null,null,"Personnel"]
[null,null,null,null,"Nombre","Ratio","Nb heures fonction",null,"Apport","Apport"]
[null,null,null,null,"personne","W/p","h",null,"W","kJ/24h"]
[null,null,null,null,0,400,4,null,{"$f":"F41*E41","v":0},{"$f":"I41*3600*G41/1000","v":0},{"$f":"J41/$J$48","v":{"$error":"#VALUE!"}},null,{"$f":"J41","v":0},{"$f":"J41","v":0},0]
[]
[null,null,"Machines",null,null,"Nb heures fonction",null,null,"Apport","Apport"]
[null,null,null,null,"W","h",null,null,"W","kJ/24h"]
[null,null,null,null,0,{"$f":"IF(I6=\"OUI\",10,0)","v":0},null,null,{"$f":"E45","v":0},{"$f":"I45*3600*F45/1000","v":0},{"$f":"J45/$J$48","v":{"$error":"#VALUE!"}},null,{"$f":"J45","v":0},{"$f":"J45","v":0},{"$f":"J45","v":0}]
[null,null,"Divers",null,0,null,null,null,{"$f":"E46","v":0},{"$f":"I46*3600*24/1000","v":0},{"$f":"J46/$J$48","v":{"$error":"#VALUE!"}},null,{"$f":"J46","v":0},{"$f":"J46","v":0},{"$f":"J46","v":0}]
[]
[null,null,"TOTAL",null,null,null,null,null,{"$f":"I16+I20+I23+I27+I31+I36+I41+I45+I46","v":{"$error":"#VALUE!"}},{"$f":"SUM(J16:J46)","v":{"$error":"#VALUE!"}},{"$f":"SUM(K16:K46)","v":{"$error":"#VALUE!"}},null,{"$f":"SUM(M16:M46)","v":{"$error":"#VALUE!"}},{"$f":"SUM(N16:N46)","v":{"$error":"#VALUE!"}},{"$f":"SUM(O16:O46)","v":0}]
[]
[null,null,null,null,"Nombres d'heures de fonctionnement groupes h/jour",null,null,null,"Bilan Chaleur Latente kW"," Bilan production kW",null,null," Bilan production kW"," Bilan production kW"," Bilan production kW"]
[null,null,"PRODUCTION",null,18,"Ratio",{"$f":"J51*1000/E14","v":{"$error":"#VALUE!"}},"W/m2",{"$f":"IF(K6=\"oui\",2501*(J67-I67)*E31/F31/E51/3600,2500.8*(H67-I67)*E31/F31/E51/3600)","v":{"$error":"#VALUE!"}},{"$f":"J48/$E$51/3600","v":{"$error":"#VALUE!"}},null,null,{"$f":"M48/$E$51/3600","v":{"$error":"#VALUE!"}},{"$f":"N48/$E$51/3600","v":{"$error":"#VALUE!"}},{"$f":"O48/$E$51/3600","v":0}]
[null,null,"EMISSION",null,16,null,{"$f":"J52*1000/E14","v":{"$error":"#VALUE!"}},null,{"$f":"I51/J51","v":{"$error":"#VALUE!"}},{"$f":"J48/$E$52/3600","v":{"$error":"#VALUE!"}},{"$f":"J52/J51-1","v":{"$error":"#VALUE!"}},null,{"$f":"M48/$E$52/3600","v":{"$error":"#VALUE!"}},{"$f":"N48/$E$52/3600","v":{"$error":"#VALUE!"}},{"$f":"O48/$E$52/3600","v":0}]
[]
[]
[null,null,null,null,null,null,null,500,500,500]
[null,null,"VIANDES PRE EMBALLES",null,"TRES FORT","ALTITUDE DU SITE (m)",null,50,50,50]
[null,null,"VOLAILLES PREEMBALLEES",null,"FORT","PRESSION TOTALE P (Pa)",null,{"$f":"1.19745*10^-8*(288.15-0.0065*H56)^5.25588","v":100726.03972155297},{"$f":"1.19745*10^-8*(288.15-0.0065*I56)^5.25588","v":100726.03972155297},{"$f":"1.19745*10^-8*(288.15-0.0065*J56)^5.25588","v":100726.03972155297}]
[null,null,"CARCASSES",null,"MOYEN","POINT",null,"EXT","INT","SAS"]
[null,null,"CHARCUTERIE PREEMBALLE",null,"FAIBLE","t","Température sèche",{"$f":"G2","v":{"$error":"#VALUE!"}},{"$f":"G4","v":9.9999999999999995E-7},{"$f":"J4","v":10}]
[null,null,"TRAITEUR",null,null,"F ( % )","Humidité relatice",50,{"$f":"G5","v":80},{"$f":"J5","v":60}]
[null,null,"CHARIOTS PLATS CUISINES",null,null,"T","Température absolue",{"$f":"H59+273.15","v":{"$error":"#VALUE!"}},{"$f":"I59+273.15","v":273.15000099999997},{"$f":"J59+273.15","v":283.14999999999998}]
[null,null,"PATISSERIE FRAICHE",null,"OUI",null,"Pvs si t<0°C",{"$f":"EXP(-5674.359/H61+6.3925247-0.009677843*H61+0.00000062215701*H61^2+0.0000000020747825*H61^3-0.0000000000009484024*H61^4+4.1635019*LN(H61))","v":{"$error":"#VALUE!"}},{"$f":"EXP(-5674.359/I61+6.3925247-0.009677843*I61+0.00000062215701*I61^2+0.0000000020747825*I61^3-0.0000000000009484024*I61^4+4.1635019*LN(I61))","v":611.54955052849118},{"$f":"EXP(-5674.359/J61+6.3925247-0.009677843*J61+0.00000062215701*J61^2+0.0000000020747825*J61^3-0.0000000000009484024*J61^4+4.1635019*LN(J61))","v":1352.9554923109872}]
[null,null,"POISSONS SUR GLACE",null,"NON",null,"Pvs si t>0°C",{"$f":"EXP(-5800.2206/H61+1.3914993-0.048640239*H61+0.000041764768*H61^2-0.000000014452093*H61^3+6.5459673*LN(H61))","v":{"$error":"#VALUE!"}},{"$f":"EXP(-5800.2206/I61+1.3914993-0.048640239*I61+0.000041764768*I61^2-0.000000014452093*I61^3+6.5459673*LN(I61))","v":611.21291185293046},{"$f":"EXP(-5800.2206/J61+1.3914993-0.048640239*J61+0.000041764768*J61^2-0.000000014452093*J61^3+6.5459673*LN(J61))","v":1227.9952754407796}]
[null,null,"FRUITS ET LEGUMES",null,null,"Pws","Pression partielle de vapeur à saturation",{"$f":"IF(H61<273.15,H62,H63)","v":{"$error":"#VALUE!"}},{"$f":"IF(I61<273.15,I62,I63)","v":611.21291185293046},{"$f":"IF(J61<273.15,J62,J63)","v":1227.9952754407796}]
[null,null,"BOF EMBALLES",null,null,"Pv","Pression partielle de vapeur non saturé",{"$f":"H64*H60/100","v":{"$error":"#VALUE!"}},{"$f":"I64*I60/100","v":488.97032948234437},{"$f":"J64*J60/100","v":736.79716526446782}]
[null,null,"FROMAGE",null,null,"Pa","Pression partielle de l'air sec",{"$f":"$H$57-H65","v":{"$error":"#VALUE!"}},{"$f":"$H$57-I65","v":100237.06939207063},{"$f":"$H$57-J65","v":99989.242556288504}]
[null,null,"BOISSONS",null,null,"w","Humidité absolue non saturée",{"$f":"0.62198*H65/($H$57-H65)","v":{"$error":"#VALUE!"}},{"$f":"0.62198*I65/($H$57-I65)","v":3.0341047216957749E-3},{"$f":"0.62198*J65/($H$57-J65)","v":4.5832240462588851E-3}]
[null,null,"POUBELLES GRASSES",null,null,"ws","Humidité absolue à saturation",{"$f":"0.62198*H64/($H$57-H64)","v":{"$error":"#VALUE!"}},{"$f":"0.62198*I64/($H$57-I64)","v":3.7972617945681957E-3},{"$f":"0.62198*J64/($H$57-J64)","v":7.676417216745615E-3}]
[null,null,"PRODUITS SURGELES",null,null,"RO","Masse volumique de l'air sec",{"$f":"(1+H67)/H70","v":{"$error":"#VALUE!"}},{"$f":"(1+I67)/I70","v":1.2820637500945116},{"$f":"(1+J67)/J70","v":1.235632662064539}]
[null,null,"CREMES GLACEES",null,null,"v'","Volume massique de l'air humide",{"$f":"0.2871*H61*(1+1.6078*H67)/$H$57*1000","v":{"$error":"#VALUE!"}},{"$f":"0.2871*I61*(1+1.6078*I67)/$H$57*1000","v":0.78235899318403923},{"$f":"0.2871*J61*(1+1.6078*J67)/$H$57*1000","v":0.81301122484716892}]
[null,null,"SAS"]
[null,null,"LABO DECOUPE",null,null,"h","Enthalpie",{"$f":"1.006*H59+H67*(2500.8+1.805*H59)","v":{"$error":"#VALUE!"}},{"$f":"1.006*I59+I67*(2500.8+1.805*I59)","v":7.5876900994933534},{"$f":"1.006*J59+J67*(2500.8+1.805*J59)","v":21.604453888919195}]
[null,null,"LABO DECOUPE EMBALLAGE"]
[null,null,"LABO EMBALLAGE"]
[]
[]
[]
[]
[null,null,"Désignation","Température","Dimensions",null,null,null,null,"Evaporateurs"]
[null,null,null,null,"Hygrométrie","Longeur","largeur","Surface","hauteur","Volume","Puissance minimum requise",{"$f":"\"à \"&ROUND(D20,0)*100 &\" % de charge en surface\"","v":"à 0 % de charge en surface"},"Maximum de charge 50 %","Minimum de charge","DT de sélection","Nbre","Type","Vitesse ventilation","Dégivrage"]
[]
[null,{"$f":"D1","v":"CFP 01"},{"$f":"E1","v":"FRAIS LS"},{"$f":"G4","v":9.9999999999999995E-7},{"$f":"G5","v":80},{"$f":"E2","v":0},{"$f":"E3","v":0},{"$f":"surface","v":0},{"$f":"hauteur","v":0},{"$f":"volume","v":0},{"$f":"J52*1000","v":{"$error":"#VALUE!"}},{"$f":"J51*1000","v":{"$error":"#VALUE!"}},{"$f":"N52*1000","v":{"$error":"#VALUE!"}},{"$f":"O52*1000","v":0},{"$error":"#N/A"},1,{"$f":"IF(OR(LABO=\"oui\",H1=\"SAS\"),\"DOUBLE FLUX\",IF(K82<2000,\"PLAFONNIER\",IF(AND(G5<80,K82<7000),\"PLAFONNIER\",\"CUBIQUE\")))","v":{"$error":"#VALUE!"}},{"$f":"IF(AND(Q82=\"DOUBLE FLUX\",LABO=\"OUI\"),1000,1500)","v":{"$error":"#VALUE!"}},{"$f":"IF(D82>1,\"Naturel\",\"Electrique\")","v":"Electrique"}]
[]
[]
[null,null,null,null,null,null,null,null,null,null,{"$f":"K82/H82","v":{"$error":"#VALUE!"}}]

{"sheet":"Table CFP 4","index":25,"n_rows":85,"n_cols":19,"rows_kept":85,"cut":false,"hidden":true,"merged":[[17,3,18,3],[78,2,79,2],[78,3,79,3],[78,4,78,8],[78,9,78,14],[0,0,5,0],[0,1,5,1],[0,5,0,6],[0,7,0,10],[1,7,2,7],[1,9,1,10],[2,8,2,9],[3,7,4,7],[3,10,4,10]]}
["ENTREES","CALCULS","CHAMBRE FROIDE","CFP 01","FRAIS LS","PRODUITS TRAITES",null,{"$f":"'Chambres positives'!H5","v":0}]
[null,null,"Largeur",null,{"$f":"'Chambres positives'!H8","v":0},"TEMPERATURE",{"$f":"Informations!G25","v":{"$error":"#VALUE!"}},"EXT","REP"]
[null,null,"Longueur",null,{"$f":"'Chambres positives'!H9","v":0},"HUMIDITE ",50,null,"COEF TRANSMISSION",null,0.3]
[null,null,"Hauteur sous plafond",null,{"$f":"'Chambres positives'!H10","v":0},"TEMPERATURE",9.9999999999999995E-7,"INT","TEMPERATURE",10,"SAS",null,"CHARGEMENT","CHARGEMENT","NUIT"]
[null,null,"Surface",null,{"$f":"E3*E2","v":0},"HUMIDITE ",90,null,"HUMIDITE ",60,null,null,0.5,0.75,"Activité 0"]
[null,null,"Volume",null,{"$f":"E5*E4","v":0},"CAPACITE CF",8400,"LABO","NON",null,"NON"]
[null,null,"BILAN ",null,null,"Text","T in","k","Apport","Apport"]
[null,null,"Déperditions",null,"m2","°C","°C","W/m2/K","W","kJ/24h"]
[null,null,"Mur droit","S1",{"$f":"E2*E4","v":0},35,{"$f":"$G$4","v":9.9999999999999995E-7},{"$f":"$K$3","v":0.3},{"$f":"H9*E9*(F9-G9)","v":0},{"$f":"I9*3600*24/1000","v":0},null,null,null,null,{"$f":"H9*(F9-5-G9)*E9","v":0}]
[null,null,"Mur gauche","S2",{"$f":"+E9","v":0},35,9.9999999999999995E-7,{"$f":"$K$3","v":0.3},0,0,null,null,null,null,{"$f":"H10*(F10-5-G10)*E10","v":0}]
[null,null,"Mur fond","S3",{"$f":"E3*E4","v":0},15,9.9999999999999995E-7,{"$f":"$K$3","v":0.3},0,0,null,null,null,null,{"$f":"H11*(F11-5-G11)*E11","v":0}]
[null,null,"Mur avant","S4",{"$f":"E11","v":0},35,9.9999999999999995E-7,0.5,0,0,null,null,null,null,{"$f":"H12*(F12-5-G12)*E12","v":0}]
[null,null,"Plafond","S5",{"$f":"E5","v":0},35,9.9999999999999995E-7,{"$f":"$K$3","v":0.3},0,0,null,null,null,null,{"$f":"H13*(F13-5-G13)*E13","v":0}]
[null,null,"Plancher","S6",{"$f":"E5","v":0},15,9.9999999999999995E-7,0.2,0,0,null,null,null,null,{"$f":"H14*(F14-G14)*E14","v":0}]
[null,null,"Linéïques",0.1,null,null,null,null,{"$f":"D15*SUM(I9:I14)","v":0},{"$f":"D15*SUM(J9:J14)","v":0}]
[null,null,"Sous total",null,null,null,null,null,{"$f":"SUM(I9:I15)","v":0},{"$f":"I16*24*3.6","v":0},{"$f":"J16/$J$48","v":{"$error":"#VALUE!"}},null,{"$f":"J16","v":0},{"$f":"J16","v":0},{"$f":"SUM(O9:O15)*24*3.6","v":0}]
[]
[null,null,"Entrés","% de charge","kg/jour","T entrée","T stockage","Cp","Apport","Apport"]
[null,null,"Surcharge kg/jour",null,"Débit","°C","°C","kJ/kg/K","W","kJ/24h"]
[null,null,0,0.33333333333333331,2800,7,{"$f":"G4","v":9.9999999999999995E-7},3.1391249999999999,{"$f":"H20*(E20+C20 )*(F20-G20)/3600/12*1000","v":1424.2324354270829},{"$f":"(C20+E20)*H20*(F20-G20)","v":61526.841210449995},{"$f":"J20/$J$48","v":{"$error":"#VALUE!"}},null,{"$f":"IF(LABO=\"non\",J20/E20*G6*$M$5,0)","v":92290.261815674981},{"$f":"IF(LABO=\"non\",J20/E20*G6*$N$5,0)","v":138435.39272351249},0]
[null,null,"Chaleur respiration",null,"Capacité",null,null,"Chaleur respiration","Apport","Apport"]
[null,null,{"$f":"H1","v":0},null,"Chambre",null,null,"kJ/kg en 24 h","W","kJ/24h"]
[null,null,0,null,{"$f":"capacité","v":8400},null,null,{"$f":"C23","v":0},{"$f":"J23/24/3600","v":0},{"$f":"H23*E23","v":0},{"$f":"J23/$J$48","v":{"$error":"#VALUE!"}},null,{"$f":"+J23","v":0},{"$f":"J23","v":0},{"$f":"J23","v":0}]
[]
[null,null,"Travail ventilateurs",null,"Volume chambre","Taux de brassage","Débit air brassé","Puissance ventilateur","Apport","Apport"]
[null,null,null,null,"m3","sd","m3","W","W","kJ/24h"]
[null,null,null,null,{"$f":"volume","v":0},30,{"$f":"F27*E6","v":0},{"$f":"I27","v":0},{"$f":"G27*0.1","v":0},{"$f":"I27/1000*24*3600","v":0},{"$f":"J27/$J$48","v":{"$error":"#VALUE!"}},null,{"$f":"J27","v":0},{"$f":"J27","v":0},{"$f":"J27","v":0}]
[]
[null,null,"Air neuf",null,"Renouvellement","Vol massique","Enthalpie Ext","Enthalpie Int","Apport","Apport"]
[null,null,"Activité chambre",null,"m3/24h","m3/kg","kJ/kg","kJ/kg","W","kJ/24h"]
[null,null,"FORT",null,938,{"$f":"IF(K6=\"NON\",H69,J69)","v":{"$error":"#VALUE!"}},{"$f":"IF(K6=\"NON\",H72,J72)","v":{"$error":"#VALUE!"}},{"$f":"I72","v":8.5413594776163269},{"$f":"(G31-H31)/F31*E31/(24*3600)*1000","v":{"$error":"#VALUE!"}},{"$f":"(G31-H31)/F31*E31","v":{"$error":"#VALUE!"}},{"$f":"J31/$J$48","v":{"$error":"#VALUE!"}},null,{"$f":"J31","v":{"$error":"#VALUE!"}},{"$f":"J31","v":{"$error":"#VALUE!"}},0]
[null,null,"Taux de renouvellement",{"$f":"E31/volume","v":{"$error":"#DIV/0!"}},"Vol/jour",{"$f":"D32/24","v":{"$error":"#DIV/0!"}},"Vol/h"]
[]
[null,null,"Eclairage",null,"Surface","Ratio","Nb heures fonction",null,"Apport","Apport"]
[null,null,null,null,"m2"," W/m2","h",null,"W","kJ/24h"]
[null,null,null,null,{"$f":"surface","v":0},{"$f":"IF(LABO=\"oui\",0,10)","v":10},4,null,{"$f":"F36*E36","v":0},{"$f":"I36*3600*G36/1000","v":0},{"$f":"J36/$J$48","v":{"$error":"#VALUE!"}},null,{"$f":"J36","v":0},{"$f":"J36","v":0},"."]
[]
[null,null,"Personnel"]
[null,null,null,null,"Nombre","Ratio","Nb heures fonction",null,"Apport","Apport"]
[null,null,null,null,"personne","W/p","h",null,"W","kJ/24h"]
[null,null,null,null,0,400,4,null,{"$f":"F41*E41","v":0},{"$f":"I41*3600*G41/1000","v":0},{"$f":"J41/$J$48","v":{"$error":"#VALUE!"}},null,{"$f":"J41","v":0},{"$f":"J41","v":0},0]
[]
[null,null,"Machines",null,null,"Nb heures fonction",null,null,"Apport","Apport"]
[null,null,null,null,"W","h",null,null,"W","kJ/24h"]
[null,null,null,null,0,{"$f":"IF(I6=\"OUI\",10,0)","v":0},null,null,{"$f":"E45","v":0},{"$f":"I45*3600*F45/1000","v":0},{"$f":"J45/$J$48","v":{"$error":"#VALUE!"}},null,{"$f":"J45","v":0},{"$f":"J45","v":0},{"$f":"J45","v":0}]
[null,null,"Divers",null,0,null,null,null,{"$f":"E46","v":0},{"$f":"I46*3600*24/1000","v":0},{"$f":"J46/$J$48","v":{"$error":"#VALUE!"}},null,{"$f":"J46","v":0},{"$f":"J46","v":0},{"$f":"J46","v":0}]
[]
[null,null,"TOTAL",null,null,null,null,null,{"$f":"I16+I20+I23+I27+I31+I36+I41+I45+I46","v":{"$error":"#VALUE!"}},{"$f":"SUM(J16:J46)","v":{"$error":"#VALUE!"}},{"$f":"SUM(K16:K46)","v":{"$error":"#VALUE!"}},null,{"$f":"SUM(M16:M46)","v":{"$error":"#VALUE!"}},{"$f":"SUM(N16:N46)","v":{"$error":"#VALUE!"}},{"$f":"SUM(O16:O46)","v":0}]
[]
[null,null,null,null,"Nombres d'heures de fonctionnement groupes h/jour",null,null,null,"Bilan Chaleur Latente kW"," Bilan production kW",null,null," Bilan production kW"," Bilan production kW"," Bilan production kW"]
[null,null,"PRODUCTION",null,18,"Ratio",{"$f":"J51*1000/E14","v":{"$error":"#VALUE!"}},"W/m2",{"$f":"IF(K6=\"oui\",2501*(J67-I67)*E31/F31/E51/3600,2500.8*(H67-I67)*E31/F31/E51/3600)","v":{"$error":"#VALUE!"}},{"$f":"J48/$E$51/3600","v":{"$error":"#VALUE!"}},null,null,{"$f":"M48/$E$51/3600","v":{"$error":"#VALUE!"}},{"$f":"N48/$E$51/3600","v":{"$error":"#VALUE!"}},{"$f":"O48/$E$51/3600","v":0}]
[null,null,"EMISSION",null,16,null,{"$f":"J52*1000/E14","v":{"$error":"#VALUE!"}},null,{"$f":"I51/J51","v":{"$error":"#VALUE!"}},{"$f":"J48/$E$52/3600","v":{"$error":"#VALUE!"}},{"$f":"J52/J51-1","v":{"$error":"#VALUE!"}},null,{"$f":"M48/$E$52/3600","v":{"$error":"#VALUE!"}},{"$f":"N48/$E$52/3600","v":{"$error":"#VALUE!"}},{"$f":"O48/$E$52/3600","v":0}]
[]
[]
[null,null,null,null,null,null,null,500,500,500]
[null,null,"VIANDES PRE EMBALLES",null,"TRES FORT","ALTITUDE DU SITE (m)",null,50,50,50]
[null,null,"VOLAILLES PREEMBALLEES",null,"FORT","PRESSION TOTALE P (Pa)",null,{"$f":"1.19745*10^-8*(288.15-0.0065*H56)^5.25588","v":100726.03972155297},{"$f":"1.19745*10^-8*(288.15-0.0065*I56)^5.25588","v":100726.03972155297},{"$f":"1.19745*10^-8*(288.15-0.0065*J56)^5.25588","v":100726.03972155297}]
[null,null,"CARCASSES",null,"MOYEN","POINT",null,"EXT","INT","SAS"]
[null,null,"CHARCUTERIE PREEMBALLE",null,"FAIBLE","t","Température sèche",{"$f":"G2","v":{"$error":"#VALUE!"}},{"$f":"G4","v":9.9999999999999995E-7},{"$f":"J4","v":10}]
[null,null,"TRAITEUR",null,null,"F ( % )","Humidité relatice",50,{"$f":"G5","v":90},{"$f":"J5","v":60}]
[null,null,"CHARIOTS PLATS CUISINES",null,null,"T","Température absolue",{"$f":"H59+273.15","v":{"$error":"#VALUE!"}},{"$f":"I59+273.15","v":273.15000099999997},{"$f":"J59+273.15","v":283.14999999999998}]
[null,null,"PATISSERIE FRAICHE",null,"OUI",null,"Pvs si t<0°C",{"$f":"EXP(-5674.359/H61+6.3925247-0.009677843*H61+0.00000062215701*H61^2+0.0000000020747825*H61^3-0.0000000000009484024*H61^4+4.1635019*LN(H61))","v":{"$error":"#VALUE!"}},{"$f":"EXP(-5674.359/I61+6.3925247-0.009677843*I61+0.00000062215701*I61^2+0.0000000020747825*I61^3-0.0000000000009484024*I61^4+4.1635019*LN(I61))","v":611.54955052849118},{"$f":"EXP(-5674.359/J61+6.3925247-0.009677843*J61+0.00000062215701*J61^2+0.0000000020747825*J61^3-0.0000000000009484024*J61^4+4.1635019*LN(J61))","v":1352.9554923109872}]
[null,null,"POISSONS SUR GLACE",null,"NON",null,"Pvs si t>0°C",{"$f":"EXP(-5800.2206/H61+1.3914993-0.048640239*H61+0.000041764768*H61^2-0.000000014452093*H61^3+6.5459673*LN(H61))","v":{"$error":"#VALUE!"}},{"$f":"EXP(-5800.2206/I61+1.3914993-0.048640239*I61+0.000041764768*I61^2-0.000000014452093*I61^3+6.5459673*LN(I61))","v":611.21291185293046},{"$f":"EXP(-5800.2206/J61+1.3914993-0.048640239*J61+0.000041764768*J61^2-0.000000014452093*J61^3+6.5459673*LN(J61))","v":1227.9952754407796}]
[null,null,"FRUITS ET LEGUMES",null,null,"Pws","Pression partielle de vapeur à saturation",{"$f":"IF(H61<273.15,H62,H63)","v":{"$error":"#VALUE!"}},{"$f":"IF(I61<273.15,I62,I63)","v":611.21291185293046},{"$f":"IF(J61<273.15,J62,J63)","v":1227.9952754407796}]
[null,null,"BOF EMBALLES",null,null,"Pv","Pression partielle de vapeur non saturé",{"$f":"H64*H60/100","v":{"$error":"#VALUE!"}},{"$f":"I64*I60/100","v":550.09162066763736},{"$f":"J64*J60/100","v":736.79716526446782}]
[null,null,"FROMAGE",null,null,"Pa","Pression partielle de l'air sec",{"$f":"$H$57-H65","v":{"$error":"#VALUE!"}},{"$f":"$H$57-I65","v":100175.94810088533},{"$f":"$H$57-J65","v":99989.242556288504}]
[null,null,"BOISSONS",null,null,"w","Humidité absolue non saturée",{"$f":"0.62198*H65/($H$57-H65)","v":{"$error":"#VALUE!"}},{"$f":"0.62198*I65/($H$57-I65)","v":3.4154504420391232E-3},{"$f":"0.62198*J65/($H$57-J65)","v":4.5832240462588851E-3}]
[null,null,"POUBELLES GRASSES",null,null,"ws","Humidité absolue à saturation",{"$f":"0.62198*H64/($H$57-H64)","v":{"$error":"#VALUE!"}},{"$f":"0.62198*I64/($H$57-I64)","v":3.7972617945681957E-3},{"$f":"0.62198*J64/($H$57-J64)","v":7.676417216745615E-3}]
[null,null,"PRODUITS SURGELES",null,null,"RO","Masse volumique de l'air sec",{"$f":"(1+H67)/H70","v":{"$error":"#VALUE!"}},{"$f":"(1+I67)/I70","v":1.2817691077579871},{"$f":"(1+J67)/J70","v":1.235632662064539}]
[null,null,"CREMES GLACEES",null,null,"v'","Volume massique de l'air humide",{"$f":"0.2871*H61*(1+1.6078*H67)/$H$57*1000","v":{"$error":"#VALUE!"}},{"$f":"0.2871*I61*(1+1.6078*I67)/$H$57*1000","v":0.7828363504540754},{"$f":"0.2871*J61*(1+1.6078*J67)/$H$57*1000","v":0.81301122484716892}]
[null,null,"SAS"]
[null,null,"LABO DECOUPE",null,null,"h","Enthalpie",{"$f":"1.006*H59+H67*(2500.8+1.805*H59)","v":{"$error":"#VALUE!"}},{"$f":"1.006*I59+I67*(2500.8+1.805*I59)","v":8.5413594776163269},{"$f":"1.006*J59+J67*(2500.8+1.805*J59)","v":21.604453888919195}]
[null,null,"LABO DECOUPE EMBALLAGE"]
[null,null,"LABO EMBALLAGE"]
[]
[]
[]
[]
[null,null,"Désignation","Température","Dimensions",null,null,null,null,"Evaporateurs"]
[null,null,null,null,"Hygrométrie","Longeur","largeur","Surface","hauteur","Volume","Puissance minimum requise",{"$f":"\"à \"&ROUND(D20,0)*100 &\" % de charge en surface\"","v":"à 0 % de charge en surface"},"Maximum de charge 50 %","Minimum de charge","DT de sélection","Nbre","Type","Vitesse ventilation","Dégivrage"]
[]
[null,{"$f":"D1","v":"CFP 01"},{"$f":"E1","v":"FRAIS LS"},{"$f":"G4","v":9.9999999999999995E-7},{"$f":"G5","v":90},{"$f":"E2","v":0},{"$f":"E3","v":0},{"$f":"surface","v":0},{"$f":"hauteur","v":0},{"$f":"volume","v":0},{"$f":"J52*1000","v":{"$error":"#VALUE!"}},{"$f":"J51*1000","v":{"$error":"#VALUE!"}},{"$f":"N52*1000","v":{"$error":"#VALUE!"}},{"$f":"O52*1000","v":0},{"$error":"#N/A"},1,{"$f":"IF(OR(LABO=\"oui\",H1=\"SAS\"),\"DOUBLE FLUX\",IF(K82<2000,\"PLAFONNIER\",IF(AND(G5<80,K82<7000),\"PLAFONNIER\",\"CUBIQUE\")))","v":{"$error":"#VALUE!"}},{"$f":"IF(AND(Q82=\"DOUBLE FLUX\",LABO=\"OUI\"),1000,1500)","v":{"$error":"#VALUE!"}},{"$f":"IF(D82>1,\"Naturel\",\"Electrique\")","v":"Electrique"}]
[]
[]
[null,null,null,null,null,null,null,null,null,null,{"$f":"K82/H82","v":{"$error":"#VALUE!"}}]

{"sheet":"Table CFP 5","index":26,"n_rows":85,"n_cols":19,"rows_kept":85,"cut":false,"hidden":true,"merged":[[17,3,18,3],[78,2,79,2],[78,3,79,3],[78,4,78,8],[78,9,78,14],[0,0,5,0],[0,1,5,1],[0,5,0,6],[0,7,0,10],[1,7,2,7],[1,9,1,10],[2,8,2,9],[3,7,4,7],[3,10,4,10]]}
["ENTREES","CALCULS","CHAMBRE FROIDE","CFP 01","FRAIS LS","PRODUITS TRAITES",null,{"$f":"'Chambres positives'!I5","v":0}]
[null,null,"Largeur",null,{"$f":"'Chambres positives'!I8","v":0},"TEMPERATURE",{"$f":"Informations!G25","v":{"$error":"#VALUE!"}},"EXT","REP"]
[null,null,"Longueur",null,{"$f":"'Chambres positives'!I9","v":0},"HUMIDITE ",50,null,"COEF TRANSMISSION",null,0.3]
[null,null,"Hauteur sous plafond",null,{"$f":"'Chambres positives'!I10","v":0},"TEMPERATURE",2,"INT","TEMPERATURE",10,"SAS",null,"CHARGEMENT","CHARGEMENT","NUIT"]
[null,null,"Surface",null,{"$f":"E3*E2","v":0},"HUMIDITE ",85,null,"HUMIDITE ",60,null,null,0.5,0.75,"Activité 0"]
[null,null,"Volume",null,{"$f":"E5*E4","v":0},"CAPACITE CF",0,"LABO","NON",null,"NON"]
[null,null,"BILAN ",null,null,"Text","T in","k","Apport","Apport"]
[null,null,"Déperditions",null,"m2","°C","°C","W/m2/K","W","kJ/24h"]
[null,null,"Mur droit","S1",{"$f":"E2*E4","v":0},35,{"$f":"$G$4","v":2},{"$f":"$K$3","v":0.3},{"$f":"H9*E9*(F9-G9)","v":0},{"$f":"I9*3600*24/1000","v":0},null,null,null,null,{"$f":"H9*(F9-5-G9)*E9","v":0}]
[null,null,"Mur gauche","S2",{"$f":"+E9","v":0},35,2,{"$f":"$K$3","v":0.3},0,0,null,null,null,null,{"$f":"H10*(F10-5-G10)*E10","v":0}]
[null,null,"Mur fond","S3",{"$f":"E3*E4","v":0},15,2,{"$f":"$K$3","v":0.3},0,0,null,null,null,null,{"$f":"H11*(F11-5-G11)*E11","v":0}]
[null,null,"Mur avant","S4",{"$f":"E11","v":0},35,2,0.5,0,0,null,null,null,null,{"$f":"H12*(F12-5-G12)*E12","v":0}]
[null,null,"Plafond","S5",{"$f":"E5","v":0},35,2,{"$f":"$K$3","v":0.3},0,0,null,null,null,null,{"$f":"H13*(F13-5-G13)*E13","v":0}]
[null,null,"Plancher","S6",{"$f":"E5","v":0},15,2,0.2,0,0,null,null,null,null,{"$f":"H14*(F14-G14)*E14","v":0}]
[null,null,"Linéïques",0.1,null,null,null,null,{"$f":"D15*SUM(I9:I14)","v":0},{"$f":"D15*SUM(J9:J14)","v":0}]
[null,null,"Sous total",null,null,null,null,null,{"$f":"SUM(I9:I15)","v":0},{"$f":"I16*24*3.6","v":0},{"$f":"J16/$J$48","v":{"$error":"#VALUE!"}},null,{"$f":"J16","v":0},{"$f":"J16","v":0},{"$f":"SUM(O9:O15)*24*3.6","v":0}]
[]
[null,null,"Entrés","% de charge","kg/jour","T entrée","T stockage","Cp","Apport","Apport"]
[null,null,"Surcharge kg/jour",null,"Débit","°C","°C","kJ/kg/K","W","kJ/24h"]
[null,null,0,{"$error":"#DIV/0!"},0,10,{"$f":"G4","v":2},3.1391249999999999,{"$f":"H20*(E20+C20 )*(F20-G20)/3600/12*1000","v":0},{"$f":"(C20+E20)*H20*(F20-G20)","v":0},{"$f":"J20/$J$48","v":{"$error":"#VALUE!"}},null,{"$f":"IF(LABO=\"non\",J20/E20*G6*$M$5,0)","v":{"$error":"#DIV/0!"}},{"$f":"IF(LABO=\"non\",J20/E20*G6*$N$5,0)","v":{"$error":"#DIV/0!"}},0]
[null,null,"Chaleur respiration",null,"Capacité",null,null,"Chaleur respiration","Apport","Apport"]
[null,null,{"$f":"H1","v":0},null,"Chambre",null,null,"kJ/kg en 24 h","W","kJ/24h"]
[null,null,0,null,{"$f":"capacité","v":0},null,null,{"$f":"C23","v":0},{"$f":"J23/24/3600","v":0},{"$f":"H23*E23","v":0},{"$f":"J23/$J$48","v":{"$error":"#VALUE!"}},null,{"$f":"+J23","v":0},{"$f":"J23","v":0},{"$f":"J23","v":0}]
[]
[null,null,"Travail ventilateurs",null,"Volume chambre","Taux de brassage","Débit air brassé","Puissance ventilateur","Apport","Apport"]
[null,null,null,null,"m3","sd","m3","W","W","kJ/24h"]
[null,null,null,null,{"$f":"volume","v":0},30,{"$f":"F27*E6","v":0},{"$f":"I27","v":0},{"$f":"G27*0.1","v":0},{"$f":"I27/1000*24*3600","v":0},{"$f":"J27/$J$48","v":{"$error":"#VALUE!"}},null,{"$f":"J27","v":0},{"$f":"J27","v":0},{"$f":"J27","v":0}]
[]
[null,null,"Air neuf",null,"Renouvellement","Vol massique","Enthalpie Ext","Enthalpie Int","Apport","Apport"]
[null,null,"Activité chambre",null,"m3/24h","m3/kg","kJ/kg","kJ/kg","W","kJ/24h"]
[null,null,"FORT",null,{"$error":"#N/A"},{"$f":"IF(K6=\"NON\",H69,J69)","v":{"$error":"#VALUE!"}},{"$f":"IF(K6=\"NON\",H72,J72)","v":{"$error":"#VALUE!"}},{"$f":"I72","v":11.347351549108373},{"$f":"(G31-H31)/F31*E31/(24*3600)*1000","v":{"$error":"#VALUE!"}},{"$f":"(G31-H31)/F31*E31","v":{"$error":"#VALUE!"}},{"$f":"J31/$J$48","v":{"$error":"#VALUE!"}},null,{"$f":"J31","v":{"$error":"#VALUE!"}},{"$f":"J31","v":{"$error":"#VALUE!"}},0]
[null,null,"Taux de renouvellement",{"$f":"E31/volume","v":{"$error":"#N/A"}},"Vol/jour",{"$f":"D32/24","v":{"$error":"#N/A"}},"Vol/h"]
[]
[null,null,"Eclairage",null,"Surface","Ratio","Nb heures fonction",null,"Apport","Apport"]
[null,null,null,null,"m2"," W/m2","h",null,"W","kJ/24h"]
[null,null,null,null,{"$f":"surface","v":0},{"$f":"IF(LABO=\"oui\",0,10)","v":10},4,null,{"$f":"F36*E36","v":0},{"$f":"I36*3600*G36/1000","v":0},{"$f":"J36/$J$48","v":{"$error":"#VALUE!"}},null,{"$f":"J36","v":0},{"$f":"J36","v":0},"."]
[]
[null,null,"Personnel"]
[null,null,null,null,"Nombre","Ratio","Nb heures fonction",null,"Apport","Apport"]
[null,null,null,null,"personne","W/p","h",null,"W","kJ/24h"]
[null,null,null,null,0,400,4,null,{"$f":"F41*E41","v":0},{"$f":"I41*3600*G41/1000","v":0},{"$f":"J41/$J$48","v":{"$error":"#VALUE!"}},null,{"$f":"J41","v":0},{"$f":"J41","v":0},0]
[]
[null,null,"Machines",null,null,"Nb heures fonction",null,null,"Apport","Apport"]
[null,null,null,null,"W","h",null,null,"W","kJ/24h"]
[null,null,null,null,0,{"$f":"IF(I6=\"OUI\",10,0)","v":0},null,null,{"$f":"E45","v":0},{"$f":"I45*3600*F45/1000","v":0},{"$f":"J45/$J$48","v":{"$error":"#VALUE!"}},null,{"$f":"J45","v":0},{"$f":"J45","v":0},{"$f":"J45","v":0}]
[null,null,"Divers",null,0,null,null,null,{"$f":"E46","v":0},{"$f":"I46*3600*24/1000","v":0},{"$f":"J46/$J$48","v":{"$error":"#VALUE!"}},null,{"$f":"J46","v":0},{"$f":"J46","v":0},{"$f":"J46","v":0}]
[]
[null,null,"TOTAL",null,null,null,null,null,{"$f":"I16+I20+I23+I27+I31+I36+I41+I45+I46","v":{"$error":"#VALUE!"}},{"$f":"SUM(J16:J46)","v":{"$error":"#VALUE!"}},{"$f":"SUM(K16:K46)","v":{"$error":"#VALUE!"}},null,{"$f":"SUM(M16:M46)","v":{"$error":"#DIV/0!"}},{"$f":"SUM(N16:N46)","v":{"$error":"#DIV/0!"}},{"$f":"SUM(O16:O46)","v":0}]
[]
[null,null,null,null,"Nombres d'heures de fonctionnement groupes h/jour",null,null,null,"Bilan Chaleur Latente kW"," Bilan production kW",null,null," Bilan production kW"," Bilan production kW"," Bilan production kW"]
[null,null,"PRODUCTION",null,18,"Ratio",{"$f":"J51*1000/E14","v":{"$error":"#VALUE!"}},"W/m2",{"$f":"IF(K6=\"oui\",2501*(J67-I67)*E31/F31/E51/3600,2500.8*(H67-I67)*E31/F31/E51/3600)","v":{"$error":"#VALUE!"}},{"$f":"J48/$E$51/3600","v":{"$error":"#VALUE!"}},null,null,{"$f":"M48/$E$51/3600","v":{"$error":"#DIV/0!"}},{"$f":"N48/$E$51/3600","v":{"$error":"#DIV/0!"}},{"$f":"O48/$E$51/3600","v":0}]
[null,null,"EMISSION",null,16,null,{"$f":"J52*1000/E14","v":{"$error":"#VALUE!"}},null,{"$f":"I51/J51","v":{"$error":"#VALUE!"}},{"$f":"J48/$E$52/3600","v":{"$error":"#VALUE!"}},{"$f":"J52/J51-1","v":{"$error":"#VALUE!"}},null,{"$f":"M48/$E$52/3600","v":{"$error":"#DIV/0!"}},{"$f":"N48/$E$52/3600","v":{"$error":"#DIV/0!"}},{"$f":"O48/$E$52/3600","v":0}]
[]
[]
[null,null,null,null,null,null,null,500,500,500]
[null,null,"VIANDES PRE EMBALLES",null,"TRES FORT","ALTITUDE DU SITE (m)",null,50,50,50]
[null,null,"VOLAILLES PREEMBALLEES",null,"FORT","PRESSION TOTALE P (Pa)",null,{"$f":"1.19745*10^-8*(288.15-0.0065*H56)^5.25588","v":100726.03972155297},{"$f":"1.19745*10^-8*(288.15-0.0065*I56)^5.25588","v":100726.03972155297},{"$f":"1.19745*10^-8*(288.15-0.0065*J56)^5.25588","v":100726.03972155297}]
[null,null,"CARCASSES",null,"MOYEN","POINT",null,"EXT","INT","SAS"]
[null,null,"CHARCUTERIE PREEMBALLE",null,"FAIBLE","t","Température sèche",{"$f":"G2","v":{"$error":"#VALUE!"}},{"$f":"G4","v":2},{"$f":"J4","v":10}]
[null,null,"TRAITEUR",null,null,"F ( % )","Humidité relatice",50,{"$f":"G5","v":85},{"$f":"J5","v":60}]
[null,null,"CHARIOTS PLATS CUISINES",null,null,"T","Température absolue",{"$f":"H59+273.15","v":{"$error":"#VALUE!"}},{"$f":"I59+273.15","v":275.14999999999998},{"$f":"J59+273.15","v":283.14999999999998}]
[null,null,"PATISSERIE FRAICHE",null,"OUI",null,"Pvs si t<0°C",{"$f":"EXP(-5674.359/H61+6.3925247-0.009677843*H61+0.00000062215701*H61^2+0.0000000020747825*H61^3-0.0000000000009484024*H61^4+4.1635019*LN(H61))","v":{"$error":"#VALUE!"}},{"$f":"EXP(-5674.359/I61+6.3925247-0.009677843*I61+0.00000062215701*I61^2+0.0000000020747825*I61^3-0.0000000000009484024*I61^4+4.1635019*LN(I61))","v":720.16150175360349},{"$f":"EXP(-5674.359/J61+6.3925247-0.009677843*J61+0.00000062215701*J61^2+0.0000000020747825*J61^3-0.0000000000009484024*J61^4+4.1635019*LN(J61))","v":1352.9554923109872}]
[null,null,"POISSONS SUR GLACE",null,"NON",null,"Pvs si t>0°C",{"$f":"EXP(-5800.2206/H61+1.3914993-0.048640239*H61+0.000041764768*H61^2-0.000000014452093*H61^3+6.5459673*LN(H61))","v":{"$error":"#VALUE!"}},{"$f":"EXP(-5800.2206/I61+1.3914993-0.048640239*I61+0.000041764768*I61^2-0.000000014452093*I61^3+6.5459673*LN(I61))","v":705.95444213942005},{"$f":"EXP(-5800.2206/J61+1.3914993-0.048640239*J61+0.000041764768*J61^2-0.000000014452093*J61^3+6.5459673*LN(J61))","v":1227.9952754407796}]
[null,null,"FRUITS ET LEGUMES",null,null,"Pws","Pression partielle de vapeur à saturation",{"$f":"IF(H61<273.15,H62,H63)","v":{"$error":"#VALUE!"}},{"$f":"IF(I61<273.15,I62,I63)","v":705.95444213942005},{"$f":"IF(J61<273.15,J62,J63)","v":1227.9952754407796}]
[null,null,"BOF EMBALLES",null,null,"Pv","Pression partielle de vapeur non saturé",{"$f":"H64*H60/100","v":{"$error":"#VALUE!"}},{"$f":"I64*I60/100","v":600.06127581850706},{"$f":"J64*J60/100","v":736.79716526446782}]
[null,null,"FROMAGE",null,null,"Pa","Pression partielle de l'air sec",{"$f":"$H$57-H65","v":{"$error":"#VALUE!"}},{"$f":"$H$57-I65","v":100125.97844573446},{"$f":"$H$57-J65","v":99989.242556288504}]
[null,null,"BOISSONS",null,null,"w","Humidité absolue non saturée",{"$f":"0.62198*H65/($H$57-H65)","v":{"$error":"#VALUE!"}},{"$f":"0.62198*I65/($H$57-I65)","v":3.7275651946400033E-3},{"$f":"0.62198*J65/($H$57-J65)","v":4.5832240462588851E-3}]
[null,null,"POUBELLES GRASSES",null,null,"ws","Humidité absolue à saturation",{"$f":"0.62198*H64/($H$57-H64)","v":{"$error":"#VALUE!"}},{"$f":"0.62198*I64/($H$57-I64)","v":4.3900136927022921E-3},{"$f":"0.62198*J64/($H$57-J64)","v":7.676417216745615E-3}]
[null,null,"PRODUITS SURGELES",null,null,"RO","Masse volumique de l'air sec",{"$f":"(1+H67)/H70","v":{"$error":"#VALUE!"}},{"$f":"(1+I67)/I70","v":1.2722131035679458},{"$f":"(1+J67)/J70","v":1.235632662064539}]
[null,null,"CREMES GLACEES",null,null,"v'","Volume massique de l'air humide",{"$f":"0.2871*H61*(1+1.6078*H67)/$H$57*1000","v":{"$error":"#VALUE!"}},{"$f":"0.2871*I61*(1+1.6078*I67)/$H$57*1000","v":0.78896181966658496},{"$f":"0.2871*J61*(1+1.6078*J67)/$H$57*1000","v":0.81301122484716892}]
[null,null,"SAS"]
[null,null,"LABO DECOUPE",null,null,"h","Enthalpie",{"$f":"1.006*H59+H67*(2500.8+1.805*H59)","v":{"$error":"#VALUE!"}},{"$f":"1.006*I59+I67*(2500.8+1.805*I59)","v":11.347351549108373},{"$f":"1.006*J59+J67*(2500.8+1.805*J59)","v":21.604453888919195}]
[null,null,"LABO DECOUPE EMBALLAGE"]
[null,null,"LABO EMBALLAGE"]
[]
[]
[]
[]
[null,null,"Désignation","Température","Dimensions",null,null,null,null,"Evaporateurs"]
[null,null,null,null,"Hygrométrie","Longeur","largeur","Surface","hauteur","Volume","Puissance minimum requise",{"$f":"\"à \"&ROUND(D20,0)*100 &\" % de charge en surface\"","v":{"$error":"#DIV/0!"}},"Maximum de charge 50 %","Minimum de charge","DT de sélection","Nbre","Type","Vitesse ventilation","Dégivrage"]
[]
[null,{"$f":"D1","v":"CFP 01"},{"$f":"E1","v":"FRAIS LS"},{"$f":"G4","v":2},{"$f":"G5","v":85},{"$f":"E2","v":0},{"$f":"E3","v":0},{"$f":"surface","v":0},{"$f":"hauteur","v":0},{"$f":"volume","v":0},{"$f":"J52*1000","v":{"$error":"#VALUE!"}},{"$f":"J51*1000","v":{"$error":"#VALUE!"}},{"$f":"N52*1000","v":{"$error":"#DIV/0!"}},{"$f":"O52*1000","v":0},{"$error":"#N/A"},1,{"$f":"IF(OR(LABO=\"oui\",H1=\"SAS\"),\"DOUBLE FLUX\",IF(K82<2000,\"PLAFONNIER\",IF(AND(G5<80,K82<7000),\"PLAFONNIER\",\"CUBIQUE\")))","v":{"$error":"#VALUE!"}},{"$f":"IF(AND(Q82=\"DOUBLE FLUX\",LABO=\"OUI\"),1000,1500)","v":{"$error":"#VALUE!"}},{"$f":"IF(D82>1,\"Naturel\",\"Electrique\")","v":"Naturel"}]
[]
[]
[null,null,null,null,null,null,null,null,null,null,{"$f":"K82/H82","v":{"$error":"#VALUE!"}}]

{"sheet":"Table CFP 6","index":27,"n_rows":85,"n_cols":19,"rows_kept":85,"cut":false,"hidden":true,"merged":[[17,3,18,3],[78,2,79,2],[78,3,79,3],[78,4,78,8],[78,9,78,14],[0,0,5,0],[0,1,5,1],[0,5,0,6],[0,7,0,10],[1,7,2,7],[1,9,1,10],[2,8,2,9],[3,7,4,7],[3,10,4,10]]}
["ENTREES","CALCULS","CHAMBRE FROIDE","CFP 01","FRAIS LS","PRODUITS TRAITES",null,{"$f":"'Chambres positives'!J5","v":0}]
[null,null,"Largeur",null,{"$f":"'Chambres positives'!J8","v":0},"TEMPERATURE",{"$f":"Informations!G25","v":{"$error":"#VALUE!"}},"EXT","REP"]
[null,null,"Longueur",null,{"$f":"'Chambres positives'!J9","v":0},"HUMIDITE ",50,null,"COEF TRANSMISSION",null,0.3]
[null,null,"Hauteur sous plafond",null,{"$f":"'Chambres positives'!J10","v":0},"TEMPERATURE",1,"INT","TEMPERATURE",10,"SAS",null,"CHARGEMENT","CHARGEMENT","NUIT"]
[null,null,"Surface",null,{"$f":"E3*E2","v":0},"HUMIDITE ",75,null,"HUMIDITE ",60,null,null,0.5,0.75,"Activité 0"]
[null,null,"Volume",null,{"$f":"E5*E4","v":0},"CAPACITE CF",0,"LABO","NON",null,"NON"]
[null,null,"BILAN ",null,null,"Text","T in","k","Apport","Apport"]
[null,null,"Déperditions",null,"m2","°C","°C","W/m2/K","W","kJ/24h"]
[null,null,"Mur droit","S1",{"$f":"E2*E4","v":0},35,{"$f":"$G$4","v":1},{"$f":"$K$3","v":0.3},{"$f":"H9*E9*(F9-G9)","v":0},{"$f":"I9*3600*24/1000","v":0},null,null,null,null,{"$f":"H9*(F9-5-G9)*E9","v":0}]
[null,null,"Mur gauche","S2",{"$f":"+E9","v":0},35,1,{"$f":"$K$3","v":0.3},0,0,null,null,null,null,{"$f":"H10*(F10-5-G10)*E10","v":0}]
[null,null,"Mur fond","S3",{"$f":"E3*E4","v":0},15,1,{"$f":"$K$3","v":0.3},0,0,null,null,null,null,{"$f":"H11*(F11-5-G11)*E11","v":0}]
[null,null,"Mur avant","S4",{"$f":"E11","v":0},35,1,0.5,0,0,null,null,null,null,{"$f":"H12*(F12-5-G12)*E12","v":0}]
[null,null,"Plafond","S5",{"$f":"E5","v":0},35,1,{"$f":"$K$3","v":0.3},0,0,null,null,null,null,{"$f":"H13*(F13-5-G13)*E13","v":0}]
[null,null,"Plancher","S6",{"$f":"E5","v":0},15,1,0.2,0,0,null,null,null,null,{"$f":"H14*(F14-G14)*E14","v":0}]
[null,null,"Linéïques",0.1,null,null,null,null,{"$f":"D15*SUM(I9:I14)","v":0},{"$f":"D15*SUM(J9:J14)","v":0}]
[null,null,"Sous total",null,null,null,null,null,{"$f":"SUM(I9:I15)","v":0},{"$f":"I16*24*3.6","v":0},{"$f":"J16/$J$48","v":{"$error":"#VALUE!"}},null,{"$f":"J16","v":0},{"$f":"J16","v":0},{"$f":"SUM(O9:O15)*24*3.6","v":0}]
[]
[null,null,"Entrés","% de charge","kg/jour","T entrée","T stockage","Cp","Apport","Apport"]
[null,null,"Surcharge kg/jour",null,"Débit","°C","°C","kJ/kg/K","W","kJ/24h"]
[null,null,0,{"$error":"#DIV/0!"},0,25,{"$f":"G4","v":1},2.9298500000000001,{"$f":"H20*(E20+C20 )*(F20-G20)/3600/12*1000","v":0},{"$f":"(C20+E20)*H20*(F20-G20)","v":0},{"$f":"J20/$J$48","v":{"$error":"#VALUE!"}},null,{"$f":"IF(LABO=\"non\",J20/E20*G6*$M$5,0)","v":{"$error":"#DIV/0!"}},{"$f":"IF(LABO=\"non\",J20/E20*G6*$N$5,0)","v":{"$error":"#DIV/0!"}},0]
[null,null,"Chaleur respiration",null,"Capacité",null,null,"Chaleur respiration","Apport","Apport"]
[null,null,{"$f":"H1","v":0},null,"Chambre",null,null,"kJ/kg en 24 h","W","kJ/24h"]
[null,null,0,null,{"$f":"capacité","v":0},null,null,{"$f":"C23","v":0},{"$f":"J23/24/3600","v":0},{"$f":"H23*E23","v":0},{"$f":"J23/$J$48","v":{"$error":"#VALUE!"}},null,{"$f":"+J23","v":0},{"$f":"J23","v":0},{"$f":"J23","v":0}]
[]
[null,null,"Travail ventilateurs",null,"Volume chambre","Taux de brassage","Débit air brassé","Puissance ventilateur","Apport","Apport"]
[null,null,null,null,"m3","sd","m3","W","W","kJ/24h"]
[null,null,null,null,{"$f":"volume","v":0},30,{"$f":"F27*E6","v":0},{"$f":"I27","v":0},{"$f":"G27*0.1","v":0},{"$f":"I27/1000*24*3600","v":0},{"$f":"J27/$J$48","v":{"$error":"#VALUE!"}},null,{"$f":"J27","v":0},{"$f":"J27","v":0},{"$f":"J27","v":0}]
[]
[null,null,"Air neuf",null,"Renouvellement","Vol massique","Enthalpie Ext","Enthalpie Int","Apport","Apport"]
[null,null,"Activité chambre",null,"m3/24h","m3/kg","kJ/kg","kJ/kg","W","kJ/24h"]
[null,null,"FORT",null,{"$error":"#N/A"},{"$f":"IF(K6=\"NON\",H69,J69)","v":{"$error":"#VALUE!"}},{"$f":"IF(K6=\"NON\",H72,J72)","v":{"$error":"#VALUE!"}},{"$f":"I72","v":8.6589876841454494},{"$f":"(G31-H31)/F31*E31/(24*3600)*1000","v":{"$error":"#VALUE!"}},{"$f":"(G31-H31)/F31*E31","v":{"$error":"#VALUE!"}},{"$f":"J31/$J$48","v":{"$error":"#VALUE!"}},null,{"$f":"J31","v":{"$error":"#VALUE!"}},{"$f":"J31","v":{"$error":"#VALUE!"}},0]
[null,null,"Taux de renouvellement",{"$f":"E31/volume","v":{"$error":"#N/A"}},"Vol/jour",{"$f":"D32/24","v":{"$error":"#N/A"}},"Vol/h"]
[]
[null,null,"Eclairage",null,"Surface","Ratio","Nb heures fonction",null,"Apport","Apport"]
[null,null,null,null,"m2"," W/m2","h",null,"W","kJ/24h"]
[null,null,null,null,{"$f":"surface","v":0},{"$f":"IF(LABO=\"oui\",0,10)","v":10},4,null,{"$f":"F36*E36","v":0},{"$f":"I36*3600*G36/1000","v":0},{"$f":"J36/$J$48","v":{"$error":"#VALUE!"}},null,{"$f":"J36","v":0},{"$f":"J36","v":0},"."]
[]
[null,null,"Personnel"]
[null,null,null,null,"Nombre","Ratio","Nb heures fonction",null,"Apport","Apport"]
[null,null,null,null,"personne","W/p","h",null,"W","kJ/24h"]
[null,null,null,null,0,400,4,null,{"$f":"F41*E41","v":0},{"$f":"I41*3600*G41/1000","v":0},{"$f":"J41/$J$48","v":{"$error":"#VALUE!"}},null,{"$f":"J41","v":0},{"$f":"J41","v":0},0]
[]
[null,null,"Machines",null,null,"Nb heures fonction",null,null,"Apport","Apport"]
[null,null,null,null,"W","h",null,null,"W","kJ/24h"]
[null,null,null,null,0,{"$f":"IF(I6=\"OUI\",10,0)","v":0},null,null,{"$f":"E45","v":0},{"$f":"I45*3600*F45/1000","v":0},{"$f":"J45/$J$48","v":{"$error":"#VALUE!"}},null,{"$f":"J45","v":0},{"$f":"J45","v":0},{"$f":"J45","v":0}]
[null,null,"Divers",null,0,null,null,null,{"$f":"E46","v":0},{"$f":"I46*3600*24/1000","v":0},{"$f":"J46/$J$48","v":{"$error":"#VALUE!"}},null,{"$f":"J46","v":0},{"$f":"J46","v":0},{"$f":"J46","v":0}]
[]
[null,null,"TOTAL",null,null,null,null,null,{"$f":"I16+I20+I23+I27+I31+I36+I41+I45+I46","v":{"$error":"#VALUE!"}},{"$f":"SUM(J16:J46)","v":{"$error":"#VALUE!"}},{"$f":"SUM(K16:K46)","v":{"$error":"#VALUE!"}},null,{"$f":"SUM(M16:M46)","v":{"$error":"#DIV/0!"}},{"$f":"SUM(N16:N46)","v":{"$error":"#DIV/0!"}},{"$f":"SUM(O16:O46)","v":0}]
[]
[null,null,null,null,"Nombres d'heures de fonctionnement groupes h/jour",null,null,null,"Bilan Chaleur Latente kW"," Bilan production kW",null,null," Bilan production kW"," Bilan production kW"," Bilan production kW"]
[null,null,"PRODUCTION",null,18,"Ratio",{"$f":"J51*1000/E14","v":{"$error":"#VALUE!"}},"W/m2",{"$f":"IF(K6=\"oui\",2501*(J67-I67)*E31/F31/E51/3600,2500.8*(H67-I67)*E31/F31/E51/3600)","v":{"$error":"#VALUE!"}},{"$f":"J48/$E$51/3600","v":{"$error":"#VALUE!"}},null,null,{"$f":"M48/$E$51/3600","v":{"$error":"#DIV/0!"}},{"$f":"N48/$E$51/3600","v":{"$error":"#DIV/0!"}},{"$f":"O48/$E$51/3600","v":0}]
[null,null,"EMISSION",null,16,null,{"$f":"J52*1000/E14","v":{"$error":"#VALUE!"}},null,{"$f":"I51/J51","v":{"$error":"#VALUE!"}},{"$f":"J48/$E$52/3600","v":{"$error":"#VALUE!"}},{"$f":"J52/J51-1","v":{"$error":"#VALUE!"}},null,{"$f":"M48/$E$52/3600","v":{"$error":"#DIV/0!"}},{"$f":"N48/$E$52/3600","v":{"$error":"#DIV/0!"}},{"$f":"O48/$E$52/3600","v":0}]
[]
[]
[null,null,null,null,null,null,null,500,500,500]
[null,null,"VIANDES PRE EMBALLES",null,"TRES FORT","ALTITUDE DU SITE (m)",null,50,50,50]
[null,null,"VOLAILLES PREEMBALLEES",null,"FORT","PRESSION TOTALE P (Pa)",null,{"$f":"1.19745*10^-8*(288.15-0.0065*H56)^5.25588","v":100726.03972155297},{"$f":"1.19745*10^-8*(288.15-0.0065*I56)^5.25588","v":100726.03972155297},{"$f":"1.19745*10^-8*(288.15-0.0065*J56)^5.25588","v":100726.03972155297}]
[null,null,"CARCASSES",null,"MOYEN","POINT",null,"EXT","INT","SAS"]
[null,null,"CHARCUTERIE PREEMBALLE",null,"FAIBLE","t","Température sèche",{"$f":"G2","v":{"$error":"#VALUE!"}},{"$f":"G4","v":1},{"$f":"J4","v":10}]
[null,null,"TRAITEUR",null,null,"F ( % )","Humidité relatice",50,{"$f":"G5","v":75},{"$f":"J5","v":60}]
[null,null,"CHARIOTS PLATS CUISINES",null,null,"T","Température absolue",{"$f":"H59+273.15","v":{"$error":"#VALUE!"}},{"$f":"I59+273.15","v":274.14999999999998},{"$f":"J59+273.15","v":283.14999999999998}]
[null,null,"PATISSERIE FRAICHE",null,"OUI",null,"Pvs si t<0°C",{"$f":"EXP(-5674.359/H61+6.3925247-0.009677843*H61+0.00000062215701*H61^2+0.0000000020747825*H61^3-0.0000000000009484024*H61^4+4.1635019*LN(H61))","v":{"$error":"#VALUE!"}},{"$f":"EXP(-5674.359/I61+6.3925247-0.009677843*I61+0.00000062215701*I61^2+0.0000000020747825*I61^3-0.0000000000009484024*I61^4+4.1635019*LN(I61))","v":663.83716861660616},{"$f":"EXP(-5674.359/J61+6.3925247-0.009677843*J61+0.00000062215701*J61^2+0.0000000020747825*J61^3-0.0000000000009484024*J61^4+4.1635019*LN(J61))","v":1352.9554923109872}]
[null,null,"POISSONS SUR GLACE",null,"NON",null,"Pvs si t>0°C",{"$f":"EXP(-5800.2206/H61+1.3914993-0.048640239*H61+0.000041764768*H61^2-0.000000014452093*H61^3+6.5459673*LN(H61))","v":{"$error":"#VALUE!"}},{"$f":"EXP(-5800.2206/I61+1.3914993-0.048640239*I61+0.000041764768*I61^2-0.000000014452093*I61^3+6.5459673*LN(I61))","v":657.07171798138165},{"$f":"EXP(-5800.2206/J61+1.3914993-0.048640239*J61+0.000041764768*J61^2-0.000000014452093*J61^3+6.5459673*LN(J61))","v":1227.9952754407796}]
[null,null,"FRUITS ET LEGUMES",null,null,"Pws","Pression partielle de vapeur à saturation",{"$f":"IF(H61<273.15,H62,H63)","v":{"$error":"#VALUE!"}},{"$f":"IF(I61<273.15,I62,I63)","v":657.07171798138165},{"$f":"IF(J61<273.15,J62,J63)","v":1227.9952754407796}]
[null,null,"BOF EMBALLES",null,null,"Pv","Pression partielle de vapeur non saturé",{"$f":"H64*H60/100","v":{"$error":"#VALUE!"}},{"$f":"I64*I60/100","v":492.80378848603618},{"$f":"J64*J60/100","v":736.79716526446782}]
[null,null,"FROMAGE",null,null,"Pa","Pression partielle de l'air sec",{"$f":"$H$57-H65","v":{"$error":"#VALUE!"}},{"$f":"$H$57-I65","v":100233.23593306693},{"$f":"$H$57-J65","v":99989.242556288504}]
[null,null,"BOISSONS",null,null,"w","Humidité absolue non saturée",{"$f":"0.62198*H65/($H$57-H65)","v":{"$error":"#VALUE!"}},{"$f":"0.62198*I65/($H$57-I65)","v":3.0580086286671085E-3},{"$f":"0.62198*J65/($H$57-J65)","v":4.5832240462588851E-3}]
[null,null,"POUBELLES GRASSES",null,null,"ws","Humidité absolue à saturation",{"$f":"0.62198*H64/($H$57-H64)","v":{"$error":"#VALUE!"}},{"$f":"0.62198*I64/($H$57-I64)","v":4.0840379920323881E-3},{"$f":"0.62198*J64/($H$57-J64)","v":7.676417216745615E-3}]
[null,null,"PRODUITS SURGELES",null,null,"RO","Masse volumique de l'air sec",{"$f":"(1+H67)/H70","v":{"$error":"#VALUE!"}},{"$f":"(1+I67)/I70","v":1.2773688378889776},{"$f":"(1+J67)/J70","v":1.235632662064539}]
[null,null,"CREMES GLACEES",null,null,"v'","Volume massique de l'air humide",{"$f":"0.2871*H61*(1+1.6078*H67)/$H$57*1000","v":{"$error":"#VALUE!"}},{"$f":"0.2871*I61*(1+1.6078*I67)/$H$57*1000","v":0.78525323217243526},{"$f":"0.2871*J61*(1+1.6078*J67)/$H$57*1000","v":0.81301122484716892}]
[null,null,"SAS"]
[null,null,"LABO DECOUPE",null,null,"h","Enthalpie",{"$f":"1.006*H59+H67*(2500.8+1.805*H59)","v":{"$error":"#VALUE!"}},{"$f":"1.006*I59+I67*(2500.8+1.805*I59)","v":8.6589876841454494},{"$f":"1.006*J59+J67*(2500.8+1.805*J59)","v":21.604453888919195}]
[null,null,"LABO DECOUPE EMBALLAGE"]
[null,null,"LABO EMBALLAGE"]
[]
[]
[]
[]
[null,null,"Désignation","Température","Dimensions",null,null,null,null,"Evaporateurs"]
[null,null,null,null,"Hygrométrie","Longeur","largeur","Surface","hauteur","Volume","Puissance minimum requise",{"$f":"\"à \"&ROUND(D20,0)*100 &\" % de charge en surface\"","v":{"$error":"#DIV/0!"}},"Maximum de charge 50 %","Minimum de charge","DT de sélection","Nbre","Type","Vitesse ventilation","Dégivrage"]
[]
[null,{"$f":"D1","v":"CFP 01"},{"$f":"E1","v":"FRAIS LS"},{"$f":"G4","v":1},{"$f":"G5","v":75},{"$f":"E2","v":0},{"$f":"E3","v":0},{"$f":"surface","v":0},{"$f":"hauteur","v":0},{"$f":"volume","v":0},{"$f":"J52*1000","v":{"$error":"#VALUE!"}},{"$f":"J51*1000","v":{"$error":"#VALUE!"}},{"$f":"N52*1000","v":{"$error":"#DIV/0!"}},{"$f":"O52*1000","v":0},{"$error":"#N/A"},1,{"$f":"IF(OR(LABO=\"oui\",H1=\"SAS\"),\"DOUBLE FLUX\",IF(K82<2000,\"PLAFONNIER\",IF(AND(G5<80,K82<7000),\"PLAFONNIER\",\"CUBIQUE\")))","v":{"$error":"#VALUE!"}},{"$f":"IF(AND(Q82=\"DOUBLE FLUX\",LABO=\"OUI\"),1000,1500)","v":{"$error":"#VALUE!"}},{"$f":"IF(D82>1,\"Naturel\",\"Electrique\")","v":"Electrique"}]
[]
[]
[null,null,null,null,null,null,null,null,null,null,{"$f":"K82/H82","v":{"$error":"#VALUE!"}}]

{"sheet":"Table CFP 7","index":28,"n_rows":85,"n_cols":19,"rows_kept":85,"cut":false,"hidden":true,"merged":[[17,3,18,3],[78,2,79,2],[78,3,79,3],[78,4,78,8],[78,9,78,14],[0,0,5,0],[0,1,5,1],[0,5,0,6],[0,7,0,10],[1,7,2,7],[1,9,1,10],[2,8,2,9],[3,7,4,7],[3,10,4,10]]}
["ENTREES","CALCULS","CHAMBRE FROIDE","CFP 01","FRAIS LS","PRODUITS TRAITES",null,{"$f":"'Chambres positives'!K5","v":0}]
[null,null,"Largeur",null,{"$f":"'Chambres positives'!K8","v":0},"TEMPERATURE",{"$f":"Informations!G25","v":{"$error":"#VALUE!"}},"EXT","REP"]
[null,null,"Longueur",null,{"$f":"'Chambres positives'!K9","v":0},"HUMIDITE ",50,null,"COEF TRANSMISSION",null,0.3]
[null,null,"Hauteur sous plafond",null,{"$f":"'Chambres positives'!K10","v":0},"TEMPERATURE",9.9999999999999995E-7,"INT","TEMPERATURE",10,"SAS",null,"CHARGEMENT","CHARGEMENT","NUIT"]
[null,null,"Surface",null,{"$f":"E3*E2","v":0},"HUMIDITE ",80,null,"HUMIDITE ",60,null,null,0.5,0.75,"Activité 0"]
[null,null,"Volume",null,{"$f":"E5*E4","v":0},"CAPACITE CF",0,"LABO","NON",null,"NON"]
[null,null,"BILAN ",null,null,"Text","T in","k","Apport","Apport"]
[null,null,"Déperditions",null,"m2","°C","°C","W/m2/K","W","kJ/24h"]
[null,null,"Mur droit","S1",{"$f":"E2*E4","v":0},35,{"$f":"$G$4","v":9.9999999999999995E-7},{"$f":"$K$3","v":0.3},{"$f":"H9*E9*(F9-G9)","v":0},{"$f":"I9*3600*24/1000","v":0},null,null,null,null,{"$f":"H9*(F9-5-G9)*E9","v":0}]
[null,null,"Mur gauche","S2",{"$f":"+E9","v":0},35,9.9999999999999995E-7,{"$f":"$K$3","v":0.3},0,0,null,null,null,null,{"$f":"H10*(F10-5-G10)*E10","v":0}]
[null,null,"Mur fond","S3",{"$f":"E3*E4","v":0},15,9.9999999999999995E-7,{"$f":"$K$3","v":0.3},0,0,null,null,null,null,{"$f":"H11*(F11-5-G11)*E11","v":0}]
[null,null,"Mur avant","S4",{"$f":"E11","v":0},35,9.9999999999999995E-7,0.5,0,0,null,null,null,null,{"$f":"H12*(F12-5-G12)*E12","v":0}]
[null,null,"Plafond","S5",{"$f":"E5","v":0},35,9.9999999999999995E-7,{"$f":"$K$3","v":0.3},0,0,null,null,null,null,{"$f":"H13*(F13-5-G13)*E13","v":0}]
[null,null,"Plancher","S6",{"$f":"E5","v":0},15,9.9999999999999995E-7,0.2,0,0,null,null,null,null,{"$f":"H14*(F14-G14)*E14","v":0}]
[null,null,"Linéïques",0.1,null,null,null,null,{"$f":"D15*SUM(I9:I14)","v":0},{"$f":"D15*SUM(J9:J14)","v":0}]
[null,null,"Sous total",null,null,null,null,null,{"$f":"SUM(I9:I15)","v":0},{"$f":"I16*24*3.6","v":0},{"$f":"J16/$J$48","v":{"$error":"#VALUE!"}},null,{"$f":"J16","v":0},{"$f":"J16","v":0},{"$f":"SUM(O9:O15)*24*3.6","v":0}]
[]
[null,null,"Entrés","% de charge","kg/jour","T entrée","T stockage","Cp","Apport","Apport"]
[null,null,"Surcharge kg/jour",null,"Débit","°C","°C","kJ/kg/K","W","kJ/24h"]
[null,null,0,{"$error":"#DIV/0!"},0,7,{"$f":"G4","v":9.9999999999999995E-7},3.3484000000000003,{"$f":"H20*(E20+C20 )*(F20-G20)/3600/12*1000","v":0},{"$f":"(C20+E20)*H20*(F20-G20)","v":0},{"$f":"J20/$J$48","v":{"$error":"#VALUE!"}},null,{"$f":"IF(LABO=\"non\",J20/E20*G6*$M$5,0)","v":{"$error":"#DIV/0!"}},{"$f":"IF(LABO=\"non\",J20/E20*G6*$N$5,0)","v":{"$error":"#DIV/0!"}},0]
[null,null,"Chaleur respiration",null,"Capacité",null,null,"Chaleur respiration","Apport","Apport"]
[null,null,{"$f":"H1","v":0},null,"Chambre",null,null,"kJ/kg en 24 h","W","kJ/24h"]
[null,null,0,null,{"$f":"capacité","v":0},null,null,{"$f":"C23","v":0},{"$f":"J23/24/3600","v":0},{"$f":"H23*E23","v":0},{"$f":"J23/$J$48","v":{"$error":"#VALUE!"}},null,{"$f":"+J23","v":0},{"$f":"J23","v":0},{"$f":"J23","v":0}]
[]
[null,null,"Travail ventilateurs",null,"Volume chambre","Taux de brassage","Débit air brassé","Puissance ventilateur","Apport","Apport"]
[null,null,null,null,"m3","sd","m3","W","W","kJ/24h"]
[null,null,null,null,{"$f":"volume","v":0},30,{"$f":"F27*E6","v":0},{"$f":"I27","v":0},{"$f":"G27*0.1","v":0},{"$f":"I27/1000*24*3600","v":0},{"$f":"J27/$J$48","v":{"$error":"#VALUE!"}},null,{"$f":"J27","v":0},{"$f":"J27","v":0},{"$f":"J27","v":0}]
[]
[null,null,"Air neuf",null,"Renouvellement","Vol massique","Enthalpie Ext","Enthalpie Int","Apport","Apport"]
[null,null,"Activité chambre",null,"m3/24h","m3/kg","kJ/kg","kJ/kg","W","kJ/24h"]
[null,null,"FORT",null,{"$error":"#N/A"},{"$f":"IF(K6=\"NON\",H69,J69)","v":{"$error":"#VALUE!"}},{"$f":"IF(K6=\"NON\",H72,J72)","v":{"$error":"#VALUE!"}},{"$f":"I72","v":7.5876900994933534},{"$f":"(G31-H31)/F31*E31/(24*3600)*1000","v":{"$error":"#VALUE!"}},{"$f":"(G31-H31)/F31*E31","v":{"$error":"#VALUE!"}},{"$f":"J31/$J$48","v":{"$error":"#VALUE!"}},null,{"$f":"J31","v":{"$error":"#VALUE!"}},{"$f":"J31","v":{"$error":"#VALUE!"}},0]
[null,null,"Taux de renouvellement",{"$f":"E31/volume","v":{"$error":"#N/A"}},"Vol/jour",{"$f":"D32/24","v":{"$error":"#N/A"}},"Vol/h"]
[]
[null,null,"Eclairage",null,"Surface","Ratio","Nb heures fonction",null,"Apport","Apport"]
[null,null,null,null,"m2"," W/m2","h",null,"W","kJ/24h"]
[null,null,null,null,{"$f":"surface","v":0},{"$f":"IF(LABO=\"oui\",0,10)","v":10},4,null,{"$f":"F36*E36","v":0},{"$f":"I36*3600*G36/1000","v":0},{"$f":"J36/$J$48","v":{"$error":"#VALUE!"}},null,{"$f":"J36","v":0},{"$f":"J36","v":0},"."]
[]
[null,null,"Personnel"]
[null,null,null,null,"Nombre","Ratio","Nb heures fonction",null,"Apport","Apport"]
[null,null,null,null,"personne","W/p","h",null,"W","kJ/24h"]
[null,null,null,null,0,400,4,null,{"$f":"F41*E41","v":0},{"$f":"I41*3600*G41/1000","v":0},{"$f":"J41/$J$48","v":{"$error":"#VALUE!"}},null,{"$f":"J41","v":0},{"$f":"J41","v":0},0]
[]
[null,null,"Machines",null,null,"Nb heures fonction",null,null,"Apport","Apport"]
[null,null,null,null,"W","h",null,null,"W","kJ/24h"]
[null,null,null,null,0,{"$f":"IF(I6=\"OUI\",10,0)","v":0},null,null,{"$f":"E45","v":0},{"$f":"I45*3600*F45/1000","v":0},{"$f":"J45/$J$48","v":{"$error":"#VALUE!"}},null,{"$f":"J45","v":0},{"$f":"J45","v":0},{"$f":"J45","v":0}]
[null,null,"Divers",null,0,null,null,null,{"$f":"E46","v":0},{"$f":"I46*3600*24/1000","v":0},{"$f":"J46/$J$48","v":{"$error":"#VALUE!"}},null,{"$f":"J46","v":0},{"$f":"J46","v":0},{"$f":"J46","v":0}]
[]
[null,null,"TOTAL",null,null,null,null,null,{"$f":"I16+I20+I23+I27+I31+I36+I41+I45+I46","v":{"$error":"#VALUE!"}},{"$f":"SUM(J16:J46)","v":{"$error":"#VALUE!"}},{"$f":"SUM(K16:K46)","v":{"$error":"#VALUE!"}},null,{"$f":"SUM(M16:M46)","v":{"$error":"#DIV/0!"}},{"$f":"SUM(N16:N46)","v":{"$error":"#DIV/0!"}},{"$f":"SUM(O16:O46)","v":0}]
[]
[null,null,null,null,"Nombres d'heures de fonctionnement groupes h/jour",null,null,null,"Bilan Chaleur Latente kW"," Bilan production kW",null,null," Bilan production kW"," Bilan production kW"," Bilan production kW"]
[null,null,"PRODUCTION",null,18,"Ratio",{"$f":"J51*1000/E14","v":{"$error":"#VALUE!"}},"W/m2",{"$f":"IF(K6=\"oui\",2501*(J67-I67)*E31/F31/E51/3600,2500.8*(H67-I67)*E31/F31/E51/3600)","v":{"$error":"#VALUE!"}},{"$f":"J48/$E$51/3600","v":{"$error":"#VALUE!"}},null,null,{"$f":"M48/$E$51/3600","v":{"$error":"#DIV/0!"}},{"$f":"N48/$E$51/3600","v":{"$error":"#DIV/0!"}},{"$f":"O48/$E$51/3600","v":0}]
[null,null,"EMISSION",null,16,null,{"$f":"J52*1000/E14","v":{"$error":"#VALUE!"}},null,{"$f":"I51/J51","v":{"$error":"#VALUE!"}},{"$f":"J48/$E$52/3600","v":{"$error":"#VALUE!"}},{"$f":"J52/J51-1","v":{"$error":"#VALUE!"}},null,{"$f":"M48/$E$52/3600","v":{"$error":"#DIV/0!"}},{"$f":"N48/$E$52/3600","v":{"$error":"#DIV/0!"}},{"$f":"O48/$E$52/3600","v":0}]
[]
[]
[null,null,null,null,null,null,null,500,500,500]
[null,null,"VIANDES PRE EMBALLES",null,"TRES FORT","ALTITUDE DU SITE (m)",null,50,50,50]
[null,null,"VOLAILLES PREEMBALLEES",null,"FORT","PRESSION TOTALE P (Pa)",null,{"$f":"1.19745*10^-8*(288.15-0.0065*H56)^5.25588","v":100726.03972155297},{"$f":"1.19745*10^-8*(288.15-0.0065*I56)^5.25588","v":100726.03972155297},{"$f":"1.19745*10^-8*(288.15-0.0065*J56)^5.25588","v":100726.03972155297}]
[null,null,"CARCASSES",null,"MOYEN","POINT",null,"EXT","INT","SAS"]
[null,null,"CHARCUTERIE PREEMBALLE",null,"FAIBLE","t","Température sèche",{"$f":"G2","v":{"$error":"#VALUE!"}},{"$f":"G4","v":9.9999999999999995E-7},{"$f":"J4","v":10}]
[null,null,"TRAITEUR",null,null,"F ( % )","Humidité relatice",50,{"$f":"G5","v":80},{"$f":"J5","v":60}]
[null,null,"CHARIOTS PLATS CUISINES",null,null,"T","Température absolue",{"$f":"H59+273.15","v":{"$error":"#VALUE!"}},{"$f":"I59+273.15","v":273.15000099999997},{"$f":"J59+273.15","v":283.14999999999998}]
[null,null,"PATISSERIE FRAICHE",null,"OUI",null,"Pvs si t<0°C",{"$f":"EXP(-5674.359/H61+6.3925247-0.009677843*H61+0.00000062215701*H61^2+0.0000000020747825*H61^3-0.0000000000009484024*H61^4+4.1635019*LN(H61))","v":{"$error":"#VALUE!"}},{"$f":"EXP(-5674.359/I61+6.3925247-0.009677843*I61+0.00000062215701*I61^2+0.0000000020747825*I61^3-0.0000000000009484024*I61^4+4.1635019*LN(I61))","v":611.54955052849118},{"$f":"EXP(-5674.359/J61+6.3925247-0.009677843*J61+0.00000062215701*J61^2+0.0000000020747825*J61^3-0.0000000000009484024*J61^4+4.1635019*LN(J61))","v":1352.9554923109872}]
[null,null,"POISSONS SUR GLACE",null,"NON",null,"Pvs si t>0°C",{"$f":"EXP(-5800.2206/H61+1.3914993-0.048640239*H61+0.000041764768*H61^2-0.000000014452093*H61^3+6.5459673*LN(H61))","v":{"$error":"#VALUE!"}},{"$f":"EXP(-5800.2206/I61+1.3914993-0.048640239*I61+0.000041764768*I61^2-0.000000014452093*I61^3+6.5459673*LN(I61))","v":611.21291185293046},{"$f":"EXP(-5800.2206/J61+1.3914993-0.048640239*J61+0.000041764768*J61^2-0.000000014452093*J61^3+6.5459673*LN(J61))","v":1227.9952754407796}]
[null,null,"FRUITS ET LEGUMES",null,null,"Pws","Pression partielle de vapeur à saturation",{"$f":"IF(H61<273.15,H62,H63)","v":{"$error":"#VALUE!"}},{"$f":"IF(I61<273.15,I62,I63)","v":611.21291185293046},{"$f":"IF(J61<273.15,J62,J63)","v":1227.9952754407796}]
[null,null,"BOF EMBALLES",null,null,"Pv","Pression partielle de vapeur non saturé",{"$f":"H64*H60/100","v":{"$error":"#VALUE!"}},{"$f":"I64*I60/100","v":488.97032948234437},{"$f":"J64*J60/100","v":736.79716526446782}]
[null,null,"FROMAGE",null,null,"Pa","Pression partielle de l'air sec",{"$f":"$H$57-H65","v":{"$error":"#VALUE!"}},{"$f":"$H$57-I65","v":100237.06939207063},{"$f":"$H$57-J65","v":99989.242556288504}]
[null,null,"BOISSONS",null,null,"w","Humidité absolue non saturée",{"$f":"0.62198*H65/($H$57-H65)","v":{"$error":"#VALUE!"}},{"$f":"0.62198*I65/($H$57-I65)","v":3.0341047216957749E-3},{"$f":"0.62198*J65/($H$57-J65)","v":4.5832240462588851E-3}]
[null,null,"POUBELLES GRASSES",null,null,"ws","Humidité absolue à saturation",{"$f":"0.62198*H64/($H$57-H64)","v":{"$error":"#VALUE!"}},{"$f":"0.62198*I64/($H$57-I64)","v":3.7972617945681957E-3},{"$f":"0.62198*J64/($H$57-J64)","v":7.676417216745615E-3}]
[null,null,"PRODUITS SURGELES",null,null,"RO","Masse volumique de l'air sec",{"$f":"(1+H67)/H70","v":{"$error":"#VALUE!"}},{"$f":"(1+I67)/I70","v":1.2820637500945116},{"$f":"(1+J67)/J70","v":1.235632662064539}]
[null,null,"CREMES GLACEES",null,null,"v'","Volume massique de l'air humide",{"$f":"0.2871*H61*(1+1.6078*H67)/$H$57*1000","v":{"$error":"#VALUE!"}},{"$f":"0.2871*I61*(1+1.6078*I67)/$H$57*1000","v":0.78235899318403923},{"$f":"0.2871*J61*(1+1.6078*J67)/$H$57*1000","v":0.81301122484716892}]
[null,null,"SAS"]
[null,null,"LABO DECOUPE",null,null,"h","Enthalpie",{"$f":"1.006*H59+H67*(2500.8+1.805*H59)","v":{"$error":"#VALUE!"}},{"$f":"1.006*I59+I67*(2500.8+1.805*I59)","v":7.5876900994933534},{"$f":"1.006*J59+J67*(2500.8+1.805*J59)","v":21.604453888919195}]
[null,null,"LABO DECOUPE EMBALLAGE"]
[null,null,"LABO EMBALLAGE"]
[]
[]
[]
[]
[null,null,"Désignation","Température","Dimensions",null,null,null,null,"Evaporateurs"]
[null,null,null,null,"Hygrométrie","Longeur","largeur","Surface","hauteur","Volume","Puissance minimum requise",{"$f":"\"à \"&ROUND(D20,0)*100 &\" % de charge en surface\"","v":{"$error":"#DIV/0!"}},"Maximum de charge 50 %","Minimum de charge","DT de sélection","Nbre","Type","Vitesse ventilation","Dégivrage"]
[]
[null,{"$f":"D1","v":"CFP 01"},{"$f":"E1","v":"FRAIS LS"},{"$f":"G4","v":9.9999999999999995E-7},{"$f":"G5","v":80},{"$f":"E2","v":0},{"$f":"E3","v":0},{"$f":"surface","v":0},{"$f":"hauteur","v":0},{"$f":"volume","v":0},{"$f":"J52*1000","v":{"$error":"#VALUE!"}},{"$f":"J51*1000","v":{"$error":"#VALUE!"}},{"$f":"N52*1000","v":{"$error":"#DIV/0!"}},{"$f":"O52*1000","v":0},{"$error":"#N/A"},1,{"$f":"IF(OR(LABO=\"oui\",H1=\"SAS\"),\"DOUBLE FLUX\",IF(K82<2000,\"PLAFONNIER\",IF(AND(G5<80,K82<7000),\"PLAFONNIER\",\"CUBIQUE\")))","v":{"$error":"#VALUE!"}},{"$f":"IF(AND(Q82=\"DOUBLE FLUX\",LABO=\"OUI\"),1000,1500)","v":{"$error":"#VALUE!"}},{"$f":"IF(D82>1,\"Naturel\",\"Electrique\")","v":"Electrique"}]
[]
[]
[null,null,null,null,null,null,null,null,null,null,{"$f":"K82/H82","v":{"$error":"#VALUE!"}}]

{"sheet":"Table CFP 8","index":29,"n_rows":85,"n_cols":19,"rows_kept":85,"cut":false,"hidden":true,"merged":[[17,3,18,3],[78,2,79,2],[78,3,79,3],[78,4,78,8],[78,9,78,14],[0,0,5,0],[0,1,5,1],[0,5,0,6],[0,7,0,10],[1,7,2,7],[1,9,1,10],[2,8,2,9],[3,7,4,7],[3,10,4,10]]}
["ENTREES","CALCULS","CHAMBRE FROIDE","CFP 01","FRAIS LS","PRODUITS TRAITES",null,{"$f":"'Chambres positives'!L5","v":0}]
[null,null,"Largeur",null,{"$f":"'Chambres positives'!L8","v":0},"TEMPERATURE",{"$f":"Informations!G25","v":{"$error":"#VALUE!"}},"EXT","REP"]
[null,null,"Longueur",null,{"$f":"'Chambres positives'!L9","v":0},"HUMIDITE ",50,null,"COEF TRANSMISSION",null,0.3]
[null,null,"Hauteur sous plafond",null,{"$f":"'Chambres positives'!L10","v":0},"TEMPERATURE",9.9999999999999995E-7,"INT","TEMPERATURE",10,"SAS",null,"CHARGEMENT","CHARGEMENT","NUIT"]
[null,null,"Surface",null,{"$f":"E3*E2","v":0},"HUMIDITE ",90,null,"HUMIDITE ",60,null,null,0.5,0.75,"Activité 0"]
[null,null,"Volume",null,{"$f":"E5*E4","v":0},"CAPACITE CF",0,"LABO","NON",null,"NON"]
[null,null,"BILAN ",null,null,"Text","T in","k","Apport","Apport"]
[null,null,"Déperditions",null,"m2","°C","°C","W/m2/K","W","kJ/24h"]
[null,null,"Mur droit","S1",{"$f":"E2*E4","v":0},35,{"$f":"$G$4","v":9.9999999999999995E-7},{"$f":"$K$3","v":0.3},{"$f":"H9*E9*(F9-G9)","v":0},{"$f":"I9*3600*24/1000","v":0},null,null,null,null,{"$f":"H9*(F9-5-G9)*E9","v":0}]
[null,null,"Mur gauche","S2",{"$f":"+E9","v":0},35,9.9999999999999995E-7,{"$f":"$K$3","v":0.3},0,0,null,null,null,null,{"$f":"H10*(F10-5-G10)*E10","v":0}]
[null,null,"Mur fond","S3",{"$f":"E3*E4","v":0},15,9.9999999999999995E-7,{"$f":"$K$3","v":0.3},0,0,null,null,null,null,{"$f":"H11*(F11-5-G11)*E11","v":0}]
[null,null,"Mur avant","S4",{"$f":"E11","v":0},35,9.9999999999999995E-7,0.5,0,0,null,null,null,null,{"$f":"H12*(F12-5-G12)*E12","v":0}]
[null,null,"Plafond","S5",{"$f":"E5","v":0},35,9.9999999999999995E-7,{"$f":"$K$3","v":0.3},0,0,null,null,null,null,{"$f":"H13*(F13-5-G13)*E13","v":0}]
[null,null,"Plancher","S6",{"$f":"E5","v":0},15,9.9999999999999995E-7,0.2,0,0,null,null,null,null,{"$f":"H14*(F14-G14)*E14","v":0}]
[null,null,"Linéïques",0.1,null,null,null,null,{"$f":"D15*SUM(I9:I14)","v":0},{"$f":"D15*SUM(J9:J14)","v":0}]
[null,null,"Sous total",null,null,null,null,null,{"$f":"SUM(I9:I15)","v":0},{"$f":"I16*24*3.6","v":0},{"$f":"J16/$J$48","v":{"$error":"#VALUE!"}},null,{"$f":"J16","v":0},{"$f":"J16","v":0},{"$f":"SUM(O9:O15)*24*3.6","v":0}]
[]
[null,null,"Entrés","% de charge","kg/jour","T entrée","T stockage","Cp","Apport","Apport"]
[null,null,"Surcharge kg/jour",null,"Débit","°C","°C","kJ/kg/K","W","kJ/24h"]
[null,null,0,{"$error":"#DIV/0!"},0,4,{"$f":"G4","v":9.9999999999999995E-7},3.3484000000000003,{"$f":"H20*(E20+C20 )*(F20-G20)/3600/12*1000","v":0},{"$f":"(C20+E20)*H20*(F20-G20)","v":0},{"$f":"J20/$J$48","v":{"$error":"#VALUE!"}},null,{"$f":"IF(LABO=\"non\",J20/E20*G6*$M$5,0)","v":{"$error":"#DIV/0!"}},{"$f":"IF(LABO=\"non\",J20/E20*G6*$N$5,0)","v":{"$error":"#DIV/0!"}},0]
[null,null,"Chaleur respiration",null,"Capacité",null,null,"Chaleur respiration","Apport","Apport"]
[null,null,{"$f":"H1","v":0},null,"Chambre",null,null,"kJ/kg en 24 h","W","kJ/24h"]
[null,null,0,null,{"$f":"capacité","v":0},null,null,{"$f":"C23","v":0},{"$f":"J23/24/3600","v":0},{"$f":"H23*E23","v":0},{"$f":"J23/$J$48","v":{"$error":"#VALUE!"}},null,{"$f":"+J23","v":0},{"$f":"J23","v":0},{"$f":"J23","v":0}]
[]
[null,null,"Travail ventilateurs",null,"Volume chambre","Taux de brassage","Débit air brassé","Puissance ventilateur","Apport","Apport"]
[null,null,null,null,"m3","sd","m3","W","W","kJ/24h"]
[null,null,null,null,{"$f":"volume","v":0},30,{"$f":"F27*E6","v":0},{"$f":"I27","v":0},{"$f":"G27*0.1","v":0},{"$f":"I27/1000*24*3600","v":0},{"$f":"J27/$J$48","v":{"$error":"#VALUE!"}},null,{"$f":"J27","v":0},{"$f":"J27","v":0},{"$f":"J27","v":0}]
[]
[null,null,"Air neuf",null,"Renouvellement","Vol massique","Enthalpie Ext","Enthalpie Int","Apport","Apport"]
[null,null,"Activité chambre",null,"m3/24h","m3/kg","kJ/kg","kJ/kg","W","kJ/24h"]
[null,null,"FORT",null,{"$error":"#N/A"},{"$f":"IF(K6=\"NON\",H69,J69)","v":{"$error":"#VALUE!"}},{"$f":"IF(K6=\"NON\",H72,J72)","v":{"$error":"#VALUE!"}},{"$f":"I72","v":8.5413594776163269},{"$f":"(G31-H31)/F31*E31/(24*3600)*1000","v":{"$error":"#VALUE!"}},{"$f":"(G31-H31)/F31*E31","v":{"$error":"#VALUE!"}},{"$f":"J31/$J$48","v":{"$error":"#VALUE!"}},null,{"$f":"J31","v":{"$error":"#VALUE!"}},{"$f":"J31","v":{"$error":"#VALUE!"}},0]
[null,null,"Taux de renouvellement",{"$f":"E31/volume","v":{"$error":"#N/A"}},"Vol/jour",{"$f":"D32/24","v":{"$error":"#N/A"}},"Vol/h"]
[]
[null,null,"Eclairage",null,"Surface","Ratio","Nb heures fonction",null,"Apport","Apport"]
[null,null,null,null,"m2"," W/m2","h",null,"W","kJ/24h"]
[null,null,null,null,{"$f":"surface","v":0},{"$f":"IF(LABO=\"oui\",0,10)","v":10},4,null,{"$f":"F36*E36","v":0},{"$f":"I36*3600*G36/1000","v":0},{"$f":"J36/$J$48","v":{"$error":"#VALUE!"}},null,{"$f":"J36","v":0},{"$f":"J36","v":0},"."]
[]
[null,null,"Personnel"]
[null,null,null,null,"Nombre","Ratio","Nb heures fonction",null,"Apport","Apport"]
[null,null,null,null,"personne","W/p","h",null,"W","kJ/24h"]
[null,null,null,null,0,400,4,null,{"$f":"F41*E41","v":0},{"$f":"I41*3600*G41/1000","v":0},{"$f":"J41/$J$48","v":{"$error":"#VALUE!"}},null,{"$f":"J41","v":0},{"$f":"J41","v":0},0]
[]
[null,null,"Machines",null,null,"Nb heures fonction",null,null,"Apport","Apport"]
[null,null,null,null,"W","h",null,null,"W","kJ/24h"]
[null,null,null,null,0,{"$f":"IF(I6=\"OUI\",10,0)","v":0},null,null,{"$f":"E45","v":0},{"$f":"I45*3600*F45/1000","v":0},{"$f":"J45/$J$48","v":{"$error":"#VALUE!"}},null,{"$f":"J45","v":0},{"$f":"J45","v":0},{"$f":"J45","v":0}]
[null,null,"Divers",null,0,null,null,null,{"$f":"E46","v":0},{"$f":"I46*3600*24/1000","v":0},{"$f":"J46/$J$48","v":{"$error":"#VALUE!"}},null,{"$f":"J46","v":0},{"$f":"J46","v":0},{"$f":"J46","v":0}]
[]
[null,null,"TOTAL",null,null,null,null,null,{"$f":"I16+I20+I23+I27+I31+I36+I41+I45+I46","v":{"$error":"#VALUE!"}},{"$f":"SUM(J16:J46)","v":{"$error":"#VALUE!"}},{"$f":"SUM(K16:K46)","v":{"$error":"#VALUE!"}},null,{"$f":"SUM(M16:M46)","v":{"$error":"#DIV/0!"}},{"$f":"SUM(N16:N46)","v":{"$error":"#DIV/0!"}},{"$f":"SUM(O16:O46)","v":0}]
[]
[null,null,null,null,"Nombres d'heures de fonctionnement groupes h/jour",null,null,null,"Bilan Chaleur Latente kW"," Bilan production kW",null,null," Bilan production kW"," Bilan production kW"," Bilan production kW"]
[null,null,"PRODUCTION",null,18,"Ratio",{"$f":"J51*1000/E14","v":{"$error":"#VALUE!"}},"W/m2",{"$f":"IF(K6=\"oui\",2501*(J67-I67)*E31/F31/E51/3600,2500.8*(H67-I67)*E31/F31/E51/3600)","v":{"$error":"#VALUE!"}},{"$f":"J48/$E$51/3600","v":{"$error":"#VALUE!"}},null,null,{"$f":"M48/$E$51/3600","v":{"$error":"#DIV/0!"}},{"$f":"N48/$E$51/3600","v":{"$error":"#DIV/0!"}},{"$f":"O48/$E$51/3600","v":0}]
[null,null,"EMISSION",null,16,null,{"$f":"J52*1000/E14","v":{"$error":"#VALUE!"}},null,{"$f":"I51/J51","v":{"$error":"#VALUE!"}},{"$f":"J48/$E$52/3600","v":{"$error":"#VALUE!"}},{"$f":"J52/J51-1","v":{"$error":"#VALUE!"}},null,{"$f":"M48/$E$52/3600","v":{"$error":"#DIV/0!"}},{"$f":"N48/$E$52/3600","v":{"$error":"#DIV/0!"}},{"$f":"O48/$E$52/3600","v":0}]
[]
[]
[null,null,null,null,null,null,null,500,500,500]
[null,null,"VIANDES PRE EMBALLES",null,"TRES FORT","ALTITUDE DU SITE (m)",null,50,50,50]
[null,null,"VOLAILLES PREEMBALLEES",null,"FORT","PRESSION TOTALE P (Pa)",null,{"$f":"1.19745*10^-8*(288.15-0.0065*H56)^5.25588","v":100726.03972155297},{"$f":"1.19745*10^-8*(288.15-0.0065*I56)^5.25588","v":100726.03972155297},{"$f":"1.19745*10^-8*(288.15-0.0065*J56)^5.25588","v":100726.03972155297}]
[null,null,"CARCASSES",null,"MOYEN","POINT",null,"EXT","INT","SAS"]
[null,null,"CHARCUTERIE PREEMBALLE",null,"FAIBLE","t","Température sèche",{"$f":"G2","v":{"$error":"#VALUE!"}},{"$f":"G4","v":9.9999999999999995E-7},{"$f":"J4","v":10}]
[null,null,"TRAITEUR",null,null,"F ( % )","Humidité relatice",50,{"$f":"G5","v":90},{"$f":"J5","v":60}]
[null,null,"CHARIOTS PLATS CUISINES",null,null,"T","Température absolue",{"$f":"H59+273.15","v":{"$error":"#VALUE!"}},{"$f":"I59+273.15","v":273.15000099999997},{"$f":"J59+273.15","v":283.14999999999998}]
[null,null,"PATISSERIE FRAICHE",null,"OUI",null,"Pvs si t<0°C",{"$f":"EXP(-5674.359/H61+6.3925247-0.009677843*H61+0.00000062215701*H61^2+0.0000000020747825*H61^3-0.0000000000009484024*H61^4+4.1635019*LN(H61))","v":{"$error":"#VALUE!"}},{"$f":"EXP(-5674.359/I61+6.3925247-0.009677843*I61+0.00000062215701*I61^2+0.0000000020747825*I61^3-0.0000000000009484024*I61^4+4.1635019*LN(I61))","v":611.54955052849118},{"$f":"EXP(-5674.359/J61+6.3925247-0.009677843*J61+0.00000062215701*J61^2+0.0000000020747825*J61^3-0.0000000000009484024*J61^4+4.1635019*LN(J61))","v":1352.9554923109872}]
[null,null,"POISSONS SUR GLACE",null,"NON",null,"Pvs si t>0°C",{"$f":"EXP(-5800.2206/H61+1.3914993-0.048640239*H61+0.000041764768*H61^2-0.000000014452093*H61^3+6.5459673*LN(H61))","v":{"$error":"#VALUE!"}},{"$f":"EXP(-5800.2206/I61+1.3914993-0.048640239*I61+0.000041764768*I61^2-0.000000014452093*I61^3+6.5459673*LN(I61))","v":611.21291185293046},{"$f":"EXP(-5800.2206/J61+1.3914993-0.048640239*J61+0.000041764768*J61^2-0.000000014452093*J61^3+6.5459673*LN(J61))","v":1227.9952754407796}]
[null,null,"FRUITS ET LEGUMES",null,null,"Pws","Pression partielle de vapeur à saturation",{"$f":"IF(H61<273.15,H62,H63)","v":{"$error":"#VALUE!"}},{"$f":"IF(I61<273.15,I62,I63)","v":611.21291185293046},{"$f":"IF(J61<273.15,J62,J63)","v":1227.9952754407796}]
[null,null,"BOF EMBALLES",null,null,"Pv","Pression partielle de vapeur non saturé",{"$f":"H64*H60/100","v":{"$error":"#VALUE!"}},{"$f":"I64*I60/100","v":550.09162066763736},{"$f":"J64*J60/100","v":736.79716526446782}]
[null,null,"FROMAGE",null,null,"Pa","Pression partielle de l'air sec",{"$f":"$H$57-H65","v":{"$error":"#VALUE!"}},{"$f":"$H$57-I65","v":100175.94810088533},{"$f":"$H$57-J65","v":99989.242556288504}]
[null,null,"BOISSONS",null,null,"w","Humidité absolue non saturée",{"$f":"0.62198*H65/($H$57-H65)","v":{"$error":"#VALUE!"}},{"$f":"0.62198*I65/($H$57-I65)","v":3.4154504420391232E-3},{"$f":"0.62198*J65/($H$57-J65)","v":4.5832240462588851E-3}]
[null,null,"POUBELLES GRASSES",null,null,"ws","Humidité absolue à saturation",{"$f":"0.62198*H64/($H$57-H64)","v":{"$error":"#VALUE!"}},{"$f":"0.62198*I64/($H$57-I64)","v":3.7972617945681957E-3},{"$f":"0.62198*J64/($H$57-J64)","v":7.676417216745615E-3}]
[null,null,"PRODUITS SURGELES",null,null,"RO","Masse volumique de l'air sec",{"$f":"(1+H67)/H70","v":{"$error":"#VALUE!"}},{"$f":"(1+I67)/I70","v":1.2817691077579871},{"$f":"(1+J67)/J70","v":1.235632662064539}]
[null,null,"CREMES GLACEES",null,null,"v'","Volume massique de l'air humide",{"$f":"0.2871*H61*(1+1.6078*H67)/$H$57*1000","v":{"$error":"#VALUE!"}},{"$f":"0.2871*I61*(1+1.6078*I67)/$H$57*1000","v":0.7828363504540754},{"$f":"0.2871*J61*(1+1.6078*J67)/$H$57*1000","v":0.81301122484716892}]
[null,null,"SAS"]
[null,null,"LABO DECOUPE",null,null,"h","Enthalpie",{"$f":"1.006*H59+H67*(2500.8+1.805*H59)","v":{"$error":"#VALUE!"}},{"$f":"1.006*I59+I67*(2500.8+1.805*I59)","v":8.5413594776163269},{"$f":"1.006*J59+J67*(2500.8+1.805*J59)","v":21.604453888919195}]
[null,null,"LABO DECOUPE EMBALLAGE"]
[null,null,"LABO EMBALLAGE"]
[]
[]
[]
[]
[null,null,"Désignation","Température","Dimensions",null,null,null,null,"Evaporateurs"]
[null,null,null,null,"Hygrométrie","Longeur","largeur","Surface","hauteur","Volume","Puissance minimum requise",{"$f":"\"à \"&ROUND(D20,0)*100 &\" % de charge en surface\"","v":{"$error":"#DIV/0!"}},"Maximum de charge 50 %","Minimum de charge","DT de sélection","Nbre","Type","Vitesse ventilation","Dégivrage"]
[]
[null,{"$f":"D1","v":"CFP 01"},{"$f":"E1","v":"FRAIS LS"},{"$f":"G4","v":9.9999999999999995E-7},{"$f":"G5","v":90},{"$f":"E2","v":0},{"$f":"E3","v":0},{"$f":"surface","v":0},{"$f":"hauteur","v":0},{"$f":"volume","v":0},{"$f":"J52*1000","v":{"$error":"#VALUE!"}},{"$f":"J51*1000","v":{"$error":"#VALUE!"}},{"$f":"N52*1000","v":{"$error":"#DIV/0!"}},{"$f":"O52*1000","v":0},{"$error":"#N/A"},1,{"$f":"IF(OR(LABO=\"oui\",H1=\"SAS\"),\"DOUBLE FLUX\",IF(K82<2000,\"PLAFONNIER\",IF(AND(G5<80,K82<7000),\"PLAFONNIER\",\"CUBIQUE\")))","v":{"$error":"#VALUE!"}},{"$f":"IF(AND(Q82=\"DOUBLE FLUX\",LABO=\"OUI\"),1000,1500)","v":{"$error":"#VALUE!"}},{"$f":"IF(D82>1,\"Naturel\",\"Electrique\")","v":"Electrique"}]
[]
[]
[null,null,null,null,null,null,null,null,null,null,{"$f":"K82/H82","v":{"$error":"#VALUE!"}}]

{"sheet":"Table CFN 1","index":30,"n_rows":85,"n_cols":19,"rows_kept":85,"cut":false,"hidden":true,"merged":[[17,3,18,3],[78,2,79,2],[78,3,79,3],[78,4,78,8],[78,9,78,14],[0,0,5,0],[0,1,5,1],[0,5,0,6],[0,7,0,10],[1,7,2,7],[1,9,1,10],[2,8,2,9],[3,7,4,7],[3,10,4,10]]}
["ENTREES","CALCULS","CHAMBRE FROIDE","CFP 01","FRAIS LS","PRODUITS TRAITES",null,{"$f":"'Chambres négative'!E5","v":0}]
[null,null,"Largeur",null,{"$f":"'Chambres négative'!E8","v":0},"TEMPERATURE",{"$f":"Informations!G25","v":{"$error":"#VALUE!"}},"EXT","REP"]
[null,null,"Longueur",null,{"$f":"'Chambres négative'!E9","v":0},"HUMIDITE ",50,null,"COEF TRANSMISSION",null,0.3]
[null,null,"Hauteur sous plafond",null,{"$f":"'Chambres négative'!E10","v":0},"TEMPERATURE",-25,"INT","TEMPERATURE",10,"SAS",null,"CHARGEMENT","CHARGEMENT","NUIT"]
[null,null,"Surface",null,{"$f":"E3*E2","v":0},"HUMIDITE ",90,null,"HUMIDITE ",60,null,null,0.5,0.75,"Activité 0"]
[null,null,"Volume",null,{"$f":"E5*E4","v":0},"CAPACITE CF",6300,"LABO","NON",null,"NON"]
[null,null,"BILAN ",null,null,"Text","T in","k","Apport","Apport"]
[null,null,"Déperditions",null,"m2","°C","°C","W/m2/K","W","kJ/24h"]
[null,null,"Mur droit","S1",{"$f":"E2*E4","v":0},35,{"$f":"$G$4","v":-25},{"$f":"$K$3","v":0.3},{"$f":"H9*E9*(F9-G9)","v":0},{"$f":"I9*3600*24/1000","v":0},null,null,null,null,{"$f":"H9*(F9-5-G9)*E9","v":0}]
[null,null,"Mur gauche","S2",{"$f":"+E9","v":0},35,-25,{"$f":"$K$3","v":0.3},0,0,null,null,null,null,{"$f":"H10*(F10-5-G10)*E10","v":0}]
[null,null,"Mur fond","S3",{"$f":"E3*E4","v":0},15,-25,{"$f":"$K$3","v":0.3},0,0,null,null,null,null,{"$f":"H11*(F11-5-G11)*E11","v":0}]
[null,null,"Mur avant","S4",{"$f":"E11","v":0},35,-25,0.5,0,0,null,null,null,null,{"$f":"H12*(F12-5-G12)*E12","v":0}]
[null,null,"Plafond","S5",{"$f":"E5","v":0},35,-25,{"$f":"$K$3","v":0.3},0,0,null,null,null,null,{"$f":"H13*(F13-5-G13)*E13","v":0}]
[null,null,"Plancher","S6",{"$f":"E5","v":0},15,-25,0.2,0,0,null,null,null,null,{"$f":"H14*(F14-G14)*E14","v":0}]
[null,null,"Linéïques",0.1,null,null,null,null,{"$f":"D15*SUM(I9:I14)","v":0},{"$f":"D15*SUM(J9:J14)","v":0}]
[null,null,"Sous total",null,null,null,null,null,{"$f":"SUM(I9:I15)","v":0},{"$f":"I16*24*3.6","v":0},{"$f":"J16/$J$48","v":{"$error":"#VALUE!"}},null,{"$f":"J16","v":0},{"$f":"J16","v":0},{"$f":"SUM(O9:O15)*24*3.6","v":0}]
[]
[null,null,"Entrés","% de charge","kg/jour","T entrée","T stockage","Cp","Apport","Apport"]
[null,null,"Surcharge kg/jour",null,"Débit","°C","°C","kJ/kg/K","W","kJ/24h"]
[null,null,0,0.25714285714285712,1620,-18,{"$f":"G4","v":-25},1.8834750000000002,{"$f":"H20*(E20+C20 )*(F20-G20)/3600/12*1000","v":494.41218750000007},{"$f":"(C20+E20)*H20*(F20-G20)","v":21358.606500000002},{"$f":"J20/$J$48","v":{"$error":"#VALUE!"}},null,{"$f":"IF(LABO=\"non\",J20/E20*G6*$M$5,0)","v":41530.623750000006},{"$f":"IF(LABO=\"non\",J20/E20*G6*$N$5,0)","v":62295.935625000013},0]
[null,null,"Chaleur respiration",null,"Capacité",null,null,"Chaleur respiration","Apport","Apport"]
[null,null,{"$f":"H1","v":0},null,"Chambre",null,null,"kJ/kg en 24 h","W","kJ/24h"]
[null,null,0,null,{"$f":"capacité","v":6300},null,null,{"$f":"C23","v":0},{"$f":"J23/24/3600","v":0},{"$f":"H23*E23","v":0},{"$f":"J23/$J$48","v":{"$error":"#VALUE!"}},null,{"$f":"+J23","v":0},{"$f":"J23","v":0},{"$f":"J23","v":0}]
[]
[null,null,"Travail ventilateurs",null,"Volume chambre","Taux de brassage","Débit air brassé","Puissance ventilateur","Apport","Apport"]
[null,null,null,null,"m3","sd","m3","W","W","kJ/24h"]
[null,null,null,null,{"$f":"volume","v":0},30,{"$f":"F27*E6","v":0},{"$f":"I27","v":0},{"$f":"G27*0.1","v":0},{"$f":"I27/1000*24*3600","v":0},{"$f":"J27/$J$48","v":{"$error":"#VALUE!"}},null,{"$f":"J27","v":0},{"$f":"J27","v":0},{"$f":"J27","v":0}]
[]
[null,null,"Air neuf",null,"Renouvellement","Vol massique","Enthalpie Ext","Enthalpie Int","Apport","Apport"]
[null,null,"Activité chambre",null,"m3/24h","m3/kg","kJ/kg","kJ/kg","W","kJ/24h"]
[null,null,"FORT",null,750,{"$f":"IF(K6=\"NON\",H69,J69)","v":{"$error":"#VALUE!"}},{"$f":"IF(K6=\"NON\",H72,J72)","v":{"$error":"#VALUE!"}},{"$f":"I72","v":-24.285166156617269},{"$f":"(G31-H31)/F31*E31/(24*3600)*1000","v":{"$error":"#VALUE!"}},{"$f":"(G31-H31)/F31*E31","v":{"$error":"#VALUE!"}},{"$f":"J31/$J$48","v":{"$error":"#VALUE!"}},null,{"$f":"J31","v":{"$error":"#VALUE!"}},{"$f":"J31","v":{"$error":"#VALUE!"}},0]
[null,null,"Taux de renouvellement",{"$f":"E31/volume","v":{"$error":"#DIV/0!"}},"Vol/jour",{"$f":"D32/24","v":{"$error":"#DIV/0!"}},"Vol/h"]
[]
[null,null,"Eclairage",null,"Surface","Ratio","Nb heures fonction",null,"Apport","Apport"]
[null,null,null,null,"m2"," W/m2","h",null,"W","kJ/24h"]
[null,null,null,null,{"$f":"surface","v":0},{"$f":"IF(LABO=\"oui\",0,10)","v":10},4,null,{"$f":"F36*E36","v":0},{"$f":"I36*3600*G36/1000","v":0},{"$f":"J36/$J$48","v":{"$error":"#VALUE!"}},null,{"$f":"J36","v":0},{"$f":"J36","v":0},"."]
[]
[null,null,"Personnel"]
[null,null,null,null,"Nombre","Ratio","Nb heures fonction",null,"Apport","Apport"]
[null,null,null,null,"personne","W/p","h",null,"W","kJ/24h"]
[null,null,null,null,0,400,4,null,{"$f":"F41*E41","v":0},{"$f":"I41*3600*G41/1000","v":0},{"$f":"J41/$J$48","v":{"$error":"#VALUE!"}},null,{"$f":"J41","v":0},{"$f":"J41","v":0},0]
[]
[null,null,"Machines",null,null,"Nb heures fonction",null,null,"Apport","Apport"]
[null,null,null,null,"W","h",null,null,"W","kJ/24h"]
[null,null,null,null,0,{"$f":"IF(I6=\"OUI\",10,0)","v":0},null,null,{"$f":"E45","v":0},{"$f":"I45*3600*F45/1000","v":0},{"$f":"J45/$J$48","v":{"$error":"#VALUE!"}},null,{"$f":"J45","v":0},{"$f":"J45","v":0},{"$f":"J45","v":0}]
[null,null,"Divers",null,0,null,null,null,{"$f":"E46","v":0},{"$f":"I46*3600*24/1000","v":0},{"$f":"J46/$J$48","v":{"$error":"#VALUE!"}},null,{"$f":"J46","v":0},{"$f":"J46","v":0},{"$f":"J46","v":0}]
[]
[null,null,"TOTAL",null,null,null,null,null,{"$f":"I16+I20+I23+I27+I31+I36+I41+I45+I46","v":{"$error":"#VALUE!"}},{"$f":"SUM(J16:J46)","v":{"$error":"#VALUE!"}},{"$f":"SUM(K16:K46)","v":{"$error":"#VALUE!"}},null,{"$f":"SUM(M16:M46)","v":{"$error":"#VALUE!"}},{"$f":"SUM(N16:N46)","v":{"$error":"#VALUE!"}},{"$f":"SUM(O16:O46)","v":0}]
[]
[null,null,null,null,"Nombres d'heures de fonctionnement groupes h/jour",null,null,null,"Bilan Chaleur Latente kW"," Bilan production kW",null,null," Bilan production kW"," Bilan production kW"," Bilan production kW"]
[null,null,"PRODUCTION",null,18,"Ratio",{"$f":"J51*1000/E14","v":{"$error":"#VALUE!"}},"W/m2",{"$f":"IF(K6=\"oui\",2501*(J67-I67)*E31/F31/E51/3600,2500.8*(H67-I67)*E31/F31/E51/3600)","v":{"$error":"#VALUE!"}},{"$f":"J48/$E$51/3600","v":{"$error":"#VALUE!"}},null,null,{"$f":"M48/$E$51/3600","v":{"$error":"#VALUE!"}},{"$f":"N48/$E$51/3600","v":{"$error":"#VALUE!"}},{"$f":"O48/$E$51/3600","v":0}]
[null,null,"EMISSION",null,16,null,{"$f":"J52*1000/E14","v":{"$error":"#VALUE!"}},null,{"$f":"I51/J51","v":{"$error":"#VALUE!"}},{"$f":"J48/$E$52/3600","v":{"$error":"#VALUE!"}},{"$f":"J52/J51-1","v":{"$error":"#VALUE!"}},null,{"$f":"M48/$E$52/3600","v":{"$error":"#VALUE!"}},{"$f":"N48/$E$52/3600","v":{"$error":"#VALUE!"}},{"$f":"O48/$E$52/3600","v":0}]
[]
[]
[null,null,null,null,null,null,null,500,500,500]
[null,null,"VIANDES PRE EMBALLES",null,"TRES FORT","ALTITUDE DU SITE (m)",null,50,50,50]
[null,null,"VOLAILLES PREEMBALLEES",null,"FORT","PRESSION TOTALE P (Pa)",null,{"$f":"1.19745*10^-8*(288.15-0.0065*H56)^5.25588","v":100726.03972155297},{"$f":"1.19745*10^-8*(288.15-0.0065*I56)^5.25588","v":100726.03972155297},{"$f":"1.19745*10^-8*(288.15-0.0065*J56)^5.25588","v":100726.03972155297}]
[null,null,"CARCASSES",null,"MOYEN","POINT",null,"EXT","INT","SAS"]
[null,null,"CHARCUTERIE PREEMBALLE",null,"FAIBLE","t","Température sèche",{"$f":"G2","v":{"$error":"#VALUE!"}},{"$f":"G4","v":-25},{"$f":"J4","v":10}]
[null,null,"TRAITEUR",null,null,"F ( % )","Humidité relatice",50,{"$f":"G5","v":90},{"$f":"J5","v":60}]
[null,null,"CHARIOTS PLATS CUISINES",null,null,"T","Température absolue",{"$f":"H59+273.15","v":{"$error":"#VALUE!"}},{"$f":"I59+273.15","v":248.14999999999998},{"$f":"J59+273.15","v":283.14999999999998}]
[null,null,"PATISSERIE FRAICHE",null,"OUI",null,"Pvs si t<0°C",{"$f":"EXP(-5674.359/H61+6.3925247-0.009677843*H61+0.00000062215701*H61^2+0.0000000020747825*H61^3-0.0000000000009484024*H61^4+4.1635019*LN(H61))","v":{"$error":"#VALUE!"}},{"$f":"EXP(-5674.359/I61+6.3925247-0.009677843*I61+0.00000062215701*I61^2+0.0000000020747825*I61^3-0.0000000000009484024*I61^4+4.1635019*LN(I61))","v":63.334271628972786},{"$f":"EXP(-5674.359/J61+6.3925247-0.009677843*J61+0.00000062215701*J61^2+0.0000000020747825*J61^3-0.0000000000009484024*J61^4+4.1635019*LN(J61))","v":1352.9554923109872}]
[null,null,"POISSONS SUR GLACE",null,"NON",null,"Pvs si t>0°C",{"$f":"EXP(-5800.2206/H61+1.3914993-0.048640239*H61+0.000041764768*H61^2-0.000000014452093*H61^3+6.5459673*LN(H61))","v":{"$error":"#VALUE!"}},{"$f":"EXP(-5800.2206/I61+1.3914993-0.048640239*I61+0.000041764768*I61^2-0.000000014452093*I61^3+6.5459673*LN(I61))","v":80.901154299253577},{"$f":"EXP(-5800.2206/J61+1.3914993-0.048640239*J61+0.000041764768*J61^2-0.000000014452093*J61^3+6.5459673*LN(J61))","v":1227.9952754407796}]
[null,null,"FRUITS ET LEGUMES",null,null,"Pws","Pression partielle de vapeur à saturation",{"$f":"IF(H61<273.15,H62,H63)","v":{"$error":"#VALUE!"}},{"$f":"IF(I61<273.15,I62,I63)","v":63.334271628972786},{"$f":"IF(J61<273.15,J62,J63)","v":1227.9952754407796}]
[null,null,"BOF EMBALLES",null,null,"Pv","Pression partielle de vapeur non saturé",{"$f":"H64*H60/100","v":{"$error":"#VALUE!"}},{"$f":"I64*I60/100","v":57.000844466075506},{"$f":"J64*J60/100","v":736.79716526446782}]
[null,null,"FROMAGE",null,null,"Pa","Pression partielle de l'air sec",{"$f":"$H$57-H65","v":{"$error":"#VALUE!"}},{"$f":"$H$57-I65","v":100669.03887708689},{"$f":"$H$57-J65","v":99989.242556288504}]
[null,null,"BOISSONS",null,null,"w","Humidité absolue non saturée",{"$f":"0.62198*H65/($H$57-H65)","v":{"$error":"#VALUE!"}},{"$f":"0.62198*I65/($H$57-I65)","v":3.5217764703502225E-4},{"$f":"0.62198*J65/($H$57-J65)","v":4.5832240462588851E-3}]
[null,null,"POUBELLES GRASSES",null,null,"ws","Humidité absolue à saturation",{"$f":"0.62198*H64/($H$57-H64)","v":{"$error":"#VALUE!"}},{"$f":"0.62198*I64/($H$57-I64)","v":3.9133311678558939E-4},{"$f":"0.62198*J64/($H$57-J64)","v":7.676417216745615E-3}]
[null,null,"PRODUITS SURGELES",null,null,"RO","Masse volumique de l'air sec",{"$f":"(1+H67)/H70","v":{"$error":"#VALUE!"}},{"$f":"(1+I67)/I70","v":1.4135180784231818},{"$f":"(1+J67)/J70","v":1.235632662064539}]
[null,null,"CREMES GLACEES",null,null,"v'","Volume massique de l'air humide",{"$f":"0.2871*H61*(1+1.6078*H67)/$H$57*1000","v":{"$error":"#VALUE!"}},{"$f":"0.2871*I61*(1+1.6078*I67)/$H$57*1000","v":0.70770384398829567},{"$f":"0.2871*J61*(1+1.6078*J67)/$H$57*1000","v":0.81301122484716892}]
[null,null,"SAS"]
[null,null,"LABO DECOUPE",null,null,"h","Enthalpie",{"$f":"1.006*H59+H67*(2500.8+1.805*H59)","v":{"$error":"#VALUE!"}},{"$f":"1.006*I59+I67*(2500.8+1.805*I59)","v":-24.285166156617269},{"$f":"1.006*J59+J67*(2500.8+1.805*J59)","v":21.604453888919195}]
[null,null,"LABO DECOUPE EMBALLAGE"]
[null,null,"LABO EMBALLAGE"]
[]
[]
[]
[]
[null,null,"Désignation","Température","Dimensions",null,null,null,null,"Evaporateurs"]
[null,null,null,null,"Hygrométrie","Longeur","largeur","Surface","hauteur","Volume","Puissance minimum requise",{"$f":"\"à \"&ROUND(D20,0)*100 &\" % de charge en surface\"","v":"à 0 % de charge en surface"},"Maximum de charge 50 %","Minimum de charge","DT de sélection","Nbre","Type","Vitesse ventilation","Dégivrage"]
[]
[null,{"$f":"D1","v":"CFP 01"},{"$f":"E1","v":"FRAIS LS"},{"$f":"G4","v":-25},{"$f":"G5","v":90},{"$f":"E2","v":0},{"$f":"E3","v":0},{"$f":"surface","v":0},{"$f":"hauteur","v":0},{"$f":"volume","v":0},{"$f":"J52*1000","v":{"$error":"#VALUE!"}},{"$f":"J51*1000","v":{"$error":"#VALUE!"}},{"$f":"N52*1000","v":{"$error":"#VALUE!"}},{"$f":"O52*1000","v":0},{"$error":"#N/A"},1,{"$f":"IF(OR(LABO=\"oui\",H1=\"SAS\"),\"DOUBLE FLUX\",IF(K82<2000,\"PLAFONNIER\",IF(AND(G5<80,K82<7000),\"PLAFONNIER\",\"CUBIQUE\")))","v":{"$error":"#VALUE!"}},{"$f":"IF(AND(Q82=\"DOUBLE FLUX\",LABO=\"OUI\"),1000,1500)","v":{"$error":"#VALUE!"}},{"$f":"IF(D82>1,\"Naturel\",\"Electrique\")","v":"Electrique"}]
[]
[]
[null,null,null,null,null,null,null,null,null,null,{"$f":"K82/H82","v":{"$error":"#VALUE!"}}]

{"sheet":"Table CFN 2","index":31,"n_rows":85,"n_cols":19,"rows_kept":85,"cut":false,"hidden":true,"merged":[[17,3,18,3],[78,2,79,2],[78,3,79,3],[78,4,78,8],[78,9,78,14],[0,0,5,0],[0,1,5,1],[0,5,0,6],[0,7,0,10],[1,7,2,7],[1,9,1,10],[2,8,2,9],[3,7,4,7],[3,10,4,10]]}
["ENTREES","CALCULS","CHAMBRE FROIDE","CFP 01","FRAIS LS","PRODUITS TRAITES",null,{"$f":"'Chambres négative'!F5","v":0}]
[null,null,"Largeur",null,{"$f":"'Chambres négative'!F8","v":0},"TEMPERATURE",{"$f":"Informations!G25","v":{"$error":"#VALUE!"}},"EXT","REP"]
[null,null,"Longueur",null,{"$f":"'Chambres négative'!F9","v":0},"HUMIDITE ",50,null,"COEF TRANSMISSION",null,0.3]
[null,null,"Hauteur sous plafond",null,{"$f":"'Chambres négative'!F10","v":0},"TEMPERATURE",-25,"INT","TEMPERATURE",10,"SAS",null,"CHARGEMENT","CHARGEMENT","NUIT"]
[null,null,"Surface",null,{"$f":"E3*E2","v":0},"HUMIDITE ",90,null,"HUMIDITE ",60,null,null,0.5,0.75,"Activité 0"]
[null,null,"Volume",null,{"$f":"E5*E4","v":0},"CAPACITE CF",8400,"LABO","NON",null,"NON"]
[null,null,"BILAN ",null,null,"Text","T in","k","Apport","Apport"]
[null,null,"Déperditions",null,"m2","°C","°C","W/m2/K","W","kJ/24h"]
[null,null,"Mur droit","S1",{"$f":"E2*E4","v":0},35,{"$f":"$G$4","v":-25},{"$f":"$K$3","v":0.3},{"$f":"H9*E9*(F9-G9)","v":0},{"$f":"I9*3600*24/1000","v":0},null,null,null,null,{"$f":"H9*(F9-5-G9)*E9","v":0}]
[null,null,"Mur gauche","S2",{"$f":"+E9","v":0},35,-25,{"$f":"$K$3","v":0.3},0,0,null,null,null,null,{"$f":"H10*(F10-5-G10)*E10","v":0}]
[null,null,"Mur fond","S3",{"$f":"E3*E4","v":0},15,-25,{"$f":"$K$3","v":0.3},0,0,null,null,null,null,{"$f":"H11*(F11-5-G11)*E11","v":0}]
[null,null,"Mur avant","S4",{"$f":"E11","v":0},35,-25,0.5,0,0,null,null,null,null,{"$f":"H12*(F12-5-G12)*E12","v":0}]
[null,null,"Plafond","S5",{"$f":"E5","v":0},35,-25,{"$f":"$K$3","v":0.3},0,0,null,null,null,null,{"$f":"H13*(F13-5-G13)*E13","v":0}]
[null,null,"Plancher","S6",{"$f":"E5","v":0},15,-25,0.2,0,0,null,null,null,null,{"$f":"H14*(F14-G14)*E14","v":0}]
[null,null,"Linéïques",0.1,null,null,null,null,{"$f":"D15*SUM(I9:I14)","v":0},{"$f":"D15*SUM(J9:J14)","v":0}]
[null,null,"Sous total",null,null,null,null,null,{"$f":"SUM(I9:I15)","v":0},{"$f":"I16*24*3.6","v":0},{"$f":"J16/$J$48","v":{"$error":"#VALUE!"}},null,{"$f":"J16","v":0},{"$f":"J16","v":0},{"$f":"SUM(O9:O15)*24*3.6","v":0}]
[]
[null,null,"Entrés","% de charge","kg/jour","T entrée","T stockage","Cp","Apport","Apport"]
[null,null,"Surcharge kg/jour",null,"Débit","°C","°C","kJ/kg/K","W","kJ/24h"]
[null,null,0,0.25714285714285712,2160,-15,{"$f":"G4","v":-25},1.7579100000000001,{"$f":"H20*(E20+C20 )*(F20-G20)/3600/12*1000","v":878.95499999999993},{"$f":"(C20+E20)*H20*(F20-G20)","v":37970.856},{"$f":"J20/$J$48","v":{"$error":"#VALUE!"}},null,{"$f":"IF(LABO=\"non\",J20/E20*G6*$M$5,0)","v":73832.22},{"$f":"IF(LABO=\"non\",J20/E20*G6*$N$5,0)","v":110748.33},0]
[null,null,"Chaleur respiration",null,"Capacité",null,null,"Chaleur respiration","Apport","Apport"]
[null,null,{"$f":"H1","v":0},null,"Chambre",null,null,"kJ/kg en 24 h","W","kJ/24h"]
[null,null,0,null,{"$f":"capacité","v":8400},null,null,{"$f":"C23","v":0},{"$f":"J23/24/3600","v":0},{"$f":"H23*E23","v":0},{"$f":"J23/$J$48","v":{"$error":"#VALUE!"}},null,{"$f":"+J23","v":0},{"$f":"J23","v":0},{"$f":"J23","v":0}]
[]
[null,null,"Travail ventilateurs",null,"Volume chambre","Taux de brassage","Débit air brassé","Puissance ventilateur","Apport","Apport"]
[null,null,null,null,"m3","sd","m3","W","W","kJ/24h"]
[null,null,null,null,{"$f":"volume","v":0},30,{"$f":"F27*E6","v":0},{"$f":"I27","v":0},{"$f":"G27*0.1","v":0},{"$f":"I27/1000*24*3600","v":0},{"$f":"J27/$J$48","v":{"$error":"#VALUE!"}},null,{"$f":"J27","v":0},{"$f":"J27","v":0},{"$f":"J27","v":0}]
[]
[null,null,"Air neuf",null,"Renouvellement","Vol massique","Enthalpie Ext","Enthalpie Int","Apport","Apport"]
[null,null,"Activité chambre",null,"m3/24h","m3/kg","kJ/kg","kJ/kg","W","kJ/24h"]
[null,null,"FORT",null,678,{"$f":"IF(K6=\"NON\",H69,J69)","v":{"$error":"#VALUE!"}},{"$f":"IF(K6=\"NON\",H72,J72)","v":{"$error":"#VALUE!"}},{"$f":"I72","v":-24.285166156617269},{"$f":"(G31-H31)/F31*E31/(24*3600)*1000","v":{"$error":"#VALUE!"}},{"$f":"(G31-H31)/F31*E31","v":{"$error":"#VALUE!"}},{"$f":"J31/$J$48","v":{"$error":"#VALUE!"}},null,{"$f":"J31","v":{"$error":"#VALUE!"}},{"$f":"J31","v":{"$error":"#VALUE!"}},0]
[null,null,"Taux de renouvellement",{"$f":"E31/volume","v":{"$error":"#DIV/0!"}},"Vol/jour",{"$f":"D32/24","v":{"$error":"#DIV/0!"}},"Vol/h"]
[]
[null,null,"Eclairage",null,"Surface","Ratio","Nb heures fonction",null,"Apport","Apport"]
[null,null,null,null,"m2"," W/m2","h",null,"W","kJ/24h"]
[null,null,null,null,{"$f":"surface","v":0},{"$f":"IF(LABO=\"oui\",0,10)","v":10},4,null,{"$f":"F36*E36","v":0},{"$f":"I36*3600*G36/1000","v":0},{"$f":"J36/$J$48","v":{"$error":"#VALUE!"}},null,{"$f":"J36","v":0},{"$f":"J36","v":0},"."]
[]
[null,null,"Personnel"]
[null,null,null,null,"Nombre","Ratio","Nb heures fonction",null,"Apport","Apport"]
[null,null,null,null,"personne","W/p","h",null,"W","kJ/24h"]
[null,null,null,null,0,400,4,null,{"$f":"F41*E41","v":0},{"$f":"I41*3600*G41/1000","v":0},{"$f":"J41/$J$48","v":{"$error":"#VALUE!"}},null,{"$f":"J41","v":0},{"$f":"J41","v":0},0]
[]
[null,null,"Machines",null,null,"Nb heures fonction",null,null,"Apport","Apport"]
[null,null,null,null,"W","h",null,null,"W","kJ/24h"]
[null,null,null,null,0,{"$f":"IF(I6=\"OUI\",10,0)","v":0},null,null,{"$f":"E45","v":0},{"$f":"I45*3600*F45/1000","v":0},{"$f":"J45/$J$48","v":{"$error":"#VALUE!"}},null,{"$f":"J45","v":0},{"$f":"J45","v":0},{"$f":"J45","v":0}]
[null,null,"Divers",null,0,null,null,null,{"$f":"E46","v":0},{"$f":"I46*3600*24/1000","v":0},{"$f":"J46/$J$48","v":{"$error":"#VALUE!"}},null,{"$f":"J46","v":0},{"$f":"J46","v":0},{"$f":"J46","v":0}]
[]
[null,null,"TOTAL",null,null,null,null,null,{"$f":"I16+I20+I23+I27+I31+I36+I41+I45+I46","v":{"$error":"#VALUE!"}},{"$f":"SUM(J16:J46)","v":{"$error":"#VALUE!"}},{"$f":"SUM(K16:K46)","v":{"$error":"#VALUE!"}},null,{"$f":"SUM(M16:M46)","v":{"$error":"#VALUE!"}},{"$f":"SUM(N16:N46)","v":{"$error":"#VALUE!"}},{"$f":"SUM(O16:O46)","v":0}]
[]
[null,null,null,null,"Nombres d'heures de fonctionnement groupes h/jour",null,null,null,"Bilan Chaleur Latente kW"," Bilan production kW",null,null," Bilan production kW"," Bilan production kW"," Bilan production kW"]
[null,null,"PRODUCTION",null,18,"Ratio",{"$f":"J51*1000/E14","v":{"$error":"#VALUE!"}},"W/m2",{"$f":"IF(K6=\"oui\",2501*(J67-I67)*E31/F31/E51/3600,2500.8*(H67-I67)*E31/F31/E51/3600)","v":{"$error":"#VALUE!"}},{"$f":"J48/$E$51/3600","v":{"$error":"#VALUE!"}},null,null,{"$f":"M48/$E$51/3600","v":{"$error":"#VALUE!"}},{"$f":"N48/$E$51/3600","v":{"$error":"#VALUE!"}},{"$f":"O48/$E$51/3600","v":0}]
[null,null,"EMISSION",null,16,null,{"$f":"J52*1000/E14","v":{"$error":"#VALUE!"}},null,{"$f":"I51/J51","v":{"$error":"#VALUE!"}},{"$f":"J48/$E$52/3600","v":{"$error":"#VALUE!"}},{"$f":"J52/J51-1","v":{"$error":"#VALUE!"}},null,{"$f":"M48/$E$52/3600","v":{"$error":"#VALUE!"}},{"$f":"N48/$E$52/3600","v":{"$error":"#VALUE!"}},{"$f":"O48/$E$52/3600","v":0}]
[]
[]
[null,null,null,null,null,null,null,500,500,500]
[null,null,"VIANDES PRE EMBALLES",null,"TRES FORT","ALTITUDE DU SITE (m)",null,50,50,50]
[null,null,"VOLAILLES PREEMBALLEES",null,"FORT","PRESSION TOTALE P (Pa)",null,{"$f":"1.19745*10^-8*(288.15-0.0065*H56)^5.25588","v":100726.03972155297},{"$f":"1.19745*10^-8*(288.15-0.0065*I56)^5.25588","v":100726.03972155297},{"$f":"1.19745*10^-8*(288.15-0.0065*J56)^5.25588","v":100726.03972155297}]
[null,null,"CARCASSES",null,"MOYEN","POINT",null,"EXT","INT","SAS"]
[null,null,"CHARCUTERIE PREEMBALLE",null,"FAIBLE","t","Température sèche",{"$f":"G2","v":{"$error":"#VALUE!"}},{"$f":"G4","v":-25},{"$f":"J4","v":10}]
[null,null,"TRAITEUR",null,null,"F ( % )","Humidité relatice",50,{"$f":"G5","v":90},{"$f":"J5","v":60}]
[null,null,"CHARIOTS PLATS CUISINES",null,null,"T","Température absolue",{"$f":"H59+273.15","v":{"$error":"#VALUE!"}},{"$f":"I59+273.15","v":248.14999999999998},{"$f":"J59+273.15","v":283.14999999999998}]
[null,null,"PATISSERIE FRAICHE",null,"OUI",null,"Pvs si t<0°C",{"$f":"EXP(-5674.359/H61+6.3925247-0.009677843*H61+0.00000062215701*H61^2+0.0000000020747825*H61^3-0.0000000000009484024*H61^4+4.1635019*LN(H61))","v":{"$error":"#VALUE!"}},{"$f":"EXP(-5674.359/I61+6.3925247-0.009677843*I61+0.00000062215701*I61^2+0.0000000020747825*I61^3-0.0000000000009484024*I61^4+4.1635019*LN(I61))","v":63.334271628972786},{"$f":"EXP(-5674.359/J61+6.3925247-0.009677843*J61+0.00000062215701*J61^2+0.0000000020747825*J61^3-0.0000000000009484024*J61^4+4.1635019*LN(J61))","v":1352.9554923109872}]
[null,null,"POISSONS SUR GLACE",null,"NON",null,"Pvs si t>0°C",{"$f":"EXP(-5800.2206/H61+1.3914993-0.048640239*H61+0.000041764768*H61^2-0.000000014452093*H61^3+6.5459673*LN(H61))","v":{"$error":"#VALUE!"}},{"$f":"EXP(-5800.2206/I61+1.3914993-0.048640239*I61+0.000041764768*I61^2-0.000000014452093*I61^3+6.5459673*LN(I61))","v":80.901154299253577},{"$f":"EXP(-5800.2206/J61+1.3914993-0.048640239*J61+0.000041764768*J61^2-0.000000014452093*J61^3+6.5459673*LN(J61))","v":1227.9952754407796}]
[null,null,"FRUITS ET LEGUMES",null,null,"Pws","Pression partielle de vapeur à saturation",{"$f":"IF(H61<273.15,H62,H63)","v":{"$error":"#VALUE!"}},{"$f":"IF(I61<273.15,I62,I63)","v":63.334271628972786},{"$f":"IF(J61<273.15,J62,J63)","v":1227.9952754407796}]
[null,null,"BOF EMBALLES",null,null,"Pv","Pression partielle de vapeur non saturé",{"$f":"H64*H60/100","v":{"$error":"#VALUE!"}},{"$f":"I64*I60/100","v":57.000844466075506},{"$f":"J64*J60/100","v":736.79716526446782}]
[null,null,"FROMAGE",null,null,"Pa","Pression partielle de l'air sec",{"$f":"$H$57-H65","v":{"$error":"#VALUE!"}},{"$f":"$H$57-I65","v":100669.03887708689},{"$f":"$H$57-J65","v":99989.242556288504}]
[null,null,"BOISSONS",null,null,"w","Humidité absolue non saturée",{"$f":"0.62198*H65/($H$57-H65)","v":{"$error":"#VALUE!"}},{"$f":"0.62198*I65/($H$57-I65)","v":3.5217764703502225E-4},{"$f":"0.62198*J65/($H$57-J65)","v":4.5832240462588851E-3}]
[null,null,"POUBELLES GRASSES",null,null,"ws","Humidité absolue à saturation",{"$f":"0.62198*H64/($H$57-H64)","v":{"$error":"#VALUE!"}},{"$f":"0.62198*I64/($H$57-I64)","v":3.9133311678558939E-4},{"$f":"0.62198*J64/($H$57-J64)","v":7.676417216745615E-3}]
[null,null,"PRODUITS SURGELES",null,null,"RO","Masse volumique de l'air sec",{"$f":"(1+H67)/H70","v":{"$error":"#VALUE!"}},{"$f":"(1+I67)/I70","v":1.4135180784231818},{"$f":"(1+J67)/J70","v":1.235632662064539}]
[null,null,"CREMES GLACEES",null,null,"v'","Volume massique de l'air humide",{"$f":"0.2871*H61*(1+1.6078*H67)/$H$57*1000","v":{"$error":"#VALUE!"}},{"$f":"0.2871*I61*(1+1.6078*I67)/$H$57*1000","v":0.70770384398829567},{"$f":"0.2871*J61*(1+1.6078*J67)/$H$57*1000","v":0.81301122484716892}]
[null,null,"SAS"]
[null,null,"LABO DECOUPE",null,null,"h","Enthalpie",{"$f":"1.006*H59+H67*(2500.8+1.805*H59)","v":{"$error":"#VALUE!"}},{"$f":"1.006*I59+I67*(2500.8+1.805*I59)","v":-24.285166156617269},{"$f":"1.006*J59+J67*(2500.8+1.805*J59)","v":21.604453888919195}]
[null,null,"LABO DECOUPE EMBALLAGE"]
[null,null,"LABO EMBALLAGE"]
[]
[]
[]
[]
[null,null,"Désignation","Température","Dimensions",null,null,null,null,"Evaporateurs"]
[null,null,null,null,"Hygrométrie","Longeur","largeur","Surface","hauteur","Volume","Puissance minimum requise",{"$f":"\"à \"&ROUND(D20,0)*100 &\" % de charge en surface\"","v":"à 0 % de charge en surface"},"Maximum de charge 50 %","Minimum de charge","DT de sélection","Nbre","Type","Vitesse ventilation","Dégivrage"]
[]
[null,{"$f":"D1","v":"CFP 01"},{"$f":"E1","v":"FRAIS LS"},{"$f":"G4","v":-25},{"$f":"G5","v":90},{"$f":"E2","v":0},{"$f":"E3","v":0},{"$f":"surface","v":0},{"$f":"hauteur","v":0},{"$f":"volume","v":0},{"$f":"J52*1000","v":{"$error":"#VALUE!"}},{"$f":"J51*1000","v":{"$error":"#VALUE!"}},{"$f":"N52*1000","v":{"$error":"#VALUE!"}},{"$f":"O52*1000","v":0},{"$error":"#N/A"},1,{"$f":"IF(OR(LABO=\"oui\",H1=\"SAS\"),\"DOUBLE FLUX\",IF(K82<2000,\"PLAFONNIER\",IF(AND(G5<80,K82<7000),\"PLAFONNIER\",\"CUBIQUE\")))","v":{"$error":"#VALUE!"}},{"$f":"IF(AND(Q82=\"DOUBLE FLUX\",LABO=\"OUI\"),1000,1500)","v":{"$error":"#VALUE!"}},{"$f":"IF(D82>1,\"Naturel\",\"Electrique\")","v":"Electrique"}]
[]
[]
[null,null,null,null,null,null,null,null,null,null,{"$f":"K82/H82","v":{"$error":"#VALUE!"}}]

{"sheet":"Table CFN 3","index":32,"n_rows":85,"n_cols":19,"rows_kept":85,"cut":false,"hidden":true,"merged":[[17,3,18,3],[78,2,79,2],[78,3,79,3],[78,4,78,8],[78,9,78,14],[0,0,5,0],[0,1,5,1],[0,5,0,6],[0,7,0,10],[1,7,2,7],[1,9,1,10],[2,8,2,9],[3,7,4,7],[3,10,4,10]]}
["ENTREES","CALCULS","CHAMBRE FROIDE","CFP 01","FRAIS LS","PRODUITS TRAITES",null,{"$f":"'Chambres négative'!G5","v":0}]
[null,null,"Largeur",null,{"$f":"'Chambres négative'!G8","v":0},"TEMPERATURE",{"$f":"Informations!G25","v":{"$error":"#VALUE!"}},"EXT","REP"]
[null,null,"Longueur",null,{"$f":"'Chambres négative'!G9","v":0},"HUMIDITE ",50,null,"COEF TRANSMISSION",null,0.3]
[null,null,"Hauteur sous plafond",null,{"$f":"'Chambres négative'!G10","v":0},"TEMPERATURE",{"$error":"#N/A"},"INT","TEMPERATURE",10,"SAS",null,"CHARGEMENT","CHARGEMENT","NUIT"]
[null,null,"Surface",null,{"$f":"E3*E2","v":0},"HUMIDITE ",{"$error":"#N/A"},null,"HUMIDITE ",60,null,null,0.5,0.75,"Activité 0"]
[null,null,"Volume",null,{"$f":"E5*E4","v":0},"CAPACITE CF",{"$error":"#N/A"},"LABO","NON",null,"NON"]
[null,null,"BILAN ",null,null,"Text","T in","k","Apport","Apport"]
[null,null,"Déperditions",null,"m2","°C","°C","W/m2/K","W","kJ/24h"]
[null,null,"Mur droit","S1",{"$f":"E2*E4","v":0},35,{"$f":"$G$4","v":{"$error":"#N/A"}},{"$f":"$K$3","v":0.3},{"$f":"H9*E9*(F9-G9)","v":{"$error":"#N/A"}},{"$f":"I9*3600*24/1000","v":{"$error":"#N/A"}},null,null,null,null,{"$f":"H9*(F9-5-G9)*E9","v":{"$error":"#N/A"}}]
[null,null,"Mur gauche","S2",{"$f":"+E9","v":0},35,{"$error":"#N/A"},{"$f":"$K$3","v":0.3},{"$error":"#N/A"},{"$error":"#N/A"},null,null,null,null,{"$f":"H10*(F10-5-G10)*E10","v":{"$error":"#N/A"}}]
[null,null,"Mur fond","S3",{"$f":"E3*E4","v":0},15,{"$error":"#N/A"},{"$f":"$K$3","v":0.3},{"$error":"#N/A"},{"$error":"#N/A"},null,null,null,null,{"$f":"H11*(F11-5-G11)*E11","v":{"$error":"#N/A"}}]
[null,null,"Mur avant","S4",{"$f":"E11","v":0},35,{"$error":"#N/A"},0.5,{"$error":"#N/A"},{"$error":"#N/A"},null,null,null,null,{"$f":"H12*(F12-5-G12)*E12","v":{"$error":"#N/A"}}]
[null,null,"Plafond","S5",{"$f":"E5","v":0},35,{"$error":"#N/A"},{"$f":"$K$3","v":0.3},{"$error":"#N/A"},{"$error":"#N/A"},null,null,null,null,{"$f":"H13*(F13-5-G13)*E13","v":{"$error":"#N/A"}}]
[null,null,"Plancher","S6",{"$f":"E5","v":0},15,{"$error":"#N/A"},0.2,{"$error":"#N/A"},{"$error":"#N/A"},null,null,null,null,{"$f":"H14*(F14-G14)*E14","v":{"$error":"#N/A"}}]
[null,null,"Linéïques",0.1,null,null,null,null,{"$f":"D15*SUM(I9:I14)","v":{"$error":"#N/A"}},{"$f":"D15*SUM(J9:J14)","v":{"$error":"#N/A"}}]
[null,null,"Sous total",null,null,null,null,null,{"$f":"SUM(I9:I15)","v":{"$error":"#N/A"}},{"$f":"I16*24*3.6","v":{"$error":"#N/A"}},{"$f":"J16/$J$48","v":{"$error":"#N/A"}},null,{"$f":"J16","v":{"$error":"#N/A"}},{"$f":"J16","v":{"$error":"#N/A"}},{"$f":"SUM(O9:O15)*24*3.6","v":{"$error":"#N/A"}}]
[]
[null,null,"Entrés","% de charge","kg/jour","T entrée","T stockage","Cp","Apport","Apport"]
[null,null,"Surcharge kg/jour",null,"Débit","°C","°C","kJ/kg/K","W","kJ/24h"]
[null,null,0,{"$error":"#N/A"},{"$error":"#N/A"},{"$error":"#N/A"},{"$f":"G4","v":{"$error":"#N/A"}},{"$error":"#N/A"},{"$f":"H20*(E20+C20 )*(F20-G20)/3600/12*1000","v":{"$error":"#N/A"}},{"$f":"(C20+E20)*H20*(F20-G20)","v":{"$error":"#N/A"}},{"$f":"J20/$J$48","v":{"$error":"#N/A"}},null,{"$f":"IF(LABO=\"non\",J20/E20*G6*$M$5,0)","v":{"$error":"#N/A"}},{"$f":"IF(LABO=\"non\",J20/E20*G6*$N$5,0)","v":{"$error":"#N/A"}},0]
[null,null,"Chaleur respiration",null,"Capacité",null,null,"Chaleur respiration","Apport","Apport"]
[null,null,{"$f":"H1","v":0},null,"Chambre",null,null,"kJ/kg en 24 h","W","kJ/24h"]
[null,null,0,null,{"$f":"capacité","v":{"$error":"#N/A"}},null,null,{"$f":"C23","v":0},{"$f":"J23/24/3600","v":{"$error":"#N/A"}},{"$f":"H23*E23","v":{"$error":"#N/A"}},{"$f":"J23/$J$48","v":{"$error":"#N/A"}},null,{"$f":"+J23","v":{"$error":"#N/A"}},{"$f":"J23","v":{"$error":"#N/A"}},{"$f":"J23","v":{"$error":"#N/A"}}]
[]
[null,null,"Travail ventilateurs",null,"Volume chambre","Taux de brassage","Débit air brassé","Puissance ventilateur","Apport","Apport"]
[null,null,null,null,"m3","sd","m3","W","W","kJ/24h"]
[null,null,null,null,{"$f":"volume","v":0},30,{"$f":"F27*E6","v":0},{"$f":"I27","v":0},{"$f":"G27*0.1","v":0},{"$f":"I27/1000*24*3600","v":0},{"$f":"J27/$J$48","v":{"$error":"#N/A"}},null,{"$f":"J27","v":0},{"$f":"J27","v":0},{"$f":"J27","v":0}]
[]
[null,null,"Air neuf",null,"Renouvellement","Vol massique","Enthalpie Ext","Enthalpie Int","Apport","Apport"]
[null,null,"Activité chambre",null,"m3/24h","m3/kg","kJ/kg","kJ/kg","W","kJ/24h"]
[null,null,"FORT",null,{"$error":"#N/A"},{"$f":"IF(K6=\"NON\",H69,J69)","v":{"$error":"#VALUE!"}},{"$f":"IF(K6=\"NON\",H72,J72)","v":{"$error":"#VALUE!"}},{"$f":"I72","v":{"$error":"#N/A"}},{"$f":"(G31-H31)/F31*E31/(24*3600)*1000","v":{"$error":"#VALUE!"}},{"$f":"(G31-H31)/F31*E31","v":{"$error":"#VALUE!"}},{"$f":"J31/$J$48","v":{"$error":"#VALUE!"}},null,{"$f":"J31","v":{"$error":"#VALUE!"}},{"$f":"J31","v":{"$error":"#VALUE!"}},0]
[null,null,"Taux de renouvellement",{"$f":"E31/volume","v":{"$error":"#N/A"}},"Vol/jour",{"$f":"D32/24","v":{"$error":"#N/A"}},"Vol/h"]
[]
[null,null,"Eclairage",null,"Surface","Ratio","Nb heures fonction",null,"Apport","Apport"]
[null,null,null,null,"m2"," W/m2","h",null,"W","kJ/24h"]
[null,null,null,null,{"$f":"surface","v":0},{"$f":"IF(LABO=\"oui\",0,10)","v":10},4,null,{"$f":"F36*E36","v":0},{"$f":"I36*3600*G36/1000","v":0},{"$f":"J36/$J$48","v":{"$error":"#N/A"}},null,{"$f":"J36","v":0},{"$f":"J36","v":0},"."]
[]
[null,null,"Personnel"]
[null,null,null,null,"Nombre","Ratio","Nb heures fonction",null,"Apport","Apport"]
[null,null,null,null,"personne","W/p","h",null,"W","kJ/24h"]
[null,null,null,null,0,400,4,null,{"$f":"F41*E41","v":0},{"$f":"I41*3600*G41/1000","v":0},{"$f":"J41/$J$48","v":{"$error":"#N/A"}},null,{"$f":"J41","v":0},{"$f":"J41","v":0},0]
[]
[null,null,"Machines",null,null,"Nb heures fonction",null,null,"Apport","Apport"]
[null,null,null,null,"W","h",null,null,"W","kJ/24h"]
[null,null,null,null,0,{"$f":"IF(I6=\"OUI\",10,0)","v":0},null,null,{"$f":"E45","v":0},{"$f":"I45*3600*F45/1000","v":0},{"$f":"J45/$J$48","v":{"$error":"#N/A"}},null,{"$f":"J45","v":0},{"$f":"J45","v":0},{"$f":"J45","v":0}]
[null,null,"Divers",null,0,null,null,null,{"$f":"E46","v":0},{"$f":"I46*3600*24/1000","v":0},{"$f":"J46/$J$48","v":{"$error":"#N/A"}},null,{"$f":"J46","v":0},{"$f":"J46","v":0},{"$f":"J46","v":0}]
[]
[null,null,"TOTAL",null,null,null,null,null,{"$f":"I16+I20+I23+I27+I31+I36+I41+I45+I46","v":{"$error":"#N/A"}},{"$f":"SUM(J16:J46)","v":{"$error":"#N/A"}},{"$f":"SUM(K16:K46)","v":{"$error":"#N/A"}},null,{"$f":"SUM(M16:M46)","v":{"$error":"#N/A"}},{"$f":"SUM(N16:N46)","v":{"$error":"#N/A"}},{"$f":"SUM(O16:O46)","v":{"$error":"#N/A"}}]
[]
[null,null,null,null,"Nombres d'heures de fonctionnement groupes h/jour",null,null,null,"Bilan Chaleur Latente kW"," Bilan production kW",null,null," Bilan production kW"," Bilan production kW"," Bilan production kW"]
[null,null,"PRODUCTION",null,18,"Ratio",{"$f":"J51*1000/E14","v":{"$error":"#N/A"}},"W/m2",{"$f":"IF(K6=\"oui\",2501*(J67-I67)*E31/F31/E51/3600,2500.8*(H67-I67)*E31/F31/E51/3600)","v":{"$error":"#VALUE!"}},{"$f":"J48/$E$51/3600","v":{"$error":"#N/A"}},null,null,{"$f":"M48/$E$51/3600","v":{"$error":"#N/A"}},{"$f":"N48/$E$51/3600","v":{"$error":"#N/A"}},{"$f":"O48/$E$51/3600","v":{"$error":"#N/A"}}]
[null,null,"EMISSION",null,16,null,{"$f":"J52*1000/E14","v":{"$error":"#N/A"}},null,{"$f":"I51/J51","v":{"$error":"#VALUE!"}},{"$f":"J48/$E$52/3600","v":{"$error":"#N/A"}},{"$f":"J52/J51-1","v":{"$error":"#N/A"}},null,{"$f":"M48/$E$52/3600","v":{"$error":"#N/A"}},{"$f":"N48/$E$52/3600","v":{"$error":"#N/A"}},{"$f":"O48/$E$52/3600","v":{"$error":"#N/A"}}]
[]
[]
[null,null,null,null,null,null,null,500,500,500]
[null,null,"VIANDES PRE EMBALLES",null,"TRES FORT","ALTITUDE DU SITE (m)",null,50,50,50]
[null,null,"VOLAILLES PREEMBALLEES",null,"FORT","PRESSION TOTALE P (Pa)",null,{"$f":"1.19745*10^-8*(288.15-0.0065*H56)^5.25588","v":100726.03972155297},{"$f":"1.19745*10^-8*(288.15-0.0065*I56)^5.25588","v":100726.03972155297},{"$f":"1.19745*10^-8*(288.15-0.0065*J56)^5.25588","v":100726.03972155297}]
[null,null,"CARCASSES",null,"MOYEN","POINT",null,"EXT","INT","SAS"]
[null,null,"CHARCUTERIE PREEMBALLE",null,"FAIBLE","t","Température sèche",{"$f":"G2","v":{"$error":"#VALUE!"}},{"$f":"G4","v":{"$error":"#N/A"}},{"$f":"J4","v":10}]
[null,null,"TRAITEUR",null,null,"F ( % )","Humidité relatice",50,{"$f":"G5","v":{"$error":"#N/A"}},{"$f":"J5","v":60}]
[null,null,"CHARIOTS PLATS CUISINES",null,null,"T","Température absolue",{"$f":"H59+273.15","v":{"$error":"#VALUE!"}},{"$f":"I59+273.15","v":{"$error":"#N/A"}},{"$f":"J59+273.15","v":283.14999999999998}]
[null,null,"PATISSERIE FRAICHE",null,"OUI",null,"Pvs si t<0°C",{"$f":"EXP(-5674.359/H61+6.3925247-0.009677843*H61+0.00000062215701*H61^2+0.0000000020747825*H61^3-0.0000000000009484024*H61^4+4.1635019*LN(H61))","v":{"$error":"#VALUE!"}},{"$f":"EXP(-5674.359/I61+6.3925247-0.009677843*I61+0.00000062215701*I61^2+0.0000000020747825*I61^3-0.0000000000009484024*I61^4+4.1635019*LN(I61))","v":{"$error":"#N/A"}},{"$f":"EXP(-5674.359/J61+6.3925247-0.009677843*J61+0.00000062215701*J61^2+0.0000000020747825*J61^3-0.0000000000009484024*J61^4+4.1635019*LN(J61))","v":1352.9554923109872}]
[null,null,"POISSONS SUR GLACE",null,"NON",null,"Pvs si t>0°C",{"$f":"EXP(-5800.2206/H61+1.3914993-0.048640239*H61+0.000041764768*H61^2-0.000000014452093*H61^3+6.5459673*LN(H61))","v":{"$error":"#VALUE!"}},{"$f":"EXP(-5800.2206/I61+1.3914993-0.048640239*I61+0.000041764768*I61^2-0.000000014452093*I61^3+6.5459673*LN(I61))","v":{"$error":"#N/A"}},{"$f":"EXP(-5800.2206/J61+1.3914993-0.048640239*J61+0.000041764768*J61^2-0.000000014452093*J61^3+6.5459673*LN(J61))","v":1227.9952754407796}]
[null,null,"FRUITS ET LEGUMES",null,null,"Pws","Pression partielle de vapeur à saturation",{"$f":"IF(H61<273.15,H62,H63)","v":{"$error":"#VALUE!"}},{"$f":"IF(I61<273.15,I62,I63)","v":{"$error":"#N/A"}},{"$f":"IF(J61<273.15,J62,J63)","v":1227.9952754407796}]
[null,null,"BOF EMBALLES",null,null,"Pv","Pression partielle de vapeur non saturé",{"$f":"H64*H60/100","v":{"$error":"#VALUE!"}},{"$f":"I64*I60/100","v":{"$error":"#N/A"}},{"$f":"J64*J60/100","v":736.79716526446782}]
[null,null,"FROMAGE",null,null,"Pa","Pression partielle de l'air sec",{"$f":"$H$57-H65","v":{"$error":"#VALUE!"}},{"$f":"$H$57-I65","v":{"$error":"#N/A"}},{"$f":"$H$57-J65","v":99989.242556288504}]
[null,null,"BOISSONS",null,null,"w","Humidité absolue non saturée",{"$f":"0.62198*H65/($H$57-H65)","v":{"$error":"#VALUE!"}},{"$f":"0.62198*I65/($H$57-I65)","v":{"$error":"#N/A"}},{"$f":"0.62198*J65/($H$57-J65)","v":4.5832240462588851E-3}]
[null,null,"POUBELLES GRASSES",null,null,"ws","Humidité absolue à saturation",{"$f":"0.62198*H64/($H$57-H64)","v":{"$error":"#VALUE!"}},{"$f":"0.62198*I64/($H$57-I64)","v":{"$error":"#N/A"}},{"$f":"0.62198*J64/($H$57-J64)","v":7.676417216745615E-3}]
[null,null,"PRODUITS SURGELES",null,null,"RO","Masse volumique de l'air sec",{"$f":"(1+H67)/H70","v":{"$error":"#VALUE!"}},{"$f":"(1+I67)/I70","v":{"$error":"#N/A"}},{"$f":"(1+J67)/J70","v":1.235632662064539}]
[null,null,"CREMES GLACEES",null,null,"v'","Volume massique de l'air humide",{"$f":"0.2871*H61*(1+1.6078*H67)/$H$57*1000","v":{"$error":"#VALUE!"}},{"$f":"0.2871*I61*(1+1.6078*I67)/$H$57*1000","v":{"$error":"#N/A"}},{"$f":"0.2871*J61*(1+1.6078*J67)/$H$57*1000","v":0.81301122484716892}]
[null,null,"SAS"]
[null,null,"LABO DECOUPE",null,null,"h","Enthalpie",{"$f":"1.006*H59+H67*(2500.8+1.805*H59)","v":{"$error":"#VALUE!"}},{"$f":"1.006*I59+I67*(2500.8+1.805*I59)","v":{"$error":"#N/A"}},{"$f":"1.006*J59+J67*(2500.8+1.805*J59)","v":21.604453888919195}]
[null,null,"LABO DECOUPE EMBALLAGE"]
[null,null,"LABO EMBALLAGE"]
[]
[]
[]
[]
[null,null,"Désignation","Température","Dimensions",null,null,null,null,"Evaporateurs"]
[null,null,null,null,"Hygrométrie","Longeur","largeur","Surface","hauteur","Volume","Puissance minimum requise",{"$f":"\"à \"&ROUND(D20,0)*100 &\" % de charge en surface\"","v":{"$error":"#N/A"}},"Maximum de charge 50 %","Minimum de charge","DT de sélection","Nbre","Type","Vitesse ventilation","Dégivrage"]
[]
[null,{"$f":"D1","v":"CFP 01"},{"$f":"E1","v":"FRAIS LS"},{"$f":"G4","v":{"$error":"#N/A"}},{"$f":"G5","v":{"$error":"#N/A"}},{"$f":"E2","v":0},{"$f":"E3","v":0},{"$f":"surface","v":0},{"$f":"hauteur","v":0},{"$f":"volume","v":0},{"$f":"J52*1000","v":{"$error":"#N/A"}},{"$f":"J51*1000","v":{"$error":"#N/A"}},{"$f":"N52*1000","v":{"$error":"#N/A"}},{"$f":"O52*1000","v":{"$error":"#N/A"}},{"$error":"#N/A"},1,{"$f":"IF(OR(LABO=\"oui\",H1=\"SAS\"),\"DOUBLE FLUX\",IF(K82<2000,\"PLAFONNIER\",IF(AND(G5<80,K82<7000),\"PLAFONNIER\",\"CUBIQUE\")))","v":{"$error":"#N/A"}},{"$f":"IF(AND(Q82=\"DOUBLE FLUX\",LABO=\"OUI\"),1000,1500)","v":{"$error":"#N/A"}},{"$f":"IF(D82>1,\"Naturel\",\"Electrique\")","v":{"$error":"#N/A"}}]
[]
[]
[null,null,null,null,null,null,null,null,null,null,{"$f":"K82/H82","v":{"$error":"#N/A"}}]

{"sheet":"Table CFN 4","index":33,"n_rows":85,"n_cols":19,"rows_kept":85,"cut":false,"hidden":true,"merged":[[17,3,18,3],[78,2,79,2],[78,3,79,3],[78,4,78,8],[78,9,78,14],[0,0,5,0],[0,1,5,1],[0,5,0,6],[0,7,0,10],[1,7,2,7],[1,9,1,10],[2,8,2,9],[3,7,4,7],[3,10,4,10]]}
["ENTREES","CALCULS","CHAMBRE FROIDE","CFP 01","FRAIS LS","PRODUITS TRAITES",null,{"$f":"'Chambres négative'!H5","v":0}]
[null,null,"Largeur",null,{"$f":"'Chambres négative'!H8","v":0},"TEMPERATURE",{"$f":"Informations!G25","v":{"$error":"#VALUE!"}},"EXT","REP"]
[null,null,"Longueur",null,{"$f":"'Chambres négative'!H9","v":0},"HUMIDITE ",50,null,"COEF TRANSMISSION",null,0.3]
[null,null,"Hauteur sous plafond",null,{"$f":"'Chambres négative'!H10","v":0},"TEMPERATURE",{"$error":"#N/A"},"INT","TEMPERATURE",10,"SAS",null,"CHARGEMENT","CHARGEMENT","NUIT"]
[null,null,"Surface",null,{"$f":"E3*E2","v":0},"HUMIDITE ",{"$error":"#N/A"},null,"HUMIDITE ",60,null,null,0.5,0.75,"Activité 0"]
[null,null,"Volume",null,{"$f":"E5*E4","v":0},"CAPACITE CF",{"$error":"#N/A"},"LABO","NON",null,"NON"]
[null,null,"BILAN ",null,null,"Text","T in","k","Apport","Apport"]
[null,null,"Déperditions",null,"m2","°C","°C","W/m2/K","W","kJ/24h"]
[null,null,"Mur droit","S1",{"$f":"E2*E4","v":0},35,{"$f":"$G$4","v":{"$error":"#N/A"}},{"$f":"$K$3","v":0.3},{"$f":"H9*E9*(F9-G9)","v":{"$error":"#N/A"}},{"$f":"I9*3600*24/1000","v":{"$error":"#N/A"}},null,null,null,null,{"$f":"H9*(F9-5-G9)*E9","v":{"$error":"#N/A"}}]
[null,null,"Mur gauche","S2",{"$f":"+E9","v":0},35,{"$error":"#N/A"},{"$f":"$K$3","v":0.3},{"$error":"#N/A"},{"$error":"#N/A"},null,null,null,null,{"$f":"H10*(F10-5-G10)*E10","v":{"$error":"#N/A"}}]
[null,null,"Mur fond","S3",{"$f":"E3*E4","v":0},15,{"$error":"#N/A"},{"$f":"$K$3","v":0.3},{"$error":"#N/A"},{"$error":"#N/A"},null,null,null,null,{"$f":"H11*(F11-5-G11)*E11","v":{"$error":"#N/A"}}]
[null,null,"Mur avant","S4",{"$f":"E11","v":0},35,{"$error":"#N/A"},0.5,{"$error":"#N/A"},{"$error":"#N/A"},null,null,null,null,{"$f":"H12*(F12-5-G12)*E12","v":{"$error":"#N/A"}}]
[null,null,"Plafond","S5",{"$f":"E5","v":0},35,{"$error":"#N/A"},{"$f":"$K$3","v":0.3},{"$error":"#N/A"},{"$error":"#N/A"},null,null,null,null,{"$f":"H13*(F13-5-G13)*E13","v":{"$error":"#N/A"}}]
[null,null,"Plancher","S6",{"$f":"E5","v":0},15,{"$error":"#N/A"},0.2,{"$error":"#N/A"},{"$error":"#N/A"},null,null,null,null,{"$f":"H14*(F14-G14)*E14","v":{"$error":"#N/A"}}]
[null,null,"Linéïques",0.1,null,null,null,null,{"$f":"D15*SUM(I9:I14)","v":{"$error":"#N/A"}},{"$f":"D15*SUM(J9:J14)","v":{"$error":"#N/A"}}]
[null,null,"Sous total",null,null,null,null,null,{"$f":"SUM(I9:I15)","v":{"$error":"#N/A"}},{"$f":"I16*24*3.6","v":{"$error":"#N/A"}},{"$f":"J16/$J$48","v":{"$error":"#N/A"}},null,{"$f":"J16","v":{"$error":"#N/A"}},{"$f":"J16","v":{"$error":"#N/A"}},{"$f":"SUM(O9:O15)*24*3.6","v":{"$error":"#N/A"}}]
[]
[null,null,"Entrés","% de charge","kg/jour","T entrée","T stockage","Cp","Apport","Apport"]
[null,null,"Surcharge kg/jour",null,"Débit","°C","°C","kJ/kg/K","W","kJ/24h"]
[null,null,0,{"$error":"#N/A"},{"$error":"#N/A"},{"$error":"#N/A"},{"$f":"G4","v":{"$error":"#N/A"}},{"$error":"#N/A"},{"$f":"H20*(E20+C20 )*(F20-G20)/3600/12*1000","v":{"$error":"#N/A"}},{"$f":"(C20+E20)*H20*(F20-G20)","v":{"$error":"#N/A"}},{"$f":"J20/$J$48","v":{"$error":"#N/A"}},null,{"$f":"IF(LABO=\"non\",J20/E20*G6*$M$5,0)","v":{"$error":"#N/A"}},{"$f":"IF(LABO=\"non\",J20/E20*G6*$N$5,0)","v":{"$error":"#N/A"}},0]
[null,null,"Chaleur respiration",null,"Capacité",null,null,"Chaleur respiration","Apport","Apport"]
[null,null,{"$f":"H1","v":0},null,"Chambre",null,null,"kJ/kg en 24 h","W","kJ/24h"]
[null,null,0,null,{"$f":"capacité","v":{"$error":"#N/A"}},null,null,{"$f":"C23","v":0},{"$f":"J23/24/3600","v":{"$error":"#N/A"}},{"$f":"H23*E23","v":{"$error":"#N/A"}},{"$f":"J23/$J$48","v":{"$error":"#N/A"}},null,{"$f":"+J23","v":{"$error":"#N/A"}},{"$f":"J23","v":{"$error":"#N/A"}},{"$f":"J23","v":{"$error":"#N/A"}}]
[]
[null,null,"Travail ventilateurs",null,"Volume chambre","Taux de brassage","Débit air brassé","Puissance ventilateur","Apport","Apport"]
[null,null,null,null,"m3","sd","m3","W","W","kJ/24h"]
[null,null,null,null,{"$f":"volume","v":0},30,{"$f":"F27*E6","v":0},{"$f":"I27","v":0},{"$f":"G27*0.1","v":0},{"$f":"I27/1000*24*3600","v":0},{"$f":"J27/$J$48","v":{"$error":"#N/A"}},null,{"$f":"J27","v":0},{"$f":"J27","v":0},{"$f":"J27","v":0}]
[]
[null,null,"Air neuf",null,"Renouvellement","Vol massique","Enthalpie Ext","Enthalpie Int","Apport","Apport"]
[null,null,"Activité chambre",null,"m3/24h","m3/kg","kJ/kg","kJ/kg","W","kJ/24h"]
[null,null,"FORT",null,{"$error":"#N/A"},{"$f":"IF(K6=\"NON\",H69,J69)","v":{"$error":"#VALUE!"}},{"$f":"IF(K6=\"NON\",H72,J72)","v":{"$error":"#VALUE!"}},{"$f":"I72","v":{"$error":"#N/A"}},{"$f":"(G31-H31)/F31*E31/(24*3600)*1000","v":{"$error":"#VALUE!"}},{"$f":"(G31-H31)/F31*E31","v":{"$error":"#VALUE!"}},{"$f":"J31/$J$48","v":{"$error":"#VALUE!"}},null,{"$f":"J31","v":{"$error":"#VALUE!"}},{"$f":"J31","v":{"$error":"#VALUE!"}},0]
[null,null,"Taux de renouvellement",{"$f":"E31/volume","v":{"$error":"#N/A"}},"Vol/jour",{"$f":"D32/24","v":{"$error":"#N/A"}},"Vol/h"]
[]
[null,null,"Eclairage",null,"Surface","Ratio","Nb heures fonction",null,"Apport","Apport"]
[null,null,null,null,"m2"," W/m2","h",null,"W","kJ/24h"]
[null,null,null,null,{"$f":"surface","v":0},{"$f":"IF(LABO=\"oui\",0,10)","v":10},4,null,{"$f":"F36*E36","v":0},{"$f":"I36*3600*G36/1000","v":0},{"$f":"J36/$J$48","v":{"$error":"#N/A"}},null,{"$f":"J36","v":0},{"$f":"J36","v":0},"."]
[]
[null,null,"Personnel"]
[null,null,null,null,"Nombre","Ratio","Nb heures fonction",null,"Apport","Apport"]
[null,null,null,null,"personne","W/p","h",null,"W","kJ/24h"]
[null,null,null,null,0,400,4,null,{"$f":"F41*E41","v":0},{"$f":"I41*3600*G41/1000","v":0},{"$f":"J41/$J$48","v":{"$error":"#N/A"}},null,{"$f":"J41","v":0},{"$f":"J41","v":0},0]
[]
[null,null,"Machines",null,null,"Nb heures fonction",null,null,"Apport","Apport"]
[null,null,null,null,"W","h",null,null,"W","kJ/24h"]
[null,null,null,null,0,{"$f":"IF(I6=\"OUI\",10,0)","v":0},null,null,{"$f":"E45","v":0},{"$f":"I45*3600*F45/1000","v":0},{"$f":"J45/$J$48","v":{"$error":"#N/A"}},null,{"$f":"J45","v":0},{"$f":"J45","v":0},{"$f":"J45","v":0}]
[null,null,"Divers",null,0,null,null,null,{"$f":"E46","v":0},{"$f":"I46*3600*24/1000","v":0},{"$f":"J46/$J$48","v":{"$error":"#N/A"}},null,{"$f":"J46","v":0},{"$f":"J46","v":0},{"$f":"J46","v":0}]
[]
[null,null,"TOTAL",null,null,null,null,null,{"$f":"I16+I20+I23+I27+I31+I36+I41+I45+I46","v":{"$error":"#N/A"}},{"$f":"SUM(J16:J46)","v":{"$error":"#N/A"}},{"$f":"SUM(K16:K46)","v":{"$error":"#N/A"}},null,{"$f":"SUM(M16:M46)","v":{"$error":"#N/A"}},{"$f":"SUM(N16:N46)","v":{"$error":"#N/A"}},{"$f":"SUM(O16:O46)","v":{"$error":"#N/A"}}]
[]
[null,null,null,null,"Nombres d'heures de fonctionnement groupes h/jour",null,null,null,"Bilan Chaleur Latente kW"," Bilan production kW",null,null," Bilan production kW"," Bilan production kW"," Bilan production kW"]
[null,null,"PRODUCTION",null,18,"Ratio",{"$f":"J51*1000/E14","v":{"$error":"#N/A"}},"W/m2",{"$f":"IF(K6=\"oui\",2501*(J67-I67)*E31/F31/E51/3600,2500.8*(H67-I67)*E31/F31/E51/3600)","v":{"$error":"#VALUE!"}},{"$f":"J48/$E$51/3600","v":{"$error":"#N/A"}},null,null,{"$f":"M48/$E$51/3600","v":{"$error":"#N/A"}},{"$f":"N48/$E$51/3600","v":{"$error":"#N/A"}},{"$f":"O48/$E$51/3600","v":{"$error":"#N/A"}}]
[null,null,"EMISSION",null,16,null,{"$f":"J52*1000/E14","v":{"$error":"#N/A"}},null,{"$f":"I51/J51","v":{"$error":"#VALUE!"}},{"$f":"J48/$E$52/3600","v":{"$error":"#N/A"}},{"$f":"J52/J51-1","v":{"$error":"#N/A"}},null,{"$f":"M48/$E$52/3600","v":{"$error":"#N/A"}},{"$f":"N48/$E$52/3600","v":{"$error":"#N/A"}},{"$f":"O48/$E$52/3600","v":{"$error":"#N/A"}}]
[]
[]
[null,null,null,null,null,null,null,500,500,500]
[null,null,"VIANDES PRE EMBALLES",null,"TRES FORT","ALTITUDE DU SITE (m)",null,50,50,50]
[null,null,"VOLAILLES PREEMBALLEES",null,"FORT","PRESSION TOTALE P (Pa)",null,{"$f":"1.19745*10^-8*(288.15-0.0065*H56)^5.25588","v":100726.03972155297},{"$f":"1.19745*10^-8*(288.15-0.0065*I56)^5.25588","v":100726.03972155297},{"$f":"1.19745*10^-8*(288.15-0.0065*J56)^5.25588","v":100726.03972155297}]
[null,null,"CARCASSES",null,"MOYEN","POINT",null,"EXT","INT","SAS"]
[null,null,"CHARCUTERIE PREEMBALLE",null,"FAIBLE","t","Température sèche",{"$f":"G2","v":{"$error":"#VALUE!"}},{"$f":"G4","v":{"$error":"#N/A"}},{"$f":"J4","v":10}]
[null,null,"TRAITEUR",null,null,"F ( % )","Humidité relatice",50,{"$f":"G5","v":{"$error":"#N/A"}},{"$f":"J5","v":60}]
[null,null,"CHARIOTS PLATS CUISINES",null,null,"T","Température absolue",{"$f":"H59+273.15","v":{"$error":"#VALUE!"}},{"$f":"I59+273.15","v":{"$error":"#N/A"}},{"$f":"J59+273.15","v":283.14999999999998}]
[null,null,"PATISSERIE FRAICHE",null,"OUI",null,"Pvs si t<0°C",{"$f":"EXP(-5674.359/H61+6.3925247-0.009677843*H61+0.00000062215701*H61^2+0.0000000020747825*H61^3-0.0000000000009484024*H61^4+4.1635019*LN(H61))","v":{"$error":"#VALUE!"}},{"$f":"EXP(-5674.359/I61+6.3925247-0.009677843*I61+0.00000062215701*I61^2+0.0000000020747825*I61^3-0.0000000000009484024*I61^4+4.1635019*LN(I61))","v":{"$error":"#N/A"}},{"$f":"EXP(-5674.359/J61+6.3925247-0.009677843*J61+0.00000062215701*J61^2+0.0000000020747825*J61^3-0.0000000000009484024*J61^4+4.1635019*LN(J61))","v":1352.9554923109872}]
[null,null,"POISSONS SUR GLACE",null,"NON",null,"Pvs si t>0°C",{"$f":"EXP(-5800.2206/H61+1.3914993-0.048640239*H61+0.000041764768*H61^2-0.000000014452093*H61^3+6.5459673*LN(H61))","v":{"$error":"#VALUE!"}},{"$f":"EXP(-5800.2206/I61+1.3914993-0.048640239*I61+0.000041764768*I61^2-0.000000014452093*I61^3+6.5459673*LN(I61))","v":{"$error":"#N/A"}},{"$f":"EXP(-5800.2206/J61+1.3914993-0.048640239*J61+0.000041764768*J61^2-0.000000014452093*J61^3+6.5459673*LN(J61))","v":1227.9952754407796}]
[null,null,"FRUITS ET LEGUMES",null,null,"Pws","Pression partielle de vapeur à saturation",{"$f":"IF(H61<273.15,H62,H63)","v":{"$error":"#VALUE!"}},{"$f":"IF(I61<273.15,I62,I63)","v":{"$error":"#N/A"}},{"$f":"IF(J61<273.15,J62,J63)","v":1227.9952754407796}]
[null,null,"BOF EMBALLES",null,null,"Pv","Pression partielle de vapeur non saturé",{"$f":"H64*H60/100","v":{"$error":"#VALUE!"}},{"$f":"I64*I60/100","v":{"$error":"#N/A"}},{"$f":"J64*J60/100","v":736.79716526446782}]
[null,null,"FROMAGE",null,null,"Pa","Pression partielle de l'air sec",{"$f":"$H$57-H65","v":{"$error":"#VALUE!"}},{"$f":"$H$57-I65","v":{"$error":"#N/A"}},{"$f":"$H$57-J65","v":99989.242556288504}]
[null,null,"BOISSONS",null,null,"w","Humidité absolue non saturée",{"$f":"0.62198*H65/($H$57-H65)","v":{"$error":"#VALUE!"}},{"$f":"0.62198*I65/($H$57-I65)","v":{"$error":"#N/A"}},{"$f":"0.62198*J65/($H$57-J65)","v":4.5832240462588851E-3}]
[null,null,"POUBELLES GRASSES",null,null,"ws","Humidité absolue à saturation",{"$f":"0.62198*H64/($H$57-H64)","v":{"$error":"#VALUE!"}},{"$f":"0.62198*I64/($H$57-I64)","v":{"$error":"#N/A"}},{"$f":"0.62198*J64/($H$57-J64)","v":7.676417216745615E-3}]
[null,null,"PRODUITS SURGELES",null,null,"RO","Masse volumique de l'air sec",{"$f":"(1+H67)/H70","v":{"$error":"#VALUE!"}},{"$f":"(1+I67)/I70","v":{"$error":"#N/A"}},{"$f":"(1+J67)/J70","v":1.235632662064539}]
[null,null,"CREMES GLACEES",null,null,"v'","Volume massique de l'air humide",{"$f":"0.2871*H61*(1+1.6078*H67)/$H$57*1000","v":{"$error":"#VALUE!"}},{"$f":"0.2871*I61*(1+1.6078*I67)/$H$57*1000","v":{"$error":"#N/A"}},{"$f":"0.2871*J61*(1+1.6078*J67)/$H$57*1000","v":0.81301122484716892}]
[null,null,"SAS"]
[null,null,"LABO DECOUPE",null,null,"h","Enthalpie",{"$f":"1.006*H59+H67*(2500.8+1.805*H59)","v":{"$error":"#VALUE!"}},{"$f":"1.006*I59+I67*(2500.8+1.805*I59)","v":{"$error":"#N/A"}},{"$f":"1.006*J59+J67*(2500.8+1.805*J59)","v":21.604453888919195}]
[null,null,"LABO DECOUPE EMBALLAGE"]
[null,null,"LABO EMBALLAGE"]
[]
[]
[]
[]
[null,null,"Désignation","Température","Dimensions",null,null,null,null,"Evaporateurs"]
[null,null,null,null,"Hygrométrie","Longeur","largeur","Surface","hauteur","Volume","Puissance minimum requise",{"$f":"\"à \"&ROUND(D20,0)*100 &\" % de charge en surface\"","v":{"$error":"#N/A"}},"Maximum de charge 50 %","Minimum de charge","DT de sélection","Nbre","Type","Vitesse ventilation","Dégivrage"]
[]
[null,{"$f":"D1","v":"CFP 01"},{"$f":"E1","v":"FRAIS LS"},{"$f":"G4","v":{"$error":"#N/A"}},{"$f":"G5","v":{"$error":"#N/A"}},{"$f":"E2","v":0},{"$f":"E3","v":0},{"$f":"surface","v":0},{"$f":"hauteur","v":0},{"$f":"volume","v":0},{"$f":"J52*1000","v":{"$error":"#N/A"}},{"$f":"J51*1000","v":{"$error":"#N/A"}},{"$f":"N52*1000","v":{"$error":"#N/A"}},{"$f":"O52*1000","v":{"$error":"#N/A"}},{"$error":"#N/A"},1,{"$f":"IF(OR(LABO=\"oui\",H1=\"SAS\"),\"DOUBLE FLUX\",IF(K82<2000,\"PLAFONNIER\",IF(AND(G5<80,K82<7000),\"PLAFONNIER\",\"CUBIQUE\")))","v":{"$error":"#N/A"}},{"$f":"IF(AND(Q82=\"DOUBLE FLUX\",LABO=\"OUI\"),1000,1500)","v":{"$error":"#N/A"}},{"$f":"IF(D82>1,\"Naturel\",\"Electrique\")","v":{"$error":"#N/A"}}]
[]
[]
[null,null,null,null,null,null,null,null,null,null,{"$f":"K82/H82","v":{"$error":"#N/A"}}]

{"sheet":"Table CFN 5","index":34,"n_rows":85,"n_cols":19,"rows_kept":85,"cut":false,"hidden":true,"merged":[[17,3,18,3],[78,2,79,2],[78,3,79,3],[78,4,78,8],[78,9,78,14],[0,0,5,0],[0,1,5,1],[0,5,0,6],[0,7,0,10],[1,7,2,7],[1,9,1,10],[2,8,2,9],[3,7,4,7],[3,10,4,10]]}
["ENTREES","CALCULS","CHAMBRE FROIDE","CFP 01","FRAIS LS","PRODUITS TRAITES",null,{"$f":"'Chambres négative'!I5","v":0}]
[null,null,"Largeur",null,{"$f":"'Chambres négative'!I8","v":0},"TEMPERATURE",{"$f":"Informations!G25","v":{"$error":"#VALUE!"}},"EXT","REP"]
[null,null,"Longueur",null,{"$f":"'Chambres négative'!I9","v":0},"HUMIDITE ",50,null,"COEF TRANSMISSION",null,0.3]
[null,null,"Hauteur sous plafond",null,{"$f":"'Chambres négative'!I10","v":0},"TEMPERATURE",{"$error":"#N/A"},"INT","TEMPERATURE",10,"SAS",null,"CHARGEMENT","CHARGEMENT","NUIT"]
[null,null,"Surface",null,{"$f":"E3*E2","v":0},"HUMIDITE ",{"$error":"#N/A"},null,"HUMIDITE ",60,null,null,0.5,0.75,"Activité 0"]
[null,null,"Volume",null,{"$f":"E5*E4","v":0},"CAPACITE CF",{"$error":"#N/A"},"LABO","NON",null,"NON"]
[null,null,"BILAN ",null,null,"Text","T in","k","Apport","Apport"]
[null,null,"Déperditions",null,"m2","°C","°C","W/m2/K","W","kJ/24h"]
[null,null,"Mur droit","S1",{"$f":"E2*E4","v":0},35,{"$f":"$G$4","v":{"$error":"#N/A"}},{"$f":"$K$3","v":0.3},{"$f":"H9*E9*(F9-G9)","v":{"$error":"#N/A"}},{"$f":"I9*3600*24/1000","v":{"$error":"#N/A"}},null,null,null,null,{"$f":"H9*(F9-5-G9)*E9","v":{"$error":"#N/A"}}]
[null,null,"Mur gauche","S2",{"$f":"+E9","v":0},35,{"$error":"#N/A"},{"$f":"$K$3","v":0.3},{"$error":"#N/A"},{"$error":"#N/A"},null,null,null,null,{"$f":"H10*(F10-5-G10)*E10","v":{"$error":"#N/A"}}]
[null,null,"Mur fond","S3",{"$f":"E3*E4","v":0},15,{"$error":"#N/A"},{"$f":"$K$3","v":0.3},{"$error":"#N/A"},{"$error":"#N/A"},null,null,null,null,{"$f":"H11*(F11-5-G11)*E11","v":{"$error":"#N/A"}}]
[null,null,"Mur avant","S4",{"$f":"E11","v":0},35,{"$error":"#N/A"},0.5,{"$error":"#N/A"},{"$error":"#N/A"},null,null,null,null,{"$f":"H12*(F12-5-G12)*E12","v":{"$error":"#N/A"}}]
[null,null,"Plafond","S5",{"$f":"E5","v":0},35,{"$error":"#N/A"},{"$f":"$K$3","v":0.3},{"$error":"#N/A"},{"$error":"#N/A"},null,null,null,null,{"$f":"H13*(F13-5-G13)*E13","v":{"$error":"#N/A"}}]
[null,null,"Plancher","S6",{"$f":"E5","v":0},15,{"$error":"#N/A"},0.2,{"$error":"#N/A"},{"$error":"#N/A"},null,null,null,null,{"$f":"H14*(F14-G14)*E14","v":{"$error":"#N/A"}}]
[null,null,"Linéïques",0.1,null,null,null,null,{"$f":"D15*SUM(I9:I14)","v":{"$error":"#N/A"}},{"$f":"D15*SUM(J9:J14)","v":{"$error":"#N/A"}}]
[null,null,"Sous total",null,null,null,null,null,{"$f":"SUM(I9:I15)","v":{"$error":"#N/A"}},{"$f":"I16*24*3.6","v":{"$error":"#N/A"}},{"$f":"J16/$J$48","v":{"$error":"#N/A"}},null,{"$f":"J16","v":{"$error":"#N/A"}},{"$f":"J16","v":{"$error":"#N/A"}},{"$f":"SUM(O9:O15)*24*3.6","v":{"$error":"#N/A"}}]
[]
[null,null,"Entrés","% de charge","kg/jour","T entrée","T stockage","Cp","Apport","Apport"]
[null,null,"Surcharge kg/jour",null,"Débit","°C","°C","kJ/kg/K","W","kJ/24h"]
[null,null,0,{"$error":"#N/A"},{"$error":"#N/A"},{"$error":"#N/A"},{"$f":"G4","v":{"$error":"#N/A"}},{"$error":"#N/A"},{"$f":"H20*(E20+C20 )*(F20-G20)/3600/12*1000","v":{"$error":"#N/A"}},{"$f":"(C20+E20)*H20*(F20-G20)","v":{"$error":"#N/A"}},{"$f":"J20/$J$48","v":{"$error":"#N/A"}},null,{"$f":"IF(LABO=\"non\",J20/E20*G6*$M$5,0)","v":{"$error":"#N/A"}},{"$f":"IF(LABO=\"non\",J20/E20*G6*$N$5,0)","v":{"$error":"#N/A"}},0]
[null,null,"Chaleur respiration",null,"Capacité",null,null,"Chaleur respiration","Apport","Apport"]
[null,null,{"$f":"H1","v":0},null,"Chambre",null,null,"kJ/kg en 24 h","W","kJ/24h"]
[null,null,0,null,{"$f":"capacité","v":{"$error":"#N/A"}},null,null,{"$f":"C23","v":0},{"$f":"J23/24/3600","v":{"$error":"#N/A"}},{"$f":"H23*E23","v":{"$error":"#N/A"}},{"$f":"J23/$J$48","v":{"$error":"#N/A"}},null,{"$f":"+J23","v":{"$error":"#N/A"}},{"$f":"J23","v":{"$error":"#N/A"}},{"$f":"J23","v":{"$error":"#N/A"}}]
[]
[null,null,"Travail ventilateurs",null,"Volume chambre","Taux de brassage","Débit air brassé","Puissance ventilateur","Apport","Apport"]
[null,null,null,null,"m3","sd","m3","W","W","kJ/24h"]
[null,null,null,null,{"$f":"volume","v":0},30,{"$f":"F27*E6","v":0},{"$f":"I27","v":0},{"$f":"G27*0.1","v":0},{"$f":"I27/1000*24*3600","v":0},{"$f":"J27/$J$48","v":{"$error":"#N/A"}},null,{"$f":"J27","v":0},{"$f":"J27","v":0},{"$f":"J27","v":0}]
[]
[null,null,"Air neuf",null,"Renouvellement","Vol massique","Enthalpie Ext","Enthalpie Int","Apport","Apport"]
[null,null,"Activité chambre",null,"m3/24h","m3/kg","kJ/kg","kJ/kg","W","kJ/24h"]
[null,null,"FORT",null,{"$error":"#N/A"},{"$f":"IF(K6=\"NON\",H69,J69)","v":{"$error":"#VALUE!"}},{"$f":"IF(K6=\"NON\",H72,J72)","v":{"$error":"#VALUE!"}},{"$f":"I72","v":{"$error":"#N/A"}},{"$f":"(G31-H31)/F31*E31/(24*3600)*1000","v":{"$error":"#VALUE!"}},{"$f":"(G31-H31)/F31*E31","v":{"$error":"#VALUE!"}},{"$f":"J31/$J$48","v":{"$error":"#VALUE!"}},null,{"$f":"J31","v":{"$error":"#VALUE!"}},{"$f":"J31","v":{"$error":"#VALUE!"}},0]
[null,null,"Taux de renouvellement",{"$f":"E31/volume","v":{"$error":"#N/A"}},"Vol/jour",{"$f":"D32/24","v":{"$error":"#N/A"}},"Vol/h"]
[]
[null,null,"Eclairage",null,"Surface","Ratio","Nb heures fonction",null,"Apport","Apport"]
[null,null,null,null,"m2"," W/m2","h",null,"W","kJ/24h"]
[null,null,null,null,{"$f":"surface","v":0},{"$f":"IF(LABO=\"oui\",0,10)","v":10},4,null,{"$f":"F36*E36","v":0},{"$f":"I36*3600*G36/1000","v":0},{"$f":"J36/$J$48","v":{"$error":"#N/A"}},null,{"$f":"J36","v":0},{"$f":"J36","v":0},"."]
[]
[null,null,"Personnel"]
[null,null,null,null,"Nombre","Ratio","Nb heures fonction",null,"Apport","Apport"]
[null,null,null,null,"personne","W/p","h",null,"W","kJ/24h"]
[null,null,null,null,0,400,4,null,{"$f":"F41*E41","v":0},{"$f":"I41*3600*G41/1000","v":0},{"$f":"J41/$J$48","v":{"$error":"#N/A"}},null,{"$f":"J41","v":0},{"$f":"J41","v":0},0]
[]
[null,null,"Machines",null,null,"Nb heures fonction",null,null,"Apport","Apport"]
[null,null,null,null,"W","h",null,null,"W","kJ/24h"]
[null,null,null,null,0,{"$f":"IF(I6=\"OUI\",10,0)","v":0},null,null,{"$f":"E45","v":0},{"$f":"I45*3600*F45/1000","v":0},{"$f":"J45/$J$48","v":{"$error":"#N/A"}},null,{"$f":"J45","v":0},{"$f":"J45","v":0},{"$f":"J45","v":0}]
[null,null,"Divers",null,0,null,null,null,{"$f":"E46","v":0},{"$f":"I46*3600*24/1000","v":0},{"$f":"J46/$J$48","v":{"$error":"#N/A"}},null,{"$f":"J46","v":0},{"$f":"J46","v":0},{"$f":"J46","v":0}]
[]
[null,null,"TOTAL",null,null,null,null,null,{"$f":"I16+I20+I23+I27+I31+I36+I41+I45+I46","v":{"$error":"#N/A"}},{"$f":"SUM(J16:J46)","v":{"$error":"#N/A"}},{"$f":"SUM(K16:K46)","v":{"$error":"#N/A"}},null,{"$f":"SUM(M16:M46)","v":{"$error":"#N/A"}},{"$f":"SUM(N16:N46)","v":{"$error":"#N/A"}},{"$f":"SUM(O16:O46)","v":{"$error":"#N/A"}}]
[]
[null,null,null,null,"Nombres d'heures de fonctionnement groupes h/jour",null,null,null,"Bilan Chaleur Latente kW"," Bilan production kW",null,null," Bilan production kW"," Bilan production kW"," Bilan production kW"]
[null,null,"PRODUCTION",null,18,"Ratio",{"$f":"J51*1000/E14","v":{"$error":"#N/A"}},"W/m2",{"$f":"IF(K6=\"oui\",2501*(J67-I67)*E31/F31/E51/3600,2500.8*(H67-I67)*E31/F31/E51/3600)","v":{"$error":"#VALUE!"}},{"$f":"J48/$E$51/3600","v":{"$error":"#N/A"}},null,null,{"$f":"M48/$E$51/3600","v":{"$error":"#N/A"}},{"$f":"N48/$E$51/3600","v":{"$error":"#N/A"}},{"$f":"O48/$E$51/3600","v":{"$error":"#N/A"}}]
[null,null,"EMISSION",null,16,null,{"$f":"J52*1000/E14","v":{"$error":"#N/A"}},null,{"$f":"I51/J51","v":{"$error":"#VALUE!"}},{"$f":"J48/$E$52/3600","v":{"$error":"#N/A"}},{"$f":"J52/J51-1","v":{"$error":"#N/A"}},null,{"$f":"M48/$E$52/3600","v":{"$error":"#N/A"}},{"$f":"N48/$E$52/3600","v":{"$error":"#N/A"}},{"$f":"O48/$E$52/3600","v":{"$error":"#N/A"}}]
[]
[]
[null,null,null,null,null,null,null,500,500,500]
[null,null,"VIANDES PRE EMBALLES",null,"TRES FORT","ALTITUDE DU SITE (m)",null,50,50,50]
[null,null,"VOLAILLES PREEMBALLEES",null,"FORT","PRESSION TOTALE P (Pa)",null,{"$f":"1.19745*10^-8*(288.15-0.0065*H56)^5.25588","v":100726.03972155297},{"$f":"1.19745*10^-8*(288.15-0.0065*I56)^5.25588","v":100726.03972155297},{"$f":"1.19745*10^-8*(288.15-0.0065*J56)^5.25588","v":100726.03972155297}]
[null,null,"CARCASSES",null,"MOYEN","POINT",null,"EXT","INT","SAS"]
[null,null,"CHARCUTERIE PREEMBALLE",null,"FAIBLE","t","Température sèche",{"$f":"G2","v":{"$error":"#VALUE!"}},{"$f":"G4","v":{"$error":"#N/A"}},{"$f":"J4","v":10}]
[null,null,"TRAITEUR",null,null,"F ( % )","Humidité relatice",50,{"$f":"G5","v":{"$error":"#N/A"}},{"$f":"J5","v":60}]
[null,null,"CHARIOTS PLATS CUISINES",null,null,"T","Température absolue",{"$f":"H59+273.15","v":{"$error":"#VALUE!"}},{"$f":"I59+273.15","v":{"$error":"#N/A"}},{"$f":"J59+273.15","v":283.14999999999998}]
[null,null,"PATISSERIE FRAICHE",null,"OUI",null,"Pvs si t<0°C",{"$f":"EXP(-5674.359/H61+6.3925247-0.009677843*H61+0.00000062215701*H61^2+0.0000000020747825*H61^3-0.0000000000009484024*H61^4+4.1635019*LN(H61))","v":{"$error":"#VALUE!"}},{"$f":"EXP(-5674.359/I61+6.3925247-0.009677843*I61+0.00000062215701*I61^2+0.0000000020747825*I61^3-0.0000000000009484024*I61^4+4.1635019*LN(I61))","v":{"$error":"#N/A"}},{"$f":"EXP(-5674.359/J61+6.3925247-0.009677843*J61+0.00000062215701*J61^2+0.0000000020747825*J61^3-0.0000000000009484024*J61^4+4.1635019*LN(J61))","v":1352.9554923109872}]
[null,null,"POISSONS SUR GLACE",null,"NON",null,"Pvs si t>0°C",{"$f":"EXP(-5800.2206/H61+1.3914993-0.048640239*H61+0.000041764768*H61^2-0.000000014452093*H61^3+6.5459673*LN(H61))","v":{"$error":"#VALUE!"}},{"$f":"EXP(-5800.2206/I61+1.3914993-0.048640239*I61+0.000041764768*I61^2-0.000000014452093*I61^3+6.5459673*LN(I61))","v":{"$error":"#N/A"}},{"$f":"EXP(-5800.2206/J61+1.3914993-0.048640239*J61+0.000041764768*J61^2-0.000000014452093*J61^3+6.5459673*LN(J61))","v":1227.9952754407796}]
[null,null,"FRUITS ET LEGUMES",null,null,"Pws","Pression partielle de vapeur à saturation",{"$f":"IF(H61<273.15,H62,H63)","v":{"$error":"#VALUE!"}},{"$f":"IF(I61<273.15,I62,I63)","v":{"$error":"#N/A"}},{"$f":"IF(J61<273.15,J62,J63)","v":1227.9952754407796}]
[null,null,"BOF EMBALLES",null,null,"Pv","Pression partielle de vapeur non saturé",{"$f":"H64*H60/100","v":{"$error":"#VALUE!"}},{"$f":"I64*I60/100","v":{"$error":"#N/A"}},{"$f":"J64*J60/100","v":736.79716526446782}]
[null,null,"FROMAGE",null,null,"Pa","Pression partielle de l'air sec",{"$f":"$H$57-H65","v":{"$error":"#VALUE!"}},{"$f":"$H$57-I65","v":{"$error":"#N/A"}},{"$f":"$H$57-J65","v":99989.242556288504}]
[null,null,"BOISSONS",null,null,"w","Humidité absolue non saturée",{"$f":"0.62198*H65/($H$57-H65)","v":{"$error":"#VALUE!"}},{"$f":"0.62198*I65/($H$57-I65)","v":{"$error":"#N/A"}},{"$f":"0.62198*J65/($H$57-J65)","v":4.5832240462588851E-3}]
[null,null,"POUBELLES GRASSES",null,null,"ws","Humidité absolue à saturation",{"$f":"0.62198*H64/($H$57-H64)","v":{"$error":"#VALUE!"}},{"$f":"0.62198*I64/($H$57-I64)","v":{"$error":"#N/A"}},{"$f":"0.62198*J64/($H$57-J64)","v":7.676417216745615E-3}]
[null,null,"PRODUITS SURGELES",null,null,"RO","Masse volumique de l'air sec",{"$f":"(1+H67)/H70","v":{"$error":"#VALUE!"}},{"$f":"(1+I67)/I70","v":{"$error":"#N/A"}},{"$f":"(1+J67)/J70","v":1.235632662064539}]
[null,null,"CREMES GLACEES",null,null,"v'","Volume massique de l'air humide",{"$f":"0.2871*H61*(1+1.6078*H67)/$H$57*1000","v":{"$error":"#VALUE!"}},{"$f":"0.2871*I61*(1+1.6078*I67)/$H$57*1000","v":{"$error":"#N/A"}},{"$f":"0.2871*J61*(1+1.6078*J67)/$H$57*1000","v":0.81301122484716892}]
[null,null,"SAS"]
[null,null,"LABO DECOUPE",null,null,"h","Enthalpie",{"$f":"1.006*H59+H67*(2500.8+1.805*H59)","v":{"$error":"#VALUE!"}},{"$f":"1.006*I59+I67*(2500.8+1.805*I59)","v":{"$error":"#N/A"}},{"$f":"1.006*J59+J67*(2500.8+1.805*J59)","v":21.604453888919195}]
[null,null,"LABO DECOUPE EMBALLAGE"]
[null,null,"LABO EMBALLAGE"]
[]
[]
[]
[]
[null,null,"Désignation","Température","Dimensions",null,null,null,null,"Evaporateurs"]
[null,null,null,null,"Hygrométrie","Longeur","largeur","Surface","hauteur","Volume","Puissance minimum requise",{"$f":"\"à \"&ROUND(D20,0)*100 &\" % de charge en surface\"","v":{"$error":"#N/A"}},"Maximum de charge 50 %","Minimum de charge","DT de sélection","Nbre","Type","Vitesse ventilation","Dégivrage"]
[]
[null,{"$f":"D1","v":"CFP 01"},{"$f":"E1","v":"FRAIS LS"},{"$f":"G4","v":{"$error":"#N/A"}},{"$f":"G5","v":{"$error":"#N/A"}},{"$f":"E2","v":0},{"$f":"E3","v":0},{"$f":"surface","v":0},{"$f":"hauteur","v":0},{"$f":"volume","v":0},{"$f":"J52*1000","v":{"$error":"#N/A"}},{"$f":"J51*1000","v":{"$error":"#N/A"}},{"$f":"N52*1000","v":{"$error":"#N/A"}},{"$f":"O52*1000","v":{"$error":"#N/A"}},{"$error":"#N/A"},1,{"$f":"IF(OR(LABO=\"oui\",H1=\"SAS\"),\"DOUBLE FLUX\",IF(K82<2000,\"PLAFONNIER\",IF(AND(G5<80,K82<7000),\"PLAFONNIER\",\"CUBIQUE\")))","v":{"$error":"#N/A"}},{"$f":"IF(AND(Q82=\"DOUBLE FLUX\",LABO=\"OUI\"),1000,1500)","v":{"$error":"#N/A"}},{"$f":"IF(D82>1,\"Naturel\",\"Electrique\")","v":{"$error":"#N/A"}}]
[]
[]
[null,null,null,null,null,null,null,null,null,null,{"$f":"K82/H82","v":{"$error":"#N/A"}}]

{"sheet":"Table CFN 6","index":35,"n_rows":85,"n_cols":19,"rows_kept":85,"cut":false,"hidden":true,"merged":[[17,3,18,3],[78,2,79,2],[78,3,79,3],[78,4,78,8],[78,9,78,14],[0,0,5,0],[0,1,5,1],[0,5,0,6],[0,7,0,10],[1,7,2,7],[1,9,1,10],[2,8,2,9],[3,7,4,7],[3,10,4,10]]}
["ENTREES","CALCULS","CHAMBRE FROIDE","CFP 01","FRAIS LS","PRODUITS TRAITES",null,{"$f":"'Chambres négative'!J5","v":0}]
[null,null,"Largeur",null,{"$f":"'Chambres négative'!J8","v":0},"TEMPERATURE",{"$f":"Informations!G25","v":{"$error":"#VALUE!"}},"EXT","REP"]
[null,null,"Longueur",null,{"$f":"'Chambres négative'!J9","v":0},"HUMIDITE ",50,null,"COEF TRANSMISSION",null,0.3]
[null,null,"Hauteur sous plafond",null,{"$f":"'Chambres négative'!J10","v":0},"TEMPERATURE",{"$error":"#N/A"},"INT","TEMPERATURE",10,"SAS",null,"CHARGEMENT","CHARGEMENT","NUIT"]
[null,null,"Surface",null,{"$f":"E3*E2","v":0},"HUMIDITE ",{"$error":"#N/A"},null,"HUMIDITE ",60,null,null,0.5,0.75,"Activité 0"]
[null,null,"Volume",null,{"$f":"E5*E4","v":0},"CAPACITE CF",{"$error":"#N/A"},"LABO","NON",null,"NON"]
[null,null,"BILAN ",null,null,"Text","T in","k","Apport","Apport"]
[null,null,"Déperditions",null,"m2","°C","°C","W/m2/K","W","kJ/24h"]
[null,null,"Mur droit","S1",{"$f":"E2*E4","v":0},35,{"$f":"$G$4","v":{"$error":"#N/A"}},{"$f":"$K$3","v":0.3},{"$f":"H9*E9*(F9-G9)","v":{"$error":"#N/A"}},{"$f":"I9*3600*24/1000","v":{"$error":"#N/A"}},null,null,null,null,{"$f":"H9*(F9-5-G9)*E9","v":{"$error":"#N/A"}}]
[null,null,"Mur gauche","S2",{"$f":"+E9","v":0},35,{"$error":"#N/A"},{"$f":"$K$3","v":0.3},{"$error":"#N/A"},{"$error":"#N/A"},null,null,null,null,{"$f":"H10*(F10-5-G10)*E10","v":{"$error":"#N/A"}}]
[null,null,"Mur fond","S3",{"$f":"E3*E4","v":0},15,{"$error":"#N/A"},{"$f":"$K$3","v":0.3},{"$error":"#N/A"},{"$error":"#N/A"},null,null,null,null,{"$f":"H11*(F11-5-G11)*E11","v":{"$error":"#N/A"}}]
[null,null,"Mur avant","S4",{"$f":"E11","v":0},35,{"$error":"#N/A"},0.5,{"$error":"#N/A"},{"$error":"#N/A"},null,null,null,null,{"$f":"H12*(F12-5-G12)*E12","v":{"$error":"#N/A"}}]
[null,null,"Plafond","S5",{"$f":"E5","v":0},35,{"$error":"#N/A"},{"$f":"$K$3","v":0.3},{"$error":"#N/A"},{"$error":"#N/A"},null,null,null,null,{"$f":"H13*(F13-5-G13)*E13","v":{"$error":"#N/A"}}]
[null,null,"Plancher","S6",{"$f":"E5","v":0},15,{"$error":"#N/A"},0.2,{"$error":"#N/A"},{"$error":"#N/A"},null,null,null,null,{"$f":"H14*(F14-G14)*E14","v":{"$error":"#N/A"}}]
[null,null,"Linéïques",0.1,null,null,null,null,{"$f":"D15*SUM(I9:I14)","v":{"$error":"#N/A"}},{"$f":"D15*SUM(J9:J14)","v":{"$error":"#N/A"}}]
[null,null,"Sous total",null,null,null,null,null,{"$f":"SUM(I9:I15)","v":{"$error":"#N/A"}},{"$f":"I16*24*3.6","v":{"$error":"#N/A"}},{"$f":"J16/$J$48","v":{"$error":"#N/A"}},null,{"$f":"J16","v":{"$error":"#N/A"}},{"$f":"J16","v":{"$error":"#N/A"}},{"$f":"SUM(O9:O15)*24*3.6","v":{"$error":"#N/A"}}]
[]
[null,null,"Entrés","% de charge","kg/jour","T entrée","T stockage","Cp","Apport","Apport"]
[null,null,"Surcharge kg/jour",null,"Débit","°C","°C","kJ/kg/K","W","kJ/24h"]
[null,null,0,{"$error":"#N/A"},{"$error":"#N/A"},{"$error":"#N/A"},{"$f":"G4","v":{"$error":"#N/A"}},{"$error":"#N/A"},{"$f":"H20*(E20+C20 )*(F20-G20)/3600/12*1000","v":{"$error":"#N/A"}},{"$f":"(C20+E20)*H20*(F20-G20)","v":{"$error":"#N/A"}},{"$f":"J20/$J$48","v":{"$error":"#N/A"}},null,{"$f":"IF(LABO=\"non\",J20/E20*G6*$M$5,0)","v":{"$error":"#N/A"}},{"$f":"IF(LABO=\"non\",J20/E20*G6*$N$5,0)","v":{"$error":"#N/A"}},0]
[null,null,"Chaleur respiration",null,"Capacité",null,null,"Chaleur respiration","Apport","Apport"]
[null,null,{"$f":"H1","v":0},null,"Chambre",null,null,"kJ/kg en 24 h","W","kJ/24h"]
[null,null,0,null,{"$f":"capacité","v":{"$error":"#N/A"}},null,null,{"$f":"C23","v":0},{"$f":"J23/24/3600","v":{"$error":"#N/A"}},{"$f":"H23*E23","v":{"$error":"#N/A"}},{"$f":"J23/$J$48","v":{"$error":"#N/A"}},null,{"$f":"+J23","v":{"$error":"#N/A"}},{"$f":"J23","v":{"$error":"#N/A"}},{"$f":"J23","v":{"$error":"#N/A"}}]
[]
[null,null,"Travail ventilateurs",null,"Volume chambre","Taux de brassage","Débit air brassé","Puissance ventilateur","Apport","Apport"]
[null,null,null,null,"m3","sd","m3","W","W","kJ/24h"]
[null,null,null,null,{"$f":"volume","v":0},30,{"$f":"F27*E6","v":0},{"$f":"I27","v":0},{"$f":"G27*0.1","v":0},{"$f":"I27/1000*24*3600","v":0},{"$f":"J27/$J$48","v":{"$error":"#N/A"}},null,{"$f":"J27","v":0},{"$f":"J27","v":0},{"$f":"J27","v":0}]
[]
[null,null,"Air neuf",null,"Renouvellement","Vol massique","Enthalpie Ext","Enthalpie Int","Apport","Apport"]
[null,null,"Activité chambre",null,"m3/24h","m3/kg","kJ/kg","kJ/kg","W","kJ/24h"]
[null,null,"FORT",null,{"$error":"#N/A"},{"$f":"IF(K6=\"NON\",H69,J69)","v":{"$error":"#VALUE!"}},{"$f":"IF(K6=\"NON\",H72,J72)","v":{"$error":"#VALUE!"}},{"$f":"I72","v":{"$error":"#N/A"}},{"$f":"(G31-H31)/F31*E31/(24*3600)*1000","v":{"$error":"#VALUE!"}},{"$f":"(G31-H31)/F31*E31","v":{"$error":"#VALUE!"}},{"$f":"J31/$J$48","v":{"$error":"#VALUE!"}},null,{"$f":"J31","v":{"$error":"#VALUE!"}},{"$f":"J31","v":{"$error":"#VALUE!"}},0]
[null,null,"Taux de renouvellement",{"$f":"E31/volume","v":{"$error":"#N/A"}},"Vol/jour",{"$f":"D32/24","v":{"$error":"#N/A"}},"Vol/h"]
[]
[null,null,"Eclairage",null,"Surface","Ratio","Nb heures fonction",null,"Apport","Apport"]
[null,null,null,null,"m2"," W/m2","h",null,"W","kJ/24h"]
[null,null,null,null,{"$f":"surface","v":0},{"$f":"IF(LABO=\"oui\",0,10)","v":10},4,null,{"$f":"F36*E36","v":0},{"$f":"I36*3600*G36/1000","v":0},{"$f":"J36/$J$48","v":{"$error":"#N/A"}},null,{"$f":"J36","v":0},{"$f":"J36","v":0},"."]
[]
[null,null,"Personnel"]
[null,null,null,null,"Nombre","Ratio","Nb heures fonction",null,"Apport","Apport"]
[null,null,null,null,"personne","W/p","h",null,"W","kJ/24h"]
[null,null,null,null,0,400,4,null,{"$f":"F41*E41","v":0},{"$f":"I41*3600*G41/1000","v":0},{"$f":"J41/$J$48","v":{"$error":"#N/A"}},null,{"$f":"J41","v":0},{"$f":"J41","v":0},0]
[]
[null,null,"Machines",null,null,"Nb heures fonction",null,null,"Apport","Apport"]
[null,null,null,null,"W","h",null,null,"W","kJ/24h"]
[null,null,null,null,0,{"$f":"IF(I6=\"OUI\",10,0)","v":0},null,null,{"$f":"E45","v":0},{"$f":"I45*3600*F45/1000","v":0},{"$f":"J45/$J$48","v":{"$error":"#N/A"}},null,{"$f":"J45","v":0},{"$f":"J45","v":0},{"$f":"J45","v":0}]
[null,null,"Divers",null,0,null,null,null,{"$f":"E46","v":0},{"$f":"I46*3600*24/1000","v":0},{"$f":"J46/$J$48","v":{"$error":"#N/A"}},null,{"$f":"J46","v":0},{"$f":"J46","v":0},{"$f":"J46","v":0}]
[]
[null,null,"TOTAL",null,null,null,null,null,{"$f":"I16+I20+I23+I27+I31+I36+I41+I45+I46","v":{"$error":"#N/A"}},{"$f":"SUM(J16:J46)","v":{"$error":"#N/A"}},{"$f":"SUM(K16:K46)","v":{"$error":"#N/A"}},null,{"$f":"SUM(M16:M46)","v":{"$error":"#N/A"}},{"$f":"SUM(N16:N46)","v":{"$error":"#N/A"}},{"$f":"SUM(O16:O46)","v":{"$error":"#N/A"}}]
[]
[null,null,null,null,"Nombres d'heures de fonctionnement groupes h/jour",null,null,null,"Bilan Chaleur Latente kW"," Bilan production kW",null,null," Bilan production kW"," Bilan production kW"," Bilan production kW"]
[null,null,"PRODUCTION",null,18,"Ratio",{"$f":"J51*1000/E14","v":{"$error":"#N/A"}},"W/m2",{"$f":"IF(K6=\"oui\",2501*(J67-I67)*E31/F31/E51/3600,2500.8*(H67-I67)*E31/F31/E51/3600)","v":{"$error":"#VALUE!"}},{"$f":"J48/$E$51/3600","v":{"$error":"#N/A"}},null,null,{"$f":"M48/$E$51/3600","v":{"$error":"#N/A"}},{"$f":"N48/$E$51/3600","v":{"$error":"#N/A"}},{"$f":"O48/$E$51/3600","v":{"$error":"#N/A"}}]
[null,null,"EMISSION",null,16,null,{"$f":"J52*1000/E14","v":{"$error":"#N/A"}},null,{"$f":"I51/J51","v":{"$error":"#VALUE!"}},{"$f":"J48/$E$52/3600","v":{"$error":"#N/A"}},{"$f":"J52/J51-1","v":{"$error":"#N/A"}},null,{"$f":"M48/$E$52/3600","v":{"$error":"#N/A"}},{"$f":"N48/$E$52/3600","v":{"$error":"#N/A"}},{"$f":"O48/$E$52/3600","v":{"$error":"#N/A"}}]
[]
[]
[null,null,null,null,null,null,null,500,500,500]
[null,null,"VIANDES PRE EMBALLES",null,"TRES FORT","ALTITUDE DU SITE (m)",null,50,50,50]
[null,null,"VOLAILLES PREEMBALLEES",null,"FORT","PRESSION TOTALE P (Pa)",null,{"$f":"1.19745*10^-8*(288.15-0.0065*H56)^5.25588","v":100726.03972155297},{"$f":"1.19745*10^-8*(288.15-0.0065*I56)^5.25588","v":100726.03972155297},{"$f":"1.19745*10^-8*(288.15-0.0065*J56)^5.25588","v":100726.03972155297}]
[null,null,"CARCASSES",null,"MOYEN","POINT",null,"EXT","INT","SAS"]
[null,null,"CHARCUTERIE PREEMBALLE",null,"FAIBLE","t","Température sèche",{"$f":"G2","v":{"$error":"#VALUE!"}},{"$f":"G4","v":{"$error":"#N/A"}},{"$f":"J4","v":10}]
[null,null,"TRAITEUR",null,null,"F ( % )","Humidité relatice",50,{"$f":"G5","v":{"$error":"#N/A"}},{"$f":"J5","v":60}]
[null,null,"CHARIOTS PLATS CUISINES",null,null,"T","Température absolue",{"$f":"H59+273.15","v":{"$error":"#VALUE!"}},{"$f":"I59+273.15","v":{"$error":"#N/A"}},{"$f":"J59+273.15","v":283.14999999999998}]
[null,null,"PATISSERIE FRAICHE",null,"OUI",null,"Pvs si t<0°C",{"$f":"EXP(-5674.359/H61+6.3925247-0.009677843*H61+0.00000062215701*H61^2+0.0000000020747825*H61^3-0.0000000000009484024*H61^4+4.1635019*LN(H61))","v":{"$error":"#VALUE!"}},{"$f":"EXP(-5674.359/I61+6.3925247-0.009677843*I61+0.00000062215701*I61^2+0.0000000020747825*I61^3-0.0000000000009484024*I61^4+4.1635019*LN(I61))","v":{"$error":"#N/A"}},{"$f":"EXP(-5674.359/J61+6.3925247-0.009677843*J61+0.00000062215701*J61^2+0.0000000020747825*J61^3-0.0000000000009484024*J61^4+4.1635019*LN(J61))","v":1352.9554923109872}]
[null,null,"POISSONS SUR GLACE",null,"NON",null,"Pvs si t>0°C",{"$f":"EXP(-5800.2206/H61+1.3914993-0.048640239*H61+0.000041764768*H61^2-0.000000014452093*H61^3+6.5459673*LN(H61))","v":{"$error":"#VALUE!"}},{"$f":"EXP(-5800.2206/I61+1.3914993-0.048640239*I61+0.000041764768*I61^2-0.000000014452093*I61^3+6.5459673*LN(I61))","v":{"$error":"#N/A"}},{"$f":"EXP(-5800.2206/J61+1.3914993-0.048640239*J61+0.000041764768*J61^2-0.000000014452093*J61^3+6.5459673*LN(J61))","v":1227.9952754407796}]
[null,null,"FRUITS ET LEGUMES",null,null,"Pws","Pression partielle de vapeur à saturation",{"$f":"IF(H61<273.15,H62,H63)","v":{"$error":"#VALUE!"}},{"$f":"IF(I61<273.15,I62,I63)","v":{"$error":"#N/A"}},{"$f":"IF(J61<273.15,J62,J63)","v":1227.9952754407796}]
[null,null,"BOF EMBALLES",null,null,"Pv","Pression partielle de vapeur non saturé",{"$f":"H64*H60/100","v":{"$error":"#VALUE!"}},{"$f":"I64*I60/100","v":{"$error":"#N/A"}},{"$f":"J64*J60/100","v":736.79716526446782}]
[null,null,"FROMAGE",null,null,"Pa","Pression partielle de l'air sec",{"$f":"$H$57-H65","v":{"$error":"#VALUE!"}},{"$f":"$H$57-I65","v":{"$error":"#N/A"}},{"$f":"$H$57-J65","v":99989.242556288504}]
[null,null,"BOISSONS",null,null,"w","Humidité absolue non saturée",{"$f":"0.62198*H65/($H$57-H65)","v":{"$error":"#VALUE!"}},{"$f":"0.62198*I65/($H$57-I65)","v":{"$error":"#N/A"}},{"$f":"0.62198*J65/($H$57-J65)","v":4.5832240462588851E-3}]
[null,null,"POUBELLES GRASSES",null,null,"ws","Humidité absolue à saturation",{"$f":"0.62198*H64/($H$57-H64)","v":{"$error":"#VALUE!"}},{"$f":"0.62198*I64/($H$57-I64)","v":{"$error":"#N/A"}},{"$f":"0.62198*J64/($H$57-J64)","v":7.676417216745615E-3}]
[null,null,"PRODUITS SURGELES",null,null,"RO","Masse volumique de l'air sec",{"$f":"(1+H67)/H70","v":{"$error":"#VALUE!"}},{"$f":"(1+I67)/I70","v":{"$error":"#N/A"}},{"$f":"(1+J67)/J70","v":1.235632662064539}]
[null,null,"CREMES GLACEES",null,null,"v'","Volume massique de l'air humide",{"$f":"0.2871*H61*(1+1.6078*H67)/$H$57*1000","v":{"$error":"#VALUE!"}},{"$f":"0.2871*I61*(1+1.6078*I67)/$H$57*1000","v":{"$error":"#N/A"}},{"$f":"0.2871*J61*(1+1.6078*J67)/$H$57*1000","v":0.81301122484716892}]
[null,null,"SAS"]
[null,null,"LABO DECOUPE",null,null,"h","Enthalpie",{"$f":"1.006*H59+H67*(2500.8+1.805*H59)","v":{"$error":"#VALUE!"}},{"$f":"1.006*I59+I67*(2500.8+1.805*I59)","v":{"$error":"#N/A"}},{"$f":"1.006*J59+J67*(2500.8+1.805*J59)","v":21.604453888919195}]
[null,null,"LABO DECOUPE EMBALLAGE"]
[null,null,"LABO EMBALLAGE"]
[]
[]
[]
[]
[null,null,"Désignation","Température","Dimensions",null,null,null,null,"Evaporateurs"]
[null,null,null,null,"Hygrométrie","Longeur","largeur","Surface","hauteur","Volume","Puissance minimum requise",{"$f":"\"à \"&ROUND(D20,0)*100 &\" % de charge en surface\"","v":{"$error":"#N/A"}},"Maximum de charge 50 %","Minimum de charge","DT de sélection","Nbre","Type","Vitesse ventilation","Dégivrage"]
[]
[null,{"$f":"D1","v":"CFP 01"},{"$f":"E1","v":"FRAIS LS"},{"$f":"G4","v":{"$error":"#N/A"}},{"$f":"G5","v":{"$error":"#N/A"}},{"$f":"E2","v":0},{"$f":"E3","v":0},{"$f":"surface","v":0},{"$f":"hauteur","v":0},{"$f":"volume","v":0},{"$f":"J52*1000","v":{"$error":"#N/A"}},{"$f":"J51*1000","v":{"$error":"#N/A"}},{"$f":"N52*1000","v":{"$error":"#N/A"}},{"$f":"O52*1000","v":{"$error":"#N/A"}},{"$error":"#N/A"},1,{"$f":"IF(OR(LABO=\"oui\",H1=\"SAS\"),\"DOUBLE FLUX\",IF(K82<2000,\"PLAFONNIER\",IF(AND(G5<80,K82<7000),\"PLAFONNIER\",\"CUBIQUE\")))","v":{"$error":"#N/A"}},{"$f":"IF(AND(Q82=\"DOUBLE FLUX\",LABO=\"OUI\"),1000,1500)","v":{"$error":"#N/A"}},{"$f":"IF(D82>1,\"Naturel\",\"Electrique\")","v":{"$error":"#N/A"}}]
[]
[]
[null,null,null,null,null,null,null,null,null,null,{"$f":"K82/H82","v":{"$error":"#N/A"}}]

{"sheet":"Table CFN 7","index":36,"n_rows":85,"n_cols":19,"rows_kept":85,"cut":false,"hidden":true,"merged":[[17,3,18,3],[78,2,79,2],[78,3,79,3],[78,4,78,8],[78,9,78,14],[0,0,5,0],[0,1,5,1],[0,5,0,6],[0,7,0,10],[1,7,2,7],[1,9,1,10],[2,8,2,9],[3,7,4,7],[3,10,4,10]]}
["ENTREES","CALCULS","CHAMBRE FROIDE","CFP 01","FRAIS LS","PRODUITS TRAITES",null,{"$f":"'Chambres négative'!K5","v":0}]
[null,null,"Largeur",null,{"$f":"'Chambres négative'!J8","v":0},"TEMPERATURE",{"$f":"Informations!G25","v":{"$error":"#VALUE!"}},"EXT","REP"]
[null,null,"Longueur",null,{"$f":"'Chambres négative'!K9","v":0},"HUMIDITE ",50,null,"COEF TRANSMISSION",null,0.3]
[null,null,"Hauteur sous plafond",null,{"$f":"'Chambres négative'!K10","v":0},"TEMPERATURE",{"$error":"#N/A"},"INT","TEMPERATURE",10,"SAS",null,"CHARGEMENT","CHARGEMENT","NUIT"]
[null,null,"Surface",null,{"$f":"E3*E2","v":0},"HUMIDITE ",{"$error":"#N/A"},null,"HUMIDITE ",60,null,null,0.5,0.75,"Activité 0"]
[null,null,"Volume",null,{"$f":"E5*E4","v":0},"CAPACITE CF",{"$error":"#N/A"},"LABO","NON",null,"NON"]
[null,null,"BILAN ",null,null,"Text","T in","k","Apport","Apport"]
[null,null,"Déperditions",null,"m2","°C","°C","W/m2/K","W","kJ/24h"]
[null,null,"Mur droit","S1",{"$f":"E2*E4","v":0},35,{"$f":"$G$4","v":{"$error":"#N/A"}},{"$f":"$K$3","v":0.3},{"$f":"H9*E9*(F9-G9)","v":{"$error":"#N/A"}},{"$f":"I9*3600*24/1000","v":{"$error":"#N/A"}},null,null,null,null,{"$f":"H9*(F9-5-G9)*E9","v":{"$error":"#N/A"}}]
[null,null,"Mur gauche","S2",{"$f":"+E9","v":0},35,{"$error":"#N/A"},{"$f":"$K$3","v":0.3},{"$error":"#N/A"},{"$error":"#N/A"},null,null,null,null,{"$f":"H10*(F10-5-G10)*E10","v":{"$error":"#N/A"}}]
[null,null,"Mur fond","S3",{"$f":"E3*E4","v":0},15,{"$error":"#N/A"},{"$f":"$K$3","v":0.3},{"$error":"#N/A"},{"$error":"#N/A"},null,null,null,null,{"$f":"H11*(F11-5-G11)*E11","v":{"$error":"#N/A"}}]
[null,null,"Mur avant","S4",{"$f":"E11","v":0},35,{"$error":"#N/A"},0.5,{"$error":"#N/A"},{"$error":"#N/A"},null,null,null,null,{"$f":"H12*(F12-5-G12)*E12","v":{"$error":"#N/A"}}]
[null,null,"Plafond","S5",{"$f":"E5","v":0},35,{"$error":"#N/A"},{"$f":"$K$3","v":0.3},{"$error":"#N/A"},{"$error":"#N/A"},null,null,null,null,{"$f":"H13*(F13-5-G13)*E13","v":{"$error":"#N/A"}}]
[null,null,"Plancher","S6",{"$f":"E5","v":0},15,{"$error":"#N/A"},0.2,{"$error":"#N/A"},{"$error":"#N/A"},null,null,null,null,{"$f":"H14*(F14-G14)*E14","v":{"$error":"#N/A"}}]
[null,null,"Linéïques",0.1,null,null,null,null,{"$f":"D15*SUM(I9:I14)","v":{"$error":"#N/A"}},{"$f":"D15*SUM(J9:J14)","v":{"$error":"#N/A"}}]
[null,null,"Sous total",null,null,null,null,null,{"$f":"SUM(I9:I15)","v":{"$error":"#N/A"}},{"$f":"I16*24*3.6","v":{"$error":"#N/A"}},{"$f":"J16/$J$48","v":{"$error":"#N/A"}},null,{"$f":"J16","v":{"$error":"#N/A"}},{"$f":"J16","v":{"$error":"#N/A"}},{"$f":"SUM(O9:O15)*24*3.6","v":{"$error":"#N/A"}}]
[]
[null,null,"Entrés","% de charge","kg/jour","T entrée","T stockage","Cp","Apport","Apport"]
[null,null,"Surcharge kg/jour",null,"Débit","°C","°C","kJ/kg/K","W","kJ/24h"]
[null,null,0,{"$error":"#N/A"},{"$error":"#N/A"},{"$error":"#N/A"},{"$f":"G4","v":{"$error":"#N/A"}},{"$error":"#N/A"},{"$f":"H20*(E20+C20 )*(F20-G20)/3600/12*1000","v":{"$error":"#N/A"}},{"$f":"(C20+E20)*H20*(F20-G20)","v":{"$error":"#N/A"}},{"$f":"J20/$J$48","v":{"$error":"#N/A"}},null,{"$f":"IF(LABO=\"non\",J20/E20*G6*$M$5,0)","v":{"$error":"#N/A"}},{"$f":"IF(LABO=\"non\",J20/E20*G6*$N$5,0)","v":{"$error":"#N/A"}},0]
[null,null,"Chaleur respiration",null,"Capacité",null,null,"Chaleur respiration","Apport","Apport"]
[null,null,{"$f":"H1","v":0},null,"Chambre",null,null,"kJ/kg en 24 h","W","kJ/24h"]
[null,null,0,null,{"$f":"capacité","v":{"$error":"#N/A"}},null,null,{"$f":"C23","v":0},{"$f":"J23/24/3600","v":{"$error":"#N/A"}},{"$f":"H23*E23","v":{"$error":"#N/A"}},{"$f":"J23/$J$48","v":{"$error":"#N/A"}},null,{"$f":"+J23","v":{"$error":"#N/A"}},{"$f":"J23","v":{"$error":"#N/A"}},{"$f":"J23","v":{"$error":"#N/A"}}]
[]
[null,null,"Travail ventilateurs",null,"Volume chambre","Taux de brassage","Débit air brassé","Puissance ventilateur","Apport","Apport"]
[null,null,null,null,"m3","sd","m3","W","W","kJ/24h"]
[null,null,null,null,{"$f":"volume","v":0},30,{"$f":"F27*E6","v":0},{"$f":"I27","v":0},{"$f":"G27*0.1","v":0},{"$f":"I27/1000*24*3600","v":0},{"$f":"J27/$J$48","v":{"$error":"#N/A"}},null,{"$f":"J27","v":0},{"$f":"J27","v":0},{"$f":"J27","v":0}]
[]
[null,null,"Air neuf",null,"Renouvellement","Vol massique","Enthalpie Ext","Enthalpie Int","Apport","Apport"]
[null,null,"Activité chambre",null,"m3/24h","m3/kg","kJ/kg","kJ/kg","W","kJ/24h"]
[null,null,"FORT",null,{"$error":"#N/A"},{"$f":"IF(K6=\"NON\",H69,J69)","v":{"$error":"#VALUE!"}},{"$f":"IF(K6=\"NON\",H72,J72)","v":{"$error":"#VALUE!"}},{"$f":"I72","v":{"$error":"#N/A"}},{"$f":"(G31-H31)/F31*E31/(24*3600)*1000","v":{"$error":"#VALUE!"}},{"$f":"(G31-H31)/F31*E31","v":{"$error":"#VALUE!"}},{"$f":"J31/$J$48","v":{"$error":"#VALUE!"}},null,{"$f":"J31","v":{"$error":"#VALUE!"}},{"$f":"J31","v":{"$error":"#VALUE!"}},0]
[null,null,"Taux de renouvellement",{"$f":"E31/volume","v":{"$error":"#N/A"}},"Vol/jour",{"$f":"D32/24","v":{"$error":"#N/A"}},"Vol/h"]
[]
[null,null,"Eclairage",null,"Surface","Ratio","Nb heures fonction",null,"Apport","Apport"]
[null,null,null,null,"m2"," W/m2","h",null,"W","kJ/24h"]
[null,null,null,null,{"$f":"surface","v":0},{"$f":"IF(LABO=\"oui\",0,10)","v":10},4,null,{"$f":"F36*E36","v":0},{"$f":"I36*3600*G36/1000","v":0},{"$f":"J36/$J$48","v":{"$error":"#N/A"}},null,{"$f":"J36","v":0},{"$f":"J36","v":0},"."]
[]
[null,null,"Personnel"]
[null,null,null,null,"Nombre","Ratio","Nb heures fonction",null,"Apport","Apport"]
[null,null,null,null,"personne","W/p","h",null,"W","kJ/24h"]
[null,null,null,null,0,400,4,null,{"$f":"F41*E41","v":0},{"$f":"I41*3600*G41/1000","v":0},{"$f":"J41/$J$48","v":{"$error":"#N/A"}},null,{"$f":"J41","v":0},{"$f":"J41","v":0},0]
[]
[null,null,"Machines",null,null,"Nb heures fonction",null,null,"Apport","Apport"]
[null,null,null,null,"W","h",null,null,"W","kJ/24h"]
[null,null,null,null,0,{"$f":"IF(I6=\"OUI\",10,0)","v":0},null,null,{"$f":"E45","v":0},{"$f":"I45*3600*F45/1000","v":0},{"$f":"J45/$J$48","v":{"$error":"#N/A"}},null,{"$f":"J45","v":0},{"$f":"J45","v":0},{"$f":"J45","v":0}]
[null,null,"Divers",null,0,null,null,null,{"$f":"E46","v":0},{"$f":"I46*3600*24/1000","v":0},{"$f":"J46/$J$48","v":{"$error":"#N/A"}},null,{"$f":"J46","v":0},{"$f":"J46","v":0},{"$f":"J46","v":0}]
[]
[null,null,"TOTAL",null,null,null,null,null,{"$f":"I16+I20+I23+I27+I31+I36+I41+I45+I46","v":{"$error":"#N/A"}},{"$f":"SUM(J16:J46)","v":{"$error":"#N/A"}},{"$f":"SUM(K16:K46)","v":{"$error":"#N/A"}},null,{"$f":"SUM(M16:M46)","v":{"$error":"#N/A"}},{"$f":"SUM(N16:N46)","v":{"$error":"#N/A"}},{"$f":"SUM(O16:O46)","v":{"$error":"#N/A"}}]
[]
[null,null,null,null,"Nombres d'heures de fonctionnement groupes h/jour",null,null,null,"Bilan Chaleur Latente kW"," Bilan production kW",null,null," Bilan production kW"," Bilan production kW"," Bilan production kW"]
[null,null,"PRODUCTION",null,18,"Ratio",{"$f":"J51*1000/E14","v":{"$error":"#N/A"}},"W/m2",{"$f":"IF(K6=\"oui\",2501*(J67-I67)*E31/F31/E51/3600,2500.8*(H67-I67)*E31/F31/E51/3600)","v":{"$error":"#VALUE!"}},{"$f":"J48/$E$51/3600","v":{"$error":"#N/A"}},null,null,{"$f":"M48/$E$51/3600","v":{"$error":"#N/A"}},{"$f":"N48/$E$51/3600","v":{"$error":"#N/A"}},{"$f":"O48/$E$51/3600","v":{"$error":"#N/A"}}]
[null,null,"EMISSION",null,16,null,{"$f":"J52*1000/E14","v":{"$error":"#N/A"}},null,{"$f":"I51/J51","v":{"$error":"#VALUE!"}},{"$f":"J48/$E$52/3600","v":{"$error":"#N/A"}},{"$f":"J52/J51-1","v":{"$error":"#N/A"}},null,{"$f":"M48/$E$52/3600","v":{"$error":"#N/A"}},{"$f":"N48/$E$52/3600","v":{"$error":"#N/A"}},{"$f":"O48/$E$52/3600","v":{"$error":"#N/A"}}]
[]
[]
[null,null,null,null,null,null,null,500,500,500]
[null,null,"VIANDES PRE EMBALLES",null,"TRES FORT","ALTITUDE DU SITE (m)",null,50,50,50]
[null,null,"VOLAILLES PREEMBALLEES",null,"FORT","PRESSION TOTALE P (Pa)",null,{"$f":"1.19745*10^-8*(288.15-0.0065*H56)^5.25588","v":100726.03972155297},{"$f":"1.19745*10^-8*(288.15-0.0065*I56)^5.25588","v":100726.03972155297},{"$f":"1.19745*10^-8*(288.15-0.0065*J56)^5.25588","v":100726.03972155297}]
[null,null,"CARCASSES",null,"MOYEN","POINT",null,"EXT","INT","SAS"]
[null,null,"CHARCUTERIE PREEMBALLE",null,"FAIBLE","t","Température sèche",{"$f":"G2","v":{"$error":"#VALUE!"}},{"$f":"G4","v":{"$error":"#N/A"}},{"$f":"J4","v":10}]
[null,null,"TRAITEUR",null,null,"F ( % )","Humidité relatice",50,{"$f":"G5","v":{"$error":"#N/A"}},{"$f":"J5","v":60}]
[null,null,"CHARIOTS PLATS CUISINES",null,null,"T","Température absolue",{"$f":"H59+273.15","v":{"$error":"#VALUE!"}},{"$f":"I59+273.15","v":{"$error":"#N/A"}},{"$f":"J59+273.15","v":283.14999999999998}]
[null,null,"PATISSERIE FRAICHE",null,"OUI",null,"Pvs si t<0°C",{"$f":"EXP(-5674.359/H61+6.3925247-0.009677843*H61+0.00000062215701*H61^2+0.0000000020747825*H61^3-0.0000000000009484024*H61^4+4.1635019*LN(H61))","v":{"$error":"#VALUE!"}},{"$f":"EXP(-5674.359/I61+6.3925247-0.009677843*I61+0.00000062215701*I61^2+0.0000000020747825*I61^3-0.0000000000009484024*I61^4+4.1635019*LN(I61))","v":{"$error":"#N/A"}},{"$f":"EXP(-5674.359/J61+6.3925247-0.009677843*J61+0.00000062215701*J61^2+0.0000000020747825*J61^3-0.0000000000009484024*J61^4+4.1635019*LN(J61))","v":1352.9554923109872}]
[null,null,"POISSONS SUR GLACE",null,"NON",null,"Pvs si t>0°C",{"$f":"EXP(-5800.2206/H61+1.3914993-0.048640239*H61+0.000041764768*H61^2-0.000000014452093*H61^3+6.5459673*LN(H61))","v":{"$error":"#VALUE!"}},{"$f":"EXP(-5800.2206/I61+1.3914993-0.048640239*I61+0.000041764768*I61^2-0.000000014452093*I61^3+6.5459673*LN(I61))","v":{"$error":"#N/A"}},{"$f":"EXP(-5800.2206/J61+1.3914993-0.048640239*J61+0.000041764768*J61^2-0.000000014452093*J61^3+6.5459673*LN(J61))","v":1227.9952754407796}]
[null,null,"FRUITS ET LEGUMES",null,null,"Pws","Pression partielle de vapeur à saturation",{"$f":"IF(H61<273.15,H62,H63)","v":{"$error":"#VALUE!"}},{"$f":"IF(I61<273.15,I62,I63)","v":{"$error":"#N/A"}},{"$f":"IF(J61<273.15,J62,J63)","v":1227.9952754407796}]
[null,null,"BOF EMBALLES",null,null,"Pv","Pression partielle de vapeur non saturé",{"$f":"H64*H60/100","v":{"$error":"#VALUE!"}},{"$f":"I64*I60/100","v":{"$error":"#N/A"}},{"$f":"J64*J60/100","v":736.79716526446782}]
[null,null,"FROMAGE",null,null,"Pa","Pression partielle de l'air sec",{"$f":"$H$57-H65","v":{"$error":"#VALUE!"}},{"$f":"$H$57-I65","v":{"$error":"#N/A"}},{"$f":"$H$57-J65","v":99989.242556288504}]
[null,null,"BOISSONS",null,null,"w","Humidité absolue non saturée",{"$f":"0.62198*H65/($H$57-H65)","v":{"$error":"#VALUE!"}},{"$f":"0.62198*I65/($H$57-I65)","v":{"$error":"#N/A"}},{"$f":"0.62198*J65/($H$57-J65)","v":4.5832240462588851E-3}]
[null,null,"POUBELLES GRASSES",null,null,"ws","Humidité absolue à saturation",{"$f":"0.62198*H64/($H$57-H64)","v":{"$error":"#VALUE!"}},{"$f":"0.62198*I64/($H$57-I64)","v":{"$error":"#N/A"}},{"$f":"0.62198*J64/($H$57-J64)","v":7.676417216745615E-3}]
[null,null,"PRODUITS SURGELES",null,null,"RO","Masse volumique de l'air sec",{"$f":"(1+H67)/H70","v":{"$error":"#VALUE!"}},{"$f":"(1+I67)/I70","v":{"$error":"#N/A"}},{"$f":"(1+J67)/J70","v":1.235632662064539}]
[null,null,"CREMES GLACEES",null,null,"v'","Volume massique de l'air humide",{"$f":"0.2871*H61*(1+1.6078*H67)/$H$57*1000","v":{"$error":"#VALUE!"}},{"$f":"0.2871*I61*(1+1.6078*I67)/$H$57*1000","v":{"$error":"#N/A"}},{"$f":"0.2871*J61*(1+1.6078*J67)/$H$57*1000","v":0.81301122484716892}]
[null,null,"SAS"]
[null,null,"LABO DECOUPE",null,null,"h","Enthalpie",{"$f":"1.006*H59+H67*(2500.8+1.805*H59)","v":{"$error":"#VALUE!"}},{"$f":"1.006*I59+I67*(2500.8+1.805*I59)","v":{"$error":"#N/A"}},{"$f":"1.006*J59+J67*(2500.8+1.805*J59)","v":21.604453888919195}]
[null,null,"LABO DECOUPE EMBALLAGE"]
[null,null,"LABO EMBALLAGE"]
[]
[]
[]
[]
[null,null,"Désignation","Température","Dimensions",null,null,null,null,"Evaporateurs"]
[null,null,null,null,"Hygrométrie","Longeur","largeur","Surface","hauteur","Volume","Puissance minimum requise",{"$f":"\"à \"&ROUND(D20,0)*100 &\" % de charge en surface\"","v":{"$error":"#N/A"}},"Maximum de charge 50 %","Minimum de charge","DT de sélection","Nbre","Type","Vitesse ventilation","Dégivrage"]
[]
[null,{"$f":"D1","v":"CFP 01"},{"$f":"E1","v":"FRAIS LS"},{"$f":"G4","v":{"$error":"#N/A"}},{"$f":"G5","v":{"$error":"#N/A"}},{"$f":"E2","v":0},{"$f":"E3","v":0},{"$f":"surface","v":0},{"$f":"hauteur","v":0},{"$f":"volume","v":0},{"$f":"J52*1000","v":{"$error":"#N/A"}},{"$f":"J51*1000","v":{"$error":"#N/A"}},{"$f":"N52*1000","v":{"$error":"#N/A"}},{"$f":"O52*1000","v":{"$error":"#N/A"}},{"$error":"#N/A"},1,{"$f":"IF(OR(LABO=\"oui\",H1=\"SAS\"),\"DOUBLE FLUX\",IF(K82<2000,\"PLAFONNIER\",IF(AND(G5<80,K82<7000),\"PLAFONNIER\",\"CUBIQUE\")))","v":{"$error":"#N/A"}},{"$f":"IF(AND(Q82=\"DOUBLE FLUX\",LABO=\"OUI\"),1000,1500)","v":{"$error":"#N/A"}},{"$f":"IF(D82>1,\"Naturel\",\"Electrique\")","v":{"$error":"#N/A"}}]
[]
[]
[null,null,null,null,null,null,null,null,null,null,{"$f":"K82/H82","v":{"$error":"#N/A"}}]

{"sheet":"Table CFN 8","index":37,"n_rows":85,"n_cols":19,"rows_kept":85,"cut":false,"hidden":true,"merged":[[17,3,18,3],[78,2,79,2],[78,3,79,3],[78,4,78,8],[78,9,78,14],[0,0,5,0],[0,1,5,1],[0,5,0,6],[0,7,0,10],[1,7,2,7],[1,9,1,10],[2,8,2,9],[3,7,4,7],[3,10,4,10]]}
["ENTREES","CALCULS","CHAMBRE FROIDE","CFP 01","FRAIS LS","PRODUITS TRAITES",null,{"$f":"'Chambres négative'!L5","v":0}]
[null,null,"Largeur",null,{"$f":"'Chambres négative'!L8","v":0},"TEMPERATURE",{"$f":"Informations!G25","v":{"$error":"#VALUE!"}},"EXT","REP"]
[null,null,"Longueur",null,{"$f":"'Chambres négative'!L9","v":0},"HUMIDITE ",50,null,"COEF TRANSMISSION",null,0.3]
[null,null,"Hauteur sous plafond",null,{"$f":"'Chambres négative'!L10","v":0},"TEMPERATURE",{"$error":"#N/A"},"INT","TEMPERATURE",10,"SAS",null,"CHARGEMENT","CHARGEMENT","NUIT"]
[null,null,"Surface",null,{"$f":"E3*E2","v":0},"HUMIDITE ",{"$error":"#N/A"},null,"HUMIDITE ",60,null,null,0.5,0.75,"Activité 0"]
[null,null,"Volume",null,{"$f":"E5*E4","v":0},"CAPACITE CF",{"$error":"#N/A"},"LABO","NON",null,"NON"]
[null,null,"BILAN ",null,null,"Text","T in","k","Apport","Apport"]
[null,null,"Déperditions",null,"m2","°C","°C","W/m2/K","W","kJ/24h"]
[null,null,"Mur droit","S1",{"$f":"E2*E4","v":0},35,{"$f":"$G$4","v":{"$error":"#N/A"}},{"$f":"$K$3","v":0.3},{"$f":"H9*E9*(F9-G9)","v":{"$error":"#N/A"}},{"$f":"I9*3600*24/1000","v":{"$error":"#N/A"}},null,null,null,null,{"$f":"H9*(F9-5-G9)*E9","v":{"$error":"#N/A"}}]
[null,null,"Mur gauche","S2",{"$f":"+E9","v":0},35,{"$error":"#N/A"},{"$f":"$K$3","v":0.3},{"$error":"#N/A"},{"$error":"#N/A"},null,null,null,null,{"$f":"H10*(F10-5-G10)*E10","v":{"$error":"#N/A"}}]
[null,null,"Mur fond","S3",{"$f":"E3*E4","v":0},15,{"$error":"#N/A"},{"$f":"$K$3","v":0.3},{"$error":"#N/A"},{"$error":"#N/A"},null,null,null,null,{"$f":"H11*(F11-5-G11)*E11","v":{"$error":"#N/A"}}]
[null,null,"Mur avant","S4",{"$f":"E11","v":0},35,{"$error":"#N/A"},0.5,{"$error":"#N/A"},{"$error":"#N/A"},null,null,null,null,{"$f":"H12*(F12-5-G12)*E12","v":{"$error":"#N/A"}}]
[null,null,"Plafond","S5",{"$f":"E5","v":0},35,{"$error":"#N/A"},{"$f":"$K$3","v":0.3},{"$error":"#N/A"},{"$error":"#N/A"},null,null,null,null,{"$f":"H13*(F13-5-G13)*E13","v":{"$error":"#N/A"}}]
[null,null,"Plancher","S6",{"$f":"E5","v":0},15,{"$error":"#N/A"},0.2,{"$error":"#N/A"},{"$error":"#N/A"},null,null,null,null,{"$f":"H14*(F14-G14)*E14","v":{"$error":"#N/A"}}]
[null,null,"Linéïques",0.1,null,null,null,null,{"$f":"D15*SUM(I9:I14)","v":{"$error":"#N/A"}},{"$f":"D15*SUM(J9:J14)","v":{"$error":"#N/A"}}]
[null,null,"Sous total",null,null,null,null,null,{"$f":"SUM(I9:I15)","v":{"$error":"#N/A"}},{"$f":"I16*24*3.6","v":{"$error":"#N/A"}},{"$f":"J16/$J$48","v":{"$error":"#N/A"}},null,{"$f":"J16","v":{"$error":"#N/A"}},{"$f":"J16","v":{"$error":"#N/A"}},{"$f":"SUM(O9:O15)*24*3.6","v":{"$error":"#N/A"}}]
[]
[null,null,"Entrés","% de charge","kg/jour","T entrée","T stockage","Cp","Apport","Apport"]
[null,null,"Surcharge kg/jour",null,"Débit","°C","°C","kJ/kg/K","W","kJ/24h"]
[null,null,0,{"$error":"#N/A"},{"$error":"#N/A"},{"$error":"#N/A"},{"$f":"G4","v":{"$error":"#N/A"}},{"$error":"#N/A"},{"$f":"H20*(E20+C20 )*(F20-G20)/3600/12*1000","v":{"$error":"#N/A"}},{"$f":"(C20+E20)*H20*(F20-G20)","v":{"$error":"#N/A"}},{"$f":"J20/$J$48","v":{"$error":"#N/A"}},null,{"$f":"IF(LABO=\"non\",J20/E20*G6*$M$5,0)","v":{"$error":"#N/A"}},{"$f":"IF(LABO=\"non\",J20/E20*G6*$N$5,0)","v":{"$error":"#N/A"}},0]
[null,null,"Chaleur respiration",null,"Capacité",null,null,"Chaleur respiration","Apport","Apport"]
[null,null,{"$f":"H1","v":0},null,"Chambre",null,null,"kJ/kg en 24 h","W","kJ/24h"]
[null,null,0,null,{"$f":"capacité","v":{"$error":"#N/A"}},null,null,{"$f":"C23","v":0},{"$f":"J23/24/3600","v":{"$error":"#N/A"}},{"$f":"H23*E23","v":{"$error":"#N/A"}},{"$f":"J23/$J$48","v":{"$error":"#N/A"}},null,{"$f":"+J23","v":{"$error":"#N/A"}},{"$f":"J23","v":{"$error":"#N/A"}},{"$f":"J23","v":{"$error":"#N/A"}}]
[]
[null,null,"Travail ventilateurs",null,"Volume chambre","Taux de brassage","Débit air brassé","Puissance ventilateur","Apport","Apport"]
[null,null,null,null,"m3","sd","m3","W","W","kJ/24h"]
[null,null,null,null,{"$f":"volume","v":0},30,{"$f":"F27*E6","v":0},{"$f":"I27","v":0},{"$f":"G27*0.1","v":0},{"$f":"I27/1000*24*3600","v":0},{"$f":"J27/$J$48","v":{"$error":"#N/A"}},null,{"$f":"J27","v":0},{"$f":"J27","v":0},{"$f":"J27","v":0}]
[]
[null,null,"Air neuf",null,"Renouvellement","Vol massique","Enthalpie Ext","Enthalpie Int","Apport","Apport"]
[null,null,"Activité chambre",null,"m3/24h","m3/kg","kJ/kg","kJ/kg","W","kJ/24h"]
[null,null,"FORT",null,{"$error":"#N/A"},{"$f":"IF(K6=\"NON\",H69,J69)","v":{"$error":"#VALUE!"}},{"$f":"IF(K6=\"NON\",H72,J72)","v":{"$error":"#VALUE!"}},{"$f":"I72","v":{"$error":"#N/A"}},{"$f":"(G31-H31)/F31*E31/(24*3600)*1000","v":{"$error":"#VALUE!"}},{"$f":"(G31-H31)/F31*E31","v":{"$error":"#VALUE!"}},{"$f":"J31/$J$48","v":{"$error":"#VALUE!"}},null,{"$f":"J31","v":{"$error":"#VALUE!"}},{"$f":"J31","v":{"$error":"#VALUE!"}},0]
[null,null,"Taux de renouvellement",{"$f":"E31/volume","v":{"$error":"#N/A"}},"Vol/jour",{"$f":"D32/24","v":{"$error":"#N/A"}},"Vol/h"]
[]
[null,null,"Eclairage",null,"Surface","Ratio","Nb heures fonction",null,"Apport","Apport"]
[null,null,null,null,"m2"," W/m2","h",null,"W","kJ/24h"]
[null,null,null,null,{"$f":"surface","v":0},{"$f":"IF(LABO=\"oui\",0,10)","v":10},4,null,{"$f":"F36*E36","v":0},{"$f":"I36*3600*G36/1000","v":0},{"$f":"J36/$J$48","v":{"$error":"#N/A"}},null,{"$f":"J36","v":0},{"$f":"J36","v":0},"."]
[]
[null,null,"Personnel"]
[null,null,null,null,"Nombre","Ratio","Nb heures fonction",null,"Apport","Apport"]
[null,null,null,null,"personne","W/p","h",null,"W","kJ/24h"]
[null,null,null,null,0,400,4,null,{"$f":"F41*E41","v":0},{"$f":"I41*3600*G41/1000","v":0},{"$f":"J41/$J$48","v":{"$error":"#N/A"}},null,{"$f":"J41","v":0},{"$f":"J41","v":0},0]
[]
[null,null,"Machines",null,null,"Nb heures fonction",null,null,"Apport","Apport"]
[null,null,null,null,"W","h",null,null,"W","kJ/24h"]
[null,null,null,null,0,{"$f":"IF(I6=\"OUI\",10,0)","v":0},null,null,{"$f":"E45","v":0},{"$f":"I45*3600*F45/1000","v":0},{"$f":"J45/$J$48","v":{"$error":"#N/A"}},null,{"$f":"J45","v":0},{"$f":"J45","v":0},{"$f":"J45","v":0}]
[null,null,"Divers",null,0,null,null,null,{"$f":"E46","v":0},{"$f":"I46*3600*24/1000","v":0},{"$f":"J46/$J$48","v":{"$error":"#N/A"}},null,{"$f":"J46","v":0},{"$f":"J46","v":0},{"$f":"J46","v":0}]
[]
[null,null,"TOTAL",null,null,null,null,null,{"$f":"I16+I20+I23+I27+I31+I36+I41+I45+I46","v":{"$error":"#N/A"}},{"$f":"SUM(J16:J46)","v":{"$error":"#N/A"}},{"$f":"SUM(K16:K46)","v":{"$error":"#N/A"}},null,{"$f":"SUM(M16:M46)","v":{"$error":"#N/A"}},{"$f":"SUM(N16:N46)","v":{"$error":"#N/A"}},{"$f":"SUM(O16:O46)","v":{"$error":"#N/A"}}]
[]
[null,null,null,null,"Nombres d'heures de fonctionnement groupes h/jour",null,null,null,"Bilan Chaleur Latente kW"," Bilan production kW",null,null," Bilan production kW"," Bilan production kW"," Bilan production kW"]
[null,null,"PRODUCTION",null,18,"Ratio",{"$f":"J51*1000/E14","v":{"$error":"#N/A"}},"W/m2",{"$f":"IF(K6=\"oui\",2501*(J67-I67)*E31/F31/E51/3600,2500.8*(H67-I67)*E31/F31/E51/3600)","v":{"$error":"#VALUE!"}},{"$f":"J48/$E$51/3600","v":{"$error":"#N/A"}},null,null,{"$f":"M48/$E$51/3600","v":{"$error":"#N/A"}},{"$f":"N48/$E$51/3600","v":{"$error":"#N/A"}},{"$f":"O48/$E$51/3600","v":{"$error":"#N/A"}}]
[null,null,"EMISSION",null,16,null,{"$f":"J52*1000/E14","v":{"$error":"#N/A"}},null,{"$f":"I51/J51","v":{"$error":"#VALUE!"}},{"$f":"J48/$E$52/3600","v":{"$error":"#N/A"}},{"$f":"J52/J51-1","v":{"$error":"#N/A"}},null,{"$f":"M48/$E$52/3600","v":{"$error":"#N/A"}},{"$f":"N48/$E$52/3600","v":{"$error":"#N/A"}},{"$f":"O48/$E$52/3600","v":{"$error":"#N/A"}}]
[]
[]
[null,null,null,null,null,null,null,500,500,500]
[null,null,"VIANDES PRE EMBALLES",null,"TRES FORT","ALTITUDE DU SITE (m)",null,50,50,50]
[null,null,"VOLAILLES PREEMBALLEES",null,"FORT","PRESSION TOTALE P (Pa)",null,{"$f":"1.19745*10^-8*(288.15-0.0065*H56)^5.25588","v":100726.03972155297},{"$f":"1.19745*10^-8*(288.15-0.0065*I56)^5.25588","v":100726.03972155297},{"$f":"1.19745*10^-8*(288.15-0.0065*J56)^5.25588","v":100726.03972155297}]
[null,null,"CARCASSES",null,"MOYEN","POINT",null,"EXT","INT","SAS"]
[null,null,"CHARCUTERIE PREEMBALLE",null,"FAIBLE","t","Température sèche",{"$f":"G2","v":{"$error":"#VALUE!"}},{"$f":"G4","v":{"$error":"#N/A"}},{"$f":"J4","v":10}]
[null,null,"TRAITEUR",null,null,"F ( % )","Humidité relatice",50,{"$f":"G5","v":{"$error":"#N/A"}},{"$f":"J5","v":60}]
[null,null,"CHARIOTS PLATS CUISINES",null,null,"T","Température absolue",{"$f":"H59+273.15","v":{"$error":"#VALUE!"}},{"$f":"I59+273.15","v":{"$error":"#N/A"}},{"$f":"J59+273.15","v":283.14999999999998}]
[null,null,"PATISSERIE FRAICHE",null,"OUI",null,"Pvs si t<0°C",{"$f":"EXP(-5674.359/H61+6.3925247-0.009677843*H61+0.00000062215701*H61^2+0.0000000020747825*H61^3-0.0000000000009484024*H61^4+4.1635019*LN(H61))","v":{"$error":"#VALUE!"}},{"$f":"EXP(-5674.359/I61+6.3925247-0.009677843*I61+0.00000062215701*I61^2+0.0000000020747825*I61^3-0.0000000000009484024*I61^4+4.1635019*LN(I61))","v":{"$error":"#N/A"}},{"$f":"EXP(-5674.359/J61+6.3925247-0.009677843*J61+0.00000062215701*J61^2+0.0000000020747825*J61^3-0.0000000000009484024*J61^4+4.1635019*LN(J61))","v":1352.9554923109872}]
[null,null,"POISSONS SUR GLACE",null,"NON",null,"Pvs si t>0°C",{"$f":"EXP(-5800.2206/H61+1.3914993-0.048640239*H61+0.000041764768*H61^2-0.000000014452093*H61^3+6.5459673*LN(H61))","v":{"$error":"#VALUE!"}},{"$f":"EXP(-5800.2206/I61+1.3914993-0.048640239*I61+0.000041764768*I61^2-0.000000014452093*I61^3+6.5459673*LN(I61))","v":{"$error":"#N/A"}},{"$f":"EXP(-5800.2206/J61+1.3914993-0.048640239*J61+0.000041764768*J61^2-0.000000014452093*J61^3+6.5459673*LN(J61))","v":1227.9952754407796}]
[null,null,"FRUITS ET LEGUMES",null,null,"Pws","Pression partielle de vapeur à saturation",{"$f":"IF(H61<273.15,H62,H63)","v":{"$error":"#VALUE!"}},{"$f":"IF(I61<273.15,I62,I63)","v":{"$error":"#N/A"}},{"$f":"IF(J61<273.15,J62,J63)","v":1227.9952754407796}]
[null,null,"BOF EMBALLES",null,null,"Pv","Pression partielle de vapeur non saturé",{"$f":"H64*H60/100","v":{"$error":"#VALUE!"}},{"$f":"I64*I60/100","v":{"$error":"#N/A"}},{"$f":"J64*J60/100","v":736.79716526446782}]
[null,null,"FROMAGE",null,null,"Pa","Pression partielle de l'air sec",{"$f":"$H$57-H65","v":{"$error":"#VALUE!"}},{"$f":"$H$57-I65","v":{"$error":"#N/A"}},{"$f":"$H$57-J65","v":99989.242556288504}]
[null,null,"BOISSONS",null,null,"w","Humidité absolue non saturée",{"$f":"0.62198*H65/($H$57-H65)","v":{"$error":"#VALUE!"}},{"$f":"0.62198*I65/($H$57-I65)","v":{"$error":"#N/A"}},{"$f":"0.62198*J65/($H$57-J65)","v":4.5832240462588851E-3}]
[null,null,"POUBELLES GRASSES",null,null,"ws","Humidité absolue à saturation",{"$f":"0.62198*H64/($H$57-H64)","v":{"$error":"#VALUE!"}},{"$f":"0.62198*I64/($H$57-I64)","v":{"$error":"#N/A"}},{"$f":"0.62198*J64/($H$57-J64)","v":7.676417216745615E-3}]
[null,null,"PRODUITS SURGELES",null,null,"RO","Masse volumique de l'air sec",{"$f":"(1+H67)/H70","v":{"$error":"#VALUE!"}},{"$f":"(1+I67)/I70","v":{"$error":"#N/A"}},{"$f":"(1+J67)/J70","v":1.235632662064539}]
[null,null,"CREMES GLACEES",null,null,"v'","Volume massique de l'air humide",{"$f":"0.2871*H61*(1+1.6078*H67)/$H$57*1000","v":{"$error":"#VALUE!"}},{"$f":"0.2871*I61*(1+1.6078*I67)/$H$57*1000","v":{"$error":"#N/A"}},{"$f":"0.2871*J61*(1+1.6078*J67)/$H$57*1000","v":0.81301122484716892}]
[null,null,"SAS"]
[null,null,"LABO DECOUPE",null,null,"h","Enthalpie",{"$f":"1.006*H59+H67*(2500.8+1.805*H59)","v":{"$error":"#VALUE!"}},{"$f":"1.006*I59+I67*(2500.8+1.805*I59)","v":{"$error":"#N/A"}},{"$f":"1.006*J59+J67*(2500.8+1.805*J59)","v":21.604453888919195}]
[null,null,"LABO DECOUPE EMBALLAGE"]
[null,null,"LABO EMBALLAGE"]
[]
[]
[]
[]
[null,null,"Désignation","Température","Dimensions",null,null,null,null,"Evaporateurs"]
[null,null,null,null,"Hygrométrie","Longeur","largeur","Surface","hauteur","Volume","Puissance minimum requise",{"$f":"\"à \"&ROUND(D20,0)*100 &\" % de charge en surface\"","v":{"$error":"#N/A"}},"Maximum de charge 50 %","Minimum de charge","DT de sélection","Nbre","Type","Vitesse ventilation","Dégivrage"]
[]
[null,{"$f":"D1","v":"CFP 01"},{"$f":"E1","v":"FRAIS LS"},{"$f":"G4","v":{"$error":"#N/A"}},{"$f":"G5","v":{"$error":"#N/A"}},{"$f":"E2","v":0},{"$f":"E3","v":0},{"$f":"surface","v":0},{"$f":"hauteur","v":0},{"$f":"volume","v":0},{"$f":"J52*1000","v":{"$error":"#N/A"}},{"$f":"J51*1000","v":{"$error":"#N/A"}},{"$f":"N52*1000","v":{"$error":"#N/A"}},{"$f":"O52*1000","v":{"$error":"#N/A"}},{"$error":"#N/A"},1,{"$f":"IF(OR(LABO=\"oui\",H1=\"SAS\"),\"DOUBLE FLUX\",IF(K82<2000,\"PLAFONNIER\",IF(AND(G5<80,K82<7000),\"PLAFONNIER\",\"CUBIQUE\")))","v":{"$error":"#N/A"}},{"$f":"IF(AND(Q82=\"DOUBLE FLUX\",LABO=\"OUI\"),1000,1500)","v":{"$error":"#N/A"}},{"$f":"IF(D82>1,\"Naturel\",\"Electrique\")","v":{"$error":"#N/A"}}]
[]
[]
[null,null,null,null,null,null,null,null,null,null,{"$f":"K82/H82","v":{"$error":"#N/A"}}]

{"sheet":"Devis","index":38,"n_rows":347,"n_cols":12,"rows_kept":347,"cut":false,"hidden":true,"merged":[[343,8,343,9],[344,0,346,0],[344,1,344,7],[344,8,344,9],[345,1,345,7],[345,8,345,9],[346,1,346,7],[346,8,346,9],[337,1,337,7],[337,8,337,10],[338,1,338,7],[338,8,338,10],[339,0,341,0],[339,1,339,7],[339,8,339,10],[340,1,340,7],[340,8,340,10],[341,1,341,7],[341,8,341,10],[334,1,334,7],[334,8,334,10],[335,1,335,7],[335,8,335,10],[336,1,336,7],[336,8,336,10],[331,1,331,7],[331,8,331,10],[332,1,332,7],[332,8,332,10],[333,1,333,7],[333,8,333,10],[330,1,330,7],[330,8,330,10],[287,1,287,6],[289,1,289,2],[316,1,316,6],[319,1,319,6],[326,1,326,6],[327,0,327,7],[327,8,327,10],[328,1,328,7],[328,8,328,10],[329,1,329,7],[329,8,329,10],[286,1,286,6],[215,1,215,2],[216,1,216,3],[227,1,227,3],[230,1,230,2],[231,1,231,3],[232,1,232,2],[233,1,233,3],[238,1,238,6],[241,1,241,6],[243,1,243,2],[274,1,274,2],[214,1,214,3],[179,1,179,2],[180,1,180,3],[181,1,181,2],[182,1,182,3],[193,1,193,3],[196,1,196,2],[197,1,197,3],[198,1,198,2],[199,1,199,3],[210,1,210,3],[213,1,213,2],[176,1,176,3],[117,1,117,2],[118,1,118,3],[129,1,129,3],[132,1,132,2],[133,1,133,3],[144,1,144,3],[147,1,147,2],[148,1,148,3],[159,1,159,3],[162,1,162,2],[163,1,163,3],[1,3,1,8],[114,1,114,3],[3,1,3,6],[5,1,5,6],[8,1,8,6],[19,1,19,6],[39,1,39,6],[64,1,64,6],[73,1,73,6],[91,1,91,6],[94,1,94,6],[104,1,104,6]]}
[]
[]
[]
[null,"COÛT HORAIRE DE LA MAIN D'ŒUVRE",null,null,null,null,null,50]
[]
["Chapitre D.C.E.","DESIGNATION DES OUVRAGES",null,null,null,null,null,"U","Qté","P.U. H.T.","P.T. H.T."]
[null,"COMPTE PRORATA",null,null,null,null,null,null,null,null,{"$f":"I7*J7","v":0}]
[null,"Les modalités de paiement sont mentionnées dans le CCAP et CCAG",null,null,null,null,null,"Ensemble",null,null,{"$f":"I8*J8","v":0}]
[null,{"$f":"\"TOTAL HT : \"&B7","v":"TOTAL HT : COMPTE PRORATA"},null,null,null,null,null,null,null,null,{"$f":"SUM(M7:M8)","v":0}]
[null,"CENTRALE POSITIVE",null,null,null,null,null,null,null,null,{"$f":"I10*J10","v":0}]
[null,null,null,null,null,null,null,null,null,null,0]
[null,"Centrale positive",null,null,null,null,null,null,null,null,0]
[null,null,"Vitrines positives : ",null,9135," Watt",null,null,null,null,0]
[null,null,"CF positives : ",null,{"$error":"#VALUE!"}," Watt",null,null,null,null,0]
[null,null,"Déshumidification :",null,0," Watt",null,null,null,null,0]
[null,null,"Climatisation SDM : ",null,685.125," Watt",null,null,null,null,0]
[null,null,"Puisssance frigorifique : ",null,{"$f":"SUM(E13:E16)","v":{"$error":"#VALUE!"}}," Watt",null,null,null,null,0]
[null,null,"Régime de fonctionnement : ",null," -8°C / +45°C",null,null,null,null,null,0]
[null,null,null,null,null,null,null,null,null,null,0]
[null,"Centrale de production frigorifique :",null,null,null,null,null,"Ensemble",{"$f":"IF(E17=0,0,1)","v":{"$error":"#VALUE!"}},null,{"$error":"#VALUE!"}]
[null,null,"Marque : ",null,null,{"$f":"'Production positive'!D7","v":"BITZER"},null,null,null,null,0]
[null,null,"Type : ",null,null,{"$f":"'Production positive'!D9","v":"Principe"},null,null,null,null,0]
[null,null,"Modèle :",null,null,{"$f":"'Production positive'!D8","v":{"$error":"#VALUE!"}},null,null,null,null,0]
[null,null,"Nombre : ",null,null,2,null,null,null,null,0]
[null,null,"Puissance frigorifique unitaire : ",null,null,{"$error":"#VALUE!"},null,null,null,null,0]
[null,null,"Puissance absorbée : ",null,null,{"$error":"#VALUE!"},null,null,null,null,0]
[null,null,"Régime de fonctionnement : ",null,null,{"$f":"IF(E17=0,\"\",\"-8°C / +45°C\")","v":{"$error":"#VALUE!"}},null,null,null,null,0]
[null,null,"Fluide : ",null,null,{"$error":"#VALUE!"},null,null,null,null,0]
[null,null,"Puisssance frigorifique totale : ",null,null,{"$f":"IF(E17=0,\"\",F25*F24)","v":{"$error":"#VALUE!"}},null,null,null,null,0]
[null,null,"Puisssance calorifique rejetée : ",null,null,{"$error":"#VALUE!"},null,null,null,null,0]
[null,null,null,null,null,null,null,null,null,null,0]
[null,"Capteur BP 4-20mA",null,null,null,null,null,null,{"$f":"IF(E17=0,0,1)","v":{"$error":"#VALUE!"}},null,{"$error":"#VALUE!"}]
[null,"Capteur HP 4-20mA",null,null,null,null,null,null,{"$f":"IF(E17=0,0,1)","v":{"$error":"#VALUE!"}},null,{"$error":"#VALUE!"}]
[null,"Charge en huile des compresseurs RL32H",null,null,null,null,null,"Litres",{"$f":"IF(E17=0,0,18)","v":{"$error":"#VALUE!"}},null,{"$error":"#VALUE!"}]
[null,"Filtre à huile HCYF53",null,null,null,null,null,"Unité",{"$f":"IF(E17=0,0,F24)","v":{"$error":"#VALUE!"}},null,{"$error":"#VALUE!"}]
[null,"Cartouche deshydratente 48DN",null,null,null,null,null,"Unité",{"$f":"IF(E17=0,0,F24)","v":{"$error":"#VALUE!"}},null,{"$error":"#VALUE!"}]
[null,"Fluide frigorigène",null,null,null,null,null,"kg",{"$f":"+F25*2.5","v":{"$error":"#VALUE!"}},null,{"$error":"#VALUE!"}]
[null,"Mise en place",null,null,null,null,null,"Heures",{"$f":"IF(E17=0,0,64)","v":{"$error":"#VALUE!"}},{"$f":"+$H$4","v":50},{"$error":"#VALUE!"},{"$error":"#VALUE!"}]
[null,null,null,null,null,null,null,null,null,null,0]
[null,{"$f":"\"TOTAL HT : \"&B10","v":"TOTAL HT : CENTRALE POSITIVE"},null,null,null,null,null,null,null,null,{"$f":"SUMIF(K10:K39,\"<>#N/A!\",K10:K39)","v":{"$error":"#VALUE!"}}]
[null,"CONDENSEUR POSITIF",null,null,null,null,null,null,null,null,{"$f":"I41*J41","v":0}]
[null,"Condenseur à air suivant CCTP",null,null,null,null,null,null,null,null,0]
[null,null,"Marque : ",null,null,{"$f":"IF(E17=0,\"\",\"LUVE ou Équivalent\")","v":{"$error":"#VALUE!"}},null,"Ensemble",{"$f":"IF(E17=0,0,1)","v":{"$error":"#VALUE!"}},null,{"$error":"#VALUE!"}]
[null,null,"Type : ",null,null,{"$error":"#VALUE!"},null,null,null,null,0]
[null,null,"Modèle :",null,null,{"$error":"#VALUE!"},null,null,null,null,0]
[null,null,"Puissance calorifique :",null,null,{"$error":"#VALUE!"},{"$error":"#VALUE!"},null,null,null,0]
[null,null,null,null,null,null,null,null,null,null,0]
[null,"Capteur HP 4-20mA",null,null,null,null,null,"Unité",{"$f":"IF(E17=0,0,1)","v":{"$error":"#VALUE!"}},null,{"$error":"#VALUE!"}]
[null,"Variateur de fréquence TAR 3260",null,null,null,null,null,"Unité",{"$f":"IF(E17=0,0,1)","v":{"$error":"#VALUE!"}},null,{"$error":"#VALUE!"}]
[null,null,null,null,null,null,null,null,null,null,0]
[null,"Gaine FIB AIR soufflage (si condenseur centrifuge) :",null,null,null,null,null,null,null,null,0]
[null,"Panneaux FIB-AIR",null,null,null,null,null,"Surface",{"$f":"IF(F44=\"centrifuge\",10,0)","v":{"$error":"#VALUE!"}},null,{"$error":"#VALUE!"}]
[null,"Agrafes",null,null,null,null,null,"Boite",{"$f":"IF(F44=\"centrifuge\",1,0)","v":{"$error":"#VALUE!"}},null,{"$error":"#VALUE!"}]
[null,"Raclettes",null,null,null,null,null,"Unité",{"$f":"IF(F44=\"centrifuge\",1,0)","v":{"$error":"#VALUE!"}},null,{"$error":"#VALUE!"}]
[null,"Couteau",null,null,null,null,null,"Unité",{"$f":"IF(F44=\"centrifuge\",1,0)","v":{"$error":"#VALUE!"}},null,{"$error":"#VALUE!"}]
[null,"Crais",null,null,null,null,null,"Unité",{"$f":"IF(F44=\"centrifuge\",1,0)","v":{"$error":"#VALUE!"}},null,{"$error":"#VALUE!"}]
[null,"Clapets coupe feu",null,null,null,null,null,"Unité",{"$f":"IF(F44=\"centrifuge\",1,0)","v":{"$error":"#VALUE!"}},null,{"$error":"#VALUE!"}]
[null,"Mise en place",null,null,null,null,null,"Heures",{"$f":"IF(F44=\"centrifuge\",11,0)","v":{"$error":"#VALUE!"}},null,{"$error":"#VALUE!"}]
[null,null,null,null,null,null,null,null,null,null,0]
[null,"Traitement ALUPAINT (option)",null,null,null,null,null,"Ensemble",{"$f":"IF(E17=0,0,1)","v":{"$error":"#VALUE!"}},null,{"$error":"#VALUE!"}]
[null,"Supportage",null,null,null,null,null,"Unité",{"$f":"IF(E17=0,0,1)","v":{"$error":"#VALUE!"}},null,{"$error":"#VALUE!"}]
[null,"Grutage",null,null,null,null,null,"Unité",{"$f":"IF(E17=0,0,1)","v":{"$error":"#VALUE!"}},null,{"$error":"#VALUE!"}]
[null,null,null,null,null,null,null,null,null,null,0]
[null,"Mise en place",null,null,null,null,null,"Heures",{"$f":"IF(E17=0,0,64)","v":{"$error":"#VALUE!"}},{"$f":"+$H$4","v":50},{"$error":"#VALUE!"},{"$error":"#VALUE!"}]
[null,{"$f":"\"TOTAL HT : \"&B41","v":"TOTAL HT : CONDENSEUR POSITIF"},null,null,null,null,null,null,null,null,{"$f":"SUMIF(K41:K64,\"<>#N/A!\",K41:K64)","v":{"$error":"#VALUE!"}}]
[null,"GROUPE DE CONDENSEUR NÉGATIF",null,null,null,null,null,null,null,null,{"$f":"I66*J66","v":0}]
[null,null,null,null,null,null,null,null,null,null,0]
[null,"Centrale positive",null,null,null,null,null,null,null,null,0]
[null,null,"Vitrines négatives : ",null,0," Watt",null,null,null,null,0]
[null,null,"CF négative : ",null,0," Watt",null,null,null,null,0]
[null,null,"Puisssance frigorifique : ",null,{"$f":"SUM(E69:E70)","v":0}," Watt",null,null,null,null,0]
[null,null,"Régime de fonctionnement : ",null," -34°C / +45°C",null,null,null,null,null,0]
[null,null,null,null,null,null,null,null,null,null,0]
[null,"Centrale de production frigorifique :",null,null,null,null,null,"Ensemble",{"$f":"IF(E71=0,0,1)","v":0},0,0]
[null,null,"Marque : ",null,null,{"$f":"IF(E71=0,\"\",\"PROFROID ou Équivalent\")","v":""},null,null,null,null,0]
[null,null,"Type : ",null,null,"",null,null,null,null,0]
[null,null,"Modèle :",null,null,"",null,null,null,null,0]
[null,null,"Nombre : ",null,null,0,null,null,null,null,0]
[null,null,"Puissance frigorifique unitaire : ",null,null,"",null,null,null,null,0]
[null,null,"Puissance absorbée : ",null,null,"",null,null,null,null,0]
[null,null,"Régime de fonctionnement : ",null,null,{"$f":"IF(E71=0,\"\",\"-34°C / +45°C\")","v":""},null,null,null,null,0]
[null,null,"Fluide : ",null,null,"",null,null,null,null,0]
[null,null,"Puisssance frigorifique totale : ",null,null,{"$f":"IF(E71=0,\"\",F78*F79)","v":""},null,null,null,null,0]
[null,null,"Puisssance calorifique rejetée : ",null,null,"",null,null,null,null,0]
[null,"Capteur BP 4-20mA",null,null,null,null,null,"Unité",{"$f":"IF(E71=0,0,1)","v":0},null,0]
[null,"Capteur HP 4-20mA",null,null,null,null,null,"Unité",{"$f":"IF(E71=0,0,1)","v":0},null,0]
[null,"Charge en huile des compresseurs RL32H",null,null,null,null,null,"Litres",{"$f":"IF(E71=0,0,12)","v":0},null,0]
[null,"Filtre à huile HCYF53",null,null,null,null,null,"Unité",{"$f":"IF(E71=0,0,F78)","v":0},null,0]
[null,"Cartouche deshydratente 48DN",null,null,null,null,null,"Unité",{"$f":"IF(E71=0,0,F78)","v":0},null,0]
[null,"Mise en place",null,null,null,null,null,"Heures",{"$f":"IF(E71=0,0,32)","v":0},{"$f":"+$H$4","v":50},0,""]
[null,null,null,null,null,null,null,null,null,null,0]
[null,{"$f":"\"TOTAL HT : \"&B66","v":"TOTAL HT : GROUPE DE CONDENSEUR NÉGATIF"},null,null,null,null,null,null,null,null,{"$f":"SUMIF(K66:K91,\"<>#VALEUR!\",K66:K91)","v":0}]
[null,"ARMOIRE ÉLECTRIQUE",null,null,null,null,null,null,null,null,{"$f":"I93*J93","v":0}]
[null,"Fourniture pose et raccordement des liaisons électriques",null,null,null,null,null,"Ensemble",1,null,{"$f":"I94*J94","v":0}]
[null,{"$f":"\"TOTAL HT : \"&B93","v":"TOTAL HT : ARMOIRE ÉLECTRIQUE"},null,null,null,null,null,null,null,null,{"$f":"SUMIF(K93:K94,\"<>#N/A!\",K93:K94)","v":0}]
[null,"LOCAL TECHNIQUE",null,"oui",null,null,null,null,null,null,{"$f":"I96*J96","v":0}]
[null,null,null,null,null,null,null,null,null,null,0]
[null,"Salle des machines",null,null,null,{"$f":"IF(D96=\"OUI\",\"BP 70\",\"\")","v":"BP 70"},null,"Unité",{"$f":"IF(D96=\"OUI\",1,0)","v":1},null,0]
[null,"Détendeur monter",null,null,null,null,null,"Unité",{"$f":"IF(D96=\"OUI\",1,0)","v":1},null,0]
[null,"Corps d'électrovanne EVR",null,null,null,null,null,"Unité",{"$f":"IF(D96=\"OUI\",1,0)","v":1},null,0]
[null,"Bobine électrovanne",null,null,null,null,null,"Unité",{"$f":"IF(D96=\"OUI\",1,0)","v":1},null,0]
[null,"Filtre deshydrateur DCL",null,null,null,null,null,"Unité",{"$f":"IF(D96=\"OUI\",1,0)","v":1},null,0]
[null,"Mise en place",null,null,null,null,null,"Heures",{"$f":"IF(D96=\"NON\",0,16)","v":16},{"$f":"+$H$4","v":50},800,""]
[null,null,null,null,null,null,null,null,null,null,0]
[null,{"$f":"\"TOTAL HT : \"&B96","v":"TOTAL HT : LOCAL TECHNIQUE"},null,null,null,null,null,null,null,null,{"$f":"SUMIF(K96:K104,\"<>#N/A!\",K96:K104)","v":800}]
[null,"CHAMBRES FROIDES",null,null,null,null,null,null,null,null,{"$f":"I106*J106","v":0}]
[null,null,null,null,null,null,null,null,null,null,0]
[null,"POSITIVE 1",null,null,"CFP 01",null,"[ 0 / +2°C ]","Ensemble",1,null,0]
[null,"Marque : ",null,null,null,"PROFROID ou Équivalent",null,null,null,null,0]
[null,"Type : ",null,null,null,"PLAFONNIER",null,null,null,null,0]
[null,"Fluide :",null,null,null,"R407F",null,null,null,null,0]
[null,"Puissance :",null,null,null,901.69616931768803,null,null,null,null,0]
[null,"Delta :",null,null,null,8,null,null,null,null,0]
[null,"Détendeur électrique AKV",null,null,null,null,null,"Ensemble",1,null,0]
[null,"Capteur de pression",null,null,null,null,null,null,null,null,0]
[null,"Régulation électrique + sonde",null,null,null,null,null,null,null,null,0]
[null,"Afficheur",null,null,null,null,null,null,null,null,0]
[null,"Filtre US RECO",null,null,null,null,null,null,null,null,0]
[null,"Vanne à main + prise de pression",null,null,null,null,null,null,null,null,0]
[null,"Mise en place",null,null,null,null,null,"Heures",16,50,800,""]
[null,null,null,null,null,null,null,null,null,null,0]
[]
[null,"POSITIVE 2",null,null,"CFP 02",null,"[ 0 / +2°C ]","Ensemble",1,null,{"$f":"I123*J123","v":0}]
[null,"Marque : ",null,null,null,"PROFROID ou Équivalent",null,null,null,null,0]
[null,"Type : ",null,null,null,"PLAFONNIER",null,null,null,null,0]
[null,"Fluide :",null,null,null,"R407F",null,null,null,null,0]
[null,"Puissance :",null,null,null,1554.1945593316932,null,null,null,null,0]
[null,"Delta :",null,null,null,6,null,null,null,null,0]
[null,"Détendeur électrique AKV",null,null,null,null,null,"Ensemble",1,null,0]
[null,"Capteur de pression",null,null,null,null,null,null,null,null,0]
[null,"Régulation électrique + sonde",null,null,null,null,null,null,null,null,0]
[null,"Afficheur",null,null,null,null,null,null,null,null,0]
[null,"Filtre US RECO",null,null,null,null,null,null,null,null,0]
[null,"Vanne à main + prise de pression",null,null,null,null,null,null,null,null,0]
[null,"Mise en place",null,null,null,null,null,"Heures",16,50,800,"DÉPASSEMENT"]
[null,null,null,null,null,null,null,null,null,null,0]
[]
[null,"POSITIVE 3",null,null,"CFP 03",null,"[ 0 / +2°C ]","Ensemble",0,null,{"$f":"I138*J138","v":0}]
[null,"Marque : ",null,null,null,"",null,null,null,null,0]
[null,"Type : ",null,null,null,"PLAFONNIER",null,null,null,null,0]
[null,"Fluide :",null,null,null,"R407F",null,null,null,null,0]
[null,"Puissance :",null,null,null,1740.5452750977279,null,null,null,null,0]
[null,"Delta :",null,null,null,8,null,null,null,null,0]
[null,"Détendeur électrique AKV",null,null,null,null,null,"Ensemble",0,null,0]
[null,"Capteur de pression",null,null,null,null,null,null,null,null,0]
[null,"Régulation électrique + sonde",null,null,null,null,null,null,null,null,0]
[null,"Afficheur",null,null,null,null,null,null,null,null,0]
[null,"Filtre US RECO",null,null,null,null,null,null,null,null,0]
[null,"Vanne à main + prise de pression",null,null,null,null,null,null,null,null,0]
[null,"Mise en place",null,null,null,null,null,"Heures",0,0,0,""]
[]
[]
[null,"POSITIVE 4",null,null,"CFP 04",null,"[ 0 / +2°C ]","Ensemble",1,null,{"$f":"I153*J153","v":0}]
[null,"Marque : ",null,null,null,"PROFROID ou Équivalent",null,null,null,null,0]
[null,"Type : ",null,null,null,"PLAFONNIER",null,null,null,null,0]
[null,"Fluide :",null,null,null,"R407F",null,null,null,null,0]
[null,"Puissance :",null,null,null,901.69616931768803,null,null,null,null,0]
[null,"Delta :",null,null,null,8,null,null,null,null,0]
[null,"Détendeur électrique AKV",null,null,null,null,null,"Ensemble",1,null,0]
[null,"Capteur de pression",null,null,null,null,null,null,null,null,0]
[null,"Régulation électrique + sonde",null,null,null,null,null,null,null,null,0]
[null,"Afficheur",null,null,null,null,null,null,null,null,0]
[null,"Filtre US RECO",null,null,null,null,null,null,null,null,0]
[null,"Vanne à main + prise de pression",null,null,null,null,null,null,null,null,0]
[null,"Mise en place",null,null,null,null,null,"Heures",16,50,800,{"$error":"#REF!"}]
[]
[]
[]
[]
[null,"SURGELES ",null,null,"CFN 01",null,"[ -25 / -18°C ] ","Ensemble",0,null,{"$f":"I170*J170","v":0}]
[null,"Marque : ",null,null,null,"",null,null,null,null,0]
[null,"Type : ",null,null,null,"CUBIQUE",null,null,null,null,0]
[null,"Fluide :",null,null,null,"R134A",null,null,null,null,0]
[null,"Puissance :",null,null,null,7136.156290406826,null,null,null,null,0]
[null,"Delta :",null,null,null,6,null,null,null,null,0]
[null,"Détendeur électrique AKV",null,null,null,null,null,"Ensemble",0,null,0]
[null,"Capteur de pression",null,null,null,null,null,null,null,null,0]
[null,"Régulation électrique + sonde",null,null,null,null,null,null,null,null,0]
[null,"Afficheur",null,null,null,null,null,null,null,null,0]
[null,"Filtre US RECO",null,null,null,null,null,null,null,null,0]
[null,"Vanne à main + prise de pression",null,null,null,null,null,null,null,null,0]
[null,"Thermostat incendie",null,null,null,null,null,null,null,null,0]
[null,"Alarme personne enfermée",null,null,null,null,null,null,null,null,0]
[null,"Mise en place",null,null,null,null,null,"Heures",0,{"$f":"+$H$4","v":50},0,""]
[]
[]
[null,"SURGELES ",null,null,"CFN 02",null,"[ -25 / -18°C ] ","Ensemble",1,null,{"$f":"I187*J187","v":0}]
[null,"Marque : ",null,null,null,"PROFROID ou Équivalent",null,null,null,null,0]
[null,"Type : ",null,null,null,"CUBIQUE",null,null,null,null,0]
[null,"Fluide :",null,null,null,"R134A",null,null,null,null,0]
[null,"Puissance :",null,null,null,550.56822837787729,null,null,null,null,0]
[null,"Delta :",null,null,null,8,null,null,null,null,0]
[null,"Détendeur électrique AKV",null,null,null,null,null,"Ensemble",1,null,0]
[null,"Capteur de pression",null,null,null,null,null,null,null,null,0]
[null,"Régulation électrique + sonde",null,null,null,null,null,null,null,null,0]
[null,"Afficheur",null,null,null,null,null,null,null,null,0]
[null,"Filtre US RECO",null,null,null,null,null,null,null,null,0]
[null,"Vanne à main + prise de pression",null,null,null,null,null,null,null,null,0]
[null,"Thermostat incendie",null,null,null,null,null,null,null,null,0]
[null,"Alarme personne enfermée",null,null,null,null,null,null,null,null,0]
[null,"Mise en place",null,null,null,null,null,"Heures",16,{"$f":"+$H$4","v":50},800,{"$error":"#REF!"}]
[]
[]
[null,"SURGELES ",null,null,"CFN 03",null,"[ -25 / -18°C ] ","Ensemble",1,null,{"$f":"I204*J204","v":0}]
[null,"Marque : ",null,null,null,"PROFROID ou Équivalent",null,null,null,null,0]
[null,"Type : ",null,null,null,"CUBIQUE",null,null,null,null,0]
[null,"Fluide :",null,null,null,"R134A",null,null,null,null,0]
[null,"Puissance :",null,null,null,1246.9093410038474,null,null,null,null,0]
[null,"Delta :",null,null,null,8,null,null,null,null,0]
[null,"Détendeur électrique AKV",null,null,null,null,null,"Ensemble",1,null,0]
[null,"Capteur de pression",null,null,null,null,null,null,null,null,0]
[null,"Régulation électrique + sonde",null,null,null,null,null,null,null,null,0]
[null,"Afficheur",null,null,null,null,null,null,null,null,0]
[null,"Filtre US RECO",null,null,null,null,null,null,null,null,0]
[null,"Vanne à main + prise de pression",null,null,null,null,null,null,null,null,0]
[null,"Thermostat incendie",null,null,null,null,null,null,null,null,0]
[null,"Alarme personne enfermée",null,null,null,null,null,null,null,null,0]
[null,"Mise en place",null,null,null,null,null,"Heures",16,{"$f":"+$H$4","v":50},800,{"$error":"#REF!"}]
[]
[]
[null,"SURGELES ",null,null,"CFN 04",null,"[ -25 / -18°C ] ","Ensemble",1,null,{"$f":"I221*J221","v":0}]
[null,"Marque : ",null,null,null,"PROFROID ou Équivalent",null,null,null,null,0]
[null,"Type : ",null,null,null,"CUBIQUE",null,null,null,null,0]
[null,"Fluide :",null,null,null,"R134A",null,null,null,null,0]
[null,"Puissance :",null,null,null,5989.6308533054171,null,null,null,null,0]
[null,"Delta :",null,null,null,8,null,null,null,null,0]
[null,"Détendeur électrique AKV",null,null,null,null,null,"Ensemble",1,null,0]
[null,"Capteur de pression",null,null,null,null,null,null,null,null,0]
[null,"Régulation électrique + sonde",null,null,null,null,null,null,null,null,0]
[null,"Afficheur",null,null,null,null,null,null,null,null,0]
[null,"Filtre US RECO",null,null,null,null,null,null,null,null,0]
[null,"Vanne à main + prise de pression",null,null,null,null,null,null,null,null,0]
[null,"Thermostat incendie",null,null,null,null,null,null,null,null,0]
[null,"Alarme personne enfermée",null,null,null,null,null,null,null,null,0]
[null,"Mise en place",null,null,null,null,null,"Heures",16,{"$f":"+$H$4","v":50},800,{"$error":"#REF!"}]
[]
[null,null,null,null,null,null,null,null,null,null,0]
[null,null,null,null,null,null,null,null,null,null,0]
[null,{"$f":"\"TOTAL HT : \"&B106","v":"TOTAL HT : CHAMBRES FROIDES"},null,null,null,null,null,null,null,null,{"$f":"SUMIF(K106:K238,\"<>#N/A!\",K106:K238)","v":4800}]
[null,"MEUBLES FRIGORIFIQUES",null,null,null,null,null,null,null,null,{"$f":"I240*J240","v":0}]
[null,null,null,null,null,null,null,null,null,null,{"$f":"I241*J241","v":0}]
[null,"Mise en place des vitrines réfrigérées positives et négatives (fournisseur à définir) y compris déchargement, déballage et alignement (DMA).",null,null,null,null,null,"ENS",null,null,{"$f":"+J242","v":0}]
[null,null,null,null,null,null,null,null,null,null,{"$f":"I243*J243","v":0}]
[null,"Désignation",null,null,null,"Longueur",null,null,null,null,0]
[null,"Charcuterie LS","oui",null,null,18,"récupéré","Unité",0,null,0]
[null,"SAURISSERIE LS","oui",null,null,18,"récupéré","Unité",0,null,0]
[null,"ILOT BACS LS 1","non",null,null,4.38,"récupéré","Unité",0,null,0]
[null,"ILOT BACS LS 2","non",null,null,7.51,"récupéré","Unité",0,null,0]
[null,"ILOT BACS LS 3","non",null,null,7.51,"récupéré","Unité",0,null,0]
[null,"TRAITEUR LS 1","non",null,null,60,"récupéré","Unité",0,null,0]
[null,"TG TRAITEUR LS 1","non",null,null,8.3999999999999986,0,"Unité",1,null,0]
[null,"TG TRAITEUR LS 2","non",null,null,8.3999999999999986,"récupéré","Unité",0,null,0]
[null,"CHARCUTERIE LS 1","non",null,null,60,"récupéré","Unité",0,null,0]
[null,"TRAITEUR LS 2","non",null,null,45,"récupéré","Unité",0,null,0]
[null,"CHARCUTERIE LS 2","non",null,null,60,"récupéré","Unité",0,null,0]
[null,"TG CHARCUTERIE LS 1","non",null,null,8.3999999999999986,"récupéré","Unité",0,null,0]
[null,"TG CHARCUTERIE LS 2","non",null,null,8.3999999999999986,"récupéré","Unité",0,null,0]
[null,"FROMAGE LS 1","non",null,null,60,"récupéré","Unité",0,null,0]
[null,"FROMAGE LS 2","non",null,null,60,"récupéré","Unité",0,null,0]
[null,"TG FROMAGE LS 1","non",null,null,8.3999999999999986,"récupéré","Unité",0,null,0]
[null,"TG FROMAGE LS 2","non",null,null,8.3999999999999986,"récupéré","Unité",0,null,0]
[null,"BOUCHERIE LS","non",null,null,45,"récupéré","Unité",0,null,0]
[null,"CREMERIE LS","non",null,null,60,"récupéré","Unité",0,null,0]
[null,"TG ULTRA FRAIS 1","non",null,null,8.3999999999999986,"récupéré","Unité",0,null,0]
[]
[null,null,null,null,null,null,null,null,null,null,0]
[null,"Régulation électronique + sondes",null,null,null,null,null,"Unité",34,null,0]
[null,"Afficheurs + sondes",null,null,null,null,null,"Unité",34,null,0]
[null,"Détendeurs + VEM",null,null,null,null,null,"Unité",34,null,0]
[null,"Capteur de pression",null,null,null,null,null,"Unité",null,null,0]
[null,"Filtres US RECO",null,null,null,null,null,"Unité",34,null,0]
[null,"Vannes à main + prise de pression",null,null,null,null,null,"Unité",68,null,0]
[null,"Vanne à pression constante",null,null,null,null,null,"Unité",null,null,0]
[null,"Sondes de tracabilité",null,null,null,null,null,"Unité",34,null,0]
[null,"Interrupteurs / linéaire",null,null,null,null,null,"Unité",null,null,0]
[null,null,null,null,null,null,null,null,null,null,0]
[null,"Raccordement électrique",null,null,null,null,null,"Unité",34,null,0]
[null,"Raccordement frigorifique",null,null,null,null,null,"Unité",34,null,0]
[null,"Tuyauterie frigorifique + isolant",null,null,null,null,null,"Unité",114.19999999999999,null,0]
[null,"Électricité : câbles + chemin de câbles",null,null,null,null,null,"Unité",114.19999999999999,null,0]
[null,null,null,null,null,null,null,null,null,null,0]
[null,"Etiquettes de signalisation des meubles avec : ",null,null,null,null,null,"Ensemble",1,null,0]
[null,null,"Nom du linéaire",null,null,null,null,null,null,null,0]
[null,null,"Température de consigne",null,null,null,null,null,null,null,0]
[null,null,"Horaire de dégivrage",null,null,null,null,null,null,null,0]
[]
[null,"Evacuation des condensats en tube PVC jusqu'aux attentes EU y compris siphon, tampon de visite, colle, raccords, accessoires.",null,null,null,null,null,"Unité",114.19999999999999,null,{"$f":"I287*J287","v":0}]
[null,{"$f":"\"TOTAL HT : \"&B240","v":"TOTAL HT : MEUBLES FRIGORIFIQUES"},null,null,null,null,null,null,null,null,{"$f":"SUMIF(K240:K287,\"<>#N/A!\",K240:K287)","v":0}]
[null,"CONFORT",null,null,null,null,null,null,null,null,{"$f":"I289*J289","v":0}]
[null,"Modèle Unité extérieure",null,null,null,null,null,null,null,null,0]
[null,"Marque :",null,"DAIKIN",null,null,null,null,null,null,0]
[null,"Modèle :",null,"…",null,null,null,"Unité",1,null,0]
[null,null,null,null,null,null,null,null,null,null,0]
[null,"Ensemble fixation pour pose du groupe extérieur",null,null,null,null,null,"Ensemble",null,null,0]
[null,null,null,null,null,null,null,null,null,null,0]
[null,"Modèle Unité intérieure",null,null,null,null,null,null,null,null,0]
[null,"Marque :",null,"TOSHIBA",null,null,null,null,null,null,0]
[null,"Modèle :",null,"…",null,null,null,"Unité",{"$error":"#REF!"},null,{"$error":"#REF!"}]
[null,null,null,null,null,null,null,null,null,null,0]
[null,"Ensemble supports pour unité(s) intérieure(s)",null,null,null,null,null,"Ensemble",null,null,0]
[null,"Filtres(s) déshydrateurs",null,null,null,null,null,"Unité",{"$error":"#REF!"},null,{"$error":"#REF!"}]
[null,null,null,null,null,null,null,"Unité",{"$error":"#REF!"},null,{"$error":"#REF!"}]
[null,"Raccordement frigorifique (+ divers y compris suportage et brassure)",null,null,null,null,null,"Ensemble",1,null,0]
[null,"Isolation avec ARMAFLEX 19mm (+divers y compris colles + bande)",null,null,null,null,null,"Ensemble",1,null,0]
[null,"Goulottes de protections des lignes frigorifiques",null,null,null,null,null,"Ensemble",1,null,0]
[null,null,null,null,null,null,null,null,null,null,0]
[null,"kits de raccordement",null,null,{"$error":"#REF!"},null,null,"Unité",{"$error":"#REF!"},null,{"$error":"#REF!"}]
[null,"Commande filaire",null,null,null,null,null,"Unité",1,null,0]
[null,"Complément de fréon",null,null,"R410A",null,null,"kg",{"$error":"#REF!"},null,{"$error":"#REF!"}]
[null,"Évacuation (Tuve PVC DN40)",null,null,null,null,null,"Longueur",0,null,0]
[null,"Pompe(s) de relevage",null,null,null,null,null,"Unité",{"$error":"#REF!"},null,{"$error":"#REF!"}]
[null,"Raccordement électrique",null,null,null,null,null,"Longueur",0,null,0]
[null,null,null,null,null,null,null,null,null,null,0]
[null,"Ensemble mise en route",null,null,null,null,null,"Heures",32,{"$f":"+$H$4","v":50},1600,""]
[null,null,null,null,null,null,null,null,null,null,0]
[null,null,null,null,null,null,null,null,null,null,0]
[null,{"$f":"\"TOTAL HT : \" & B289","v":"TOTAL HT : CONFORT"},null,null,null,null,null,null,null,null,{"$f":"SUMIF(K289:K316,\"<>#N/A\",K289:K316)","v":{"$error":"#REF!"}}]
[null,"TUBES CUIVRES & CALORIFUGES",null,null,null,null,null,null,null,null,{"$f":"I318*J318","v":0}]
[null,"Raccordement des equipements frigorifiques de l'installation.",null,null,null,null,null,"Ensemble",1,null,{"$f":"I319*J319","v":0}]
[null,{"$f":"\"TOTAL HT : \"&B318","v":"TOTAL HT : TUBES CUIVRES & CALORIFUGES"},null,null,null,null,null,null,null,null,{"$f":"SUMIF(K318:K319,\"<>#N/A!\",K318:K319)","v":0}]
[null,"CONDITIONS DE RECEPTION",null,null,null,null,null,null,null,null,{"$f":"I321*J321","v":0}]
[null,"Test d'étanchéité sous pression",null,null,null,null,null,"Ensemble",1,null,0]
[null,"Tirage au vide - test d'étanchéité",null,null,null,null,null,"Ensemble",1,null,0]
[null,"Mise en service",null,null,null,null,null,"Ensemble",1,null,0]
[null,"Founir une fiche de programmation des régulateurs d'unités de chauffage/rafraîchissement (tutoriel).",null,null,null,null,null,"Ensemble",1,null,0]
[null,null,null,null,null,null,null,null,null,null,0]
[null,{"$f":"\"TOTAL HT : \"&B321","v":"TOTAL HT : CONDITIONS DE RECEPTION"},null,null,null,null,null,null,null,null,{"$f":"SUMIF(K321:K326,\"<>#N/A!\",K321:K326)","v":0}]
["RECAPITULATIF",null,null,null,null,null,null,null,{"$f":"+#REF!","v":{"$error":"#REF!"}}]
[null,{"$f":"+B9","v":"TOTAL HT : COMPTE PRORATA"},null,null,null,null,null,null,{"$f":"+K9","v":0}]
[null,{"$f":"B40","v":"TOTAL HT : CENTRALE POSITIVE"},null,null,null,null,null,null,{"$f":"+K40","v":{"$error":"#VALUE!"}}]
[null,{"$f":"+B65","v":"TOTAL HT : CONDENSEUR POSITIF"},null,null,null,null,null,null,{"$f":"+K65","v":{"$error":"#VALUE!"}}]
[null,{"$f":"+B92","v":"TOTAL HT : GROUPE DE CONDENSEUR NÉGATIF"},null,null,null,null,null,null,{"$f":"+K92","v":0}]
[null,{"$f":"B95","v":"TOTAL HT : ARMOIRE ÉLECTRIQUE"},null,null,null,null,null,null,{"$f":"+K95","v":0}]
[null,{"$f":"B105","v":"TOTAL HT : LOCAL TECHNIQUE"},null,null,null,null,null,null,{"$f":"+K105","v":800}]
[null,{"$f":"B239","v":"TOTAL HT : CHAMBRES FROIDES"},null,null,null,null,null,null,{"$f":"+K239","v":4800}]
[null,{"$f":"B288","v":"TOTAL HT : MEUBLES FRIGORIFIQUES"},null,null,null,null,null,null,{"$f":"+K288","v":0}]
[null,{"$f":"B317","v":"TOTAL HT : CONFORT"},null,null,null,null,null,null,{"$f":"+K317","v":{"$error":"#REF!"}}]
[null,{"$f":"B320","v":"TOTAL HT : TUBES CUIVRES & CALORIFUGES"},null,null,null,null,null,null,{"$f":"+K320","v":0}]
[null,{"$f":"+B327","v":"TOTAL HT : CONDITIONS DE RECEPTION"},null,null,null,null,null,null,{"$f":"+K327","v":0}]
[null,"MONTANT TOTAL HT",null,null,null,null,null,null,{"$f":"SUMIF(I329:K339,\"<>#N/A!\",I329:K339)","v":{"$error":"#VALUE!"}}]
[null,"TVA 20,0%",null,null,null,null,null,null,{"$f":"I340*20/100","v":{"$error":"#VALUE!"}}]
[null,"MONTANT TOTAL TTC",null,null,null,null,null,null,{"$f":"I340+I341","v":{"$error":"#VALUE!"}}]
[]
[null,null,null,null,null,null,null,null,"Décomposition"]
["DONT","MONTANT MAIN D'ŒUVRE TOTAL HT",null,null,null,null,null,null,{"$f":"+K38+K64+K90+K103+K120+K135+K150+K184+K314+I327","v":{"$error":"#VALUE!"}},null,{"$f":"+I345/$I$340","v":{"$error":"#VALUE!"}}]
[null,"MONTANT ÉQUIPEMENT HT",null,null,null,null,null,null,{"$f":"+I340-I345-I347","v":{"$error":"#VALUE!"}},null,{"$f":"+I346/$I$340","v":{"$error":"#VALUE!"}}]
[null,"MONTANT ÉQUIPEMENT HT (DMA)",null,null,null,null,null,null,{"$f":"+$K$242","v":0},null,{"$f":"+I347/$I$340","v":{"$error":"#VALUE!"}}]

{"sheet":"Sélection Comp. négatif","index":39,"n_rows":45,"n_cols":8,"rows_kept":45,"cut":false,"hidden":true,"merged":[]}
["Champ libre 1","Champ libre 2","Libellé","Ref","Valeurs"]
["Scroll","R134A","COPELAND","ZR18 K3E PFJ 522",2.5,null,"Somme cible",{"$f":"'Besoins frigo'!E35/1000","v":0}]
["Scroll","R134A","COPELAND","ZR22 K3E PFJ 522",3.1,null,"nbCompresseursmini",3]
["Scroll","R134A","COPELAND","ZR28 K3E PFJ 522",4.1100000000000003,null,"nbCompresseursMaxi",3]
["Scroll","R134A","COPELAND","ZR34 K3E PFJ 522",4.91,null,"nbMaxSolutions",3]
["Scroll","R134A","COPELAND","ZR40 K3E PFJ 522",5.71]
["Scroll","R134A","COPELAND","ZR48 K3E PFJ 522",7.2,null,"Précision",0.1]
["Scroll","R134A","COPELAND","ZR61 KCE PFZ 522",8.81]
["Scroll","R134A","COPELAND","ZR22 K3E TFD 522",3.2]
["Scroll","R134A","COPELAND","ZR28 K3E TFD 522",4.2]
["Scroll","R134A","COPELAND","ZR34 K3E TFD 522",4.9000000000000004]
["Scroll","R134A","COPELAND","ZR40 K3E TFD 522",5.7]
["Scroll","R134A","COPELAND","ZR48 K3E TFD 522",6.8]
["Scroll","R134A","COPELAND","ZR61 KSE TFM 522",8.85]
["Scroll","R134A","COPELAND","ZR61 KCE TFD 522",8.8000000000000007]
["Scroll","R134A","COPELAND","ZR72 KCE TFD 522",10.5]
["Scroll","R134A","COPELAND","ZR81 KCE TFD 522",11.8]
["Scroll","R134A","COPELAND","ZR90 K3E TWD 961",12.8]
["Scroll","R134A","COPELAND","ZR94 KCE TFD 455",12.3]
["Scroll","R134A","COPELAND","ZR108 KCE TFD 455",14.1]
["Scroll","R134A","COPELAND","ZR11 M3E TWD 961",15.8]
["Scroll","R134A","COPELAND","ZR12 M3E TWD 961",18.3]
["Scroll","R134A","COPELAND","ZR125 KCE TFD 455",16.2]
["Scroll","R134A","COPELAND","ZR144 KCE TFD 455",20.9]
["Scroll","R134A","COPELAND","ZR16 M3E TWD 961",22.4]
["Scroll","R134A","COPELAND","ZR160 K-E TFD 455",22.8]
["Scroll","R134A","COPELAND","ZR19 M3E TWD 961",26.8]
["Scroll","R134A","COPELAND","ZR190 KCE TFD 455",27.2]
["Scroll","R134A","COPELAND","ZR250 KCE TWD 522",35.4]
["Scroll","R134A","COPELAND","ZR310 KCE TWD 522",45]
["Scroll","R134A","COPELAND","ZR380 KCE TWD 522",55.4]
["Semi-hermétique","R407F","COPELAND","2DC-50X",10.25]
["Semi-hermétique","R407F","COPELAND","2DD-50X",11.95]
["Semi-hermétique","R407F","COPELAND","2DL-75X",14.75]
["Semi-hermétique","R407F","COPELAND","2DB-75X",17.850000000000001]
["Semi-hermétique","R407F","COPELAND","3DA-75X",20.8]
["Semi-hermétique","R407F","COPELAND","3DC-100X",24.7]
["Semi-hermétique","R407F","COPELAND","3DS-150X",32.6]
["Semi-hermétique","R407F","COPELAND","8DH-500X",94.2]
["Semi-hermétique","R407F","COPELAND","8DJ-600X",113]
["Scroll","R407F","COPELAND","ZF13KVE",11.5]
["Scroll","R407F","COPELAND","ZF18KVE",16]
["Scroll","R407F","COPELAND","ZF25K5E",19.100000000000001]
["Scroll","R407F","COPELAND","ZF34K5E",25.4]
["Scroll","R407F","COPELAND","ZF41K5E",21.2]

{"sheet":"Tableau synthèse","index":40,"n_rows":9,"n_cols":10,"rows_kept":9,"cut":false,"hidden":true,"merged":[[3,9,8,13]]}
[]
[]
[null,null,"Solution 1","Solution 2","Solution 3"]
[null,"Compresseurs 1",{"$f":"IF(COUNTA(OFFSET('Sélection Comp. négatif'!$I$1:$I$65536,,COLUMN(A:A)))-ROW(1:1)>0,INDEX('Sélection Comp. négatif'!$D$1:$D$65536,MATCH(LARGE(OFFSET('Sélection Comp. négatif'!$I$1:$I$65536,,COLUMN(A:A)),COUNTA(OFFSET('Sélection Comp. négatif'!$I$1:$I$65536,,COLUMN(A:A)))-ROW(1:1)),OFFSET('Sélection Comp. négatif'!$I$1:$I$65536,,COLUMN(A:A)),0)),\"\")","v":""},{"$f":"IF(COUNTA(OFFSET('Sélection Comp. négatif'!$I:$I,,COLUMN(B:B)))-ROW(1:1)>0,INDEX('Sélection Comp. négatif'!$D:$D,MATCH(LARGE(OFFSET('Sélection Comp. négatif'!$I:$I,,COLUMN(B:B)),COUNTA(OFFSET('Sélection Comp. négatif'!$I:$I,,COLUMN(B:B)))-ROW(1:1)),OFFSET('Sélection Comp. négatif'!$I:$I,,COLUMN(B:B)),0)),\"\")","v":""},{"$f":"IF(COUNTA(OFFSET('Sélection Comp. négatif'!$I:$I,,COLUMN(C:C)))-ROW(1:1)>0,INDEX('Sélection Comp. négatif'!$D:$D,MATCH(LARGE(OFFSET('Sélection Comp. négatif'!$I:$I,,COLUMN(C:C)),COUNTA(OFFSET('Sélection Comp. négatif'!$I:$I,,COLUMN(C:C)))-ROW(1:1)),OFFSET('Sélection Comp. négatif'!$I:$I,,COLUMN(C:C)),0)),\"\")","v":""},null,null,null,null,"NE PAS SUPPRIMER !\nCe tableau récupère les valeurs de la sélection multiple des compresseurs NÉGATIF !"]
[null,"Compresseurs 2",{"$f":"IF(COUNTA(OFFSET('Sélection Comp. négatif'!$I$1:$I$65536,,COLUMN(A:A)))-ROW(2:2)>0,INDEX('Sélection Comp. négatif'!$D$1:$D$65536,MATCH(LARGE(OFFSET('Sélection Comp. négatif'!$I$1:$I$65536,,COLUMN(A:A)),COUNTA(OFFSET('Sélection Comp. négatif'!$I$1:$I$65536,,COLUMN(A:A)))-ROW(2:2)),OFFSET('Sélection Comp. négatif'!$I$1:$I$65536,,COLUMN(A:A)),0)),\"\")","v":""},{"$f":"IF(COUNTA(OFFSET('Sélection Comp. négatif'!$I:$I,,COLUMN(B:B)))-ROW(2:2)>0,INDEX('Sélection Comp. négatif'!$D:$D,MATCH(LARGE(OFFSET('Sélection Comp. négatif'!$I:$I,,COLUMN(B:B)),COUNTA(OFFSET('Sélection Comp. négatif'!$I:$I,,COLUMN(B:B)))-ROW(2:2)),OFFSET('Sélection Comp. négatif'!$I:$I,,COLUMN(B:B)),0)),\"\")","v":""},{"$f":"IF(COUNTA(OFFSET('Sélection Comp. négatif'!$I:$I,,COLUMN(C:C)))-ROW(2:2)>0,INDEX('Sélection Comp. négatif'!$D:$D,MATCH(LARGE(OFFSET('Sélection Comp. négatif'!$I:$I,,COLUMN(C:C)),COUNTA(OFFSET('Sélection Comp. négatif'!$I:$I,,COLUMN(C:C)))-ROW(2:2)),OFFSET('Sélection Comp. négatif'!$I:$I,,COLUMN(C:C)),0)),\"\")","v":""}]
[null,"Compresseurs 3",{"$f":"IF(COUNTA(OFFSET('Sélection Comp. négatif'!$I$1:$I$65536,,COLUMN(A:A)))-ROW(3:3)>0,INDEX('Sélection Comp. négatif'!$D$1:$D$65536,MATCH(LARGE(OFFSET('Sélection Comp. négatif'!$I$1:$I$65536,,COLUMN(A:A)),COUNTA(OFFSET('Sélection Comp. négatif'!$I$1:$I$65536,,COLUMN(A:A)))-ROW(3:3)),OFFSET('Sélection Comp. négatif'!$I$1:$I$65536,,COLUMN(A:A)),0)),\"\")","v":""},{"$f":"IF(COUNTA(OFFSET('Sélection Comp. négatif'!$I:$I,,COLUMN(B:B)))-ROW(3:3)>0,INDEX('Sélection Comp. négatif'!$D:$D,MATCH(LARGE(OFFSET('Sélection Comp. négatif'!$I:$I,,COLUMN(B:B)),COUNTA(OFFSET('Sélection Comp. négatif'!$I:$I,,COLUMN(B:B)))-ROW(3:3)),OFFSET('Sélection Comp. négatif'!$I:$I,,COLUMN(B:B)),0)),\"\")","v":""},{"$f":"IF(COUNTA(OFFSET('Sélection Comp. négatif'!$I:$I,,COLUMN(C:C)))-ROW(3:3)>0,INDEX('Sélection Comp. négatif'!$D:$D,MATCH(LARGE(OFFSET('Sélection Comp. négatif'!$I:$I,,COLUMN(C:C)),COUNTA(OFFSET('Sélection Comp. négatif'!$I:$I,,COLUMN(C:C)))-ROW(3:3)),OFFSET('Sélection Comp. négatif'!$I:$I,,COLUMN(C:C)),0)),\"\")","v":""}]
[null,"Compresseurs 4",{"$f":"IF(COUNTA(OFFSET('Sélection Comp. négatif'!$I$1:$I$65536,,COLUMN(A:A)))-ROW(4:4)>0,INDEX('Sélection Comp. négatif'!$D$1:$D$65536,MATCH(LARGE(OFFSET('Sélection Comp. négatif'!$I$1:$I$65536,,COLUMN(A:A)),COUNTA(OFFSET('Sélection Comp. négatif'!$I$1:$I$65536,,COLUMN(A:A)))-ROW(4:4)),OFFSET('Sélection Comp. négatif'!$I$1:$I$65536,,COLUMN(A:A)),0)),\"\")","v":""},{"$f":"IF(COUNTA(OFFSET('Sélection Comp. négatif'!$I:$I,,COLUMN(B:B)))-ROW(4:4)>0,INDEX('Sélection Comp. négatif'!$D:$D,MATCH(LARGE(OFFSET('Sélection Comp. négatif'!$I:$I,,COLUMN(B:B)),COUNTA(OFFSET('Sélection Comp. négatif'!$I:$I,,COLUMN(B:B)))-ROW(4:4)),OFFSET('Sélection Comp. négatif'!$I:$I,,COLUMN(B:B)),0)),\"\")","v":""},{"$f":"IF(COUNTA(OFFSET('Sélection Comp. négatif'!$I:$I,,COLUMN(C:C)))-ROW(4:4)>0,INDEX('Sélection Comp. négatif'!$D:$D,MATCH(LARGE(OFFSET('Sélection Comp. négatif'!$I:$I,,COLUMN(C:C)),COUNTA(OFFSET('Sélection Comp. négatif'!$I:$I,,COLUMN(C:C)))-ROW(4:4)),OFFSET('Sélection Comp. négatif'!$I:$I,,COLUMN(C:C)),0)),\"\")","v":""}]
[null,"Compresseurs 5",{"$f":"IF(COUNTA(OFFSET('Sélection Comp. négatif'!$I$1:$I$65536,,COLUMN(A:A)))-ROW(5:5)>0,INDEX('Sélection Comp. négatif'!$D$1:$D$65536,MATCH(LARGE(OFFSET('Sélection Comp. négatif'!$I$1:$I$65536,,COLUMN(A:A)),COUNTA(OFFSET('Sélection Comp. négatif'!$I$1:$I$65536,,COLUMN(A:A)))-ROW(5:5)),OFFSET('Sélection Comp. négatif'!$I$1:$I$65536,,COLUMN(A:A)),0)),\"\")","v":""},{"$f":"IF(COUNTA(OFFSET('Sélection Comp. négatif'!$I:$I,,COLUMN(B:B)))-ROW(5:5)>0,INDEX('Sélection Comp. négatif'!$D:$D,MATCH(LARGE(OFFSET('Sélection Comp. négatif'!$I:$I,,COLUMN(B:B)),COUNTA(OFFSET('Sélection Comp. négatif'!$I:$I,,COLUMN(B:B)))-ROW(5:5)),OFFSET('Sélection Comp. négatif'!$I:$I,,COLUMN(B:B)),0)),\"\")","v":""},{"$f":"IF(COUNTA(OFFSET('Sélection Comp. négatif'!$I:$I,,COLUMN(C:C)))-ROW(5:5)>0,INDEX('Sélection Comp. négatif'!$D:$D,MATCH(LARGE(OFFSET('Sélection Comp. négatif'!$I:$I,,COLUMN(C:C)),COUNTA(OFFSET('Sélection Comp. négatif'!$I:$I,,COLUMN(C:C)))-ROW(5:5)),OFFSET('Sélection Comp. négatif'!$I:$I,,COLUMN(C:C)),0)),\"\")","v":""}]
[null,"Compresseurs 6",{"$f":"IF(COUNTA(OFFSET('Sélection Comp. négatif'!$I$1:$I$65536,,COLUMN(A:A)))-ROW(6:6)>0,INDEX('Sélection Comp. négatif'!$D$1:$D$65536,MATCH(LARGE(OFFSET('Sélection Comp. négatif'!$I$1:$I$65536,,COLUMN(A:A)),COUNTA(OFFSET('Sélection Comp. négatif'!$I$1:$I$65536,,COLUMN(A:A)))-ROW(6:6)),OFFSET('Sélection Comp. négatif'!$I$1:$I$65536,,COLUMN(A:A)),0)),\"\")","v":""},{"$f":"IF(COUNTA(OFFSET('Sélection Comp. négatif'!$I:$I,,COLUMN(B:B)))-ROW(6:6)>0,INDEX('Sélection Comp. négatif'!$D:$D,MATCH(LARGE(OFFSET('Sélection Comp. négatif'!$I:$I,,COLUMN(B:B)),COUNTA(OFFSET('Sélection Comp. négatif'!$I:$I,,COLUMN(B:B)))-ROW(6:6)),OFFSET('Sélection Comp. négatif'!$I:$I,,COLUMN(B:B)),0)),\"\")","v":""},{"$f":"IF(COUNTA(OFFSET('Sélection Comp. négatif'!$I:$I,,COLUMN(C:C)))-ROW(6:6)>0,INDEX('Sélection Comp. négatif'!$D:$D,MATCH(LARGE(OFFSET('Sélection Comp. négatif'!$I:$I,,COLUMN(C:C)),COUNTA(OFFSET('Sélection Comp. négatif'!$I:$I,,COLUMN(C:C)))-ROW(6:6)),OFFSET('Sélection Comp. négatif'!$I:$I,,COLUMN(C:C)),0)),\"\")","v":""}]

{"sheet":"Sélection Comp.positif","index":41,"n_rows":226,"n_cols":8,"rows_kept":226,"cut":false,"hidden":true,"merged":[]}
["Champ libre 1","Champ libre 2","Libellé","Ref","Valeurs"]
["Semi-hermétique","R134A","BITZER","2KES-05Y",1,null,"Somme cible",{"$f":"'Besoins frigo'!E19/1000","v":0}]
["Semi-hermétique","R134A","BITZER","2JES-07Y",1.27,null,"nbCompresseursmini",4]
["Semi-hermétique","R134A","BITZER","2HES-1Y",1.83,null,"nbCompresseursMaxi",4]
["Semi-hermétique","R134A","BITZER","2HES-2Y",1.81,null,"nbMaxSolutions",3]
["Semi-hermétique","R134A","BITZER","2GES-2Y",2.16]
["Semi-hermétique","R134A","BITZER","2FES-2Y",2.68,null,"Précision",0.1]
["Semi-hermétique","R134A","BITZER","2FES-3Y",2.67]
["Semi-hermétique","R134A","BITZER","2EES-2Y",3.31]
["Semi-hermétique","R134A","BITZER","2EES-3Y",3.32]
["Semi-hermétique","R134A","BITZER","2DES-2Y",3.98]
["Semi-hermétique","R134A","BITZER","2DES-3Y",3.99]
["Semi-hermétique","R134A","BITZER","2CES-3Y",4.95]
["Semi-hermétique","R134A","BITZER","2CES-4Y",4.96]
["Semi-hermétique","R134A","BITZER","4FES-3Y",5.08]
["Semi-hermétique","R134A","BITZER","4FES-5Y",5.07]
["Semi-hermétique","R134A","BITZER","4EES-4Y",6.79]
["Semi-hermétique","R134A","BITZER","4EES-6Y",6.77]
["Semi-hermétique","R134A","BITZER","4DES-5Y",7.82]
["Semi-hermétique","R134A","BITZER","4DES-7Y",7.83]
["Semi-hermétique","R134A","BITZER","4CES-6Y",9.73]
["Semi-hermétique","R134A","BITZER","4CES-9Y",9.7100000000000009]
["Semi-hermétique","R134A","BITZER","4VES-7Y",10.09]
["Semi-hermétique","R134A","BITZER","4VES-10Y",9.8800000000000008]
["Semi-hermétique","R134A","BITZER","4TES-12Y",12.06]
["Semi-hermétique","R134A","BITZER","4PES-15Y",13.56]
["Semi-hermétique","R134A","BITZER","4NES-20Y",16.46]
["Semi-hermétique","R134A","BITZER","4JE-22Y",18.82]
["Semi-hermétique","R134A","BITZER","4HE-25Y",22.5]
["Semi-hermétique","R134A","BITZER","4GE-30Y",26.3]
["Semi-hermétique","R134A","BITZER","4FE-35Y",31.1]
["Semi-hermétique","R134A","BITZER","6JE-33Y",28.4]
["Semi-hermétique","R134A","BITZER","6HE-35Y",32.9]
["Semi-hermétique","R134A","BITZER","6GE-40Y",38.799999999999997]
["Semi-hermétique","R134A","BITZER","6FE-50Y",45.7]
["Semi-hermétique","R407F","BITZER","2KES-05Y",1.91]
["Semi-hermétique","R407F","BITZER","2JES-07Y",2.57]
["Semi-hermétique","R407F","BITZER","2HES-1Y",3.3]
["Semi-hermétique","R407F","BITZER","2HES-2Y",3.29]
["Semi-hermétique","R407F","BITZER","2GES-2Y",3.88]
["Semi-hermétique","R407F","BITZER","2FES-2Y",4.92]
["Semi-hermétique","R407F","BITZER","2FES-3Y",4.91]
["Semi-hermétique","R407F","BITZER","2EES-2Y",5.56]
["Semi-hermétique","R407F","BITZER","2EES-3Y",5.57]
["Semi-hermétique","R407F","BITZER","2DES-2Y",6.67]
["Semi-hermétique","R407F","BITZER","2DES-3Y",6.69]
["Semi-hermétique","R407F","BITZER","2CES-3Y",8.26]
["Semi-hermétique","R407F","BITZER","2CES-4Y",8.27]
["Semi-hermétique","R407F","BITZER","4FES-3Y",9.0500000000000007]
["Semi-hermétique","R407F","BITZER","4FES-5Y",9.06]
["Semi-hermétique","R407F","BITZER","4EES-4Y",11.33]
["Semi-hermétique","R407F","BITZER","4EES-6Y",11.32]
["Semi-hermétique","R407F","BITZER","4DES-5Y",13.31]
["Semi-hermétique","R407F","BITZER","4DES-7Y",13.32]
["Semi-hermétique","R407F","BITZER","4CES-6Y",16.5]
["Semi-hermétique","R407F","BITZER","4CES-9Y",16.510000000000002]
["Semi-hermétique","R407F","BITZER","4VES-7Y",16.71]
["Semi-hermétique","R407F","BITZER","4VES-10Y",16.7]
["Semi-hermétique","R407F","BITZER","4TES-12Y",20.399999999999999]
["Semi-hermétique","R407F","BITZER","4PES-15Y",23.2]
["Semi-hermétique","R407F","BITZER","4NES-20Y",27.7]
["Semi-hermétique","R407F","BITZER","4JE-22Y",31.4]
["Semi-hermétique","R407F","BITZER","4HE-25Y",37.4]
["Semi-hermétique","R407F","BITZER","4GE-30Y",43.3]
["Semi-hermétique","R407F","BITZER","4FE-35Y",51.8]
["Semi-hermétique","R407F","BITZER","6JE-33Y",46.9]
["Semi-hermétique","R407F","BITZER","6HE-35Y",56]
["Semi-hermétique","R407F","BITZER","6GE-40Y",64.8]
["Semi-hermétique","R407F","BITZER","6FE-50Y",77.5]
["Semi-hermétique","R134A","BITZER","2DES-3.F1Y 40S",3.6]
["Semi-hermétique","R134A","BITZER","4FES-5.F1Y+BCP 40S",3.82]
["Semi-hermétique","R134A","BITZER","4EES-6.F1Y+BCP 40S",4.9400000000000004]
["Semi-hermétique","R134A","BITZER","4DES-7.F3Y+BCP 40S",5.82]
["Semi-hermétique","R134A","BITZER","4CES-9.F3Y+BCP 40S",7.17]
["Semi-hermétique","R134A","BITZER","4VES-10.F4Y 40S",7.44]
["Semi-hermétique","R134A","BITZER","4TES-12.F4Y 40S",9]
["Semi-hermétique","R134A","BITZER","4PES-15.F4Y 40S",10.28]
["Semi-hermétique","R134A","BITZER","4NES-20.F4Y 40S",12.28]
["Semi-hermétique","R134A","BITZER","2DES-3.F1Y 40S",10.49]
["Semi-hermétique","R134A","BITZER","4FES-5.F1Y+BCP 40S",13.61]
["Semi-hermétique","R134A","BITZER","4EES-6.F1Y+BCP 40S",17.59]
["Semi-hermétique","R134A","BITZER","4DES-7.F3Y+BCP 40S",20.7]
["Semi-hermétique","R134A","BITZER","4CES-9.F3Y+BCP 40S",25.6]
["Semi-hermétique","R134A","BITZER","4VES-10.F4Y 40S",26.5]
["Semi-hermétique","R134A","BITZER","4TES-12.F4Y 40S",32.1]
["Semi-hermétique","R134A","BITZER","4PES-15.F4Y 40S",36.6]
["Semi-hermétique","R134A","BITZER","4NES-20.F4Y 40S",43.7]
["Semi-hermétique","R134A","COPELAND","2DC-50X",4.25]
["Semi-hermétique","R134A","COPELAND","2DD-50X",5.27]
["Semi-hermétique","R134A","COPELAND","2DL-40X",6.2]
["Semi-hermétique","R134A","COPELAND","2DL-75X",6.19]
["Semi-hermétique","R134A","COPELAND","2DB-50X",7.93]
["Semi-hermétique","R134A","COPELAND","2DB-75X",7.51]
["Semi-hermétique","R134A","COPELAND","3DA-50X",8.93]
["Semi-hermétique","R134A","COPELAND","3DA-75X",8.74]
["Semi-hermétique","R134A","COPELAND","3DC-100X",11.05]
["Semi-hermétique","R134A","COPELAND","3DC-75X ",10.95]
["Semi-hermétique","R134A","COPELAND","3DS-100X",14.4]
["Semi-hermétique","R134A","COPELAND","3DS-150X",15.17]
["Semi-hermétique","R134A","COPELAND","4DF-100X",16.8]
["Semi-hermétique","R134A","COPELAND","4DA-200X ",17.2]
["Semi-hermétique","R134A","COPELAND","4DL-150X",21.81]
["Semi-hermétique","R134A","COPELAND","4DH-250X",21.1]
["Semi-hermétique","R134A","COPELAND","4DT-220X",26.61]
["Semi-hermétique","R134A","COPELAND","4DJ-300X",25.7]
["Semi-hermétique","R134A","COPELAND","6DH-350X",30.9]
["Semi-hermétique","R134A","COPELAND","6DL-270X",31.7]
["Semi-hermétique","R134A","COPELAND","6DJ-400X",37.6]
["Semi-hermétique","R134A","COPELAND","6DT-320X",38.5]
["Semi-hermétique","R134A","COPELAND","8DH-500X",44.4]
["Semi-hermétique","R134A","COPELAND","8DL-370X",46]
["Semi-hermétique","R134A","COPELAND","8DJ-600X",53.3]
["Semi-hermétique","R134A","COPELAND","8DT-450X",55.5]
["Semi-hermétique","R134A","COPELAND","4MA1-22X",18.649999999999999]
["Semi-hermétique","R134A","COPELAND","4MF1-13X",17.95]
["Semi-hermétique","R134A","COPELAND","4MH1-25X",21.5]
["Semi-hermétique","R134A","COPELAND","4ML1-15X",21.8]
["Semi-hermétique","R134A","COPELAND","4MI1-30X",23.8]
["Semi-hermétique","R134A","COPELAND","4MM1-20X",24.2]
["Semi-hermétique","R134A","COPELAND","4MJ1-33X",26.6]
["Semi-hermétique","R134A","COPELAND","4MT1-22X",27.4]
["Semi-hermétique","R134A","COPELAND","4MK1-35X",29.8]
["Semi-hermétique","R134A","COPELAND","4MU1-25X",30.2]
["Semi-hermétique","R134A","COPELAND","6MI1-40X",35]
["Semi-hermétique","R134A","COPELAND","6MM1-30X",36.4]
["Semi-hermétique","R134A","COPELAND","6MJ1-45X",39.700000000000003]
["Semi-hermétique","R134A","COPELAND","6MT1-35X",41.1]
["Semi-hermétique","R134A","COPELAND","6MK1-50X",42.5]
["Semi-hermétique","R134A","COPELAND","6MU1-40X",44.9]
["Semi-hermétique","R407F","COPELAND","4MA1-22X",3.39]
["Semi-hermétique","R407F","COPELAND","4MF1-13X",29.1]
["Semi-hermétique","R407F","COPELAND","4MH1-25X",36.5]
["Semi-hermétique","R407F","COPELAND","4ML1-15X",36]
["Semi-hermétique","R407F","COPELAND","4MI1-30X",40.200000000000003]
["Semi-hermétique","R407F","COPELAND","4MM1-20X",39.4]
["Semi-hermétique","R407F","COPELAND","4MJ1-33X",44.8]
["Semi-hermétique","R407F","COPELAND","4MT1-22X",43.8]
["Semi-hermétique","R407F","COPELAND","4MK1-35X",50]
["Semi-hermétique","R407F","COPELAND","4MU1-25X",49.2]
["Semi-hermétique","R407F","COPELAND","6MI1-40X",61.5]
["Semi-hermétique","R407F","COPELAND","6MM1-30X",59.9]
["Semi-hermétique","R407F","COPELAND","6MJ1-45X",68]
["Semi-hermétique","R407F","COPELAND","6MT1-35X",66.900000000000006]
["Semi-hermétique","R407F","COPELAND","6MK1-50X",76.599999999999994]
["Semi-hermétique","R407F","COPELAND","6MU1-40X",72.7]
["Scroll","R134A","COPELAND","ZBD21KCE TFD 551",3]
["Scroll","R134A","COPELAND","ZBD30 KCE TFD 551",4.0999999999999996]
["Scroll","R134A","COPELAND","ZBD38 KCE TFD 551",5.0999999999999996]
["Scroll","R134A","COPELAND","ZBD45 KCE TFD 551",5.81]
["Scroll","R134A","COPELAND","ZBD58 KCE TFD 551",7.5]
["Scroll","R134A","COPELAND","ZBD76 KCE TFD 551",9.81]
["Scroll","R407F","COPELAND","ZBD21KCE TFD 551",4.5999999999999996]
["Scroll","R407F","COPELAND","ZBD30 KCE TFD 551",6.7]
["Scroll","R407F","COPELAND","ZBD38 KCE TFD 551",8.1999999999999993]
["Scroll","R407F","COPELAND","ZBD45 KCE TFD 551",9.8000000000000007]
["Scroll","R134A","COPELAND","ZB15 KCE TFD 551 ",1.98]
["Scroll","R134A","COPELAND","ZB19 KCE TFD 551",2.29]
["Scroll","R134A","COPELAND","ZB21 KCE TFD 551",2.89]
["Scroll","R134A","COPELAND","ZB26 KCE TFD 551",3.34]
["Scroll","R134A","COPELAND","ZB30 KCE TFD 551",3.92]
["Scroll","R134A","COPELAND","ZB38 KCE TFD 551",4.87]
["Scroll","R134A","COPELAND","ZB45 KCE TFD 551",5.8]
["Scroll","R134A","COPELAND","ZB50 KCE TFD 551",6.68]
["Scroll","R134A","COPELAND","ZB56 KCE TWD 551",6.78]
["Scroll","R134A","COPELAND","ZB58 KCE TFD 551",7.48]
["Scroll","R134A","COPELAND","ZB66 KCE TFD 551",8.5500000000000007]
["Scroll","R134A","COPELAND","ZB75 KCE TWD 551",9.52]
["Scroll","R134A","COPELAND","ZB76 KCE TFD 551",9.7899999999999991]
["Scroll","R134A","COPELAND","ZB92 KCE TWD 551",11.85]
["Scroll","R134A","COPELAND","ZB95 KCE TFD 551",12.35]
["Scroll","R134A","COPELAND","ZB11 MCE TWD 551",14.65]
["Scroll","R134A","COPELAND","ZB114 KCE TFD 551",14.6]
["Scroll","R407F","COPELAND","ZB15 KCE TFD 551 ",2.94]
["Scroll","R407F","COPELAND","ZB19 KCE TFD 551",3.71]
["Scroll","R407F","COPELAND","ZB21 KCE TFD 551",4.49]
["Scroll","R407F","COPELAND","ZB26 KCE TFD 551",5.19]
["Scroll","R407F","COPELAND","ZB30 KCE TFD 551",6.46]
["Scroll","R407F","COPELAND","ZB38 KCE TFD 551",8.0299999999999994]
["Scroll","R407F","COPELAND","ZB45 KCE TFD 551",9.44]
["Semi-hermétique","R134A","COPELAND","KM-5X",1.08]
["Semi-hermétique","R134A","COPELAND","KJ-7X",1.42]
["Semi-hermétique","R134A","COPELAND","KSJ-10X",1.82]
["Semi-hermétique","R134A","COPELAND","KL-15X",2.09]
["Semi-hermétique","R134A","COPELAND","LE-20X",2.52]
["Semi-hermétique","R134A","COPELAND","KSL-15X",2.61]
["Semi-hermétique","R134A","COPELAND","KSL-20X",2.69]
["Semi-hermétique","R134A","COPELAND","LF-20X",3.47]
["Semi-hermétique","R134A","COPELAND","LJ-20X",3.93]
["Semi-hermétique","R134A","COPELAND","LL-30X",5.03]
["Semi-hermétique","R134A","COPELAND","2DL-40X",6.61]
["Semi-hermétique","R134A","COPELAND","LSG-40X",6.6]
["Semi-hermétique","R134A","COPELAND","2DB-50X",8.3699999999999992]
["Semi-hermétique","R134A","COPELAND","3DA-50X",9.4499999999999993]
["Semi-hermétique","R134A","COPELAND","3DAD-50X",9.6300000000000008]
["Semi-hermétique","R134A","COPELAND","3DC-75X",11.55]
["Semi-hermétique","R134A","COPELAND","3DCD-75X",11.56]
["Semi-hermétique","R134A","COPELAND","3DS-100X",15.15]
["Semi-hermétique","R134A","COPELAND","3DSD-100X",15.5]
["Semi-hermétique","R134A","COPELAND","8DH-400X",44.89]
["Semi-hermétique","R134A","COPELAND","8DL-370X",48.2]
["Semi-hermétique","R134A","COPELAND","8DJ-500X",52]
["Semi-hermétique","R134A","COPELAND","8DT-450X",58.2]
["Semi-hermétique","R744","COPELAND","4MTL-12X",19.25]
["Semi-hermétique","R744","COPELAND","4MTL-12X [INV]",19.3]
["Semi-hermétique","R744","COPELAND","4MTL-15X [INV]",25.1]
["Semi-hermétique","R744","COPELAND","4MTL-15X",25.2]
["Semi-hermétique","R744","COPELAND","4MTL-30X [INV]",36.799999999999997]
["Semi-hermétique","R744","COPELAND","4MTL-30X",37]
["Scroll","R134A","COPELAND","ZB15KCE",2.2000000000000002]
["Scroll","R134A","COPELAND","ZB19KCE",2.5099999999999998]
["Scroll","R134A","COPELAND","ZB21KCE",3.21]
["Scroll","R134A","COPELAND","ZB26KCE",3.7]
["Scroll","R134A","COPELAND","ZB29KCE",4.3099999999999996]
["Scroll","R134A","COPELAND","ZB30KCE",4.3]
["Scroll","R134A","COPELAND","ZB38KCE",5.4]
["Scroll","R134A","COPELAND","ZB42KCE",6]
["Scroll","R134A","COPELAND","ZB45KCE",6.4]
["Scroll","R134A","COPELAND","ZB48KCE",7.52]
["Scroll","R134A","COPELAND","ZB50KCE",7.4]
["Scroll","R134A","COPELAND","ZB57KCE",8.1]
["Scroll","R134A","COPELAND","ZB58KCE",8.3000000000000007]
["Scroll","R134A","COPELAND","ZB66KCE",9.51]
["Scroll","R134A","COPELAND","ZB76KCE",10.9]
["Scroll","R134A","COPELAND","ZB95KCE",13.8]
["Scroll","R134A","COPELAND","ZB114KCE",16.3]
["Scroll","R134A","COPELAND","ZB220KCE",34.1]

{"sheet":"Tableau synthèse (2)","index":42,"n_rows":9,"n_cols":10,"rows_kept":9,"cut":false,"hidden":true,"merged":[[4,9,9,13]]}
[]
[]
[null,null,"Solution 1","Solution 2","Solution 3"]
[null,"Compresseurs 1",{"$f":"IF(COUNTA(OFFSET('Sélection Comp.positif'!$I$1:$I$65536,,COLUMN(A:A)))-ROW(1:1)>0,INDEX('Sélection Comp.positif'!$D$1:$D$65536,MATCH(LARGE(OFFSET('Sélection Comp.positif'!$I$1:$I$65536,,COLUMN(A:A)),COUNTA(OFFSET('Sélection Comp.positif'!$I$1:$I$65536,,COLUMN(A:A)))-ROW(1:1)),OFFSET('Sélection Comp.positif'!$I$1:$I$65536,,COLUMN(A:A)),0)),\"\")","v":""},{"$f":"IF(COUNTA(OFFSET('Sélection Comp.positif'!$I:$I,,COLUMN(B:B)))-ROW(1:1)>0,INDEX('Sélection Comp.positif'!$D:$D,MATCH(LARGE(OFFSET('Sélection Comp.positif'!$I:$I,,COLUMN(B:B)),COUNTA(OFFSET('Sélection Comp.positif'!$I:$I,,COLUMN(B:B)))-ROW(1:1)),OFFSET('Sélection Comp.positif'!$I:$I,,COLUMN(B:B)),0)),\"\")","v":""},{"$f":"IF(COUNTA(OFFSET('Sélection Comp.positif'!$I:$I,,COLUMN(C:C)))-ROW(1:1)>0,INDEX('Sélection Comp.positif'!$D:$D,MATCH(LARGE(OFFSET('Sélection Comp.positif'!$I:$I,,COLUMN(C:C)),COUNTA(OFFSET('Sélection Comp.positif'!$I:$I,,COLUMN(C:C)))-ROW(1:1)),OFFSET('Sélection Comp.positif'!$I:$I,,COLUMN(C:C)),0)),\"\")","v":""}]
[null,"Compresseurs 2",{"$f":"IF(COUNTA(OFFSET('Sélection Comp.positif'!$I$1:$I$65536,,COLUMN(A:A)))-ROW(2:2)>0,INDEX('Sélection Comp.positif'!$D$1:$D$65536,MATCH(LARGE(OFFSET('Sélection Comp.positif'!$I$1:$I$65536,,COLUMN(A:A)),COUNTA(OFFSET('Sélection Comp.positif'!$I$1:$I$65536,,COLUMN(A:A)))-ROW(2:2)),OFFSET('Sélection Comp.positif'!$I$1:$I$65536,,COLUMN(A:A)),0)),\"\")","v":""},{"$f":"IF(COUNTA(OFFSET('Sélection Comp.positif'!$I:$I,,COLUMN(B:B)))-ROW(2:2)>0,INDEX('Sélection Comp.positif'!$D:$D,MATCH(LARGE(OFFSET('Sélection Comp.positif'!$I:$I,,COLUMN(B:B)),COUNTA(OFFSET('Sélection Comp.positif'!$I:$I,,COLUMN(B:B)))-ROW(2:2)),OFFSET('Sélection Comp.positif'!$I:$I,,COLUMN(B:B)),0)),\"\")","v":""},{"$f":"IF(COUNTA(OFFSET('Sélection Comp.positif'!$I:$I,,COLUMN(C:C)))-ROW(2:2)>0,INDEX('Sélection Comp.positif'!$D:$D,MATCH(LARGE(OFFSET('Sélection Comp.positif'!$I:$I,,COLUMN(C:C)),COUNTA(OFFSET('Sélection Comp.positif'!$I:$I,,COLUMN(C:C)))-ROW(2:2)),OFFSET('Sélection Comp.positif'!$I:$I,,COLUMN(C:C)),0)),\"\")","v":""},null,null,null,null,"NE PAS SUPPRIMER !\nCe tableau récupère les valeurs de la sélection multiple des compresseurs POSITIF !"]
[null,"Compresseurs 3",{"$f":"IF(COUNTA(OFFSET('Sélection Comp.positif'!$I$1:$I$65536,,COLUMN(A:A)))-ROW(3:3)>0,INDEX('Sélection Comp.positif'!$D$1:$D$65536,MATCH(LARGE(OFFSET('Sélection Comp.positif'!$I$1:$I$65536,,COLUMN(A:A)),COUNTA(OFFSET('Sélection Comp.positif'!$I$1:$I$65536,,COLUMN(A:A)))-ROW(3:3)),OFFSET('Sélection Comp.positif'!$I$1:$I$65536,,COLUMN(A:A)),0)),\"\")","v":""},{"$f":"IF(COUNTA(OFFSET('Sélection Comp.positif'!$I:$I,,COLUMN(B:B)))-ROW(3:3)>0,INDEX('Sélection Comp.positif'!$D:$D,MATCH(LARGE(OFFSET('Sélection Comp.positif'!$I:$I,,COLUMN(B:B)),COUNTA(OFFSET('Sélection Comp.positif'!$I:$I,,COLUMN(B:B)))-ROW(3:3)),OFFSET('Sélection Comp.positif'!$I:$I,,COLUMN(B:B)),0)),\"\")","v":""},{"$f":"IF(COUNTA(OFFSET('Sélection Comp.positif'!$I:$I,,COLUMN(C:C)))-ROW(3:3)>0,INDEX('Sélection Comp.positif'!$D:$D,MATCH(LARGE(OFFSET('Sélection Comp.positif'!$I:$I,,COLUMN(C:C)),COUNTA(OFFSET('Sélection Comp.positif'!$I:$I,,COLUMN(C:C)))-ROW(3:3)),OFFSET('Sélection Comp.positif'!$I:$I,,COLUMN(C:C)),0)),\"\")","v":""}]
[null,"Compresseurs 4",{"$f":"IF(COUNTA(OFFSET('Sélection Comp.positif'!$I$1:$I$65536,,COLUMN(A:A)))-ROW(4:4)>0,INDEX('Sélection Comp.positif'!$D$1:$D$65536,MATCH(LARGE(OFFSET('Sélection Comp.positif'!$I$1:$I$65536,,COLUMN(A:A)),COUNTA(OFFSET('Sélection Comp.positif'!$I$1:$I$65536,,COLUMN(A:A)))-ROW(4:4)),OFFSET('Sélection Comp.positif'!$I$1:$I$65536,,COLUMN(A:A)),0)),\"\")","v":""},{"$f":"IF(COUNTA(OFFSET('Sélection Comp.positif'!$I:$I,,COLUMN(B:B)))-ROW(4:4)>0,INDEX('Sélection Comp.positif'!$D:$D,MATCH(LARGE(OFFSET('Sélection Comp.positif'!$I:$I,,COLUMN(B:B)),COUNTA(OFFSET('Sélection Comp.positif'!$I:$I,,COLUMN(B:B)))-ROW(4:4)),OFFSET('Sélection Comp.positif'!$I:$I,,COLUMN(B:B)),0)),\"\")","v":""},{"$f":"IF(COUNTA(OFFSET('Sélection Comp.positif'!$I:$I,,COLUMN(C:C)))-ROW(4:4)>0,INDEX('Sélection Comp.positif'!$D:$D,MATCH(LARGE(OFFSET('Sélection Comp.positif'!$I:$I,,COLUMN(C:C)),COUNTA(OFFSET('Sélection Comp.positif'!$I:$I,,COLUMN(C:C)))-ROW(4:4)),OFFSET('Sélection Comp.positif'!$I:$I,,COLUMN(C:C)),0)),\"\")","v":""}]
[null,"Compresseurs 5",{"$f":"IF(COUNTA(OFFSET('Sélection Comp.positif'!$I$1:$I$65536,,COLUMN(A:A)))-ROW(5:5)>0,INDEX('Sélection Comp.positif'!$D$1:$D$65536,MATCH(LARGE(OFFSET('Sélection Comp.positif'!$I$1:$I$65536,,COLUMN(A:A)),COUNTA(OFFSET('Sélection Comp.positif'!$I$1:$I$65536,,COLUMN(A:A)))-ROW(5:5)),OFFSET('Sélection Comp.positif'!$I$1:$I$65536,,COLUMN(A:A)),0)),\"\")","v":""},{"$f":"IF(COUNTA(OFFSET('Sélection Comp.positif'!$I:$I,,COLUMN(B:B)))-ROW(5:5)>0,INDEX('Sélection Comp.positif'!$D:$D,MATCH(LARGE(OFFSET('Sélection Comp.positif'!$I:$I,,COLUMN(B:B)),COUNTA(OFFSET('Sélection Comp.positif'!$I:$I,,COLUMN(B:B)))-ROW(5:5)),OFFSET('Sélection Comp.positif'!$I:$I,,COLUMN(B:B)),0)),\"\")","v":""},{"$f":"IF(COUNTA(OFFSET('Sélection Comp.positif'!$I:$I,,COLUMN(C:C)))-ROW(5:5)>0,INDEX('Sélection Comp.positif'!$D:$D,MATCH(LARGE(OFFSET('Sélection Comp.positif'!$I:$I,,COLUMN(C:C)),COUNTA(OFFSET('Sélection Comp.positif'!$I:$I,,COLUMN(C:C)))-ROW(5:5)),OFFSET('Sélection Comp.positif'!$I:$I,,COLUMN(C:C)),0)),\"\")","v":""}]
[null,"Compresseurs 6",{"$f":"IF(COUNTA(OFFSET('Sélection Comp.positif'!$I$1:$I$65536,,COLUMN(A:A)))-ROW(6:6)>0,INDEX('Sélection Comp.positif'!$D$1:$D$65536,MATCH(LARGE(OFFSET('Sélection Comp.positif'!$I$1:$I$65536,,COLUMN(A:A)),COUNTA(OFFSET('Sélection Comp.positif'!$I$1:$I$65536,,COLUMN(A:A)))-ROW(6:6)),OFFSET('Sélection Comp.positif'!$I$1:$I$65536,,COLUMN(A:A)),0)),\"\")","v":""},{"$f":"IF(COUNTA(OFFSET('Sélection Comp.positif'!$I:$I,,COLUMN(B:B)))-ROW(6:6)>0,INDEX('Sélection Comp.positif'!$D:$D,MATCH(LARGE(OFFSET('Sélection Comp.positif'!$I:$I,,COLUMN(B:B)),COUNTA(OFFSET('Sélection Comp.positif'!$I:$I,,COLUMN(B:B)))-ROW(6:6)),OFFSET('Sélection Comp.positif'!$I:$I,,COLUMN(B:B)),0)),\"\")","v":""},{"$f":"IF(COUNTA(OFFSET('Sélection Comp.positif'!$I:$I,,COLUMN(C:C)))-ROW(6:6)>0,INDEX('Sélection Comp.positif'!$D:$D,MATCH(LARGE(OFFSET('Sélection Comp.positif'!$I:$I,,COLUMN(C:C)),COUNTA(OFFSET('Sélection Comp.positif'!$I:$I,,COLUMN(C:C)))-ROW(6:6)),OFFSET('Sélection Comp.positif'!$I:$I,,COLUMN(C:C)),0)),\"\")","v":""}]

{"sheet":"formulaire1","index":43,"n_rows":110,"n_cols":9,"rows_kept":110,"cut":false,"hidden":true,"merged":[[0,0,0,8],[13,0,13,8],[69,0,69,8],[70,0,70,1],[90,0,90,8]]}
["Liste de l'étape n°1 : informations"]
["Activité magasin","type bâtiment","Orientation","Isolation bâtiment","bruit ambiant","Réserves","grilles ventilation","nb compresseurs","CH froides"]
["Continue","existant","Nord","Norme RT 2012","Faible ","OUI","OUI",1,1]
["Discontinue","neuf","Est","Norme RT 2005","Moyen","NON","NON",2,2]
[null,null,"Sud","Norme RT 2000","Élevé",null,null,3,3]
[null,null,"Ouest","Constructions après 1980",null,null,null,4,4]
[null,null,null,"Constructions moyennement isolées",null,null,null,null,5]
[null,null,null,"Constructions non isolées",null,null,null,null,6]
[null,null,null,null,null,null,null,null,7]
[null,null,null,null,null,null,null,null,8]
[null,null,null,null,null,null,null,null,9]
[null,null,null,null,null,null,null,null,10]
[]
["Liste de l'étape n°2 & 3  : MFV positifs et négatifs"]
["Configuration","Neuf / portes ?","Modèle positif","modèle négatif"]
["Charcuterie LS","oui","AERIAEFFICIA","AGATEII"]
["SAURISSERIE LS","non","AERIAII","AGORA36"]
["ILOT BACS LS ",null,"AERIAMODULAR","AGORAII36"]
["TRAITEUR LS ",null,"AERIAVOLUM","AIS86"]
["TG TRAITEUR LS ",null,"AGORAPOS36","AMPLEONEG"]
["TG CHARCUTERIE LS",null,"AGORAPOS46","AMPLEONEGECO"]
["FROMAGE LS",null,"AIS46","AMPLEOR"]
["TG FROMAGE LS",null,"AMARANTELS","ARCADER"]
["CREMERIE LS",null,"AMARANTEVE","ATR85"]
["TG ULTRA FRAIS",null,"AMPHI11","COSMOS36"]
[null,null,"AMPHI12","COSMOSIII"]
["Config négatif",null,"AMPLEOPOS","COSMOSMODULAR"]
["surgelé",null,"AMPLEOPOSECO","GRENATII"]
["bac simple",null,"AMPLEOPOSECOR","ROTTONDE36"]
["bac double",null,"AMPLEOPOSR","ROTTONDE46"]
["bac simple + porte",null,"ARCHEB 09 DR","VELANDOSG"]
["bac double + porte",null,"ARCHEB 09 RF"]
[null,null,"ARCHEB 10 DR"]
[null,null,"ARCHEB 10 RF"]
[null,null,"ARN36"]
[null,null,"ARN46"]
[]
[]
[]
[]
[]
[]
[]
[]
[]
[]
[]
[]
[]
[]
[]
[]
[]
[]
[]
[]
[]
[]
[]
[]
[]
[]
[]
[]
[]
[]
[]
[]
[]
["Liste de l'étape n°4 & 5 : chambres froides positives & négatives"]
["Utilisation CFPositive",null,"CH existe ? Évapo existant ?","récupéré l'évapo ?","Utilisation CF négative"]
["VIANDES PRE EMBALLES",null,"oui","récupéré","PRODUITS SURGELES"]
["VOLAILLES PREEMBALLEES",null,"non","déposé","CREMES GLACEES"]
["CARCASSES"]
["CHARCUTERIE PREEMBALLE"]
["TRAITEUR"]
["CHARIOTS PLATS CUISINES"]
["PATISSERIE FRAICHE"]
["POISSONS SUR GLACE"]
["FRUITS ET LEGUMES"]
["BOF EMBALLES"]
["FROMAGE"]
["BOISSONS"]
["POUBELLES GRASSES"]
["SAS"]
["LABO DECOUPE"]
["LABO DECOUPE EMBALLAGE"]
["LABO EMBALLAGE"]
[]
[]
["Liste de l'étape n°6 : Clim existante"]
["Fluide utilisé ?"]
["R410A"]
["R22"]
["R407C"]
["R407A"]
["R134a"]
["R290 "]
["R404A"]
["R407C"]
["R410A"]
["R417A"]
["R422A"]
["R422D"]
["R427A"]
["R507 A"]
["R717 "]
["R723"]
["R744  "]
["R1270 "]

{"sheet":"Explication","index":44,"n_rows":8,"n_cols":1,"rows_kept":8,"cut":false,"hidden":false,"merged":[]}
[]
["Pour adapter votre code Banzai64 :"]
["1) Dans ma UserForm appelée \"Informations\", la comboBox12 reçoit le nombre à afficher"]
["2) Ce nombre choisis (de ma ComboBox12), doit faire apparaître le nombre de TextBox et comboBox correspondant dans ma UserForm appellée \"Chpositive\""]
[]
[]
["En SUS (pas obligatoire je le ferais en fonction):"]
["Pareil pour ma comboBox13 de ma userForm \"Informations\", pour afficher les TextBox et comboBox correpondant dans ma Userform \"Chnégative\""]