{"text_format":"1","workbook":"xlsx","n_sheets":6,"sheets":["RECUEIL","LISTE","STATS CAMPS","INDEX PERSOS","INDEX PLAGES","CALC"],"not_rendered":{"charts":0,"images":0,"macros":1,"external_links":0,"defined_names":8,"comments":0,"pivot_tables":0},"unopened":[],"bounds":{"document_bytes":16777216,"sheet_cells":100000,"rows_first":2000,"rows_last":500,"rows_between":2000,"halvings":0,"cell_chars":16384,"cell_head_chars":4096},"cells_cut":0,"cells_raw":0,"read":"whole","date_system":"1900"}

{"sheet":"RECUEIL","index":0,"n_rows":2004,"n_cols":17,"rows_kept":2004,"cut":false,"hidden":false,"merged":[[4,2,5,2],[2,2,2,16],[1988,2,1989,2],[1990,2,1991,2],[1992,2,1993,2],[1994,2,1995,2],[1996,2,1997,2],[1998,2,1999,2],[1964,2,1965,2],[1966,2,1967,2],[1968,2,1969,2],[1970,2,1971,2],[1972,2,1973,2],[1974,2,1975,2],[1940,2,1941,2],[1942,2,1943,2],[1944,2,1945,2],[1946,2,1947,2],[1948,2,1949,2],[1950,2,1951,2],[1916,2,1917,2],[1918,2,1919,2],[1920,2,1921,2],[1922,2,1923,2],[1924,2,1925,2],[1926,2,1927,2],[1892,2,1893,2],[1894,2,1895,2],[1896,2,1897,2],[1898,2,1899,2],[1844,2,1845,2],[1846,2,1847,2],[1848,2,1849,2],[1850,2,1851,2],[1852,2,1853,2],[1854,2,1855,2],[1820,2,1821,2],[1822,2,1823,2],[1824,2,1825,2],[1826,2,1827,2],[1828,2,1829,2],[1830,2,1831,2],[1856,2,1857,2],[1858,2,1859,2],[1836,2,1837,2],[1838,2,1839,2],[1840,2,1841,2],[1842,2,1843,2],[1832,2,1833,2],[1834,2,1835,2],[1676,2,1677,2],[1678,2,1679,2],[1680,2,1681,2],[1682,2,1683,2],[1684,2,1685,2],[1686,2,1687,2],[1796,2,1797,2],[1798,2,1799,2],[1800,2,1801,2],[1802,2,1803,2],[1804,2,1805,2],[1806,2,1807,2],[1772,2,1773,2],[1774,2,1775,2],[1776,2,1777,2],[1778,2,1779,2],[1780,2,1781,2],[1782,2,1783,2],[1748,2,1749,2],[1750,2,1751,2],[1752,2,1753,2],[1754,2,1755,2],[1756,2,1757,2],[1758,2,1759,2],[1740,2,1741,2],[1742,2,1743,2],[1744,2,1745,2],[1746,2,1747,2],[1736,2,1737,2],[1738,2,1739,2],[1716,2,1717,2],[1718,2,1719,2],[1532,2,1533,2],[1534,2,1535,2],[1536,2,1537,2],[1538,2,1539,2],[1540,2,1541,2],[1542,2,1543,2],[1652,2,1653,2],[1654,2,1655,2],[1656,2,1657,2],[1658,2,1659,2],[1660,2,1661,2],[1662,2,1663,2],[1628,2,1629,2],[1630,2,1631,2],[1632,2,1633,2],[1634,2,1635,2],[1636,2,1637,2],[1638,2,1639,2],[1604,2,1605,2],[1606,2,1607,2],[1608,2,1609,2],[1610,2,1611,2],[1612,2,1613,2],[1614,2,1615,2],[1596,2,1597,2],[1598,2,1599,2],[1600,2,1601,2],[1602,2,1603,2],[1592,2,1593,2],[1594,2,1595,2],[1572,2,1573,2],[1574,2,1575,2],[1390,2,1391,2],[1392,2,1393,2],[1394,2,1395,2],[1366,2,1367,2],[1368,2,1369,2],[1370,2,1371,2],[1372,2,1373,2],[1374,2,1375,2],[1376,2,1377,2],[1382,2,1383,2],[1384,2,1385,2],[1386,2,1387,2],[1388,2,1389,2],[1378,2,1379,2],[1380,2,1381,2],[1508,2,1509,2],[1510,2,1511,2],[1484,2,1485,2],[1486,2,1487,2],[1488,2,1489,2],[1490,2,1491,2],[1492,2,1493,2],[1494,2,1495,2],[1460,2,1461,2],[1462,2,1463,2],[1464,2,1465,2],[1466,2,1467,2],[1468,2,1469,2],[1470,2,1471,2],[1396,2,1397,2],[1398,2,1399,2],[1452,2,1453,2],[1222,2,1223,2],[1224,2,1225,2],[1226,2,1227,2],[1228,2,1229,2],[1230,2,1231,2],[1232,2,1233,2],[1342,2,1343,2],[1344,2,1345,2],[1346,2,1347,2],[1348,2,1349,2],[1350,2,1351,2],[1352,2,1353,2],[1318,2,1319,2],[1320,2,1321,2],[1322,2,1323,2],[1324,2,1325,2],[1326,2,1327,2],[1328,2,1329,2],[1294,2,1295,2],[1296,2,1297,2],[1298,2,1299,2],[1300,2,1301,2],[1302,2,1303,2],[1304,2,1305,2],[1286,2,1287,2],[1288,2,1289,2],[1290,2,1291,2],[1292,2,1293,2],[1282,2,1283,2],[1284,2,1285,2],[1262,2,1263,2],[1264,2,1265,2],[1078,2,1079,2],[1080,2,1081,2],[1082,2,1083,2],[1084,2,1085,2],[1086,2,1087,2],[1088,2,1089,2],[1198,2,1199,2],[1200,2,1201,2],[1202,2,1203,2],[1204,2,1205,2],[1206,2,1207,2],[1208,2,1209,2],[1174,2,1175,2],[1176,2,1177,2],[1178,2,1179,2],[1180,2,1181,2],[1182,2,1183,2],[1184,2,1185,2],[1150,2,1151,2],[1152,2,1153,2],[1154,2,1155,2],[1156,2,1157,2],[1158,2,1159,2],[1160,2,1161,2],[1142,2,1143,2],[1144,2,1145,2],[1146,2,1147,2],[1148,2,1149,2],[1138,2,1139,2],[1140,2,1141,2],[1118,2,1119,2],[1120,2,1121,2],[934,2,935,2],[936,2,937,2],[938,2,939,2],[940,2,941,2],[942,2,943,2],[944,2,945,2],[1054,2,1055,2],[1056,2,1057,2],[1058,2,1059,2],[1060,2,1061,2],[1062,2,1063,2],[1064,2,1065,2],[1030,2,1031,2],[1032,2,1033,2],[1034,2,1035,2],[1036,2,1037,2],[1038,2,1039,2],[1040,2,1041,2],[1006,2,1007,2],[1008,2,1009,2],[1010,2,1011,2],[1012,2,1013,2],[1014,2,1015,2],[1016,2,1017,2],[998,2,999,2],[1000,2,1001,2],[1002,2,1003,2],[1004,2,1005,2],[994,2,995,2],[996,2,997,2],[974,2,975,2],[976,2,977,2],[790,2,791,2],[792,2,793,2],[794,2,795,2],[796,2,797,2],[798,2,799,2],[800,2,801,2],[910,2,911,2],[912,2,913,2],[914,2,915,2],[916,2,917,2],[918,2,919,2],[920,2,921,2],[886,2,887,2],[888,2,889,2],[890,2,891,2],[892,2,893,2],[894,2,895,2],[896,2,897,2],[862,2,863,2],[864,2,865,2],[866,2,867,2],[868,2,869,2],[870,2,871,2],[872,2,873,2],[854,2,855,2],[856,2,857,2],[858,2,859,2],[860,2,861,2],[850,2,851,2],[852,2,853,2],[830,2,831,2],[832,2,833,2],[646,2,647,2],[648,2,649,2],[650,2,651,2],[652,2,653,2],[654,2,655,2],[656,2,657,2],[766,2,767,2],[768,2,769,2],[770,2,771,2],[772,2,773,2],[774,2,775,2],[776,2,777,2],[742,2,743,2],[744,2,745,2],[746,2,747,2],[748,2,749,2],[750,2,751,2],[752,2,753,2],[718,2,719,2],[720,2,721,2],[722,2,723,2],[724,2,725,2],[726,2,727,2],[728,2,729,2],[710,2,711,2],[712,2,713,2],[714,2,715,2],[716,2,717,2],[706,2,707,2],[708,2,709,2],[686,2,687,2],[688,2,689,2],[502,2,503,2],[504,2,505,2],[506,2,507,2],[508,2,509,2],[510,2,511,2],[512,2,513,2],[622,2,623,2],[624,2,625,2],[626,2,627,2],[628,2,629,2],[630,2,631,2],[632,2,633,2],[598,2,599,2],[600,2,601,2],[602,2,603,2],[604,2,605,2],[606,2,607,2],[608,2,609,2],[574,2,575,2],[576,2,577,2],[578,2,579,2],[580,2,581,2],[582,2,583,2],[584,2,585,2],[566,2,567,2],[568,2,569,2],[570,2,571,2],[572,2,573,2],[562,2,563,2],[564,2,565,2],[542,2,543,2],[544,2,545,2],[358,2,359,2],[360,2,361,2],[362,2,363,2],[364,2,365,2],[366,2,367,2],[368,2,369,2],[478,2,479,2],[480,2,481,2],[482,2,483,2],[484,2,485,2],[486,2,487,2],[488,2,489,2],[454,2,455,2],[456,2,457,2],[458,2,459,2],[460,2,461,2],[462,2,463,2],[464,2,465,2],[430,2,431,2],[432,2,433,2],[434,2,435,2],[436,2,437,2],[438,2,439,2],[440,2,441,2],[422,2,423,2],[424,2,425,2],[426,2,427,2],[428,2,429,2],[418,2,419,2],[420,2,421,2],[398,2,399,2],[400,2,401,2],[214,2,215,2],[216,2,217,2],[218,2,219,2],[220,2,221,2],[222,2,223,2],[224,2,225,2],[334,2,335,2],[336,2,337,2],[338,2,339,2],[340,2,341,2],[342,2,343,2],[344,2,345,2],[310,2,311,2],[312,2,313,2],[314,2,315,2],[316,2,317,2],[318,2,319,2],[320,2,321,2],[286,2,287,2],[288,2,289,2],[290,2,291,2],[292,2,293,2],[294,2,295,2],[296,2,297,2],[278,2,279,2],[280,2,281,2],[282,2,283,2],[284,2,285,2],[274,2,275,2],[276,2,277,2],[254,2,255,2],[256,2,257,2],[6,2,7,2],[8,2,9,2],[10,2,11,2],[12,2,13,2],[14,2,15,2],[118,2,119,2],[120,2,121,2],[122,2,123,2],[124,2,125,2],[126,2,127,2],[128,2,129,2],[94,2,95,2],[96,2,97,2],[98,2,99,2],[100,2,101,2],[102,2,103,2],[104,2,105,2],[70,2,71,2],[72,2,73,2],[74,2,75,2],[76,2,77,2],[78,2,79,2],[80,2,81,2],[62,2,63,2],[64,2,65,2],[66,2,67,2],[68,2,69,2],[58,2,59,2],[60,2,61,2],[38,2,39,2],[40,2,41,2],[42,2,43,2],[2000,2,2001,2],[2002,2,2003,2],[1980,2,1981,2],[1982,2,1983,2],[1984,2,1985,2],[1986,2,1987,2],[1976,2,1977,2],[1978,2,1979,2],[1956,2,1957,2],[1958,2,1959,2],[1960,2,1961,2],[1962,2,1963,2],[1952,2,1953,2],[1954,2,1955,2],[1932,2,1933,2],[1934,2,1935,2],[1936,2,1937,2],[1938,2,1939,2],[1928,2,1929,2],[1930,2,1931,2],[1908,2,1909,2],[1910,2,1911,2],[1912,2,1913,2],[1914,2,1915,2],[1904,2,1905,2],[1906,2,1907,2],[1884,2,1885,2],[1886,2,1887,2],[1888,2,1889,2],[1890,2,1891,2],[1880,2,1881,2],[1882,2,1883,2],[1860,2,1861,2],[1862,2,1863,2],[1864,2,1865,2],[1866,2,1867,2],[1900,2,1901,2],[1902,2,1903,2],[1868,2,1869,2],[1870,2,1871,2],[1872,2,1873,2],[1874,2,1875,2],[1876,2,1877,2],[1878,2,1879,2],[1812,2,1813,2],[1814,2,1815,2],[1816,2,1817,2],[1818,2,1819,2],[1808,2,1809,2],[1810,2,1811,2],[1788,2,1789,2],[1790,2,1791,2],[1792,2,1793,2],[1794,2,1795,2],[1784,2,1785,2],[1786,2,1787,2],[1764,2,1765,2],[1766,2,1767,2],[1768,2,1769,2],[1770,2,1771,2],[1760,2,1761,2],[1762,2,1763,2],[1720,2,1721,2],[1722,2,1723,2],[1712,2,1713,2],[1714,2,1715,2],[1692,2,1693,2],[1694,2,1695,2],[1696,2,1697,2],[1698,2,1699,2],[1688,2,1689,2],[1690,2,1691,2],[1724,2,1725,2],[1726,2,1727,2],[1728,2,1729,2],[1730,2,1731,2],[1732,2,1733,2],[1734,2,1735,2],[1700,2,1701,2],[1702,2,1703,2],[1704,2,1705,2],[1706,2,1707,2],[1708,2,1709,2],[1710,2,1711,2],[1668,2,1669,2],[1670,2,1671,2],[1672,2,1673,2],[1674,2,1675,2],[1664,2,1665,2],[1666,2,1667,2],[1644,2,1645,2],[1646,2,1647,2],[1648,2,1649,2],[1650,2,1651,2],[1640,2,1641,2],[1642,2,1643,2],[1620,2,1621,2],[1622,2,1623,2],[1624,2,1625,2],[1626,2,1627,2],[1616,2,1617,2],[1618,2,1619,2],[1576,2,1577,2],[1578,2,1579,2],[1568,2,1569,2],[1570,2,1571,2],[1548,2,1549,2],[1550,2,1551,2],[1552,2,1553,2],[1554,2,1555,2],[1544,2,1545,2],[1546,2,1547,2],[1580,2,1581,2],[1582,2,1583,2],[1584,2,1585,2],[1586,2,1587,2],[1588,2,1589,2],[1590,2,1591,2],[1556,2,1557,2],[1558,2,1559,2],[1560,2,1561,2],[1562,2,1563,2],[1564,2,1565,2],[1566,2,1567,2],[1524,2,1525,2],[1526,2,1527,2],[1528,2,1529,2],[1530,2,1531,2],[1520,2,1521,2],[1522,2,1523,2],[1500,2,1501,2],[1502,2,1503,2],[1504,2,1505,2],[1506,2,1507,2],[1496,2,1497,2],[1498,2,1499,2],[1476,2,1477,2],[1478,2,1479,2],[1480,2,1481,2],[1482,2,1483,2],[1472,2,1473,2],[1474,2,1475,2],[1512,2,1513,2],[1514,2,1515,2],[1516,2,1517,2],[1518,2,1519,2],[1454,2,1455,2],[1456,2,1457,2],[1458,2,1459,2],[1448,2,1449,2],[1450,2,1451,2],[1428,2,1429,2],[1430,2,1431,2],[1432,2,1433,2],[1434,2,1435,2],[1424,2,1425,2],[1426,2,1427,2],[1404,2,1405,2],[1406,2,1407,2],[1408,2,1409,2],[1410,2,1411,2],[1400,2,1401,2],[1402,2,1403,2],[1436,2,1437,2],[1438,2,1439,2],[1440,2,1441,2],[1442,2,1443,2],[1444,2,1445,2],[1446,2,1447,2],[1412,2,1413,2],[1414,2,1415,2],[1416,2,1417,2],[1418,2,1419,2],[1420,2,1421,2],[1422,2,1423,2],[1358,2,1359,2],[1360,2,1361,2],[1362,2,1363,2],[1364,2,1365,2],[1354,2,1355,2],[1356,2,1357,2],[1334,2,1335,2],[1336,2,1337,2],[1338,2,1339,2],[1340,2,1341,2],[1330,2,1331,2],[1332,2,1333,2],[1310,2,1311,2],[1312,2,1313,2],[1314,2,1315,2],[1316,2,1317,2],[1306,2,1307,2],[1308,2,1309,2],[1266,2,1267,2],[1268,2,1269,2],[1258,2,1259,2],[1260,2,1261,2],[1238,2,1239,2],[1240,2,1241,2],[1242,2,1243,2],[1244,2,1245,2],[1234,2,1235,2],[1236,2,1237,2],[1270,2,1271,2],[1272,2,1273,2],[1274,2,1275,2],[1276,2,1277,2],[1278,2,1279,2],[1280,2,1281,2],[1246,2,1247,2],[1248,2,1249,2],[1250,2,1251,2],[1252,2,1253,2],[1254,2,1255,2],[1256,2,1257,2],[1214,2,1215,2],[1216,2,1217,2],[1218,2,1219,2],[1220,2,1221,2],[1210,2,1211,2],[1212,2,1213,2],[1190,2,1191,2],[1192,2,1193,2],[1194,2,1195,2],[1196,2,1197,2],[1186,2,1187,2],[1188,2,1189,2],[1166,2,1167,2],[1168,2,1169,2],[1170,2,1171,2],[1172,2,1173,2],[1162,2,1163,2],[1164,2,1165,2],[1122,2,1123,2],[1124,2,1125,2],[1114,2,1115,2],[1116,2,1117,2],[1094,2,1095,2],[1096,2,1097,2],[1098,2,1099,2],[1100,2,1101,2],[1090,2,1091,2],[1092,2,1093,2],[1126,2,1127,2],[1128,2,1129,2],[1130,2,1131,2],[1132,2,1133,2],[1134,2,1135,2],[1136,2,1137,2],[1102,2,1103,2],[1104,2,1105,2],[1106,2,1107,2],[1108,2,1109,2],[1110,2,1111,2],[1112,2,1113,2],[1070,2,1071,2],[1072,2,1073,2],[1074,2,1075,2],[1076,2,1077,2],[1066,2,1067,2],[1068,2,1069,2],[1046,2,1047,2],[1048,2,1049,2],[1050,2,1051,2],[1052,2,1053,2],[1042,2,1043,2],[1044,2,1045,2],[1022,2,1023,2],[1024,2,1025,2],[1026,2,1027,2],[1028,2,1029,2],[1018,2,1019,2],[1020,2,1021,2],[978,2,979,2],[980,2,981,2],[970,2,971,2],[972,2,973,2],[950,2,951,2],[952,2,953,2],[954,2,955,2],[956,2,957,2],[946,2,947,2],[948,2,949,2],[982,2,983,2],[984,2,985,2],[986,2,987,2],[988,2,989,2],[990,2,991,2],[992,2,993,2],[958,2,959,2],[960,2,961,2],[962,2,963,2],[964,2,965,2],[966,2,967,2],[968,2,969,2],[926,2,927,2],[928,2,929,2],[930,2,931,2],[932,2,933,2],[922,2,923,2],[924,2,925,2],[902,2,903,2],[904,2,905,2],[906,2,907,2],[908,2,909,2],[898,2,899,2],[900,2,901,2],[878,2,879,2],[880,2,881,2],[882,2,883,2],[884,2,885,2],[874,2,875,2],[876,2,877,2],[834,2,835,2],[836,2,837,2],[826,2,827,2],[828,2,829,2],[806,2,807,2],[808,2,809,2],[810,2,811,2],[812,2,813,2],[802,2,803,2],[804,2,805,2],[838,2,839,2],[840,2,841,2],[842,2,843,2],[844,2,845,2],[846,2,847,2],[848,2,849,2],[814,2,815,2],[816,2,817,2],[818,2,819,2],[820,2,821,2],[822,2,823,2],[824,2,825,2],[782,2,783,2],[784,2,785,2],[786,2,787,2],[788,2,789,2],[778,2,779,2],[780,2,781,2],[758,2,759,2],[760,2,761,2],[762,2,763,2],[764,2,765,2],[754,2,755,2],[756,2,757,2],[734,2,735,2],[736,2,737,2],[738,2,739,2],[740,2,741,2],[730,2,731,2],[732,2,733,2],[690,2,691,2],[692,2,693,2],[682,2,683,2],[684,2,685,2],[662,2,663,2],[664,2,665,2],[666,2,667,2],[668,2,669,2],[658,2,659,2],[660,2,661,2],[694,2,695,2],[696,2,697,2],[698,2,699,2],[700,2,701,2],[702,2,703,2],[704,2,705,2],[670,2,671,2],[672,2,673,2],[674,2,675,2],[676,2,677,2],[678,2,679,2],[680,2,681,2],[638,2,639,2],[640,2,641,2],[642,2,643,2],[644,2,645,2],[634,2,635,2],[636,2,637,2],[614,2,615,2],[616,2,617,2],[618,2,619,2],[620,2,621,2],[610,2,611,2],[612,2,613,2],[590,2,591,2],[592,2,593,2],[594,2,595,2],[596,2,597,2],[586,2,587,2],[588,2,589,2],[546,2,547,2],[548,2,549,2],[538,2,539,2],[540,2,541,2],[518,2,519,2],[520,2,521,2],[522,2,523,2],[524,2,525,2],[514,2,515,2],[516,2,517,2],[550,2,551,2],[552,2,553,2],[554,2,555,2],[556,2,557,2],[558,2,559,2],[560,2,561,2],[526,2,527,2],[528,2,529,2],[530,2,531,2],[532,2,533,2],[534,2,535,2],[536,2,537,2],[494,2,495,2],[496,2,497,2],[498,2,499,2],[500,2,501,2],[490,2,491,2],[492,2,493,2],[470,2,471,2],[472,2,473,2],[474,2,475,2],[476,2,477,2],[466,2,467,2],[468,2,469,2],[446,2,447,2],[448,2,449,2],[450,2,451,2],[452,2,453,2],[442,2,443,2],[444,2,445,2],[402,2,403,2],[404,2,405,2],[394,2,395,2],[396,2,397,2],[374,2,375,2],[376,2,377,2],[378,2,379,2],[380,2,381,2],[370,2,371,2],[372,2,373,2],[406,2,407,2],[408,2,409,2],[410,2,411,2],[412,2,413,2],[414,2,415,2],[416,2,417,2],[382,2,383,2],[384,2,385,2],[386,2,387,2],[388,2,389,2],[390,2,391,2],[392,2,393,2],[350,2,351,2],[352,2,353,2],[354,2,355,2],[356,2,357,2],[346,2,347,2],[348,2,349,2],[326,2,327,2],[328,2,329,2],[330,2,331,2],[332,2,333,2],[322,2,323,2],[324,2,325,2],[302,2,303,2],[304,2,305,2],[306,2,307,2],[308,2,309,2],[298,2,299,2],[300,2,301,2],[258,2,259,2],[260,2,261,2],[250,2,251,2],[252,2,253,2],[230,2,231,2],[232,2,233,2],[234,2,235,2],[236,2,237,2],[226,2,227,2],[228,2,229,2],[262,2,263,2],[264,2,265,2],[266,2,267,2],[268,2,269,2],[270,2,271,2],[272,2,273,2],[238,2,239,2],[240,2,241,2],[242,2,243,2],[244,2,245,2],[246,2,247,2],[248,2,249,2],[208,2,209,2],[210,2,211,2],[212,2,213,2],[202,2,203,2],[204,2,205,2],[182,2,183,2],[184,2,185,2],[186,2,187,2],[188,2,189,2],[178,2,179,2],[180,2,181,2],[158,2,159,2],[160,2,161,2],[162,2,163,2],[164,2,165,2],[154,2,155,2],[156,2,157,2],[190,2,191,2],[192,2,193,2],[194,2,195,2],[196,2,197,2],[198,2,199,2],[200,2,201,2],[166,2,167,2],[168,2,169,2],[170,2,171,2],[172,2,173,2],[174,2,175,2],[176,2,177,2],[138,2,139,2],[140,2,141,2],[130,2,131,2],[132,2,133,2],[110,2,111,2],[112,2,113,2],[114,2,115,2],[116,2,117,2],[106,2,107,2],[108,2,109,2],[86,2,87,2],[88,2,89,2],[90,2,91,2],[92,2,93,2],[82,2,83,2],[84,2,85,2],[206,2,207,2],[142,2,143,2],[144,2,145,2],[146,2,147,2],[148,2,149,2],[150,2,151,2],[152,2,153,2],[44,2,45,2],[36,2,37,2],[16,2,17,2],[18,2,19,2],[20,2,21,2],[22,2,23,2],[134,2,135,2],[136,2,137,2],[46,2,47,2],[48,2,49,2],[50,2,51,2],[52,2,53,2],[54,2,55,2],[56,2,57,2],[24,2,25,2],[26,2,27,2],[28,2,29,2],[30,2,31,2],[32,2,33,2]],"merged_total":1001,"flags":["merged_cut"]}
[]
[]
[null,null,"Liste des personnages obtenus dans les camps            (à remplir)"]
[null,null,null,"Entrainement aux armes","Formation médicale","Formation à la stratégie","Entrainement tactique","Entrainement fondamental","Entrainement généraliste","Enrainement à la Guérilla","Entrainement avancé","Entrainement en milieu sauvage","Entrainement militaire","Entrainement d'élite","Formation au commandement","Formation à la sécurité ","Entrainement spécial"]
[{"$f":"ISEVEN(ROW())","v":false},true,1,"Carol"]
[{"$f":"ISEVEN(ROW())","v":true},true,null,"=SI(ESTERREUR(INDEX(PR;EQUIV(D5;PERSO);2));\"\";INDEX(PR;EQUIV(D5;PERSO);2))"]
[false,false,2,"Carol"]
[true,false,null,"=SI(ESTERREUR(INDEX(PR;EQUIV(D5;PERSOS);2));\"\";INDEX(PR;EQUIV(D5;PERSOS);2))"]
[false,true,3,"Georges"]
[true,true,null,"=SI(ESTERREUR(INDEX(PR;EQUIV(D5;PERSOS);2));\"\";INDEX(PR;EQUIV(D5;PERSOS);2))"]
[false,false,4,"Carter"]
[true,false,null,"=SI(ESTERREUR(INDEX(PR;EQUIV(D5;PERSOS);2));\"\";INDEX(PR;EQUIV(D5;PERSOS);2))"]
[false,true,5,"Carol"]
[true,true,null,"=SI(ESTERREUR(INDEX(PR;EQUIV(D5;PERSOS);2));\"\";INDEX(PR;EQUIV(D5;PERSOS);2))"]
[false,false,6,"Mac"]
[true,false,null,"=SI(ESTERREUR(INDEX(PR;EQUIV(D5;PERSOS);2));\"\";INDEX(PR;EQUIV(D5;PERSOS);2))"]
[false,true,7,"Garret"]
[true,true,null,"=SI(ESTERREUR(INDEX(PR;EQUIV(D5;PERSOS);2));\"\";INDEX(PR;EQUIV(D5;PERSOS);2))"]
[false,false,8,"Garret"]
[true,false,null,"=SI(ESTERREUR(INDEX(PR;EQUIV(D5;PERSOS);2));\"\";INDEX(PR;EQUIV(D5;PERSOS);2))"]
[false,true,9,"Carol"]
[true,true,null,"=SI(ESTERREUR(INDEX(PR;EQUIV(D5;PERSOS);2));\"\";INDEX(PR;EQUIV(D5;PERSOS);2))"]
[false,false,10,"Christa"]
[true,false,null,"=SI(ESTERREUR(INDEX(PR;EQUIV(D5;PERSOS);2));\"\";INDEX(PR;EQUIV(D5;PERSOS);2))"]
[false,true,11,"Mac"]
[true,true,null,"=SI(ESTERREUR(INDEX(PR;EQUIV(D5;PERSOS);2));\"\";INDEX(PR;EQUIV(D5;PERSOS);2))"]
[false,false,12,"Georges"]
[true,false,null,"=SI(ESTERREUR(INDEX(PR;EQUIV(D5;PERSOS);2));\"\";INDEX(PR;EQUIV(D5;PERSOS);2))"]
[false,true,13,"Carol"]
[true,true,null,"=SI(ESTERREUR(INDEX(PR;EQUIV(D5;PERSOS);2));\"\";INDEX(PR;EQUIV(D5;PERSOS);2))"]
[false,false,14,"Georges"]
[true,false,null,"=SI(ESTERREUR(INDEX(PR;EQUIV(D5;PERSOS);2));\"\";INDEX(PR;EQUIV(D5;PERSOS);2))"]
[false,true,15,"Garret"]
[true,true,null,"=SI(ESTERREUR(INDEX(PR;EQUIV(D5;PERSOS);2));\"\";INDEX(PR;EQUIV(D5;PERSOS);2))"]
[false,false,16,"Georges"]
[true,false,null,"=SI(ESTERREUR(INDEX(PR;EQUIV(D5;PERSOS);2));\"\";INDEX(PR;EQUIV(D5;PERSOS);2))"]
[false,true,17,"Georges"]
[true,true,null,"=SI(ESTERREUR(INDEX(PR;EQUIV(D5;PERSOS);2));\"\";INDEX(PR;EQUIV(D5;PERSOS);2))"]
[false,false,18,"Carter"]
[true,false,null,"=SI(ESTERREUR(INDEX(PR;EQUIV(D5;PERSOS);2));\"\";INDEX(PR;EQUIV(D5;PERSOS);2))"]
[false,true,19,"Mac"]
[true,true,null,"=SI(ESTERREUR(INDEX(PR;EQUIV(D5;PERSOS);2));\"\";INDEX(PR;EQUIV(D5;PERSOS);2))"]
[false,false,20,"Christa"]
[true,false,null,"=SI(ESTERREUR(INDEX(PR;EQUIV(D5;PERSOS);2));\"\";INDEX(PR;EQUIV(D5;PERSOS);2))"]
[false,true,21,"Carter"]
[true,true,null,"=SI(ESTERREUR(INDEX(PR;EQUIV(D5;PERSOS);2));\"\";INDEX(PR;EQUIV(D5;PERSOS);2))"]
[false,false,22,"Carter"]
[true,false,null,"=SI(ESTERREUR(INDEX(PR;EQUIV(D5;PERSOS);2));\"\";INDEX(PR;EQUIV(D5;PERSOS);2))"]
[false,true,23,"Georges"]
[true,true,null,"=SI(ESTERREUR(INDEX(PR;EQUIV(D5;PERSOS);2));\"\";INDEX(PR;EQUIV(D5;PERSOS);2))"]
[false,false,24,"Carol"]
[true,false,null,"=SI(ESTERREUR(INDEX(PR;EQUIV(D5;PERSOS);2));\"\";INDEX(PR;EQUIV(D5;PERSOS);2))"]
[false,true,25,"Georges"]
[true,true,null,"=SI(ESTERREUR(INDEX(PR;EQUIV(D5;PERSOS);2));\"\";INDEX(PR;EQUIV(D5;PERSOS);2))"]
[false,false,26,"Garret"]
[true,false,null,"=SI(ESTERREUR(INDEX(PR;EQUIV(D5;PERSOS);2));\"\";INDEX(PR;EQUIV(D5;PERSOS);2))"]
[false,true,27,"Mac"]
[true,true,null,"=SI(ESTERREUR(INDEX(PR;EQUIV(D5;PERSOS);2));\"\";INDEX(PR;EQUIV(D5;PERSOS);2))"]
[false,false,28,"Mac"]
[true,false,null,"=SI(ESTERREUR(INDEX(PR;EQUIV(D5;PERSOS);2));\"\";INDEX(PR;EQUIV(D5;PERSOS);2))"]
[false,true,29,"Carol"]
[true,true,null,"=SI(ESTERREUR(INDEX(PR;EQUIV(D5;PERSOS);2));\"\";INDEX(PR;EQUIV(D5;PERSOS);2))"]
[false,false,30,"Georges"]
[true,false,null,"=SI(ESTERREUR(INDEX(PR;EQUIV(D5;PERSOS);2));\"\";INDEX(PR;EQUIV(D5;PERSOS);2))"]
[false,true,31,"Garret"]
[true,true,null,"=SI(ESTERREUR(INDEX(PR;EQUIV(D5;PERSOS);2));\"\";INDEX(PR;EQUIV(D5;PERSOS);2))"]
[false,false,32,"Garret"]
[true,false,null,"=SI(ESTERREUR(INDEX(PR;EQUIV(D5;PERSOS);2));\"\";INDEX(PR;EQUIV(D5;PERSOS);2))"]
[false,true,33,"Carol"]
[{"$f":"ISEVEN(ROW())","v":true},true,null,"=SI(ESTERREUR(INDEX(PR;EQUIV(D5;PERSOS);2));\"\";INDEX(PR;EQUIV(D5;PERSOS);2))"]
[false,false,34,"Carol"]
[true,false,null,"=SI(ESTERREUR(INDEX(PR;EQUIV(D5;PERSOS);2));\"\";INDEX(PR;EQUIV(D5;PERSOS);2))"]
[false,true,35,"Carol"]
[true,true,null,"=SI(ESTERREUR(INDEX(PR;EQUIV(D5;PERSOS);2));\"\";INDEX(PR;EQUIV(D5;PERSOS);2))"]
[false,false,36,"Georges"]
[true,false,null,"=SI(ESTERREUR(INDEX(PR;EQUIV(D5;PERSOS);2));\"\";INDEX(PR;EQUIV(D5;PERSOS);2))"]
[false,true,37,"Georges"]
[true,true,null,"=SI(ESTERREUR(INDEX(PR;EQUIV(D5;PERSOS);2));\"\";INDEX(PR;EQUIV(D5;PERSOS);2))"]
[false,false,38,"Carol"]
[true,false,null,"=SI(ESTERREUR(INDEX(PR;EQUIV(D5;PERSOS);2));\"\";INDEX(PR;EQUIV(D5;PERSOS);2))"]
[false,true,39,"Georges"]
[true,true,null,"=SI(ESTERREUR(INDEX(PR;EQUIV(D5;PERSOS);2));\"\";INDEX(PR;EQUIV(D5;PERSOS);2))"]
[false,false,40,"Christa"]
[true,false,null,"=SI(ESTERREUR(INDEX(PR;EQUIV(D5;PERSOS);2));\"\";INDEX(PR;EQUIV(D5;PERSOS);2))"]
[false,true,41,"Mac"]
[true,true,null,"=SI(ESTERREUR(INDEX(PR;EQUIV(D5;PERSOS);2));\"\";INDEX(PR;EQUIV(D5;PERSOS);2))"]
[false,false,42,"Georges"]
[true,false,null,"=SI(ESTERREUR(INDEX(PR;EQUIV(D5;PERSOS);2));\"\";INDEX(PR;EQUIV(D5;PERSOS);2))"]
[false,true,43,"Christa"]
[true,true,null,"=SI(ESTERREUR(INDEX(PR;EQUIV(D5;PERSOS);2));\"\";INDEX(PR;EQUIV(D5;PERSOS);2))"]
[false,false,44,"Georges"]
[true,false,null,"=SI(ESTERREUR(INDEX(PR;EQUIV(D5;PERSOS);2));\"\";INDEX(PR;EQUIV(D5;PERSOS);2))"]
[false,true,45,"Mac"]
[true,true,null,"=SI(ESTERREUR(INDEX(PR;EQUIV(D5;PERSOS);2));\"\";INDEX(PR;EQUIV(D5;PERSOS);2))"]
[false,false,46,"Mac"]
[true,false,null,"=SI(ESTERREUR(INDEX(PR;EQUIV(D5;PERSOS);2));\"\";INDEX(PR;EQUIV(D5;PERSOS);2))"]
[false,true,47,"Georges"]
[true,true,null,"=SI(ESTERREUR(INDEX(PR;EQUIV(D5;PERSOS);2));\"\";INDEX(PR;EQUIV(D5;PERSOS);2))"]
[false,false,48,"Georges"]
[true,false,null,"=SI(ESTERREUR(INDEX(PR;EQUIV(D5;PERSOS);2));\"\";INDEX(PR;EQUIV(D5;PERSOS);2))"]
[false,true,49,"Carter"]
[true,true,null,"=SI(ESTERREUR(INDEX(PR;EQUIV(D5;PERSOS);2));\"\";INDEX(PR;EQUIV(D5;PERSOS);2))"]
[false,false,50,"Georges"]
[true,false,null,"=SI(ESTERREUR(INDEX(PR;EQUIV(D5;PERSOS);2));\"\";INDEX(PR;EQUIV(D5;PERSOS);2))"]
[false,true,51,"Garret"]
[true,true,null,"=SI(ESTERREUR(INDEX(PR;EQUIV(D5;PERSOS);2));\"\";INDEX(PR;EQUIV(D5;PERSOS);2))"]
[false,false,52,"Mac"]
[true,false,null,"=SI(ESTERREUR(INDEX(PR;EQUIV(D5;PERSOS);2));\"\";INDEX(PR;EQUIV(D5;PERSOS);2))"]
[false,true,53,"Carol"]
[true,true,null,"=SI(ESTERREUR(INDEX(PR;EQUIV(D5;PERSOS);2));\"\";INDEX(PR;EQUIV(D5;PERSOS);2))"]
[false,false,54,"Georges"]
[true,false,null,"=SI(ESTERREUR(INDEX(PR;EQUIV(D5;PERSOS);2));\"\";INDEX(PR;EQUIV(D5;PERSOS);2))"]
[false,true,55,"Georges"]
[true,true,null,"=SI(ESTERREUR(INDEX(PR;EQUIV(D5;PERSOS);2));\"\";INDEX(PR;EQUIV(D5;PERSOS);2))"]
[false,false,56,"Mac"]
[true,false,null,"=SI(ESTERREUR(INDEX(PR;EQUIV(D5;PERSOS);2));\"\";INDEX(PR;EQUIV(D5;PERSOS);2))"]
[false,true,57,"Carter"]
[true,true,null,"=SI(ESTERREUR(INDEX(PR;EQUIV(D5;PERSOS);2));\"\";INDEX(PR;EQUIV(D5;PERSOS);2))"]
[false,false,58,"Christa"]
[true,false,null,"=SI(ESTERREUR(INDEX(PR;EQUIV(D5;PERSOS);2));\"\";INDEX(PR;EQUIV(D5;PERSOS);2))"]
[false,true,59,"Carter"]
[true,true,null,"=SI(ESTERREUR(INDEX(PR;EQUIV(D5;PERSOS);2));\"\";INDEX(PR;EQUIV(D5;PERSOS);2))"]
[false,false,60,"Carol"]
[true,false,null,"=SI(ESTERREUR(INDEX(PR;EQUIV(D5;PERSOS);2));\"\";INDEX(PR;EQUIV(D5;PERSOS);2))"]
[false,true,61,"Georges"]
[true,true,null,"=SI(ESTERREUR(INDEX(PR;EQUIV(D5;PERSOS);2));\"\";INDEX(PR;EQUIV(D5;PERSOS);2))"]
[false,false,62,"Mac"]
[true,false,null,"=SI(ESTERREUR(INDEX(PR;EQUIV(D5;PERSOS);2));\"\";INDEX(PR;EQUIV(D5;PERSOS);2))"]
[false,true,63,"Georges"]
[true,true,null,"=SI(ESTERREUR(INDEX(PR;EQUIV(D5;PERSOS);2));\"\";INDEX(PR;EQUIV(D5;PERSOS);2))"]
[false,false,64,"Christa"]
[true,false,null,"=SI(ESTERREUR(INDEX(PR;EQUIV(D5;PERSOS);2));\"\";INDEX(PR;EQUIV(D5;PERSOS);2))"]
[false,true,65,"Garret"]
[{"$f":"ISEVEN(ROW())","v":true},true,null,"=SI(ESTERREUR(INDEX(PR;EQUIV(D5;PERSOS);2));\"\";INDEX(PR;EQUIV(D5;PERSOS);2))"]
[false,false,66,"Garret"]
[true,false,null,"=SI(ESTERREUR(INDEX(PR;EQUIV(D5;PERSOS);2));\"\";INDEX(PR;EQUIV(D5;PERSOS);2))"]
[false,true,67,"Mac"]
[true,true,null,"=SI(ESTERREUR(INDEX(PR;EQUIV(D5;PERSOS);2));\"\";INDEX(PR;EQUIV(D5;PERSOS);2))"]
[false,false,68,"Garret"]
[true,false,null,"=SI(ESTERREUR(INDEX(PR;EQUIV(D5;PERSOS);2));\"\";INDEX(PR;EQUIV(D5;PERSOS);2))"]
[false,true,69,"Georges"]
[true,true,null,"=SI(ESTERREUR(INDEX(PR;EQUIV(D5;PERSOS);2));\"\";INDEX(PR;EQUIV(D5;PERSOS);2))"]
[false,false,70,"Georges"]
[true,false,null,"=SI(ESTERREUR(INDEX(PR;EQUIV(D5;PERSOS);2));\"\";INDEX(PR;EQUIV(D5;PERSOS);2))"]
[false,true,71,"Mac"]
[true,true,null,"=SI(ESTERREUR(INDEX(PR;EQUIV(D5;PERSOS);2));\"\";INDEX(PR;EQUIV(D5;PERSOS);2))"]
[false,false,72,"Christa"]
[true,false,null,"=SI(ESTERREUR(INDEX(PR;EQUIV(D5;PERSOS);2));\"\";INDEX(PR;EQUIV(D5;PERSOS);2))"]
[false,true,73,"Georges"]
[true,true,null,"=SI(ESTERREUR(INDEX(PR;EQUIV(D5;PERSOS);2));\"\";INDEX(PR;EQUIV(D5;PERSOS);2))"]
[false,false,74,"Carter"]
[true,false,null,"=SI(ESTERREUR(INDEX(PR;EQUIV(D5;PERSOS);2));\"\";INDEX(PR;EQUIV(D5;PERSOS);2))"]
[false,true,75,"Carol"]
[true,true,null,"=SI(ESTERREUR(INDEX(PR;EQUIV(D5;PERSOS);2));\"\";INDEX(PR;EQUIV(D5;PERSOS);2))"]
[false,false,76,"Carol"]
[true,false,null,"=SI(ESTERREUR(INDEX(PR;EQUIV(D5;PERSOS);2));\"\";INDEX(PR;EQUIV(D5;PERSOS);2))"]
[false,true,77,"Georges"]
[true,true,null,"=SI(ESTERREUR(INDEX(PR;EQUIV(D5;PERSOS);2));\"\";INDEX(PR;EQUIV(D5;PERSOS);2))"]
[false,false,78,"Georges"]
[true,false,null,"=SI(ESTERREUR(INDEX(PR;EQUIV(D5;PERSOS);2));\"\";INDEX(PR;EQUIV(D5;PERSOS);2))"]
[false,true,79,"Carol"]
[true,true,null,"=SI(ESTERREUR(INDEX(PR;EQUIV(D5;PERSOS);2));\"\";INDEX(PR;EQUIV(D5;PERSOS);2))"]
[false,false,80,"Christa"]
[true,false,null,"=SI(ESTERREUR(INDEX(PR;EQUIV(D5;PERSOS);2));\"\";INDEX(PR;EQUIV(D5;PERSOS);2))"]
[false,true,81,"Carol"]
[true,true,null,"=SI(ESTERREUR(INDEX(PR;EQUIV(D5;PERSOS);2));\"\";INDEX(PR;EQUIV(D5;PERSOS);2))"]
[false,false,82,"Christa"]
[true,false,null,"=SI(ESTERREUR(INDEX(PR;EQUIV(D5;PERSOS);2));\"\";INDEX(PR;EQUIV(D5;PERSOS);2))"]
[false,true,83,"Mac"]
[true,true,null,"=SI(ESTERREUR(INDEX(PR;EQUIV(D5;PERSOS);2));\"\";INDEX(PR;EQUIV(D5;PERSOS);2))"]
[false,false,84,"Georges"]
[true,false,null,"=SI(ESTERREUR(INDEX(PR;EQUIV(D5;PERSOS);2));\"\";INDEX(PR;EQUIV(D5;PERSOS);2))"]
[false,true,85,"Garret"]
[true,true,null,"=SI(ESTERREUR(INDEX(PR;EQUIV(D5;PERSOS);2));\"\";INDEX(PR;EQUIV(D5;PERSOS);2))"]
[false,false,86,"Carter"]
[true,false,null,"=SI(ESTERREUR(INDEX(PR;EQUIV(D5;PERSOS);2));\"\";INDEX(PR;EQUIV(D5;PERSOS);2))"]
[false,true,87,"Carter"]
[true,true,null,"=SI(ESTERREUR(INDEX(PR;EQUIV(D5;PERSOS);2));\"\";INDEX(PR;EQUIV(D5;PERSOS);2))"]
[false,false,88,"Carol"]
[true,false,null,"=SI(ESTERREUR(INDEX(PR;EQUIV(D5;PERSOS);2));\"\";INDEX(PR;EQUIV(D5;PERSOS);2))"]
[false,true,89,"Carol"]
[true,true,null,"=SI(ESTERREUR(INDEX(PR;EQUIV(D5;PERSOS);2));\"\";INDEX(PR;EQUIV(D5;PERSOS);2))"]
[false,false,90,"Christa"]
[true,false,null,"=SI(ESTERREUR(INDEX(PR;EQUIV(D5;PERSOS);2));\"\";INDEX(PR;EQUIV(D5;PERSOS);2))"]
[false,true,91,"Carol"]
[true,true,null,"=SI(ESTERREUR(INDEX(PR;EQUIV(D5;PERSOS);2));\"\";INDEX(PR;EQUIV(D5;PERSOS);2))"]
[false,false,92,"Mac"]
[true,false,null,"=SI(ESTERREUR(INDEX(PR;EQUIV(D5;PERSOS);2));\"\";INDEX(PR;EQUIV(D5;PERSOS);2))"]
[false,true,93,"Georges"]
[true,true,null,"=SI(ESTERREUR(INDEX(PR;EQUIV(D5;PERSOS);2));\"\";INDEX(PR;EQUIV(D5;PERSOS);2))"]
[false,false,94,"Carter"]
[true,false,null,"=SI(ESTERREUR(INDEX(PR;EQUIV(D5;PERSOS);2));\"\";INDEX(PR;EQUIV(D5;PERSOS);2))"]
[false,true,95,"Carter"]
[true,true,null,"=SI(ESTERREUR(INDEX(PR;EQUIV(D5;PERSOS);2));\"\";INDEX(PR;EQUIV(D5;PERSOS);2))"]
[false,false,96]
[true,false]
[false,true,97]
[{"$f":"ISEVEN(ROW())","v":true},true]
[false,false,98]
[true,false]
[false,true,99]
[true,true]
[false,false,100]
[true,false]
[false,true,101]
[true,true]
[false,false,102]
[true,false]
[false,true,103]
[true,true]
[false,false,104]
[true,false]
[false,true,105]
[true,true]
[false,false,106]
[true,false]
[false,true,107]
[true,true]
[false,false,108]
[true,false]
[false,true,109]
[true,true]
[false,false,110]
[true,false]
[false,true,111]
[true,true]
[false,false,112]
[true,false]
[false,true,113]
[true,true]
[false,false,114]
[true,false]
[false,true,115]
[true,true]
[false,false,116]
[true,false]
[false,true,117]
[true,true]
[false,false,118]
[true,false]
[false,true,119]
[true,true]
[false,false,120]
[true,false]
[false,true,121]
[true,true]
[false,false,122]
[true,false]
[false,true,123]
[true,true]
[false,false,124]
[true,false]
[false,true,125]
[true,true]
[false,false,126]
[true,false]
[false,true,127]
[true,true]
[false,false,128]
[true,false]
[false,true,129]
[{"$f":"ISEVEN(ROW())","v":true},true]
[false,false,130]
[true,false]
[false,true,131]
[true,true]
[false,false,132]
[true,false]
[false,true,133]
[true,true]
[false,false,134]
[true,false]
[false,true,135]
[true,true]
[false,false,136]
[true,false]
[false,true,137]
[true,true]
[false,false,138]
[true,false]
[false,true,139]
[true,true]
[false,false,140]
[true,false]
[false,true,141]
[true,true]
[false,false,142]
[true,false]
[false,true,143]
[true,true]
[false,false,144]
[true,false]
[false,true,145]
[true,true]
[false,false,146]
[true,false]
[false,true,147]
[true,true]
[false,false,148]
[true,false]
[false,true,149]
[true,true]
[false,false,150]
[true,false]
[false,true,151]
[true,true]
[false,false,152]
[true,false]
[false,true,153]
[true,true]
[false,false,154]
[true,false]
[false,true,155]
[true,true]
[false,false,156]
[true,false]
[false,true,157]
[true,true]
[false,false,158]
[true,false]
[false,true,159]
[true,true]
[false,false,160]
[true,false]
[false,true,161]
[{"$f":"ISEVEN(ROW())","v":true},true]
[false,false,162]
[true,false]
[false,true,163]
[true,true]
[false,false,164]
[true,false]
[false,true,165]
[true,true]
[false,false,166]
[true,false]
[false,true,167]
[true,true]
[false,false,168]
[true,false]
[false,true,169]
[true,true]
[false,false,170]
[true,false]
[false,true,171]
[true,true]
[false,false,172]
[true,false]
[false,true,173]
[true,true]
[false,false,174]
[true,false]
[false,true,175]
[true,true]
[false,false,176]
[true,false]
[false,true,177]
[true,true]
[false,false,178]
[true,false]
[false,true,179]
[true,true]
[false,false,180]
[true,false]
[false,true,181]
[true,true]
[false,false,182]
[true,false]
[false,true,183]
[true,true]
[false,false,184]
[true,false]
[false,true,185]
[true,true]
[false,false,186]
[true,false]
[false,true,187]
[true,true]
[false,false,188]
[true,false]
[false,true,189]
[true,true]
[false,false,190]
[true,false]
[false,true,191]
[true,true]
[false,false,192]
[true,false]
[false,true,193]
[{"$f":"ISEVEN(ROW())","v":true},true]
[false,false,194]
[true,false]
[false,true,195]
[true,true]
[false,false,196]
[true,false]
[false,true,197]
[true,true]
[false,false,198]
[true,false]
[false,true,199]
[true,true]
[false,false,200]
[true,false]
[false,true,201]
[true,true]
[false,false,202]
[true,false]
[false,true,203]
[true,true]
[false,false,204]
[true,false]
[false,true,205]
[true,true]
[false,false,206]
[true,false]
[false,true,207]
[true,true]
[false,false,208]
[true,false]
[false,true,209]
[true,true]
[false,false,210]
[true,false]
[false,true,211]
[true,true]
[false,false,212]
[true,false]
[false,true,213]
[true,true]
[false,false,214]
[true,false]
[false,true,215]
[true,true]
[false,false,216]
[true,false]
[false,true,217]
[true,true]
[false,false,218]
[true,false]
[false,true,219]
[true,true]
[false,false,220]
[true,false]
[false,true,221]
[true,true]
[false,false,222]
[true,false]
[false,true,223]
[true,true]
[false,false,224]
[true,false]
[false,true,225]
[{"$f":"ISEVEN(ROW())","v":true},true]
[false,false,226]
[true,false]
[false,true,227]
[true,true]
[false,false,228]
[true,false]
[false,true,229]
[true,true]
[false,false,230]
[true,false]
[false,true,231]
[true,true]
[false,false,232]
[true,false]
[false,true,233]
[true,true]
[false,false,234]
[true,false]
[false,true,235]
[true,true]
[false,false,236]
[true,false]
[false,true,237]
[true,true]
[false,false,238]
[true,false]
[false,true,239]
[true,true]
[false,false,240]
[true,false]
[false,true,241]
[true,true]
[false,false,242]
[true,false]
[false,true,243]
[true,true]
[false,false,244]
[true,false]
[false,true,245]
[true,true]
[false,false,246]
[true,false]
[false,true,247]
[true,true]
[false,false,248]
[true,false]
[false,true,249]
[true,true]
[false,false,250]
[true,false]
[false,true,251]
[true,true]
[false,false,252]
[true,false]
[false,true,253]
[true,true]
[false,false,254]
[true,false]
[false,true,255]
[true,true]
[false,false,256]
[true,false]
[false,true,257]
[{"$f":"ISEVEN(ROW())","v":true},true]
[false,false,258]
[true,false]
[false,true,259]
[true,true]
[false,false,260]
[true,false]
[false,true,261]
[true,true]
[false,false,262]
[true,false]
[false,true,263]
[true,true]
[false,false,264]
[true,false]
[false,true,265]
[true,true]
[false,false,266]
[true,false]
[false,true,267]
[true,true]
[false,false,268]
[true,false]
[false,true,269]
[true,true]
[false,false,270]
[true,false]
[false,true,271]
[true,true]
[false,false,272]
[true,false]
[false,true,273]
[true,true]
[false,false,274]
[true,false]
[false,true,275]
[true,true]
[false,false,276]
[true,false]
[false,true,277]
[true,true]
[false,false,278]
[true,false]
[false,true,279]
[true,true]
[false,false,280]
[true,false]
[false,true,281]
[true,true]
[false,false,282]
[true,false]
[false,true,283]
[true,true]
[false,false,284]
[true,false]
[false,true,285]
[true,true]
[false,false,286]
[true,false]
[false,true,287]
[true,true]
[false,false,288]
[true,false]
[false,true,289]
[{"$f":"ISEVEN(ROW())","v":true},true]
[false,false,290]
[true,false]
[false,true,291]
[true,true]
[false,false,292]
[true,false]
[false,true,293]
[true,true]
[false,false,294]
[true,false]
[false,true,295]
[true,true]
[false,false,296]
[true,false]
[false,true,297]
[true,true]
[false,false,298]
[true,false]
[false,true,299]
[true,true]
[false,false,300]
[true,false]
[false,true,301]
[true,true]
[false,false,302]
[true,false]
[false,true,303]
[true,true]
[false,false,304]
[true,false]
[false,true,305]
[true,true]
[false,false,306]
[true,false]
[false,true,307]
[true,true]
[false,false,308]
[true,false]
[false,true,309]
[true,true]
[false,false,310]
[true,false]
[false,true,311]
[true,true]
[false,false,312]
[true,false]
[false,true,313]
[true,true]
[false,false,314]
[true,false]
[false,true,315]
[true,true]
[false,false,316]
[true,false]
[false,true,317]
[true,true]
[false,false,318]
[true,false]
[false,true,319]
[true,true]
[false,false,320]
[true,false]
[false,true,321]
[{"$f":"ISEVEN(ROW())","v":true},true]
[false,false,322]
[true,false]
[false,true,323]
[true,true]
[false,false,324]
[true,false]
[false,true,325]
[true,true]
[false,false,326]
[true,false]
[false,true,327]
[true,true]
[false,false,328]
[true,false]
[false,true,329]
[true,true]
[false,false,330]
[true,false]
[false,true,331]
[true,true]
[false,false,332]
[true,false]
[false,true,333]
[true,true]
[false,false,334]
[true,false]
[false,true,335]
[true,true]
[false,false,336]
[true,false]
[false,true,337]
[true,true]
[false,false,338]
[true,false]
[false,true,339]
[true,true]
[false,false,340]
[true,false]
[false,true,341]
[true,true]
[false,false,342]
[true,false]
[false,true,343]
[true,true]
[false,false,344]
[true,false]
[false,true,345]
[true,true]
[false,false,346]
[true,false]
[false,true,347]
[true,true]
[false,false,348]
[true,false]
[false,true,349]
[true,true]
[false,false,350]
[true,false]
[false,true,351]
[true,true]
[false,false,352]
[true,false]
[false,true,353]
[{"$f":"ISEVEN(ROW())","v":true},true]
[false,false,354]
[true,false]
[false,true,355]
[true,true]
[false,false,356]
[true,false]
[false,true,357]
[true,true]
[false,false,358]
[true,false]
[false,true,359]
[true,true]
[false,false,360]
[true,false]
[false,true,361]
[true,true]
[false,false,362]
[true,false]
[false,true,363]
[true,true]
[false,false,364]
[true,false]
[false,true,365]
[true,true]
[false,false,366]
[true,false]
[false,true,367]
[true,true]
[false,false,368]
[true,false]
[false,true,369]
[true,true]
[false,false,370]
[true,false]
[false,true,371]
[true,true]
[false,false,372]
[true,false]
[false,true,373]
[true,true]
[false,false,374]
[true,false]
[false,true,375]
[true,true]
[false,false,376]
[true,false]
[false,true,377]
[true,true]
[false,false,378]
[true,false]
[false,true,379]
[true,true]
[false,false,380]
[true,false]
[false,true,381]
[true,true]
[false,false,382]
[true,false]
[false,true,383]
[true,true]
[false,false,384]
[true,false]
[false,true,385]
[{"$f":"ISEVEN(ROW())","v":true},true]
[false,false,386]
[true,false]
[false,true,387]
[true,true]
[false,false,388]
[true,false]
[false,true,389]
[true,true]
[false,false,390]
[true,false]
[false,true,391]
[true,true]
[false,false,392]
[true,false]
[false,true,393]
[true,true]
[false,false,394]
[true,false]
[false,true,395]
[true,true]
[false,false,396]
[true,false]
[false,true,397]
[true,true]
[false,false,398]
[true,false]
[false,true,399]
[true,true]
[false,false,400]
[true,false]
[false,true,401]
[true,true]
[false,false,402]
[true,false]
[false,true,403]
[true,true]
[false,false,404]
[true,false]
[false,true,405]
[true,true]
[false,false,406]
[true,false]
[false,true,407]
[true,true]
[false,false,408]
[true,false]
[false,true,409]
[true,true]
[false,false,410]
[true,false]
[false,true,411]
[true,true]
[false,false,412]
[true,false]
[false,true,413]
[true,true]
[false,false,414]
[true,false]
[false,true,415]
[true,true]
[false,false,416]
[true,false]
[false,true,417]
[{"$f":"ISEVEN(ROW())","v":true},true]
[false,false,418]
[true,false]
[false,true,419]
[true,true]
[false,false,420]
[true,false]
[false,true,421]
[true,true]
[false,false,422]
[true,false]
[false,true,423]
[true,true]
[false,false,424]
[true,false]
[false,true,425]
[true,true]
[false,false,426]
[true,false]
[false,true,427]
[true,true]
[false,false,428]
[true,false]
[false,true,429]
[true,true]
[false,false,430]
[true,false]
[false,true,431]
[true,true]
[false,false,432]
[true,false]
[false,true,433]
[true,true]
[false,false,434]
[true,false]
[false,true,435]
[true,true]
[false,false,436]
[true,false]
[false,true,437]
[true,true]
[false,false,438]
[true,false]
[false,true,439]
[true,true]
[false,false,440]
[true,false]
[false,true,441]
[true,true]
[false,false,442]
[true,false]
[false,true,443]
[true,true]
[false,false,444]
[true,false]
[false,true,445]
[true,true]
[false,false,446]
[true,false]
[false,true,447]
[true,true]
[false,false,448]
[true,false]
[false,true,449]
[{"$f":"ISEVEN(ROW())","v":true},true]
[false,false,450]
[true,false]
[false,true,451]
[true,true]
[false,false,452]
[true,false]
[false,true,453]
[true,true]
[false,false,454]
[true,false]
[false,true,455]
[true,true]
[false,false,456]
[true,false]
[false,true,457]
[true,true]
[false,false,458]
[true,false]
[false,true,459]
[true,true]
[false,false,460]
[true,false]
[false,true,461]
[true,true]
[false,false,462]
[true,false]
[false,true,463]
[true,true]
[false,false,464]
[true,false]
[false,true,465]
[true,true]
[false,false,466]
[true,false]
[false,true,467]
[true,true]
[false,false,468]
[true,false]
[false,true,469]
[true,true]
[false,false,470]
[true,false]
[false,true,471]
[true,true]
[false,false,472]
[true,false]
[false,true,473]
[true,true]
[false,false,474]
[true,false]
[false,true,475]
[true,true]
[false,false,476]
[true,false]
[false,true,477]
[true,true]
[false,false,478]
[true,false]
[false,true,479]
[true,true]
[false,false,480]
[true,false]
[false,true,481]
[{"$f":"ISEVEN(ROW())","v":true},true]
[false,false,482]
[true,false]
[false,true,483]
[true,true]
[false,false,484]
[true,false]
[false,true,485]
[true,true]
[false,false,486]
[true,false]
[false,true,487]
[true,true]
[false,false,488]
[true,false]
[false,true,489]
[true,true]
[false,false,490]
[true,false]
[false,true,491]
[true,true]
[false,false,492]
[true,false]
[false,true,493]
[true,true]
[false,false,494]
[true,false]
[false,true,495]
[true,true]
[false,false,496]
[true,false]
[false,true,497]
[true,true]
[false,false,498]
[true,false]
[false,true,499]
[true,true]
[false,false,500]
[true,false]
[false,true,501]
[true,true]
[false,false,502]
[true,false]
[false,true,503]
[true,true]
[false,false,504]
[true,false]
[false,true,505]
[true,true]
[false,false,506]
[true,false]
[false,true,507]
[true,true]
[false,false,508]
[true,false]
[false,true,509]
[true,true]
[false,false,510]
[true,false]
[false,true,511]
[true,true]
[false,false,512]
[true,false]
[false,true,513]
[{"$f":"ISEVEN(ROW())","v":true},true]
[false,false,514]
[true,false]
[false,true,515]
[true,true]
[false,false,516]
[true,false]
[false,true,517]
[true,true]
[false,false,518]
[true,false]
[false,true,519]
[true,true]
[false,false,520]
[true,false]
[false,true,521]
[true,true]
[false,false,522]
[true,false]
[false,true,523]
[true,true]
[false,false,524]
[true,false]
[false,true,525]
[true,true]
[false,false,526]
[true,false]
[false,true,527]
[true,true]
[false,false,528]
[true,false]
[false,true,529]
[true,true]
[false,false,530]
[true,false]
[false,true,531]
[true,true]
[false,false,532]
[true,false]
[false,true,533]
[true,true]
[false,false,534]
[true,false]
[false,true,535]
[true,true]
[false,false,536]
[true,false]
[false,true,537]
[true,true]
[false,false,538]
[true,false]
[false,true,539]
[true,true]
[false,false,540]
[true,false]
[false,true,541]
[true,true]
[false,false,542]
[true,false]
[false,true,543]
[true,true]
[false,false,544]
[true,false]
[false,true,545]
[{"$f":"ISEVEN(ROW())","v":true},true]
[false,false,546]
[true,false]
[false,true,547]
[true,true]
[false,false,548]
[true,false]
[false,true,549]
[true,true]
[false,false,550]
[true,false]
[false,true,551]
[true,true]
[false,false,552]
[true,false]
[false,true,553]
[true,true]
[false,false,554]
[true,false]
[false,true,555]
[true,true]
[false,false,556]
[true,false]
[false,true,557]
[true,true]
[false,false,558]
[true,false]
[false,true,559]
[true,true]
[false,false,560]
[true,false]
[false,true,561]
[true,true]
[false,false,562]
[true,false]
[false,true,563]
[true,true]
[false,false,564]
[true,false]
[false,true,565]
[true,true]
[false,false,566]
[true,false]
[false,true,567]
[true,true]
[false,false,568]
[true,false]
[false,true,569]
[true,true]
[false,false,570]
[true,false]
[false,true,571]
[true,true]
[false,false,572]
[true,false]
[false,true,573]
[true,true]
[false,false,574]
[true,false]
[false,true,575]
[true,true]
[false,false,576]
[true,false]
[false,true,577]
[{"$f":"ISEVEN(ROW())","v":true},true]
[false,false,578]
[true,false]
[false,true,579]
[true,true]
[false,false,580]
[true,false]
[false,true,581]
[true,true]
[false,false,582]
[true,false]
[false,true,583]
[true,true]
[false,false,584]
[true,false]
[false,true,585]
[true,true]
[false,false,586]
[true,false]
[false,true,587]
[true,true]
[false,false,588]
[true,false]
[false,true,589]
[true,true]
[false,false,590]
[true,false]
[false,true,591]
[true,true]
[false,false,592]
[true,false]
[false,true,593]
[true,true]
[false,false,594]
[true,false]
[false,true,595]
[true,true]
[false,false,596]
[true,false]
[false,true,597]
[true,true]
[false,false,598]
[true,false]
[false,true,599]
[true,true]
[false,false,600]
[true,false]
[false,true,601]
[true,true]
[false,false,602]
[true,false]
[false,true,603]
[true,true]
[false,false,604]
[true,false]
[false,true,605]
[true,true]
[false,false,606]
[true,false]
[false,true,607]
[true,true]
[false,false,608]
[true,false]
[false,true,609]
[{"$f":"ISEVEN(ROW())","v":true},true]
[false,false,610]
[true,false]
[false,true,611]
[true,true]
[false,false,612]
[true,false]
[false,true,613]
[true,true]
[false,false,614]
[true,false]
[false,true,615]
[true,true]
[false,false,616]
[true,false]
[false,true,617]
[true,true]
[false,false,618]
[true,false]
[false,true,619]
[true,true]
[false,false,620]
[true,false]
[false,true,621]
[true,true]
[false,false,622]
[true,false]
[false,true,623]
[true,true]
[false,false,624]
[true,false]
[false,true,625]
[true,true]
[false,false,626]
[true,false]
[false,true,627]
[true,true]
[false,false,628]
[true,false]
[false,true,629]
[true,true]
[false,false,630]
[true,false]
[false,true,631]
[true,true]
[false,false,632]
[true,false]
[false,true,633]
[true,true]
[false,false,634]
[true,false]
[false,true,635]
[true,true]
[false,false,636]
[true,false]
[false,true,637]
[true,true]
[false,false,638]
[true,false]
[false,true,639]
[true,true]
[false,false,640]
[true,false]
[false,true,641]
[{"$f":"ISEVEN(ROW())","v":true},true]
[false,false,642]
[true,false]
[false,true,643]
[true,true]
[false,false,644]
[true,false]
[false,true,645]
[true,true]
[false,false,646]
[true,false]
[false,true,647]
[true,true]
[false,false,648]
[true,false]
[false,true,649]
[true,true]
[false,false,650]
[true,false]
[false,true,651]
[true,true]
[false,false,652]
[true,false]
[false,true,653]
[true,true]
[false,false,654]
[true,false]
[false,true,655]
[true,true]
[false,false,656]
[true,false]
[false,true,657]
[true,true]
[false,false,658]
[true,false]
[false,true,659]
[true,true]
[false,false,660]
[true,false]
[false,true,661]
[true,true]
[false,false,662]
[true,false]
[false,true,663]
[true,true]
[false,false,664]
[true,false]
[false,true,665]
[true,true]
[false,false,666]
[true,false]
[false,true,667]
[true,true]
[false,false,668]
[true,false]
[false,true,669]
[true,true]
[false,false,670]
[true,false]
[false,true,671]
[true,true]
[false,false,672]
[true,false]
[false,true,673]
[{"$f":"ISEVEN(ROW())","v":true},true]
[false,false,674]
[true,false]
[false,true,675]
[true,true]
[false,false,676]
[true,false]
[false,true,677]
[true,true]
[false,false,678]
[true,false]
[false,true,679]
[true,true]
[false,false,680]
[true,false]
[false,true,681]
[true,true]
[false,false,682]
[true,false]
[false,true,683]
[true,true]
[false,false,684]
[true,false]
[false,true,685]
[true,true]
[false,false,686]
[true,false]
[false,true,687]
[true,true]
[false,false,688]
[true,false]
[false,true,689]
[true,true]
[false,false,690]
[true,false]
[false,true,691]
[true,true]
[false,false,692]
[true,false]
[false,true,693]
[true,true]
[false,false,694]
[true,false]
[false,true,695]
[true,true]
[false,false,696]
[true,false]
[false,true,697]
[true,true]
[false,false,698]
[true,false]
[false,true,699]
[true,true]
[false,false,700]
[true,false]
[false,true,701]
[true,true]
[false,false,702]
[true,false]
[false,true,703]
[true,true]
[false,false,704]
[true,false]
[false,true,705]
[{"$f":"ISEVEN(ROW())","v":true},true]
[false,false,706]
[true,false]
[false,true,707]
[true,true]
[false,false,708]
[true,false]
[false,true,709]
[true,true]
[false,false,710]
[true,false]
[false,true,711]
[true,true]
[false,false,712]
[true,false]
[false,true,713]
[true,true]
[false,false,714]
[true,false]
[false,true,715]
[true,true]
[false,false,716]
[true,false]
[false,true,717]
[true,true]
[false,false,718]
[true,false]
[false,true,719]
[true,true]
[false,false,720]
[true,false]
[false,true,721]
[true,true]
[false,false,722]
[true,false]
[false,true,723]
[true,true]
[false,false,724]
[true,false]
[false,true,725]
[true,true]
[false,false,726]
[true,false]
[false,true,727]
[true,true]
[false,false,728]
[true,false]
[false,true,729]
[true,true]
[false,false,730]
[true,false]
[false,true,731]
[true,true]
[false,false,732]
[true,false]
[false,true,733]
[true,true]
[false,false,734]
[true,false]
[false,true,735]
[true,true]
[false,false,736]
[true,false]
[false,true,737]
[{"$f":"ISEVEN(ROW())","v":true},true]
[false,false,738]
[true,false]
[false,true,739]
[true,true]
[false,false,740]
[true,false]
[false,true,741]
[true,true]
[false,false,742]
[true,false]
[false,true,743]
[true,true]
[false,false,744]
[true,false]
[false,true,745]
[true,true]
[false,false,746]
[true,false]
[false,true,747]
[true,true]
[false,false,748]
[true,false]
[false,true,749]
[true,true]
[false,false,750]
[true,false]
[false,true,751]
[true,true]
[false,false,752]
[true,false]
[false,true,753]
[true,true]
[false,false,754]
[true,false]
[false,true,755]
[true,true]
[false,false,756]
[true,false]
[false,true,757]
[true,true]
[false,false,758]
[true,false]
[false,true,759]
[true,true]
[false,false,760]
[true,false]
[false,true,761]
[true,true]
[false,false,762]
[true,false]
[false,true,763]
[true,true]
[false,false,764]
[true,false]
[false,true,765]
[true,true]
[false,false,766]
[true,false]
[false,true,767]
[true,true]
[false,false,768]
[true,false]
[false,true,769]
[{"$f":"ISEVEN(ROW())","v":true},true]
[false,false,770]
[true,false]
[false,true,771]
[true,true]
[false,false,772]
[true,false]
[false,true,773]
[true,true]
[false,false,774]
[true,false]
[false,true,775]
[true,true]
[false,false,776]
[true,false]
[false,true,777]
[true,true]
[false,false,778]
[true,false]
[false,true,779]
[true,true]
[false,false,780]
[true,false]
[false,true,781]
[true,true]
[false,false,782]
[true,false]
[false,true,783]
[true,true]
[false,false,784]
[true,false]
[false,true,785]
[true,true]
[false,false,786]
[true,false]
[false,true,787]
[true,true]
[false,false,788]
[true,false]
[false,true,789]
[true,true]
[false,false,790]
[true,false]
[false,true,791]
[true,true]
[false,false,792]
[true,false]
[false,true,793]
[true,true]
[false,false,794]
[true,false]
[false,true,795]
[true,true]
[false,false,796]
[true,false]
[false,true,797]
[true,true]
[false,false,798]
[true,false]
[false,true,799]
[true,true]
[false,false,800]
[true,false]
[false,true,801]
[{"$f":"ISEVEN(ROW())","v":true},true]
[false,false,802]
[true,false]
[false,true,803]
[true,true]
[false,false,804]
[true,false]
[false,true,805]
[true,true]
[false,false,806]
[true,false]
[false,true,807]
[true,true]
[false,false,808]
[true,false]
[false,true,809]
[true,true]
[false,false,810]
[true,false]
[false,true,811]
[true,true]
[false,false,812]
[true,false]
[false,true,813]
[true,true]
[false,false,814]
[true,false]
[false,true,815]
[true,true]
[false,false,816]
[true,false]
[false,true,817]
[true,true]
[false,false,818]
[true,false]
[false,true,819]
[true,true]
[false,false,820]
[true,false]
[false,true,821]
[true,true]
[false,false,822]
[true,false]
[false,true,823]
[true,true]
[false,false,824]
[true,false]
[false,true,825]
[true,true]
[false,false,826]
[true,false]
[false,true,827]
[true,true]
[false,false,828]
[true,false]
[false,true,829]
[true,true]
[false,false,830]
[true,false]
[false,true,831]
[true,true]
[false,false,832]
[true,false]
[false,true,833]
[{"$f":"ISEVEN(ROW())","v":true},true]
[false,false,834]
[true,false]
[false,true,835]
[true,true]
[false,false,836]
[true,false]
[false,true,837]
[true,true]
[false,false,838]
[true,false]
[false,true,839]
[true,true]
[false,false,840]
[true,false]
[false,true,841]
[true,true]
[false,false,842]
[true,false]
[false,true,843]
[true,true]
[false,false,844]
[true,false]
[false,true,845]
[true,true]
[false,false,846]
[true,false]
[false,true,847]
[true,true]
[false,false,848]
[true,false]
[false,true,849]
[true,true]
[false,false,850]
[true,false]
[false,true,851]
[true,true]
[false,false,852]
[true,false]
[false,true,853]
[true,true]
[false,false,854]
[true,false]
[false,true,855]
[true,true]
[false,false,856]
[true,false]
[false,true,857]
[true,true]
[false,false,858]
[true,false]
[false,true,859]
[true,true]
[false,false,860]
[true,false]
[false,true,861]
[true,true]
[false,false,862]
[true,false]
[false,true,863]
[true,true]
[false,false,864]
[true,false]
[false,true,865]
[{"$f":"ISEVEN(ROW())","v":true},true]
[false,false,866]
[true,false]
[false,true,867]
[true,true]
[false,false,868]
[true,false]
[false,true,869]
[true,true]
[false,false,870]
[true,false]
[false,true,871]
[true,true]
[false,false,872]
[true,false]
[false,true,873]
[true,true]
[false,false,874]
[true,false]
[false,true,875]
[true,true]
[false,false,876]
[true,false]
[false,true,877]
[true,true]
[false,false,878]
[true,false]
[false,true,879]
[true,true]
[false,false,880]
[true,false]
[false,true,881]
[true,true]
[false,false,882]
[true,false]
[false,true,883]
[true,true]
[false,false,884]
[true,false]
[false,true,885]
[true,true]
[false,false,886]
[true,false]
[false,true,887]
[true,true]
[false,false,888]
[true,false]
[false,true,889]
[true,true]
[false,false,890]
[true,false]
[false,true,891]
[true,true]
[false,false,892]
[true,false]
[false,true,893]
[true,true]
[false,false,894]
[true,false]
[false,true,895]
[true,true]
[false,false,896]
[true,false]
[false,true,897]
[{"$f":"ISEVEN(ROW())","v":true},true]
[false,false,898]
[true,false]
[false,true,899]
[true,true]
[false,false,900]
[true,false]
[false,true,901]
[true,true]
[false,false,902]
[true,false]
[false,true,903]
[true,true]
[false,false,904]
[true,false]
[false,true,905]
[true,true]
[false,false,906]
[true,false]
[false,true,907]
[true,true]
[false,false,908]
[true,false]
[false,true,909]
[true,true]
[false,false,910]
[true,false]
[false,true,911]
[true,true]
[false,false,912]
[true,false]
[false,true,913]
[true,true]
[false,false,914]
[true,false]
[false,true,915]
[true,true]
[false,false,916]
[true,false]
[false,true,917]
[true,true]
[false,false,918]
[true,false]
[false,true,919]
[true,true]
[false,false,920]
[true,false]
[false,true,921]
[true,true]
[false,false,922]
[true,false]
[false,true,923]
[true,true]
[false,false,924]
[true,false]
[false,true,925]
[true,true]
[false,false,926]
[true,false]
[false,true,927]
[true,true]
[false,false,928]
[true,false]
[false,true,929]
[{"$f":"ISEVEN(ROW())","v":true},true]
[false,false,930]
[true,false]
[false,true,931]
[true,true]
[false,false,932]
[true,false]
[false,true,933]
[true,true]
[false,false,934]
[true,false]
[false,true,935]
[true,true]
[false,false,936]
[true,false]
[false,true,937]
[true,true]
[false,false,938]
[true,false]
[false,true,939]
[true,true]
[false,false,940]
[true,false]
[false,true,941]
[true,true]
[false,false,942]
[true,false]
[false,true,943]
[true,true]
[false,false,944]
[true,false]
[false,true,945]
[true,true]
[false,false,946]
[true,false]
[false,true,947]
[true,true]
[false,false,948]
[true,false]
[false,true,949]
[true,true]
[false,false,950]
[true,false]
[false,true,951]
[true,true]
[false,false,952]
[true,false]
[false,true,953]
[true,true]
[false,false,954]
[true,false]
[false,true,955]
[true,true]
[false,false,956]
[true,false]
[false,true,957]
[true,true]
[false,false,958]
[true,false]
[false,true,959]
[true,true]
[false,false,960]
[true,false]
[false,true,961]
[{"$f":"ISEVEN(ROW())","v":true},true]
[false,false,962]
[true,false]
[false,true,963]
[true,true]
[false,false,964]
[true,false]
[false,true,965]
[true,true]
[false,false,966]
[true,false]
[false,true,967]
[true,true]
[false,false,968]
[true,false]
[false,true,969]
[true,true]
[false,false,970]
[true,false]
[false,true,971]
[true,true]
[false,false,972]
[true,false]
[false,true,973]
[true,true]
[false,false,974]
[true,false]
[false,true,975]
[true,true]
[false,false,976]
[true,false]
[false,true,977]
[true,true]
[false,false,978]
[true,false]
[false,true,979]
[true,true]
[false,false,980]
[true,false]
[false,true,981]
[true,true]
[false,false,982]
[true,false]
[false,true,983]
[true,true]
[false,false,984]
[true,false]
[false,true,985]
[true,true]
[false,false,986]
[true,false]
[false,true,987]
[true,true]
[false,false,988]
[true,false]
[false,true,989]
[true,true]
[false,false,990]
[true,false]
[false,true,991]
[true,true]
[false,false,992]
[true,false]
[false,true,993]
[{"$f":"ISEVEN(ROW())","v":true},true]
[false,false,994]
[true,false]
[false,true,995]
[true,true]
[false,false,996]
[true,false]
[false,true,997]
[true,true]
[false,false,998]
[true,false]
[false,true,999]
[true,true]
[false,false,1000]
[true,false]

{"sheet":"LISTE","index":1,"n_rows":200,"n_cols":15,"rows_kept":200,"cut":false,"hidden":false,"merged":[]}
[]
[null,"Entrainement aux armes","Formation médicale","Formation à la stratégie","Entrainement tactique","Entrainement fondamental","Entrainement généraliste","Enrainement à la Guérilla","Entrainement avancé","Entrainement en milieu sauvage","Entrainement militaire","Entrainement d'élite","Formation au commandement","Formation à la sécurité ","Entrainement spécial"]
[null,"Carol","Gabriel","Brock","Diane","Clarence","Carol","Cletus","John","Christa"]
[null,"Carol","Gabriel","Margaret","Diane","Cyrus","Carol","Randall","Gerald","Christa",{"$f":"IF(ISERROR(INDEX(PR,MATCH(K3,PERSOS),2)),\"\",INDEX(PR,MATCH(K3,PERSOS),2))","v":""},{"$f":"IF(ISERROR(INDEX(PR,MATCH(L3,PERSOS),2)),\"\",INDEX(PR,MATCH(L3,PERSOS),2))","v":""},{"$f":"IF(ISERROR(INDEX(PR,MATCH(M3,PERSOS),2)),\"\",INDEX(PR,MATCH(M3,PERSOS),2))","v":""},{"$f":"IF(ISERROR(INDEX(PR,MATCH(N3,PERSOS),2)),\"\",INDEX(PR,MATCH(N3,PERSOS),2))","v":""},{"$f":"IF(ISERROR(INDEX(PR,MATCH(O3,PERSOS),2)),\"\",INDEX(PR,MATCH(O3,PERSOS),2))","v":""}]
[null,"Georges","Darren","Brock","Diane","Gerald","Margaret","Cletus","Gerald","Christa"]
[null,"Carter","Darren","Brock","Randall","Danny","Ashley","Burt","Ethel","Christa",{"$f":"IF(ISERROR(INDEX(PR,MATCH(K5,PERSOS),2)),\"\",INDEX(PR,MATCH(K5,PERSOS),2))","v":""},{"$f":"IF(ISERROR(INDEX(PR,MATCH(L5,PERSOS),2)),\"\",INDEX(PR,MATCH(L5,PERSOS),2))","v":""},{"$f":"IF(ISERROR(INDEX(PR,MATCH(M5,PERSOS),2)),\"\",INDEX(PR,MATCH(M5,PERSOS),2))","v":""},{"$f":"IF(ISERROR(INDEX(PR,MATCH(N5,PERSOS),2)),\"\",INDEX(PR,MATCH(N5,PERSOS),2))","v":""},{"$f":"IF(ISERROR(INDEX(PR,MATCH(O5,PERSOS),2)),\"\",INDEX(PR,MATCH(O5,PERSOS),2))","v":""}]
[null,"Carol","Darren","Margaret","Isabel","Ethel","Ashley","Randall","Todd"]
[null,"Mac","Ray","Brock","Randall","Ethel","Burt","Randall","Susan",null,{"$f":"IF(ISERROR(INDEX(PR,MATCH(K7,PERSOS),2)),\"\",INDEX(PR,MATCH(K7,PERSOS),2))","v":""},{"$f":"IF(ISERROR(INDEX(PR,MATCH(L7,PERSOS),2)),\"\",INDEX(PR,MATCH(L7,PERSOS),2))","v":""},{"$f":"IF(ISERROR(INDEX(PR,MATCH(M7,PERSOS),2)),\"\",INDEX(PR,MATCH(M7,PERSOS),2))","v":""},{"$f":"IF(ISERROR(INDEX(PR,MATCH(N7,PERSOS),2)),\"\",INDEX(PR,MATCH(N7,PERSOS),2))","v":""},{"$f":"IF(ISERROR(INDEX(PR,MATCH(O7,PERSOS),2)),\"\",INDEX(PR,MATCH(O7,PERSOS),2))","v":""}]
[null,"Garret","Gabriel","Brock","Randall","Jed","Carol","Cletus","Susan"]
[null,"Garret","Gabriel","Cletus","Isabel","Chris","Neil","Randall","Cyrus",null,{"$f":"IF(ISERROR(INDEX(PR,MATCH(K9,PERSOS),2)),\"\",INDEX(PR,MATCH(K9,PERSOS),2))","v":""},{"$f":"IF(ISERROR(INDEX(PR,MATCH(L9,PERSOS),2)),\"\",INDEX(PR,MATCH(L9,PERSOS),2))","v":""},{"$f":"IF(ISERROR(INDEX(PR,MATCH(M9,PERSOS),2)),\"\",INDEX(PR,MATCH(M9,PERSOS),2))","v":""},{"$f":"IF(ISERROR(INDEX(PR,MATCH(N9,PERSOS),2)),\"\",INDEX(PR,MATCH(N9,PERSOS),2))","v":""},{"$f":"IF(ISERROR(INDEX(PR,MATCH(O9,PERSOS),2)),\"\",INDEX(PR,MATCH(O9,PERSOS),2))","v":""}]
[null,"Carol","Darren","Margaret","Neil","Caleb","Carol","Cletus","Ethel"]
[null,"Christa","Ray","Brock","Diane","Olivia","Ashley","Cletus","Clarence",null,{"$f":"IF(ISERROR(INDEX(PR,MATCH(K11,PERSOS),2)),\"\",INDEX(PR,MATCH(K11,PERSOS),2))","v":""},{"$f":"IF(ISERROR(INDEX(PR,MATCH(L11,PERSOS),2)),\"\",INDEX(PR,MATCH(L11,PERSOS),2))","v":""},{"$f":"IF(ISERROR(INDEX(PR,MATCH(M11,PERSOS),2)),\"\",INDEX(PR,MATCH(M11,PERSOS),2))","v":""},{"$f":"IF(ISERROR(INDEX(PR,MATCH(N11,PERSOS),2)),\"\",INDEX(PR,MATCH(N11,PERSOS),2))","v":""},{"$f":"IF(ISERROR(INDEX(PR,MATCH(O11,PERSOS),2)),\"\",INDEX(PR,MATCH(O11,PERSOS),2))","v":""}]
[null,"Mac","Ray","Cletus","Randall","Gerald","Neil",null,"Clarence"]
[null,"Georges","Angela","Margaret","Brigitte","Danny","Neil",null,"Nathan",null,{"$f":"IF(ISERROR(INDEX(PR,MATCH(K13,PERSOS),2)),\"\",INDEX(PR,MATCH(K13,PERSOS),2))","v":""},{"$f":"IF(ISERROR(INDEX(PR,MATCH(L13,PERSOS),2)),\"\",INDEX(PR,MATCH(L13,PERSOS),2))","v":""},{"$f":"IF(ISERROR(INDEX(PR,MATCH(M13,PERSOS),2)),\"\",INDEX(PR,MATCH(M13,PERSOS),2))","v":""},{"$f":"IF(ISERROR(INDEX(PR,MATCH(N13,PERSOS),2)),\"\",INDEX(PR,MATCH(N13,PERSOS),2))","v":""},{"$f":"IF(ISERROR(INDEX(PR,MATCH(O13,PERSOS),2)),\"\",INDEX(PR,MATCH(O13,PERSOS),2))","v":""}]
[null,"Carol","Darren","Margaret","Neil","Olivia","Ashley",null,"Gerald"]
[null,"Georges","Angela","Margaret","Randall","Danny","Margaret",null,"Grace",null,{"$f":"IF(ISERROR(INDEX(PR,MATCH(K15,PERSOS),2)),\"\",INDEX(PR,MATCH(K15,PERSOS),2))","v":""},{"$f":"IF(ISERROR(INDEX(PR,MATCH(L15,PERSOS),2)),\"\",INDEX(PR,MATCH(L15,PERSOS),2))","v":""},{"$f":"IF(ISERROR(INDEX(PR,MATCH(M15,PERSOS),2)),\"\",INDEX(PR,MATCH(M15,PERSOS),2))","v":""},{"$f":"IF(ISERROR(INDEX(PR,MATCH(N15,PERSOS),2)),\"\",INDEX(PR,MATCH(N15,PERSOS),2))","v":""},{"$f":"IF(ISERROR(INDEX(PR,MATCH(O15,PERSOS),2)),\"\",INDEX(PR,MATCH(O15,PERSOS),2))","v":""}]
[null,"Garret","Gabriel","Ashley","Diane","John","Neil",null,"Nathan"]
[null,"Georges","Gabriel","Margaret","Isabel","John","Neil",null,null,null,{"$f":"IF(ISERROR(INDEX(PR,MATCH(K17,PERSOS),2)),\"\",INDEX(PR,MATCH(K17,PERSOS),2))","v":""},{"$f":"IF(ISERROR(INDEX(PR,MATCH(L17,PERSOS),2)),\"\",INDEX(PR,MATCH(L17,PERSOS),2))","v":""},{"$f":"IF(ISERROR(INDEX(PR,MATCH(M17,PERSOS),2)),\"\",INDEX(PR,MATCH(M17,PERSOS),2))","v":""},{"$f":"IF(ISERROR(INDEX(PR,MATCH(N17,PERSOS),2)),\"\",INDEX(PR,MATCH(N17,PERSOS),2))","v":""},{"$f":"IF(ISERROR(INDEX(PR,MATCH(O17,PERSOS),2)),\"\",INDEX(PR,MATCH(O17,PERSOS),2))","v":""}]
[null,"Georges","Angela","Brock","Isabel","Danny","Neil"]
[null,"Carter","Angela","Margaret","Diane","Todd","Neil",null,null,null,{"$f":"IF(ISERROR(INDEX(PR,MATCH(K19,PERSOS),2)),\"\",INDEX(PR,MATCH(K19,PERSOS),2))","v":""},{"$f":"IF(ISERROR(INDEX(PR,MATCH(L19,PERSOS),2)),\"\",INDEX(PR,MATCH(L19,PERSOS),2))","v":""},{"$f":"IF(ISERROR(INDEX(PR,MATCH(M19,PERSOS),2)),\"\",INDEX(PR,MATCH(M19,PERSOS),2))","v":""},{"$f":"IF(ISERROR(INDEX(PR,MATCH(N19,PERSOS),2)),\"\",INDEX(PR,MATCH(N19,PERSOS),2))","v":""},{"$f":"IF(ISERROR(INDEX(PR,MATCH(O19,PERSOS),2)),\"\",INDEX(PR,MATCH(O19,PERSOS),2))","v":""}]
[null,"Mac","Ray","Brock","Samuel","Jody","Margaret"]
[null,"Christa","Angela","Ashley","Randall","Jody","Ashley",null,null,null,{"$f":"IF(ISERROR(INDEX(PR,MATCH(K21,PERSOS),2)),\"\",INDEX(PR,MATCH(K21,PERSOS),2))","v":""},{"$f":"IF(ISERROR(INDEX(PR,MATCH(L21,PERSOS),2)),\"\",INDEX(PR,MATCH(L21,PERSOS),2))","v":""},{"$f":"IF(ISERROR(INDEX(PR,MATCH(M21,PERSOS),2)),\"\",INDEX(PR,MATCH(M21,PERSOS),2))","v":""},{"$f":"IF(ISERROR(INDEX(PR,MATCH(N21,PERSOS),2)),\"\",INDEX(PR,MATCH(N21,PERSOS),2))","v":""},{"$f":"IF(ISERROR(INDEX(PR,MATCH(O21,PERSOS),2)),\"\",INDEX(PR,MATCH(O21,PERSOS),2))","v":""}]
[null,"Carter","Ray","Brock","Isabel","John","Carol"]
[null,"Carter","Angela","Ashley","Randall","Susan","Neil",null,null,null,{"$f":"IF(ISERROR(INDEX(PR,MATCH(K23,PERSOS),2)),\"\",INDEX(PR,MATCH(K23,PERSOS),2))","v":""},{"$f":"IF(ISERROR(INDEX(PR,MATCH(L23,PERSOS),2)),\"\",INDEX(PR,MATCH(L23,PERSOS),2))","v":""},{"$f":"IF(ISERROR(INDEX(PR,MATCH(M23,PERSOS),2)),\"\",INDEX(PR,MATCH(M23,PERSOS),2))","v":""},{"$f":"IF(ISERROR(INDEX(PR,MATCH(N23,PERSOS),2)),\"\",INDEX(PR,MATCH(N23,PERSOS),2))","v":""},{"$f":"IF(ISERROR(INDEX(PR,MATCH(O23,PERSOS),2)),\"\",INDEX(PR,MATCH(O23,PERSOS),2))","v":""}]
[null,"Georges","Ray","Ashley","Isabel","Gerald","Margaret"]
[null,"Carol","Ray","Ashley","Isabel","Clifton","Ashley",null,null,null,{"$f":"IF(ISERROR(INDEX(PR,MATCH(K25,PERSOS),2)),\"\",INDEX(PR,MATCH(K25,PERSOS),2))","v":""},{"$f":"IF(ISERROR(INDEX(PR,MATCH(L25,PERSOS),2)),\"\",INDEX(PR,MATCH(L25,PERSOS),2))","v":""},{"$f":"IF(ISERROR(INDEX(PR,MATCH(M25,PERSOS),2)),\"\",INDEX(PR,MATCH(M25,PERSOS),2))","v":""},{"$f":"IF(ISERROR(INDEX(PR,MATCH(N25,PERSOS),2)),\"\",INDEX(PR,MATCH(N25,PERSOS),2))","v":""},{"$f":"IF(ISERROR(INDEX(PR,MATCH(O25,PERSOS),2)),\"\",INDEX(PR,MATCH(O25,PERSOS),2))","v":""}]
[null,"Georges","Ray","Margaret","Randall",null,"Ashley"]
[null,"Garret","Darren","Margaret","Brigitte",null,"Margaret",null,null,null,{"$f":"IF(ISERROR(INDEX(PR,MATCH(K27,PERSOS),2)),\"\",INDEX(PR,MATCH(K27,PERSOS),2))","v":""},{"$f":"IF(ISERROR(INDEX(PR,MATCH(L27,PERSOS),2)),\"\",INDEX(PR,MATCH(L27,PERSOS),2))","v":""},{"$f":"IF(ISERROR(INDEX(PR,MATCH(M27,PERSOS),2)),\"\",INDEX(PR,MATCH(M27,PERSOS),2))","v":""},{"$f":"IF(ISERROR(INDEX(PR,MATCH(N27,PERSOS),2)),\"\",INDEX(PR,MATCH(N27,PERSOS),2))","v":""},{"$f":"IF(ISERROR(INDEX(PR,MATCH(O27,PERSOS),2)),\"\",INDEX(PR,MATCH(O27,PERSOS),2))","v":""}]
[null,"Mac","Ray","Brock","Neil",null,"Ashley"]
[null,"Mac","Gabriel","Ashley","Neil",null,"Ashley",null,null,null,{"$f":"IF(ISERROR(INDEX(PR,MATCH(K29,PERSOS),2)),\"\",INDEX(PR,MATCH(K29,PERSOS),2))","v":""},{"$f":"IF(ISERROR(INDEX(PR,MATCH(L29,PERSOS),2)),\"\",INDEX(PR,MATCH(L29,PERSOS),2))","v":""},{"$f":"IF(ISERROR(INDEX(PR,MATCH(M29,PERSOS),2)),\"\",INDEX(PR,MATCH(M29,PERSOS),2))","v":""},{"$f":"IF(ISERROR(INDEX(PR,MATCH(N29,PERSOS),2)),\"\",INDEX(PR,MATCH(N29,PERSOS),2))","v":""},{"$f":"IF(ISERROR(INDEX(PR,MATCH(O29,PERSOS),2)),\"\",INDEX(PR,MATCH(O29,PERSOS),2))","v":""}]
[null,"Carol","Gabriel","Ashley","Randall",null,"Margaret"]
[null,"Georges","Ray","Cletus","Brigitte",null,"Carol",null,null,null,{"$f":"IF(ISERROR(INDEX(PR,MATCH(K31,PERSOS),2)),\"\",INDEX(PR,MATCH(K31,PERSOS),2))","v":""},{"$f":"IF(ISERROR(INDEX(PR,MATCH(L31,PERSOS),2)),\"\",INDEX(PR,MATCH(L31,PERSOS),2))","v":""},{"$f":"IF(ISERROR(INDEX(PR,MATCH(M31,PERSOS),2)),\"\",INDEX(PR,MATCH(M31,PERSOS),2))","v":""},{"$f":"IF(ISERROR(INDEX(PR,MATCH(N31,PERSOS),2)),\"\",INDEX(PR,MATCH(N31,PERSOS),2))","v":""},{"$f":"IF(ISERROR(INDEX(PR,MATCH(O31,PERSOS),2)),\"\",INDEX(PR,MATCH(O31,PERSOS),2))","v":""}]
[null,"Garret","Ray","Margaret","Randall",null,"Neil"]
[null,"Garret","Ray","Margaret","Isabel",null,"Neil",null,null,null,{"$f":"IF(ISERROR(INDEX(PR,MATCH(K33,PERSOS),2)),\"\",INDEX(PR,MATCH(K33,PERSOS),2))","v":""},{"$f":"IF(ISERROR(INDEX(PR,MATCH(L33,PERSOS),2)),\"\",INDEX(PR,MATCH(L33,PERSOS),2))","v":""},{"$f":"IF(ISERROR(INDEX(PR,MATCH(M33,PERSOS),2)),\"\",INDEX(PR,MATCH(M33,PERSOS),2))","v":""},{"$f":"IF(ISERROR(INDEX(PR,MATCH(N33,PERSOS),2)),\"\",INDEX(PR,MATCH(N33,PERSOS),2))","v":""},{"$f":"IF(ISERROR(INDEX(PR,MATCH(O33,PERSOS),2)),\"\",INDEX(PR,MATCH(O33,PERSOS),2))","v":""}]
[null,"Carol","Ray","Margaret","Brigitte",null,"Margaret"]
[null,"Carol","Ray",null,"Neil",null,"Ashley",null,null,null,{"$f":"IF(ISERROR(INDEX(PR,MATCH(K35,PERSOS),2)),\"\",INDEX(PR,MATCH(K35,PERSOS),2))","v":""},{"$f":"IF(ISERROR(INDEX(PR,MATCH(L35,PERSOS),2)),\"\",INDEX(PR,MATCH(L35,PERSOS),2))","v":""},{"$f":"IF(ISERROR(INDEX(PR,MATCH(M35,PERSOS),2)),\"\",INDEX(PR,MATCH(M35,PERSOS),2))","v":""},{"$f":"IF(ISERROR(INDEX(PR,MATCH(N35,PERSOS),2)),\"\",INDEX(PR,MATCH(N35,PERSOS),2))","v":""},{"$f":"IF(ISERROR(INDEX(PR,MATCH(O35,PERSOS),2)),\"\",INDEX(PR,MATCH(O35,PERSOS),2))","v":""}]
[null,"Carol","Darren",null,"Isabel",null,"Margaret"]
[null,"Georges","Darren",null,"Diane",null,"Neil",null,null,null,{"$f":"IF(ISERROR(INDEX(PR,MATCH(K37,PERSOS),2)),\"\",INDEX(PR,MATCH(K37,PERSOS),2))","v":""},{"$f":"IF(ISERROR(INDEX(PR,MATCH(L37,PERSOS),2)),\"\",INDEX(PR,MATCH(L37,PERSOS),2))","v":""},{"$f":"IF(ISERROR(INDEX(PR,MATCH(M37,PERSOS),2)),\"\",INDEX(PR,MATCH(M37,PERSOS),2))","v":""},{"$f":"IF(ISERROR(INDEX(PR,MATCH(N37,PERSOS),2)),\"\",INDEX(PR,MATCH(N37,PERSOS),2))","v":""},{"$f":"IF(ISERROR(INDEX(PR,MATCH(O37,PERSOS),2)),\"\",INDEX(PR,MATCH(O37,PERSOS),2))","v":""}]
[null,"Georges","Ray",null,"Neil",null,"Neil"]
[null,"Carol","Darren",null,"Brigitte",null,"Neil",null,null,null,{"$f":"IF(ISERROR(INDEX(PR,MATCH(K39,PERSOS),2)),\"\",INDEX(PR,MATCH(K39,PERSOS),2))","v":""},{"$f":"IF(ISERROR(INDEX(PR,MATCH(L39,PERSOS),2)),\"\",INDEX(PR,MATCH(L39,PERSOS),2))","v":""},{"$f":"IF(ISERROR(INDEX(PR,MATCH(M39,PERSOS),2)),\"\",INDEX(PR,MATCH(M39,PERSOS),2))","v":""},{"$f":"IF(ISERROR(INDEX(PR,MATCH(N39,PERSOS),2)),\"\",INDEX(PR,MATCH(N39,PERSOS),2))","v":""},{"$f":"IF(ISERROR(INDEX(PR,MATCH(O39,PERSOS),2)),\"\",INDEX(PR,MATCH(O39,PERSOS),2))","v":""}]
[null,"Georges","Angela",null,"Randall",null,"Neil"]
[null,"Christa","Ray",null,"Neil",null,"Neil",null,null,null,{"$f":"IF(ISERROR(INDEX(PR,MATCH(K41,PERSOS),2)),\"\",INDEX(PR,MATCH(K41,PERSOS),2))","v":""},{"$f":"IF(ISERROR(INDEX(PR,MATCH(L41,PERSOS),2)),\"\",INDEX(PR,MATCH(L41,PERSOS),2))","v":""},{"$f":"IF(ISERROR(INDEX(PR,MATCH(M41,PERSOS),2)),\"\",INDEX(PR,MATCH(M41,PERSOS),2))","v":""},{"$f":"IF(ISERROR(INDEX(PR,MATCH(N41,PERSOS),2)),\"\",INDEX(PR,MATCH(N41,PERSOS),2))","v":""},{"$f":"IF(ISERROR(INDEX(PR,MATCH(O41,PERSOS),2)),\"\",INDEX(PR,MATCH(O41,PERSOS),2))","v":""}]
[null,"Mac","Darren",null,"Samuel",null,"Neil"]
[null,"Georges","Angela",null,"Isabel",null,"Carol",null,null,null,{"$f":"IF(ISERROR(INDEX(PR,MATCH(K43,PERSOS),2)),\"\",INDEX(PR,MATCH(K43,PERSOS),2))","v":""},{"$f":"IF(ISERROR(INDEX(PR,MATCH(L43,PERSOS),2)),\"\",INDEX(PR,MATCH(L43,PERSOS),2))","v":""},{"$f":"IF(ISERROR(INDEX(PR,MATCH(M43,PERSOS),2)),\"\",INDEX(PR,MATCH(M43,PERSOS),2))","v":""},{"$f":"IF(ISERROR(INDEX(PR,MATCH(N43,PERSOS),2)),\"\",INDEX(PR,MATCH(N43,PERSOS),2))","v":""},{"$f":"IF(ISERROR(INDEX(PR,MATCH(O43,PERSOS),2)),\"\",INDEX(PR,MATCH(O43,PERSOS),2))","v":""}]
[null,"Christa","Gabriel",null,"Brigitte",null,"Margaret"]
[null,"Georges","Ray",null,null,null,"Neil",null,null,null,{"$f":"IF(ISERROR(INDEX(PR,MATCH(K45,PERSOS),2)),\"\",INDEX(PR,MATCH(K45,PERSOS),2))","v":""},{"$f":"IF(ISERROR(INDEX(PR,MATCH(L45,PERSOS),2)),\"\",INDEX(PR,MATCH(L45,PERSOS),2))","v":""},{"$f":"IF(ISERROR(INDEX(PR,MATCH(M45,PERSOS),2)),\"\",INDEX(PR,MATCH(M45,PERSOS),2))","v":""},{"$f":"IF(ISERROR(INDEX(PR,MATCH(N45,PERSOS),2)),\"\",INDEX(PR,MATCH(N45,PERSOS),2))","v":""},{"$f":"IF(ISERROR(INDEX(PR,MATCH(O45,PERSOS),2)),\"\",INDEX(PR,MATCH(O45,PERSOS),2))","v":""}]
[null,"Mac","Ray",null,null,null,"Neil"]
[null,"Mac","Ray",null,null,null,"Ashley",null,null,null,{"$f":"IF(ISERROR(INDEX(PR,MATCH(K47,PERSOS),2)),\"\",INDEX(PR,MATCH(K47,PERSOS),2))","v":""},{"$f":"IF(ISERROR(INDEX(PR,MATCH(L47,PERSOS),2)),\"\",INDEX(PR,MATCH(L47,PERSOS),2))","v":""},{"$f":"IF(ISERROR(INDEX(PR,MATCH(M47,PERSOS),2)),\"\",INDEX(PR,MATCH(M47,PERSOS),2))","v":""},{"$f":"IF(ISERROR(INDEX(PR,MATCH(N47,PERSOS),2)),\"\",INDEX(PR,MATCH(N47,PERSOS),2))","v":""},{"$f":"IF(ISERROR(INDEX(PR,MATCH(O47,PERSOS),2)),\"\",INDEX(PR,MATCH(O47,PERSOS),2))","v":""}]
[null,"Georges","Darren",null,null,null,"Neil"]
[null,"Georges","Angela",null,null,null,"Neil",null,null,null,{"$f":"IF(ISERROR(INDEX(PR,MATCH(K49,PERSOS),2)),\"\",INDEX(PR,MATCH(K49,PERSOS),2))","v":""},{"$f":"IF(ISERROR(INDEX(PR,MATCH(L49,PERSOS),2)),\"\",INDEX(PR,MATCH(L49,PERSOS),2))","v":""},{"$f":"IF(ISERROR(INDEX(PR,MATCH(M49,PERSOS),2)),\"\",INDEX(PR,MATCH(M49,PERSOS),2))","v":""},{"$f":"IF(ISERROR(INDEX(PR,MATCH(N49,PERSOS),2)),\"\",INDEX(PR,MATCH(N49,PERSOS),2))","v":""},{"$f":"IF(ISERROR(INDEX(PR,MATCH(O49,PERSOS),2)),\"\",INDEX(PR,MATCH(O49,PERSOS),2))","v":""}]
[null,"Carter","Ray",null,null,null,"Ashley"]
[null,"Georges","Darren",null,null,null,"Ashley",null,null,null,{"$f":"IF(ISERROR(INDEX(PR,MATCH(K51,PERSOS),2)),\"\",INDEX(PR,MATCH(K51,PERSOS),2))","v":""},{"$f":"IF(ISERROR(INDEX(PR,MATCH(L51,PERSOS),2)),\"\",INDEX(PR,MATCH(L51,PERSOS),2))","v":""},{"$f":"IF(ISERROR(INDEX(PR,MATCH(M51,PERSOS),2)),\"\",INDEX(PR,MATCH(M51,PERSOS),2))","v":""},{"$f":"IF(ISERROR(INDEX(PR,MATCH(N51,PERSOS),2)),\"\",INDEX(PR,MATCH(N51,PERSOS),2))","v":""},{"$f":"IF(ISERROR(INDEX(PR,MATCH(O51,PERSOS),2)),\"\",INDEX(PR,MATCH(O51,PERSOS),2))","v":""}]
[null,"Garret","Ray",null,null,null,"Ashley"]
[null,"Mac","Angela",null,null,null,"Carol",null,null,null,{"$f":"IF(ISERROR(INDEX(PR,MATCH(K53,PERSOS),2)),\"\",INDEX(PR,MATCH(K53,PERSOS),2))","v":""},{"$f":"IF(ISERROR(INDEX(PR,MATCH(L53,PERSOS),2)),\"\",INDEX(PR,MATCH(L53,PERSOS),2))","v":""},{"$f":"IF(ISERROR(INDEX(PR,MATCH(M53,PERSOS),2)),\"\",INDEX(PR,MATCH(M53,PERSOS),2))","v":""},{"$f":"IF(ISERROR(INDEX(PR,MATCH(N53,PERSOS),2)),\"\",INDEX(PR,MATCH(N53,PERSOS),2))","v":""},{"$f":"IF(ISERROR(INDEX(PR,MATCH(O53,PERSOS),2)),\"\",INDEX(PR,MATCH(O53,PERSOS),2))","v":""}]
[null,"Carol","Ray",null,null,null,"Margaret"]
[null,"Georges","Darren",null,null,null,"Burt",null,null,null,{"$f":"IF(ISERROR(INDEX(PR,MATCH(K55,PERSOS),2)),\"\",INDEX(PR,MATCH(K55,PERSOS),2))","v":""},{"$f":"IF(ISERROR(INDEX(PR,MATCH(L55,PERSOS),2)),\"\",INDEX(PR,MATCH(L55,PERSOS),2))","v":""},{"$f":"IF(ISERROR(INDEX(PR,MATCH(M55,PERSOS),2)),\"\",INDEX(PR,MATCH(M55,PERSOS),2))","v":""},{"$f":"IF(ISERROR(INDEX(PR,MATCH(N55,PERSOS),2)),\"\",INDEX(PR,MATCH(N55,PERSOS),2))","v":""},{"$f":"IF(ISERROR(INDEX(PR,MATCH(O55,PERSOS),2)),\"\",INDEX(PR,MATCH(O55,PERSOS),2))","v":""}]
[null,"Georges","Ray",null,null,null,"Neil"]
[null,"Mac","Darren",null,null,null,"Neil",null,null,null,{"$f":"IF(ISERROR(INDEX(PR,MATCH(K57,PERSOS),2)),\"\",INDEX(PR,MATCH(K57,PERSOS),2))","v":""},{"$f":"IF(ISERROR(INDEX(PR,MATCH(L57,PERSOS),2)),\"\",INDEX(PR,MATCH(L57,PERSOS),2))","v":""},{"$f":"IF(ISERROR(INDEX(PR,MATCH(M57,PERSOS),2)),\"\",INDEX(PR,MATCH(M57,PERSOS),2))","v":""},{"$f":"IF(ISERROR(INDEX(PR,MATCH(N57,PERSOS),2)),\"\",INDEX(PR,MATCH(N57,PERSOS),2))","v":""},{"$f":"IF(ISERROR(INDEX(PR,MATCH(O57,PERSOS),2)),\"\",INDEX(PR,MATCH(O57,PERSOS),2))","v":""}]
[null,"Carter","Ray",null,null,null,"Carol"]
[null,"Christa","Ray",null,null,null,"Margaret",null,null,null,{"$f":"IF(ISERROR(INDEX(PR,MATCH(K59,PERSOS),2)),\"\",INDEX(PR,MATCH(K59,PERSOS),2))","v":""},{"$f":"IF(ISERROR(INDEX(PR,MATCH(L59,PERSOS),2)),\"\",INDEX(PR,MATCH(L59,PERSOS),2))","v":""},{"$f":"IF(ISERROR(INDEX(PR,MATCH(M59,PERSOS),2)),\"\",INDEX(PR,MATCH(M59,PERSOS),2))","v":""},{"$f":"IF(ISERROR(INDEX(PR,MATCH(N59,PERSOS),2)),\"\",INDEX(PR,MATCH(N59,PERSOS),2))","v":""},{"$f":"IF(ISERROR(INDEX(PR,MATCH(O59,PERSOS),2)),\"\",INDEX(PR,MATCH(O59,PERSOS),2))","v":""}]
[null,"Carter","Ray",null,null,null,"Margaret"]
[null,"Carol","Ray",null,null,null,"Neil",null,null,null,{"$f":"IF(ISERROR(INDEX(PR,MATCH(K61,PERSOS),2)),\"\",INDEX(PR,MATCH(K61,PERSOS),2))","v":""},{"$f":"IF(ISERROR(INDEX(PR,MATCH(L61,PERSOS),2)),\"\",INDEX(PR,MATCH(L61,PERSOS),2))","v":""},{"$f":"IF(ISERROR(INDEX(PR,MATCH(M61,PERSOS),2)),\"\",INDEX(PR,MATCH(M61,PERSOS),2))","v":""},{"$f":"IF(ISERROR(INDEX(PR,MATCH(N61,PERSOS),2)),\"\",INDEX(PR,MATCH(N61,PERSOS),2))","v":""},{"$f":"IF(ISERROR(INDEX(PR,MATCH(O61,PERSOS),2)),\"\",INDEX(PR,MATCH(O61,PERSOS),2))","v":""}]
[null,"Georges","Ray",null,null,null,"Margaret"]
[null,"Mac","Ray",null,null,null,"Ashley",null,null,null,{"$f":"IF(ISERROR(INDEX(PR,MATCH(K63,PERSOS),2)),\"\",INDEX(PR,MATCH(K63,PERSOS),2))","v":""},{"$f":"IF(ISERROR(INDEX(PR,MATCH(L63,PERSOS),2)),\"\",INDEX(PR,MATCH(L63,PERSOS),2))","v":""},{"$f":"IF(ISERROR(INDEX(PR,MATCH(M63,PERSOS),2)),\"\",INDEX(PR,MATCH(M63,PERSOS),2))","v":""},{"$f":"IF(ISERROR(INDEX(PR,MATCH(N63,PERSOS),2)),\"\",INDEX(PR,MATCH(N63,PERSOS),2))","v":""},{"$f":"IF(ISERROR(INDEX(PR,MATCH(O63,PERSOS),2)),\"\",INDEX(PR,MATCH(O63,PERSOS),2))","v":""}]
[null,"Georges","Ray",null,null,null,"Neil"]
[null,"Christa","Angela",null,null,null,"Carol",null,null,null,{"$f":"IF(ISERROR(INDEX(PR,MATCH(K65,PERSOS),2)),\"\",INDEX(PR,MATCH(K65,PERSOS),2))","v":""},{"$f":"IF(ISERROR(INDEX(PR,MATCH(L65,PERSOS),2)),\"\",INDEX(PR,MATCH(L65,PERSOS),2))","v":""},{"$f":"IF(ISERROR(INDEX(PR,MATCH(M65,PERSOS),2)),\"\",INDEX(PR,MATCH(M65,PERSOS),2))","v":""},{"$f":"IF(ISERROR(INDEX(PR,MATCH(N65,PERSOS),2)),\"\",INDEX(PR,MATCH(N65,PERSOS),2))","v":""},{"$f":"IF(ISERROR(INDEX(PR,MATCH(O65,PERSOS),2)),\"\",INDEX(PR,MATCH(O65,PERSOS),2))","v":""}]
[null,"Garret","Darren",null,null,null,"Neil"]
[null,"Garret","Ray",null,null,null,"Margaret",null,null,null,{"$f":"IF(ISERROR(INDEX(PR,MATCH(K67,PERSOS),2)),\"\",INDEX(PR,MATCH(K67,PERSOS),2))","v":""},{"$f":"IF(ISERROR(INDEX(PR,MATCH(L67,PERSOS),2)),\"\",INDEX(PR,MATCH(L67,PERSOS),2))","v":""},{"$f":"IF(ISERROR(INDEX(PR,MATCH(M67,PERSOS),2)),\"\",INDEX(PR,MATCH(M67,PERSOS),2))","v":""},{"$f":"IF(ISERROR(INDEX(PR,MATCH(N67,PERSOS),2)),\"\",INDEX(PR,MATCH(N67,PERSOS),2))","v":""},{"$f":"IF(ISERROR(INDEX(PR,MATCH(O67,PERSOS),2)),\"\",INDEX(PR,MATCH(O67,PERSOS),2))","v":""}]
[null,"Mac","Ray",null,null,null,"Ashley"]
[null,"Garret","Gabriel",null,null,null,"Margaret",null,null,null,{"$f":"IF(ISERROR(INDEX(PR,MATCH(K69,PERSOS),2)),\"\",INDEX(PR,MATCH(K69,PERSOS),2))","v":""},{"$f":"IF(ISERROR(INDEX(PR,MATCH(L69,PERSOS),2)),\"\",INDEX(PR,MATCH(L69,PERSOS),2))","v":""},{"$f":"IF(ISERROR(INDEX(PR,MATCH(M69,PERSOS),2)),\"\",INDEX(PR,MATCH(M69,PERSOS),2))","v":""},{"$f":"IF(ISERROR(INDEX(PR,MATCH(N69,PERSOS),2)),\"\",INDEX(PR,MATCH(N69,PERSOS),2))","v":""},{"$f":"IF(ISERROR(INDEX(PR,MATCH(O69,PERSOS),2)),\"\",INDEX(PR,MATCH(O69,PERSOS),2))","v":""}]
[null,"Georges","Ray",null,null,null,"Margaret"]
[null,"Georges","Gabriel",null,null,null,"Margaret",null,null,null,{"$f":"IF(ISERROR(INDEX(PR,MATCH(K71,PERSOS),2)),\"\",INDEX(PR,MATCH(K71,PERSOS),2))","v":""},{"$f":"IF(ISERROR(INDEX(PR,MATCH(L71,PERSOS),2)),\"\",INDEX(PR,MATCH(L71,PERSOS),2))","v":""},{"$f":"IF(ISERROR(INDEX(PR,MATCH(M71,PERSOS),2)),\"\",INDEX(PR,MATCH(M71,PERSOS),2))","v":""},{"$f":"IF(ISERROR(INDEX(PR,MATCH(N71,PERSOS),2)),\"\",INDEX(PR,MATCH(N71,PERSOS),2))","v":""},{"$f":"IF(ISERROR(INDEX(PR,MATCH(O71,PERSOS),2)),\"\",INDEX(PR,MATCH(O71,PERSOS),2))","v":""}]
[null,"Mac","Angela",null,null,null,"Margaret"]
[null,"Christa","Ray",null,null,null,"Margaret",null,null,null,{"$f":"IF(ISERROR(INDEX(PR,MATCH(K73,PERSOS),2)),\"\",INDEX(PR,MATCH(K73,PERSOS),2))","v":""},{"$f":"IF(ISERROR(INDEX(PR,MATCH(L73,PERSOS),2)),\"\",INDEX(PR,MATCH(L73,PERSOS),2))","v":""},{"$f":"IF(ISERROR(INDEX(PR,MATCH(M73,PERSOS),2)),\"\",INDEX(PR,MATCH(M73,PERSOS),2))","v":""},{"$f":"IF(ISERROR(INDEX(PR,MATCH(N73,PERSOS),2)),\"\",INDEX(PR,MATCH(N73,PERSOS),2))","v":""},{"$f":"IF(ISERROR(INDEX(PR,MATCH(O73,PERSOS),2)),\"\",INDEX(PR,MATCH(O73,PERSOS),2))","v":""}]
[null,"Georges","Gabriel",null,null,null,"Margaret"]
[null,"Carter","Ray",null,null,null,"Margaret",null,null,null,{"$f":"IF(ISERROR(INDEX(PR,MATCH(K75,PERSOS),2)),\"\",INDEX(PR,MATCH(K75,PERSOS),2))","v":""},{"$f":"IF(ISERROR(INDEX(PR,MATCH(L75,PERSOS),2)),\"\",INDEX(PR,MATCH(L75,PERSOS),2))","v":""},{"$f":"IF(ISERROR(INDEX(PR,MATCH(M75,PERSOS),2)),\"\",INDEX(PR,MATCH(M75,PERSOS),2))","v":""},{"$f":"IF(ISERROR(INDEX(PR,MATCH(N75,PERSOS),2)),\"\",INDEX(PR,MATCH(N75,PERSOS),2))","v":""},{"$f":"IF(ISERROR(INDEX(PR,MATCH(O75,PERSOS),2)),\"\",INDEX(PR,MATCH(O75,PERSOS),2))","v":""}]
[null,"Carol","Ray",null,null,null,"Carol"]
[null,"Carol","Angela",null,null,null,"Margaret",null,null,null,{"$f":"IF(ISERROR(INDEX(PR,MATCH(K77,PERSOS),2)),\"\",INDEX(PR,MATCH(K77,PERSOS),2))","v":""},{"$f":"IF(ISERROR(INDEX(PR,MATCH(L77,PERSOS),2)),\"\",INDEX(PR,MATCH(L77,PERSOS),2))","v":""},{"$f":"IF(ISERROR(INDEX(PR,MATCH(M77,PERSOS),2)),\"\",INDEX(PR,MATCH(M77,PERSOS),2))","v":""},{"$f":"IF(ISERROR(INDEX(PR,MATCH(N77,PERSOS),2)),\"\",INDEX(PR,MATCH(N77,PERSOS),2))","v":""},{"$f":"IF(ISERROR(INDEX(PR,MATCH(O77,PERSOS),2)),\"\",INDEX(PR,MATCH(O77,PERSOS),2))","v":""}]
[null,"Georges","Gabriel",null,null,null,"Neil"]
[null,"Georges","Gabriel",null,null,null,"Carol",null,null,null,{"$f":"IF(ISERROR(INDEX(PR,MATCH(K79,PERSOS),2)),\"\",INDEX(PR,MATCH(K79,PERSOS),2))","v":""},{"$f":"IF(ISERROR(INDEX(PR,MATCH(L79,PERSOS),2)),\"\",INDEX(PR,MATCH(L79,PERSOS),2))","v":""},{"$f":"IF(ISERROR(INDEX(PR,MATCH(M79,PERSOS),2)),\"\",INDEX(PR,MATCH(M79,PERSOS),2))","v":""},{"$f":"IF(ISERROR(INDEX(PR,MATCH(N79,PERSOS),2)),\"\",INDEX(PR,MATCH(N79,PERSOS),2))","v":""},{"$f":"IF(ISERROR(INDEX(PR,MATCH(O79,PERSOS),2)),\"\",INDEX(PR,MATCH(O79,PERSOS),2))","v":""}]
[null,"Carol","Gabriel",null,null,null,"Neil"]
[null,"Christa","Ray",null,null,null,"Ashley",null,null,null,{"$f":"IF(ISERROR(INDEX(PR,MATCH(K81,PERSOS),2)),\"\",INDEX(PR,MATCH(K81,PERSOS),2))","v":""},{"$f":"IF(ISERROR(INDEX(PR,MATCH(L81,PERSOS),2)),\"\",INDEX(PR,MATCH(L81,PERSOS),2))","v":""},{"$f":"IF(ISERROR(INDEX(PR,MATCH(M81,PERSOS),2)),\"\",INDEX(PR,MATCH(M81,PERSOS),2))","v":""},{"$f":"IF(ISERROR(INDEX(PR,MATCH(N81,PERSOS),2)),\"\",INDEX(PR,MATCH(N81,PERSOS),2))","v":""},{"$f":"IF(ISERROR(INDEX(PR,MATCH(O81,PERSOS),2)),\"\",INDEX(PR,MATCH(O81,PERSOS),2))","v":""}]
[null,"Carol","Angela",null,null,null,"Carol"]
[null,"Christa","Gabriel",null,null,null,"Carol",null,null,null,{"$f":"IF(ISERROR(INDEX(PR,MATCH(K83,PERSOS),2)),\"\",INDEX(PR,MATCH(K83,PERSOS),2))","v":""},{"$f":"IF(ISERROR(INDEX(PR,MATCH(L83,PERSOS),2)),\"\",INDEX(PR,MATCH(L83,PERSOS),2))","v":""},{"$f":"IF(ISERROR(INDEX(PR,MATCH(M83,PERSOS),2)),\"\",INDEX(PR,MATCH(M83,PERSOS),2))","v":""},{"$f":"IF(ISERROR(INDEX(PR,MATCH(N83,PERSOS),2)),\"\",INDEX(PR,MATCH(N83,PERSOS),2))","v":""},{"$f":"IF(ISERROR(INDEX(PR,MATCH(O83,PERSOS),2)),\"\",INDEX(PR,MATCH(O83,PERSOS),2))","v":""}]
[null,"Mac","Ray",null,null,null,"Margaret"]
[null,"Georges","Gabriel",null,null,null,"Neil",null,null,null,{"$f":"IF(ISERROR(INDEX(PR,MATCH(K85,PERSOS),2)),\"\",INDEX(PR,MATCH(K85,PERSOS),2))","v":""},{"$f":"IF(ISERROR(INDEX(PR,MATCH(L85,PERSOS),2)),\"\",INDEX(PR,MATCH(L85,PERSOS),2))","v":""},{"$f":"IF(ISERROR(INDEX(PR,MATCH(M85,PERSOS),2)),\"\",INDEX(PR,MATCH(M85,PERSOS),2))","v":""},{"$f":"IF(ISERROR(INDEX(PR,MATCH(N85,PERSOS),2)),\"\",INDEX(PR,MATCH(N85,PERSOS),2))","v":""},{"$f":"IF(ISERROR(INDEX(PR,MATCH(O85,PERSOS),2)),\"\",INDEX(PR,MATCH(O85,PERSOS),2))","v":""}]
[null,"Garret","Ray",null,null,null,"Margaret"]
[null,"Carter","Gabriel",null,null,null,"Carol",null,null,null,{"$f":"IF(ISERROR(INDEX(PR,MATCH(K87,PERSOS),2)),\"\",INDEX(PR,MATCH(K87,PERSOS),2))","v":""},{"$f":"IF(ISERROR(INDEX(PR,MATCH(L87,PERSOS),2)),\"\",INDEX(PR,MATCH(L87,PERSOS),2))","v":""},{"$f":"IF(ISERROR(INDEX(PR,MATCH(M87,PERSOS),2)),\"\",INDEX(PR,MATCH(M87,PERSOS),2))","v":""},{"$f":"IF(ISERROR(INDEX(PR,MATCH(N87,PERSOS),2)),\"\",INDEX(PR,MATCH(N87,PERSOS),2))","v":""},{"$f":"IF(ISERROR(INDEX(PR,MATCH(O87,PERSOS),2)),\"\",INDEX(PR,MATCH(O87,PERSOS),2))","v":""}]
[null,"Carter","Ray",null,null,null,"Neil"]
[null,"Carol","Darren",null,null,null,"Ashley",null,null,null,{"$f":"IF(ISERROR(INDEX(PR,MATCH(K89,PERSOS),2)),\"\",INDEX(PR,MATCH(K89,PERSOS),2))","v":""},{"$f":"IF(ISERROR(INDEX(PR,MATCH(L89,PERSOS),2)),\"\",INDEX(PR,MATCH(L89,PERSOS),2))","v":""},{"$f":"IF(ISERROR(INDEX(PR,MATCH(M89,PERSOS),2)),\"\",INDEX(PR,MATCH(M89,PERSOS),2))","v":""},{"$f":"IF(ISERROR(INDEX(PR,MATCH(N89,PERSOS),2)),\"\",INDEX(PR,MATCH(N89,PERSOS),2))","v":""},{"$f":"IF(ISERROR(INDEX(PR,MATCH(O89,PERSOS),2)),\"\",INDEX(PR,MATCH(O89,PERSOS),2))","v":""}]
[null,"Carol","Gabriel",null,null,null,"Neil"]
[null,"Christa","Darren",null,null,null,"Carol",null,null,null,{"$f":"IF(ISERROR(INDEX(PR,MATCH(K91,PERSOS),2)),\"\",INDEX(PR,MATCH(K91,PERSOS),2))","v":""},{"$f":"IF(ISERROR(INDEX(PR,MATCH(L91,PERSOS),2)),\"\",INDEX(PR,MATCH(L91,PERSOS),2))","v":""},{"$f":"IF(ISERROR(INDEX(PR,MATCH(M91,PERSOS),2)),\"\",INDEX(PR,MATCH(M91,PERSOS),2))","v":""},{"$f":"IF(ISERROR(INDEX(PR,MATCH(N91,PERSOS),2)),\"\",INDEX(PR,MATCH(N91,PERSOS),2))","v":""},{"$f":"IF(ISERROR(INDEX(PR,MATCH(O91,PERSOS),2)),\"\",INDEX(PR,MATCH(O91,PERSOS),2))","v":""}]
[null,"Carol","Darren",null,null,null,"Margaret"]
[null,"Mac","Ray",null,null,null,"Margaret",null,null,null,{"$f":"IF(ISERROR(INDEX(PR,MATCH(K93,PERSOS),2)),\"\",INDEX(PR,MATCH(K93,PERSOS),2))","v":""},{"$f":"IF(ISERROR(INDEX(PR,MATCH(L93,PERSOS),2)),\"\",INDEX(PR,MATCH(L93,PERSOS),2))","v":""},{"$f":"IF(ISERROR(INDEX(PR,MATCH(M93,PERSOS),2)),\"\",INDEX(PR,MATCH(M93,PERSOS),2))","v":""},{"$f":"IF(ISERROR(INDEX(PR,MATCH(N93,PERSOS),2)),\"\",INDEX(PR,MATCH(N93,PERSOS),2))","v":""},{"$f":"IF(ISERROR(INDEX(PR,MATCH(O93,PERSOS),2)),\"\",INDEX(PR,MATCH(O93,PERSOS),2))","v":""}]
[null,"Georges","Gabriel",null,null,null,"Ashley"]
[null,"Carter","Ray",null,null,null,"Margaret",null,null,null,{"$f":"IF(ISERROR(INDEX(PR,MATCH(K95,PERSOS),2)),\"\",INDEX(PR,MATCH(K95,PERSOS),2))","v":""},{"$f":"IF(ISERROR(INDEX(PR,MATCH(L95,PERSOS),2)),\"\",INDEX(PR,MATCH(L95,PERSOS),2))","v":""},{"$f":"IF(ISERROR(INDEX(PR,MATCH(M95,PERSOS),2)),\"\",INDEX(PR,MATCH(M95,PERSOS),2))","v":""},{"$f":"IF(ISERROR(INDEX(PR,MATCH(N95,PERSOS),2)),\"\",INDEX(PR,MATCH(N95,PERSOS),2))","v":""},{"$f":"IF(ISERROR(INDEX(PR,MATCH(O95,PERSOS),2)),\"\",INDEX(PR,MATCH(O95,PERSOS),2))","v":""}]
[null,"Carter","Ray",null,null,null,"Ashley"]
[null,null,"Ray",null,null,null,"Neil",null,null,null,{"$f":"IF(ISERROR(INDEX(PR,MATCH(K97,PERSOS),2)),\"\",INDEX(PR,MATCH(K97,PERSOS),2))","v":""},{"$f":"IF(ISERROR(INDEX(PR,MATCH(L97,PERSOS),2)),\"\",INDEX(PR,MATCH(L97,PERSOS),2))","v":""},{"$f":"IF(ISERROR(INDEX(PR,MATCH(M97,PERSOS),2)),\"\",INDEX(PR,MATCH(M97,PERSOS),2))","v":""},{"$f":"IF(ISERROR(INDEX(PR,MATCH(N97,PERSOS),2)),\"\",INDEX(PR,MATCH(N97,PERSOS),2))","v":""},{"$f":"IF(ISERROR(INDEX(PR,MATCH(O97,PERSOS),2)),\"\",INDEX(PR,MATCH(O97,PERSOS),2))","v":""}]
[null,null,"Angela",null,null,null,"Neil"]
[null,null,"Ray",null,null,null,"Margaret",null,null,null,{"$f":"IF(ISERROR(INDEX(PR,MATCH(K99,PERSOS),2)),\"\",INDEX(PR,MATCH(K99,PERSOS),2))","v":""},{"$f":"IF(ISERROR(INDEX(PR,MATCH(L99,PERSOS),2)),\"\",INDEX(PR,MATCH(L99,PERSOS),2))","v":""},{"$f":"IF(ISERROR(INDEX(PR,MATCH(M99,PERSOS),2)),\"\",INDEX(PR,MATCH(M99,PERSOS),2))","v":""},{"$f":"IF(ISERROR(INDEX(PR,MATCH(N99,PERSOS),2)),\"\",INDEX(PR,MATCH(N99,PERSOS),2))","v":""},{"$f":"IF(ISERROR(INDEX(PR,MATCH(O99,PERSOS),2)),\"\",INDEX(PR,MATCH(O99,PERSOS),2))","v":""}]
[null,null,"Darren",null,null,null,"Margaret"]
[null,null,"Ray",null,null,null,"Neil",null,null,null,{"$f":"IF(ISERROR(INDEX(PR,MATCH(K101,PERSOS),2)),\"\",INDEX(PR,MATCH(K101,PERSOS),2))","v":""},{"$f":"IF(ISERROR(INDEX(PR,MATCH(L101,PERSOS),2)),\"\",INDEX(PR,MATCH(L101,PERSOS),2))","v":""},{"$f":"IF(ISERROR(INDEX(PR,MATCH(M101,PERSOS),2)),\"\",INDEX(PR,MATCH(M101,PERSOS),2))","v":""},{"$f":"IF(ISERROR(INDEX(PR,MATCH(N101,PERSOS),2)),\"\",INDEX(PR,MATCH(N101,PERSOS),2))","v":""},{"$f":"IF(ISERROR(INDEX(PR,MATCH(O101,PERSOS),2)),\"\",INDEX(PR,MATCH(O101,PERSOS),2))","v":""}]
[null,null,"Ray",null,null,null,"Neil"]
[null,null,"Gabriel",null,null,null,"Margaret",null,null,null,{"$f":"IF(ISERROR(INDEX(PR,MATCH(K103,PERSOS),2)),\"\",INDEX(PR,MATCH(K103,PERSOS),2))","v":""},{"$f":"IF(ISERROR(INDEX(PR,MATCH(L103,PERSOS),2)),\"\",INDEX(PR,MATCH(L103,PERSOS),2))","v":""},{"$f":"IF(ISERROR(INDEX(PR,MATCH(M103,PERSOS),2)),\"\",INDEX(PR,MATCH(M103,PERSOS),2))","v":""},{"$f":"IF(ISERROR(INDEX(PR,MATCH(N103,PERSOS),2)),\"\",INDEX(PR,MATCH(N103,PERSOS),2))","v":""},{"$f":"IF(ISERROR(INDEX(PR,MATCH(O103,PERSOS),2)),\"\",INDEX(PR,MATCH(O103,PERSOS),2))","v":""}]
[null,null,"Angela",null,null,null,"Carol"]
[null,null,"Darren",null,null,null,"Neil",null,null,null,{"$f":"IF(ISERROR(INDEX(PR,MATCH(K105,PERSOS),2)),\"\",INDEX(PR,MATCH(K105,PERSOS),2))","v":""},{"$f":"IF(ISERROR(INDEX(PR,MATCH(L105,PERSOS),2)),\"\",INDEX(PR,MATCH(L105,PERSOS),2))","v":""},{"$f":"IF(ISERROR(INDEX(PR,MATCH(M105,PERSOS),2)),\"\",INDEX(PR,MATCH(M105,PERSOS),2))","v":""},{"$f":"IF(ISERROR(INDEX(PR,MATCH(N105,PERSOS),2)),\"\",INDEX(PR,MATCH(N105,PERSOS),2))","v":""},{"$f":"IF(ISERROR(INDEX(PR,MATCH(O105,PERSOS),2)),\"\",INDEX(PR,MATCH(O105,PERSOS),2))","v":""}]
[null,null,"Gabriel",null,null,null,"Ashley"]
[null,null,"Ray",null,null,null,"Neil",null,null,null,{"$f":"IF(ISERROR(INDEX(PR,MATCH(K107,PERSOS),2)),\"\",INDEX(PR,MATCH(K107,PERSOS),2))","v":""},{"$f":"IF(ISERROR(INDEX(PR,MATCH(L107,PERSOS),2)),\"\",INDEX(PR,MATCH(L107,PERSOS),2))","v":""},{"$f":"IF(ISERROR(INDEX(PR,MATCH(M107,PERSOS),2)),\"\",INDEX(PR,MATCH(M107,PERSOS),2))","v":""},{"$f":"IF(ISERROR(INDEX(PR,MATCH(N107,PERSOS),2)),\"\",INDEX(PR,MATCH(N107,PERSOS),2))","v":""},{"$f":"IF(ISERROR(INDEX(PR,MATCH(O107,PERSOS),2)),\"\",INDEX(PR,MATCH(O107,PERSOS),2))","v":""}]
[null,null,"Ray",null,null,null,"Neil"]
[null,null,"Ray",null,null,null,"Ashley",null,null,null,{"$f":"IF(ISERROR(INDEX(PR,MATCH(K109,PERSOS),2)),\"\",INDEX(PR,MATCH(K109,PERSOS),2))","v":""},{"$f":"IF(ISERROR(INDEX(PR,MATCH(L109,PERSOS),2)),\"\",INDEX(PR,MATCH(L109,PERSOS),2))","v":""},{"$f":"IF(ISERROR(INDEX(PR,MATCH(M109,PERSOS),2)),\"\",INDEX(PR,MATCH(M109,PERSOS),2))","v":""},{"$f":"IF(ISERROR(INDEX(PR,MATCH(N109,PERSOS),2)),\"\",INDEX(PR,MATCH(N109,PERSOS),2))","v":""},{"$f":"IF(ISERROR(INDEX(PR,MATCH(O109,PERSOS),2)),\"\",INDEX(PR,MATCH(O109,PERSOS),2))","v":""}]
[null,null,"Ray",null,null,null,"Ashley"]
[null,null,"Ray",null,null,null,"Margaret",null,null,null,{"$f":"IF(ISERROR(INDEX(PR,MATCH(K111,PERSOS),2)),\"\",INDEX(PR,MATCH(K111,PERSOS),2))","v":""},{"$f":"IF(ISERROR(INDEX(PR,MATCH(L111,PERSOS),2)),\"\",INDEX(PR,MATCH(L111,PERSOS),2))","v":""},{"$f":"IF(ISERROR(INDEX(PR,MATCH(M111,PERSOS),2)),\"\",INDEX(PR,MATCH(M111,PERSOS),2))","v":""},{"$f":"IF(ISERROR(INDEX(PR,MATCH(N111,PERSOS),2)),\"\",INDEX(PR,MATCH(N111,PERSOS),2))","v":""},{"$f":"IF(ISERROR(INDEX(PR,MATCH(O111,PERSOS),2)),\"\",INDEX(PR,MATCH(O111,PERSOS),2))","v":""}]
[null,null,"Ray",null,null,null,"Carol"]
[null,null,"Ray",null,null,null,"Ashley",null,null,null,{"$f":"IF(ISERROR(INDEX(PR,MATCH(K113,PERSOS),2)),\"\",INDEX(PR,MATCH(K113,PERSOS),2))","v":""},{"$f":"IF(ISERROR(INDEX(PR,MATCH(L113,PERSOS),2)),\"\",INDEX(PR,MATCH(L113,PERSOS),2))","v":""},{"$f":"IF(ISERROR(INDEX(PR,MATCH(M113,PERSOS),2)),\"\",INDEX(PR,MATCH(M113,PERSOS),2))","v":""},{"$f":"IF(ISERROR(INDEX(PR,MATCH(N113,PERSOS),2)),\"\",INDEX(PR,MATCH(N113,PERSOS),2))","v":""},{"$f":"IF(ISERROR(INDEX(PR,MATCH(O113,PERSOS),2)),\"\",INDEX(PR,MATCH(O113,PERSOS),2))","v":""}]
[null,null,"Ray",null,null,null,"Margaret"]
[null,null,"Ray",null,null,null,"Carol",null,null,null,{"$f":"IF(ISERROR(INDEX(PR,MATCH(K115,PERSOS),2)),\"\",INDEX(PR,MATCH(K115,PERSOS),2))","v":""},{"$f":"IF(ISERROR(INDEX(PR,MATCH(L115,PERSOS),2)),\"\",INDEX(PR,MATCH(L115,PERSOS),2))","v":""},{"$f":"IF(ISERROR(INDEX(PR,MATCH(M115,PERSOS),2)),\"\",INDEX(PR,MATCH(M115,PERSOS),2))","v":""},{"$f":"IF(ISERROR(INDEX(PR,MATCH(N115,PERSOS),2)),\"\",INDEX(PR,MATCH(N115,PERSOS),2))","v":""},{"$f":"IF(ISERROR(INDEX(PR,MATCH(O115,PERSOS),2)),\"\",INDEX(PR,MATCH(O115,PERSOS),2))","v":""}]
[null,null,"Gabriel",null,null,null,"Margaret"]
[null,null,"Ray",null,null,null,"Margaret",null,null,null,{"$f":"IF(ISERROR(INDEX(PR,MATCH(K117,PERSOS),2)),\"\",INDEX(PR,MATCH(K117,PERSOS),2))","v":""},{"$f":"IF(ISERROR(INDEX(PR,MATCH(L117,PERSOS),2)),\"\",INDEX(PR,MATCH(L117,PERSOS),2))","v":""},{"$f":"IF(ISERROR(INDEX(PR,MATCH(M117,PERSOS),2)),\"\",INDEX(PR,MATCH(M117,PERSOS),2))","v":""},{"$f":"IF(ISERROR(INDEX(PR,MATCH(N117,PERSOS),2)),\"\",INDEX(PR,MATCH(N117,PERSOS),2))","v":""},{"$f":"IF(ISERROR(INDEX(PR,MATCH(O117,PERSOS),2)),\"\",INDEX(PR,MATCH(O117,PERSOS),2))","v":""}]
[null,null,"Darren",null,null,null,"Neil"]
[null,null,"Gabriel",null,null,null,"Carol",null,null,null,{"$f":"IF(ISERROR(INDEX(PR,MATCH(K119,PERSOS),2)),\"\",INDEX(PR,MATCH(K119,PERSOS),2))","v":""},{"$f":"IF(ISERROR(INDEX(PR,MATCH(L119,PERSOS),2)),\"\",INDEX(PR,MATCH(L119,PERSOS),2))","v":""},{"$f":"IF(ISERROR(INDEX(PR,MATCH(M119,PERSOS),2)),\"\",INDEX(PR,MATCH(M119,PERSOS),2))","v":""},{"$f":"IF(ISERROR(INDEX(PR,MATCH(N119,PERSOS),2)),\"\",INDEX(PR,MATCH(N119,PERSOS),2))","v":""},{"$f":"IF(ISERROR(INDEX(PR,MATCH(O119,PERSOS),2)),\"\",INDEX(PR,MATCH(O119,PERSOS),2))","v":""}]
[null,null,"Angela",null,null,null,"Margaret"]
[null,null,"Ray",null,null,null,"Neil",null,null,null,{"$f":"IF(ISERROR(INDEX(PR,MATCH(K121,PERSOS),2)),\"\",INDEX(PR,MATCH(K121,PERSOS),2))","v":""},{"$f":"IF(ISERROR(INDEX(PR,MATCH(L121,PERSOS),2)),\"\",INDEX(PR,MATCH(L121,PERSOS),2))","v":""},{"$f":"IF(ISERROR(INDEX(PR,MATCH(M121,PERSOS),2)),\"\",INDEX(PR,MATCH(M121,PERSOS),2))","v":""},{"$f":"IF(ISERROR(INDEX(PR,MATCH(N121,PERSOS),2)),\"\",INDEX(PR,MATCH(N121,PERSOS),2))","v":""},{"$f":"IF(ISERROR(INDEX(PR,MATCH(O121,PERSOS),2)),\"\",INDEX(PR,MATCH(O121,PERSOS),2))","v":""}]
[null,null,"Angela",null,null,null,"Ashley"]
[null,null,"Ray",null,null,null,"Margaret",null,null,null,{"$f":"IF(ISERROR(INDEX(PR,MATCH(K123,PERSOS),2)),\"\",INDEX(PR,MATCH(K123,PERSOS),2))","v":""},{"$f":"IF(ISERROR(INDEX(PR,MATCH(L123,PERSOS),2)),\"\",INDEX(PR,MATCH(L123,PERSOS),2))","v":""},{"$f":"IF(ISERROR(INDEX(PR,MATCH(M123,PERSOS),2)),\"\",INDEX(PR,MATCH(M123,PERSOS),2))","v":""},{"$f":"IF(ISERROR(INDEX(PR,MATCH(N123,PERSOS),2)),\"\",INDEX(PR,MATCH(N123,PERSOS),2))","v":""},{"$f":"IF(ISERROR(INDEX(PR,MATCH(O123,PERSOS),2)),\"\",INDEX(PR,MATCH(O123,PERSOS),2))","v":""}]
[null,null,"Darren",null,null,null,"Margaret"]
[null,null,"Gabriel",null,null,null,"Neil",null,null,null,{"$f":"IF(ISERROR(INDEX(PR,MATCH(K125,PERSOS),2)),\"\",INDEX(PR,MATCH(K125,PERSOS),2))","v":""},{"$f":"IF(ISERROR(INDEX(PR,MATCH(L125,PERSOS),2)),\"\",INDEX(PR,MATCH(L125,PERSOS),2))","v":""},{"$f":"IF(ISERROR(INDEX(PR,MATCH(M125,PERSOS),2)),\"\",INDEX(PR,MATCH(M125,PERSOS),2))","v":""},{"$f":"IF(ISERROR(INDEX(PR,MATCH(N125,PERSOS),2)),\"\",INDEX(PR,MATCH(N125,PERSOS),2))","v":""},{"$f":"IF(ISERROR(INDEX(PR,MATCH(O125,PERSOS),2)),\"\",INDEX(PR,MATCH(O125,PERSOS),2))","v":""}]
[null,null,"Ray",null,null,null,"Margaret"]
[null,null,"Angela",null,null,null,"Neil",null,null,null,{"$f":"IF(ISERROR(INDEX(PR,MATCH(K127,PERSOS),2)),\"\",INDEX(PR,MATCH(K127,PERSOS),2))","v":""},{"$f":"IF(ISERROR(INDEX(PR,MATCH(L127,PERSOS),2)),\"\",INDEX(PR,MATCH(L127,PERSOS),2))","v":""},{"$f":"IF(ISERROR(INDEX(PR,MATCH(M127,PERSOS),2)),\"\",INDEX(PR,MATCH(M127,PERSOS),2))","v":""},{"$f":"IF(ISERROR(INDEX(PR,MATCH(N127,PERSOS),2)),\"\",INDEX(PR,MATCH(N127,PERSOS),2))","v":""},{"$f":"IF(ISERROR(INDEX(PR,MATCH(O127,PERSOS),2)),\"\",INDEX(PR,MATCH(O127,PERSOS),2))","v":""}]
[null,null,"Gabriel",null,null,null,"Margaret"]
[null,null,"Ray",null,null,null,"Margaret",null,null,null,{"$f":"IF(ISERROR(INDEX(PR,MATCH(K129,PERSOS),2)),\"\",INDEX(PR,MATCH(K129,PERSOS),2))","v":""},{"$f":"IF(ISERROR(INDEX(PR,MATCH(L129,PERSOS),2)),\"\",INDEX(PR,MATCH(L129,PERSOS),2))","v":""},{"$f":"IF(ISERROR(INDEX(PR,MATCH(M129,PERSOS),2)),\"\",INDEX(PR,MATCH(M129,PERSOS),2))","v":""},{"$f":"IF(ISERROR(INDEX(PR,MATCH(N129,PERSOS),2)),\"\",INDEX(PR,MATCH(N129,PERSOS),2))","v":""},{"$f":"IF(ISERROR(INDEX(PR,MATCH(O129,PERSOS),2)),\"\",INDEX(PR,MATCH(O129,PERSOS),2))","v":""}]
[null,null,"Gabriel",null,null,null,"Margaret"]
[null,null,"Ray",null,null,null,"Carol",null,null,null,{"$f":"IF(ISERROR(INDEX(PR,MATCH(K131,PERSOS),2)),\"\",INDEX(PR,MATCH(K131,PERSOS),2))","v":""},{"$f":"IF(ISERROR(INDEX(PR,MATCH(L131,PERSOS),2)),\"\",INDEX(PR,MATCH(L131,PERSOS),2))","v":""},{"$f":"IF(ISERROR(INDEX(PR,MATCH(M131,PERSOS),2)),\"\",INDEX(PR,MATCH(M131,PERSOS),2))","v":""},{"$f":"IF(ISERROR(INDEX(PR,MATCH(N131,PERSOS),2)),\"\",INDEX(PR,MATCH(N131,PERSOS),2))","v":""},{"$f":"IF(ISERROR(INDEX(PR,MATCH(O131,PERSOS),2)),\"\",INDEX(PR,MATCH(O131,PERSOS),2))","v":""}]
[null,null,"Darren",null,null,null,"Neil"]
[null,null,"Darren",null,null,null,"Ashley",null,null,null,{"$f":"IF(ISERROR(INDEX(PR,MATCH(K133,PERSOS),2)),\"\",INDEX(PR,MATCH(K133,PERSOS),2))","v":""},{"$f":"IF(ISERROR(INDEX(PR,MATCH(L133,PERSOS),2)),\"\",INDEX(PR,MATCH(L133,PERSOS),2))","v":""},{"$f":"IF(ISERROR(INDEX(PR,MATCH(M133,PERSOS),2)),\"\",INDEX(PR,MATCH(M133,PERSOS),2))","v":""},{"$f":"IF(ISERROR(INDEX(PR,MATCH(N133,PERSOS),2)),\"\",INDEX(PR,MATCH(N133,PERSOS),2))","v":""},{"$f":"IF(ISERROR(INDEX(PR,MATCH(O133,PERSOS),2)),\"\",INDEX(PR,MATCH(O133,PERSOS),2))","v":""}]
[null,null,"Ray",null,null,null,"Neil"]
[null,null,"Gabriel",null,null,null,"Ashley",null,null,null,{"$f":"IF(ISERROR(INDEX(PR,MATCH(K135,PERSOS),2)),\"\",INDEX(PR,MATCH(K135,PERSOS),2))","v":""},{"$f":"IF(ISERROR(INDEX(PR,MATCH(L135,PERSOS),2)),\"\",INDEX(PR,MATCH(L135,PERSOS),2))","v":""},{"$f":"IF(ISERROR(INDEX(PR,MATCH(M135,PERSOS),2)),\"\",INDEX(PR,MATCH(M135,PERSOS),2))","v":""},{"$f":"IF(ISERROR(INDEX(PR,MATCH(N135,PERSOS),2)),\"\",INDEX(PR,MATCH(N135,PERSOS),2))","v":""},{"$f":"IF(ISERROR(INDEX(PR,MATCH(O135,PERSOS),2)),\"\",INDEX(PR,MATCH(O135,PERSOS),2))","v":""}]
[null,null,"Ray",null,null,null,"Ashley"]
[null,null,"Gabriel",null,null,null,"Carol",null,null,null,{"$f":"IF(ISERROR(INDEX(PR,MATCH(K137,PERSOS),2)),\"\",INDEX(PR,MATCH(K137,PERSOS),2))","v":""},{"$f":"IF(ISERROR(INDEX(PR,MATCH(L137,PERSOS),2)),\"\",INDEX(PR,MATCH(L137,PERSOS),2))","v":""},{"$f":"IF(ISERROR(INDEX(PR,MATCH(M137,PERSOS),2)),\"\",INDEX(PR,MATCH(M137,PERSOS),2))","v":""},{"$f":"IF(ISERROR(INDEX(PR,MATCH(N137,PERSOS),2)),\"\",INDEX(PR,MATCH(N137,PERSOS),2))","v":""},{"$f":"IF(ISERROR(INDEX(PR,MATCH(O137,PERSOS),2)),\"\",INDEX(PR,MATCH(O137,PERSOS),2))","v":""}]
[null,null,"Ray",null,null,null,"Margaret"]
[null,null,"Angela",null,null,null,"Neil",null,null,null,{"$f":"IF(ISERROR(INDEX(PR,MATCH(K139,PERSOS),2)),\"\",INDEX(PR,MATCH(K139,PERSOS),2))","v":""},{"$f":"IF(ISERROR(INDEX(PR,MATCH(L139,PERSOS),2)),\"\",INDEX(PR,MATCH(L139,PERSOS),2))","v":""},{"$f":"IF(ISERROR(INDEX(PR,MATCH(M139,PERSOS),2)),\"\",INDEX(PR,MATCH(M139,PERSOS),2))","v":""},{"$f":"IF(ISERROR(INDEX(PR,MATCH(N139,PERSOS),2)),\"\",INDEX(PR,MATCH(N139,PERSOS),2))","v":""},{"$f":"IF(ISERROR(INDEX(PR,MATCH(O139,PERSOS),2)),\"\",INDEX(PR,MATCH(O139,PERSOS),2))","v":""}]
[null,null,"Ray",null,null,null,"Neil"]
[null,null,"Ray",null,null,null,"Margaret",null,null,null,{"$f":"IF(ISERROR(INDEX(PR,MATCH(K141,PERSOS),2)),\"\",INDEX(PR,MATCH(K141,PERSOS),2))","v":""},{"$f":"IF(ISERROR(INDEX(PR,MATCH(L141,PERSOS),2)),\"\",INDEX(PR,MATCH(L141,PERSOS),2))","v":""},{"$f":"IF(ISERROR(INDEX(PR,MATCH(M141,PERSOS),2)),\"\",INDEX(PR,MATCH(M141,PERSOS),2))","v":""},{"$f":"IF(ISERROR(INDEX(PR,MATCH(N141,PERSOS),2)),\"\",INDEX(PR,MATCH(N141,PERSOS),2))","v":""},{"$f":"IF(ISERROR(INDEX(PR,MATCH(O141,PERSOS),2)),\"\",INDEX(PR,MATCH(O141,PERSOS),2))","v":""}]
[null,null,"Darren",null,null,null,"Neil"]
[null,null,"Ray",null,null,null,"Neil",null,null,null,{"$f":"IF(ISERROR(INDEX(PR,MATCH(K143,PERSOS),2)),\"\",INDEX(PR,MATCH(K143,PERSOS),2))","v":""},{"$f":"IF(ISERROR(INDEX(PR,MATCH(L143,PERSOS),2)),\"\",INDEX(PR,MATCH(L143,PERSOS),2))","v":""},{"$f":"IF(ISERROR(INDEX(PR,MATCH(M143,PERSOS),2)),\"\",INDEX(PR,MATCH(M143,PERSOS),2))","v":""},{"$f":"IF(ISERROR(INDEX(PR,MATCH(N143,PERSOS),2)),\"\",INDEX(PR,MATCH(N143,PERSOS),2))","v":""},{"$f":"IF(ISERROR(INDEX(PR,MATCH(O143,PERSOS),2)),\"\",INDEX(PR,MATCH(O143,PERSOS),2))","v":""}]
[null,null,"Ray",null,null,null,"Neil"]
[null,null,"Ray",null,null,null,"Margaret",null,null,null,{"$f":"IF(ISERROR(INDEX(PR,MATCH(K145,PERSOS),2)),\"\",INDEX(PR,MATCH(K145,PERSOS),2))","v":""},{"$f":"IF(ISERROR(INDEX(PR,MATCH(L145,PERSOS),2)),\"\",INDEX(PR,MATCH(L145,PERSOS),2))","v":""},{"$f":"IF(ISERROR(INDEX(PR,MATCH(M145,PERSOS),2)),\"\",INDEX(PR,MATCH(M145,PERSOS),2))","v":""},{"$f":"IF(ISERROR(INDEX(PR,MATCH(N145,PERSOS),2)),\"\",INDEX(PR,MATCH(N145,PERSOS),2))","v":""},{"$f":"IF(ISERROR(INDEX(PR,MATCH(O145,PERSOS),2)),\"\",INDEX(PR,MATCH(O145,PERSOS),2))","v":""}]
[null,null,"Ray",null,null,null,"Neil"]
[null,null,"Ray"]
[null,null,"Angela"]
[null,null,"Darren"]
[null,null,"Ray"]
[null,null,"Ray"]
[null,null,"Angela"]
[null,null,"Angela"]
[null,null,"Ray"]
[null,null,"Ray"]
[null,null,"Ray"]
[null,null,"Ray"]
[null,null,"Ray"]
[null,null,"Angela"]
[null,null,"Ray"]
[null,null,"Ray"]
[null,null,"Angela"]
[null,null,"Ray"]
[null,null,"Ray"]
[null,null,"Angela"]
[null,null,"Darren"]
[null,null,"Ray"]
[null,null,"Ray"]
[null,null,"Darren"]
[null,null,"Ray"]
[null,null,"Ray"]
[null,null,"Ray"]
[null,null,"Darren"]
[null,null,"Ray"]
[null,null,"Ray"]
[null,null,"Ray"]
[null,null,"Darren"]
[null,null,"Gabriel"]
[null,null,"Ray"]
[null,null,"Darren"]
[null,null,"Angela"]
[null,null,"Angela"]
[null,null,"Ray"]
[null,null,"Angela"]
[null,null,"Ray"]
[null,null,"Ray"]
[null,null,"Ray"]
[null,null,"Ray"]
[null,null,"Ray"]
[null,null,"Ray"]
[null,null,"Gabriel"]
[null,null,"Gabriel"]
[null,null,"Ray"]
[null,null,"Ray"]
[null,null,"Ray"]
[null,null,"Ray"]
[null,null,"Ray"]
[null,null,"Gabriel"]
[null,null,"Gabriel"]

{"sheet":"STATS CAMPS","index":2,"n_rows":1407,"n_cols":18,"rows_kept":1407,"cut":false,"hidden":true,"merged":[[31,1,32,1],[73,1,74,1],[33,1,34,1],[35,1,36,1],[37,1,38,1],[39,1,40,1],[41,1,42,1],[43,1,44,1],[59,1,60,1],[61,1,62,1],[63,1,64,1],[57,1,58,1],[45,1,46,1],[85,1,86,1],[83,1,84,1],[81,1,82,1],[79,1,80,1],[77,1,78,1],[71,1,72,1],[69,1,70,1],[67,1,68,1],[65,1,66,1],[103,1,104,1],[101,1,102,1],[99,1,100,1],[97,1,98,1],[95,1,96,1],[93,1,94,1],[91,1,92,1],[89,1,90,1],[87,1,88,1],[165,1,166,1],[213,1,214,1],[215,1,216,1],[121,1,122,1],[123,1,124,1],[125,1,126,1],[127,1,128,1],[129,1,130,1],[131,1,132,1],[133,1,134,1],[209,1,210,1],[169,1,170,1],[187,1,188,1],[193,1,194,1],[195,1,196,1],[197,1,198,1],[181,1,182,1],[171,1,172,1],[173,1,174,1],[189,1,190,1],[191,1,192,1],[179,1,180,1],[185,1,186,1],[115,1,116,1],[113,1,114,1],[109,1,110,1],[107,1,108,1],[105,1,106,1],[141,1,142,1],[143,1,144,1],[161,1,162,1],[163,1,164,1],[1111,1,1112,1],[437,1,438,1],[435,1,436,1],[433,1,434,1],[429,1,430,1],[427,1,428,1],[425,1,426,1],[423,1,424,1],[421,1,422,1],[997,1,998,1],[999,1,1000,1],[1001,1,1002,1],[1003,1,1004,1],[977,1,978,1],[979,1,980,1],[993,1,994,1],[983,1,984,1],[985,1,986,1],[981,1,982,1],[991,1,992,1],[1011,1,1012,1],[1017,1,1018,1],[1013,1,1014,1],[1015,1,1016,1],[1115,1,1116,1],[1117,1,1118,1],[1121,1,1122,1],[1123,1,1124,1],[1145,1,1146,1],[1127,1,1128,1],[1113,1,1114,1],[1125,1,1126,1],[1141,1,1142,1],[1143,1,1144,1],[1119,1,1120,1],[1129,1,1130,1],[1131,1,1132,1],[1137,1,1138,1],[1139,1,1140,1],[1305,1,1306,1],[1307,1,1308,1],[1309,1,1310,1],[1311,1,1312,1],[1313,1,1314,1],[1315,1,1316,1],[1317,1,1318,1],[1319,1,1320,1],[1287,1,1288,1],[1289,1,1290,1],[1405,1,1406,1],[1407,1,1408,1],[1379,1,1380,1],[1381,1,1382,1],[1383,1,1384,1],[1385,1,1386,1],[1387,1,1388,1],[1389,1,1390,1],[1391,1,1392,1],[1393,1,1394,1],[1395,1,1396,1],[1397,1,1398,1],[1357,1,1358,1],[1359,1,1360,1],[1361,1,1362,1],[1363,1,1364,1],[1367,1,1368,1],[1365,1,1366,1],[1399,1,1400,1],[1401,1,1402,1],[1403,1,1404,1],[1369,1,1370,1],[1371,1,1372,1],[1373,1,1374,1],[1375,1,1376,1],[1377,1,1378,1],[1339,1,1340,1],[1341,1,1342,1],[1343,1,1344,1],[1345,1,1346,1],[1347,1,1348,1],[1349,1,1350,1],[1351,1,1352,1],[1353,1,1354,1],[1355,1,1356,1],[1227,1,1228,1],[1229,1,1230,1],[1325,1,1326,1],[1327,1,1328,1],[1329,1,1330,1],[1331,1,1332,1],[1333,1,1334,1],[1335,1,1336,1],[1337,1,1338,1],[1295,1,1296,1],[1283,1,1284,1],[1273,1,1274,1],[1275,1,1276,1],[1279,1,1280,1],[1277,1,1278,1],[1323,1,1324,1],[1281,1,1282,1],[1321,1,1322,1],[1291,1,1292,1],[1293,1,1294,1],[1297,1,1298,1],[1299,1,1300,1],[1301,1,1302,1],[1303,1,1304,1],[1221,1,1222,1],[1223,1,1224,1],[1225,1,1226,1],[1199,1,1200,1],[1201,1,1202,1],[1203,1,1204,1],[1185,1,1186,1],[1205,1,1206,1],[1211,1,1212,1],[1207,1,1208,1],[1209,1,1210,1],[1217,1,1218,1],[1219,1,1220,1],[1193,1,1194,1],[1191,1,1192,1],[1187,1,1188,1],[1189,1,1190,1],[1195,1,1196,1],[1197,1,1198,1],[1213,1,1214,1],[1215,1,1216,1],[1161,1,1162,1],[1173,1,1174,1],[1175,1,1176,1],[1177,1,1178,1],[1179,1,1180,1],[1181,1,1182,1],[1183,1,1184,1],[1133,1,1134,1],[1135,1,1136,1],[1171,1,1172,1],[1167,1,1168,1],[1169,1,1170,1],[1159,1,1160,1],[1147,1,1148,1],[1149,1,1150,1],[1151,1,1152,1],[1153,1,1154,1],[1155,1,1156,1],[1157,1,1158,1],[1163,1,1164,1],[1165,1,1166,1],[1255,1,1256,1],[1257,1,1258,1],[1253,1,1254,1],[1285,1,1286,1],[1245,1,1246,1],[1247,1,1248,1],[1261,1,1262,1],[1259,1,1260,1],[1263,1,1264,1],[1265,1,1266,1],[1267,1,1268,1],[1269,1,1270,1],[1271,1,1272,1],[1233,1,1234,1],[1235,1,1236,1],[1249,1,1250,1],[1251,1,1252,1],[1237,1,1238,1],[1239,1,1240,1],[1243,1,1244,1],[1241,1,1242,1],[1231,1,1232,1],[953,1,954,1],[945,1,946,1],[947,1,948,1],[951,1,952,1],[949,1,950,1],[955,1,956,1],[975,1,976,1],[973,1,974,1],[967,1,968,1],[969,1,970,1],[971,1,972,1],[959,1,960,1],[961,1,962,1],[957,1,958,1],[1005,1,1006,1],[1019,1,1020,1],[1009,1,1010,1],[1007,1,1008,1],[963,1,964,1],[965,1,966,1],[987,1,988,1],[989,1,990,1],[995,1,996,1],[1093,1,1094,1],[1095,1,1096,1],[1051,1,1052,1],[1053,1,1054,1],[1055,1,1056,1],[1057,1,1058,1],[1047,1,1048,1],[1049,1,1050,1],[1063,1,1064,1],[1065,1,1066,1],[1067,1,1068,1],[1085,1,1086,1],[1061,1,1062,1],[1039,1,1040,1],[1059,1,1060,1],[1025,1,1026,1],[1027,1,1028,1],[1097,1,1098,1],[469,1,470,1],[1103,1,1104,1],[823,1,824,1],[487,1,488,1],[481,1,482,1],[483,1,484,1],[485,1,486,1],[471,1,472,1],[811,1,812,1],[813,1,814,1],[819,1,820,1],[821,1,822,1],[599,1,600,1],[601,1,602,1],[591,1,592,1],[589,1,590,1],[579,1,580,1],[1099,1,1100,1],[1091,1,1092,1],[1105,1,1106,1],[1107,1,1108,1],[1109,1,1110,1],[1101,1,1102,1],[1087,1,1088,1],[1089,1,1090,1],[1021,1,1022,1],[1023,1,1024,1],[1029,1,1030,1],[1031,1,1032,1],[1033,1,1034,1],[1035,1,1036,1],[1041,1,1042,1],[1043,1,1044,1],[1069,1,1070,1],[1071,1,1072,1],[1073,1,1074,1],[1075,1,1076,1],[1077,1,1078,1],[1079,1,1080,1],[1081,1,1082,1],[1083,1,1084,1],[1045,1,1046,1],[1037,1,1038,1],[467,1,468,1],[457,1,458,1],[455,1,456,1],[459,1,460,1],[443,1,444,1],[445,1,446,1],[447,1,448,1],[449,1,450,1],[451,1,452,1],[453,1,454,1],[403,1,404,1],[405,1,406,1],[415,1,416,1],[417,1,418,1],[419,1,420,1],[407,1,408,1],[409,1,410,1],[411,1,412,1],[413,1,414,1],[851,1,852,1],[827,1,828,1],[829,1,830,1],[825,1,826,1],[907,1,908,1],[909,1,910,1],[919,1,920,1],[915,1,916,1],[917,1,918,1],[913,1,914,1],[901,1,902,1],[903,1,904,1],[905,1,906,1],[911,1,912,1],[881,1,882,1],[883,1,884,1],[885,1,886,1],[887,1,888,1],[857,1,858,1],[855,1,856,1],[833,1,834,1],[847,1,848,1],[849,1,850,1],[831,1,832,1],[347,1,348,1],[349,1,350,1],[1,14,1,17],[1,1,1,11],[6,15,6,17],[2,15,2,17],[3,15,3,17],[5,15,5,17],[4,15,4,17],[7,15,7,17],[117,1,118,1],[119,1,120,1],[147,1,148,1],[149,1,150,1],[137,1,138,1],[139,1,140,1],[183,1,184,1],[151,1,152,1],[157,1,158,1],[159,1,160,1],[135,1,136,1],[153,1,154,1],[155,1,156,1],[167,1,168,1],[289,1,290,1],[317,1,318,1],[299,1,300,1],[301,1,302,1],[303,1,304,1],[211,1,212,1],[575,1,576,1],[577,1,578,1],[489,1,490,1],[493,1,494,1],[491,1,492,1],[305,1,306,1],[307,1,308,1],[309,1,310,1],[365,1,366,1],[367,1,368,1],[319,1,320,1],[567,1,568,1],[569,1,570,1],[527,1,528,1],[549,1,550,1],[341,1,342,1],[343,1,344,1],[345,1,346,1],[219,1,220,1],[285,1,286,1],[287,1,288,1],[271,1,272,1],[273,1,274,1],[275,1,276,1],[277,1,278,1],[279,1,280,1],[281,1,282,1],[283,1,284,1],[257,1,258,1],[259,1,260,1],[243,1,244,1],[245,1,246,1],[247,1,248,1],[249,1,250,1],[251,1,252,1],[253,1,254,1],[255,1,256,1],[217,1,218,1],[203,1,204,1],[201,1,202,1],[199,1,200,1],[8,15,8,17],[13,14,13,17],[9,15,9,17],[29,1,30,1],[17,1,18,1],[19,1,20,1],[21,1,22,1],[23,1,24,1],[25,1,26,1],[27,1,28,1],[15,1,16,1],[13,1,13,11],[47,1,48,1],[49,1,50,1],[51,1,52,1],[53,1,54,1],[55,1,56,1],[75,1,76,1],[111,1,112,1],[145,1,146,1],[353,1,354,1],[477,1,478,1],[441,1,442,1],[383,1,384,1],[385,1,386,1],[387,1,388,1],[389,1,390,1],[391,1,392,1],[393,1,394,1],[395,1,396,1],[369,1,370,1],[371,1,372,1],[373,1,374,1],[375,1,376,1],[431,1,432,1],[439,1,440,1],[397,1,398,1],[399,1,400,1],[401,1,402,1],[473,1,474,1],[475,1,476,1],[461,1,462,1],[463,1,464,1],[465,1,466,1],[593,1,594,1],[533,1,534,1],[535,1,536,1],[537,1,538,1],[541,1,542,1],[539,1,540,1],[543,1,544,1],[547,1,548,1],[545,1,546,1],[551,1,552,1],[553,1,554,1],[555,1,556,1],[587,1,588,1],[571,1,572,1],[573,1,574,1],[581,1,582,1],[583,1,584,1],[585,1,586,1],[515,1,516,1],[517,1,518,1],[295,1,296,1],[297,1,298,1],[175,1,176,1],[177,1,178,1],[205,1,206,1],[207,1,208,1],[327,1,328,1],[329,1,330,1],[331,1,332,1],[333,1,334,1],[335,1,336,1],[337,1,338,1],[339,1,340,1],[377,1,378,1],[379,1,380,1],[381,1,382,1],[355,1,356,1],[357,1,358,1],[359,1,360,1],[361,1,362,1],[363,1,364,1],[351,1,352,1],[941,1,942,1],[943,1,944,1],[931,1,932,1],[899,1,900,1],[897,1,898,1],[873,1,874,1],[519,1,520,1],[521,1,522,1],[529,1,530,1],[531,1,532,1],[523,1,524,1],[525,1,526,1],[661,1,662,1],[663,1,664,1],[605,1,606,1],[607,1,608,1],[603,1,604,1],[557,1,558,1],[559,1,560,1],[561,1,562,1],[595,1,596,1],[597,1,598,1],[563,1,564,1],[565,1,566,1],[937,1,938,1],[939,1,940,1],[927,1,928,1],[929,1,930,1],[933,1,934,1],[935,1,936,1],[921,1,922,1],[923,1,924,1],[925,1,926,1],[323,1,324,1],[325,1,326,1],[311,1,312,1],[221,1,222,1],[223,1,224,1],[225,1,226,1],[241,1,242,1],[229,1,230,1],[231,1,232,1],[233,1,234,1],[235,1,236,1],[237,1,238,1],[239,1,240,1],[227,1,228,1],[291,1,292,1],[269,1,270,1],[293,1,294,1],[313,1,314,1],[315,1,316,1],[261,1,262,1],[263,1,264,1],[265,1,266,1],[267,1,268,1],[321,1,322,1],[727,1,728,1],[729,1,730,1],[765,1,766,1],[609,1,610,1],[611,1,612,1],[613,1,614,1],[777,1,778,1],[643,1,644,1],[759,1,760,1],[731,1,732,1],[709,1,710,1],[711,1,712,1],[713,1,714,1],[725,1,726,1],[715,1,716,1],[717,1,718,1],[719,1,720,1],[721,1,722,1],[723,1,724,1],[679,1,680,1],[681,1,682,1],[683,1,684,1],[685,1,686,1],[691,1,692,1],[695,1,696,1],[707,1,708,1],[697,1,698,1],[699,1,700,1],[701,1,702,1],[703,1,704,1],[705,1,706,1],[499,1,500,1],[495,1,496,1],[497,1,498,1],[511,1,512,1],[509,1,510,1],[501,1,502,1],[615,1,616,1],[621,1,622,1],[623,1,624,1],[625,1,626,1],[653,1,654,1],[655,1,656,1],[635,1,636,1],[637,1,638,1],[639,1,640,1],[641,1,642,1],[513,1,514,1],[479,1,480,1],[505,1,506,1],[507,1,508,1],[503,1,504,1],[891,1,892,1],[889,1,890,1],[893,1,894,1],[895,1,896,1],[875,1,876,1],[877,1,878,1],[755,1,756,1],[757,1,758,1],[747,1,748,1],[749,1,750,1],[761,1,762,1],[763,1,764,1],[767,1,768,1],[769,1,770,1],[771,1,772,1],[773,1,774,1],[807,1,808,1],[805,1,806,1],[797,1,798,1],[799,1,800,1],[815,1,816,1],[817,1,818,1],[801,1,802,1],[803,1,804,1],[795,1,796,1],[789,1,790,1],[791,1,792,1],[775,1,776,1],[879,1,880,1],[809,1,810,1],[871,1,872,1],[865,1,866,1],[867,1,868,1],[869,1,870,1],[859,1,860,1],[861,1,862,1],[863,1,864,1],[835,1,836,1],[837,1,838,1],[839,1,840,1],[841,1,842,1],[843,1,844,1],[845,1,846,1],[853,1,854,1],[737,1,738,1],[785,1,786,1],[779,1,780,1],[781,1,782,1],[783,1,784,1],[751,1,752,1],[753,1,754,1],[787,1,788,1],[793,1,794,1],[739,1,740,1],[741,1,742,1],[743,1,744,1],[745,1,746,1],[733,1,734,1],[735,1,736,1],[617,1,618,1],[665,1,666,1],[627,1,628,1],[629,1,630,1],[631,1,632,1],[633,1,634,1],[619,1,620,1],[675,1,676,1],[669,1,670,1],[671,1,672,1],[673,1,674,1],[657,1,658,1],[659,1,660,1],[667,1,668,1],[687,1,688,1],[689,1,690,1],[677,1,678,1],[693,1,694,1],[645,1,646,1],[647,1,648,1],[649,1,650,1],[651,1,652,1]]}
[]
[null,"Statistiques pour les Camps d'exercice          (automatisé)",null,null,null,null,null,null,null,null,null,null,null,null,"Choix du meilleur camp         (automatisé)"]
[null,null,"Entrainement aux armes","Formation médicale","Formation à la stratégie","Entrainement tactique","Entrainement fondamental","Entrainement généraliste","Enrainement à la Guérilla","Entrainement avancé","Entrainement en milieu sauvage","Entrainement militaire",null,null,"Rôle","BEST ?"]
[null,"CITOYEN",{"$f":"ROUND(IF(ISERROR(COUNTIF(C$16:C$1411,$B4)*100/SUMPRODUCT(COUNTIF(ROLE,C16:C9999))),\"0,0\",COUNTIF(C$16:C$1411,$B4)*100/SUMPRODUCT(COUNTIF(ROLE,C16:C9999))),1)","v":21.2},0,60.6,16.3,58.3,98.5,0,60,0,0,null,null,"CITOYEN",{"$f":"IF(MAX(C4:L4)=0,\"\",INDEX($C$3:$L$10,1,MATCH(MAX(C4:L4),C4:L4,0)) & \" - \" & VALUE(MAX(C4:L4)) & \" %\")","v":"Entrainement généraliste - 98,5 %"}]
[null,"CHASSEUR",{"$f":"ROUND(IF(ISERROR(COUNTIF(C$16:C$1411,$B5)*100/SUMPRODUCT(COUNTIF(ROLE,C17:C10000))),\"0,0\",COUNTIF(C$16:C$1411,$B5)*100/SUMPRODUCT(COUNTIF(ROLE,C17:C10000))),1)","v":34.6},0,0,23.3,16.7,0,0,6.7,100,0,null,null,"CHASSEUR","Entrainement en milieu sauvage - 100 %"]
[null,"CHEF",{"$f":"ROUND(IF(ISERROR(COUNTIF(C$16:C$1411,$B6)*100/SUMPRODUCT(COUNTIF(ROLE,C18:C10001))),\"0,0\",COUNTIF(C$16:C$1411,$B6)*100/SUMPRODUCT(COUNTIF(ROLE,C18:C10001))),1)","v":31.4},15.5,0,0,0,0,0,0,0,0,null,null,"CHEF","Entrainement aux armes - 31,4 %"]
[null,"GARDIEN",{"$f":"ROUND(IF(ISERROR(COUNTIF(C$16:C$1411,$B7)*100/SUMPRODUCT(COUNTIF(ROLE,C19:C10002))),\"0,0\",COUNTIF(C$16:C$1411,$B7)*100/SUMPRODUCT(COUNTIF(ROLE,C19:C10002))),1)","v":0},85.4,0,0,8.6999999999999993,0,0,7.1,0,0,null,null,"GARDIEN","Formation médicale - 85,4 %"]
[null,"PROF",{"$f":"ROUND(IF(ISERROR(COUNTIF(C$16:C$1411,$B8)*100/SUMPRODUCT(COUNTIF(ROLE,C20:C10003))),\"0,0\",COUNTIF(C$16:C$1411,$B8)*100/SUMPRODUCT(COUNTIF(ROLE,C20:C10003))),1)","v":0},0,0,0,0,1.5,0,0,0,0,null,null,"PROF","Entrainement généraliste - 1,5 %"]
[null,"REBELLE",{"$f":"ROUND(IF(ISERROR(COUNTIF(C$16:C$1411,$B9)*100/SUMPRODUCT(COUNTIF(ROLE,C21:C10004))),\"0,0\",COUNTIF(C$16:C$1411,$B9)*100/SUMPRODUCT(COUNTIF(ROLE,C21:C10004))),1)","v":0},0,9.6999999999999993,26.8,9.1,0,0,15.4,0,0,null,null,"REBELLE","Entrainement tactique - 26,8 %"]
[null,"SOLDAT",{"$f":"ROUND(IF(ISERROR(COUNTIF(C$16:C$1411,$B10)*100/SUMPRODUCT(COUNTIF(ROLE,C22:C10005))),\"0,0\",COUNTIF(C$16:C$1411,$B10)*100/SUMPRODUCT(COUNTIF(ROLE,C22:C10005))),1)","v":14.3},0,33.299999999999997,37.5,9.5,0,0,16.7,0,0,null,null,"SOLDAT","Entrainement tactique - 37,5 %"]
[null,"TOTAL",{"$f":"SUM(C4:C10)","v":101.49999999999999},100.9,103.6,103.9,102.3,100,0,105.9,100,0]
[]
[null,null,null,null,{"$f":"COUNTIF(C$16:C$1408,$B4)","v":11},{"$f":"SUMPRODUCT(((C$16:C$21409=$B$4)+(C$16:C$21409=$B$5)+(C$16:C$21409=$B$6)+(C$16:C$21409=$B$7)+(C$16:C$21409=$B$8)+(C$16:C$21409=$B$9)+(C$16:C$21409=$B$10))*(C$16:C$21409>0))","v":52},{"$f":"SUMPRODUCT(((C$16:C$21409=$B$4)+(C$16:C$21409=$B$5)+(C$16:C$21409=$B$6)+(C$16:C$21409=$B$7)+(C$16:C$21409=$B$8)+(C$16:C$21409=$B$9)+(C$16:C$21409=$B$10))*(C$16:C$21409>0))","v":52},{"$f":"COUNTIF(C$16:C$1408,$B4)","v":11},{"$f":"SUMPRODUCT(COUNTIF(ROLE,C16:C119))","v":52},{"$f":"COUNTIF(C$16:C$1411,$B4)","v":11}]
[null,"Liste des rôles des personnages obtenus             (à remplir)",null,null,null,null,null,null,null,null,null,null,null,null,"Index des rôles des persos"]
[null,null,"Entrainement aux armes","Formation médicale","Formation à la stratégie","Entrainement tactique","Entrainement fondamental","Entrainement généraliste","Enrainement à la Guérilla","Entrainement avancé","Entrainement en milieu sauvage","Entrainement militaire",null,null,"Personnage","Rôle","Rareté","Drop ?"]
[null,1,"Carol","Gabriel","Brock","Diane","Clarence","Carol",null,"John","Christa",null,null,null,"Angela","CHEF","Inhabituel",{"$f":"IF(MAX(CALC!M4:V4)=0,\"Aucun\",(CHOOSE(INDEX(CALC!$M$3:$V$3,MATCH(MAX(CALC!M4:V4),CALC!M4:V4,0)),\"Entrainement aux armes\",\"Formation médicale\",\"Formation à la stratégie\",\"Entrainement tactique\",\"Entrainement fondamental\",\"Entrainement généraliste\",\"Enrainement à la Guérilla\",\"Entrainement avancé\",\"Entrainement en milieu sauvage\",\"Entrainement militaire\")))","v":"Formation médicale"}]
[null,null,{"$f":"IF(ISERROR(INDEX($O$16:$P$55,MATCH(C16,$O$16:$O$55),2)),\"\",INDEX($O$16:$P$55,MATCH(C16,$O$16:$O$55),2))","v":"CITOYEN"},"GARDIEN","SOLDAT","SOLDAT","REBELLE","CITOYEN","","CITOYEN","CHASSEUR","",null,null,"Ashley","CITOYEN","Inhabituel",{"$f":"IF(MAX(CALC!M5:V5)=0,\"Aucun\",(CHOOSE(INDEX(CALC!$M$3:$V$3,MATCH(MAX(CALC!M5:V5),CALC!M5:V5,0)),\"Entrainement aux armes\",\"Formation médicale\",\"Formation à la stratégie\",\"Entrainement tactique\",\"Entrainement fondamental\",\"Entrainement généraliste\",\"Enrainement à la Guérilla\",\"Entrainement avancé\",\"Entrainement en milieu sauvage\",\"Entrainement militaire\")))","v":"Entrainement généraliste"}]
[null,2,"Carol","Gabriel","Margaret","Diane","Cyrus","Carol",null,"Gerald","Christa",null,null,null,"Brigitte","SOLDAT","Inhabituel",{"$f":"IF(MAX(CALC!M6:V6)=0,\"Aucun\",(CHOOSE(INDEX(CALC!$M$3:$V$3,MATCH(MAX(CALC!M6:V6),CALC!M6:V6,0)),\"Entrainement aux armes\",\"Formation médicale\",\"Formation à la stratégie\",\"Entrainement tactique\",\"Entrainement fondamental\",\"Entrainement généraliste\",\"Enrainement à la Guérilla\",\"Entrainement avancé\",\"Entrainement en milieu sauvage\",\"Entrainement militaire\")))","v":"Entrainement tactique"}]
[null,null,{"$f":"IF(ISERROR(INDEX($O$16:$P$55,MATCH(C18,$O$16:$O$55),2)),\"\",INDEX($O$16:$P$55,MATCH(C18,$O$16:$O$55),2))","v":"CITOYEN"},"GARDIEN","CITOYEN","SOLDAT","CHASSEUR","CITOYEN","","CITOYEN","CHASSEUR","",null,null,"Blaireau","SOLDAT","Inhabituel",{"$f":"IF(MAX(CALC!M7:V7)=0,\"Aucun\",(CHOOSE(INDEX(CALC!$M$3:$V$3,MATCH(MAX(CALC!M7:V7),CALC!M7:V7,0)),\"Entrainement aux armes\",\"Formation médicale\",\"Formation à la stratégie\",\"Entrainement tactique\",\"Entrainement fondamental\",\"Entrainement généraliste\",\"Enrainement à la Guérilla\",\"Entrainement avancé\",\"Entrainement en milieu sauvage\",\"Entrainement militaire\")))","v":"Aucun"}]
[null,3,"Georges","Darren","Brock","Diane","Gerald","Margaret",null,"Gerald","Christa",null,null,null,"Brock","SOLDAT","Inhabituel",{"$f":"IF(MAX(CALC!M8:V8)=0,\"Aucun\",(CHOOSE(INDEX(CALC!$M$3:$V$3,MATCH(MAX(CALC!M8:V8),CALC!M8:V8,0)),\"Entrainement aux armes\",\"Formation médicale\",\"Formation à la stratégie\",\"Entrainement tactique\",\"Entrainement fondamental\",\"Entrainement généraliste\",\"Enrainement à la Guérilla\",\"Entrainement avancé\",\"Entrainement en milieu sauvage\",\"Entrainement militaire\")))","v":"Formation à la stratégie"}]
[null,null,{"$f":"IF(ISERROR(INDEX($O$16:$P$55,MATCH(C20,$O$16:$O$55),2)),\"\",INDEX($O$16:$P$55,MATCH(C20,$O$16:$O$55),2))","v":"CHEF"},"GARDIEN","SOLDAT","SOLDAT","CITOYEN","CITOYEN","","CITOYEN","CHASSEUR","",null,null,"Burt","PROF","Inhabituel",{"$f":"IF(MAX(CALC!M9:V9)=0,\"Aucun\",(CHOOSE(INDEX(CALC!$M$3:$V$3,MATCH(MAX(CALC!M9:V9),CALC!M9:V9,0)),\"Entrainement aux armes\",\"Formation médicale\",\"Formation à la stratégie\",\"Entrainement tactique\",\"Entrainement fondamental\",\"Entrainement généraliste\",\"Enrainement à la Guérilla\",\"Entrainement avancé\",\"Entrainement en milieu sauvage\",\"Entrainement militaire\")))","v":"Entrainement généraliste"}]
[null,4,"Carter","Darren","Brock","Randall","Danny","Ashley",null,"Ethel","Christa",null,null,null,"Caleb","CITOYEN","Ordinaire",{"$f":"IF(MAX(CALC!M10:V10)=0,\"Aucun\",(CHOOSE(INDEX(CALC!$M$3:$V$3,MATCH(MAX(CALC!M10:V10),CALC!M10:V10,0)),\"Entrainement aux armes\",\"Formation médicale\",\"Formation à la stratégie\",\"Entrainement tactique\",\"Entrainement fondamental\",\"Entrainement généraliste\",\"Enrainement à la Guérilla\",\"Entrainement avancé\",\"Entrainement en milieu sauvage\",\"Entrainement militaire\")))","v":"Entrainement fondamental"}]
[null,null,{"$f":"IF(ISERROR(INDEX($O$16:$P$55,MATCH(C22,$O$16:$O$55),2)),\"\",INDEX($O$16:$P$55,MATCH(C22,$O$16:$O$55),2))","v":"CHASSEUR"},"GARDIEN","SOLDAT","REBELLE","CITOYEN","CITOYEN","","SOLDAT","CHASSEUR","",null,null,"Carol","CITOYEN","Inhabituel",{"$f":"IF(MAX(CALC!M11:V11)=0,\"Aucun\",(CHOOSE(INDEX(CALC!$M$3:$V$3,MATCH(MAX(CALC!M11:V11),CALC!M11:V11,0)),\"Entrainement aux armes\",\"Formation médicale\",\"Formation à la stratégie\",\"Entrainement tactique\",\"Entrainement fondamental\",\"Entrainement généraliste\",\"Enrainement à la Guérilla\",\"Entrainement avancé\",\"Entrainement en milieu sauvage\",\"Entrainement militaire\")))","v":"Entrainement généraliste"}]
[null,5,"Carol","Darren","Margaret","Isabel","Ethel","Ashley",null,"Todd",null,null,null,null,"Carter","CHASSEUR","Inhabituel",{"$f":"IF(MAX(CALC!M12:V12)=0,\"Aucun\",(CHOOSE(INDEX(CALC!$M$3:$V$3,MATCH(MAX(CALC!M12:V12),CALC!M12:V12,0)),\"Entrainement aux armes\",\"Formation médicale\",\"Formation à la stratégie\",\"Entrainement tactique\",\"Entrainement fondamental\",\"Entrainement généraliste\",\"Enrainement à la Guérilla\",\"Entrainement avancé\",\"Entrainement en milieu sauvage\",\"Entrainement militaire\")))","v":"Entrainement aux armes"}]
[null,null,{"$f":"IF(ISERROR(INDEX($O$16:$P$55,MATCH(C24,$O$16:$O$55),2)),\"\",INDEX($O$16:$P$55,MATCH(C24,$O$16:$O$55),2))","v":"CITOYEN"},"GARDIEN","CITOYEN","CHASSEUR","SOLDAT","CITOYEN","","CITOYEN","","",null,null,"Charretier",null,"Inhabituel",{"$f":"IF(MAX(CALC!M13:V13)=0,\"Aucun\",(CHOOSE(INDEX(CALC!$M$3:$V$3,MATCH(MAX(CALC!M13:V13),CALC!M13:V13,0)),\"Entrainement aux armes\",\"Formation médicale\",\"Formation à la stratégie\",\"Entrainement tactique\",\"Entrainement fondamental\",\"Entrainement généraliste\",\"Enrainement à la Guérilla\",\"Entrainement avancé\",\"Entrainement en milieu sauvage\",\"Entrainement militaire\")))","v":"Aucun"}]
[null,6,"Mac","Ray","Brock","Randall","Ethel","Burt",null,"Susan",null,null,null,null,"Chris","REBELLE","Ordinaire",{"$f":"IF(MAX(CALC!M14:V14)=0,\"Aucun\",(CHOOSE(INDEX(CALC!$M$3:$V$3,MATCH(MAX(CALC!M14:V14),CALC!M14:V14,0)),\"Entrainement aux armes\",\"Formation médicale\",\"Formation à la stratégie\",\"Entrainement tactique\",\"Entrainement fondamental\",\"Entrainement généraliste\",\"Enrainement à la Guérilla\",\"Entrainement avancé\",\"Entrainement en milieu sauvage\",\"Entrainement militaire\")))","v":"Entrainement fondamental"}]
[null,null,{"$f":"IF(ISERROR(INDEX($O$16:$P$55,MATCH(C26,$O$16:$O$55),2)),\"\",INDEX($O$16:$P$55,MATCH(C26,$O$16:$O$55),2))","v":"CHASSEUR"},"GARDIEN","SOLDAT","REBELLE","SOLDAT","PROF","","CITOYEN","","",null,null,"Christa","CHASSEUR","Inhabituel",{"$f":"IF(MAX(CALC!M15:V15)=0,\"Aucun\",(CHOOSE(INDEX(CALC!$M$3:$V$3,MATCH(MAX(CALC!M15:V15),CALC!M15:V15,0)),\"Entrainement aux armes\",\"Formation médicale\",\"Formation à la stratégie\",\"Entrainement tactique\",\"Entrainement fondamental\",\"Entrainement généraliste\",\"Enrainement à la Guérilla\",\"Entrainement avancé\",\"Entrainement en milieu sauvage\",\"Entrainement militaire\")))","v":"Entrainement aux armes"}]
[null,7,"Garret","Gabriel","Brock","Randall","Jed","Carol",null,"Susan",null,null,null,null,"Clarence","REBELLE","Ordinaire",{"$f":"IF(MAX(CALC!M16:V16)=0,\"Aucun\",(CHOOSE(INDEX(CALC!$M$3:$V$3,MATCH(MAX(CALC!M16:V16),CALC!M16:V16,0)),\"Entrainement aux armes\",\"Formation médicale\",\"Formation à la stratégie\",\"Entrainement tactique\",\"Entrainement fondamental\",\"Entrainement généraliste\",\"Enrainement à la Guérilla\",\"Entrainement avancé\",\"Entrainement en milieu sauvage\",\"Entrainement militaire\")))","v":"Entrainement avancé"}]
[null,null,{"$f":"IF(ISERROR(INDEX($O$16:$P$55,MATCH(C28,$O$16:$O$55),2)),\"\",INDEX($O$16:$P$55,MATCH(C28,$O$16:$O$55),2))","v":"SOLDAT"},"GARDIEN","SOLDAT","REBELLE","CHASSEUR","CITOYEN","","CITOYEN","","",null,null,"Cletus","REBELLE","Inhabituel",{"$f":"IF(MAX(CALC!M17:V17)=0,\"Aucun\",(CHOOSE(INDEX(CALC!$M$3:$V$3,MATCH(MAX(CALC!M17:V17),CALC!M17:V17,0)),\"Entrainement aux armes\",\"Formation médicale\",\"Formation à la stratégie\",\"Entrainement tactique\",\"Entrainement fondamental\",\"Entrainement généraliste\",\"Enrainement à la Guérilla\",\"Entrainement avancé\",\"Entrainement en milieu sauvage\",\"Entrainement militaire\")))","v":"Formation à la stratégie"}]
[null,8,"Garret","Gabriel","Cletus","Isabel","Chris","Neil",null,"Cyrus",null,null,null,null,"Clifton","CITOYEN","Ordinaire",{"$f":"IF(MAX(CALC!M18:V18)=0,\"Aucun\",(CHOOSE(INDEX(CALC!$M$3:$V$3,MATCH(MAX(CALC!M18:V18),CALC!M18:V18,0)),\"Entrainement aux armes\",\"Formation médicale\",\"Formation à la stratégie\",\"Entrainement tactique\",\"Entrainement fondamental\",\"Entrainement généraliste\",\"Enrainement à la Guérilla\",\"Entrainement avancé\",\"Entrainement en milieu sauvage\",\"Entrainement militaire\")))","v":"Entrainement fondamental"}]
[null,null,{"$f":"IF(ISERROR(INDEX($O$16:$P$55,MATCH(C30,$O$16:$O$55),2)),\"\",INDEX($O$16:$P$55,MATCH(C30,$O$16:$O$55),2))","v":"SOLDAT"},"GARDIEN","REBELLE","CHASSEUR","REBELLE","CITOYEN","","CHASSEUR","","",null,null,"Cyrus","CHASSEUR","Ordinaire",{"$f":"IF(MAX(CALC!M19:V19)=0,\"Aucun\",(CHOOSE(INDEX(CALC!$M$3:$V$3,MATCH(MAX(CALC!M19:V19),CALC!M19:V19,0)),\"Entrainement aux armes\",\"Formation médicale\",\"Formation à la stratégie\",\"Entrainement tactique\",\"Entrainement fondamental\",\"Entrainement généraliste\",\"Enrainement à la Guérilla\",\"Entrainement avancé\",\"Entrainement en milieu sauvage\",\"Entrainement militaire\")))","v":"Entrainement fondamental"}]
[null,9,"Carol","Darren","Margaret","Neil","Caleb","Carol",null,"Ethel",null,null,null,null,"Danny","CITOYEN","Ordinaire",{"$f":"IF(MAX(CALC!M20:V20)=0,\"Aucun\",(CHOOSE(INDEX(CALC!$M$3:$V$3,MATCH(MAX(CALC!M20:V20),CALC!M20:V20,0)),\"Entrainement aux armes\",\"Formation médicale\",\"Formation à la stratégie\",\"Entrainement tactique\",\"Entrainement fondamental\",\"Entrainement généraliste\",\"Enrainement à la Guérilla\",\"Entrainement avancé\",\"Entrainement en milieu sauvage\",\"Entrainement militaire\")))","v":"Entrainement fondamental"}]
[null,null,{"$f":"IF(ISERROR(INDEX($O$16:$P$55,MATCH(C32,$O$16:$O$55),2)),\"\",INDEX($O$16:$P$55,MATCH(C32,$O$16:$O$55),2))","v":"CITOYEN"},"GARDIEN","CITOYEN","CITOYEN","CITOYEN","CITOYEN","","SOLDAT","","",null,null,"Darren","GARDIEN","Inhabituel",{"$f":"IF(MAX(CALC!M21:V21)=0,\"Aucun\",(CHOOSE(INDEX(CALC!$M$3:$V$3,MATCH(MAX(CALC!M21:V21),CALC!M21:V21,0)),\"Entrainement aux armes\",\"Formation médicale\",\"Formation à la stratégie\",\"Entrainement tactique\",\"Entrainement fondamental\",\"Entrainement généraliste\",\"Enrainement à la Guérilla\",\"Entrainement avancé\",\"Entrainement en milieu sauvage\",\"Entrainement militaire\")))","v":"Formation médicale"}]
[null,10,"Christa","Ray","Brock","Diane","Olivia","Ashley",null,"Clarence",null,null,null,null,"Diane","SOLDAT","Inhabituel",{"$f":"IF(MAX(CALC!M22:V22)=0,\"Aucun\",(CHOOSE(INDEX(CALC!$M$3:$V$3,MATCH(MAX(CALC!M22:V22),CALC!M22:V22,0)),\"Entrainement aux armes\",\"Formation médicale\",\"Formation à la stratégie\",\"Entrainement tactique\",\"Entrainement fondamental\",\"Entrainement généraliste\",\"Enrainement à la Guérilla\",\"Entrainement avancé\",\"Entrainement en milieu sauvage\",\"Entrainement militaire\")))","v":"Entrainement tactique"}]
[null,null,{"$f":"IF(ISERROR(INDEX($O$16:$P$55,MATCH(C34,$O$16:$O$55),2)),\"\",INDEX($O$16:$P$55,MATCH(C34,$O$16:$O$55),2))","v":"CHASSEUR"},"GARDIEN","SOLDAT","SOLDAT","GARDIEN","CITOYEN","","REBELLE","","",null,null,"Ethel","SOLDAT","Ordinaire",{"$f":"IF(MAX(CALC!M23:V23)=0,\"Aucun\",(CHOOSE(INDEX(CALC!$M$3:$V$3,MATCH(MAX(CALC!M23:V23),CALC!M23:V23,0)),\"Entrainement aux armes\",\"Formation médicale\",\"Formation à la stratégie\",\"Entrainement tactique\",\"Entrainement fondamental\",\"Entrainement généraliste\",\"Enrainement à la Guérilla\",\"Entrainement avancé\",\"Entrainement en milieu sauvage\",\"Entrainement militaire\")))","v":"Entrainement fondamental"}]
[null,11,"Mac","Ray","Cletus","Randall","Gerald","Neil",null,"Clarence",null,null,null,null,"Gabriel","GARDIEN","Inhabituel",{"$f":"IF(MAX(CALC!M24:V24)=0,\"Aucun\",(CHOOSE(INDEX(CALC!$M$3:$V$3,MATCH(MAX(CALC!M24:V24),CALC!M24:V24,0)),\"Entrainement aux armes\",\"Formation médicale\",\"Formation à la stratégie\",\"Entrainement tactique\",\"Entrainement fondamental\",\"Entrainement généraliste\",\"Enrainement à la Guérilla\",\"Entrainement avancé\",\"Entrainement en milieu sauvage\",\"Entrainement militaire\")))","v":"Formation médicale"}]
[null,null,{"$f":"IF(ISERROR(INDEX($O$16:$P$55,MATCH(C36,$O$16:$O$55),2)),\"\",INDEX($O$16:$P$55,MATCH(C36,$O$16:$O$55),2))","v":"CHASSEUR"},"GARDIEN","REBELLE","REBELLE","CITOYEN","CITOYEN","","REBELLE","","",null,null,"Garret","SOLDAT","Inhabituel",{"$f":"IF(MAX(CALC!M25:V25)=0,\"Aucun\",(CHOOSE(INDEX(CALC!$M$3:$V$3,MATCH(MAX(CALC!M25:V25),CALC!M25:V25,0)),\"Entrainement aux armes\",\"Formation médicale\",\"Formation à la stratégie\",\"Entrainement tactique\",\"Entrainement fondamental\",\"Entrainement généraliste\",\"Enrainement à la Guérilla\",\"Entrainement avancé\",\"Entrainement en milieu sauvage\",\"Entrainement militaire\")))","v":"Entrainement aux armes"}]
[null,12,"Georges","Angela","Margaret","Brigitte","Danny","Neil",null,"Nathan",null,null,null,null,"Georges","CHEF","Inhabituel",{"$f":"IF(MAX(CALC!M26:V26)=0,\"Aucun\",(CHOOSE(INDEX(CALC!$M$3:$V$3,MATCH(MAX(CALC!M26:V26),CALC!M26:V26,0)),\"Entrainement aux armes\",\"Formation médicale\",\"Formation à la stratégie\",\"Entrainement tactique\",\"Entrainement fondamental\",\"Entrainement généraliste\",\"Enrainement à la Guérilla\",\"Entrainement avancé\",\"Entrainement en milieu sauvage\",\"Entrainement militaire\")))","v":"Entrainement aux armes"}]
[null,null,{"$f":"IF(ISERROR(INDEX($O$16:$P$55,MATCH(C38,$O$16:$O$55),2)),\"\",INDEX($O$16:$P$55,MATCH(C38,$O$16:$O$55),2))","v":"CHEF"},"CHEF","CITOYEN","SOLDAT","CITOYEN","CITOYEN","","CITOYEN","","",null,null,"Gerald","CITOYEN","Ordinaire",{"$f":"IF(MAX(CALC!M27:V27)=0,\"Aucun\",(CHOOSE(INDEX(CALC!$M$3:$V$3,MATCH(MAX(CALC!M27:V27),CALC!M27:V27,0)),\"Entrainement aux armes\",\"Formation médicale\",\"Formation à la stratégie\",\"Entrainement tactique\",\"Entrainement fondamental\",\"Entrainement généraliste\",\"Enrainement à la Guérilla\",\"Entrainement avancé\",\"Entrainement en milieu sauvage\",\"Entrainement militaire\")))","v":"Entrainement fondamental"}]
[null,13,"Carol","Darren","Margaret","Neil","Olivia","Ashley",null,"Gerald",null,null,null,null,"Grace","GARDIEN","Ordinaire",{"$f":"IF(MAX(CALC!M28:V28)=0,\"Aucun\",(CHOOSE(INDEX(CALC!$M$3:$V$3,MATCH(MAX(CALC!M28:V28),CALC!M28:V28,0)),\"Entrainement aux armes\",\"Formation médicale\",\"Formation à la stratégie\",\"Entrainement tactique\",\"Entrainement fondamental\",\"Entrainement généraliste\",\"Enrainement à la Guérilla\",\"Entrainement avancé\",\"Entrainement en milieu sauvage\",\"Entrainement militaire\")))","v":"Entrainement avancé"}]
[null,null,{"$f":"IF(ISERROR(INDEX($O$16:$P$55,MATCH(C40,$O$16:$O$55),2)),\"\",INDEX($O$16:$P$55,MATCH(C40,$O$16:$O$55),2))","v":"CITOYEN"},"GARDIEN","CITOYEN","CITOYEN","GARDIEN","CITOYEN","","CITOYEN","","",null,null,"Isabel","CHASSEUR","Inhabituel",{"$f":"IF(MAX(CALC!M29:V29)=0,\"Aucun\",(CHOOSE(INDEX(CALC!$M$3:$V$3,MATCH(MAX(CALC!M29:V29),CALC!M29:V29,0)),\"Entrainement aux armes\",\"Formation médicale\",\"Formation à la stratégie\",\"Entrainement tactique\",\"Entrainement fondamental\",\"Entrainement généraliste\",\"Enrainement à la Guérilla\",\"Entrainement avancé\",\"Entrainement en milieu sauvage\",\"Entrainement militaire\")))","v":"Entrainement tactique"}]
[null,14,"Georges","Angela","Margaret","Randall","Danny","Margaret",null,"Grace",null,null,null,null,"Jed","CHASSEUR","Ordinaire",{"$f":"IF(MAX(CALC!M30:V30)=0,\"Aucun\",(CHOOSE(INDEX(CALC!$M$3:$V$3,MATCH(MAX(CALC!M30:V30),CALC!M30:V30,0)),\"Entrainement aux armes\",\"Formation médicale\",\"Formation à la stratégie\",\"Entrainement tactique\",\"Entrainement fondamental\",\"Entrainement généraliste\",\"Enrainement à la Guérilla\",\"Entrainement avancé\",\"Entrainement en milieu sauvage\",\"Entrainement militaire\")))","v":"Entrainement fondamental"}]
[null,null,{"$f":"IF(ISERROR(INDEX($O$16:$P$55,MATCH(C42,$O$16:$O$55),2)),\"\",INDEX($O$16:$P$55,MATCH(C42,$O$16:$O$55),2))","v":"CHEF"},"CHEF","CITOYEN","REBELLE","CITOYEN","CITOYEN","","GARDIEN","","",null,null,"Jody","CHASSEUR","Ordinaire",{"$f":"IF(MAX(CALC!M31:V31)=0,\"Aucun\",(CHOOSE(INDEX(CALC!$M$3:$V$3,MATCH(MAX(CALC!M31:V31),CALC!M31:V31,0)),\"Entrainement aux armes\",\"Formation médicale\",\"Formation à la stratégie\",\"Entrainement tactique\",\"Entrainement fondamental\",\"Entrainement généraliste\",\"Enrainement à la Guérilla\",\"Entrainement avancé\",\"Entrainement en milieu sauvage\",\"Entrainement militaire\")))","v":"Entrainement fondamental"}]
[null,15,"Garret","Gabriel","Ashley","Diane","John","Neil",null,"Nathan",null,null,null,null,"John","CITOYEN","Ordinaire",{"$f":"IF(MAX(CALC!M32:V32)=0,\"Aucun\",(CHOOSE(INDEX(CALC!$M$3:$V$3,MATCH(MAX(CALC!M32:V32),CALC!M32:V32,0)),\"Entrainement aux armes\",\"Formation médicale\",\"Formation à la stratégie\",\"Entrainement tactique\",\"Entrainement fondamental\",\"Entrainement généraliste\",\"Enrainement à la Guérilla\",\"Entrainement avancé\",\"Entrainement en milieu sauvage\",\"Entrainement militaire\")))","v":"Entrainement fondamental"}]
[null,null,{"$f":"IF(ISERROR(INDEX($O$16:$P$55,MATCH(C44,$O$16:$O$55),2)),\"\",INDEX($O$16:$P$55,MATCH(C44,$O$16:$O$55),2))","v":"SOLDAT"},"GARDIEN","CITOYEN","SOLDAT","CITOYEN","CITOYEN","","CITOYEN","","",null,null,"Lucia","CITOYEN","Ordinaire",{"$f":"IF(MAX(CALC!M33:V33)=0,\"Aucun\",(CHOOSE(INDEX(CALC!$M$3:$V$3,MATCH(MAX(CALC!M33:V33),CALC!M33:V33,0)),\"Entrainement aux armes\",\"Formation médicale\",\"Formation à la stratégie\",\"Entrainement tactique\",\"Entrainement fondamental\",\"Entrainement généraliste\",\"Enrainement à la Guérilla\",\"Entrainement avancé\",\"Entrainement en milieu sauvage\",\"Entrainement militaire\")))","v":"Aucun"}]
[null,16,"Georges","Gabriel","Margaret","Isabel","John","Neil",null,null,null,null,null,null,"Mac","CHASSEUR","Inhabituel",{"$f":"IF(MAX(CALC!M34:V34)=0,\"Aucun\",(CHOOSE(INDEX(CALC!$M$3:$V$3,MATCH(MAX(CALC!M34:V34),CALC!M34:V34,0)),\"Entrainement aux armes\",\"Formation médicale\",\"Formation à la stratégie\",\"Entrainement tactique\",\"Entrainement fondamental\",\"Entrainement généraliste\",\"Enrainement à la Guérilla\",\"Entrainement avancé\",\"Entrainement en milieu sauvage\",\"Entrainement militaire\")))","v":"Entrainement aux armes"}]
[null,null,{"$f":"IF(ISERROR(INDEX($O$16:$P$55,MATCH(C46,$O$16:$O$55),2)),\"\",INDEX($O$16:$P$55,MATCH(C46,$O$16:$O$55),2))","v":"CHEF"},"GARDIEN","CITOYEN","CHASSEUR","CITOYEN","CITOYEN","","","","",null,null,"Margaret","CITOYEN","Inhabituel",{"$f":"IF(MAX(CALC!M35:V35)=0,\"Aucun\",(CHOOSE(INDEX(CALC!$M$3:$V$3,MATCH(MAX(CALC!M35:V35),CALC!M35:V35,0)),\"Entrainement aux armes\",\"Formation médicale\",\"Formation à la stratégie\",\"Entrainement tactique\",\"Entrainement fondamental\",\"Entrainement généraliste\",\"Enrainement à la Guérilla\",\"Entrainement avancé\",\"Entrainement en milieu sauvage\",\"Entrainement militaire\")))","v":"Entrainement généraliste"}]
[null,17,"Georges","Angela","Brock","Isabel","Danny","Neil",null,null,null,null,null,null,"Nathan","CITOYEN","Ordinaire",{"$f":"IF(MAX(CALC!M36:V36)=0,\"Aucun\",(CHOOSE(INDEX(CALC!$M$3:$V$3,MATCH(MAX(CALC!M36:V36),CALC!M36:V36,0)),\"Entrainement aux armes\",\"Formation médicale\",\"Formation à la stratégie\",\"Entrainement tactique\",\"Entrainement fondamental\",\"Entrainement généraliste\",\"Enrainement à la Guérilla\",\"Entrainement avancé\",\"Entrainement en milieu sauvage\",\"Entrainement militaire\")))","v":"Entrainement avancé"}]
[null,null,{"$f":"IF(ISERROR(INDEX($O$16:$P$55,MATCH(C48,$O$16:$O$55),2)),\"\",INDEX($O$16:$P$55,MATCH(C48,$O$16:$O$55),2))","v":"CHEF"},"CHEF","SOLDAT","CHASSEUR","CITOYEN","CITOYEN","","","","",null,null,"Neil","CITOYEN","Inhabituel",{"$f":"IF(MAX(CALC!M37:V37)=0,\"Aucun\",(CHOOSE(INDEX(CALC!$M$3:$V$3,MATCH(MAX(CALC!M37:V37),CALC!M37:V37,0)),\"Entrainement aux armes\",\"Formation médicale\",\"Formation à la stratégie\",\"Entrainement tactique\",\"Entrainement fondamental\",\"Entrainement généraliste\",\"Enrainement à la Guérilla\",\"Entrainement avancé\",\"Entrainement en milieu sauvage\",\"Entrainement militaire\")))","v":"Entrainement généraliste"}]
[null,18,"Carter","Angela","Margaret","Diane","Todd","Neil",null,null,null,null,null,null,"Olivia","GARDIEN","Ordinaire",{"$f":"IF(MAX(CALC!M38:V38)=0,\"Aucun\",(CHOOSE(INDEX(CALC!$M$3:$V$3,MATCH(MAX(CALC!M38:V38),CALC!M38:V38,0)),\"Entrainement aux armes\",\"Formation médicale\",\"Formation à la stratégie\",\"Entrainement tactique\",\"Entrainement fondamental\",\"Entrainement généraliste\",\"Enrainement à la Guérilla\",\"Entrainement avancé\",\"Entrainement en milieu sauvage\",\"Entrainement militaire\")))","v":"Entrainement fondamental"}]
[null,null,{"$f":"IF(ISERROR(INDEX($O$16:$P$55,MATCH(C50,$O$16:$O$55),2)),\"\",INDEX($O$16:$P$55,MATCH(C50,$O$16:$O$55),2))","v":"CHASSEUR"},"CHEF","CITOYEN","SOLDAT","CITOYEN","CITOYEN","","","","",null,null,"Parker","SOLDAT","Ordinaire",{"$f":"IF(MAX(CALC!M39:V39)=0,\"Aucun\",(CHOOSE(INDEX(CALC!$M$3:$V$3,MATCH(MAX(CALC!M39:V39),CALC!M39:V39,0)),\"Entrainement aux armes\",\"Formation médicale\",\"Formation à la stratégie\",\"Entrainement tactique\",\"Entrainement fondamental\",\"Entrainement généraliste\",\"Enrainement à la Guérilla\",\"Entrainement avancé\",\"Entrainement en milieu sauvage\",\"Entrainement militaire\")))","v":"Aucun"}]
[null,19,"Mac","Ray","Brock","Samuel","Jody","Margaret",null,null,null,null,null,null,"Randall","REBELLE","Inhabituel",{"$f":"IF(MAX(CALC!M40:V40)=0,\"Aucun\",(CHOOSE(INDEX(CALC!$M$3:$V$3,MATCH(MAX(CALC!M40:V40),CALC!M40:V40,0)),\"Entrainement aux armes\",\"Formation médicale\",\"Formation à la stratégie\",\"Entrainement tactique\",\"Entrainement fondamental\",\"Entrainement généraliste\",\"Enrainement à la Guérilla\",\"Entrainement avancé\",\"Entrainement en milieu sauvage\",\"Entrainement militaire\")))","v":"Entrainement tactique"}]
[null,null,{"$f":"IF(ISERROR(INDEX($O$16:$P$55,MATCH(C52,$O$16:$O$55),2)),\"\",INDEX($O$16:$P$55,MATCH(C52,$O$16:$O$55),2))","v":"CHASSEUR"},"GARDIEN","SOLDAT","SOLDAT","CHASSEUR","CITOYEN","","","","",null,null,"Ray","GARDIEN","Inhabituel",{"$f":"IF(MAX(CALC!M41:V41)=0,\"Aucun\",(CHOOSE(INDEX(CALC!$M$3:$V$3,MATCH(MAX(CALC!M41:V41),CALC!M41:V41,0)),\"Entrainement aux armes\",\"Formation médicale\",\"Formation à la stratégie\",\"Entrainement tactique\",\"Entrainement fondamental\",\"Entrainement généraliste\",\"Enrainement à la Guérilla\",\"Entrainement avancé\",\"Entrainement en milieu sauvage\",\"Entrainement militaire\")))","v":"Formation médicale"}]
[null,20,"Christa","Angela","Ashley","Randall","Jody","Ashley",null,null,null,null,null,null,"Samuel","SOLDAT","Inhabituel",{"$f":"IF(MAX(CALC!M42:V42)=0,\"Aucun\",(CHOOSE(INDEX(CALC!$M$3:$V$3,MATCH(MAX(CALC!M42:V42),CALC!M42:V42,0)),\"Entrainement aux armes\",\"Formation médicale\",\"Formation à la stratégie\",\"Entrainement tactique\",\"Entrainement fondamental\",\"Entrainement généraliste\",\"Enrainement à la Guérilla\",\"Entrainement avancé\",\"Entrainement en milieu sauvage\",\"Entrainement militaire\")))","v":"Entrainement tactique"}]
[null,null,{"$f":"IF(ISERROR(INDEX($O$16:$P$55,MATCH(C54,$O$16:$O$55),2)),\"\",INDEX($O$16:$P$55,MATCH(C54,$O$16:$O$55),2))","v":"CHASSEUR"},"CHEF","CITOYEN","REBELLE","CHASSEUR","CITOYEN","","","","",null,null,"Susan","CITOYEN","Ordinaire",{"$f":"IF(MAX(CALC!M43:V43)=0,\"Aucun\",(CHOOSE(INDEX(CALC!$M$3:$V$3,MATCH(MAX(CALC!M43:V43),CALC!M43:V43,0)),\"Entrainement aux armes\",\"Formation médicale\",\"Formation à la stratégie\",\"Entrainement tactique\",\"Entrainement fondamental\",\"Entrainement généraliste\",\"Enrainement à la Guérilla\",\"Entrainement avancé\",\"Entrainement en milieu sauvage\",\"Entrainement militaire\")))","v":"Entrainement avancé"}]
[null,21,"Carter","Ray","Brock","Isabel","John","Carol",null,null,null,null,null,null,"Todd","CITOYEN","Ordinaire",{"$f":"IF(MAX(CALC!M44:V44)=0,\"Aucun\",(CHOOSE(INDEX(CALC!$M$3:$V$3,MATCH(MAX(CALC!M44:V44),CALC!M44:V44,0)),\"Entrainement aux armes\",\"Formation médicale\",\"Formation à la stratégie\",\"Entrainement tactique\",\"Entrainement fondamental\",\"Entrainement généraliste\",\"Enrainement à la Guérilla\",\"Entrainement avancé\",\"Entrainement en milieu sauvage\",\"Entrainement militaire\")))","v":"Entrainement fondamental"}]
[null,null,{"$f":"IF(ISERROR(INDEX($O$16:$P$55,MATCH(C56,$O$16:$O$55),2)),\"\",INDEX($O$16:$P$55,MATCH(C56,$O$16:$O$55),2))","v":"CHASSEUR"},"GARDIEN","SOLDAT","CHASSEUR","CITOYEN","CITOYEN","","","",""]
[null,22,"Carter","Angela","Ashley","Randall","Susan","Neil"]
[null,null,{"$f":"IF(ISERROR(INDEX($O$16:$P$55,MATCH(C58,$O$16:$O$55),2)),\"\",INDEX($O$16:$P$55,MATCH(C58,$O$16:$O$55),2))","v":"CHASSEUR"},"CHEF","CITOYEN","REBELLE","CITOYEN","CITOYEN","","","",""]
[null,23,"Georges","Ray","Ashley","Isabel","Gerald","Margaret"]
[null,null,{"$f":"IF(ISERROR(INDEX($O$16:$P$55,MATCH(C60,$O$16:$O$55),2)),\"\",INDEX($O$16:$P$55,MATCH(C60,$O$16:$O$55),2))","v":"CHEF"},"GARDIEN","CITOYEN","CHASSEUR","CITOYEN","CITOYEN","","","",""]
[null,24,"Carol","Ray","Ashley","Isabel","Clifton","Ashley"]
[null,null,{"$f":"IF(ISERROR(INDEX($O$16:$P$55,MATCH(C62,$O$16:$O$55),2)),\"\",INDEX($O$16:$P$55,MATCH(C62,$O$16:$O$55),2))","v":"CITOYEN"},"GARDIEN","CITOYEN","CHASSEUR","CITOYEN","CITOYEN","","","",""]
[null,25,"Georges","Ray","Margaret","Randall",null,"Ashley"]
[null,null,{"$f":"IF(ISERROR(INDEX($O$16:$P$55,MATCH(C64,$O$16:$O$55),2)),\"\",INDEX($O$16:$P$55,MATCH(C64,$O$16:$O$55),2))","v":"CHEF"},"GARDIEN","CITOYEN","REBELLE","","CITOYEN","","","",""]
[null,26,"Garret","Darren","Margaret","Brigitte",null,"Margaret"]
[null,null,{"$f":"IF(ISERROR(INDEX($O$16:$P$55,MATCH(C66,$O$16:$O$55),2)),\"\",INDEX($O$16:$P$55,MATCH(C66,$O$16:$O$55),2))","v":"SOLDAT"},"GARDIEN","CITOYEN","SOLDAT","","CITOYEN","","","",""]
[null,27,"Mac","Ray","Brock","Neil",null,"Ashley"]
[null,null,{"$f":"IF(ISERROR(INDEX($O$16:$P$55,MATCH(C68,$O$16:$O$55),2)),\"\",INDEX($O$16:$P$55,MATCH(C68,$O$16:$O$55),2))","v":"CHASSEUR"},"GARDIEN","SOLDAT","CITOYEN","","CITOYEN","","","",""]
[null,28,"Mac","Gabriel","Ashley","Neil",null,"Ashley"]
[null,null,{"$f":"IF(ISERROR(INDEX($O$16:$P$55,MATCH(C70,$O$16:$O$55),2)),\"\",INDEX($O$16:$P$55,MATCH(C70,$O$16:$O$55),2))","v":"CHASSEUR"},"GARDIEN","CITOYEN","CITOYEN","","CITOYEN","","","",""]
[null,29,"Carol","Gabriel","Ashley","Randall",null,"Margaret"]
[null,null,{"$f":"IF(ISERROR(INDEX($O$16:$P$55,MATCH(C72,$O$16:$O$55),2)),\"\",INDEX($O$16:$P$55,MATCH(C72,$O$16:$O$55),2))","v":"CITOYEN"},"GARDIEN","CITOYEN","REBELLE","","CITOYEN","","","",""]
[null,30,"Georges","Ray","Cletus","Brigitte",null,"Carol"]
[null,null,{"$f":"IF(ISERROR(INDEX($O$16:$P$55,MATCH(C74,$O$16:$O$55),2)),\"\",INDEX($O$16:$P$55,MATCH(C74,$O$16:$O$55),2))","v":"CHEF"},"GARDIEN","REBELLE","SOLDAT","","CITOYEN","","","",""]
[null,31,"Garret","Ray","Margaret","Randall",null,"Neil"]
[null,null,{"$f":"IF(ISERROR(INDEX($O$16:$P$55,MATCH(C76,$O$16:$O$55),2)),\"\",INDEX($O$16:$P$55,MATCH(C76,$O$16:$O$55),2))","v":"SOLDAT"},"GARDIEN","CITOYEN","REBELLE","","CITOYEN","","","",""]
[null,32,"Garret","Ray","Margaret","Isabel",null,"Neil"]
[null,null,{"$f":"IF(ISERROR(INDEX($O$16:$P$55,MATCH(C78,$O$16:$O$55),2)),\"\",INDEX($O$16:$P$55,MATCH(C78,$O$16:$O$55),2))","v":"SOLDAT"},"GARDIEN","CITOYEN","CHASSEUR","","CITOYEN","","","",""]
[null,33,"Carol","Ray","Margaret","Brigitte",null,"Margaret"]
[null,null,{"$f":"IF(ISERROR(INDEX($O$16:$P$55,MATCH(C80,$O$16:$O$55),2)),\"\",INDEX($O$16:$P$55,MATCH(C80,$O$16:$O$55),2))","v":"CITOYEN"},"GARDIEN","CITOYEN","SOLDAT","","CITOYEN","","","",""]
[null,34,"Carol","Ray",null,"Neil",null,"Ashley"]
[null,null,{"$f":"IF(ISERROR(INDEX($O$16:$P$55,MATCH(C82,$O$16:$O$55),2)),\"\",INDEX($O$16:$P$55,MATCH(C82,$O$16:$O$55),2))","v":"CITOYEN"},"GARDIEN","","CITOYEN","","CITOYEN","","","",""]
[null,35,"Carol","Darren",null,"Isabel",null,"Margaret"]
[null,null,{"$f":"IF(ISERROR(INDEX($O$16:$P$55,MATCH(C84,$O$16:$O$55),2)),\"\",INDEX($O$16:$P$55,MATCH(C84,$O$16:$O$55),2))","v":"CITOYEN"},"GARDIEN","","CHASSEUR","","CITOYEN","","","",""]
[null,36,"Georges","Darren",null,"Diane",null,"Neil"]
[null,null,{"$f":"IF(ISERROR(INDEX($O$16:$P$55,MATCH(C86,$O$16:$O$55),2)),\"\",INDEX($O$16:$P$55,MATCH(C86,$O$16:$O$55),2))","v":"CHEF"},"GARDIEN","","SOLDAT","","CITOYEN","","","",""]
[null,37,"Georges","Ray",null,"Neil",null,"Neil"]
[null,null,{"$f":"IF(ISERROR(INDEX($O$16:$P$55,MATCH(C88,$O$16:$O$55),2)),\"\",INDEX($O$16:$P$55,MATCH(C88,$O$16:$O$55),2))","v":"CHEF"},"GARDIEN","","CITOYEN","","CITOYEN","","","",""]
[null,38,"Carol","Darren",null,"Brigitte",null,"Neil"]
[null,null,{"$f":"IF(ISERROR(INDEX($O$16:$P$55,MATCH(C90,$O$16:$O$55),2)),\"\",INDEX($O$16:$P$55,MATCH(C90,$O$16:$O$55),2))","v":"CITOYEN"},"GARDIEN","","SOLDAT","","CITOYEN","","","",""]
[null,39,"Georges","Angela",null,"Randall",null,"Neil"]
[null,null,{"$f":"IF(ISERROR(INDEX($O$16:$P$55,MATCH(C92,$O$16:$O$55),2)),\"\",INDEX($O$16:$P$55,MATCH(C92,$O$16:$O$55),2))","v":"CHEF"},"CHEF","","REBELLE","","CITOYEN","","","",""]
[null,40,"Christa","Ray",null,"Neil",null,"Neil"]
[null,null,{"$f":"IF(ISERROR(INDEX($O$16:$P$55,MATCH(C94,$O$16:$O$55),2)),\"\",INDEX($O$16:$P$55,MATCH(C94,$O$16:$O$55),2))","v":"CHASSEUR"},"GARDIEN","","CITOYEN","","CITOYEN","","","",""]
[null,41,"Mac","Darren",null,"Samuel",null,"Neil"]
[null,null,{"$f":"IF(ISERROR(INDEX($O$16:$P$55,MATCH(C96,$O$16:$O$55),2)),\"\",INDEX($O$16:$P$55,MATCH(C96,$O$16:$O$55),2))","v":"CHASSEUR"},"GARDIEN","","SOLDAT","","CITOYEN","","","",""]
[null,42,"Georges","Angela",null,"Isabel",null,"Carol"]
[null,null,{"$f":"IF(ISERROR(INDEX($O$16:$P$55,MATCH(C98,$O$16:$O$55),2)),\"\",INDEX($O$16:$P$55,MATCH(C98,$O$16:$O$55),2))","v":"CHEF"},"CHEF","","CHASSEUR","","CITOYEN","","","",""]
[null,43,"Christa","Gabriel",null,"Brigitte",null,"Margaret"]
[null,null,{"$f":"IF(ISERROR(INDEX($O$16:$P$55,MATCH(C100,$O$16:$O$55),2)),\"\",INDEX($O$16:$P$55,MATCH(C100,$O$16:$O$55),2))","v":"CHASSEUR"},"GARDIEN","","SOLDAT","","CITOYEN","","","",""]
[null,44,"Georges","Ray",null,null,null,"Neil"]
[null,null,{"$f":"IF(ISERROR(INDEX($O$16:$P$55,MATCH(C102,$O$16:$O$55),2)),\"\",INDEX($O$16:$P$55,MATCH(C102,$O$16:$O$55),2))","v":"CHEF"},"GARDIEN","","","","CITOYEN","","","",""]
[null,45,"Mac","Ray",null,null,null,"Neil"]
[null,null,{"$f":"IF(ISERROR(INDEX($O$16:$P$55,MATCH(C104,$O$16:$O$55),2)),\"\",INDEX($O$16:$P$55,MATCH(C104,$O$16:$O$55),2))","v":"CHASSEUR"},"GARDIEN","","","","CITOYEN","","","",""]
[null,46,"Mac","Ray",null,null,null,"Ashley"]
[null,null,{"$f":"IF(ISERROR(INDEX($O$16:$P$55,MATCH(C106,$O$16:$O$55),2)),\"\",INDEX($O$16:$P$55,MATCH(C106,$O$16:$O$55),2))","v":"CHASSEUR"},"GARDIEN","","","","CITOYEN","","","",""]
[null,47,"Georges","Darren",null,null,null,"Neil"]
[null,null,{"$f":"IF(ISERROR(INDEX($O$16:$P$55,MATCH(C108,$O$16:$O$55),2)),\"\",INDEX($O$16:$P$55,MATCH(C108,$O$16:$O$55),2))","v":"CHEF"},"GARDIEN","","","","CITOYEN","","","",""]
[null,48,"Georges","Angela",null,null,null,"Neil"]
[null,null,{"$f":"IF(ISERROR(INDEX($O$16:$P$55,MATCH(C110,$O$16:$O$55),2)),\"\",INDEX($O$16:$P$55,MATCH(C110,$O$16:$O$55),2))","v":"CHEF"},"CHEF","","","","CITOYEN","","","",""]
[null,49,"Carter","Ray",null,null,null,"Ashley"]
[null,null,{"$f":"IF(ISERROR(INDEX($O$16:$P$55,MATCH(C112,$O$16:$O$55),2)),\"\",INDEX($O$16:$P$55,MATCH(C112,$O$16:$O$55),2))","v":"CHASSEUR"},"GARDIEN","","","","CITOYEN","","","",""]
[null,50,"Georges","Darren",null,null,null,"Ashley"]
[null,null,{"$f":"IF(ISERROR(INDEX($O$16:$P$55,MATCH(C114,$O$16:$O$55),2)),\"\",INDEX($O$16:$P$55,MATCH(C114,$O$16:$O$55),2))","v":"CHEF"},"GARDIEN","","","","CITOYEN","","","",""]
[null,51,"Garret","Ray",null,null,null,"Ashley"]
[null,null,{"$f":"IF(ISERROR(INDEX($O$16:$P$55,MATCH(C116,$O$16:$O$55),2)),\"\",INDEX($O$16:$P$55,MATCH(C116,$O$16:$O$55),2))","v":"SOLDAT"},"GARDIEN","","","","CITOYEN","","","",""]
[null,52,"Mac","Angela",null,null,null,"Carol"]
[null,null,{"$f":"IF(ISERROR(INDEX($O$16:$P$55,MATCH(C118,$O$16:$O$55),2)),\"\",INDEX($O$16:$P$55,MATCH(C118,$O$16:$O$55),2))","v":"CHASSEUR"},"CHEF","","","","CITOYEN","","","",""]
[null,53,null,"Ray",null,null,null,"Margaret"]
[null,null,{"$f":"IF(ISERROR(INDEX($O$16:$P$55,MATCH(C120,$O$16:$O$55),2)),\"\",INDEX($O$16:$P$55,MATCH(C120,$O$16:$O$55),2))","v":""},"GARDIEN","","","","CITOYEN","","","",""]
[null,54,null,"Darren",null,null,null,"Burt"]
[null,null,{"$f":"IF(ISERROR(INDEX($O$16:$P$55,MATCH(C122,$O$16:$O$55),2)),\"\",INDEX($O$16:$P$55,MATCH(C122,$O$16:$O$55),2))","v":""},"GARDIEN","","","","PROF","","","",""]
[null,55,null,"Ray",null,null,null,"Neil"]
[null,null,{"$f":"IF(ISERROR(INDEX($O$16:$P$55,MATCH(C124,$O$16:$O$55),2)),\"\",INDEX($O$16:$P$55,MATCH(C124,$O$16:$O$55),2))","v":""},"GARDIEN","","","","CITOYEN","","","",""]
[null,56,null,"Darren",null,null,null,"Neil"]
[null,null,{"$f":"IF(ISERROR(INDEX($O$16:$P$55,MATCH(C126,$O$16:$O$55),2)),\"\",INDEX($O$16:$P$55,MATCH(C126,$O$16:$O$55),2))","v":""},"GARDIEN","","","","CITOYEN","","","",""]
[null,57,null,"Ray",null,null,null,"Carol"]
[null,null,{"$f":"IF(ISERROR(INDEX($O$16:$P$55,MATCH(C128,$O$16:$O$55),2)),\"\",INDEX($O$16:$P$55,MATCH(C128,$O$16:$O$55),2))","v":""},"GARDIEN","","","","CITOYEN","","","",""]
[null,58,null,"Ray",null,null,null,"Margaret"]
[null,null,{"$f":"IF(ISERROR(INDEX($O$16:$P$55,MATCH(C130,$O$16:$O$55),2)),\"\",INDEX($O$16:$P$55,MATCH(C130,$O$16:$O$55),2))","v":""},"GARDIEN","","","","CITOYEN","","","",""]
[null,59,null,"Ray",null,null,null,"Margaret"]
[null,null,{"$f":"IF(ISERROR(INDEX($O$16:$P$55,MATCH(C132,$O$16:$O$55),2)),\"\",INDEX($O$16:$P$55,MATCH(C132,$O$16:$O$55),2))","v":""},"GARDIEN","","","","CITOYEN","","","",""]
[null,60,null,"Ray",null,null,null,"Neil"]
[null,null,{"$f":"IF(ISERROR(INDEX($O$16:$P$55,MATCH(C134,$O$16:$O$55),2)),\"\",INDEX($O$16:$P$55,MATCH(C134,$O$16:$O$55),2))","v":""},"GARDIEN","","","","CITOYEN","","","",""]
[null,61,null,"Ray",null,null,null,"Margaret"]
[null,null,{"$f":"IF(ISERROR(INDEX($O$16:$P$55,MATCH(C136,$O$16:$O$55),2)),\"\",INDEX($O$16:$P$55,MATCH(C136,$O$16:$O$55),2))","v":""},"GARDIEN","","","","CITOYEN","","","",""]
[null,62,null,"Ray",null,null,null,"Ashley"]
[null,null,{"$f":"IF(ISERROR(INDEX($O$16:$P$55,MATCH(C138,$O$16:$O$55),2)),\"\",INDEX($O$16:$P$55,MATCH(C138,$O$16:$O$55),2))","v":""},"GARDIEN","","","","CITOYEN","","","",""]
[null,63,null,"Ray",null,null,null,"Neil"]
[null,null,{"$f":"IF(ISERROR(INDEX($O$16:$P$55,MATCH(C140,$O$16:$O$55),2)),\"\",INDEX($O$16:$P$55,MATCH(C140,$O$16:$O$55),2))","v":""},"GARDIEN","","","","CITOYEN","","","",""]
[null,64,null,"Angela",null,null,null,"Carol"]
[null,null,{"$f":"IF(ISERROR(INDEX($O$16:$P$55,MATCH(C142,$O$16:$O$55),2)),\"\",INDEX($O$16:$P$55,MATCH(C142,$O$16:$O$55),2))","v":""},"CHEF","","","","CITOYEN","","","",""]
[null,65,null,"Darren",null,null,null,"Neil"]
[null,null,{"$f":"IF(ISERROR(INDEX($O$16:$P$55,MATCH(C144,$O$16:$O$55),2)),\"\",INDEX($O$16:$P$55,MATCH(C144,$O$16:$O$55),2))","v":""},"GARDIEN","","","","CITOYEN","","","",""]
[null,66,null,"Ray",null,null,null,"Margaret"]
[null,null,{"$f":"IF(ISERROR(INDEX($O$16:$P$55,MATCH(C146,$O$16:$O$55),2)),\"\",INDEX($O$16:$P$55,MATCH(C146,$O$16:$O$55),2))","v":""},"GARDIEN","","","","CITOYEN","","","",""]
[null,67,null,"Ray",null,null,null,"Ashley"]
[null,null,{"$f":"IF(ISERROR(INDEX($O$16:$P$55,MATCH(C148,$O$16:$O$55),2)),\"\",INDEX($O$16:$P$55,MATCH(C148,$O$16:$O$55),2))","v":""},"GARDIEN","","","","CITOYEN","","","",""]
[null,68,null,"Gabriel",null,null,null,"Margaret"]
[null,null,{"$f":"IF(ISERROR(INDEX($O$16:$P$55,MATCH(C150,$O$16:$O$55),2)),\"\",INDEX($O$16:$P$55,MATCH(C150,$O$16:$O$55),2))","v":""},"GARDIEN","","","","CITOYEN","","","",""]
[null,69,null,"Ray",null,null,null,"Margaret"]
[null,null,{"$f":"IF(ISERROR(INDEX($O$16:$P$55,MATCH(C152,$O$16:$O$55),2)),\"\",INDEX($O$16:$P$55,MATCH(C152,$O$16:$O$55),2))","v":""},"GARDIEN","","","","CITOYEN","","","",""]
[null,70,null,"Gabriel",null,null,null,"Margaret"]
[null,null,{"$f":"IF(ISERROR(INDEX($O$16:$P$55,MATCH(C154,$O$16:$O$55),2)),\"\",INDEX($O$16:$P$55,MATCH(C154,$O$16:$O$55),2))","v":""},"GARDIEN","","","","CITOYEN","","","",""]
[null,71,null,"Angela",null,null,null,"Margaret"]
[null,null,{"$f":"IF(ISERROR(INDEX($O$16:$P$55,MATCH(C156,$O$16:$O$55),2)),\"\",INDEX($O$16:$P$55,MATCH(C156,$O$16:$O$55),2))","v":""},"CHEF","","","","CITOYEN","","","",""]
[null,72,null,"Ray",null,null,null,"Margaret"]
[null,null,{"$f":"IF(ISERROR(INDEX($O$16:$P$55,MATCH(C158,$O$16:$O$55),2)),\"\",INDEX($O$16:$P$55,MATCH(C158,$O$16:$O$55),2))","v":""},"GARDIEN","","","","CITOYEN","","","",""]
[null,73,null,"Gabriel",null,null,null,"Margaret"]
[null,null,{"$f":"IF(ISERROR(INDEX($O$16:$P$55,MATCH(C160,$O$16:$O$55),2)),\"\",INDEX($O$16:$P$55,MATCH(C160,$O$16:$O$55),2))","v":""},"GARDIEN","","","","CITOYEN","","","",""]
[null,74,null,"Ray",null,null,null,"Margaret"]
[null,null,{"$f":"IF(ISERROR(INDEX($O$16:$P$55,MATCH(C162,$O$16:$O$55),2)),\"\",INDEX($O$16:$P$55,MATCH(C162,$O$16:$O$55),2))","v":""},"GARDIEN","","","","CITOYEN","","","",""]
[null,75,null,"Ray",null,null,null,"Carol"]
[null,null,{"$f":"IF(ISERROR(INDEX($O$16:$P$55,MATCH(C164,$O$16:$O$55),2)),\"\",INDEX($O$16:$P$55,MATCH(C164,$O$16:$O$55),2))","v":""},"GARDIEN","","","","CITOYEN","","","",""]
[null,76,null,"Angela",null,null,null,"Margaret"]
[null,null,{"$f":"IF(ISERROR(INDEX($O$16:$P$55,MATCH(C166,$O$16:$O$55),2)),\"\",INDEX($O$16:$P$55,MATCH(C166,$O$16:$O$55),2))","v":""},"CHEF","","","","CITOYEN","","","",""]
[null,77,null,"Gabriel",null,null,null,"Neil"]
[null,null,{"$f":"IF(ISERROR(INDEX($O$16:$P$55,MATCH(C168,$O$16:$O$55),2)),\"\",INDEX($O$16:$P$55,MATCH(C168,$O$16:$O$55),2))","v":""},"GARDIEN","","","","CITOYEN","","","",""]
[null,78,null,"Gabriel",null,null,null,"Carol"]
[null,null,{"$f":"IF(ISERROR(INDEX($O$16:$P$55,MATCH(C170,$O$16:$O$55),2)),\"\",INDEX($O$16:$P$55,MATCH(C170,$O$16:$O$55),2))","v":""},"GARDIEN","","","","CITOYEN","","","",""]
[null,79,null,"Gabriel",null,null,null,"Neil"]
[null,null,{"$f":"IF(ISERROR(INDEX($O$16:$P$55,MATCH(C172,$O$16:$O$55),2)),\"\",INDEX($O$16:$P$55,MATCH(C172,$O$16:$O$55),2))","v":""},"GARDIEN","","","","CITOYEN","","","",""]
[null,80,null,"Ray",null,null,null,"Ashley"]
[null,null,{"$f":"IF(ISERROR(INDEX($O$16:$P$55,MATCH(C174,$O$16:$O$55),2)),\"\",INDEX($O$16:$P$55,MATCH(C174,$O$16:$O$55),2))","v":""},"GARDIEN","","","","CITOYEN","","","",""]
[null,81,null,"Angela",null,null,null,"Carol"]
[null,null,{"$f":"IF(ISERROR(INDEX($O$16:$P$55,MATCH(C176,$O$16:$O$55),2)),\"\",INDEX($O$16:$P$55,MATCH(C176,$O$16:$O$55),2))","v":""},"CHEF","","","","CITOYEN","","","",""]
[null,82,null,"Gabriel",null,null,null,"Carol"]
[null,null,{"$f":"IF(ISERROR(INDEX($O$16:$P$55,MATCH(C178,$O$16:$O$55),2)),\"\",INDEX($O$16:$P$55,MATCH(C178,$O$16:$O$55),2))","v":""},"GARDIEN","","","","CITOYEN","","","",""]
[null,83,null,"Ray",null,null,null,"Margaret"]
[null,null,{"$f":"IF(ISERROR(INDEX($O$16:$P$55,MATCH(C180,$O$16:$O$55),2)),\"\",INDEX($O$16:$P$55,MATCH(C180,$O$16:$O$55),2))","v":""},"GARDIEN","","","","CITOYEN","","","",""]
[null,84,null,"Gabriel",null,null,null,"Neil"]
[null,null,{"$f":"IF(ISERROR(INDEX($O$16:$P$55,MATCH(C182,$O$16:$O$55),2)),\"\",INDEX($O$16:$P$55,MATCH(C182,$O$16:$O$55),2))","v":""},"GARDIEN","","","","CITOYEN","","","",""]
[null,85,null,"Ray",null,null,null,"Margaret"]
[null,null,{"$f":"IF(ISERROR(INDEX($O$16:$P$55,MATCH(C184,$O$16:$O$55),2)),\"\",INDEX($O$16:$P$55,MATCH(C184,$O$16:$O$55),2))","v":""},"GARDIEN","","","","CITOYEN","","","",""]
[null,86,null,"Gabriel",null,null,null,"Carol"]
[null,null,{"$f":"IF(ISERROR(INDEX($O$16:$P$55,MATCH(C186,$O$16:$O$55),2)),\"\",INDEX($O$16:$P$55,MATCH(C186,$O$16:$O$55),2))","v":""},"GARDIEN","","","","CITOYEN","","","",""]
[null,87,null,"Ray",null,null,null,"Neil"]
[null,null,{"$f":"IF(ISERROR(INDEX($O$16:$P$55,MATCH(C188,$O$16:$O$55),2)),\"\",INDEX($O$16:$P$55,MATCH(C188,$O$16:$O$55),2))","v":""},"GARDIEN","","","","CITOYEN","","","",""]
[null,88,null,"Darren",null,null,null,"Ashley"]
[null,null,{"$f":"IF(ISERROR(INDEX($O$16:$P$55,MATCH(C190,$O$16:$O$55),2)),\"\",INDEX($O$16:$P$55,MATCH(C190,$O$16:$O$55),2))","v":""},"GARDIEN","","","","CITOYEN","","","",""]
[null,89,null,"Gabriel",null,null,null,"Neil"]
[null,null,{"$f":"IF(ISERROR(INDEX($O$16:$P$55,MATCH(C192,$O$16:$O$55),2)),\"\",INDEX($O$16:$P$55,MATCH(C192,$O$16:$O$55),2))","v":""},"GARDIEN","","","","CITOYEN","","","",""]
[null,90,null,"Darren",null,null,null,"Carol"]
[null,null,{"$f":"IF(ISERROR(INDEX($O$16:$P$55,MATCH(C194,$O$16:$O$55),2)),\"\",INDEX($O$16:$P$55,MATCH(C194,$O$16:$O$55),2))","v":""},"GARDIEN","","","","CITOYEN","","","",""]
[null,91,null,"Darren",null,null,null,"Margaret"]
[null,null,{"$f":"IF(ISERROR(INDEX($O$16:$P$55,MATCH(C196,$O$16:$O$55),2)),\"\",INDEX($O$16:$P$55,MATCH(C196,$O$16:$O$55),2))","v":""},"GARDIEN","","","","CITOYEN","","","",""]
[null,92,null,"Ray",null,null,null,"Margaret"]
[null,null,{"$f":"IF(ISERROR(INDEX($O$16:$P$55,MATCH(C198,$O$16:$O$55),2)),\"\",INDEX($O$16:$P$55,MATCH(C198,$O$16:$O$55),2))","v":""},"GARDIEN","","","","CITOYEN","","","",""]
[null,93,null,"Gabriel",null,null,null,"Ashley"]
[null,null,{"$f":"IF(ISERROR(INDEX($O$16:$P$55,MATCH(C200,$O$16:$O$55),2)),\"\",INDEX($O$16:$P$55,MATCH(C200,$O$16:$O$55),2))","v":""},"GARDIEN","","","","CITOYEN","","","",""]
[null,94,null,"Ray",null,null,null,"Margaret"]
[null,null,{"$f":"IF(ISERROR(INDEX($O$16:$P$55,MATCH(C202,$O$16:$O$55),2)),\"\",INDEX($O$16:$P$55,MATCH(C202,$O$16:$O$55),2))","v":""},"GARDIEN","","","","CITOYEN","","","",""]
[null,95,null,"Ray",null,null,null,"Ashley"]
[null,null,{"$f":"IF(ISERROR(INDEX($O$16:$P$55,MATCH(C204,$O$16:$O$55),2)),\"\",INDEX($O$16:$P$55,MATCH(C204,$O$16:$O$55),2))","v":""},"GARDIEN","","","","CITOYEN","","","",""]
[null,96,null,"Ray",null,null,null,"Neil"]
[null,null,{"$f":"IF(ISERROR(INDEX($O$16:$P$55,MATCH(C206,$O$16:$O$55),2)),\"\",INDEX($O$16:$P$55,MATCH(C206,$O$16:$O$55),2))","v":""},"GARDIEN","","","","CITOYEN","","","",""]
[null,97,null,"Angela",null,null,null,"Neil"]
[null,null,{"$f":"IF(ISERROR(INDEX($O$16:$P$55,MATCH(C208,$O$16:$O$55),2)),\"\",INDEX($O$16:$P$55,MATCH(C208,$O$16:$O$55),2))","v":""},"CHEF","","","","CITOYEN","","","",""]
[null,98,null,"Ray",null,null,null,"Margaret"]
[null,null,{"$f":"IF(ISERROR(INDEX($O$16:$P$55,MATCH(C210,$O$16:$O$55),2)),\"\",INDEX($O$16:$P$55,MATCH(C210,$O$16:$O$55),2))","v":""},"GARDIEN","","","","CITOYEN","","","",""]
[null,99,null,"Darren",null,null,null,"Margaret"]
[null,null,{"$f":"IF(ISERROR(INDEX($O$16:$P$55,MATCH(C212,$O$16:$O$55),2)),\"\",INDEX($O$16:$P$55,MATCH(C212,$O$16:$O$55),2))","v":""},"GARDIEN","","","","CITOYEN","","","",""]
[null,100,null,"Ray",null,null,null,"Neil"]
[null,null,{"$f":"IF(ISERROR(INDEX($O$16:$P$55,MATCH(C214,$O$16:$O$55),2)),\"\",INDEX($O$16:$P$55,MATCH(C214,$O$16:$O$55),2))","v":""},"GARDIEN","","","","CITOYEN","","","",""]
[null,101,null,"Ray",null,null,null,"Neil"]
[null,null,{"$f":"IF(ISERROR(INDEX($O$16:$P$55,MATCH(C216,$O$16:$O$55),2)),\"\",INDEX($O$16:$P$55,MATCH(C216,$O$16:$O$55),2))","v":""},"GARDIEN","","","","CITOYEN","","","",""]
[null,102,null,"Gabriel",null,null,null,"Margaret"]
[null,null,{"$f":"IF(ISERROR(INDEX($O$16:$P$55,MATCH(C218,$O$16:$O$55),2)),\"\",INDEX($O$16:$P$55,MATCH(C218,$O$16:$O$55),2))","v":""},"GARDIEN","","","","CITOYEN","","","",""]
[null,103,null,"Angela",null,null,null,"Carol"]
[null,null,{"$f":"IF(ISERROR(INDEX($O$16:$P$55,MATCH(C220,$O$16:$O$55),2)),\"\",INDEX($O$16:$P$55,MATCH(C220,$O$16:$O$55),2))","v":""},"CHEF","","","","CITOYEN","","","",""]
[null,104,null,"Darren",null,null,null,"Neil"]
[null,null,{"$f":"IF(ISERROR(INDEX($O$16:$P$55,MATCH(C222,$O$16:$O$55),2)),\"\",INDEX($O$16:$P$55,MATCH(C222,$O$16:$O$55),2))","v":""},"GARDIEN","","","","CITOYEN","","","",""]
[null,105,null,null,null,null,null,"Ashley"]
[null,null,{"$f":"IF(ISERROR(INDEX($O$16:$P$55,MATCH(C224,$O$16:$O$55),2)),\"\",INDEX($O$16:$P$55,MATCH(C224,$O$16:$O$55),2))","v":""},"","","","","CITOYEN","","","",""]
[null,106,null,null,null,null,null,"Neil"]
[null,null,{"$f":"IF(ISERROR(INDEX($O$16:$P$55,MATCH(C226,$O$16:$O$55),2)),\"\",INDEX($O$16:$P$55,MATCH(C226,$O$16:$O$55),2))","v":""},"","","","","CITOYEN","","","",""]
[null,107,null,null,null,null,null,"Neil"]
[null,null,{"$f":"IF(ISERROR(INDEX($O$16:$P$55,MATCH(C228,$O$16:$O$55),2)),\"\",INDEX($O$16:$P$55,MATCH(C228,$O$16:$O$55),2))","v":""},"","","","","CITOYEN","","","",""]
[null,108,null,null,null,null,null,"Ashley"]
[null,null,{"$f":"IF(ISERROR(INDEX($O$16:$P$55,MATCH(C230,$O$16:$O$55),2)),\"\",INDEX($O$16:$P$55,MATCH(C230,$O$16:$O$55),2))","v":""},"","","","","CITOYEN","","","",""]
[null,109,null,null,null,null,null,"Ashley"]
[null,null,{"$f":"IF(ISERROR(INDEX($O$16:$P$55,MATCH(C232,$O$16:$O$55),2)),\"\",INDEX($O$16:$P$55,MATCH(C232,$O$16:$O$55),2))","v":""},"","","","","CITOYEN","","","",""]
[null,110,null,null,null,null,null,"Margaret"]
[null,null,{"$f":"IF(ISERROR(INDEX($O$16:$P$55,MATCH(C234,$O$16:$O$55),2)),\"\",INDEX($O$16:$P$55,MATCH(C234,$O$16:$O$55),2))","v":""},"","","","","CITOYEN","","","",""]
[null,111,null,null,null,null,null,"Carol"]
[null,null,{"$f":"IF(ISERROR(INDEX($O$16:$P$55,MATCH(C236,$O$16:$O$55),2)),\"\",INDEX($O$16:$P$55,MATCH(C236,$O$16:$O$55),2))","v":""},"","","","","CITOYEN","","","",""]
[null,112,null,null,null,null,null,"Ashley"]
[null,null,{"$f":"IF(ISERROR(INDEX($O$16:$P$55,MATCH(C238,$O$16:$O$55),2)),\"\",INDEX($O$16:$P$55,MATCH(C238,$O$16:$O$55),2))","v":""},"","","","","CITOYEN","","","",""]
[null,113,null,null,null,null,null,"Margaret"]
[null,null,{"$f":"IF(ISERROR(INDEX($O$16:$P$55,MATCH(C240,$O$16:$O$55),2)),\"\",INDEX($O$16:$P$55,MATCH(C240,$O$16:$O$55),2))","v":""},"","","","","CITOYEN","","","",""]
[null,114,null,null,null,null,null,"Carol"]
[null,null,{"$f":"IF(ISERROR(INDEX($O$16:$P$55,MATCH(C242,$O$16:$O$55),2)),\"\",INDEX($O$16:$P$55,MATCH(C242,$O$16:$O$55),2))","v":""},"","","","","CITOYEN","","","",""]
[null,115,null,null,null,null,null,"Margaret"]
[null,null,{"$f":"IF(ISERROR(INDEX($O$16:$P$55,MATCH(C244,$O$16:$O$55),2)),\"\",INDEX($O$16:$P$55,MATCH(C244,$O$16:$O$55),2))","v":""},"","","","","CITOYEN","","","",""]
[null,116,null,null,null,null,null,"Margaret"]
[null,null,{"$f":"IF(ISERROR(INDEX($O$16:$P$55,MATCH(C246,$O$16:$O$55),2)),\"\",INDEX($O$16:$P$55,MATCH(C246,$O$16:$O$55),2))","v":""},"","","","","CITOYEN","","","",""]
[null,117,null,null,null,null,null,"Neil"]
[null,null,{"$f":"IF(ISERROR(INDEX($O$16:$P$55,MATCH(C248,$O$16:$O$55),2)),\"\",INDEX($O$16:$P$55,MATCH(C248,$O$16:$O$55),2))","v":""},"","","","","CITOYEN","","","",""]
[null,118,null,null,null,null,null,"Carol"]
[null,null,{"$f":"IF(ISERROR(INDEX($O$16:$P$55,MATCH(C250,$O$16:$O$55),2)),\"\",INDEX($O$16:$P$55,MATCH(C250,$O$16:$O$55),2))","v":""},"","","","","CITOYEN","","","",""]
[null,119,null,null,null,null,null,"Margaret"]
[null,null,{"$f":"IF(ISERROR(INDEX($O$16:$P$55,MATCH(C252,$O$16:$O$55),2)),\"\",INDEX($O$16:$P$55,MATCH(C252,$O$16:$O$55),2))","v":""},"","","","","CITOYEN","","","",""]
[null,120,null,null,null,null,null,"Neil"]
[null,null,{"$f":"IF(ISERROR(INDEX($O$16:$P$55,MATCH(C254,$O$16:$O$55),2)),\"\",INDEX($O$16:$P$55,MATCH(C254,$O$16:$O$55),2))","v":""},"","","","","CITOYEN","","","",""]
[null,121,null,null,null,null,null,"Ashley"]
[null,null,{"$f":"IF(ISERROR(INDEX($O$16:$P$55,MATCH(C256,$O$16:$O$55),2)),\"\",INDEX($O$16:$P$55,MATCH(C256,$O$16:$O$55),2))","v":""},"","","","","CITOYEN","","","",""]
[null,122,null,null,null,null,null,"Margaret"]
[null,null,{"$f":"IF(ISERROR(INDEX($O$16:$P$55,MATCH(C258,$O$16:$O$55),2)),\"\",INDEX($O$16:$P$55,MATCH(C258,$O$16:$O$55),2))","v":""},"","","","","CITOYEN","","","",""]
[null,123,null,null,null,null,null,"Margaret"]
[null,null,{"$f":"IF(ISERROR(INDEX($O$16:$P$55,MATCH(C260,$O$16:$O$55),2)),\"\",INDEX($O$16:$P$55,MATCH(C260,$O$16:$O$55),2))","v":""},"","","","","CITOYEN","","","",""]
[null,124,null,null,null,null,null,"Neil"]
[null,null,{"$f":"IF(ISERROR(INDEX($O$16:$P$55,MATCH(C262,$O$16:$O$55),2)),\"\",INDEX($O$16:$P$55,MATCH(C262,$O$16:$O$55),2))","v":""},"","","","","CITOYEN","","","",""]
[null,125,null,null,null,null,null,"Margaret"]
[null,null,{"$f":"IF(ISERROR(INDEX($O$16:$P$55,MATCH(C264,$O$16:$O$55),2)),\"\",INDEX($O$16:$P$55,MATCH(C264,$O$16:$O$55),2))","v":""},"","","","","CITOYEN","","","",""]
[null,126,null,null,null,null,null,"Neil"]
[null,null,{"$f":"IF(ISERROR(INDEX($O$16:$P$55,MATCH(C266,$O$16:$O$55),2)),\"\",INDEX($O$16:$P$55,MATCH(C266,$O$16:$O$55),2))","v":""},"","","","","CITOYEN","","","",""]
[null,127,null,null,null,null,null,"Margaret"]
[null,null,{"$f":"IF(ISERROR(INDEX($O$16:$P$55,MATCH(C268,$O$16:$O$55),2)),\"\",INDEX($O$16:$P$55,MATCH(C268,$O$16:$O$55),2))","v":""},"","","","","CITOYEN","","","",""]
[null,128,null,null,null,null,null,"Margaret"]
[null,null,{"$f":"IF(ISERROR(INDEX($O$16:$P$55,MATCH(C270,$O$16:$O$55),2)),\"\",INDEX($O$16:$P$55,MATCH(C270,$O$16:$O$55),2))","v":""},"","","","","CITOYEN","","","",""]
[null,129,null,null,null,null,null,"Margaret"]
[null,null,{"$f":"IF(ISERROR(INDEX($O$16:$P$55,MATCH(C272,$O$16:$O$55),2)),\"\",INDEX($O$16:$P$55,MATCH(C272,$O$16:$O$55),2))","v":""},"","","","","CITOYEN","","","",""]
[null,130,null,null,null,null,null,"Carol"]
[null,null,{"$f":"IF(ISERROR(INDEX($O$16:$P$55,MATCH(C274,$O$16:$O$55),2)),\"\",INDEX($O$16:$P$55,MATCH(C274,$O$16:$O$55),2))","v":""},"","","","","CITOYEN","","","",""]
[null,131,null,null,null,null,null,"Neil"]
[null,null,{"$f":"IF(ISERROR(INDEX($O$16:$P$55,MATCH(C276,$O$16:$O$55),2)),\"\",INDEX($O$16:$P$55,MATCH(C276,$O$16:$O$55),2))","v":""},"","","","","CITOYEN","","","",""]
[null,132,null,null,null,null,null,"Ashley"]
[null,null,{"$f":"IF(ISERROR(INDEX($O$16:$P$55,MATCH(C278,$O$16:$O$55),2)),\"\",INDEX($O$16:$P$55,MATCH(C278,$O$16:$O$55),2))","v":""},"","","","","CITOYEN","","","",""]
[null,133,null,null,null,null,null,"Neil"]
[null,null,{"$f":"IF(ISERROR(INDEX($O$16:$P$55,MATCH(C280,$O$16:$O$55),2)),\"\",INDEX($O$16:$P$55,MATCH(C280,$O$16:$O$55),2))","v":""},"","","","","CITOYEN","","","",""]
[null,134,null,null,null,null,null,"Ashley"]
[null,null,{"$f":"IF(ISERROR(INDEX($O$16:$P$55,MATCH(C282,$O$16:$O$55),2)),\"\",INDEX($O$16:$P$55,MATCH(C282,$O$16:$O$55),2))","v":""},"","","","","CITOYEN","","","",""]
[null,135,null,null,null,null,null,"Ashley"]
[null,null,{"$f":"IF(ISERROR(INDEX($O$16:$P$55,MATCH(C284,$O$16:$O$55),2)),\"\",INDEX($O$16:$P$55,MATCH(C284,$O$16:$O$55),2))","v":""},"","","","","CITOYEN","","","",""]
[null,136,null,null,null,null,null,"Carol"]
[null,null,{"$f":"IF(ISERROR(INDEX($O$16:$P$55,MATCH(C286,$O$16:$O$55),2)),\"\",INDEX($O$16:$P$55,MATCH(C286,$O$16:$O$55),2))","v":""},"","","","","CITOYEN","","","",""]
[null,137,null,null,null,null,null,"Margaret"]
[null,null,{"$f":"IF(ISERROR(INDEX($O$16:$P$55,MATCH(C288,$O$16:$O$55),2)),\"\",INDEX($O$16:$P$55,MATCH(C288,$O$16:$O$55),2))","v":""},"","","","","CITOYEN","","","",""]
[null,138]
[null,null,{"$f":"IF(ISERROR(INDEX($O$16:$P$55,MATCH(C290,$O$16:$O$55),2)),\"\",INDEX($O$16:$P$55,MATCH(C290,$O$16:$O$55),2))","v":""},"","","","","","","","",""]
[null,139]
[null,null,{"$f":"IF(ISERROR(INDEX($O$16:$P$55,MATCH(C292,$O$16:$O$55),2)),\"\",INDEX($O$16:$P$55,MATCH(C292,$O$16:$O$55),2))","v":""},"","","","","","","","",""]
[null,140]
[null,null,{"$f":"IF(ISERROR(INDEX($O$16:$P$55,MATCH(C294,$O$16:$O$55),2)),\"\",INDEX($O$16:$P$55,MATCH(C294,$O$16:$O$55),2))","v":""},"","","","","","","","",""]
[null,141]
[null,null,{"$f":"IF(ISERROR(INDEX($O$16:$P$55,MATCH(C296,$O$16:$O$55),2)),\"\",INDEX($O$16:$P$55,MATCH(C296,$O$16:$O$55),2))","v":""},"","","","","","","","",""]
[null,142]
[null,null,{"$f":"IF(ISERROR(INDEX($O$16:$P$55,MATCH(C298,$O$16:$O$55),2)),\"\",INDEX($O$16:$P$55,MATCH(C298,$O$16:$O$55),2))","v":""},"","","","","","","","",""]
[null,143]
[null,null,{"$f":"IF(ISERROR(INDEX($O$16:$P$55,MATCH(C300,$O$16:$O$55),2)),\"\",INDEX($O$16:$P$55,MATCH(C300,$O$16:$O$55),2))","v":""},"","","","","","","","",""]
[null,144]
[null,null,{"$f":"IF(ISERROR(INDEX($O$16:$P$55,MATCH(C302,$O$16:$O$55),2)),\"\",INDEX($O$16:$P$55,MATCH(C302,$O$16:$O$55),2))","v":""},"","","","","","","","",""]
[null,145]
[null,null,{"$f":"IF(ISERROR(INDEX($O$16:$P$55,MATCH(C304,$O$16:$O$55),2)),\"\",INDEX($O$16:$P$55,MATCH(C304,$O$16:$O$55),2))","v":""},"","","","","","","","",""]
[null,146]
[null,null,{"$f":"IF(ISERROR(INDEX($O$16:$P$55,MATCH(C306,$O$16:$O$55),2)),\"\",INDEX($O$16:$P$55,MATCH(C306,$O$16:$O$55),2))","v":""},"","","","","","","","",""]
[null,147]
[null,null,{"$f":"IF(ISERROR(INDEX($O$16:$P$55,MATCH(C308,$O$16:$O$55),2)),\"\",INDEX($O$16:$P$55,MATCH(C308,$O$16:$O$55),2))","v":""},"","","","","","","","",""]
[null,148]
[null,null,{"$f":"IF(ISERROR(INDEX($O$16:$P$55,MATCH(C310,$O$16:$O$55),2)),\"\",INDEX($O$16:$P$55,MATCH(C310,$O$16:$O$55),2))","v":""},"","","","","","","","",""]
[null,149]
[null,null,{"$f":"IF(ISERROR(INDEX($O$16:$P$55,MATCH(C312,$O$16:$O$55),2)),\"\",INDEX($O$16:$P$55,MATCH(C312,$O$16:$O$55),2))","v":""},"","","","","","","","",""]
[null,150]
[null,null,{"$f":"IF(ISERROR(INDEX($O$16:$P$55,MATCH(C314,$O$16:$O$55),2)),\"\",INDEX($O$16:$P$55,MATCH(C314,$O$16:$O$55),2))","v":""},"","","","","","","","",""]
[null,151]
[null,null,{"$f":"IF(ISERROR(INDEX($O$16:$P$55,MATCH(C316,$O$16:$O$55),2)),\"\",INDEX($O$16:$P$55,MATCH(C316,$O$16:$O$55),2))","v":""},"","","","","","","","",""]
[null,152]
[null,null,{"$f":"IF(ISERROR(INDEX($O$16:$P$55,MATCH(C318,$O$16:$O$55),2)),\"\",INDEX($O$16:$P$55,MATCH(C318,$O$16:$O$55),2))","v":""},"","","","","","","","",""]
[null,153]
[null,null,{"$f":"IF(ISERROR(INDEX($O$16:$P$55,MATCH(C320,$O$16:$O$55),2)),\"\",INDEX($O$16:$P$55,MATCH(C320,$O$16:$O$55),2))","v":""},"","","","","","","","",""]
[null,154]
[null,null,{"$f":"IF(ISERROR(INDEX($O$16:$P$55,MATCH(C322,$O$16:$O$55),2)),\"\",INDEX($O$16:$P$55,MATCH(C322,$O$16:$O$55),2))","v":""},"","","","","","","","",""]
[null,155]
[null,null,{"$f":"IF(ISERROR(INDEX($O$16:$P$55,MATCH(C324,$O$16:$O$55),2)),\"\",INDEX($O$16:$P$55,MATCH(C324,$O$16:$O$55),2))","v":""},"","","","","","","","",""]
[null,156]
[null,null,{"$f":"IF(ISERROR(INDEX($O$16:$P$55,MATCH(C326,$O$16:$O$55),2)),\"\",INDEX($O$16:$P$55,MATCH(C326,$O$16:$O$55),2))","v":""},"","","","","","","","",""]
[null,157]
[null,null,{"$f":"IF(ISERROR(INDEX($O$16:$P$55,MATCH(C328,$O$16:$O$55),2)),\"\",INDEX($O$16:$P$55,MATCH(C328,$O$16:$O$55),2))","v":""},"","","","","","","","",""]
[null,158]
[null,null,{"$f":"IF(ISERROR(INDEX($O$16:$P$55,MATCH(C330,$O$16:$O$55),2)),\"\",INDEX($O$16:$P$55,MATCH(C330,$O$16:$O$55),2))","v":""},"","","","","","","","",""]
[null,159]
[null,null,{"$f":"IF(ISERROR(INDEX($O$16:$P$55,MATCH(C332,$O$16:$O$55),2)),\"\",INDEX($O$16:$P$55,MATCH(C332,$O$16:$O$55),2))","v":""},"","","","","","","","",""]
[null,160]
[null,null,{"$f":"IF(ISERROR(INDEX($O$16:$P$55,MATCH(C334,$O$16:$O$55),2)),\"\",INDEX($O$16:$P$55,MATCH(C334,$O$16:$O$55),2))","v":""},"","","","","","","","",""]
[null,161]
[null,null,{"$f":"IF(ISERROR(INDEX($O$16:$P$55,MATCH(C336,$O$16:$O$55),2)),\"\",INDEX($O$16:$P$55,MATCH(C336,$O$16:$O$55),2))","v":""},"","","","","","","","",""]
[null,162]
[null,null,{"$f":"IF(ISERROR(INDEX($O$16:$P$55,MATCH(C338,$O$16:$O$55),2)),\"\",INDEX($O$16:$P$55,MATCH(C338,$O$16:$O$55),2))","v":""},"","","","","","","","",""]
[null,163]
[null,null,{"$f":"IF(ISERROR(INDEX($O$16:$P$55,MATCH(C340,$O$16:$O$55),2)),\"\",INDEX($O$16:$P$55,MATCH(C340,$O$16:$O$55),2))","v":""},"","","","","","","","",""]
[null,164]
[null,null,{"$f":"IF(ISERROR(INDEX($O$16:$P$55,MATCH(C342,$O$16:$O$55),2)),\"\",INDEX($O$16:$P$55,MATCH(C342,$O$16:$O$55),2))","v":""},"","","","","","","","",""]
[null,165]
[null,null,{"$f":"IF(ISERROR(INDEX($O$16:$P$55,MATCH(C344,$O$16:$O$55),2)),\"\",INDEX($O$16:$P$55,MATCH(C344,$O$16:$O$55),2))","v":""},"","","","","","","","",""]
[null,166]
[null,null,{"$f":"IF(ISERROR(INDEX($O$16:$P$55,MATCH(C346,$O$16:$O$55),2)),\"\",INDEX($O$16:$P$55,MATCH(C346,$O$16:$O$55),2))","v":""},"","","","","","","","",""]
[null,167]
[null,null,{"$f":"IF(ISERROR(INDEX($O$16:$P$55,MATCH(C348,$O$16:$O$55),2)),\"\",INDEX($O$16:$P$55,MATCH(C348,$O$16:$O$55),2))","v":""},"","","","","","","","",""]
[null,168]
[null,null,{"$f":"IF(ISERROR(INDEX($O$16:$P$55,MATCH(C350,$O$16:$O$55),2)),\"\",INDEX($O$16:$P$55,MATCH(C350,$O$16:$O$55),2))","v":""},"","","","","","","","",""]
[null,169]
[null,null,{"$f":"IF(ISERROR(INDEX($O$16:$P$55,MATCH(C352,$O$16:$O$55),2)),\"\",INDEX($O$16:$P$55,MATCH(C352,$O$16:$O$55),2))","v":""},"","","","","","","","",""]
[null,170]
[null,null,{"$f":"IF(ISERROR(INDEX($O$16:$P$55,MATCH(C354,$O$16:$O$55),2)),\"\",INDEX($O$16:$P$55,MATCH(C354,$O$16:$O$55),2))","v":""},"","","","","","","","",""]
[null,171]
[null,null,{"$f":"IF(ISERROR(INDEX($O$16:$P$55,MATCH(C356,$O$16:$O$55),2)),\"\",INDEX($O$16:$P$55,MATCH(C356,$O$16:$O$55),2))","v":""},"","","","","","","","",""]
[null,172]
[null,null,{"$f":"IF(ISERROR(INDEX($O$16:$P$55,MATCH(C358,$O$16:$O$55),2)),\"\",INDEX($O$16:$P$55,MATCH(C358,$O$16:$O$55),2))","v":""},"","","","","","","","",""]
[null,173]
[null,null,{"$f":"IF(ISERROR(INDEX($O$16:$P$55,MATCH(C360,$O$16:$O$55),2)),\"\",INDEX($O$16:$P$55,MATCH(C360,$O$16:$O$55),2))","v":""},"","","","","","","","",""]
[null,174]
[null,null,{"$f":"IF(ISERROR(INDEX($O$16:$P$55,MATCH(C362,$O$16:$O$55),2)),\"\",INDEX($O$16:$P$55,MATCH(C362,$O$16:$O$55),2))","v":""},"","","","","","","","",""]
[null,175]
[null,null,{"$f":"IF(ISERROR(INDEX($O$16:$P$55,MATCH(C364,$O$16:$O$55),2)),\"\",INDEX($O$16:$P$55,MATCH(C364,$O$16:$O$55),2))","v":""},"","","","","","","","",""]
[null,176]
[null,null,{"$f":"IF(ISERROR(INDEX($O$16:$P$55,MATCH(C366,$O$16:$O$55),2)),\"\",INDEX($O$16:$P$55,MATCH(C366,$O$16:$O$55),2))","v":""},"","","","","","","","",""]
[null,177]
[null,null,{"$f":"IF(ISERROR(INDEX($O$16:$P$55,MATCH(C368,$O$16:$O$55),2)),\"\",INDEX($O$16:$P$55,MATCH(C368,$O$16:$O$55),2))","v":""},"","","","","","","","",""]
[null,178]
[null,null,{"$f":"IF(ISERROR(INDEX($O$16:$P$55,MATCH(C370,$O$16:$O$55),2)),\"\",INDEX($O$16:$P$55,MATCH(C370,$O$16:$O$55),2))","v":""},"","","","","","","","",""]
[null,179]
[null,null,{"$f":"IF(ISERROR(INDEX($O$16:$P$55,MATCH(C372,$O$16:$O$55),2)),\"\",INDEX($O$16:$P$55,MATCH(C372,$O$16:$O$55),2))","v":""},"","","","","","","","",""]
[null,180]
[null,null,{"$f":"IF(ISERROR(INDEX($O$16:$P$55,MATCH(C374,$O$16:$O$55),2)),\"\",INDEX($O$16:$P$55,MATCH(C374,$O$16:$O$55),2))","v":""},"","","","","","","","",""]
[null,181]
[null,null,{"$f":"IF(ISERROR(INDEX($O$16:$P$55,MATCH(C376,$O$16:$O$55),2)),\"\",INDEX($O$16:$P$55,MATCH(C376,$O$16:$O$55),2))","v":""},"","","","","","","","",""]
[null,182]
[null,null,{"$f":"IF(ISERROR(INDEX($O$16:$P$55,MATCH(C378,$O$16:$O$55),2)),\"\",INDEX($O$16:$P$55,MATCH(C378,$O$16:$O$55),2))","v":""},"","","","","","","","",""]
[null,183]
[null,null,{"$f":"IF(ISERROR(INDEX($O$16:$P$55,MATCH(C380,$O$16:$O$55),2)),\"\",INDEX($O$16:$P$55,MATCH(C380,$O$16:$O$55),2))","v":""},"","","","","","","","",""]
[null,184]
[null,null,{"$f":"IF(ISERROR(INDEX($O$16:$P$55,MATCH(C382,$O$16:$O$55),2)),\"\",INDEX($O$16:$P$55,MATCH(C382,$O$16:$O$55),2))","v":""},"","","","","","","","",""]
[null,185]
[null,null,{"$f":"IF(ISERROR(INDEX($O$16:$P$55,MATCH(C384,$O$16:$O$55),2)),\"\",INDEX($O$16:$P$55,MATCH(C384,$O$16:$O$55),2))","v":""},"","","","","","","","",""]
[null,186]
[null,null,{"$f":"IF(ISERROR(INDEX($O$16:$P$55,MATCH(C386,$O$16:$O$55),2)),\"\",INDEX($O$16:$P$55,MATCH(C386,$O$16:$O$55),2))","v":""},"","","","","","","","",""]
[null,187]
[null,null,{"$f":"IF(ISERROR(INDEX($O$16:$P$55,MATCH(C388,$O$16:$O$55),2)),\"\",INDEX($O$16:$P$55,MATCH(C388,$O$16:$O$55),2))","v":""},"","","","","","","","",""]
[null,188]
[null,null,{"$f":"IF(ISERROR(INDEX($O$16:$P$55,MATCH(C390,$O$16:$O$55),2)),\"\",INDEX($O$16:$P$55,MATCH(C390,$O$16:$O$55),2))","v":""},"","","","","","","","",""]
[null,189]
[null,null,{"$f":"IF(ISERROR(INDEX($O$16:$P$55,MATCH(C392,$O$16:$O$55),2)),\"\",INDEX($O$16:$P$55,MATCH(C392,$O$16:$O$55),2))","v":""},"","","","","","","","",""]
[null,190]
[null,null,{"$f":"IF(ISERROR(INDEX($O$16:$P$55,MATCH(C394,$O$16:$O$55),2)),\"\",INDEX($O$16:$P$55,MATCH(C394,$O$16:$O$55),2))","v":""},"","","","","","","","",""]
[null,191]
[null,null,{"$f":"IF(ISERROR(INDEX($O$16:$P$55,MATCH(C396,$O$16:$O$55),2)),\"\",INDEX($O$16:$P$55,MATCH(C396,$O$16:$O$55),2))","v":""},"","","","","","","","",""]
[null,192]
[null,null,{"$f":"IF(ISERROR(INDEX($O$16:$P$55,MATCH(C398,$O$16:$O$55),2)),\"\",INDEX($O$16:$P$55,MATCH(C398,$O$16:$O$55),2))","v":""},"","","","","","","","",""]
[null,193]
[null,null,{"$f":"IF(ISERROR(INDEX($O$16:$P$55,MATCH(C400,$O$16:$O$55),2)),\"\",INDEX($O$16:$P$55,MATCH(C400,$O$16:$O$55),2))","v":""},"","","","","","","","",""]
[null,194]
[null,null,{"$f":"IF(ISERROR(INDEX($O$16:$P$55,MATCH(C402,$O$16:$O$55),2)),\"\",INDEX($O$16:$P$55,MATCH(C402,$O$16:$O$55),2))","v":""},"","","","","","","","",""]
[null,195]
[null,null,{"$f":"IF(ISERROR(INDEX($O$16:$P$55,MATCH(C404,$O$16:$O$55),2)),\"\",INDEX($O$16:$P$55,MATCH(C404,$O$16:$O$55),2))","v":""},"","","","","","","","",""]
[null,196]
[null,null,{"$f":"IF(ISERROR(INDEX($O$16:$P$55,MATCH(C406,$O$16:$O$55),2)),\"\",INDEX($O$16:$P$55,MATCH(C406,$O$16:$O$55),2))","v":""},"","","","","","","","",""]
[null,197]
[null,null,{"$f":"IF(ISERROR(INDEX($O$16:$P$55,MATCH(C408,$O$16:$O$55),2)),\"\",INDEX($O$16:$P$55,MATCH(C408,$O$16:$O$55),2))","v":""},"","","","","","","","",""]
[null,198]
[null,null,{"$f":"IF(ISERROR(INDEX($O$16:$P$55,MATCH(C410,$O$16:$O$55),2)),\"\",INDEX($O$16:$P$55,MATCH(C410,$O$16:$O$55),2))","v":""},"","","","","","","","",""]
[null,199]
[null,null,{"$f":"IF(ISERROR(INDEX($O$16:$P$55,MATCH(C412,$O$16:$O$55),2)),\"\",INDEX($O$16:$P$55,MATCH(C412,$O$16:$O$55),2))","v":""},"","","","","","","","",""]
[null,200]
[null,null,{"$f":"IF(ISERROR(INDEX($O$16:$P$55,MATCH(C414,$O$16:$O$55),2)),\"\",INDEX($O$16:$P$55,MATCH(C414,$O$16:$O$55),2))","v":""},"","","","","","","","",""]
[null,201]
[null,null,{"$f":"IF(ISERROR(INDEX($O$16:$P$55,MATCH(C416,$O$16:$O$55),2)),\"\",INDEX($O$16:$P$55,MATCH(C416,$O$16:$O$55),2))","v":""},"","","","","","","","",""]
[null,202]
[null,null,{"$f":"IF(ISERROR(INDEX($O$16:$P$55,MATCH(C418,$O$16:$O$55),2)),\"\",INDEX($O$16:$P$55,MATCH(C418,$O$16:$O$55),2))","v":""},"","","","","","","","",""]
[null,203]
[null,null,{"$f":"IF(ISERROR(INDEX($O$16:$P$55,MATCH(C420,$O$16:$O$55),2)),\"\",INDEX($O$16:$P$55,MATCH(C420,$O$16:$O$55),2))","v":""},"","","","","","","","",""]
[null,204]
[null,null,{"$f":"IF(ISERROR(INDEX($O$16:$P$55,MATCH(C422,$O$16:$O$55),2)),\"\",INDEX($O$16:$P$55,MATCH(C422,$O$16:$O$55),2))","v":""},"","","","","","","","",""]
[null,205]
[null,null,{"$f":"IF(ISERROR(INDEX($O$16:$P$55,MATCH(C424,$O$16:$O$55),2)),\"\",INDEX($O$16:$P$55,MATCH(C424,$O$16:$O$55),2))","v":""},"","","","","","","","",""]
[null,206]
[null,null,{"$f":"IF(ISERROR(INDEX($O$16:$P$55,MATCH(C426,$O$16:$O$55),2)),\"\",INDEX($O$16:$P$55,MATCH(C426,$O$16:$O$55),2))","v":""},"","","","","","","","",""]
[null,207]
[null,null,{"$f":"IF(ISERROR(INDEX($O$16:$P$55,MATCH(C428,$O$16:$O$55),2)),\"\",INDEX($O$16:$P$55,MATCH(C428,$O$16:$O$55),2))","v":""},"","","","","","","","",""]
[null,208]
[null,null,{"$f":"IF(ISERROR(INDEX($O$16:$P$55,MATCH(C430,$O$16:$O$55),2)),\"\",INDEX($O$16:$P$55,MATCH(C430,$O$16:$O$55),2))","v":""},"","","","","","","","",""]
[null,209]
[null,null,{"$f":"IF(ISERROR(INDEX($O$16:$P$55,MATCH(C432,$O$16:$O$55),2)),\"\",INDEX($O$16:$P$55,MATCH(C432,$O$16:$O$55),2))","v":""},"","","","","","","","",""]
[null,210]
[null,null,{"$f":"IF(ISERROR(INDEX($O$16:$P$55,MATCH(C434,$O$16:$O$55),2)),\"\",INDEX($O$16:$P$55,MATCH(C434,$O$16:$O$55),2))","v":""},"","","","","","","","",""]
[null,211]
[null,null,{"$f":"IF(ISERROR(INDEX($O$16:$P$55,MATCH(C436,$O$16:$O$55),2)),\"\",INDEX($O$16:$P$55,MATCH(C436,$O$16:$O$55),2))","v":""},"","","","","","","","",""]
[null,212]
[null,null,{"$f":"IF(ISERROR(INDEX($O$16:$P$55,MATCH(C438,$O$16:$O$55),2)),\"\",INDEX($O$16:$P$55,MATCH(C438,$O$16:$O$55),2))","v":""},"","","","","","","","",""]
[null,213]
[null,null,{"$f":"IF(ISERROR(INDEX($O$16:$P$55,MATCH(C440,$O$16:$O$55),2)),\"\",INDEX($O$16:$P$55,MATCH(C440,$O$16:$O$55),2))","v":""},"","","","","","","","",""]
[null,214]
[null,null,{"$f":"IF(ISERROR(INDEX($O$16:$P$55,MATCH(C442,$O$16:$O$55),2)),\"\",INDEX($O$16:$P$55,MATCH(C442,$O$16:$O$55),2))","v":""},"","","","","","","","",""]
[null,215]
[null,null,{"$f":"IF(ISERROR(INDEX($O$16:$P$55,MATCH(C444,$O$16:$O$55),2)),\"\",INDEX($O$16:$P$55,MATCH(C444,$O$16:$O$55),2))","v":""},"","","","","","","","",""]
[null,216]
[null,null,{"$f":"IF(ISERROR(INDEX($O$16:$P$55,MATCH(C446,$O$16:$O$55),2)),\"\",INDEX($O$16:$P$55,MATCH(C446,$O$16:$O$55),2))","v":""},"","","","","","","","",""]
[null,217]
[null,null,{"$f":"IF(ISERROR(INDEX($O$16:$P$55,MATCH(C448,$O$16:$O$55),2)),\"\",INDEX($O$16:$P$55,MATCH(C448,$O$16:$O$55),2))","v":""},"","","","","","","","",""]
[null,218]
[null,null,{"$f":"IF(ISERROR(INDEX($O$16:$P$55,MATCH(C450,$O$16:$O$55),2)),\"\",INDEX($O$16:$P$55,MATCH(C450,$O$16:$O$55),2))","v":""},"","","","","","","","",""]
[null,219]
[null,null,{"$f":"IF(ISERROR(INDEX($O$16:$P$55,MATCH(C452,$O$16:$O$55),2)),\"\",INDEX($O$16:$P$55,MATCH(C452,$O$16:$O$55),2))","v":""},"","","","","","","","",""]
[null,220]
[null,null,{"$f":"IF(ISERROR(INDEX($O$16:$P$55,MATCH(C454,$O$16:$O$55),2)),\"\",INDEX($O$16:$P$55,MATCH(C454,$O$16:$O$55),2))","v":""},"","","","","","","","",""]
[null,221]
[null,null,{"$f":"IF(ISERROR(INDEX($O$16:$P$55,MATCH(C456,$O$16:$O$55),2)),\"\",INDEX($O$16:$P$55,MATCH(C456,$O$16:$O$55),2))","v":""},"","","","","","","","",""]
[null,222]
[null,null,{"$f":"IF(ISERROR(INDEX($O$16:$P$55,MATCH(C458,$O$16:$O$55),2)),\"\",INDEX($O$16:$P$55,MATCH(C458,$O$16:$O$55),2))","v":""},"","","","","","","","",""]
[null,223]
[null,null,{"$f":"IF(ISERROR(INDEX($O$16:$P$55,MATCH(C460,$O$16:$O$55),2)),\"\",INDEX($O$16:$P$55,MATCH(C460,$O$16:$O$55),2))","v":""},"","","","","","","","",""]
[null,224]
[null,null,{"$f":"IF(ISERROR(INDEX($O$16:$P$55,MATCH(C462,$O$16:$O$55),2)),\"\",INDEX($O$16:$P$55,MATCH(C462,$O$16:$O$55),2))","v":""},"","","","","","","","",""]
[null,225]
[null,null,{"$f":"IF(ISERROR(INDEX($O$16:$P$55,MATCH(C464,$O$16:$O$55),2)),\"\",INDEX($O$16:$P$55,MATCH(C464,$O$16:$O$55),2))","v":""},"","","","","","","","",""]
[null,226]
[null,null,{"$f":"IF(ISERROR(INDEX($O$16:$P$55,MATCH(C466,$O$16:$O$55),2)),\"\",INDEX($O$16:$P$55,MATCH(C466,$O$16:$O$55),2))","v":""},"","","","","","","","",""]
[null,227]
[null,null,{"$f":"IF(ISERROR(INDEX($O$16:$P$55,MATCH(C468,$O$16:$O$55),2)),\"\",INDEX($O$16:$P$55,MATCH(C468,$O$16:$O$55),2))","v":""},"","","","","","","","",""]
[null,228]
[null,null,{"$f":"IF(ISERROR(INDEX($O$16:$P$55,MATCH(C470,$O$16:$O$55),2)),\"\",INDEX($O$16:$P$55,MATCH(C470,$O$16:$O$55),2))","v":""},"","","","","","","","",""]
[null,229]
[null,null,{"$f":"IF(ISERROR(INDEX($O$16:$P$55,MATCH(C472,$O$16:$O$55),2)),\"\",INDEX($O$16:$P$55,MATCH(C472,$O$16:$O$55),2))","v":""},"","","","","","","","",""]
[null,230]
[null,null,{"$f":"IF(ISERROR(INDEX($O$16:$P$55,MATCH(C474,$O$16:$O$55),2)),\"\",INDEX($O$16:$P$55,MATCH(C474,$O$16:$O$55),2))","v":""},"","","","","","","","",""]
[null,231]
[null,null,{"$f":"IF(ISERROR(INDEX($O$16:$P$55,MATCH(C476,$O$16:$O$55),2)),\"\",INDEX($O$16:$P$55,MATCH(C476,$O$16:$O$55),2))","v":""},"","","","","","","","",""]
[null,232]
[null,null,{"$f":"IF(ISERROR(INDEX($O$16:$P$55,MATCH(C478,$O$16:$O$55),2)),\"\",INDEX($O$16:$P$55,MATCH(C478,$O$16:$O$55),2))","v":""},"","","","","","","","",""]
[null,233]
[null,null,{"$f":"IF(ISERROR(INDEX($O$16:$P$55,MATCH(C480,$O$16:$O$55),2)),\"\",INDEX($O$16:$P$55,MATCH(C480,$O$16:$O$55),2))","v":""},"","","","","","","","",""]
[null,234]
[null,null,{"$f":"IF(ISERROR(INDEX($O$16:$P$55,MATCH(C482,$O$16:$O$55),2)),\"\",INDEX($O$16:$P$55,MATCH(C482,$O$16:$O$55),2))","v":""},"","","","","","","","",""]
[null,235]
[null,null,{"$f":"IF(ISERROR(INDEX($O$16:$P$55,MATCH(C484,$O$16:$O$55),2)),\"\",INDEX($O$16:$P$55,MATCH(C484,$O$16:$O$55),2))","v":""},"","","","","","","","",""]
[null,236]
[null,null,{"$f":"IF(ISERROR(INDEX($O$16:$P$55,MATCH(C486,$O$16:$O$55),2)),\"\",INDEX($O$16:$P$55,MATCH(C486,$O$16:$O$55),2))","v":""},"","","","","","","","",""]
[null,237]
[null,null,{"$f":"IF(ISERROR(INDEX($O$16:$P$55,MATCH(C488,$O$16:$O$55),2)),\"\",INDEX($O$16:$P$55,MATCH(C488,$O$16:$O$55),2))","v":""},"","","","","","","","",""]
[null,238]
[null,null,{"$f":"IF(ISERROR(INDEX($O$16:$P$55,MATCH(C490,$O$16:$O$55),2)),\"\",INDEX($O$16:$P$55,MATCH(C490,$O$16:$O$55),2))","v":""},"","","","","","","","",""]
[null,239]
[null,null,{"$f":"IF(ISERROR(INDEX($O$16:$P$55,MATCH(C492,$O$16:$O$55),2)),\"\",INDEX($O$16:$P$55,MATCH(C492,$O$16:$O$55),2))","v":""},"","","","","","","","",""]
[null,240]
[null,null,{"$f":"IF(ISERROR(INDEX($O$16:$P$55,MATCH(C494,$O$16:$O$55),2)),\"\",INDEX($O$16:$P$55,MATCH(C494,$O$16:$O$55),2))","v":""},"","","","","","","","",""]
[null,241]
[null,null,{"$f":"IF(ISERROR(INDEX($O$16:$P$55,MATCH(C496,$O$16:$O$55),2)),\"\",INDEX($O$16:$P$55,MATCH(C496,$O$16:$O$55),2))","v":""},"","","","","","","","",""]
[null,242]
[null,null,{"$f":"IF(ISERROR(INDEX($O$16:$P$55,MATCH(C498,$O$16:$O$55),2)),\"\",INDEX($O$16:$P$55,MATCH(C498,$O$16:$O$55),2))","v":""},"","","","","","","","",""]
[null,243]
[null,null,{"$f":"IF(ISERROR(INDEX($O$16:$P$55,MATCH(C500,$O$16:$O$55),2)),\"\",INDEX($O$16:$P$55,MATCH(C500,$O$16:$O$55),2))","v":""},"","","","","","","","",""]
[null,244]
[null,null,{"$f":"IF(ISERROR(INDEX($O$16:$P$55,MATCH(C502,$O$16:$O$55),2)),\"\",INDEX($O$16:$P$55,MATCH(C502,$O$16:$O$55),2))","v":""},"","","","","","","","",""]
[null,245]
[null,null,{"$f":"IF(ISERROR(INDEX($O$16:$P$55,MATCH(C504,$O$16:$O$55),2)),\"\",INDEX($O$16:$P$55,MATCH(C504,$O$16:$O$55),2))","v":""},"","","","","","","","",""]
[null,246]
[null,null,{"$f":"IF(ISERROR(INDEX($O$16:$P$55,MATCH(C506,$O$16:$O$55),2)),\"\",INDEX($O$16:$P$55,MATCH(C506,$O$16:$O$55),2))","v":""},"","","","","","","","",""]
[null,247]
[null,null,{"$f":"IF(ISERROR(INDEX($O$16:$P$55,MATCH(C508,$O$16:$O$55),2)),\"\",INDEX($O$16:$P$55,MATCH(C508,$O$16:$O$55),2))","v":""},"","","","","","","","",""]
[null,248]
[null,null,{"$f":"IF(ISERROR(INDEX($O$16:$P$55,MATCH(C510,$O$16:$O$55),2)),\"\",INDEX($O$16:$P$55,MATCH(C510,$O$16:$O$55),2))","v":""},"","","","","","","","",""]
[null,249]
[null,null,{"$f":"IF(ISERROR(INDEX($O$16:$P$55,MATCH(C512,$O$16:$O$55),2)),\"\",INDEX($O$16:$P$55,MATCH(C512,$O$16:$O$55),2))","v":""},"","","","","","","","",""]
[null,250]
[null,null,{"$f":"IF(ISERROR(INDEX($O$16:$P$55,MATCH(C514,$O$16:$O$55),2)),\"\",INDEX($O$16:$P$55,MATCH(C514,$O$16:$O$55),2))","v":""},"","","","","","","","",""]
[null,251]
[null,null,{"$f":"IF(ISERROR(INDEX($O$16:$P$55,MATCH(C516,$O$16:$O$55),2)),\"\",INDEX($O$16:$P$55,MATCH(C516,$O$16:$O$55),2))","v":""},"","","","","","","","",""]
[null,252]
[null,null,{"$f":"IF(ISERROR(INDEX($O$16:$P$55,MATCH(C518,$O$16:$O$55),2)),\"\",INDEX($O$16:$P$55,MATCH(C518,$O$16:$O$55),2))","v":""},"","","","","","","","",""]
[null,253]
[null,null,{"$f":"IF(ISERROR(INDEX($O$16:$P$55,MATCH(C520,$O$16:$O$55),2)),\"\",INDEX($O$16:$P$55,MATCH(C520,$O$16:$O$55),2))","v":""},"","","","","","","","",""]
[null,254]
[null,null,{"$f":"IF(ISERROR(INDEX($O$16:$P$55,MATCH(C522,$O$16:$O$55),2)),\"\",INDEX($O$16:$P$55,MATCH(C522,$O$16:$O$55),2))","v":""},"","","","","","","","",""]
[null,255]
[null,null,{"$f":"IF(ISERROR(INDEX($O$16:$P$55,MATCH(C524,$O$16:$O$55),2)),\"\",INDEX($O$16:$P$55,MATCH(C524,$O$16:$O$55),2))","v":""},"","","","","","","","",""]
[null,256]
[null,null,{"$f":"IF(ISERROR(INDEX($O$16:$P$55,MATCH(C526,$O$16:$O$55),2)),\"\",INDEX($O$16:$P$55,MATCH(C526,$O$16:$O$55),2))","v":""},"","","","","","","","",""]
[null,257]
[null,null,{"$f":"IF(ISERROR(INDEX($O$16:$P$55,MATCH(C528,$O$16:$O$55),2)),\"\",INDEX($O$16:$P$55,MATCH(C528,$O$16:$O$55),2))","v":""},"","","","","","","","",""]
[null,258]
[null,null,{"$f":"IF(ISERROR(INDEX($O$16:$P$55,MATCH(C530,$O$16:$O$55),2)),\"\",INDEX($O$16:$P$55,MATCH(C530,$O$16:$O$55),2))","v":""},"","","","","","","","",""]
[null,259]
[null,null,{"$f":"IF(ISERROR(INDEX($O$16:$P$55,MATCH(C532,$O$16:$O$55),2)),\"\",INDEX($O$16:$P$55,MATCH(C532,$O$16:$O$55),2))","v":""},"","","","","","","","",""]
[null,260]
[null,null,{"$f":"IF(ISERROR(INDEX($O$16:$P$55,MATCH(C534,$O$16:$O$55),2)),\"\",INDEX($O$16:$P$55,MATCH(C534,$O$16:$O$55),2))","v":""},"","","","","","","","",""]
[null,261]
[null,null,{"$f":"IF(ISERROR(INDEX($O$16:$P$55,MATCH(C536,$O$16:$O$55),2)),\"\",INDEX($O$16:$P$55,MATCH(C536,$O$16:$O$55),2))","v":""},"","","","","","","","",""]
[null,262]
[null,null,{"$f":"IF(ISERROR(INDEX($O$16:$P$55,MATCH(C538,$O$16:$O$55),2)),\"\",INDEX($O$16:$P$55,MATCH(C538,$O$16:$O$55),2))","v":""},"","","","","","","","",""]
[null,263]
[null,null,{"$f":"IF(ISERROR(INDEX($O$16:$P$55,MATCH(C540,$O$16:$O$55),2)),\"\",INDEX($O$16:$P$55,MATCH(C540,$O$16:$O$55),2))","v":""},"","","","","","","","",""]
[null,264]
[null,null,{"$f":"IF(ISERROR(INDEX($O$16:$P$55,MATCH(C542,$O$16:$O$55),2)),\"\",INDEX($O$16:$P$55,MATCH(C542,$O$16:$O$55),2))","v":""},"","","","","","","","",""]
[null,265]
[null,null,{"$f":"IF(ISERROR(INDEX($O$16:$P$55,MATCH(C544,$O$16:$O$55),2)),\"\",INDEX($O$16:$P$55,MATCH(C544,$O$16:$O$55),2))","v":""},"","","","","","","","",""]
[null,266]
[null,null,{"$f":"IF(ISERROR(INDEX($O$16:$P$55,MATCH(C546,$O$16:$O$55),2)),\"\",INDEX($O$16:$P$55,MATCH(C546,$O$16:$O$55),2))","v":""},"","","","","","","","",""]
[null,267]
[null,null,{"$f":"IF(ISERROR(INDEX($O$16:$P$55,MATCH(C548,$O$16:$O$55),2)),\"\",INDEX($O$16:$P$55,MATCH(C548,$O$16:$O$55),2))","v":""},"","","","","","","","",""]
[null,268]
[null,null,{"$f":"IF(ISERROR(INDEX($O$16:$P$55,MATCH(C550,$O$16:$O$55),2)),\"\",INDEX($O$16:$P$55,MATCH(C550,$O$16:$O$55),2))","v":""},"","","","","","","","",""]
[null,269]
[null,null,{"$f":"IF(ISERROR(INDEX($O$16:$P$55,MATCH(C552,$O$16:$O$55),2)),\"\",INDEX($O$16:$P$55,MATCH(C552,$O$16:$O$55),2))","v":""},"","","","","","","","",""]
[null,270]
[null,null,{"$f":"IF(ISERROR(INDEX($O$16:$P$55,MATCH(C554,$O$16:$O$55),2)),\"\",INDEX($O$16:$P$55,MATCH(C554,$O$16:$O$55),2))","v":""},"","","","","","","","",""]
[null,271]
[null,null,{"$f":"IF(ISERROR(INDEX($O$16:$P$55,MATCH(C556,$O$16:$O$55),2)),\"\",INDEX($O$16:$P$55,MATCH(C556,$O$16:$O$55),2))","v":""},"","","","","","","","",""]
[null,272]
[null,null,{"$f":"IF(ISERROR(INDEX($O$16:$P$55,MATCH(C558,$O$16:$O$55),2)),\"\",INDEX($O$16:$P$55,MATCH(C558,$O$16:$O$55),2))","v":""},"","","","","","","","",""]
[null,273]
[null,null,{"$f":"IF(ISERROR(INDEX($O$16:$P$55,MATCH(C560,$O$16:$O$55),2)),\"\",INDEX($O$16:$P$55,MATCH(C560,$O$16:$O$55),2))","v":""},"","","","","","","","",""]
[null,274]
[null,null,{"$f":"IF(ISERROR(INDEX($O$16:$P$55,MATCH(C562,$O$16:$O$55),2)),\"\",INDEX($O$16:$P$55,MATCH(C562,$O$16:$O$55),2))","v":""},"","","","","","","","",""]
[null,275]
[null,null,{"$f":"IF(ISERROR(INDEX($O$16:$P$55,MATCH(C564,$O$16:$O$55),2)),\"\",INDEX($O$16:$P$55,MATCH(C564,$O$16:$O$55),2))","v":""},"","","","","","","","",""]
[null,276]
[null,null,{"$f":"IF(ISERROR(INDEX($O$16:$P$55,MATCH(C566,$O$16:$O$55),2)),\"\",INDEX($O$16:$P$55,MATCH(C566,$O$16:$O$55),2))","v":""},"","","","","","","","",""]
[null,277]
[null,null,{"$f":"IF(ISERROR(INDEX($O$16:$P$55,MATCH(C568,$O$16:$O$55),2)),\"\",INDEX($O$16:$P$55,MATCH(C568,$O$16:$O$55),2))","v":""},"","","","","","","","",""]
[null,278]
[null,null,{"$f":"IF(ISERROR(INDEX($O$16:$P$55,MATCH(C570,$O$16:$O$55),2)),\"\",INDEX($O$16:$P$55,MATCH(C570,$O$16:$O$55),2))","v":""},"","","","","","","","",""]
[null,279]
[null,null,{"$f":"IF(ISERROR(INDEX($O$16:$P$55,MATCH(C572,$O$16:$O$55),2)),\"\",INDEX($O$16:$P$55,MATCH(C572,$O$16:$O$55),2))","v":""},"","","","","","","","",""]
[null,280]
[null,null,{"$f":"IF(ISERROR(INDEX($O$16:$P$55,MATCH(C574,$O$16:$O$55),2)),\"\",INDEX($O$16:$P$55,MATCH(C574,$O$16:$O$55),2))","v":""},"","","","","","","","",""]
[null,281]
[null,null,{"$f":"IF(ISERROR(INDEX($O$16:$P$55,MATCH(C576,$O$16:$O$55),2)),\"\",INDEX($O$16:$P$55,MATCH(C576,$O$16:$O$55),2))","v":""},"","","","","","","","",""]
[null,282]
[null,null,{"$f":"IF(ISERROR(INDEX($O$16:$P$55,MATCH(C578,$O$16:$O$55),2)),\"\",INDEX($O$16:$P$55,MATCH(C578,$O$16:$O$55),2))","v":""},"","","","","","","","",""]
[null,283]
[null,null,{"$f":"IF(ISERROR(INDEX($O$16:$P$55,MATCH(C580,$O$16:$O$55),2)),\"\",INDEX($O$16:$P$55,MATCH(C580,$O$16:$O$55),2))","v":""},"","","","","","","","",""]
[null,284]
[null,null,{"$f":"IF(ISERROR(INDEX($O$16:$P$55,MATCH(C582,$O$16:$O$55),2)),\"\",INDEX($O$16:$P$55,MATCH(C582,$O$16:$O$55),2))","v":""},"","","","","","","","",""]
[null,285]
[null,null,{"$f":"IF(ISERROR(INDEX($O$16:$P$55,MATCH(C584,$O$16:$O$55),2)),\"\",INDEX($O$16:$P$55,MATCH(C584,$O$16:$O$55),2))","v":""},"","","","","","","","",""]
[null,286]
[null,null,{"$f":"IF(ISERROR(INDEX($O$16:$P$55,MATCH(C586,$O$16:$O$55),2)),\"\",INDEX($O$16:$P$55,MATCH(C586,$O$16:$O$55),2))","v":""},"","","","","","","","",""]
[null,287]
[null,null,{"$f":"IF(ISERROR(INDEX($O$16:$P$55,MATCH(C588,$O$16:$O$55),2)),\"\",INDEX($O$16:$P$55,MATCH(C588,$O$16:$O$55),2))","v":""},"","","","","","","","",""]
[null,288]
[null,null,{"$f":"IF(ISERROR(INDEX($O$16:$P$55,MATCH(C590,$O$16:$O$55),2)),\"\",INDEX($O$16:$P$55,MATCH(C590,$O$16:$O$55),2))","v":""},"","","","","","","","",""]
[null,289]
[null,null,{"$f":"IF(ISERROR(INDEX($O$16:$P$55,MATCH(C592,$O$16:$O$55),2)),\"\",INDEX($O$16:$P$55,MATCH(C592,$O$16:$O$55),2))","v":""},"","","","","","","","",""]
[null,290]
[null,null,{"$f":"IF(ISERROR(INDEX($O$16:$P$55,MATCH(C594,$O$16:$O$55),2)),\"\",INDEX($O$16:$P$55,MATCH(C594,$O$16:$O$55),2))","v":""},"","","","","","","","",""]
[null,291]
[null,null,{"$f":"IF(ISERROR(INDEX($O$16:$P$55,MATCH(C596,$O$16:$O$55),2)),\"\",INDEX($O$16:$P$55,MATCH(C596,$O$16:$O$55),2))","v":""},"","","","","","","","",""]
[null,292]
[null,null,{"$f":"IF(ISERROR(INDEX($O$16:$P$55,MATCH(C598,$O$16:$O$55),2)),\"\",INDEX($O$16:$P$55,MATCH(C598,$O$16:$O$55),2))","v":""},"","","","","","","","",""]
[null,293]
[null,null,{"$f":"IF(ISERROR(INDEX($O$16:$P$55,MATCH(C600,$O$16:$O$55),2)),\"\",INDEX($O$16:$P$55,MATCH(C600,$O$16:$O$55),2))","v":""},"","","","","","","","",""]
[null,294]
[null,null,{"$f":"IF(ISERROR(INDEX($O$16:$P$55,MATCH(C602,$O$16:$O$55),2)),\"\",INDEX($O$16:$P$55,MATCH(C602,$O$16:$O$55),2))","v":""},"","","","","","","","",""]
[null,295]
[null,null,{"$f":"IF(ISERROR(INDEX($O$16:$P$55,MATCH(C604,$O$16:$O$55),2)),\"\",INDEX($O$16:$P$55,MATCH(C604,$O$16:$O$55),2))","v":""},"","","","","","","","",""]
[null,296]
[null,null,{"$f":"IF(ISERROR(INDEX($O$16:$P$55,MATCH(C606,$O$16:$O$55),2)),\"\",INDEX($O$16:$P$55,MATCH(C606,$O$16:$O$55),2))","v":""},"","","","","","","","",""]
[null,297]
[null,null,{"$f":"IF(ISERROR(INDEX($O$16:$P$55,MATCH(C608,$O$16:$O$55),2)),\"\",INDEX($O$16:$P$55,MATCH(C608,$O$16:$O$55),2))","v":""},"","","","","","","","",""]
[null,298]
[null,null,{"$f":"IF(ISERROR(INDEX($O$16:$P$55,MATCH(C610,$O$16:$O$55),2)),\"\",INDEX($O$16:$P$55,MATCH(C610,$O$16:$O$55),2))","v":""},"","","","","","","","",""]
[null,299]
[null,null,{"$f":"IF(ISERROR(INDEX($O$16:$P$55,MATCH(C612,$O$16:$O$55),2)),\"\",INDEX($O$16:$P$55,MATCH(C612,$O$16:$O$55),2))","v":""},"","","","","","","","",""]
[null,300]
[null,null,{"$f":"IF(ISERROR(INDEX($O$16:$P$55,MATCH(C614,$O$16:$O$55),2)),\"\",INDEX($O$16:$P$55,MATCH(C614,$O$16:$O$55),2))","v":""},"","","","","","","","",""]
[null,301]
[null,null,{"$f":"IF(ISERROR(INDEX($O$16:$P$55,MATCH(C616,$O$16:$O$55),2)),\"\",INDEX($O$16:$P$55,MATCH(C616,$O$16:$O$55),2))","v":""},"","","","","","","","",""]
[null,302]
[null,null,{"$f":"IF(ISERROR(INDEX($O$16:$P$55,MATCH(C618,$O$16:$O$55),2)),\"\",INDEX($O$16:$P$55,MATCH(C618,$O$16:$O$55),2))","v":""},"","","","","","","","",""]
[null,303]
[null,null,{"$f":"IF(ISERROR(INDEX($O$16:$P$55,MATCH(C620,$O$16:$O$55),2)),\"\",INDEX($O$16:$P$55,MATCH(C620,$O$16:$O$55),2))","v":""},"","","","","","","","",""]
[null,304]
[null,null,{"$f":"IF(ISERROR(INDEX($O$16:$P$55,MATCH(C622,$O$16:$O$55),2)),\"\",INDEX($O$16:$P$55,MATCH(C622,$O$16:$O$55),2))","v":""},"","","","","","","","",""]
[null,305]
[null,null,{"$f":"IF(ISERROR(INDEX($O$16:$P$55,MATCH(C624,$O$16:$O$55),2)),\"\",INDEX($O$16:$P$55,MATCH(C624,$O$16:$O$55),2))","v":""},"","","","","","","","",""]
[null,306]
[null,null,{"$f":"IF(ISERROR(INDEX($O$16:$P$55,MATCH(C626,$O$16:$O$55),2)),\"\",INDEX($O$16:$P$55,MATCH(C626,$O$16:$O$55),2))","v":""},"","","","","","","","",""]
[null,307]
[null,null,{"$f":"IF(ISERROR(INDEX($O$16:$P$55,MATCH(C628,$O$16:$O$55),2)),\"\",INDEX($O$16:$P$55,MATCH(C628,$O$16:$O$55),2))","v":""},"","","","","","","","",""]
[null,308]
[null,null,{"$f":"IF(ISERROR(INDEX($O$16:$P$55,MATCH(C630,$O$16:$O$55),2)),\"\",INDEX($O$16:$P$55,MATCH(C630,$O$16:$O$55),2))","v":""},"","","","","","","","",""]
[null,309]
[null,null,{"$f":"IF(ISERROR(INDEX($O$16:$P$55,MATCH(C632,$O$16:$O$55),2)),\"\",INDEX($O$16:$P$55,MATCH(C632,$O$16:$O$55),2))","v":""},"","","","","","","","",""]
[null,310]
[null,null,{"$f":"IF(ISERROR(INDEX($O$16:$P$55,MATCH(C634,$O$16:$O$55),2)),\"\",INDEX($O$16:$P$55,MATCH(C634,$O$16:$O$55),2))","v":""},"","","","","","","","",""]
[null,311]
[null,null,{"$f":"IF(ISERROR(INDEX($O$16:$P$55,MATCH(C636,$O$16:$O$55),2)),\"\",INDEX($O$16:$P$55,MATCH(C636,$O$16:$O$55),2))","v":""},"","","","","","","","",""]
[null,312]
[null,null,{"$f":"IF(ISERROR(INDEX($O$16:$P$55,MATCH(C638,$O$16:$O$55),2)),\"\",INDEX($O$16:$P$55,MATCH(C638,$O$16:$O$55),2))","v":""},"","","","","","","","",""]
[null,313]
[null,null,{"$f":"IF(ISERROR(INDEX($O$16:$P$55,MATCH(C640,$O$16:$O$55),2)),\"\",INDEX($O$16:$P$55,MATCH(C640,$O$16:$O$55),2))","v":""},"","","","","","","","",""]
[null,314]
[null,null,{"$f":"IF(ISERROR(INDEX($O$16:$P$55,MATCH(C642,$O$16:$O$55),2)),\"\",INDEX($O$16:$P$55,MATCH(C642,$O$16:$O$55),2))","v":""},"","","","","","","","",""]
[null,315]
[null,null,{"$f":"IF(ISERROR(INDEX($O$16:$P$55,MATCH(C644,$O$16:$O$55),2)),\"\",INDEX($O$16:$P$55,MATCH(C644,$O$16:$O$55),2))","v":""},"","","","","","","","",""]
[null,316]
[null,null,{"$f":"IF(ISERROR(INDEX($O$16:$P$55,MATCH(C646,$O$16:$O$55),2)),\"\",INDEX($O$16:$P$55,MATCH(C646,$O$16:$O$55),2))","v":""},"","","","","","","","",""]
[null,317]
[null,null,{"$f":"IF(ISERROR(INDEX($O$16:$P$55,MATCH(C648,$O$16:$O$55),2)),\"\",INDEX($O$16:$P$55,MATCH(C648,$O$16:$O$55),2))","v":""},"","","","","","","","",""]
[null,318]
[null,null,{"$f":"IF(ISERROR(INDEX($O$16:$P$55,MATCH(C650,$O$16:$O$55),2)),\"\",INDEX($O$16:$P$55,MATCH(C650,$O$16:$O$55),2))","v":""},"","","","","","","","",""]
[null,319]
[null,null,{"$f":"IF(ISERROR(INDEX($O$16:$P$55,MATCH(C652,$O$16:$O$55),2)),\"\",INDEX($O$16:$P$55,MATCH(C652,$O$16:$O$55),2))","v":""},"","","","","","","","",""]
[null,320]
[null,null,{"$f":"IF(ISERROR(INDEX($O$16:$P$55,MATCH(C654,$O$16:$O$55),2)),\"\",INDEX($O$16:$P$55,MATCH(C654,$O$16:$O$55),2))","v":""},"","","","","","","","",""]
[null,321]
[null,null,{"$f":"IF(ISERROR(INDEX($O$16:$P$55,MATCH(C656,$O$16:$O$55),2)),\"\",INDEX($O$16:$P$55,MATCH(C656,$O$16:$O$55),2))","v":""},"","","","","","","","",""]
[null,322]
[null,null,{"$f":"IF(ISERROR(INDEX($O$16:$P$55,MATCH(C658,$O$16:$O$55),2)),\"\",INDEX($O$16:$P$55,MATCH(C658,$O$16:$O$55),2))","v":""},"","","","","","","","",""]
[null,323]
[null,null,{"$f":"IF(ISERROR(INDEX($O$16:$P$55,MATCH(C660,$O$16:$O$55),2)),\"\",INDEX($O$16:$P$55,MATCH(C660,$O$16:$O$55),2))","v":""},"","","","","","","","",""]
[null,324]
[null,null,{"$f":"IF(ISERROR(INDEX($O$16:$P$55,MATCH(C662,$O$16:$O$55),2)),\"\",INDEX($O$16:$P$55,MATCH(C662,$O$16:$O$55),2))","v":""},"","","","","","","","",""]
[null,325]
[null,null,{"$f":"IF(ISERROR(INDEX($O$16:$P$55,MATCH(C664,$O$16:$O$55),2)),\"\",INDEX($O$16:$P$55,MATCH(C664,$O$16:$O$55),2))","v":""},"","","","","","","","",""]
[null,326]
[null,null,{"$f":"IF(ISERROR(INDEX($O$16:$P$55,MATCH(C666,$O$16:$O$55),2)),\"\",INDEX($O$16:$P$55,MATCH(C666,$O$16:$O$55),2))","v":""},"","","","","","","","",""]
[null,327]
[null,null,{"$f":"IF(ISERROR(INDEX($O$16:$P$55,MATCH(C668,$O$16:$O$55),2)),\"\",INDEX($O$16:$P$55,MATCH(C668,$O$16:$O$55),2))","v":""},"","","","","","","","",""]
[null,328]
[null,null,{"$f":"IF(ISERROR(INDEX($O$16:$P$55,MATCH(C670,$O$16:$O$55),2)),\"\",INDEX($O$16:$P$55,MATCH(C670,$O$16:$O$55),2))","v":""},"","","","","","","","",""]
[null,329]
[null,null,{"$f":"IF(ISERROR(INDEX($O$16:$P$55,MATCH(C672,$O$16:$O$55),2)),\"\",INDEX($O$16:$P$55,MATCH(C672,$O$16:$O$55),2))","v":""},"","","","","","","","",""]
[null,330]
[null,null,{"$f":"IF(ISERROR(INDEX($O$16:$P$55,MATCH(C674,$O$16:$O$55),2)),\"\",INDEX($O$16:$P$55,MATCH(C674,$O$16:$O$55),2))","v":""},"","","","","","","","",""]
[null,331]
[null,null,{"$f":"IF(ISERROR(INDEX($O$16:$P$55,MATCH(C676,$O$16:$O$55),2)),\"\",INDEX($O$16:$P$55,MATCH(C676,$O$16:$O$55),2))","v":""},"","","","","","","","",""]
[null,332]
[null,null,{"$f":"IF(ISERROR(INDEX($O$16:$P$55,MATCH(C678,$O$16:$O$55),2)),\"\",INDEX($O$16:$P$55,MATCH(C678,$O$16:$O$55),2))","v":""},"","","","","","","","",""]
[null,333]
[null,null,{"$f":"IF(ISERROR(INDEX($O$16:$P$55,MATCH(C680,$O$16:$O$55),2)),\"\",INDEX($O$16:$P$55,MATCH(C680,$O$16:$O$55),2))","v":""},"","","","","","","","",""]
[null,334]
[null,null,{"$f":"IF(ISERROR(INDEX($O$16:$P$55,MATCH(C682,$O$16:$O$55),2)),\"\",INDEX($O$16:$P$55,MATCH(C682,$O$16:$O$55),2))","v":""},"","","","","","","","",""]
[null,335]
[null,null,{"$f":"IF(ISERROR(INDEX($O$16:$P$55,MATCH(C684,$O$16:$O$55),2)),\"\",INDEX($O$16:$P$55,MATCH(C684,$O$16:$O$55),2))","v":""},"","","","","","","","",""]
[null,336]
[null,null,{"$f":"IF(ISERROR(INDEX($O$16:$P$55,MATCH(C686,$O$16:$O$55),2)),\"\",INDEX($O$16:$P$55,MATCH(C686,$O$16:$O$55),2))","v":""},"","","","","","","","",""]
[null,337]
[null,null,{"$f":"IF(ISERROR(INDEX($O$16:$P$55,MATCH(C688,$O$16:$O$55),2)),\"\",INDEX($O$16:$P$55,MATCH(C688,$O$16:$O$55),2))","v":""},"","","","","","","","",""]
[null,338]
[null,null,{"$f":"IF(ISERROR(INDEX($O$16:$P$55,MATCH(C690,$O$16:$O$55),2)),\"\",INDEX($O$16:$P$55,MATCH(C690,$O$16:$O$55),2))","v":""},"","","","","","","","",""]
[null,339]
[null,null,{"$f":"IF(ISERROR(INDEX($O$16:$P$55,MATCH(C692,$O$16:$O$55),2)),\"\",INDEX($O$16:$P$55,MATCH(C692,$O$16:$O$55),2))","v":""},"","","","","","","","",""]
[null,340]
[null,null,{"$f":"IF(ISERROR(INDEX($O$16:$P$55,MATCH(C694,$O$16:$O$55),2)),\"\",INDEX($O$16:$P$55,MATCH(C694,$O$16:$O$55),2))","v":""},"","","","","","","","",""]
[null,341]
[null,null,{"$f":"IF(ISERROR(INDEX($O$16:$P$55,MATCH(C696,$O$16:$O$55),2)),\"\",INDEX($O$16:$P$55,MATCH(C696,$O$16:$O$55),2))","v":""},"","","","","","","","",""]
[null,342]
[null,null,{"$f":"IF(ISERROR(INDEX($O$16:$P$55,MATCH(C698,$O$16:$O$55),2)),\"\",INDEX($O$16:$P$55,MATCH(C698,$O$16:$O$55),2))","v":""},"","","","","","","","",""]
[null,343]
[null,null,{"$f":"IF(ISERROR(INDEX($O$16:$P$55,MATCH(C700,$O$16:$O$55),2)),\"\",INDEX($O$16:$P$55,MATCH(C700,$O$16:$O$55),2))","v":""},"","","","","","","","",""]
[null,344]
[null,null,{"$f":"IF(ISERROR(INDEX($O$16:$P$55,MATCH(C702,$O$16:$O$55),2)),\"\",INDEX($O$16:$P$55,MATCH(C702,$O$16:$O$55),2))","v":""},"","","","","","","","",""]
[null,345]
[null,null,{"$f":"IF(ISERROR(INDEX($O$16:$P$55,MATCH(C704,$O$16:$O$55),2)),\"\",INDEX($O$16:$P$55,MATCH(C704,$O$16:$O$55),2))","v":""},"","","","","","","","",""]
[null,346]
[null,null,{"$f":"IF(ISERROR(INDEX($O$16:$P$55,MATCH(C706,$O$16:$O$55),2)),\"\",INDEX($O$16:$P$55,MATCH(C706,$O$16:$O$55),2))","v":""},"","","","","","","","",""]
[null,347]
[null,null,{"$f":"IF(ISERROR(INDEX($O$16:$P$55,MATCH(C708,$O$16:$O$55),2)),\"\",INDEX($O$16:$P$55,MATCH(C708,$O$16:$O$55),2))","v":""},"","","","","","","","",""]
[null,348]
[null,null,{"$f":"IF(ISERROR(INDEX($O$16:$P$55,MATCH(C710,$O$16:$O$55),2)),\"\",INDEX($O$16:$P$55,MATCH(C710,$O$16:$O$55),2))","v":""},"","","","","","","","",""]
[null,349]
[null,null,{"$f":"IF(ISERROR(INDEX($O$16:$P$55,MATCH(C712,$O$16:$O$55),2)),\"\",INDEX($O$16:$P$55,MATCH(C712,$O$16:$O$55),2))","v":""},"","","","","","","","",""]
[null,350]
[null,null,{"$f":"IF(ISERROR(INDEX($O$16:$P$55,MATCH(C714,$O$16:$O$55),2)),\"\",INDEX($O$16:$P$55,MATCH(C714,$O$16:$O$55),2))","v":""},"","","","","","","","",""]
[null,351]
[null,null,{"$f":"IF(ISERROR(INDEX($O$16:$P$55,MATCH(C716,$O$16:$O$55),2)),\"\",INDEX($O$16:$P$55,MATCH(C716,$O$16:$O$55),2))","v":""},"","","","","","","","",""]
[null,352]
[null,null,{"$f":"IF(ISERROR(INDEX($O$16:$P$55,MATCH(C718,$O$16:$O$55),2)),\"\",INDEX($O$16:$P$55,MATCH(C718,$O$16:$O$55),2))","v":""},"","","","","","","","",""]
[null,353]
[null,null,{"$f":"IF(ISERROR(INDEX($O$16:$P$55,MATCH(C720,$O$16:$O$55),2)),\"\",INDEX($O$16:$P$55,MATCH(C720,$O$16:$O$55),2))","v":""},"","","","","","","","",""]
[null,354]
[null,null,{"$f":"IF(ISERROR(INDEX($O$16:$P$55,MATCH(C722,$O$16:$O$55),2)),\"\",INDEX($O$16:$P$55,MATCH(C722,$O$16:$O$55),2))","v":""},"","","","","","","","",""]
[null,355]
[null,null,{"$f":"IF(ISERROR(INDEX($O$16:$P$55,MATCH(C724,$O$16:$O$55),2)),\"\",INDEX($O$16:$P$55,MATCH(C724,$O$16:$O$55),2))","v":""},"","","","","","","","",""]
[null,356]
[null,null,{"$f":"IF(ISERROR(INDEX($O$16:$P$55,MATCH(C726,$O$16:$O$55),2)),\"\",INDEX($O$16:$P$55,MATCH(C726,$O$16:$O$55),2))","v":""},"","","","","","","","",""]
[null,357]
[null,null,{"$f":"IF(ISERROR(INDEX($O$16:$P$55,MATCH(C728,$O$16:$O$55),2)),\"\",INDEX($O$16:$P$55,MATCH(C728,$O$16:$O$55),2))","v":""},"","","","","","","","",""]
[null,358]
[null,null,{"$f":"IF(ISERROR(INDEX($O$16:$P$55,MATCH(C730,$O$16:$O$55),2)),\"\",INDEX($O$16:$P$55,MATCH(C730,$O$16:$O$55),2))","v":""},"","","","","","","","",""]
[null,359]
[null,null,{"$f":"IF(ISERROR(INDEX($O$16:$P$55,MATCH(C732,$O$16:$O$55),2)),\"\",INDEX($O$16:$P$55,MATCH(C732,$O$16:$O$55),2))","v":""},"","","","","","","","",""]
[null,360]
[null,null,{"$f":"IF(ISERROR(INDEX($O$16:$P$55,MATCH(C734,$O$16:$O$55),2)),\"\",INDEX($O$16:$P$55,MATCH(C734,$O$16:$O$55),2))","v":""},"","","","","","","","",""]
[null,361]
[null,null,{"$f":"IF(ISERROR(INDEX($O$16:$P$55,MATCH(C736,$O$16:$O$55),2)),\"\",INDEX($O$16:$P$55,MATCH(C736,$O$16:$O$55),2))","v":""},"","","","","","","","",""]
[null,362]
[null,null,{"$f":"IF(ISERROR(INDEX($O$16:$P$55,MATCH(C738,$O$16:$O$55),2)),\"\",INDEX($O$16:$P$55,MATCH(C738,$O$16:$O$55),2))","v":""},"","","","","","","","",""]
[null,363]
[null,null,{"$f":"IF(ISERROR(INDEX($O$16:$P$55,MATCH(C740,$O$16:$O$55),2)),\"\",INDEX($O$16:$P$55,MATCH(C740,$O$16:$O$55),2))","v":""},"","","","","","","","",""]
[null,364]
[null,null,{"$f":"IF(ISERROR(INDEX($O$16:$P$55,MATCH(C742,$O$16:$O$55),2)),\"\",INDEX($O$16:$P$55,MATCH(C742,$O$16:$O$55),2))","v":""},"","","","","","","","",""]
[null,365]
[null,null,{"$f":"IF(ISERROR(INDEX($O$16:$P$55,MATCH(C744,$O$16:$O$55),2)),\"\",INDEX($O$16:$P$55,MATCH(C744,$O$16:$O$55),2))","v":""},"","","","","","","","",""]
[null,366]
[null,null,{"$f":"IF(ISERROR(INDEX($O$16:$P$55,MATCH(C746,$O$16:$O$55),2)),\"\",INDEX($O$16:$P$55,MATCH(C746,$O$16:$O$55),2))","v":""},"","","","","","","","",""]
[null,367]
[null,null,{"$f":"IF(ISERROR(INDEX($O$16:$P$55,MATCH(C748,$O$16:$O$55),2)),\"\",INDEX($O$16:$P$55,MATCH(C748,$O$16:$O$55),2))","v":""},"","","","","","","","",""]
[null,368]
[null,null,{"$f":"IF(ISERROR(INDEX($O$16:$P$55,MATCH(C750,$O$16:$O$55),2)),\"\",INDEX($O$16:$P$55,MATCH(C750,$O$16:$O$55),2))","v":""},"","","","","","","","",""]
[null,369]
[null,null,{"$f":"IF(ISERROR(INDEX($O$16:$P$55,MATCH(C752,$O$16:$O$55),2)),\"\",INDEX($O$16:$P$55,MATCH(C752,$O$16:$O$55),2))","v":""},"","","","","","","","",""]
[null,370]
[null,null,{"$f":"IF(ISERROR(INDEX($O$16:$P$55,MATCH(C754,$O$16:$O$55),2)),\"\",INDEX($O$16:$P$55,MATCH(C754,$O$16:$O$55),2))","v":""},"","","","","","","","",""]
[null,371]
[null,null,{"$f":"IF(ISERROR(INDEX($O$16:$P$55,MATCH(C756,$O$16:$O$55),2)),\"\",INDEX($O$16:$P$55,MATCH(C756,$O$16:$O$55),2))","v":""},"","","","","","","","",""]
[null,372]
[null,null,{"$f":"IF(ISERROR(INDEX($O$16:$P$55,MATCH(C758,$O$16:$O$55),2)),\"\",INDEX($O$16:$P$55,MATCH(C758,$O$16:$O$55),2))","v":""},"","","","","","","","",""]
[null,373]
[null,null,{"$f":"IF(ISERROR(INDEX($O$16:$P$55,MATCH(C760,$O$16:$O$55),2)),\"\",INDEX($O$16:$P$55,MATCH(C760,$O$16:$O$55),2))","v":""},"","","","","","","","",""]
[null,374]
[null,null,{"$f":"IF(ISERROR(INDEX($O$16:$P$55,MATCH(C762,$O$16:$O$55),2)),\"\",INDEX($O$16:$P$55,MATCH(C762,$O$16:$O$55),2))","v":""},"","","","","","","","",""]
[null,375]
[null,null,{"$f":"IF(ISERROR(INDEX($O$16:$P$55,MATCH(C764,$O$16:$O$55),2)),\"\",INDEX($O$16:$P$55,MATCH(C764,$O$16:$O$55),2))","v":""},"","","","","","","","",""]
[null,376]
[null,null,{"$f":"IF(ISERROR(INDEX($O$16:$P$55,MATCH(C766,$O$16:$O$55),2)),\"\",INDEX($O$16:$P$55,MATCH(C766,$O$16:$O$55),2))","v":""},"","","","","","","","",""]
[null,377]
[null,null,{"$f":"IF(ISERROR(INDEX($O$16:$P$55,MATCH(C768,$O$16:$O$55),2)),\"\",INDEX($O$16:$P$55,MATCH(C768,$O$16:$O$55),2))","v":""},"","","","","","","","",""]
[null,378]
[null,null,{"$f":"IF(ISERROR(INDEX($O$16:$P$55,MATCH(C770,$O$16:$O$55),2)),\"\",INDEX($O$16:$P$55,MATCH(C770,$O$16:$O$55),2))","v":""},"","","","","","","","",""]
[null,379]
[null,null,{"$f":"IF(ISERROR(INDEX($O$16:$P$55,MATCH(C772,$O$16:$O$55),2)),\"\",INDEX($O$16:$P$55,MATCH(C772,$O$16:$O$55),2))","v":""},"","","","","","","","",""]
[null,380]
[null,null,{"$f":"IF(ISERROR(INDEX($O$16:$P$55,MATCH(C774,$O$16:$O$55),2)),\"\",INDEX($O$16:$P$55,MATCH(C774,$O$16:$O$55),2))","v":""},"","","","","","","","",""]
[null,381]
[null,null,{"$f":"IF(ISERROR(INDEX($O$16:$P$55,MATCH(C776,$O$16:$O$55),2)),\"\",INDEX($O$16:$P$55,MATCH(C776,$O$16:$O$55),2))","v":""},"","","","","","","","",""]
[null,382]
[null,null,{"$f":"IF(ISERROR(INDEX($O$16:$P$55,MATCH(C778,$O$16:$O$55),2)),\"\",INDEX($O$16:$P$55,MATCH(C778,$O$16:$O$55),2))","v":""},"","","","","","","","",""]
[null,383]
[null,null,{"$f":"IF(ISERROR(INDEX($O$16:$P$55,MATCH(C780,$O$16:$O$55),2)),\"\",INDEX($O$16:$P$55,MATCH(C780,$O$16:$O$55),2))","v":""},"","","","","","","","",""]
[null,384]
[null,null,{"$f":"IF(ISERROR(INDEX($O$16:$P$55,MATCH(C782,$O$16:$O$55),2)),\"\",INDEX($O$16:$P$55,MATCH(C782,$O$16:$O$55),2))","v":""},"","","","","","","","",""]
[null,385]
[null,null,{"$f":"IF(ISERROR(INDEX($O$16:$P$55,MATCH(C784,$O$16:$O$55),2)),\"\",INDEX($O$16:$P$55,MATCH(C784,$O$16:$O$55),2))","v":""},"","","","","","","","",""]
[null,386]
[null,null,{"$f":"IF(ISERROR(INDEX($O$16:$P$55,MATCH(C786,$O$16:$O$55),2)),\"\",INDEX($O$16:$P$55,MATCH(C786,$O$16:$O$55),2))","v":""},"","","","","","","","",""]
[null,387]
[null,null,{"$f":"IF(ISERROR(INDEX($O$16:$P$55,MATCH(C788,$O$16:$O$55),2)),\"\",INDEX($O$16:$P$55,MATCH(C788,$O$16:$O$55),2))","v":""},"","","","","","","","",""]
[null,388]
[null,null,{"$f":"IF(ISERROR(INDEX($O$16:$P$55,MATCH(C790,$O$16:$O$55),2)),\"\",INDEX($O$16:$P$55,MATCH(C790,$O$16:$O$55),2))","v":""},"","","","","","","","",""]
[null,389]
[null,null,{"$f":"IF(ISERROR(INDEX($O$16:$P$55,MATCH(C792,$O$16:$O$55),2)),\"\",INDEX($O$16:$P$55,MATCH(C792,$O$16:$O$55),2))","v":""},"","","","","","","","",""]
[null,390]
[null,null,{"$f":"IF(ISERROR(INDEX($O$16:$P$55,MATCH(C794,$O$16:$O$55),2)),\"\",INDEX($O$16:$P$55,MATCH(C794,$O$16:$O$55),2))","v":""},"","","","","","","","",""]
[null,391]
[null,null,{"$f":"IF(ISERROR(INDEX($O$16:$P$55,MATCH(C796,$O$16:$O$55),2)),\"\",INDEX($O$16:$P$55,MATCH(C796,$O$16:$O$55),2))","v":""},"","","","","","","","",""]
[null,392]
[null,null,{"$f":"IF(ISERROR(INDEX($O$16:$P$55,MATCH(C798,$O$16:$O$55),2)),\"\",INDEX($O$16:$P$55,MATCH(C798,$O$16:$O$55),2))","v":""},"","","","","","","","",""]
[null,393]
[null,null,{"$f":"IF(ISERROR(INDEX($O$16:$P$55,MATCH(C800,$O$16:$O$55),2)),\"\",INDEX($O$16:$P$55,MATCH(C800,$O$16:$O$55),2))","v":""},"","","","","","","","",""]
[null,394]
[null,null,{"$f":"IF(ISERROR(INDEX($O$16:$P$55,MATCH(C802,$O$16:$O$55),2)),\"\",INDEX($O$16:$P$55,MATCH(C802,$O$16:$O$55),2))","v":""},"","","","","","","","",""]
[null,395]
[null,null,{"$f":"IF(ISERROR(INDEX($O$16:$P$55,MATCH(C804,$O$16:$O$55),2)),\"\",INDEX($O$16:$P$55,MATCH(C804,$O$16:$O$55),2))","v":""},"","","","","","","","",""]
[null,396]
[null,null,{"$f":"IF(ISERROR(INDEX($O$16:$P$55,MATCH(C806,$O$16:$O$55),2)),\"\",INDEX($O$16:$P$55,MATCH(C806,$O$16:$O$55),2))","v":""},"","","","","","","","",""]
[null,397]
[null,null,{"$f":"IF(ISERROR(INDEX($O$16:$P$55,MATCH(C808,$O$16:$O$55),2)),\"\",INDEX($O$16:$P$55,MATCH(C808,$O$16:$O$55),2))","v":""},"","","","","","","","",""]
[null,398]
[null,null,{"$f":"IF(ISERROR(INDEX($O$16:$P$55,MATCH(C810,$O$16:$O$55),2)),\"\",INDEX($O$16:$P$55,MATCH(C810,$O$16:$O$55),2))","v":""},"","","","","","","","",""]
[null,399]
[null,null,{"$f":"IF(ISERROR(INDEX($O$16:$P$55,MATCH(C812,$O$16:$O$55),2)),\"\",INDEX($O$16:$P$55,MATCH(C812,$O$16:$O$55),2))","v":""},"","","","","","","","",""]
[null,400]
[null,null,{"$f":"IF(ISERROR(INDEX($O$16:$P$55,MATCH(C814,$O$16:$O$55),2)),\"\",INDEX($O$16:$P$55,MATCH(C814,$O$16:$O$55),2))","v":""},"","","","","","","","",""]
[null,401]
[null,null,{"$f":"IF(ISERROR(INDEX($O$16:$P$55,MATCH(C816,$O$16:$O$55),2)),\"\",INDEX($O$16:$P$55,MATCH(C816,$O$16:$O$55),2))","v":""},"","","","","","","","",""]
[null,402]
[null,null,{"$f":"IF(ISERROR(INDEX($O$16:$P$55,MATCH(C818,$O$16:$O$55),2)),\"\",INDEX($O$16:$P$55,MATCH(C818,$O$16:$O$55),2))","v":""},"","","","","","","","",""]
[null,403]
[null,null,{"$f":"IF(ISERROR(INDEX($O$16:$P$55,MATCH(C820,$O$16:$O$55),2)),\"\",INDEX($O$16:$P$55,MATCH(C820,$O$16:$O$55),2))","v":""},"","","","","","","","",""]
[null,404]
[null,null,{"$f":"IF(ISERROR(INDEX($O$16:$P$55,MATCH(C822,$O$16:$O$55),2)),\"\",INDEX($O$16:$P$55,MATCH(C822,$O$16:$O$55),2))","v":""},"","","","","","","","",""]
[null,405]
[null,null,{"$f":"IF(ISERROR(INDEX($O$16:$P$55,MATCH(C824,$O$16:$O$55),2)),\"\",INDEX($O$16:$P$55,MATCH(C824,$O$16:$O$55),2))","v":""},"","","","","","","","",""]
[null,406]
[null,null,{"$f":"IF(ISERROR(INDEX($O$16:$P$55,MATCH(C826,$O$16:$O$55),2)),\"\",INDEX($O$16:$P$55,MATCH(C826,$O$16:$O$55),2))","v":""},"","","","","","","","",""]
[null,407]
[null,null,{"$f":"IF(ISERROR(INDEX($O$16:$P$55,MATCH(C828,$O$16:$O$55),2)),\"\",INDEX($O$16:$P$55,MATCH(C828,$O$16:$O$55),2))","v":""},"","","","","","","","",""]
[null,408]
[null,null,{"$f":"IF(ISERROR(INDEX($O$16:$P$55,MATCH(C830,$O$16:$O$55),2)),\"\",INDEX($O$16:$P$55,MATCH(C830,$O$16:$O$55),2))","v":""},"","","","","","","","",""]
[null,409]
[null,null,{"$f":"IF(ISERROR(INDEX($O$16:$P$55,MATCH(C832,$O$16:$O$55),2)),\"\",INDEX($O$16:$P$55,MATCH(C832,$O$16:$O$55),2))","v":""},"","","","","","","","",""]
[null,410]
[null,null,{"$f":"IF(ISERROR(INDEX($O$16:$P$55,MATCH(C834,$O$16:$O$55),2)),\"\",INDEX($O$16:$P$55,MATCH(C834,$O$16:$O$55),2))","v":""},"","","","","","","","",""]
[null,411]
[null,null,{"$f":"IF(ISERROR(INDEX($O$16:$P$55,MATCH(C836,$O$16:$O$55),2)),\"\",INDEX($O$16:$P$55,MATCH(C836,$O$16:$O$55),2))","v":""},"","","","","","","","",""]
[null,412]
[null,null,{"$f":"IF(ISERROR(INDEX($O$16:$P$55,MATCH(C838,$O$16:$O$55),2)),\"\",INDEX($O$16:$P$55,MATCH(C838,$O$16:$O$55),2))","v":""},"","","","","","","","",""]
[null,413]
[null,null,{"$f":"IF(ISERROR(INDEX($O$16:$P$55,MATCH(C840,$O$16:$O$55),2)),\"\",INDEX($O$16:$P$55,MATCH(C840,$O$16:$O$55),2))","v":""},"","","","","","","","",""]
[null,414]
[null,null,{"$f":"IF(ISERROR(INDEX($O$16:$P$55,MATCH(C842,$O$16:$O$55),2)),\"\",INDEX($O$16:$P$55,MATCH(C842,$O$16:$O$55),2))","v":""},"","","","","","","","",""]
[null,415]
[null,null,{"$f":"IF(ISERROR(INDEX($O$16:$P$55,MATCH(C844,$O$16:$O$55),2)),\"\",INDEX($O$16:$P$55,MATCH(C844,$O$16:$O$55),2))","v":""},"","","","","","","","",""]
[null,416]
[null,null,{"$f":"IF(ISERROR(INDEX($O$16:$P$55,MATCH(C846,$O$16:$O$55),2)),\"\",INDEX($O$16:$P$55,MATCH(C846,$O$16:$O$55),2))","v":""},"","","","","","","","",""]
[null,417]
[null,null,{"$f":"IF(ISERROR(INDEX($O$16:$P$55,MATCH(C848,$O$16:$O$55),2)),\"\",INDEX($O$16:$P$55,MATCH(C848,$O$16:$O$55),2))","v":""},"","","","","","","","",""]
[null,418]
[null,null,{"$f":"IF(ISERROR(INDEX($O$16:$P$55,MATCH(C850,$O$16:$O$55),2)),\"\",INDEX($O$16:$P$55,MATCH(C850,$O$16:$O$55),2))","v":""},"","","","","","","","",""]
[null,419]
[null,null,{"$f":"IF(ISERROR(INDEX($O$16:$P$55,MATCH(C852,$O$16:$O$55),2)),\"\",INDEX($O$16:$P$55,MATCH(C852,$O$16:$O$55),2))","v":""},"","","","","","","","",""]
[null,420]
[null,null,{"$f":"IF(ISERROR(INDEX($O$16:$P$55,MATCH(C854,$O$16:$O$55),2)),\"\",INDEX($O$16:$P$55,MATCH(C854,$O$16:$O$55),2))","v":""},"","","","","","","","",""]
[null,421]
[null,null,{"$f":"IF(ISERROR(INDEX($O$16:$P$55,MATCH(C856,$O$16:$O$55),2)),\"\",INDEX($O$16:$P$55,MATCH(C856,$O$16:$O$55),2))","v":""},"","","","","","","","",""]
[null,422]
[null,null,{"$f":"IF(ISERROR(INDEX($O$16:$P$55,MATCH(C858,$O$16:$O$55),2)),\"\",INDEX($O$16:$P$55,MATCH(C858,$O$16:$O$55),2))","v":""},"","","","","","","","",""]
[null,423]
[null,null,{"$f":"IF(ISERROR(INDEX($O$16:$P$55,MATCH(C860,$O$16:$O$55),2)),\"\",INDEX($O$16:$P$55,MATCH(C860,$O$16:$O$55),2))","v":""},"","","","","","","","",""]
[null,424]
[null,null,{"$f":"IF(ISERROR(INDEX($O$16:$P$55,MATCH(C862,$O$16:$O$55),2)),\"\",INDEX($O$16:$P$55,MATCH(C862,$O$16:$O$55),2))","v":""},"","","","","","","","",""]
[null,425]
[null,null,{"$f":"IF(ISERROR(INDEX($O$16:$P$55,MATCH(C864,$O$16:$O$55),2)),\"\",INDEX($O$16:$P$55,MATCH(C864,$O$16:$O$55),2))","v":""},"","","","","","","","",""]
[null,426]
[null,null,{"$f":"IF(ISERROR(INDEX($O$16:$P$55,MATCH(C866,$O$16:$O$55),2)),\"\",INDEX($O$16:$P$55,MATCH(C866,$O$16:$O$55),2))","v":""},"","","","","","","","",""]
[null,427]
[null,null,{"$f":"IF(ISERROR(INDEX($O$16:$P$55,MATCH(C868,$O$16:$O$55),2)),\"\",INDEX($O$16:$P$55,MATCH(C868,$O$16:$O$55),2))","v":""},"","","","","","","","",""]
[null,428]
[null,null,{"$f":"IF(ISERROR(INDEX($O$16:$P$55,MATCH(C870,$O$16:$O$55),2)),\"\",INDEX($O$16:$P$55,MATCH(C870,$O$16:$O$55),2))","v":""},"","","","","","","","",""]
[null,429]
[null,null,{"$f":"IF(ISERROR(INDEX($O$16:$P$55,MATCH(C872,$O$16:$O$55),2)),\"\",INDEX($O$16:$P$55,MATCH(C872,$O$16:$O$55),2))","v":""},"","","","","","","","",""]
[null,430]
[null,null,{"$f":"IF(ISERROR(INDEX($O$16:$P$55,MATCH(C874,$O$16:$O$55),2)),\"\",INDEX($O$16:$P$55,MATCH(C874,$O$16:$O$55),2))","v":""},"","","","","","","","",""]
[null,431]
[null,null,{"$f":"IF(ISERROR(INDEX($O$16:$P$55,MATCH(C876,$O$16:$O$55),2)),\"\",INDEX($O$16:$P$55,MATCH(C876,$O$16:$O$55),2))","v":""},"","","","","","","","",""]
[null,432]
[null,null,{"$f":"IF(ISERROR(INDEX($O$16:$P$55,MATCH(C878,$O$16:$O$55),2)),\"\",INDEX($O$16:$P$55,MATCH(C878,$O$16:$O$55),2))","v":""},"","","","","","","","",""]
[null,433]
[null,null,{"$f":"IF(ISERROR(INDEX($O$16:$P$55,MATCH(C880,$O$16:$O$55),2)),\"\",INDEX($O$16:$P$55,MATCH(C880,$O$16:$O$55),2))","v":""},"","","","","","","","",""]
[null,434]
[null,null,{"$f":"IF(ISERROR(INDEX($O$16:$P$55,MATCH(C882,$O$16:$O$55),2)),\"\",INDEX($O$16:$P$55,MATCH(C882,$O$16:$O$55),2))","v":""},"","","","","","","","",""]
[null,435]
[null,null,{"$f":"IF(ISERROR(INDEX($O$16:$P$55,MATCH(C884,$O$16:$O$55),2)),\"\",INDEX($O$16:$P$55,MATCH(C884,$O$16:$O$55),2))","v":""},"","","","","","","","",""]
[null,436]
[null,null,{"$f":"IF(ISERROR(INDEX($O$16:$P$55,MATCH(C886,$O$16:$O$55),2)),\"\",INDEX($O$16:$P$55,MATCH(C886,$O$16:$O$55),2))","v":""},"","","","","","","","",""]
[null,437]
[null,null,{"$f":"IF(ISERROR(INDEX($O$16:$P$55,MATCH(C888,$O$16:$O$55),2)),\"\",INDEX($O$16:$P$55,MATCH(C888,$O$16:$O$55),2))","v":""},"","","","","","","","",""]
[null,438]
[null,null,{"$f":"IF(ISERROR(INDEX($O$16:$P$55,MATCH(C890,$O$16:$O$55),2)),\"\",INDEX($O$16:$P$55,MATCH(C890,$O$16:$O$55),2))","v":""},"","","","","","","","",""]
[null,439]
[null,null,{"$f":"IF(ISERROR(INDEX($O$16:$P$55,MATCH(C892,$O$16:$O$55),2)),\"\",INDEX($O$16:$P$55,MATCH(C892,$O$16:$O$55),2))","v":""},"","","","","","","","",""]
[null,440]
[null,null,{"$f":"IF(ISERROR(INDEX($O$16:$P$55,MATCH(C894,$O$16:$O$55),2)),\"\",INDEX($O$16:$P$55,MATCH(C894,$O$16:$O$55),2))","v":""},"","","","","","","","",""]
[null,441]
[null,null,{"$f":"IF(ISERROR(INDEX($O$16:$P$55,MATCH(C896,$O$16:$O$55),2)),\"\",INDEX($O$16:$P$55,MATCH(C896,$O$16:$O$55),2))","v":""},"","","","","","","","",""]
[null,442]
[null,null,{"$f":"IF(ISERROR(INDEX($O$16:$P$55,MATCH(C898,$O$16:$O$55),2)),\"\",INDEX($O$16:$P$55,MATCH(C898,$O$16:$O$55),2))","v":""},"","","","","","","","",""]
[null,443]
[null,null,{"$f":"IF(ISERROR(INDEX($O$16:$P$55,MATCH(C900,$O$16:$O$55),2)),\"\",INDEX($O$16:$P$55,MATCH(C900,$O$16:$O$55),2))","v":""},"","","","","","","","",""]
[null,444]
[null,null,{"$f":"IF(ISERROR(INDEX($O$16:$P$55,MATCH(C902,$O$16:$O$55),2)),\"\",INDEX($O$16:$P$55,MATCH(C902,$O$16:$O$55),2))","v":""},"","","","","","","","",""]
[null,445]
[null,null,{"$f":"IF(ISERROR(INDEX($O$16:$P$55,MATCH(C904,$O$16:$O$55),2)),\"\",INDEX($O$16:$P$55,MATCH(C904,$O$16:$O$55),2))","v":""},"","","","","","","","",""]
[null,446]
[null,null,{"$f":"IF(ISERROR(INDEX($O$16:$P$55,MATCH(C906,$O$16:$O$55),2)),\"\",INDEX($O$16:$P$55,MATCH(C906,$O$16:$O$55),2))","v":""},"","","","","","","","",""]
[null,447]
[null,null,{"$f":"IF(ISERROR(INDEX($O$16:$P$55,MATCH(C908,$O$16:$O$55),2)),\"\",INDEX($O$16:$P$55,MATCH(C908,$O$16:$O$55),2))","v":""},"","","","","","","","",""]
[null,448]
[null,null,{"$f":"IF(ISERROR(INDEX($O$16:$P$55,MATCH(C910,$O$16:$O$55),2)),\"\",INDEX($O$16:$P$55,MATCH(C910,$O$16:$O$55),2))","v":""},"","","","","","","","",""]
[null,449]
[null,null,{"$f":"IF(ISERROR(INDEX($O$16:$P$55,MATCH(C912,$O$16:$O$55),2)),\"\",INDEX($O$16:$P$55,MATCH(C912,$O$16:$O$55),2))","v":""},"","","","","","","","",""]
[null,450]
[null,null,{"$f":"IF(ISERROR(INDEX($O$16:$P$55,MATCH(C914,$O$16:$O$55),2)),\"\",INDEX($O$16:$P$55,MATCH(C914,$O$16:$O$55),2))","v":""},"","","","","","","","",""]
[null,451]
[null,null,{"$f":"IF(ISERROR(INDEX($O$16:$P$55,MATCH(C916,$O$16:$O$55),2)),\"\",INDEX($O$16:$P$55,MATCH(C916,$O$16:$O$55),2))","v":""},"","","","","","","","",""]
[null,452]
[null,null,{"$f":"IF(ISERROR(INDEX($O$16:$P$55,MATCH(C918,$O$16:$O$55),2)),\"\",INDEX($O$16:$P$55,MATCH(C918,$O$16:$O$55),2))","v":""},"","","","","","","","",""]
[null,453]
[null,null,{"$f":"IF(ISERROR(INDEX($O$16:$P$55,MATCH(C920,$O$16:$O$55),2)),\"\",INDEX($O$16:$P$55,MATCH(C920,$O$16:$O$55),2))","v":""},"","","","","","","","",""]
[null,454]
[null,null,{"$f":"IF(ISERROR(INDEX($O$16:$P$55,MATCH(C922,$O$16:$O$55),2)),\"\",INDEX($O$16:$P$55,MATCH(C922,$O$16:$O$55),2))","v":""},"","","","","","","","",""]
[null,455]
[null,null,{"$f":"IF(ISERROR(INDEX($O$16:$P$55,MATCH(C924,$O$16:$O$55),2)),\"\",INDEX($O$16:$P$55,MATCH(C924,$O$16:$O$55),2))","v":""},"","","","","","","","",""]
[null,456]
[null,null,{"$f":"IF(ISERROR(INDEX($O$16:$P$55,MATCH(C926,$O$16:$O$55),2)),\"\",INDEX($O$16:$P$55,MATCH(C926,$O$16:$O$55),2))","v":""},"","","","","","","","",""]
[null,457]
[null,null,{"$f":"IF(ISERROR(INDEX($O$16:$P$55,MATCH(C928,$O$16:$O$55),2)),\"\",INDEX($O$16:$P$55,MATCH(C928,$O$16:$O$55),2))","v":""},"","","","","","","","",""]
[null,458]
[null,null,{"$f":"IF(ISERROR(INDEX($O$16:$P$55,MATCH(C930,$O$16:$O$55),2)),\"\",INDEX($O$16:$P$55,MATCH(C930,$O$16:$O$55),2))","v":""},"","","","","","","","",""]
[null,459]
[null,null,{"$f":"IF(ISERROR(INDEX($O$16:$P$55,MATCH(C932,$O$16:$O$55),2)),\"\",INDEX($O$16:$P$55,MATCH(C932,$O$16:$O$55),2))","v":""},"","","","","","","","",""]
[null,460]
[null,null,{"$f":"IF(ISERROR(INDEX($O$16:$P$55,MATCH(C934,$O$16:$O$55),2)),\"\",INDEX($O$16:$P$55,MATCH(C934,$O$16:$O$55),2))","v":""},"","","","","","","","",""]
[null,461]
[null,null,{"$f":"IF(ISERROR(INDEX($O$16:$P$55,MATCH(C936,$O$16:$O$55),2)),\"\",INDEX($O$16:$P$55,MATCH(C936,$O$16:$O$55),2))","v":""},"","","","","","","","",""]
[null,462]
[null,null,{"$f":"IF(ISERROR(INDEX($O$16:$P$55,MATCH(C938,$O$16:$O$55),2)),\"\",INDEX($O$16:$P$55,MATCH(C938,$O$16:$O$55),2))","v":""},"","","","","","","","",""]
[null,463]
[null,null,{"$f":"IF(ISERROR(INDEX($O$16:$P$55,MATCH(C940,$O$16:$O$55),2)),\"\",INDEX($O$16:$P$55,MATCH(C940,$O$16:$O$55),2))","v":""},"","","","","","","","",""]
[null,464]
[null,null,{"$f":"IF(ISERROR(INDEX($O$16:$P$55,MATCH(C942,$O$16:$O$55),2)),\"\",INDEX($O$16:$P$55,MATCH(C942,$O$16:$O$55),2))","v":""},"","","","","","","","",""]
[null,465]
[null,null,{"$f":"IF(ISERROR(INDEX($O$16:$P$55,MATCH(C944,$O$16:$O$55),2)),\"\",INDEX($O$16:$P$55,MATCH(C944,$O$16:$O$55),2))","v":""},"","","","","","","","",""]
[null,466]
[null,null,{"$f":"IF(ISERROR(INDEX($O$16:$P$55,MATCH(C946,$O$16:$O$55),2)),\"\",INDEX($O$16:$P$55,MATCH(C946,$O$16:$O$55),2))","v":""},"","","","","","","","",""]
[null,467]
[null,null,{"$f":"IF(ISERROR(INDEX($O$16:$P$55,MATCH(C948,$O$16:$O$55),2)),\"\",INDEX($O$16:$P$55,MATCH(C948,$O$16:$O$55),2))","v":""},"","","","","","","","",""]
[null,468]
[null,null,{"$f":"IF(ISERROR(INDEX($O$16:$P$55,MATCH(C950,$O$16:$O$55),2)),\"\",INDEX($O$16:$P$55,MATCH(C950,$O$16:$O$55),2))","v":""},"","","","","","","","",""]
[null,469]
[null,null,{"$f":"IF(ISERROR(INDEX($O$16:$P$55,MATCH(C952,$O$16:$O$55),2)),\"\",INDEX($O$16:$P$55,MATCH(C952,$O$16:$O$55),2))","v":""},"","","","","","","","",""]
[null,470]
[null,null,{"$f":"IF(ISERROR(INDEX($O$16:$P$55,MATCH(C954,$O$16:$O$55),2)),\"\",INDEX($O$16:$P$55,MATCH(C954,$O$16:$O$55),2))","v":""},"","","","","","","","",""]
[null,471]
[null,null,{"$f":"IF(ISERROR(INDEX($O$16:$P$55,MATCH(C956,$O$16:$O$55),2)),\"\",INDEX($O$16:$P$55,MATCH(C956,$O$16:$O$55),2))","v":""},"","","","","","","","",""]
[null,472]
[null,null,{"$f":"IF(ISERROR(INDEX($O$16:$P$55,MATCH(C958,$O$16:$O$55),2)),\"\",INDEX($O$16:$P$55,MATCH(C958,$O$16:$O$55),2))","v":""},"","","","","","","","",""]
[null,473]
[null,null,{"$f":"IF(ISERROR(INDEX($O$16:$P$55,MATCH(C960,$O$16:$O$55),2)),\"\",INDEX($O$16:$P$55,MATCH(C960,$O$16:$O$55),2))","v":""},"","","","","","","","",""]
[null,474]
[null,null,{"$f":"IF(ISERROR(INDEX($O$16:$P$55,MATCH(C962,$O$16:$O$55),2)),\"\",INDEX($O$16:$P$55,MATCH(C962,$O$16:$O$55),2))","v":""},"","","","","","","","",""]
[null,475]
[null,null,{"$f":"IF(ISERROR(INDEX($O$16:$P$55,MATCH(C964,$O$16:$O$55),2)),\"\",INDEX($O$16:$P$55,MATCH(C964,$O$16:$O$55),2))","v":""},"","","","","","","","",""]
[null,476]
[null,null,{"$f":"IF(ISERROR(INDEX($O$16:$P$55,MATCH(C966,$O$16:$O$55),2)),\"\",INDEX($O$16:$P$55,MATCH(C966,$O$16:$O$55),2))","v":""},"","","","","","","","",""]
[null,477]
[null,null,{"$f":"IF(ISERROR(INDEX($O$16:$P$55,MATCH(C968,$O$16:$O$55),2)),\"\",INDEX($O$16:$P$55,MATCH(C968,$O$16:$O$55),2))","v":""},"","","","","","","","",""]
[null,478]
[null,null,{"$f":"IF(ISERROR(INDEX($O$16:$P$55,MATCH(C970,$O$16:$O$55),2)),\"\",INDEX($O$16:$P$55,MATCH(C970,$O$16:$O$55),2))","v":""},"","","","","","","","",""]
[null,479]
[null,null,{"$f":"IF(ISERROR(INDEX($O$16:$P$55,MATCH(C972,$O$16:$O$55),2)),\"\",INDEX($O$16:$P$55,MATCH(C972,$O$16:$O$55),2))","v":""},"","","","","","","","",""]
[null,480]
[null,null,{"$f":"IF(ISERROR(INDEX($O$16:$P$55,MATCH(C974,$O$16:$O$55),2)),\"\",INDEX($O$16:$P$55,MATCH(C974,$O$16:$O$55),2))","v":""},"","","","","","","","",""]
[null,481]
[null,null,{"$f":"IF(ISERROR(INDEX($O$16:$P$55,MATCH(C976,$O$16:$O$55),2)),\"\",INDEX($O$16:$P$55,MATCH(C976,$O$16:$O$55),2))","v":""},"","","","","","","","",""]
[null,482]
[null,null,{"$f":"IF(ISERROR(INDEX($O$16:$P$55,MATCH(C978,$O$16:$O$55),2)),\"\",INDEX($O$16:$P$55,MATCH(C978,$O$16:$O$55),2))","v":""},"","","","","","","","",""]
[null,483]
[null,null,{"$f":"IF(ISERROR(INDEX($O$16:$P$55,MATCH(C980,$O$16:$O$55),2)),\"\",INDEX($O$16:$P$55,MATCH(C980,$O$16:$O$55),2))","v":""},"","","","","","","","",""]
[null,484]
[null,null,{"$f":"IF(ISERROR(INDEX($O$16:$P$55,MATCH(C982,$O$16:$O$55),2)),\"\",INDEX($O$16:$P$55,MATCH(C982,$O$16:$O$55),2))","v":""},"","","","","","","","",""]
[null,485]
[null,null,{"$f":"IF(ISERROR(INDEX($O$16:$P$55,MATCH(C984,$O$16:$O$55),2)),\"\",INDEX($O$16:$P$55,MATCH(C984,$O$16:$O$55),2))","v":""},"","","","","","","","",""]
[null,486]
[null,null,{"$f":"IF(ISERROR(INDEX($O$16:$P$55,MATCH(C986,$O$16:$O$55),2)),\"\",INDEX($O$16:$P$55,MATCH(C986,$O$16:$O$55),2))","v":""},"","","","","","","","",""]
[null,487]
[null,null,{"$f":"IF(ISERROR(INDEX($O$16:$P$55,MATCH(C988,$O$16:$O$55),2)),\"\",INDEX($O$16:$P$55,MATCH(C988,$O$16:$O$55),2))","v":""},"","","","","","","","",""]
[null,488]
[null,null,{"$f":"IF(ISERROR(INDEX($O$16:$P$55,MATCH(C990,$O$16:$O$55),2)),\"\",INDEX($O$16:$P$55,MATCH(C990,$O$16:$O$55),2))","v":""},"","","","","","","","",""]
[null,489]
[null,null,{"$f":"IF(ISERROR(INDEX($O$16:$P$55,MATCH(C992,$O$16:$O$55),2)),\"\",INDEX($O$16:$P$55,MATCH(C992,$O$16:$O$55),2))","v":""},"","","","","","","","",""]
[null,490]
[null,null,{"$f":"IF(ISERROR(INDEX($O$16:$P$55,MATCH(C994,$O$16:$O$55),2)),\"\",INDEX($O$16:$P$55,MATCH(C994,$O$16:$O$55),2))","v":""},"","","","","","","","",""]
[null,491]
[null,null,{"$f":"IF(ISERROR(INDEX($O$16:$P$55,MATCH(C996,$O$16:$O$55),2)),\"\",INDEX($O$16:$P$55,MATCH(C996,$O$16:$O$55),2))","v":""},"","","","","","","","",""]
[null,492]
[null,null,{"$f":"IF(ISERROR(INDEX($O$16:$P$55,MATCH(C998,$O$16:$O$55),2)),\"\",INDEX($O$16:$P$55,MATCH(C998,$O$16:$O$55),2))","v":""},"","","","","","","","",""]
[null,493]
[null,null,{"$f":"IF(ISERROR(INDEX($O$16:$P$55,MATCH(C1000,$O$16:$O$55),2)),\"\",INDEX($O$16:$P$55,MATCH(C1000,$O$16:$O$55),2))","v":""},"","","","","","","","",""]
[null,494]
[null,null,{"$f":"IF(ISERROR(INDEX($O$16:$P$55,MATCH(C1002,$O$16:$O$55),2)),\"\",INDEX($O$16:$P$55,MATCH(C1002,$O$16:$O$55),2))","v":""},"","","","","","","","",""]
[null,495]
[null,null,{"$f":"IF(ISERROR(INDEX($O$16:$P$55,MATCH(C1004,$O$16:$O$55),2)),\"\",INDEX($O$16:$P$55,MATCH(C1004,$O$16:$O$55),2))","v":""},"","","","","","","","",""]
[null,496]
[null,null,{"$f":"IF(ISERROR(INDEX($O$16:$P$55,MATCH(C1006,$O$16:$O$55),2)),\"\",INDEX($O$16:$P$55,MATCH(C1006,$O$16:$O$55),2))","v":""},"","","","","","","","",""]
[null,497]
[null,null,{"$f":"IF(ISERROR(INDEX($O$16:$P$55,MATCH(C1008,$O$16:$O$55),2)),\"\",INDEX($O$16:$P$55,MATCH(C1008,$O$16:$O$55),2))","v":""},"","","","","","","","",""]
[null,498]
[null,null,{"$f":"IF(ISERROR(INDEX($O$16:$P$55,MATCH(C1010,$O$16:$O$55),2)),\"\",INDEX($O$16:$P$55,MATCH(C1010,$O$16:$O$55),2))","v":""},"","","","","","","","",""]
[null,499]
[null,null,{"$f":"IF(ISERROR(INDEX($O$16:$P$55,MATCH(C1012,$O$16:$O$55),2)),\"\",INDEX($O$16:$P$55,MATCH(C1012,$O$16:$O$55),2))","v":""},"","","","","","","","",""]
[null,500]
[null,null,{"$f":"IF(ISERROR(INDEX($O$16:$P$55,MATCH(C1014,$O$16:$O$55),2)),\"\",INDEX($O$16:$P$55,MATCH(C1014,$O$16:$O$55),2))","v":""},"","","","","","","","",""]
[null,501]
[null,null,{"$f":"IF(ISERROR(INDEX($O$16:$P$55,MATCH(C1016,$O$16:$O$55),2)),\"\",INDEX($O$16:$P$55,MATCH(C1016,$O$16:$O$55),2))","v":""},"","","","","","","","",""]
[null,502]
[null,null,{"$f":"IF(ISERROR(INDEX($O$16:$P$55,MATCH(C1018,$O$16:$O$55),2)),\"\",INDEX($O$16:$P$55,MATCH(C1018,$O$16:$O$55),2))","v":""},"","","","","","","","",""]
[null,503]
[null,null,{"$f":"IF(ISERROR(INDEX($O$16:$P$55,MATCH(C1020,$O$16:$O$55),2)),\"\",INDEX($O$16:$P$55,MATCH(C1020,$O$16:$O$55),2))","v":""},"","","","","","","","",""]
[null,504]
[null,null,{"$f":"IF(ISERROR(INDEX($O$16:$P$55,MATCH(C1022,$O$16:$O$55),2)),\"\",INDEX($O$16:$P$55,MATCH(C1022,$O$16:$O$55),2))","v":""},"","","","","","","","",""]
[null,505]
[null,null,{"$f":"IF(ISERROR(INDEX($O$16:$P$55,MATCH(C1024,$O$16:$O$55),2)),\"\",INDEX($O$16:$P$55,MATCH(C1024,$O$16:$O$55),2))","v":""},"","","","","","","","",""]
[null,506]
[null,null,{"$f":"IF(ISERROR(INDEX($O$16:$P$55,MATCH(C1026,$O$16:$O$55),2)),\"\",INDEX($O$16:$P$55,MATCH(C1026,$O$16:$O$55),2))","v":""},"","","","","","","","",""]
[null,507]
[null,null,{"$f":"IF(ISERROR(INDEX($O$16:$P$55,MATCH(C1028,$O$16:$O$55),2)),\"\",INDEX($O$16:$P$55,MATCH(C1028,$O$16:$O$55),2))","v":""},"","","","","","","","",""]
[null,508]
[null,null,{"$f":"IF(ISERROR(INDEX($O$16:$P$55,MATCH(C1030,$O$16:$O$55),2)),\"\",INDEX($O$16:$P$55,MATCH(C1030,$O$16:$O$55),2))","v":""},"","","","","","","","",""]
[null,509]
[null,null,{"$f":"IF(ISERROR(INDEX($O$16:$P$55,MATCH(C1032,$O$16:$O$55),2)),\"\",INDEX($O$16:$P$55,MATCH(C1032,$O$16:$O$55),2))","v":""},"","","","","","","","",""]
[null,510]
[null,null,{"$f":"IF(ISERROR(INDEX($O$16:$P$55,MATCH(C1034,$O$16:$O$55),2)),\"\",INDEX($O$16:$P$55,MATCH(C1034,$O$16:$O$55),2))","v":""},"","","","","","","","",""]
[null,511]
[null,null,{"$f":"IF(ISERROR(INDEX($O$16:$P$55,MATCH(C1036,$O$16:$O$55),2)),\"\",INDEX($O$16:$P$55,MATCH(C1036,$O$16:$O$55),2))","v":""},"","","","","","","","",""]
[null,512]
[null,null,{"$f":"IF(ISERROR(INDEX($O$16:$P$55,MATCH(C1038,$O$16:$O$55),2)),\"\",INDEX($O$16:$P$55,MATCH(C1038,$O$16:$O$55),2))","v":""},"","","","","","","","",""]
[null,513]
[null,null,{"$f":"IF(ISERROR(INDEX($O$16:$P$55,MATCH(C1040,$O$16:$O$55),2)),\"\",INDEX($O$16:$P$55,MATCH(C1040,$O$16:$O$55),2))","v":""},"","","","","","","","",""]
[null,514]
[null,null,{"$f":"IF(ISERROR(INDEX($O$16:$P$55,MATCH(C1042,$O$16:$O$55),2)),\"\",INDEX($O$16:$P$55,MATCH(C1042,$O$16:$O$55),2))","v":""},"","","","","","","","",""]
[null,515]
[null,null,{"$f":"IF(ISERROR(INDEX($O$16:$P$55,MATCH(C1044,$O$16:$O$55),2)),\"\",INDEX($O$16:$P$55,MATCH(C1044,$O$16:$O$55),2))","v":""},"","","","","","","","",""]
[null,516]
[null,null,{"$f":"IF(ISERROR(INDEX($O$16:$P$55,MATCH(C1046,$O$16:$O$55),2)),\"\",INDEX($O$16:$P$55,MATCH(C1046,$O$16:$O$55),2))","v":""},"","","","","","","","",""]
[null,517]
[null,null,{"$f":"IF(ISERROR(INDEX($O$16:$P$55,MATCH(C1048,$O$16:$O$55),2)),\"\",INDEX($O$16:$P$55,MATCH(C1048,$O$16:$O$55),2))","v":""},"","","","","","","","",""]
[null,518]
[null,null,{"$f":"IF(ISERROR(INDEX($O$16:$P$55,MATCH(C1050,$O$16:$O$55),2)),\"\",INDEX($O$16:$P$55,MATCH(C1050,$O$16:$O$55),2))","v":""},"","","","","","","","",""]
[null,519]
[null,null,{"$f":"IF(ISERROR(INDEX($O$16:$P$55,MATCH(C1052,$O$16:$O$55),2)),\"\",INDEX($O$16:$P$55,MATCH(C1052,$O$16:$O$55),2))","v":""},"","","","","","","","",""]
[null,520]
[null,null,{"$f":"IF(ISERROR(INDEX($O$16:$P$55,MATCH(C1054,$O$16:$O$55),2)),\"\",INDEX($O$16:$P$55,MATCH(C1054,$O$16:$O$55),2))","v":""},"","","","","","","","",""]
[null,521]
[null,null,{"$f":"IF(ISERROR(INDEX($O$16:$P$55,MATCH(C1056,$O$16:$O$55),2)),\"\",INDEX($O$16:$P$55,MATCH(C1056,$O$16:$O$55),2))","v":""},"","","","","","","","",""]
[null,522]
[null,null,{"$f":"IF(ISERROR(INDEX($O$16:$P$55,MATCH(C1058,$O$16:$O$55),2)),\"\",INDEX($O$16:$P$55,MATCH(C1058,$O$16:$O$55),2))","v":""},"","","","","","","","",""]
[null,523]
[null,null,{"$f":"IF(ISERROR(INDEX($O$16:$P$55,MATCH(C1060,$O$16:$O$55),2)),\"\",INDEX($O$16:$P$55,MATCH(C1060,$O$16:$O$55),2))","v":""},"","","","","","","","",""]
[null,524]
[null,null,{"$f":"IF(ISERROR(INDEX($O$16:$P$55,MATCH(C1062,$O$16:$O$55),2)),\"\",INDEX($O$16:$P$55,MATCH(C1062,$O$16:$O$55),2))","v":""},"","","","","","","","",""]
[null,525]
[null,null,{"$f":"IF(ISERROR(INDEX($O$16:$P$55,MATCH(C1064,$O$16:$O$55),2)),\"\",INDEX($O$16:$P$55,MATCH(C1064,$O$16:$O$55),2))","v":""},"","","","","","","","",""]
[null,526]
[null,null,{"$f":"IF(ISERROR(INDEX($O$16:$P$55,MATCH(C1066,$O$16:$O$55),2)),\"\",INDEX($O$16:$P$55,MATCH(C1066,$O$16:$O$55),2))","v":""},"","","","","","","","",""]
[null,527]
[null,null,{"$f":"IF(ISERROR(INDEX($O$16:$P$55,MATCH(C1068,$O$16:$O$55),2)),\"\",INDEX($O$16:$P$55,MATCH(C1068,$O$16:$O$55),2))","v":""},"","","","","","","","",""]
[null,528]
[null,null,{"$f":"IF(ISERROR(INDEX($O$16:$P$55,MATCH(C1070,$O$16:$O$55),2)),\"\",INDEX($O$16:$P$55,MATCH(C1070,$O$16:$O$55),2))","v":""},"","","","","","","","",""]
[null,529]
[null,null,{"$f":"IF(ISERROR(INDEX($O$16:$P$55,MATCH(C1072,$O$16:$O$55),2)),\"\",INDEX($O$16:$P$55,MATCH(C1072,$O$16:$O$55),2))","v":""},"","","","","","","","",""]
[null,530]
[null,null,{"$f":"IF(ISERROR(INDEX($O$16:$P$55,MATCH(C1074,$O$16:$O$55),2)),\"\",INDEX($O$16:$P$55,MATCH(C1074,$O$16:$O$55),2))","v":""},"","","","","","","","",""]
[null,531]
[null,null,{"$f":"IF(ISERROR(INDEX($O$16:$P$55,MATCH(C1076,$O$16:$O$55),2)),\"\",INDEX($O$16:$P$55,MATCH(C1076,$O$16:$O$55),2))","v":""},"","","","","","","","",""]
[null,532]
[null,null,{"$f":"IF(ISERROR(INDEX($O$16:$P$55,MATCH(C1078,$O$16:$O$55),2)),\"\",INDEX($O$16:$P$55,MATCH(C1078,$O$16:$O$55),2))","v":""},"","","","","","","","",""]
[null,533]
[null,null,{"$f":"IF(ISERROR(INDEX($O$16:$P$55,MATCH(C1080,$O$16:$O$55),2)),\"\",INDEX($O$16:$P$55,MATCH(C1080,$O$16:$O$55),2))","v":""},"","","","","","","","",""]
[null,534]
[null,null,{"$f":"IF(ISERROR(INDEX($O$16:$P$55,MATCH(C1082,$O$16:$O$55),2)),\"\",INDEX($O$16:$P$55,MATCH(C1082,$O$16:$O$55),2))","v":""},"","","","","","","","",""]
[null,535]
[null,null,{"$f":"IF(ISERROR(INDEX($O$16:$P$55,MATCH(C1084,$O$16:$O$55),2)),\"\",INDEX($O$16:$P$55,MATCH(C1084,$O$16:$O$55),2))","v":""},"","","","","","","","",""]
[null,536]
[null,null,{"$f":"IF(ISERROR(INDEX($O$16:$P$55,MATCH(C1086,$O$16:$O$55),2)),\"\",INDEX($O$16:$P$55,MATCH(C1086,$O$16:$O$55),2))","v":""},"","","","","","","","",""]
[null,537]
[null,null,{"$f":"IF(ISERROR(INDEX($O$16:$P$55,MATCH(C1088,$O$16:$O$55),2)),\"\",INDEX($O$16:$P$55,MATCH(C1088,$O$16:$O$55),2))","v":""},"","","","","","","","",""]
[null,538]
[null,null,{"$f":"IF(ISERROR(INDEX($O$16:$P$55,MATCH(C1090,$O$16:$O$55),2)),\"\",INDEX($O$16:$P$55,MATCH(C1090,$O$16:$O$55),2))","v":""},"","","","","","","","",""]
[null,539]
[null,null,{"$f":"IF(ISERROR(INDEX($O$16:$P$55,MATCH(C1092,$O$16:$O$55),2)),\"\",INDEX($O$16:$P$55,MATCH(C1092,$O$16:$O$55),2))","v":""},"","","","","","","","",""]
[null,540]
[null,null,{"$f":"IF(ISERROR(INDEX($O$16:$P$55,MATCH(C1094,$O$16:$O$55),2)),\"\",INDEX($O$16:$P$55,MATCH(C1094,$O$16:$O$55),2))","v":""},"","","","","","","","",""]
[null,541]
[null,null,{"$f":"IF(ISERROR(INDEX($O$16:$P$55,MATCH(C1096,$O$16:$O$55),2)),\"\",INDEX($O$16:$P$55,MATCH(C1096,$O$16:$O$55),2))","v":""},"","","","","","","","",""]
[null,542]
[null,null,{"$f":"IF(ISERROR(INDEX($O$16:$P$55,MATCH(C1098,$O$16:$O$55),2)),\"\",INDEX($O$16:$P$55,MATCH(C1098,$O$16:$O$55),2))","v":""},"","","","","","","","",""]
[null,543]
[null,null,{"$f":"IF(ISERROR(INDEX($O$16:$P$55,MATCH(C1100,$O$16:$O$55),2)),\"\",INDEX($O$16:$P$55,MATCH(C1100,$O$16:$O$55),2))","v":""},"","","","","","","","",""]
[null,544]
[null,null,{"$f":"IF(ISERROR(INDEX($O$16:$P$55,MATCH(C1102,$O$16:$O$55),2)),\"\",INDEX($O$16:$P$55,MATCH(C1102,$O$16:$O$55),2))","v":""},"","","","","","","","",""]
[null,545]
[null,null,{"$f":"IF(ISERROR(INDEX($O$16:$P$55,MATCH(C1104,$O$16:$O$55),2)),\"\",INDEX($O$16:$P$55,MATCH(C1104,$O$16:$O$55),2))","v":""},"","","","","","","","",""]
[null,546]
[null,null,{"$f":"IF(ISERROR(INDEX($O$16:$P$55,MATCH(C1106,$O$16:$O$55),2)),\"\",INDEX($O$16:$P$55,MATCH(C1106,$O$16:$O$55),2))","v":""},"","","","","","","","",""]
[null,547]
[null,null,{"$f":"IF(ISERROR(INDEX($O$16:$P$55,MATCH(C1108,$O$16:$O$55),2)),\"\",INDEX($O$16:$P$55,MATCH(C1108,$O$16:$O$55),2))","v":""},"","","","","","","","",""]
[null,548]
[null,null,{"$f":"IF(ISERROR(INDEX($O$16:$P$55,MATCH(C1110,$O$16:$O$55),2)),\"\",INDEX($O$16:$P$55,MATCH(C1110,$O$16:$O$55),2))","v":""},"","","","","","","","",""]
[null,549]
[null,null,{"$f":"IF(ISERROR(INDEX($O$16:$P$55,MATCH(C1112,$O$16:$O$55),2)),\"\",INDEX($O$16:$P$55,MATCH(C1112,$O$16:$O$55),2))","v":""},"","","","","","","","",""]
[null,550]
[null,null,{"$f":"IF(ISERROR(INDEX($O$16:$P$55,MATCH(C1114,$O$16:$O$55),2)),\"\",INDEX($O$16:$P$55,MATCH(C1114,$O$16:$O$55),2))","v":""},"","","","","","","","",""]
[null,551]
[null,null,{"$f":"IF(ISERROR(INDEX($O$16:$P$55,MATCH(C1116,$O$16:$O$55),2)),\"\",INDEX($O$16:$P$55,MATCH(C1116,$O$16:$O$55),2))","v":""},"","","","","","","","",""]
[null,552]
[null,null,{"$f":"IF(ISERROR(INDEX($O$16:$P$55,MATCH(C1118,$O$16:$O$55),2)),\"\",INDEX($O$16:$P$55,MATCH(C1118,$O$16:$O$55),2))","v":""},"","","","","","","","",""]
[null,553]
[null,null,{"$f":"IF(ISERROR(INDEX($O$16:$P$55,MATCH(C1120,$O$16:$O$55),2)),\"\",INDEX($O$16:$P$55,MATCH(C1120,$O$16:$O$55),2))","v":""},"","","","","","","","",""]
[null,554]
[null,null,{"$f":"IF(ISERROR(INDEX($O$16:$P$55,MATCH(C1122,$O$16:$O$55),2)),\"\",INDEX($O$16:$P$55,MATCH(C1122,$O$16:$O$55),2))","v":""},"","","","","","","","",""]
[null,555]
[null,null,{"$f":"IF(ISERROR(INDEX($O$16:$P$55,MATCH(C1124,$O$16:$O$55),2)),\"\",INDEX($O$16:$P$55,MATCH(C1124,$O$16:$O$55),2))","v":""},"","","","","","","","",""]
[null,556]
[null,null,{"$f":"IF(ISERROR(INDEX($O$16:$P$55,MATCH(C1126,$O$16:$O$55),2)),\"\",INDEX($O$16:$P$55,MATCH(C1126,$O$16:$O$55),2))","v":""},"","","","","","","","",""]
[null,557]
[null,null,{"$f":"IF(ISERROR(INDEX($O$16:$P$55,MATCH(C1128,$O$16:$O$55),2)),\"\",INDEX($O$16:$P$55,MATCH(C1128,$O$16:$O$55),2))","v":""},"","","","","","","","",""]
[null,558]
[null,null,{"$f":"IF(ISERROR(INDEX($O$16:$P$55,MATCH(C1130,$O$16:$O$55),2)),\"\",INDEX($O$16:$P$55,MATCH(C1130,$O$16:$O$55),2))","v":""},"","","","","","","","",""]
[null,559]
[null,null,{"$f":"IF(ISERROR(INDEX($O$16:$P$55,MATCH(C1132,$O$16:$O$55),2)),\"\",INDEX($O$16:$P$55,MATCH(C1132,$O$16:$O$55),2))","v":""},"","","","","","","","",""]
[null,560]
[null,null,{"$f":"IF(ISERROR(INDEX($O$16:$P$55,MATCH(C1134,$O$16:$O$55),2)),\"\",INDEX($O$16:$P$55,MATCH(C1134,$O$16:$O$55),2))","v":""},"","","","","","","","",""]
[null,561]
[null,null,{"$f":"IF(ISERROR(INDEX($O$16:$P$55,MATCH(C1136,$O$16:$O$55),2)),\"\",INDEX($O$16:$P$55,MATCH(C1136,$O$16:$O$55),2))","v":""},"","","","","","","","",""]
[null,562]
[null,null,{"$f":"IF(ISERROR(INDEX($O$16:$P$55,MATCH(C1138,$O$16:$O$55),2)),\"\",INDEX($O$16:$P$55,MATCH(C1138,$O$16:$O$55),2))","v":""},"","","","","","","","",""]
[null,563]
[null,null,{"$f":"IF(ISERROR(INDEX($O$16:$P$55,MATCH(C1140,$O$16:$O$55),2)),\"\",INDEX($O$16:$P$55,MATCH(C1140,$O$16:$O$55),2))","v":""},"","","","","","","","",""]
[null,564]
[null,null,{"$f":"IF(ISERROR(INDEX($O$16:$P$55,MATCH(C1142,$O$16:$O$55),2)),\"\",INDEX($O$16:$P$55,MATCH(C1142,$O$16:$O$55),2))","v":""},"","","","","","","","",""]
[null,565]
[null,null,{"$f":"IF(ISERROR(INDEX($O$16:$P$55,MATCH(C1144,$O$16:$O$55),2)),\"\",INDEX($O$16:$P$55,MATCH(C1144,$O$16:$O$55),2))","v":""},"","","","","","","","",""]
[null,566]
[null,null,{"$f":"IF(ISERROR(INDEX($O$16:$P$55,MATCH(C1146,$O$16:$O$55),2)),\"\",INDEX($O$16:$P$55,MATCH(C1146,$O$16:$O$55),2))","v":""},"","","","","","","","",""]
[null,567]
[null,null,{"$f":"IF(ISERROR(INDEX($O$16:$P$55,MATCH(C1148,$O$16:$O$55),2)),\"\",INDEX($O$16:$P$55,MATCH(C1148,$O$16:$O$55),2))","v":""},"","","","","","","","",""]
[null,568]
[null,null,{"$f":"IF(ISERROR(INDEX($O$16:$P$55,MATCH(C1150,$O$16:$O$55),2)),\"\",INDEX($O$16:$P$55,MATCH(C1150,$O$16:$O$55),2))","v":""},"","","","","","","","",""]
[null,569]
[null,null,{"$f":"IF(ISERROR(INDEX($O$16:$P$55,MATCH(C1152,$O$16:$O$55),2)),\"\",INDEX($O$16:$P$55,MATCH(C1152,$O$16:$O$55),2))","v":""},"","","","","","","","",""]
[null,570]
[null,null,{"$f":"IF(ISERROR(INDEX($O$16:$P$55,MATCH(C1154,$O$16:$O$55),2)),\"\",INDEX($O$16:$P$55,MATCH(C1154,$O$16:$O$55),2))","v":""},"","","","","","","","",""]
[null,571]
[null,null,{"$f":"IF(ISERROR(INDEX($O$16:$P$55,MATCH(C1156,$O$16:$O$55),2)),\"\",INDEX($O$16:$P$55,MATCH(C1156,$O$16:$O$55),2))","v":""},"","","","","","","","",""]
[null,572]
[null,null,{"$f":"IF(ISERROR(INDEX($O$16:$P$55,MATCH(C1158,$O$16:$O$55),2)),\"\",INDEX($O$16:$P$55,MATCH(C1158,$O$16:$O$55),2))","v":""},"","","","","","","","",""]
[null,573]
[null,null,{"$f":"IF(ISERROR(INDEX($O$16:$P$55,MATCH(C1160,$O$16:$O$55),2)),\"\",INDEX($O$16:$P$55,MATCH(C1160,$O$16:$O$55),2))","v":""},"","","","","","","","",""]
[null,574]
[null,null,{"$f":"IF(ISERROR(INDEX($O$16:$P$55,MATCH(C1162,$O$16:$O$55),2)),\"\",INDEX($O$16:$P$55,MATCH(C1162,$O$16:$O$55),2))","v":""},"","","","","","","","",""]
[null,575]
[null,null,{"$f":"IF(ISERROR(INDEX($O$16:$P$55,MATCH(C1164,$O$16:$O$55),2)),\"\",INDEX($O$16:$P$55,MATCH(C1164,$O$16:$O$55),2))","v":""},"","","","","","","","",""]
[null,576]
[null,null,{"$f":"IF(ISERROR(INDEX($O$16:$P$55,MATCH(C1166,$O$16:$O$55),2)),\"\",INDEX($O$16:$P$55,MATCH(C1166,$O$16:$O$55),2))","v":""},"","","","","","","","",""]
[null,577]
[null,null,{"$f":"IF(ISERROR(INDEX($O$16:$P$55,MATCH(C1168,$O$16:$O$55),2)),\"\",INDEX($O$16:$P$55,MATCH(C1168,$O$16:$O$55),2))","v":""},"","","","","","","","",""]
[null,578]
[null,null,{"$f":"IF(ISERROR(INDEX($O$16:$P$55,MATCH(C1170,$O$16:$O$55),2)),\"\",INDEX($O$16:$P$55,MATCH(C1170,$O$16:$O$55),2))","v":""},"","","","","","","","",""]
[null,579]
[null,null,{"$f":"IF(ISERROR(INDEX($O$16:$P$55,MATCH(C1172,$O$16:$O$55),2)),\"\",INDEX($O$16:$P$55,MATCH(C1172,$O$16:$O$55),2))","v":""},"","","","","","","","",""]
[null,580]
[null,null,{"$f":"IF(ISERROR(INDEX($O$16:$P$55,MATCH(C1174,$O$16:$O$55),2)),\"\",INDEX($O$16:$P$55,MATCH(C1174,$O$16:$O$55),2))","v":""},"","","","","","","","",""]
[null,581]
[null,null,{"$f":"IF(ISERROR(INDEX($O$16:$P$55,MATCH(C1176,$O$16:$O$55),2)),\"\",INDEX($O$16:$P$55,MATCH(C1176,$O$16:$O$55),2))","v":""},"","","","","","","","",""]
[null,582]
[null,null,{"$f":"IF(ISERROR(INDEX($O$16:$P$55,MATCH(C1178,$O$16:$O$55),2)),\"\",INDEX($O$16:$P$55,MATCH(C1178,$O$16:$O$55),2))","v":""},"","","","","","","","",""]
[null,583]
[null,null,{"$f":"IF(ISERROR(INDEX($O$16:$P$55,MATCH(C1180,$O$16:$O$55),2)),\"\",INDEX($O$16:$P$55,MATCH(C1180,$O$16:$O$55),2))","v":""},"","","","","","","","",""]
[null,584]
[null,null,{"$f":"IF(ISERROR(INDEX($O$16:$P$55,MATCH(C1182,$O$16:$O$55),2)),\"\",INDEX($O$16:$P$55,MATCH(C1182,$O$16:$O$55),2))","v":""},"","","","","","","","",""]
[null,585]
[null,null,{"$f":"IF(ISERROR(INDEX($O$16:$P$55,MATCH(C1184,$O$16:$O$55),2)),\"\",INDEX($O$16:$P$55,MATCH(C1184,$O$16:$O$55),2))","v":""},"","","","","","","","",""]
[null,586]
[null,null,{"$f":"IF(ISERROR(INDEX($O$16:$P$55,MATCH(C1186,$O$16:$O$55),2)),\"\",INDEX($O$16:$P$55,MATCH(C1186,$O$16:$O$55),2))","v":""},"","","","","","","","",""]
[null,587]
[null,null,{"$f":"IF(ISERROR(INDEX($O$16:$P$55,MATCH(C1188,$O$16:$O$55),2)),\"\",INDEX($O$16:$P$55,MATCH(C1188,$O$16:$O$55),2))","v":""},"","","","","","","","",""]
[null,588]
[null,null,{"$f":"IF(ISERROR(INDEX($O$16:$P$55,MATCH(C1190,$O$16:$O$55),2)),\"\",INDEX($O$16:$P$55,MATCH(C1190,$O$16:$O$55),2))","v":""},"","","","","","","","",""]
[null,589]
[null,null,{"$f":"IF(ISERROR(INDEX($O$16:$P$55,MATCH(C1192,$O$16:$O$55),2)),\"\",INDEX($O$16:$P$55,MATCH(C1192,$O$16:$O$55),2))","v":""},"","","","","","","","",""]
[null,590]
[null,null,{"$f":"IF(ISERROR(INDEX($O$16:$P$55,MATCH(C1194,$O$16:$O$55),2)),\"\",INDEX($O$16:$P$55,MATCH(C1194,$O$16:$O$55),2))","v":""},"","","","","","","","",""]
[null,591]
[null,null,{"$f":"IF(ISERROR(INDEX($O$16:$P$55,MATCH(C1196,$O$16:$O$55),2)),\"\",INDEX($O$16:$P$55,MATCH(C1196,$O$16:$O$55),2))","v":""},"","","","","","","","",""]
[null,592]
[null,null,{"$f":"IF(ISERROR(INDEX($O$16:$P$55,MATCH(C1198,$O$16:$O$55),2)),\"\",INDEX($O$16:$P$55,MATCH(C1198,$O$16:$O$55),2))","v":""},"","","","","","","","",""]
[null,593]
[null,null,{"$f":"IF(ISERROR(INDEX($O$16:$P$55,MATCH(C1200,$O$16:$O$55),2)),\"\",INDEX($O$16:$P$55,MATCH(C1200,$O$16:$O$55),2))","v":""},"","","","","","","","",""]
[null,594]
[null,null,{"$f":"IF(ISERROR(INDEX($O$16:$P$55,MATCH(C1202,$O$16:$O$55),2)),\"\",INDEX($O$16:$P$55,MATCH(C1202,$O$16:$O$55),2))","v":""},"","","","","","","","",""]
[null,595]
[null,null,{"$f":"IF(ISERROR(INDEX($O$16:$P$55,MATCH(C1204,$O$16:$O$55),2)),\"\",INDEX($O$16:$P$55,MATCH(C1204,$O$16:$O$55),2))","v":""},"","","","","","","","",""]
[null,596]
[null,null,{"$f":"IF(ISERROR(INDEX($O$16:$P$55,MATCH(C1206,$O$16:$O$55),2)),\"\",INDEX($O$16:$P$55,MATCH(C1206,$O$16:$O$55),2))","v":""},"","","","","","","","",""]
[null,597]
[null,null,{"$f":"IF(ISERROR(INDEX($O$16:$P$55,MATCH(C1208,$O$16:$O$55),2)),\"\",INDEX($O$16:$P$55,MATCH(C1208,$O$16:$O$55),2))","v":""},"","","","","","","","",""]
[null,598]
[null,null,{"$f":"IF(ISERROR(INDEX($O$16:$P$55,MATCH(C1210,$O$16:$O$55),2)),\"\",INDEX($O$16:$P$55,MATCH(C1210,$O$16:$O$55),2))","v":""},"","","","","","","","",""]
[null,599]
[null,null,{"$f":"IF(ISERROR(INDEX($O$16:$P$55,MATCH(C1212,$O$16:$O$55),2)),\"\",INDEX($O$16:$P$55,MATCH(C1212,$O$16:$O$55),2))","v":""},"","","","","","","","",""]
[null,600]
[null,null,{"$f":"IF(ISERROR(INDEX($O$16:$P$55,MATCH(C1214,$O$16:$O$55),2)),\"\",INDEX($O$16:$P$55,MATCH(C1214,$O$16:$O$55),2))","v":""},"","","","","","","","",""]
[null,601]
[null,null,{"$f":"IF(ISERROR(INDEX($O$16:$P$55,MATCH(C1216,$O$16:$O$55),2)),\"\",INDEX($O$16:$P$55,MATCH(C1216,$O$16:$O$55),2))","v":""},"","","","","","","","",""]
[null,602]
[null,null,{"$f":"IF(ISERROR(INDEX($O$16:$P$55,MATCH(C1218,$O$16:$O$55),2)),\"\",INDEX($O$16:$P$55,MATCH(C1218,$O$16:$O$55),2))","v":""},"","","","","","","","",""]
[null,603]
[null,null,{"$f":"IF(ISERROR(INDEX($O$16:$P$55,MATCH(C1220,$O$16:$O$55),2)),\"\",INDEX($O$16:$P$55,MATCH(C1220,$O$16:$O$55),2))","v":""},"","","","","","","","",""]
[null,604]
[null,null,{"$f":"IF(ISERROR(INDEX($O$16:$P$55,MATCH(C1222,$O$16:$O$55),2)),\"\",INDEX($O$16:$P$55,MATCH(C1222,$O$16:$O$55),2))","v":""},"","","","","","","","",""]
[null,605]
[null,null,{"$f":"IF(ISERROR(INDEX($O$16:$P$55,MATCH(C1224,$O$16:$O$55),2)),\"\",INDEX($O$16:$P$55,MATCH(C1224,$O$16:$O$55),2))","v":""},"","","","","","","","",""]
[null,606]
[null,null,{"$f":"IF(ISERROR(INDEX($O$16:$P$55,MATCH(C1226,$O$16:$O$55),2)),\"\",INDEX($O$16:$P$55,MATCH(C1226,$O$16:$O$55),2))","v":""},"","","","","","","","",""]
[null,607]
[null,null,{"$f":"IF(ISERROR(INDEX($O$16:$P$55,MATCH(C1228,$O$16:$O$55),2)),\"\",INDEX($O$16:$P$55,MATCH(C1228,$O$16:$O$55),2))","v":""},"","","","","","","","",""]
[null,608]
[null,null,{"$f":"IF(ISERROR(INDEX($O$16:$P$55,MATCH(C1230,$O$16:$O$55),2)),\"\",INDEX($O$16:$P$55,MATCH(C1230,$O$16:$O$55),2))","v":""},"","","","","","","","",""]
[null,609]
[null,null,{"$f":"IF(ISERROR(INDEX($O$16:$P$55,MATCH(C1232,$O$16:$O$55),2)),\"\",INDEX($O$16:$P$55,MATCH(C1232,$O$16:$O$55),2))","v":""},"","","","","","","","",""]
[null,610]
[null,null,{"$f":"IF(ISERROR(INDEX($O$16:$P$55,MATCH(C1234,$O$16:$O$55),2)),\"\",INDEX($O$16:$P$55,MATCH(C1234,$O$16:$O$55),2))","v":""},"","","","","","","","",""]
[null,611]
[null,null,{"$f":"IF(ISERROR(INDEX($O$16:$P$55,MATCH(C1236,$O$16:$O$55),2)),\"\",INDEX($O$16:$P$55,MATCH(C1236,$O$16:$O$55),2))","v":""},"","","","","","","","",""]
[null,612]
[null,null,{"$f":"IF(ISERROR(INDEX($O$16:$P$55,MATCH(C1238,$O$16:$O$55),2)),\"\",INDEX($O$16:$P$55,MATCH(C1238,$O$16:$O$55),2))","v":""},"","","","","","","","",""]
[null,613]
[null,null,{"$f":"IF(ISERROR(INDEX($O$16:$P$55,MATCH(C1240,$O$16:$O$55),2)),\"\",INDEX($O$16:$P$55,MATCH(C1240,$O$16:$O$55),2))","v":""},"","","","","","","","",""]
[null,614]
[null,null,{"$f":"IF(ISERROR(INDEX($O$16:$P$55,MATCH(C1242,$O$16:$O$55),2)),\"\",INDEX($O$16:$P$55,MATCH(C1242,$O$16:$O$55),2))","v":""},"","","","","","","","",""]
[null,615]
[null,null,{"$f":"IF(ISERROR(INDEX($O$16:$P$55,MATCH(C1244,$O$16:$O$55),2)),\"\",INDEX($O$16:$P$55,MATCH(C1244,$O$16:$O$55),2))","v":""},"","","","","","","","",""]
[null,616]
[null,null,{"$f":"IF(ISERROR(INDEX($O$16:$P$55,MATCH(C1246,$O$16:$O$55),2)),\"\",INDEX($O$16:$P$55,MATCH(C1246,$O$16:$O$55),2))","v":""},"","","","","","","","",""]
[null,617]
[null,null,{"$f":"IF(ISERROR(INDEX($O$16:$P$55,MATCH(C1248,$O$16:$O$55),2)),\"\",INDEX($O$16:$P$55,MATCH(C1248,$O$16:$O$55),2))","v":""},"","","","","","","","",""]
[null,618]
[null,null,{"$f":"IF(ISERROR(INDEX($O$16:$P$55,MATCH(C1250,$O$16:$O$55),2)),\"\",INDEX($O$16:$P$55,MATCH(C1250,$O$16:$O$55),2))","v":""},"","","","","","","","",""]
[null,619]
[null,null,{"$f":"IF(ISERROR(INDEX($O$16:$P$55,MATCH(C1252,$O$16:$O$55),2)),\"\",INDEX($O$16:$P$55,MATCH(C1252,$O$16:$O$55),2))","v":""},"","","","","","","","",""]
[null,620]
[null,null,{"$f":"IF(ISERROR(INDEX($O$16:$P$55,MATCH(C1254,$O$16:$O$55),2)),\"\",INDEX($O$16:$P$55,MATCH(C1254,$O$16:$O$55),2))","v":""},"","","","","","","","",""]
[null,621]
[null,null,{"$f":"IF(ISERROR(INDEX($O$16:$P$55,MATCH(C1256,$O$16:$O$55),2)),\"\",INDEX($O$16:$P$55,MATCH(C1256,$O$16:$O$55),2))","v":""},"","","","","","","","",""]
[null,622]
[null,null,{"$f":"IF(ISERROR(INDEX($O$16:$P$55,MATCH(C1258,$O$16:$O$55),2)),\"\",INDEX($O$16:$P$55,MATCH(C1258,$O$16:$O$55),2))","v":""},"","","","","","","","",""]
[null,623]
[null,null,{"$f":"IF(ISERROR(INDEX($O$16:$P$55,MATCH(C1260,$O$16:$O$55),2)),\"\",INDEX($O$16:$P$55,MATCH(C1260,$O$16:$O$55),2))","v":""},"","","","","","","","",""]
[null,624]
[null,null,{"$f":"IF(ISERROR(INDEX($O$16:$P$55,MATCH(C1262,$O$16:$O$55),2)),\"\",INDEX($O$16:$P$55,MATCH(C1262,$O$16:$O$55),2))","v":""},"","","","","","","","",""]
[null,625]
[null,null,{"$f":"IF(ISERROR(INDEX($O$16:$P$55,MATCH(C1264,$O$16:$O$55),2)),\"\",INDEX($O$16:$P$55,MATCH(C1264,$O$16:$O$55),2))","v":""},"","","","","","","","",""]
[null,626]
[null,null,{"$f":"IF(ISERROR(INDEX($O$16:$P$55,MATCH(C1266,$O$16:$O$55),2)),\"\",INDEX($O$16:$P$55,MATCH(C1266,$O$16:$O$55),2))","v":""},"","","","","","","","",""]
[null,627]
[null,null,{"$f":"IF(ISERROR(INDEX($O$16:$P$55,MATCH(C1268,$O$16:$O$55),2)),\"\",INDEX($O$16:$P$55,MATCH(C1268,$O$16:$O$55),2))","v":""},"","","","","","","","",""]
[null,628]
[null,null,{"$f":"IF(ISERROR(INDEX($O$16:$P$55,MATCH(C1270,$O$16:$O$55),2)),\"\",INDEX($O$16:$P$55,MATCH(C1270,$O$16:$O$55),2))","v":""},"","","","","","","","",""]
[null,629]
[null,null,{"$f":"IF(ISERROR(INDEX($O$16:$P$55,MATCH(C1272,$O$16:$O$55),2)),\"\",INDEX($O$16:$P$55,MATCH(C1272,$O$16:$O$55),2))","v":""},"","","","","","","","",""]
[null,630]
[null,null,{"$f":"IF(ISERROR(INDEX($O$16:$P$55,MATCH(C1274,$O$16:$O$55),2)),\"\",INDEX($O$16:$P$55,MATCH(C1274,$O$16:$O$55),2))","v":""},"","","","","","","","",""]
[null,631]
[null,null,{"$f":"IF(ISERROR(INDEX($O$16:$P$55,MATCH(C1276,$O$16:$O$55),2)),\"\",INDEX($O$16:$P$55,MATCH(C1276,$O$16:$O$55),2))","v":""},"","","","","","","","",""]
[null,632]
[null,null,{"$f":"IF(ISERROR(INDEX($O$16:$P$55,MATCH(C1278,$O$16:$O$55),2)),\"\",INDEX($O$16:$P$55,MATCH(C1278,$O$16:$O$55),2))","v":""},"","","","","","","","",""]
[null,633]
[null,null,{"$f":"IF(ISERROR(INDEX($O$16:$P$55,MATCH(C1280,$O$16:$O$55),2)),\"\",INDEX($O$16:$P$55,MATCH(C1280,$O$16:$O$55),2))","v":""},"","","","","","","","",""]
[null,634]
[null,null,{"$f":"IF(ISERROR(INDEX($O$16:$P$55,MATCH(C1282,$O$16:$O$55),2)),\"\",INDEX($O$16:$P$55,MATCH(C1282,$O$16:$O$55),2))","v":""},"","","","","","","","",""]
[null,635]
[null,null,{"$f":"IF(ISERROR(INDEX($O$16:$P$55,MATCH(C1284,$O$16:$O$55),2)),\"\",INDEX($O$16:$P$55,MATCH(C1284,$O$16:$O$55),2))","v":""},"","","","","","","","",""]
[null,636]
[null,null,{"$f":"IF(ISERROR(INDEX($O$16:$P$55,MATCH(C1286,$O$16:$O$55),2)),\"\",INDEX($O$16:$P$55,MATCH(C1286,$O$16:$O$55),2))","v":""},"","","","","","","","",""]
[null,637]
[null,null,{"$f":"IF(ISERROR(INDEX($O$16:$P$55,MATCH(C1288,$O$16:$O$55),2)),\"\",INDEX($O$16:$P$55,MATCH(C1288,$O$16:$O$55),2))","v":""},"","","","","","","","",""]
[null,638]
[null,null,{"$f":"IF(ISERROR(INDEX($O$16:$P$55,MATCH(C1290,$O$16:$O$55),2)),\"\",INDEX($O$16:$P$55,MATCH(C1290,$O$16:$O$55),2))","v":""},"","","","","","","","",""]
[null,639]
[null,null,{"$f":"IF(ISERROR(INDEX($O$16:$P$55,MATCH(C1292,$O$16:$O$55),2)),\"\",INDEX($O$16:$P$55,MATCH(C1292,$O$16:$O$55),2))","v":""},"","","","","","","","",""]
[null,640]
[null,null,{"$f":"IF(ISERROR(INDEX($O$16:$P$55,MATCH(C1294,$O$16:$O$55),2)),\"\",INDEX($O$16:$P$55,MATCH(C1294,$O$16:$O$55),2))","v":""},"","","","","","","","",""]
[null,641]
[null,null,{"$f":"IF(ISERROR(INDEX($O$16:$P$55,MATCH(C1296,$O$16:$O$55),2)),\"\",INDEX($O$16:$P$55,MATCH(C1296,$O$16:$O$55),2))","v":""},"","","","","","","","",""]
[null,642]
[null,null,{"$f":"IF(ISERROR(INDEX($O$16:$P$55,MATCH(C1298,$O$16:$O$55),2)),\"\",INDEX($O$16:$P$55,MATCH(C1298,$O$16:$O$55),2))","v":""},"","","","","","","","",""]
[null,643]
[null,null,{"$f":"IF(ISERROR(INDEX($O$16:$P$55,MATCH(C1300,$O$16:$O$55),2)),\"\",INDEX($O$16:$P$55,MATCH(C1300,$O$16:$O$55),2))","v":""},"","","","","","","","",""]
[null,644]
[null,null,{"$f":"IF(ISERROR(INDEX($O$16:$P$55,MATCH(C1302,$O$16:$O$55),2)),\"\",INDEX($O$16:$P$55,MATCH(C1302,$O$16:$O$55),2))","v":""},"","","","","","","","",""]
[null,645]
[null,null,{"$f":"IF(ISERROR(INDEX($O$16:$P$55,MATCH(C1304,$O$16:$O$55),2)),\"\",INDEX($O$16:$P$55,MATCH(C1304,$O$16:$O$55),2))","v":""},"","","","","","","","",""]
[null,646]
[null,null,{"$f":"IF(ISERROR(INDEX($O$16:$P$55,MATCH(C1306,$O$16:$O$55),2)),\"\",INDEX($O$16:$P$55,MATCH(C1306,$O$16:$O$55),2))","v":""},"","","","","","","","",""]
[null,647]
[null,null,{"$f":"IF(ISERROR(INDEX($O$16:$P$55,MATCH(C1308,$O$16:$O$55),2)),\"\",INDEX($O$16:$P$55,MATCH(C1308,$O$16:$O$55),2))","v":""},"","","","","","","","",""]
[null,648]
[null,null,{"$f":"IF(ISERROR(INDEX($O$16:$P$55,MATCH(C1310,$O$16:$O$55),2)),\"\",INDEX($O$16:$P$55,MATCH(C1310,$O$16:$O$55),2))","v":""},"","","","","","","","",""]
[null,649]
[null,null,{"$f":"IF(ISERROR(INDEX($O$16:$P$55,MATCH(C1312,$O$16:$O$55),2)),\"\",INDEX($O$16:$P$55,MATCH(C1312,$O$16:$O$55),2))","v":""},"","","","","","","","",""]
[null,650]
[null,null,{"$f":"IF(ISERROR(INDEX($O$16:$P$55,MATCH(C1314,$O$16:$O$55),2)),\"\",INDEX($O$16:$P$55,MATCH(C1314,$O$16:$O$55),2))","v":""},"","","","","","","","",""]
[null,651]
[null,null,{"$f":"IF(ISERROR(INDEX($O$16:$P$55,MATCH(C1316,$O$16:$O$55),2)),\"\",INDEX($O$16:$P$55,MATCH(C1316,$O$16:$O$55),2))","v":""},"","","","","","","","",""]
[null,652]
[null,null,{"$f":"IF(ISERROR(INDEX($O$16:$P$55,MATCH(C1318,$O$16:$O$55),2)),\"\",INDEX($O$16:$P$55,MATCH(C1318,$O$16:$O$55),2))","v":""},"","","","","","","","",""]
[null,653]
[null,null,{"$f":"IF(ISERROR(INDEX($O$16:$P$55,MATCH(C1320,$O$16:$O$55),2)),\"\",INDEX($O$16:$P$55,MATCH(C1320,$O$16:$O$55),2))","v":""},"","","","","","","","",""]
[null,654]
[null,null,{"$f":"IF(ISERROR(INDEX($O$16:$P$55,MATCH(C1322,$O$16:$O$55),2)),\"\",INDEX($O$16:$P$55,MATCH(C1322,$O$16:$O$55),2))","v":""},"","","","","","","","",""]
[null,655]
[null,null,{"$f":"IF(ISERROR(INDEX($O$16:$P$55,MATCH(C1324,$O$16:$O$55),2)),\"\",INDEX($O$16:$P$55,MATCH(C1324,$O$16:$O$55),2))","v":""},"","","","","","","","",""]
[null,656]
[null,null,{"$f":"IF(ISERROR(INDEX($O$16:$P$55,MATCH(C1326,$O$16:$O$55),2)),\"\",INDEX($O$16:$P$55,MATCH(C1326,$O$16:$O$55),2))","v":""},"","","","","","","","",""]
[null,657]
[null,null,{"$f":"IF(ISERROR(INDEX($O$16:$P$55,MATCH(C1328,$O$16:$O$55),2)),\"\",INDEX($O$16:$P$55,MATCH(C1328,$O$16:$O$55),2))","v":""},"","","","","","","","",""]
[null,658]
[null,null,{"$f":"IF(ISERROR(INDEX($O$16:$P$55,MATCH(C1330,$O$16:$O$55),2)),\"\",INDEX($O$16:$P$55,MATCH(C1330,$O$16:$O$55),2))","v":""},"","","","","","","","",""]
[null,659]
[null,null,{"$f":"IF(ISERROR(INDEX($O$16:$P$55,MATCH(C1332,$O$16:$O$55),2)),\"\",INDEX($O$16:$P$55,MATCH(C1332,$O$16:$O$55),2))","v":""},"","","","","","","","",""]
[null,660]
[null,null,{"$f":"IF(ISERROR(INDEX($O$16:$P$55,MATCH(C1334,$O$16:$O$55),2)),\"\",INDEX($O$16:$P$55,MATCH(C1334,$O$16:$O$55),2))","v":""},"","","","","","","","",""]
[null,661]
[null,null,{"$f":"IF(ISERROR(INDEX($O$16:$P$55,MATCH(C1336,$O$16:$O$55),2)),\"\",INDEX($O$16:$P$55,MATCH(C1336,$O$16:$O$55),2))","v":""},"","","","","","","","",""]
[null,662]
[null,null,{"$f":"IF(ISERROR(INDEX($O$16:$P$55,MATCH(C1338,$O$16:$O$55),2)),\"\",INDEX($O$16:$P$55,MATCH(C1338,$O$16:$O$55),2))","v":""},"","","","","","","","",""]
[null,663]
[null,null,{"$f":"IF(ISERROR(INDEX($O$16:$P$55,MATCH(C1340,$O$16:$O$55),2)),\"\",INDEX($O$16:$P$55,MATCH(C1340,$O$16:$O$55),2))","v":""},"","","","","","","","",""]
[null,664]
[null,null,{"$f":"IF(ISERROR(INDEX($O$16:$P$55,MATCH(C1342,$O$16:$O$55),2)),\"\",INDEX($O$16:$P$55,MATCH(C1342,$O$16:$O$55),2))","v":""},"","","","","","","","",""]
[null,665]
[null,null,{"$f":"IF(ISERROR(INDEX($O$16:$P$55,MATCH(C1344,$O$16:$O$55),2)),\"\",INDEX($O$16:$P$55,MATCH(C1344,$O$16:$O$55),2))","v":""},"","","","","","","","",""]
[null,666]
[null,null,{"$f":"IF(ISERROR(INDEX($O$16:$P$55,MATCH(C1346,$O$16:$O$55),2)),\"\",INDEX($O$16:$P$55,MATCH(C1346,$O$16:$O$55),2))","v":""},"","","","","","","","",""]
[null,667]
[null,null,{"$f":"IF(ISERROR(INDEX($O$16:$P$55,MATCH(C1348,$O$16:$O$55),2)),\"\",INDEX($O$16:$P$55,MATCH(C1348,$O$16:$O$55),2))","v":""},"","","","","","","","",""]
[null,668]
[null,null,{"$f":"IF(ISERROR(INDEX($O$16:$P$55,MATCH(C1350,$O$16:$O$55),2)),\"\",INDEX($O$16:$P$55,MATCH(C1350,$O$16:$O$55),2))","v":""},"","","","","","","","",""]
[null,669]
[null,null,{"$f":"IF(ISERROR(INDEX($O$16:$P$55,MATCH(C1352,$O$16:$O$55),2)),\"\",INDEX($O$16:$P$55,MATCH(C1352,$O$16:$O$55),2))","v":""},"","","","","","","","",""]
[null,670]
[null,null,{"$f":"IF(ISERROR(INDEX($O$16:$P$55,MATCH(C1354,$O$16:$O$55),2)),\"\",INDEX($O$16:$P$55,MATCH(C1354,$O$16:$O$55),2))","v":""},"","","","","","","","",""]
[null,671]
[null,null,{"$f":"IF(ISERROR(INDEX($O$16:$P$55,MATCH(C1356,$O$16:$O$55),2)),\"\",INDEX($O$16:$P$55,MATCH(C1356,$O$16:$O$55),2))","v":""},"","","","","","","","",""]
[null,672]
[null,null,{"$f":"IF(ISERROR(INDEX($O$16:$P$55,MATCH(C1358,$O$16:$O$55),2)),\"\",INDEX($O$16:$P$55,MATCH(C1358,$O$16:$O$55),2))","v":""},"","","","","","","","",""]
[null,673]
[null,null,{"$f":"IF(ISERROR(INDEX($O$16:$P$55,MATCH(C1360,$O$16:$O$55),2)),\"\",INDEX($O$16:$P$55,MATCH(C1360,$O$16:$O$55),2))","v":""},"","","","","","","","",""]
[null,674]
[null,null,{"$f":"IF(ISERROR(INDEX($O$16:$P$55,MATCH(C1362,$O$16:$O$55),2)),\"\",INDEX($O$16:$P$55,MATCH(C1362,$O$16:$O$55),2))","v":""},"","","","","","","","",""]
[null,675]
[null,null,{"$f":"IF(ISERROR(INDEX($O$16:$P$55,MATCH(C1364,$O$16:$O$55),2)),\"\",INDEX($O$16:$P$55,MATCH(C1364,$O$16:$O$55),2))","v":""},"","","","","","","","",""]
[null,676]
[null,null,{"$f":"IF(ISERROR(INDEX($O$16:$P$55,MATCH(C1366,$O$16:$O$55),2)),\"\",INDEX($O$16:$P$55,MATCH(C1366,$O$16:$O$55),2))","v":""},"","","","","","","","",""]
[null,677]
[null,null,{"$f":"IF(ISERROR(INDEX($O$16:$P$55,MATCH(C1368,$O$16:$O$55),2)),\"\",INDEX($O$16:$P$55,MATCH(C1368,$O$16:$O$55),2))","v":""},"","","","","","","","",""]
[null,678]
[null,null,{"$f":"IF(ISERROR(INDEX($O$16:$P$55,MATCH(C1370,$O$16:$O$55),2)),\"\",INDEX($O$16:$P$55,MATCH(C1370,$O$16:$O$55),2))","v":""},"","","","","","","","",""]
[null,679]
[null,null,{"$f":"IF(ISERROR(INDEX($O$16:$P$55,MATCH(C1372,$O$16:$O$55),2)),\"\",INDEX($O$16:$P$55,MATCH(C1372,$O$16:$O$55),2))","v":""},"","","","","","","","",""]
[null,680]
[null,null,{"$f":"IF(ISERROR(INDEX($O$16:$P$55,MATCH(C1374,$O$16:$O$55),2)),\"\",INDEX($O$16:$P$55,MATCH(C1374,$O$16:$O$55),2))","v":""},"","","","","","","","",""]
[null,681]
[null,null,{"$f":"IF(ISERROR(INDEX($O$16:$P$55,MATCH(C1376,$O$16:$O$55),2)),\"\",INDEX($O$16:$P$55,MATCH(C1376,$O$16:$O$55),2))","v":""},"","","","","","","","",""]
[null,682]
[null,null,{"$f":"IF(ISERROR(INDEX($O$16:$P$55,MATCH(C1378,$O$16:$O$55),2)),\"\",INDEX($O$16:$P$55,MATCH(C1378,$O$16:$O$55),2))","v":""},"","","","","","","","",""]
[null,683]
[null,null,{"$f":"IF(ISERROR(INDEX($O$16:$P$55,MATCH(C1380,$O$16:$O$55),2)),\"\",INDEX($O$16:$P$55,MATCH(C1380,$O$16:$O$55),2))","v":""},"","","","","","","","",""]
[null,684]
[null,null,{"$f":"IF(ISERROR(INDEX($O$16:$P$55,MATCH(C1382,$O$16:$O$55),2)),\"\",INDEX($O$16:$P$55,MATCH(C1382,$O$16:$O$55),2))","v":""},"","","","","","","","",""]
[null,685]
[null,null,{"$f":"IF(ISERROR(INDEX($O$16:$P$55,MATCH(C1384,$O$16:$O$55),2)),\"\",INDEX($O$16:$P$55,MATCH(C1384,$O$16:$O$55),2))","v":""},"","","","","","","","",""]
[null,686]
[null,null,{"$f":"IF(ISERROR(INDEX($O$16:$P$55,MATCH(C1386,$O$16:$O$55),2)),\"\",INDEX($O$16:$P$55,MATCH(C1386,$O$16:$O$55),2))","v":""},"","","","","","","","",""]
[null,687]
[null,null,{"$f":"IF(ISERROR(INDEX($O$16:$P$55,MATCH(C1388,$O$16:$O$55),2)),\"\",INDEX($O$16:$P$55,MATCH(C1388,$O$16:$O$55),2))","v":""},"","","","","","","","",""]
[null,688]
[null,null,{"$f":"IF(ISERROR(INDEX($O$16:$P$55,MATCH(C1390,$O$16:$O$55),2)),\"\",INDEX($O$16:$P$55,MATCH(C1390,$O$16:$O$55),2))","v":""},"","","","","","","","",""]
[null,689]
[null,null,{"$f":"IF(ISERROR(INDEX($O$16:$P$55,MATCH(C1392,$O$16:$O$55),2)),\"\",INDEX($O$16:$P$55,MATCH(C1392,$O$16:$O$55),2))","v":""},"","","","","","","","",""]
[null,690]
[null,null,{"$f":"IF(ISERROR(INDEX($O$16:$P$55,MATCH(C1394,$O$16:$O$55),2)),\"\",INDEX($O$16:$P$55,MATCH(C1394,$O$16:$O$55),2))","v":""},"","","","","","","","",""]
[null,691]
[null,null,{"$f":"IF(ISERROR(INDEX($O$16:$P$55,MATCH(C1396,$O$16:$O$55),2)),\"\",INDEX($O$16:$P$55,MATCH(C1396,$O$16:$O$55),2))","v":""},"","","","","","","","",""]
[null,692]
[null,null,{"$f":"IF(ISERROR(INDEX($O$16:$P$55,MATCH(C1398,$O$16:$O$55),2)),\"\",INDEX($O$16:$P$55,MATCH(C1398,$O$16:$O$55),2))","v":""},"","","","","","","","",""]
[null,693]
[null,null,{"$f":"IF(ISERROR(INDEX($O$16:$P$55,MATCH(C1400,$O$16:$O$55),2)),\"\",INDEX($O$16:$P$55,MATCH(C1400,$O$16:$O$55),2))","v":""},"","","","","","","","",""]
[null,694]
[null,null,{"$f":"IF(ISERROR(INDEX($O$16:$P$55,MATCH(C1402,$O$16:$O$55),2)),\"\",INDEX($O$16:$P$55,MATCH(C1402,$O$16:$O$55),2))","v":""},"","","","","","","","",""]
[null,695]
[null,null,{"$f":"IF(ISERROR(INDEX($O$16:$P$55,MATCH(C1404,$O$16:$O$55),2)),\"\",INDEX($O$16:$P$55,MATCH(C1404,$O$16:$O$55),2))","v":""},"","","","","","","","",""]
[null,696]
[null,null,{"$f":"IF(ISERROR(INDEX($O$16:$P$55,MATCH(C1406,$O$16:$O$55),2)),\"\",INDEX($O$16:$P$55,MATCH(C1406,$O$16:$O$55),2))","v":""},"","","","","","","","",""]

{"sheet":"INDEX PERSOS","index":3,"n_rows":45,"n_cols":5,"rows_kept":45,"cut":false,"hidden":false,"merged":[[1,1,1,4]]}
[]
[null,"Index des rôles des persos"]
[null,"PERSOS","ROLE","RARETE","CLASSE"]
[null,"Angela","CHEF","Inhabituel","RAPIDE"]
[null,"Ashley","CITOYEN","Inhabituel","RAPIDE"]
[null,"Brigitte","SOLDAT","Inhabituel","ENDURANT"]
[null,"Blaireau","SOLDAT","Inhabituel","ENDURANT"]
[null,"Brock","SOLDAT","Inhabituel","ENDURANT"]
[null,"Burt","PROF","Inhabituel","VIGILANT"]
[null,"Caleb","CITOYEN","Ordinaire","FORT"]
[null,"Carol","CITOYEN","Inhabituel","RAPIDE"]
[null,"Carter","CHASSEUR","Inhabituel","ENDURANT"]
[null,"Cateline","PROF","Inhabituel","VIGILANT"]
[null,"Charretier",null,"Inhabituel","ENDURANT"]
[null,"Chris","REBELLE","Ordinaire","ENDURANT"]
[null,"Christa","CHASSEUR","Inhabituel","FORT"]
[null,"Clarence","REBELLE","Ordinaire","RAPIDE"]
[null,"Cletus","REBELLE","Inhabituel","RAPIDE"]
[null,"Clifton","CITOYEN","Ordinaire","VIGILANT"]
[null,"Cyrus","CHASSEUR","Ordinaire","RAPIDE"]
[null,"Danny","CITOYEN","Ordinaire","VIGILANT"]
[null,"Darren","GARDIEN","Inhabituel","RAPIDE"]
[null,"Diane","SOLDAT","Inhabituel","VIGILANT"]
[null,"Ethel","SOLDAT","Ordinaire","VIGILANT"]
[null,"Gabriel","GARDIEN","Inhabituel","RAPIDE"]
[null,"Garret","SOLDAT","Inhabituel","FORT"]
[null,"Georges","CHEF","Inhabituel","VIGILANT"]
[null,"Gerald","CITOYEN","Ordinaire","FORT"]
[null,"Grace","GARDIEN","Ordinaire","ENDURANT"]
[null,"Isabel","CHASSEUR","Inhabituel","RAPIDE"]
[null,"Jed","CHASSEUR","Ordinaire","FORT"]
[null,"Jody","CHASSEUR","Ordinaire","RAPIDE"]
[null,"John","CITOYEN","Ordinaire","FORT"]
[null,"Lucia","CITOYEN","Ordinaire","FORT"]
[null,"Mac","CHASSEUR","Inhabituel","ENDURANT"]
[null,"Margaret","CITOYEN","Inhabituel","VIGILANT"]
[null,"Nathan","CITOYEN","Ordinaire","ENDURANT"]
[null,"Neil","CITOYEN","Inhabituel","ENDURANT"]
[null,"Olivia","GARDIEN","Ordinaire","RAPIDE"]
[null,"Parker","SOLDAT","Ordinaire","ENDURANT"]
[null,"Randall","REBELLE","Inhabituel","VIGILANT"]
[null,"Ray","GARDIEN","Inhabituel","FORT"]
[null,"Samuel","SOLDAT","Inhabituel","ENDURANT"]
[null,"Susan","CITOYEN","Ordinaire","FORT"]
[null,"Todd","CITOYEN","Ordinaire","FORT"]

{"sheet":"INDEX PLAGES","index":4,"n_rows":44,"n_cols":10,"rows_kept":44,"cut":false,"hidden":false,"merged":[]}
[]
[null,"PERSOS",null,"ROLE",null,"CLASSE",null,"RARETE",null,"FORMATION"]
[null,"Angela",null,"CITOYEN",null,"ENDURANT",null,"Ordinaire",null,"Entrainement aux armes"]
[null,"Ashley",null,"CHASSEUR",null,"VIGILANT",null,"Inhabituel",null,"Formation médicale"]
[null,"Brigitte",null,"CHEF",null,"FORT",null,null,null,"Formation à la stratégie"]
[null,"Blaireau",null,"GARDIEN",null,"RAPIDE",null,null,null,"Entrainement tactique"]
[null,"Brock",null,"PROF",null,null,null,null,null,"Entrainement fondamental"]
[null,"Burt",null,"REBELLE",null,null,null,null,null,"Entrainement généraliste"]
[null,"Caleb",null,"SOLDAT",null,null,null,null,null,"Enrainement à la Guérilla"]
[null,"Carol",null,null,null,null,null,null,null,"Entrainement avancé"]
[null,"Carter",null,null,null,null,null,null,null,"Entrainement en milieu sauvage"]
[null,"Cateline",null,null,null,null,null,null,null,"Entrainement militaire"]
[null,"Charretier"]
[null,"Chris"]
[null,"Christa"]
[null,"Clarence"]
[null,"Cletus"]
[null,"Clifton"]
[null,"Cyrus"]
[null,"Danny"]
[null,"Darren"]
[null,"Diane"]
[null,"Ethel"]
[null,"Gabriel"]
[null,"Garret"]
[null,"Georges"]
[null,"Gerald"]
[null,"Grace"]
[null,"Isabel"]
[null,"Jed"]
[null,"Jody"]
[null,"John"]
[null,"Lucia"]
[null,"Mac"]
[null,"Margaret"]
[null,"Nathan"]
[null,"Neil"]
[null,"Olivia"]
[null,"Parker"]
[null,"Randall"]
[null,"Ray"]
[null,"Samuel"]
[null,"Susan"]
[null,"Todd"]

{"sheet":"CALC","index":5,"n_rows":44,"n_cols":23,"rows_kept":44,"cut":false,"hidden":true,"merged":[[1,13,1,22]]}
[]
[null,null,null,null,null,null,null,null,null,null,null,null,null,"En tests"]
[null,null,null,null,null,null,null,null,null,null,null,null,null,1,2,3,4,5,6,7,8,9,10]
[null,null,null,null,null,null,null,null,null,null,null,null,"Angela",{"$f":"COUNTIF('STATS CAMPS'!C$16:C$1408,$M4)","v":0},{"$f":"COUNTIF('STATS CAMPS'!D$16:D$1408,$M4)","v":16},{"$f":"COUNTIF('STATS CAMPS'!E$16:E$1408,$M4)","v":0},{"$f":"COUNTIF('STATS CAMPS'!F$16:F$1408,$M4)","v":0},{"$f":"COUNTIF('STATS CAMPS'!G$16:G$1408,$M4)","v":0},{"$f":"COUNTIF('STATS CAMPS'!H$16:H$1408,$M4)","v":0},{"$f":"COUNTIF('STATS CAMPS'!I$16:I$1408,$M4)","v":0},{"$f":"COUNTIF('STATS CAMPS'!J$16:J$1408,$M4)","v":0},{"$f":"COUNTIF('STATS CAMPS'!K$16:K$1408,$M4)","v":0},{"$f":"COUNTIF('STATS CAMPS'!L$16:L$1408,$M4)","v":0}]
[null,null,null,null,null,null,null,null,null,null,null,null,"Ashley",{"$f":"COUNTIF('STATS CAMPS'!C$16:C$1408,$M5)","v":0},{"$f":"COUNTIF('STATS CAMPS'!D$16:D$1408,$M5)","v":0},{"$f":"COUNTIF('STATS CAMPS'!E$16:E$1408,$M5)","v":7},{"$f":"COUNTIF('STATS CAMPS'!F$16:F$1408,$M5)","v":0},{"$f":"COUNTIF('STATS CAMPS'!G$16:G$1408,$M5)","v":0},{"$f":"COUNTIF('STATS CAMPS'!H$16:H$1408,$M5)","v":28},{"$f":"COUNTIF('STATS CAMPS'!I$16:I$1408,$M5)","v":0},{"$f":"COUNTIF('STATS CAMPS'!J$16:J$1408,$M5)","v":0},{"$f":"COUNTIF('STATS CAMPS'!K$16:K$1408,$M5)","v":0},{"$f":"COUNTIF('STATS CAMPS'!L$16:L$1408,$M5)","v":0}]
[null,null,null,null,null,null,null,null,null,null,null,null,"Brigitte",{"$f":"COUNTIF('STATS CAMPS'!C$16:C$1408,$M6)","v":0},{"$f":"COUNTIF('STATS CAMPS'!D$16:D$1408,$M6)","v":0},{"$f":"COUNTIF('STATS CAMPS'!E$16:E$1408,$M6)","v":0},{"$f":"COUNTIF('STATS CAMPS'!F$16:F$1408,$M6)","v":6},{"$f":"COUNTIF('STATS CAMPS'!G$16:G$1408,$M6)","v":0},{"$f":"COUNTIF('STATS CAMPS'!H$16:H$1408,$M6)","v":0},{"$f":"COUNTIF('STATS CAMPS'!I$16:I$1408,$M6)","v":0},{"$f":"COUNTIF('STATS CAMPS'!J$16:J$1408,$M6)","v":0},{"$f":"COUNTIF('STATS CAMPS'!K$16:K$1408,$M6)","v":0},{"$f":"COUNTIF('STATS CAMPS'!L$16:L$1408,$M6)","v":0}]
[null,null,null,null,null,null,null,null,null,null,null,null,"Blaireau",{"$f":"COUNTIF('STATS CAMPS'!C$16:C$1408,$M7)","v":0},{"$f":"COUNTIF('STATS CAMPS'!D$16:D$1408,$M7)","v":0},{"$f":"COUNTIF('STATS CAMPS'!E$16:E$1408,$M7)","v":0},{"$f":"COUNTIF('STATS CAMPS'!F$16:F$1408,$M7)","v":0},{"$f":"COUNTIF('STATS CAMPS'!G$16:G$1408,$M7)","v":0},{"$f":"COUNTIF('STATS CAMPS'!H$16:H$1408,$M7)","v":0},{"$f":"COUNTIF('STATS CAMPS'!I$16:I$1408,$M7)","v":0},{"$f":"COUNTIF('STATS CAMPS'!J$16:J$1408,$M7)","v":0},{"$f":"COUNTIF('STATS CAMPS'!K$16:K$1408,$M7)","v":0},{"$f":"COUNTIF('STATS CAMPS'!L$16:L$1408,$M7)","v":0}]
[null,null,null,null,null,null,null,null,null,null,null,null,"Brock",{"$f":"COUNTIF('STATS CAMPS'!C$16:C$1408,$M8)","v":0},{"$f":"COUNTIF('STATS CAMPS'!D$16:D$1408,$M8)","v":0},{"$f":"COUNTIF('STATS CAMPS'!E$16:E$1408,$M8)","v":10},{"$f":"COUNTIF('STATS CAMPS'!F$16:F$1408,$M8)","v":0},{"$f":"COUNTIF('STATS CAMPS'!G$16:G$1408,$M8)","v":0},{"$f":"COUNTIF('STATS CAMPS'!H$16:H$1408,$M8)","v":0},{"$f":"COUNTIF('STATS CAMPS'!I$16:I$1408,$M8)","v":0},{"$f":"COUNTIF('STATS CAMPS'!J$16:J$1408,$M8)","v":0},{"$f":"COUNTIF('STATS CAMPS'!K$16:K$1408,$M8)","v":0},{"$f":"COUNTIF('STATS CAMPS'!L$16:L$1408,$M8)","v":0}]
[null,null,null,null,null,null,null,null,null,null,null,null,"Burt",{"$f":"COUNTIF('STATS CAMPS'!C$16:C$1408,$M9)","v":0},{"$f":"COUNTIF('STATS CAMPS'!D$16:D$1408,$M9)","v":0},{"$f":"COUNTIF('STATS CAMPS'!E$16:E$1408,$M9)","v":0},{"$f":"COUNTIF('STATS CAMPS'!F$16:F$1408,$M9)","v":0},{"$f":"COUNTIF('STATS CAMPS'!G$16:G$1408,$M9)","v":0},{"$f":"COUNTIF('STATS CAMPS'!H$16:H$1408,$M9)","v":2},{"$f":"COUNTIF('STATS CAMPS'!I$16:I$1408,$M9)","v":0},{"$f":"COUNTIF('STATS CAMPS'!J$16:J$1408,$M9)","v":0},{"$f":"COUNTIF('STATS CAMPS'!K$16:K$1408,$M9)","v":0},{"$f":"COUNTIF('STATS CAMPS'!L$16:L$1408,$M9)","v":0}]
[null,null,null,null,null,null,null,null,null,null,null,null,"Caleb",{"$f":"COUNTIF('STATS CAMPS'!C$16:C$1408,$M10)","v":0},{"$f":"COUNTIF('STATS CAMPS'!D$16:D$1408,$M10)","v":0},{"$f":"COUNTIF('STATS CAMPS'!E$16:E$1408,$M10)","v":0},{"$f":"COUNTIF('STATS CAMPS'!F$16:F$1408,$M10)","v":0},{"$f":"COUNTIF('STATS CAMPS'!G$16:G$1408,$M10)","v":1},{"$f":"COUNTIF('STATS CAMPS'!H$16:H$1408,$M10)","v":0},{"$f":"COUNTIF('STATS CAMPS'!I$16:I$1408,$M10)","v":0},{"$f":"COUNTIF('STATS CAMPS'!J$16:J$1408,$M10)","v":0},{"$f":"COUNTIF('STATS CAMPS'!K$16:K$1408,$M10)","v":0},{"$f":"COUNTIF('STATS CAMPS'!L$16:L$1408,$M10)","v":0}]
[null,null,null,null,null,null,null,null,null,null,null,null,"Carol",{"$f":"COUNTIF('STATS CAMPS'!C$16:C$1408,$M11)","v":11},{"$f":"COUNTIF('STATS CAMPS'!D$16:D$1408,$M11)","v":0},{"$f":"COUNTIF('STATS CAMPS'!E$16:E$1408,$M11)","v":0},{"$f":"COUNTIF('STATS CAMPS'!F$16:F$1408,$M11)","v":0},{"$f":"COUNTIF('STATS CAMPS'!G$16:G$1408,$M11)","v":0},{"$f":"COUNTIF('STATS CAMPS'!H$16:H$1408,$M11)","v":22},{"$f":"COUNTIF('STATS CAMPS'!I$16:I$1408,$M11)","v":0},{"$f":"COUNTIF('STATS CAMPS'!J$16:J$1408,$M11)","v":0},{"$f":"COUNTIF('STATS CAMPS'!K$16:K$1408,$M11)","v":0},{"$f":"COUNTIF('STATS CAMPS'!L$16:L$1408,$M11)","v":0}]
[null,null,null,null,null,null,null,null,null,null,null,null,"Carter",{"$f":"COUNTIF('STATS CAMPS'!C$16:C$1408,$M12)","v":5},{"$f":"COUNTIF('STATS CAMPS'!D$16:D$1408,$M12)","v":0},{"$f":"COUNTIF('STATS CAMPS'!E$16:E$1408,$M12)","v":0},{"$f":"COUNTIF('STATS CAMPS'!F$16:F$1408,$M12)","v":0},{"$f":"COUNTIF('STATS CAMPS'!G$16:G$1408,$M12)","v":0},{"$f":"COUNTIF('STATS CAMPS'!H$16:H$1408,$M12)","v":0},{"$f":"COUNTIF('STATS CAMPS'!I$16:I$1408,$M12)","v":0},{"$f":"COUNTIF('STATS CAMPS'!J$16:J$1408,$M12)","v":0},{"$f":"COUNTIF('STATS CAMPS'!K$16:K$1408,$M12)","v":0},{"$f":"COUNTIF('STATS CAMPS'!L$16:L$1408,$M12)","v":0}]
[null,null,null,null,null,null,null,null,null,null,null,null,"Charretier",{"$f":"COUNTIF('STATS CAMPS'!C$16:C$1408,$M13)","v":0},{"$f":"COUNTIF('STATS CAMPS'!D$16:D$1408,$M13)","v":0},{"$f":"COUNTIF('STATS CAMPS'!E$16:E$1408,$M13)","v":0},{"$f":"COUNTIF('STATS CAMPS'!F$16:F$1408,$M13)","v":0},{"$f":"COUNTIF('STATS CAMPS'!G$16:G$1408,$M13)","v":0},{"$f":"COUNTIF('STATS CAMPS'!H$16:H$1408,$M13)","v":0},{"$f":"COUNTIF('STATS CAMPS'!I$16:I$1408,$M13)","v":0},{"$f":"COUNTIF('STATS CAMPS'!J$16:J$1408,$M13)","v":0},{"$f":"COUNTIF('STATS CAMPS'!K$16:K$1408,$M13)","v":0},{"$f":"COUNTIF('STATS CAMPS'!L$16:L$1408,$M13)","v":0}]
[null,null,null,null,null,null,null,null,null,null,null,null,"Chris",{"$f":"COUNTIF('STATS CAMPS'!C$16:C$1408,$M14)","v":0},{"$f":"COUNTIF('STATS CAMPS'!D$16:D$1408,$M14)","v":0},{"$f":"COUNTIF('STATS CAMPS'!E$16:E$1408,$M14)","v":0},{"$f":"COUNTIF('STATS CAMPS'!F$16:F$1408,$M14)","v":0},{"$f":"COUNTIF('STATS CAMPS'!G$16:G$1408,$M14)","v":1},{"$f":"COUNTIF('STATS CAMPS'!H$16:H$1408,$M14)","v":0},{"$f":"COUNTIF('STATS CAMPS'!I$16:I$1408,$M14)","v":0},{"$f":"COUNTIF('STATS CAMPS'!J$16:J$1408,$M14)","v":0},{"$f":"COUNTIF('STATS CAMPS'!K$16:K$1408,$M14)","v":0},{"$f":"COUNTIF('STATS CAMPS'!L$16:L$1408,$M14)","v":0}]
[null,null,null,null,null,null,null,null,null,null,null,null,"Christa",{"$f":"COUNTIF('STATS CAMPS'!C$16:C$1408,$M15)","v":4},{"$f":"COUNTIF('STATS CAMPS'!D$16:D$1408,$M15)","v":0},{"$f":"COUNTIF('STATS CAMPS'!E$16:E$1408,$M15)","v":0},{"$f":"COUNTIF('STATS CAMPS'!F$16:F$1408,$M15)","v":0},{"$f":"COUNTIF('STATS CAMPS'!G$16:G$1408,$M15)","v":0},{"$f":"COUNTIF('STATS CAMPS'!H$16:H$1408,$M15)","v":0},{"$f":"COUNTIF('STATS CAMPS'!I$16:I$1408,$M15)","v":0},{"$f":"COUNTIF('STATS CAMPS'!J$16:J$1408,$M15)","v":0},{"$f":"COUNTIF('STATS CAMPS'!K$16:K$1408,$M15)","v":4},{"$f":"COUNTIF('STATS CAMPS'!L$16:L$1408,$M15)","v":0}]
[null,null,null,null,null,null,null,null,null,null,null,null,"Clarence",{"$f":"COUNTIF('STATS CAMPS'!C$16:C$1408,$M16)","v":0},{"$f":"COUNTIF('STATS CAMPS'!D$16:D$1408,$M16)","v":0},{"$f":"COUNTIF('STATS CAMPS'!E$16:E$1408,$M16)","v":0},{"$f":"COUNTIF('STATS CAMPS'!F$16:F$1408,$M16)","v":0},{"$f":"COUNTIF('STATS CAMPS'!G$16:G$1408,$M16)","v":1},{"$f":"COUNTIF('STATS CAMPS'!H$16:H$1408,$M16)","v":0},{"$f":"COUNTIF('STATS CAMPS'!I$16:I$1408,$M16)","v":0},{"$f":"COUNTIF('STATS CAMPS'!J$16:J$1408,$M16)","v":2},{"$f":"COUNTIF('STATS CAMPS'!K$16:K$1408,$M16)","v":0},{"$f":"COUNTIF('STATS CAMPS'!L$16:L$1408,$M16)","v":0}]
[null,null,null,null,null,null,null,null,null,null,null,null,"Cletus",{"$f":"COUNTIF('STATS CAMPS'!C$16:C$1408,$M17)","v":0},{"$f":"COUNTIF('STATS CAMPS'!D$16:D$1408,$M17)","v":0},{"$f":"COUNTIF('STATS CAMPS'!E$16:E$1408,$M17)","v":3},{"$f":"COUNTIF('STATS CAMPS'!F$16:F$1408,$M17)","v":0},{"$f":"COUNTIF('STATS CAMPS'!G$16:G$1408,$M17)","v":0},{"$f":"COUNTIF('STATS CAMPS'!H$16:H$1408,$M17)","v":0},{"$f":"COUNTIF('STATS CAMPS'!I$16:I$1408,$M17)","v":0},{"$f":"COUNTIF('STATS CAMPS'!J$16:J$1408,$M17)","v":0},{"$f":"COUNTIF('STATS CAMPS'!K$16:K$1408,$M17)","v":0},{"$f":"COUNTIF('STATS CAMPS'!L$16:L$1408,$M17)","v":0}]
[null,null,null,null,null,null,null,null,null,null,null,null,"Clifton",{"$f":"COUNTIF('STATS CAMPS'!C$16:C$1408,$M18)","v":0},{"$f":"COUNTIF('STATS CAMPS'!D$16:D$1408,$M18)","v":0},{"$f":"COUNTIF('STATS CAMPS'!E$16:E$1408,$M18)","v":0},{"$f":"COUNTIF('STATS CAMPS'!F$16:F$1408,$M18)","v":0},{"$f":"COUNTIF('STATS CAMPS'!G$16:G$1408,$M18)","v":1},{"$f":"COUNTIF('STATS CAMPS'!H$16:H$1408,$M18)","v":0},{"$f":"COUNTIF('STATS CAMPS'!I$16:I$1408,$M18)","v":0},{"$f":"COUNTIF('STATS CAMPS'!J$16:J$1408,$M18)","v":0},{"$f":"COUNTIF('STATS CAMPS'!K$16:K$1408,$M18)","v":0},{"$f":"COUNTIF('STATS CAMPS'!L$16:L$1408,$M18)","v":0}]
[null,null,null,null,null,null,null,null,null,null,null,null,"Cyrus",{"$f":"COUNTIF('STATS CAMPS'!C$16:C$1408,$M19)","v":0},{"$f":"COUNTIF('STATS CAMPS'!D$16:D$1408,$M19)","v":0},{"$f":"COUNTIF('STATS CAMPS'!E$16:E$1408,$M19)","v":0},{"$f":"COUNTIF('STATS CAMPS'!F$16:F$1408,$M19)","v":0},{"$f":"COUNTIF('STATS CAMPS'!G$16:G$1408,$M19)","v":1},{"$f":"COUNTIF('STATS CAMPS'!H$16:H$1408,$M19)","v":0},{"$f":"COUNTIF('STATS CAMPS'!I$16:I$1408,$M19)","v":0},{"$f":"COUNTIF('STATS CAMPS'!J$16:J$1408,$M19)","v":1},{"$f":"COUNTIF('STATS CAMPS'!K$16:K$1408,$M19)","v":0},{"$f":"COUNTIF('STATS CAMPS'!L$16:L$1408,$M19)","v":0}]
[null,null,null,null,null,null,null,null,null,null,null,null,"Danny",{"$f":"COUNTIF('STATS CAMPS'!C$16:C$1408,$M20)","v":0},{"$f":"COUNTIF('STATS CAMPS'!D$16:D$1408,$M20)","v":0},{"$f":"COUNTIF('STATS CAMPS'!E$16:E$1408,$M20)","v":0},{"$f":"COUNTIF('STATS CAMPS'!F$16:F$1408,$M20)","v":0},{"$f":"COUNTIF('STATS CAMPS'!G$16:G$1408,$M20)","v":4},{"$f":"COUNTIF('STATS CAMPS'!H$16:H$1408,$M20)","v":0},{"$f":"COUNTIF('STATS CAMPS'!I$16:I$1408,$M20)","v":0},{"$f":"COUNTIF('STATS CAMPS'!J$16:J$1408,$M20)","v":0},{"$f":"COUNTIF('STATS CAMPS'!K$16:K$1408,$M20)","v":0},{"$f":"COUNTIF('STATS CAMPS'!L$16:L$1408,$M20)","v":0}]
[null,null,null,null,null,null,null,null,null,null,null,null,"Darren",{"$f":"COUNTIF('STATS CAMPS'!C$16:C$1408,$M21)","v":0},{"$f":"COUNTIF('STATS CAMPS'!D$16:D$1408,$M21)","v":20},{"$f":"COUNTIF('STATS CAMPS'!E$16:E$1408,$M21)","v":0},{"$f":"COUNTIF('STATS CAMPS'!F$16:F$1408,$M21)","v":0},{"$f":"COUNTIF('STATS CAMPS'!G$16:G$1408,$M21)","v":0},{"$f":"COUNTIF('STATS CAMPS'!H$16:H$1408,$M21)","v":0},{"$f":"COUNTIF('STATS CAMPS'!I$16:I$1408,$M21)","v":0},{"$f":"COUNTIF('STATS CAMPS'!J$16:J$1408,$M21)","v":0},{"$f":"COUNTIF('STATS CAMPS'!K$16:K$1408,$M21)","v":0},{"$f":"COUNTIF('STATS CAMPS'!L$16:L$1408,$M21)","v":0}]
[null,null,null,null,null,null,null,null,null,null,null,null,"Diane",{"$f":"COUNTIF('STATS CAMPS'!C$16:C$1408,$M22)","v":0},{"$f":"COUNTIF('STATS CAMPS'!D$16:D$1408,$M22)","v":0},{"$f":"COUNTIF('STATS CAMPS'!E$16:E$1408,$M22)","v":0},{"$f":"COUNTIF('STATS CAMPS'!F$16:F$1408,$M22)","v":7},{"$f":"COUNTIF('STATS CAMPS'!G$16:G$1408,$M22)","v":0},{"$f":"COUNTIF('STATS CAMPS'!H$16:H$1408,$M22)","v":0},{"$f":"COUNTIF('STATS CAMPS'!I$16:I$1408,$M22)","v":0},{"$f":"COUNTIF('STATS CAMPS'!J$16:J$1408,$M22)","v":0},{"$f":"COUNTIF('STATS CAMPS'!K$16:K$1408,$M22)","v":0},{"$f":"COUNTIF('STATS CAMPS'!L$16:L$1408,$M22)","v":0}]
[null,null,null,null,null,null,null,null,null,null,null,null,"Ethel",{"$f":"COUNTIF('STATS CAMPS'!C$16:C$1408,$M23)","v":0},{"$f":"COUNTIF('STATS CAMPS'!D$16:D$1408,$M23)","v":0},{"$f":"COUNTIF('STATS CAMPS'!E$16:E$1408,$M23)","v":0},{"$f":"COUNTIF('STATS CAMPS'!F$16:F$1408,$M23)","v":0},{"$f":"COUNTIF('STATS CAMPS'!G$16:G$1408,$M23)","v":2},{"$f":"COUNTIF('STATS CAMPS'!H$16:H$1408,$M23)","v":0},{"$f":"COUNTIF('STATS CAMPS'!I$16:I$1408,$M23)","v":0},{"$f":"COUNTIF('STATS CAMPS'!J$16:J$1408,$M23)","v":2},{"$f":"COUNTIF('STATS CAMPS'!K$16:K$1408,$M23)","v":0},{"$f":"COUNTIF('STATS CAMPS'!L$16:L$1408,$M23)","v":0}]
[null,null,null,null,null,null,null,null,null,null,null,null,"Gabriel",{"$f":"COUNTIF('STATS CAMPS'!C$16:C$1408,$M24)","v":0},{"$f":"COUNTIF('STATS CAMPS'!D$16:D$1408,$M24)","v":21},{"$f":"COUNTIF('STATS CAMPS'!E$16:E$1408,$M24)","v":0},{"$f":"COUNTIF('STATS CAMPS'!F$16:F$1408,$M24)","v":0},{"$f":"COUNTIF('STATS CAMPS'!G$16:G$1408,$M24)","v":0},{"$f":"COUNTIF('STATS CAMPS'!H$16:H$1408,$M24)","v":0},{"$f":"COUNTIF('STATS CAMPS'!I$16:I$1408,$M24)","v":0},{"$f":"COUNTIF('STATS CAMPS'!J$16:J$1408,$M24)","v":0},{"$f":"COUNTIF('STATS CAMPS'!K$16:K$1408,$M24)","v":0},{"$f":"COUNTIF('STATS CAMPS'!L$16:L$1408,$M24)","v":0}]
[null,null,null,null,null,null,null,null,null,null,null,null,"Garret",{"$f":"COUNTIF('STATS CAMPS'!C$16:C$1408,$M25)","v":7},{"$f":"COUNTIF('STATS CAMPS'!D$16:D$1408,$M25)","v":0},{"$f":"COUNTIF('STATS CAMPS'!E$16:E$1408,$M25)","v":0},{"$f":"COUNTIF('STATS CAMPS'!F$16:F$1408,$M25)","v":0},{"$f":"COUNTIF('STATS CAMPS'!G$16:G$1408,$M25)","v":0},{"$f":"COUNTIF('STATS CAMPS'!H$16:H$1408,$M25)","v":0},{"$f":"COUNTIF('STATS CAMPS'!I$16:I$1408,$M25)","v":0},{"$f":"COUNTIF('STATS CAMPS'!J$16:J$1408,$M25)","v":0},{"$f":"COUNTIF('STATS CAMPS'!K$16:K$1408,$M25)","v":0},{"$f":"COUNTIF('STATS CAMPS'!L$16:L$1408,$M25)","v":0}]
[null,null,null,null,null,null,null,null,null,null,null,null,"Georges",{"$f":"COUNTIF('STATS CAMPS'!C$16:C$1408,$M26)","v":16},{"$f":"COUNTIF('STATS CAMPS'!D$16:D$1408,$M26)","v":0},{"$f":"COUNTIF('STATS CAMPS'!E$16:E$1408,$M26)","v":0},{"$f":"COUNTIF('STATS CAMPS'!F$16:F$1408,$M26)","v":0},{"$f":"COUNTIF('STATS CAMPS'!G$16:G$1408,$M26)","v":0},{"$f":"COUNTIF('STATS CAMPS'!H$16:H$1408,$M26)","v":0},{"$f":"COUNTIF('STATS CAMPS'!I$16:I$1408,$M26)","v":0},{"$f":"COUNTIF('STATS CAMPS'!J$16:J$1408,$M26)","v":0},{"$f":"COUNTIF('STATS CAMPS'!K$16:K$1408,$M26)","v":0},{"$f":"COUNTIF('STATS CAMPS'!L$16:L$1408,$M26)","v":0}]
[null,null,null,null,null,null,null,null,null,null,null,null,"Gerald",{"$f":"COUNTIF('STATS CAMPS'!C$16:C$1408,$M27)","v":0},{"$f":"COUNTIF('STATS CAMPS'!D$16:D$1408,$M27)","v":0},{"$f":"COUNTIF('STATS CAMPS'!E$16:E$1408,$M27)","v":0},{"$f":"COUNTIF('STATS CAMPS'!F$16:F$1408,$M27)","v":0},{"$f":"COUNTIF('STATS CAMPS'!G$16:G$1408,$M27)","v":3},{"$f":"COUNTIF('STATS CAMPS'!H$16:H$1408,$M27)","v":0},{"$f":"COUNTIF('STATS CAMPS'!I$16:I$1408,$M27)","v":0},{"$f":"COUNTIF('STATS CAMPS'!J$16:J$1408,$M27)","v":3},{"$f":"COUNTIF('STATS CAMPS'!K$16:K$1408,$M27)","v":0},{"$f":"COUNTIF('STATS CAMPS'!L$16:L$1408,$M27)","v":0}]
[null,null,null,null,null,null,null,null,null,null,null,null,"Grace",{"$f":"COUNTIF('STATS CAMPS'!C$16:C$1408,$M28)","v":0},{"$f":"COUNTIF('STATS CAMPS'!D$16:D$1408,$M28)","v":0},{"$f":"COUNTIF('STATS CAMPS'!E$16:E$1408,$M28)","v":0},{"$f":"COUNTIF('STATS CAMPS'!F$16:F$1408,$M28)","v":0},{"$f":"COUNTIF('STATS CAMPS'!G$16:G$1408,$M28)","v":0},{"$f":"COUNTIF('STATS CAMPS'!H$16:H$1408,$M28)","v":0},{"$f":"COUNTIF('STATS CAMPS'!I$16:I$1408,$M28)","v":0},{"$f":"COUNTIF('STATS CAMPS'!J$16:J$1408,$M28)","v":1},{"$f":"COUNTIF('STATS CAMPS'!K$16:K$1408,$M28)","v":0},{"$f":"COUNTIF('STATS CAMPS'!L$16:L$1408,$M28)","v":0}]
[null,null,null,null,null,null,null,null,null,null,null,null,"Isabel",{"$f":"COUNTIF('STATS CAMPS'!C$16:C$1408,$M29)","v":0},{"$f":"COUNTIF('STATS CAMPS'!D$16:D$1408,$M29)","v":0},{"$f":"COUNTIF('STATS CAMPS'!E$16:E$1408,$M29)","v":0},{"$f":"COUNTIF('STATS CAMPS'!F$16:F$1408,$M29)","v":10},{"$f":"COUNTIF('STATS CAMPS'!G$16:G$1408,$M29)","v":0},{"$f":"COUNTIF('STATS CAMPS'!H$16:H$1408,$M29)","v":0},{"$f":"COUNTIF('STATS CAMPS'!I$16:I$1408,$M29)","v":0},{"$f":"COUNTIF('STATS CAMPS'!J$16:J$1408,$M29)","v":0},{"$f":"COUNTIF('STATS CAMPS'!K$16:K$1408,$M29)","v":0},{"$f":"COUNTIF('STATS CAMPS'!L$16:L$1408,$M29)","v":0}]
[null,null,null,null,null,null,null,null,null,null,null,null,"Jed",{"$f":"COUNTIF('STATS CAMPS'!C$16:C$1408,$M30)","v":0},{"$f":"COUNTIF('STATS CAMPS'!D$16:D$1408,$M30)","v":0},{"$f":"COUNTIF('STATS CAMPS'!E$16:E$1408,$M30)","v":0},{"$f":"COUNTIF('STATS CAMPS'!F$16:F$1408,$M30)","v":0},{"$f":"COUNTIF('STATS CAMPS'!G$16:G$1408,$M30)","v":1},{"$f":"COUNTIF('STATS CAMPS'!H$16:H$1408,$M30)","v":0},{"$f":"COUNTIF('STATS CAMPS'!I$16:I$1408,$M30)","v":0},{"$f":"COUNTIF('STATS CAMPS'!J$16:J$1408,$M30)","v":0},{"$f":"COUNTIF('STATS CAMPS'!K$16:K$1408,$M30)","v":0},{"$f":"COUNTIF('STATS CAMPS'!L$16:L$1408,$M30)","v":0}]
[null,null,null,null,null,null,null,null,null,null,null,null,"Jody",{"$f":"COUNTIF('STATS CAMPS'!C$16:C$1408,$M31)","v":0},{"$f":"COUNTIF('STATS CAMPS'!D$16:D$1408,$M31)","v":0},{"$f":"COUNTIF('STATS CAMPS'!E$16:E$1408,$M31)","v":0},{"$f":"COUNTIF('STATS CAMPS'!F$16:F$1408,$M31)","v":0},{"$f":"COUNTIF('STATS CAMPS'!G$16:G$1408,$M31)","v":2},{"$f":"COUNTIF('STATS CAMPS'!H$16:H$1408,$M31)","v":0},{"$f":"COUNTIF('STATS CAMPS'!I$16:I$1408,$M31)","v":0},{"$f":"COUNTIF('STATS CAMPS'!J$16:J$1408,$M31)","v":0},{"$f":"COUNTIF('STATS CAMPS'!K$16:K$1408,$M31)","v":0},{"$f":"COUNTIF('STATS CAMPS'!L$16:L$1408,$M31)","v":0}]
[null,null,null,null,null,null,null,null,null,null,null,null,"John",{"$f":"COUNTIF('STATS CAMPS'!C$16:C$1408,$M32)","v":0},{"$f":"COUNTIF('STATS CAMPS'!D$16:D$1408,$M32)","v":0},{"$f":"COUNTIF('STATS CAMPS'!E$16:E$1408,$M32)","v":0},{"$f":"COUNTIF('STATS CAMPS'!F$16:F$1408,$M32)","v":0},{"$f":"COUNTIF('STATS CAMPS'!G$16:G$1408,$M32)","v":3},{"$f":"COUNTIF('STATS CAMPS'!H$16:H$1408,$M32)","v":0},{"$f":"COUNTIF('STATS CAMPS'!I$16:I$1408,$M32)","v":0},{"$f":"COUNTIF('STATS CAMPS'!J$16:J$1408,$M32)","v":1},{"$f":"COUNTIF('STATS CAMPS'!K$16:K$1408,$M32)","v":0},{"$f":"COUNTIF('STATS CAMPS'!L$16:L$1408,$M32)","v":0}]
[null,null,null,null,null,null,null,null,null,null,null,null,"Lucia",{"$f":"COUNTIF('STATS CAMPS'!C$16:C$1408,$M33)","v":0},{"$f":"COUNTIF('STATS CAMPS'!D$16:D$1408,$M33)","v":0},{"$f":"COUNTIF('STATS CAMPS'!E$16:E$1408,$M33)","v":0},{"$f":"COUNTIF('STATS CAMPS'!F$16:F$1408,$M33)","v":0},{"$f":"COUNTIF('STATS CAMPS'!G$16:G$1408,$M33)","v":0},{"$f":"COUNTIF('STATS CAMPS'!H$16:H$1408,$M33)","v":0},{"$f":"COUNTIF('STATS CAMPS'!I$16:I$1408,$M33)","v":0},{"$f":"COUNTIF('STATS CAMPS'!J$16:J$1408,$M33)","v":0},{"$f":"COUNTIF('STATS CAMPS'!K$16:K$1408,$M33)","v":0},{"$f":"COUNTIF('STATS CAMPS'!L$16:L$1408,$M33)","v":0}]
[null,null,null,null,null,null,null,null,null,null,null,null,"Mac",{"$f":"COUNTIF('STATS CAMPS'!C$16:C$1408,$M34)","v":9},{"$f":"COUNTIF('STATS CAMPS'!D$16:D$1408,$M34)","v":0},{"$f":"COUNTIF('STATS CAMPS'!E$16:E$1408,$M34)","v":0},{"$f":"COUNTIF('STATS CAMPS'!F$16:F$1408,$M34)","v":0},{"$f":"COUNTIF('STATS CAMPS'!G$16:G$1408,$M34)","v":0},{"$f":"COUNTIF('STATS CAMPS'!H$16:H$1408,$M34)","v":0},{"$f":"COUNTIF('STATS CAMPS'!I$16:I$1408,$M34)","v":0},{"$f":"COUNTIF('STATS CAMPS'!J$16:J$1408,$M34)","v":0},{"$f":"COUNTIF('STATS CAMPS'!K$16:K$1408,$M34)","v":0},{"$f":"COUNTIF('STATS CAMPS'!L$16:L$1408,$M34)","v":0}]
[null,null,null,null,null,null,null,null,null,null,null,null,"Margaret",{"$f":"COUNTIF('STATS CAMPS'!C$16:C$1408,$M35)","v":0},{"$f":"COUNTIF('STATS CAMPS'!D$16:D$1408,$M35)","v":0},{"$f":"COUNTIF('STATS CAMPS'!E$16:E$1408,$M35)","v":13},{"$f":"COUNTIF('STATS CAMPS'!F$16:F$1408,$M35)","v":0},{"$f":"COUNTIF('STATS CAMPS'!G$16:G$1408,$M35)","v":0},{"$f":"COUNTIF('STATS CAMPS'!H$16:H$1408,$M35)","v":42},{"$f":"COUNTIF('STATS CAMPS'!I$16:I$1408,$M35)","v":0},{"$f":"COUNTIF('STATS CAMPS'!J$16:J$1408,$M35)","v":0},{"$f":"COUNTIF('STATS CAMPS'!K$16:K$1408,$M35)","v":0},{"$f":"COUNTIF('STATS CAMPS'!L$16:L$1408,$M35)","v":0}]
[null,null,null,null,null,null,null,null,null,null,null,null,"Nathan",{"$f":"COUNTIF('STATS CAMPS'!C$16:C$1408,$M36)","v":0},{"$f":"COUNTIF('STATS CAMPS'!D$16:D$1408,$M36)","v":0},{"$f":"COUNTIF('STATS CAMPS'!E$16:E$1408,$M36)","v":0},{"$f":"COUNTIF('STATS CAMPS'!F$16:F$1408,$M36)","v":0},{"$f":"COUNTIF('STATS CAMPS'!G$16:G$1408,$M36)","v":0},{"$f":"COUNTIF('STATS CAMPS'!H$16:H$1408,$M36)","v":0},{"$f":"COUNTIF('STATS CAMPS'!I$16:I$1408,$M36)","v":0},{"$f":"COUNTIF('STATS CAMPS'!J$16:J$1408,$M36)","v":2},{"$f":"COUNTIF('STATS CAMPS'!K$16:K$1408,$M36)","v":0},{"$f":"COUNTIF('STATS CAMPS'!L$16:L$1408,$M36)","v":0}]
[null,null,null,null,null,null,null,null,null,null,null,null,"Neil",{"$f":"COUNTIF('STATS CAMPS'!C$16:C$1408,$M37)","v":0},{"$f":"COUNTIF('STATS CAMPS'!D$16:D$1408,$M37)","v":0},{"$f":"COUNTIF('STATS CAMPS'!E$16:E$1408,$M37)","v":0},{"$f":"COUNTIF('STATS CAMPS'!F$16:F$1408,$M37)","v":7},{"$f":"COUNTIF('STATS CAMPS'!G$16:G$1408,$M37)","v":0},{"$f":"COUNTIF('STATS CAMPS'!H$16:H$1408,$M37)","v":43},{"$f":"COUNTIF('STATS CAMPS'!I$16:I$1408,$M37)","v":0},{"$f":"COUNTIF('STATS CAMPS'!J$16:J$1408,$M37)","v":0},{"$f":"COUNTIF('STATS CAMPS'!K$16:K$1408,$M37)","v":0},{"$f":"COUNTIF('STATS CAMPS'!L$16:L$1408,$M37)","v":0}]
[null,null,null,null,null,null,null,null,null,null,null,null,"Olivia",{"$f":"COUNTIF('STATS CAMPS'!C$16:C$1408,$M38)","v":0},{"$f":"COUNTIF('STATS CAMPS'!D$16:D$1408,$M38)","v":0},{"$f":"COUNTIF('STATS CAMPS'!E$16:E$1408,$M38)","v":0},{"$f":"COUNTIF('STATS CAMPS'!F$16:F$1408,$M38)","v":0},{"$f":"COUNTIF('STATS CAMPS'!G$16:G$1408,$M38)","v":2},{"$f":"COUNTIF('STATS CAMPS'!H$16:H$1408,$M38)","v":0},{"$f":"COUNTIF('STATS CAMPS'!I$16:I$1408,$M38)","v":0},{"$f":"COUNTIF('STATS CAMPS'!J$16:J$1408,$M38)","v":0},{"$f":"COUNTIF('STATS CAMPS'!K$16:K$1408,$M38)","v":0},{"$f":"COUNTIF('STATS CAMPS'!L$16:L$1408,$M38)","v":0}]
[null,null,null,null,null,null,null,null,null,null,null,null,"Parker",{"$f":"COUNTIF('STATS CAMPS'!C$16:C$1408,$M39)","v":0},{"$f":"COUNTIF('STATS CAMPS'!D$16:D$1408,$M39)","v":0},{"$f":"COUNTIF('STATS CAMPS'!E$16:E$1408,$M39)","v":0},{"$f":"COUNTIF('STATS CAMPS'!F$16:F$1408,$M39)","v":0},{"$f":"COUNTIF('STATS CAMPS'!G$16:G$1408,$M39)","v":0},{"$f":"COUNTIF('STATS CAMPS'!H$16:H$1408,$M39)","v":0},{"$f":"COUNTIF('STATS CAMPS'!I$16:I$1408,$M39)","v":0},{"$f":"COUNTIF('STATS CAMPS'!J$16:J$1408,$M39)","v":0},{"$f":"COUNTIF('STATS CAMPS'!K$16:K$1408,$M39)","v":0},{"$f":"COUNTIF('STATS CAMPS'!L$16:L$1408,$M39)","v":0}]
[null,null,null,null,null,null,null,null,null,null,null,null,"Randall",{"$f":"COUNTIF('STATS CAMPS'!C$16:C$1408,$M40)","v":0},{"$f":"COUNTIF('STATS CAMPS'!D$16:D$1408,$M40)","v":0},{"$f":"COUNTIF('STATS CAMPS'!E$16:E$1408,$M40)","v":0},{"$f":"COUNTIF('STATS CAMPS'!F$16:F$1408,$M40)","v":11},{"$f":"COUNTIF('STATS CAMPS'!G$16:G$1408,$M40)","v":0},{"$f":"COUNTIF('STATS CAMPS'!H$16:H$1408,$M40)","v":0},{"$f":"COUNTIF('STATS CAMPS'!I$16:I$1408,$M40)","v":0},{"$f":"COUNTIF('STATS CAMPS'!J$16:J$1408,$M40)","v":0},{"$f":"COUNTIF('STATS CAMPS'!K$16:K$1408,$M40)","v":0},{"$f":"COUNTIF('STATS CAMPS'!L$16:L$1408,$M40)","v":0}]
[null,null,null,null,null,null,null,null,null,null,null,null,"Ray",{"$f":"COUNTIF('STATS CAMPS'!C$16:C$1408,$M41)","v":0},{"$f":"COUNTIF('STATS CAMPS'!D$16:D$1408,$M41)","v":47},{"$f":"COUNTIF('STATS CAMPS'!E$16:E$1408,$M41)","v":0},{"$f":"COUNTIF('STATS CAMPS'!F$16:F$1408,$M41)","v":0},{"$f":"COUNTIF('STATS CAMPS'!G$16:G$1408,$M41)","v":0},{"$f":"COUNTIF('STATS CAMPS'!H$16:H$1408,$M41)","v":0},{"$f":"COUNTIF('STATS CAMPS'!I$16:I$1408,$M41)","v":0},{"$f":"COUNTIF('STATS CAMPS'!J$16:J$1408,$M41)","v":0},{"$f":"COUNTIF('STATS CAMPS'!K$16:K$1408,$M41)","v":0},{"$f":"COUNTIF('STATS CAMPS'!L$16:L$1408,$M41)","v":0}]
[null,null,null,null,null,null,null,null,null,null,null,null,"Samuel",{"$f":"COUNTIF('STATS CAMPS'!C$16:C$1408,$M42)","v":0},{"$f":"COUNTIF('STATS CAMPS'!D$16:D$1408,$M42)","v":0},{"$f":"COUNTIF('STATS CAMPS'!E$16:E$1408,$M42)","v":0},{"$f":"COUNTIF('STATS CAMPS'!F$16:F$1408,$M42)","v":2},{"$f":"COUNTIF('STATS CAMPS'!G$16:G$1408,$M42)","v":0},{"$f":"COUNTIF('STATS CAMPS'!H$16:H$1408,$M42)","v":0},{"$f":"COUNTIF('STATS CAMPS'!I$16:I$1408,$M42)","v":0},{"$f":"COUNTIF('STATS CAMPS'!J$16:J$1408,$M42)","v":0},{"$f":"COUNTIF('STATS CAMPS'!K$16:K$1408,$M42)","v":0},{"$f":"COUNTIF('STATS CAMPS'!L$16:L$1408,$M42)","v":0}]
[null,null,null,null,null,null,null,null,null,null,null,null,"Susan",{"$f":"COUNTIF('STATS CAMPS'!C$16:C$1408,$M43)","v":0},{"$f":"COUNTIF('STATS CAMPS'!D$16:D$1408,$M43)","v":0},{"$f":"COUNTIF('STATS CAMPS'!E$16:E$1408,$M43)","v":0},{"$f":"COUNTIF('STATS CAMPS'!F$16:F$1408,$M43)","v":0},{"$f":"COUNTIF('STATS CAMPS'!G$16:G$1408,$M43)","v":1},{"$f":"COUNTIF('STATS CAMPS'!H$16:H$1408,$M43)","v":0},{"$f":"COUNTIF('STATS CAMPS'!I$16:I$1408,$M43)","v":0},{"$f":"COUNTIF('STATS CAMPS'!J$16:J$1408,$M43)","v":2},{"$f":"COUNTIF('STATS CAMPS'!K$16:K$1408,$M43)","v":0},{"$f":"COUNTIF('STATS CAMPS'!L$16:L$1408,$M43)","v":0}]
[null,null,null,null,null,null,null,null,null,null,null,null,"Todd",{"$f":"COUNTIF('STATS CAMPS'!C$16:C$1408,$M44)","v":0},{"$f":"COUNTIF('STATS CAMPS'!D$16:D$1408,$M44)","v":0},{"$f":"COUNTIF('STATS CAMPS'!E$16:E$1408,$M44)","v":0},{"$f":"COUNTIF('STATS CAMPS'!F$16:F$1408,$M44)","v":0},{"$f":"COUNTIF('STATS CAMPS'!G$16:G$1408,$M44)","v":1},{"$f":"COUNTIF('STATS CAMPS'!H$16:H$1408,$M44)","v":0},{"$f":"COUNTIF('STATS CAMPS'!I$16:I$1408,$M44)","v":0},{"$f":"COUNTIF('STATS CAMPS'!J$16:J$1408,$M44)","v":1},{"$f":"COUNTIF('STATS CAMPS'!K$16:K$1408,$M44)","v":0},{"$f":"COUNTIF('STATS CAMPS'!L$16:L$1408,$M44)","v":0}]