{"text_format":"1","workbook":"xlsx","n_sheets":2,"sheets":["Programme de cours","Résultat"],"not_rendered":{"charts":0,"images":1,"macros":1,"external_links":1,"defined_names":51,"comments":0,"pivot_tables":0},"unopened":[],"bounds":{"document_bytes":16777216,"sheet_cells":100000,"rows_first":2000,"rows_last":500,"rows_between":2000,"halvings":0,"cell_chars":16384,"cell_head_chars":4096},"cells_cut":0,"cells_raw":0,"read":"whole","date_system":"1900"}

{"sheet":"Programme de cours","index":0,"n_rows":16,"n_cols":28,"rows_kept":16,"cut":false,"hidden":false,"merged":[[0,0,2,13],[0,15,2,27]]}
["Programme de cours"]
[]
[]
["Mois","Date","Début","Fin","Lieu","Session","Processus","Filière","Intitulé du cours","Intervenant 1","Intervenant 2","Intervenant 3","Communication(s)","Auditeur(s) libre(s)","Simulation","FC","SA►SI","SA►SU","SI►SA","SI►SU","SU►SA","SU►SI","IMC►SA","IMC►SI","IMC►SU","DS SI---->SU22","Nombre de période(s)","Nombre d'heure(s)"]
["janvier","2015-01-12",0.375,0.51041666666666663,"Salle Erasme",1,"3,4","SA-SI-SU-IMC","Accueil - Concept","Pierre delaroche","Marc dusoubois","Jean delaforet",null,null,null,"X",{"$f":"IF(AND(#REF!<>\"\",#REF!<>\"\"),#REF!-#REF!,\"\")","v":{"$error":"#REF!"}},null,null,null,null,null,null,null,null,"P",{"$f":"IF(AND(C5<>\"\",D5<>\"\"),TRUNC(((D5-C5)*24)/0.833333333,0),\"\")","v":3},{"$f":"IF(AND(C5<>\"\",D5<>\"\"),D5-C5,\"\")","v":0.13541666666666663}]
["janvier","2015-01-12",0.55208333333333337,0.625,"Salle Erasme",1,4,"SA-SI-SU-IMC","Apprendre à l'âge adulte","Pierre delaroche","Jean delaforet",null,null,null,null,"X",{"$f":"IF(AND(#REF!<>\"\",#REF!<>\"\"),#REF!-#REF!,\"\")","v":{"$error":"#REF!"}},null,null,null,null,null,null,null,null,"P",2,7.291666666666663E-2]
["janvier","2015-01-12",0.55208333333333337,0.625,"Salle Erasme",1,4,"SA-SI-SU-IMC","Apprendre à l'âge adulte","Marc dusoubois","Marc dusoubois","Jean delaforet",null,null,null,"X",{"$f":"IF(AND(#REF!<>\"\",#REF!<>\"\"),#REF!-#REF!,\"\")","v":{"$error":"#REF!"}},null,null,null,null,null,null,null,null,"P",{"$f":"IF(AND(C7<>\"\",D7<>\"\"),TRUNC(((D7-C7)*24)/0.833333333,0),\"\")","v":2},{"$f":"IF(AND(C7<>\"\",D7<>\"\"),D7-C7,\"\")","v":7.291666666666663E-2}]
[{"$f":"IF(B8<>\"\",VLOOKUP(MONTH(B8),'[1]Base de données'!$B$5:$C$17,2),\"\")","v":"Février"},"2015-02-02",0.34375,0.41666666666666669,"Salle Pythagore",1,"SU","SA-SI-SU-IMC","Riesenmey Virginie","Marc dusoubois",null,null,null,"X",null,{"$f":"IF(AND(#REF!<>\"\",#REF!<>\"\"),TRUNC(((#REF!-#REF!)*24)/0.833333333,0),\"\")","v":{"$error":"#REF!"}},{"$f":"IF(AND(#REF!<>\"\",#REF!<>\"\"),#REF!-#REF!,\"\")","v":{"$error":"#REF!"}},null,null,null,null,null,null,null,null,null,{"$f":"IF(AND(C8<>\"\",D8<>\"\"),TRUNC(((D8-C8)*24)/0.833333333,0),\"\")","v":2},{"$f":"IF(AND(C8<>\"\",D8<>\"\"),D8-C8,\"\")","v":7.2916666666666685E-2}]
[{"$f":"IF(B9<>\"\",VLOOKUP(MONTH(B9),'[1]Base de données'!$B$5:$C$17,2),\"\")","v":"Février"},"2015-02-02",0.4375,0.51041666666666663,"Salle Erasme",1,"SA-SI-SU-IMC","SA-SI-SU-IMC","Riesenmey Virginie","Pierre delaroche","Jean delaforet",null,null,null,null,{"$f":"IF(AND(#REF!<>\"\",#REF!<>\"\"),TRUNC(((#REF!-#REF!)*24)/0.833333333,0),\"\")","v":{"$error":"#REF!"}},{"$f":"IF(AND(#REF!<>\"\",#REF!<>\"\"),#REF!-#REF!,\"\")","v":{"$error":"#REF!"}},null,null,null,null,null,null,null,null,null,2,7.291666666666663E-2]
[{"$f":"IF(B10<>\"\",VLOOKUP(MONTH(B10),'[1]Base de données'!$B$5:$C$17,2),\"\")","v":"Février"},"2015-02-02",0.55208333333333337,0.63541666666666663,"Salle Erasme",1,"SA-SI-SU-IMC","SA-SI-SU-IMC","Vasse Jean-Michel","Marc dusoubois",null,null,null,null,null,{"$f":"IF(AND(#REF!<>\"\",#REF!<>\"\"),TRUNC(((#REF!-#REF!)*24)/0.833333333,0),\"\")","v":{"$error":"#REF!"}},{"$f":"IF(AND(#REF!<>\"\",#REF!<>\"\"),#REF!-#REF!,\"\")","v":{"$error":"#REF!"}},null,null,null,null,null,null,null,null,null,2,8.3333333333333259E-2]
[{"$f":"IF(B11<>\"\",VLOOKUP(MONTH(B11),'[1]Base de données'!$B$5:$C$17,2),\"\")","v":"Février"},"2015-02-03",0.34375,0.41666666666666669,"Start",5,"15:14:43","00:01:00","Mondragon Pablo","Pierre delaroche","Marc dusoubois",null,null,null,null,{"$f":"IF(AND(#REF!<>\"\",#REF!<>\"\"),TRUNC(((#REF!-#REF!)*24)/0.833333333,0),\"\")","v":{"$error":"#REF!"}},{"$f":"IF(AND(#REF!<>\"\",#REF!<>\"\"),#REF!-#REF!,\"\")","v":{"$error":"#REF!"}},null,null,null,null,null,null,null,null,null,2,7.2916666666666685E-2]
[{"$f":"IF(B12<>\"\",VLOOKUP(MONTH(B12),'[1]Base de données'!$B$5:$C$17,2),\"\")","v":"Février"},"2015-02-03",0.4375,0.51041666666666663,"Salle Erasme",1,"SA-SI-SU-IMC","SA-SI-SU-IMC","Sridharan Govind","Jean delaforet",null,null,null,null,null,{"$f":"IF(AND(#REF!<>\"\",#REF!<>\"\"),TRUNC(((#REF!-#REF!)*24)/0.833333333,0),\"\")","v":{"$error":"#REF!"}},{"$f":"IF(AND(#REF!<>\"\",#REF!<>\"\"),#REF!-#REF!,\"\")","v":{"$error":"#REF!"}},null,null,null,null,null,null,null,null,null,2,7.291666666666663E-2]
[{"$f":"IF(B13<>\"\",VLOOKUP(MONTH(B13),'[1]Base de données'!$B$5:$C$17,2),\"\")","v":"Février"},"2015-02-03",0.55208333333333337,0.625,"Salle Erasme",1,"SA-SI-SU","SA-SI-SU-IMC","Vauthey Barbara","Jean delaforet",null,null,null,null,null,{"$f":"IF(AND(#REF!<>\"\",#REF!<>\"\"),TRUNC(((#REF!-#REF!)*24)/0.833333333,0),\"\")","v":{"$error":"#REF!"}},{"$f":"IF(AND(#REF!<>\"\",#REF!<>\"\"),#REF!-#REF!,\"\")","v":{"$error":"#REF!"}},null,null,null,null,null,null,null,null,null,2,7.291666666666663E-2]
[{"$f":"IF(B14<>\"\",VLOOKUP(MONTH(B14),'[1]Base de données'!$B$5:$C$17,2),\"\")","v":"Février"},"2015-02-04",0.34375,0.4375,"Salle Erasme",1,"SA-SI-SU","SA-SI-SU-IMC","Vasse Jean-Michel","Pierre delaroche","Marc dusoubois",null,null,null,null,{"$f":"IF(AND(#REF!<>\"\",#REF!<>\"\"),TRUNC(((#REF!-#REF!)*24)/0.833333333,0),\"\")","v":{"$error":"#REF!"}},{"$f":"IF(AND(#REF!<>\"\",#REF!<>\"\"),#REF!-#REF!,\"\")","v":{"$error":"#REF!"}},null,null,null,null,null,null,null,null,null,{"$f":"IF(AND(C14<>\"\",D14<>\"\"),TRUNC(((D14-C14)*24)/0.833333333,0),\"\")","v":2},{"$f":"IF(AND(C14<>\"\",D14<>\"\"),D14-C14,\"\")","v":9.375E-2}]
[{"$f":"IF(B15<>\"\",VLOOKUP(MONTH(B15),'[1]Base de données'!$B$5:$C$17,2),\"\")","v":"Février"},"2015-02-04",0.44791666666666669,0.51041666666666663,"Salle Pythagore",1,"SU","SA-SI-SU-IMC","Riesenmey Virginie","Jean delaforet","Marc dusoubois",null,null,null,null,{"$f":"IF(AND(#REF!<>\"\",#REF!<>\"\"),TRUNC(((#REF!-#REF!)*24)/0.833333333,0),\"\")","v":{"$error":"#REF!"}},{"$f":"IF(AND(#REF!<>\"\",#REF!<>\"\"),#REF!-#REF!,\"\")","v":{"$error":"#REF!"}},null,null,null,null,null,null,null,null,null,{"$f":"IF(AND(C15<>\"\",D15<>\"\"),TRUNC(((D15-C15)*24)/0.833333333,0),\"\")","v":1},{"$f":"IF(AND(C15<>\"\",D15<>\"\"),D15-C15,\"\")","v":6.2499999999999944E-2}]
[{"$f":"IF(B16<>\"\",VLOOKUP(MONTH(B16),'[1]Base de données'!$B$5:$C$17,2),\"\")","v":"Février"},"2015-02-04",0.55208333333333337,0.61458333333333337,"Salle Erasme",1,"SA-SI-SU-IMC","SA-SI-SU-IMC","Hanhart Walter","Jean delaforet",null,null,null,null,null,{"$f":"IF(AND(#REF!<>\"\",#REF!<>\"\"),TRUNC(((#REF!-#REF!)*24)/0.833333333,0),\"\")","v":{"$error":"#REF!"}},{"$f":"IF(AND(#REF!<>\"\",#REF!<>\"\"),#REF!-#REF!,\"\")","v":{"$error":"#REF!"}},null,null,null,null,null,null,null,null,null,1,6.25E-2]

{"sheet":"Résultat","index":1,"n_rows":4,"n_cols":15,"rows_kept":4,"cut":false,"hidden":false,"merged":[]}
["Intervenant ","Intitulé du cours 1","Filières 1","périodes 1","Intitulé du cours 2","Filières 2","périodes 2","Intitulé du cours 3","Filières 3","périodes 3","Intitulé du cours 4","Filières 4","périodes 4","Année des cours","Nbr périodes"]
["Pierre delaroche","Accueil - Concept","SA-SI-SU-IMC",3,"Apprendre à l'âge adulte","SA-SI-SU-IMC",2,"Apprendre à l'âge adulte","SA-SI-SU-IMC",2,null,null,null,2015,7]
["Marc dusoubois","Accueil - Concept","SA-SI-SU-IMC",3,"Apprendre à l'âge adulte","SA-SI-SU-IMC",2,null,null,null,null,null,null,2015,5]
["Jean delaforet"]