{"text_format":"1","workbook":"xlsx","n_sheets":6,"sheets":["Archive ACHAT","Archive VENTE","Reçu Achat","Reçu Vente","Statistique","Liste Pays"],"not_rendered":{"charts":0,"images":1,"macros":1,"external_links":1,"defined_names":2,"comments":0,"pivot_tables":0},"unopened":[],"bounds":{"document_bytes":16777216,"sheet_cells":100000,"rows_first":2000,"rows_last":500,"rows_between":2000,"halvings":0,"cell_chars":16384,"cell_head_chars":4096},"cells_cut":0,"cells_raw":0,"read":"whole","date_system":"1900"}

{"sheet":"Archive ACHAT","index":0,"n_rows":7,"n_cols":37,"rows_kept":7,"cut":false,"hidden":false,"merged":[[0,3,1,3],[0,2,1,2],[0,0,1,0],[0,1,1,1],[0,9,1,9],[0,8,1,8],[0,7,1,7],[0,6,1,6],[0,5,1,5],[0,4,1,4],[0,11,0,22],[0,23,0,34],[0,35,1,35],[0,36,1,36],[0,10,1,10]]}
["N° Bordereau","Date","Nom(S)","Prénom(S)","Adresse et Téléphone","N° Passeport","Provenance","Motif","Devise","Taux1","Taux2","Quantité",null,null,null,null,null,null,null,null,null,null,null,"Valeur",null,null,null,null,null,null,null,null,null,null,null,"Valeur Totale","Net à payer"]
[null,null,null,null,null,null,null,null,null,null,null,10000,5000,2000,1000,500,200,100,50,20,10,5,1,10000,5000,2000,1000,500,200,100,50,20,10,5,1]
[null,null,null,null,null,null,null,null,null,null,null,null,null,null,null,null,null,null,null,null,null,null,null,{"$f":"IF(I3=\"CFAO\",L3*10000,\"\")","v":""},{"$f":"IF(I3=\"CFAO\",M3*5000,\"\")","v":""},{"$f":"IF(I3=\"CFAO\",N3*2000,\"\")","v":""},{"$f":"IF(I3=\"CFAO\",O3*1000,\"\")","v":""},{"$f":"IF(OR(I3=\"CFAO\",I3=\"EURO\"),P3*500,\"\")","v":""},{"$f":"IF(I3=\"EURO\",Q3*200,\"\")","v":""},{"$f":"IF(OR(I3=\"DOLLAR\",I3=\"EURO\"),R3*100,\"\")","v":""},{"$f":"IF(OR(I3=\"DOLLAR\",I3=\"EURO\",I3=\"LIVRES STERLING\"),S3*50,\"\")","v":""},{"$f":"IF(OR(I3=\"DOLLAR\",I3=\"EURO\",I3=\"LIVRES STERLING\"),T3*20,\"\")","v":""},{"$f":"IF(OR(I3=\"DOLLAR\",I3=\"EURO\",I3=\"LIVRES STERLING\"),U3*10,\"\")","v":""},{"$f":"IF(OR(I3=\"DOLLAR\",I3=\"EURO\",I3=\"LIVRES STERLING\"),V3*5,\"\")","v":""},{"$f":"IF(I3=\"DOLLAR\",W3,\"\")","v":""},{"$f":"IF(I3=\"CFAO\",(X3+Y3+Z3+AA3+AB3),IF(I3=\"DOLLAR\",(AD3+AE3+AF3+AG3+AH3+AI3),IF(I3=\"EURO\",(AB3+AC3+AD3+AE3+AF3+AG3+AH3),IF(I3=\"LIVRES STERLING\",(AE3+AF3+AG3+AH3),\"\"))))","v":""},{"$f":"IF(I3=\"CFAO\",AJ3,IF(I3=\"DOLLAR\",(((AD3+AE3)*J3)+((AF3+AG3+AH3+AI3)*K3)),IF(I3=\"EURO\",(((AB3+AC3+AD3+AE3)*J3)+((AF3+AG3+AH3)*K3)),IF(I3=\"LIVRES STERLING\",((AE3*J3)+((AF3+AG3+AH3)*K3)),\"\"))))","v":""}]
[null,null,null,null,null,null,null,null,null,null,null,null,null,null,null,null,null,null,null,null,null,null,null,{"$f":"IF(I4=\"CFAO\",L4*10000,\"\")","v":""},{"$f":"IF(I4=\"CFAO\",M4*5000,\"\")","v":""},{"$f":"IF(I4=\"CFAO\",N4*2000,\"\")","v":""},{"$f":"IF(I4=\"CFAO\",O4*1000,\"\")","v":""},{"$f":"IF(OR(I4=\"CFAO\",I4=\"EURO\"),P4*500,\"\")","v":""},{"$f":"IF(I4=\"EURO\",Q4*200,\"\")","v":""},{"$f":"IF(OR(I4=\"DOLLAR\",I4=\"EURO\"),R4*100,\"\")","v":""},{"$f":"IF(OR(I4=\"DOLLAR\",I4=\"EURO\",I4=\"LIVRES STERLING\"),S4*50,\"\")","v":""},{"$f":"IF(OR(I4=\"DOLLAR\",I4=\"EURO\",I4=\"LIVRES STERLING\"),T4*20,\"\")","v":""},{"$f":"IF(OR(I4=\"DOLLAR\",I4=\"EURO\",I4=\"LIVRES STERLING\"),U4*10,\"\")","v":""},{"$f":"IF(OR(I4=\"DOLLAR\",I4=\"EURO\",I4=\"LIVRES STERLING\"),V4*5,\"\")","v":""},{"$f":"IF(I4=\"DOLLAR\",W4,\"\")","v":""},{"$f":"IF(I4=\"CFAO\",(X4+Y4+Z4+AA4+AB4),IF(I4=\"DOLLAR\",(AD4+AE4+AF4+AG4+AH4+AI4),IF(I4=\"EURO\",(AB4+AC4+AD4+AE4+AF4+AG4+AH4),IF(I4=\"LIVRES STERLING\",(AE4+AF4+AG4+AH4),\"\"))))","v":""},{"$f":"IF(I4=\"CFAO\",AJ4,IF(I4=\"DOLLAR\",(((AD4+AE4)*J4)+((AF4+AG4+AH4+AI4)*K4)),IF(I4=\"EURO\",(((AB4+AC4+AD4+AE4)*J4)+((AF4+AG4+AH4)*K4)),IF(I4=\"LIVRES STERLING\",((AE4*J4)+((AF4+AG4+AH4)*K4)),\"\"))))","v":""}]
[null,null,null,null,null,null,null,null,null,null,null,null,null,null,null,null,null,null,null,null,null,null,null,{"$f":"IF(I5=\"CFAO\",L5*10000,\"\")","v":""},{"$f":"IF(I5=\"CFAO\",M5*5000,\"\")","v":""},{"$f":"IF(I5=\"CFAO\",N5*2000,\"\")","v":""},{"$f":"IF(I5=\"CFAO\",O5*1000,\"\")","v":""},{"$f":"IF(OR(I5=\"CFAO\",I5=\"EURO\"),P5*500,\"\")","v":""},{"$f":"IF(I5=\"EURO\",Q5*200,\"\")","v":""},"","","","","","",{"$f":"IF(I5=\"CFAO\",(X5+Y5+Z5+AA5+AB5),IF(I5=\"DOLLAR\",(AD5+AE5+AF5+AG5+AH5+AI5),IF(I5=\"EURO\",(AB5+AC5+AD5+AE5+AF5+AG5+AH5),IF(I5=\"LIVRES STERLING\",(AE5+AF5+AG5+AH5),\"\"))))","v":""},{"$f":"IF(I5=\"CFAO\",AJ5,IF(I5=\"DOLLAR\",(((AD5+AE5)*J5)+((AF5+AG5+AH5+AI5)*K5)),IF(I5=\"EURO\",(((AB5+AC5+AD5+AE5)*J5)+((AF5+AG5+AH5)*K5)),IF(I5=\"LIVRES STERLING\",((AE5*J5)+((AF5+AG5+AH5)*K5)),\"\"))))","v":""}]
[null,null,null,null,null,null,null,null,null,null,null,null,null,null,null,null,null,null,null,null,null,null,null,"","","","","","","","","","","","",{"$f":"IF(I6=\"CFAO\",(X6+Y6+Z6+AA6+AB6),IF(I6=\"DOLLAR\",(AD6+AE6+AF6+AG6+AH6+AI6),IF(I6=\"EURO\",(AB6+AC6+AD6+AE6+AF6+AG6+AH6),IF(I6=\"LIVRES STERLING\",(AE6+AF6+AG6+AH6),\"\"))))","v":""},{"$f":"IF(I6=\"CFAO\",AJ6,IF(I6=\"DOLLAR\",(((AD6+AE6)*J6)+((AF6+AG6+AH6+AI6)*K6)),IF(I6=\"EURO\",(((AB6+AC6+AD6+AE6)*J6)+((AF6+AG6+AH6)*K6)),IF(I6=\"LIVRES STERLING\",((AE6*J6)+((AF6+AG6+AH6)*K6)),\"\"))))","v":""}]
[null,null,null,null,null,null,null,null,null,null,null,null,null,null,null,null,null,null,null,null,null,null,null,"","","","","","",{"$f":"IF(OR(I7=\"DOLLARS\",I7=\"EURO\"),R7*100,\"\")","v":""},{"$f":"IF(OR(I7=\"DOLLARS\",I7=\"EURO\",I7=\"LIVRES STERLING\"),S7*50,\"\")","v":""},{"$f":"IF(OR(I7=\"DOLLARS\",I7=\"EURO\",I7=\"LIVRES STERLING\"),T7*20,\"\")","v":""},{"$f":"IF(OR(I7=\"DOLLARS\",I7=\"EURO\",I7=\"LIVRES STERLING\"),U7*10,\"\")","v":""},{"$f":"IF(OR(I7=\"DOLLARS\",I7=\"EURO\",I7=\"LIVRES STERLING\"),V7*5,\"\")","v":""},{"$f":"IF(I7=\"DOLLARS\",W7,\"\")","v":""},{"$f":"IF(I7=\"CFAO\",(X7+Y7+Z7+AA7+AB7),IF(I7=\"DOLLAR\",(AD7+AE7+AF7+AG7+AH7+AI7),IF(I7=\"EURO\",(AB7+AC7+AD7+AE7+AF7+AG7+AH7),IF(I7=\"LIVRES STERLING\",(AE7+AF7+AG7+AH7),\"\"))))","v":""},{"$f":"IF(I7=\"CFAO\",AJ7,IF(I7=\"DOLLAR\",(((AD7+AE7)*J7)+((AF7+AG7+AH7+AI7)*K7)),IF(I7=\"EURO\",(((AB7+AC7+AD7+AE7)*J7)+((AF7+AG7+AH7)*K7)),IF(I7=\"LIVRES STERLING\",((AE7*J7)+((AF7+AG7+AH7)*K7)),\"\"))))","v":""}]

{"sheet":"Archive VENTE","index":1,"n_rows":3,"n_cols":36,"rows_kept":3,"cut":false,"hidden":false,"merged":[[0,5,1,5],[0,0,1,0],[0,1,1,1],[0,2,1,2],[0,3,1,3],[0,4,1,4],[0,22,0,33],[0,34,1,34],[0,35,1,35],[0,6,1,6],[0,7,1,7],[0,8,1,8],[0,9,1,9],[0,10,0,21]]}
["N° Bordereau","Date","Nom(S)","Prénom(S)","Adresse et Téléphone","N° Passeport","Destination","Motif","Devise","Taux","Quantité",null,null,null,null,null,null,null,null,null,null,null,"Valeur",null,null,null,null,null,null,null,null,null,null,null,"Valeur Totale","Net à payer"]
[null,null,null,null,null,null,null,null,null,null,10000,5000,2000,1000,500,200,100,50,20,10,5,1,10000,5000,2000,1000,500,200,100,50,20,10,5,1]
[null,null,null,null,null,null,null,null,"DOLLAR",635,null,null,null,null,null,null,5,null,null,null,null,10,{"$f":"IF(I3=\"CFAO\",K3*10000,\"\")","v":""},{"$f":"IF(I3=\"CFAO\",L3*5000,\"\")","v":""},{"$f":"IF(I3=\"CFAO\",M3*2000,\"\")","v":""},{"$f":"IF(I3=\"CFAO\",N3*1000,\"\")","v":""},{"$f":"IF(OR(I3=\"CFAO\",I3=\"EURO\"),O3*500,\"\")","v":""},{"$f":"IF(I3=\"EURO\",P3*200,\"\")","v":""},{"$f":"IF(OR(I3=\"DOLLAR\",I3=\"EURO\"),Q3*100,\"\")","v":500},{"$f":"IF(OR(I3=\"DOLLAR\",I3=\"EURO\",I3=\"LIVRES STERLING\"),R3*50,\"\")","v":0},{"$f":"IF(OR(I3=\"DOLLAR\",I3=\"EURO\",I3=\"LIVRES STERLING\"),S3*20,\"\")","v":0},{"$f":"IF(OR(I3=\"DOLLAR\",I3=\"EURO\",I3=\"LIVRES STERLING\"),T3*10,\"\")","v":0},{"$f":"IF(OR(I3=\"DOLLAR\",I3=\"EURO\",I3=\"LIVRES STERLING\"),U3*5,\"\")","v":0},{"$f":"IF(I3=\"DOLLAR\",V3,\"\")","v":10},{"$f":"IF(I3=\"CFAO\",(W3+X3+Y3+Z3+AA3),IF(I3=\"DOLLAR\",(AC3+AD3+AE3+AF3+AG3+AH3),IF(I3=\"EURO\",(AA3+AB3+AC3+AD3+AE3+AF3+AG3),IF(I3=\"LIVRES STERLING\",(AD3+AE3+AF3+AG3),\"\"))))","v":510},{"$f":"AI3*J3","v":323850}]

{"sheet":"Reçu Achat","index":2,"n_rows":31,"n_cols":13,"rows_kept":31,"cut":false,"hidden":false,"merged":[[6,0,6,2],[6,3,6,5],[3,0,3,5],[4,0,4,2],[4,3,4,5],[5,0,5,2],[5,3,5,5],[7,0,7,2],[7,3,7,5],[8,0,8,2],[8,3,8,4],[9,0,9,2],[9,3,9,4],[3,7,3,12],[4,7,4,9],[4,10,4,12],[5,7,5,9],[5,10,5,12],[10,0,10,2],[10,3,10,4],[11,1,11,2],[11,4,11,5],[28,2,28,3],[6,7,6,9],[6,10,6,12],[7,7,7,9],[7,10,7,12],[8,7,8,9],[8,10,8,11],[30,4,30,5],[30,11,30,12],[28,9,28,10],[9,7,9,9],[9,10,9,11],[10,7,10,9],[10,10,10,11],[11,8,11,9],[11,11,11,12]]}
["BORDEREAU D'ACHAT N°",null,1,null,null,null,null,"BORDEREAU D'ACHAT N°",null,{"$f":"IF(C1=\"\",\"\",C1)","v":1}]
["Agence:","Lmumba",null,"            Pointe-Noire le",null,"2015-09-05",null,"Agence:","Lmumba",null,"            Pointe-Noire le",null,{"$f":"IF(F2=\"\",\"\",F2)","v":"2015-09-05"}]
[]
["INFORMATIONS DU CLIENT",null,null,null,null,null,null,"INFORMATIONS DU CLIENT"]
["NOM (S) :",null,null,"loemba ndelo",null,null,null,"NOM (S) :",null,null,{"$f":"IF(D5=\"\",\"\",D5)","v":"loemba ndelo"}]
[" PRENOM (S):",null,null,"gladness",null,null,null," PRENOM (S):",null,null,{"$f":"IF(D6=\"\",\"\",D6)","v":"gladness"}]
["ADRESSE et TELEPHONE:",null,null,"ekpe gare / 04 440 16 13",null,null,null,"ADRESSE et TELEPHONE:",null,null,{"$f":"IF(D7=\"\",\"\",D7)","v":"ekpe gare / 04 440 16 13"}]
["N° PASSEPORT:",null,null,"AO3421",null,null,null,"N° PASSEPORT:",null,null,{"$f":"IF(D8=\"\",\"\",D8)","v":"AO3421"}]
["Provenance des devises:",null,null,"CANADA",null,null,null,"Provenance des devises:"]
["Motif:",null,null,"ETUDE",null,null,null,"Motif:",null,null,{"$f":"IF(D10=\"\",\"\",D10)","v":"ETUDE"}]
["Devise:",null,null,"DOLLARS",null,null,null,"Devise:",null,null,{"$f":"IF(D11=\"\",\"\",D11)","v":"DOLLARS"}]
["TAUX 1:",500,null,"TAUX 2:",null,null,null,"TAUX 1:",{"$f":"IF(B12=\"\",\"\",B12)","v":500},null,"TAUX 2:",{"$f":"IF(E12=\"\",\"\",E12)","v":""}]
[]
[null,"BILLETAGE",null,null,null,null,null,null,"BILLETAGE"]
[null,"Coupures","Quantité","Valeur",null,null,null,null,"Coupures","Quantité","Valeur"]
[null,10000,null,{"$f":"C16*B16","v":0},null,null,null,null,10000,{"$f":"IF(C16=\"\",\"\",C16)","v":""},{"$f":"IF(D16=\"\",\"\",D16)","v":0}]
[null,5000,null,{"$f":"C17*B17","v":0},null,null,null,null,5000,{"$f":"IF(C17=\"\",\"\",C17)","v":""},{"$f":"IF(D17=\"\",\"\",D17)","v":0}]
[null,2000,null,{"$f":"C18*B18","v":0},null,null,null,null,2000,{"$f":"IF(C18=\"\",\"\",C18)","v":""},{"$f":"IF(D18=\"\",\"\",D18)","v":0}]
[null,1000,null,0,null,null,null,null,1000,"",0]
[null,500,null,0,null,null,null,null,500,"",0]
[null,200,null,0,null,null,null,null,200,"",0]
[null,100,null,0,null,null,null,null,100,"",0]
[null,50,null,0,null,null,null,null,50,"",0]
[null,20,null,0,null,null,null,null,20,"",0]
[null,10,1,10,null,null,null,null,10,1,10]
[null,5,1,5,null,null,null,null,5,1,5]
[null,1,null,0,null,null,null,null,1,"",0]
[null,"TOTAL",{"$f":"SUM(C16:C27)","v":2},{"$f":"SUM(D16:D27)","v":15},null,null,null,null,"TOTAL",{"$f":"IF(C28=\"\",\"\",C28)","v":2},{"$f":"IF(D28=\"\",\"\",D28)","v":15}]
[null,"Net à Payer",{"$f":"IF(D11=\"CFAO\",D28,IF(D11=\"DOLLARS\",(((D22+D23)*E12)+((D24+D25+D26+D27)*B12)),IF(D11=\"EURO\",(((D20+D21+D22+D23)*E12)+((D24+D25+D26)*B12)),IF(D11=\"LIVRES STERLING\",((D23*E12)+((D24+D25+D26)*B12)),\"\"))))","v":7500},null,null,null,null,null,"Net à Payer",{"$f":"IF(C29=\"\",\"\",C29)","v":7500}]
[]
["Caissier(ère)",null,null,null,{"$f":"IF(D5=\"\",\"\",D5)","v":"loemba ndelo"},null,null,"Caissier(ère)",null,null,null,{"$f":"IF(E31=\"\",\"\",E31)","v":"loemba ndelo"}]

{"sheet":"Reçu Vente","index":3,"n_rows":31,"n_cols":13,"rows_kept":31,"cut":false,"hidden":false,"merged":[[3,0,3,5],[3,7,3,12],[4,0,4,2],[4,3,4,5],[4,7,4,9],[4,10,4,12],[5,0,5,2],[5,3,5,5],[5,7,5,9],[5,10,5,12],[6,0,6,2],[6,3,6,5],[6,7,6,9],[6,10,6,12],[7,0,7,2],[7,3,7,5],[7,7,7,9],[7,10,7,12],[8,0,8,2],[8,3,8,4],[8,7,8,9],[8,10,8,11],[9,0,9,2],[9,3,9,4],[9,7,9,9],[9,10,9,11],[10,0,10,2],[10,3,10,4],[10,7,10,9],[10,10,10,11],[30,4,30,5],[30,11,30,12],[28,2,28,3],[28,9,28,10],[11,3,11,5],[11,7,11,9],[11,10,11,12]]}
["BORDEREAU DE VENTE N°",null,1,null,null,null,null,"BORDEREAU DE VENTE N°",null,{"$f":"IF(C1=\"\",\"\",C1)","v":1}]
["Agence:","Lmumba",null,"            Pointe-Noire le",null,"2015-09-05",null,"Agence:","Lmumba",null,"            Pointe-Noire le",null,{"$f":"IF(F2=\"\",\"\",F2)","v":"2015-09-05"}]
[]
["INFORMATIONS DU CLIENT",null,null,null,null,null,null,"INFORMATIONS DU CLIENT"]
["NOM (S) :",null,null,"senou",null,null,null,"NOM (S) :",null,null,{"$f":"IF(D5=\"\",\"\",D5)","v":"senou"}]
[" PRENOM (S):",null,null,"gladness",null,null,null," PRENOM (S):",null,null,{"$f":"IF(D6=\"\",\"\",D6)","v":"gladness"}]
["ADRESSE et TELEPHONE:",null,null,"ekpe gare / 04 440 16 13",null,null,null,"ADRESSE et TELEPHONE:",null,null,{"$f":"IF(D7=\"\",\"\",D7)","v":"ekpe gare / 04 440 16 13"}]
["N° PASSEPORT:",null,null,"AO3421",null,null,null,"N° PASSEPORT:",null,null,{"$f":"IF(D8=\"\",\"\",D8)","v":"AO3421"}]
["Provenance des devises:",null,null,"CANADA",null,null,null,"Provenance des devises:",null,null,{"$f":"IF(D9=\"\",\"\",D9)","v":"CANADA"}]
["Motif:",null,null,"ETUDE",null,null,null,"Motif:",null,null,{"$f":"IF(D10=\"\",\"\",D10)","v":"ETUDE"}]
["Devise:",null,null,"DOLLARS",null,null,null,"Devise:",null,null,"DOLLARS"]
["Taux moyen de vente",null,null,695,null,null,null,"Taux moyen de vente",null,null,{"$f":"IF(D12=\"\",\"\",D12)","v":695}]
[]
[null,"BILLETAGE",null,null,null,null,null,null,"BILLETAGE"]
[null,"Coupures","Quantité","Valeur",null,null,null,null,"Coupures","Quantité","Valeur"]
[null,10000,null,{"$f":"C16*B16","v":0},null,null,null,null,10000,{"$f":"IF(C16=\"\",\"\",C16)","v":""},{"$f":"IF(D16=\"\",\"\",D16)","v":0}]
[null,5000,null,{"$f":"C17*B17","v":0},null,null,null,null,5000,{"$f":"IF(C17=\"\",\"\",C17)","v":""},{"$f":"IF(D17=\"\",\"\",D17)","v":0}]
[null,2000,null,{"$f":"C18*B18","v":0},null,null,null,null,2000,{"$f":"IF(C18=\"\",\"\",C18)","v":""},{"$f":"IF(D18=\"\",\"\",D18)","v":0}]
[null,1000,null,0,null,null,null,null,1000,"",0]
[null,500,null,0,null,null,null,null,500,"",0]
[null,200,null,0,null,null,null,null,200,"",0]
[null,100,5,500,null,null,null,null,100,5,500]
[null,50,null,0,null,null,null,null,50,"",0]
[null,20,null,0,null,null,null,null,20,"",0]
[null,10,null,0,null,null,null,null,10,"",0]
[null,5,null,0,null,null,null,null,5,"",0]
[null,1,null,0,null,null,null,null,1,"",0]
[null,"TOTAL",{"$f":"SUM(C16:C27)","v":5},{"$f":"SUM(D16:D27)","v":500},null,null,null,null,"TOTAL",{"$f":"IF(C28=\"\",\"\",C28)","v":5},{"$f":"IF(D28=\"\",\"\",D28)","v":500}]
[null,"Net à Payer",{"$f":"D28*D12","v":347500},null,null,null,null,null,"Net à Payer",{"$f":"IF(C29=\"\",\"\",C29)","v":347500}]
[]
["Caissier(ère)",null,null,null,{"$f":"IF(D5=\"\",\"\",D5)","v":"senou"},null,null,"Caissier(ère)",null,null,null,{"$f":"IF(E31=\"\",\"\",E31)","v":"senou"}]

{"sheet":"Statistique","index":4,"n_rows":23,"n_cols":9,"rows_kept":23,"cut":false,"hidden":false,"merged":[[14,3,14,4],[14,5,14,6]]}
[]
[]
[]
[null,null,null,"STATISTIQUE DES OPERATIONS DE CHANGE"]
[]
[null,null,null,null,null,null,null,"Pointe-Noire, le","2015-09-09"]
["Agence","Lumumba"]
[]
[]
["DEVISE","OUVERTURE","APPRO","VALEUR ACHAT","Montant ACHAT","VALEUR VENTE","Montant VENTE","RAPATRIE","CLOTURE"]
["CFAO",136500,null,null,null,null,null,null,{"$f":"(B11+C11+D11)-(F11+H11)","v":136500}]
["DOLLARS",36489,null,null,null,null,null,null,{"$f":"(B12+C12+D12)-(F12+H12)","v":36489}]
["EURO",450,null,null,null,null,null,null,450]
["Livre Sterling",560,null,null,null,null,null,null,560]
["XAF",1166469,null,{"$f":"E14+E13+E12+E11","v":0},null,{"$f":"G14+G13+G12+G11","v":0},null,null,{"$f":"(B15+C15+F15)-(D15+H15)","v":1166469}]
[]
[null,"Chef d'agence",null,null,null,null,null,"Caissier(ère)"]
[]
[]
[]
[]
[]
["PROVENANCE DE L'APPROVISIONNEMENT",null,null,null,null,"MOTIF DE RAPATRIEMENT"]

{"sheet":"Liste Pays","index":5,"n_rows":196,"n_cols":1,"rows_kept":196,"cut":false,"hidden":false,"merged":[]}
["AFGHANISTAN"]
["AFRIQUE DU SUD"]
["ALBANIE"]
["ALGÉRIE"]
["ALLEMAGNE"]
["ANGOLA"]
["ANGUILLA"]
["ARABIE SAOUDITE"]
["ARGENTINE"]
["ARMÉNIE"]
["AUSTRALIE"]
["AUTRICHE"]
["AZERBAÏDJAN"]
["BAHAMAS"]
["BANGLADESH"]
["BARBADE"]
["BÉLARUS"]
["BELGIQUE"]
["BELIZE"]
["BÉNIN"]
["BERMUDES"]
["BOLIVIE, ÉTAT PLURINATIONAL"]
["BOSNIE-HERZÉGOVINE"]
["BOTSWANA"]
["BRÉSIL"]
["BRUNÉI DARUSSALAM"]
["BULGARIE"]
["BURKINA FASO"]
["BURUNDI"]
["CAÏMANES, ÎLES"]
["CAMBODGE"]
["CAMEROUN"]
["CANADA"]
["CAP-VERT"]
["CENTRAFRICAINE, RÉPUBLIQUE"]
["CHILI"]
["CHINE"]
["CHYPRE"]
["COLOMBIE"]
["COMORES"]
["CONGO"]
["CONGO, RÉPUBLIQUE DÉMOCRATIQUE DU"]
["CORÉE, RÉPUBLIQUE DE"]
["CORÉE, RÉPUBLIQUE POPULAIRE DÉMOCRATIQUE DE"]
["COSTA RICA"]
["CÔTE D’IVOIRE"]
["CROATIE"]
["CUBA"]
["DANEMARK"]
["DJIBOUTI"]
["DOMINICAINE, RÉPUBLIQUE"]
["DOMINIQUE"]
["ÉGYPTE"]
["EL SALVADOR"]
["ÉMIRATS ARABES UNIS"]
["ÉQUATEUR"]
["ÉRYTHRÉE"]
["ESPAGNE"]
["ESTONIE"]
["ÉTATS-UNIS"]
["ÉTHIOPIE"]
["FIDJI"]
["FINLANDE"]
["FRANCE"]
["GABON"]
["GAMBIE"]
["GÉORGIE"]
["GHANA"]
["GIBRALTAR"]
["GRÈCE"]
["GRENADE"]
["GROENLAND"]
["GUADELOUPE"]
["GUAM"]
["GUATEMALA"]
["GUINÉE"]
["GUINÉE-BISSAU"]
["GUINÉE ÉQUATORIALE"]
["GUYANA"]
["GUYANE FRANÇAISE"]
["HAÏTI"]
["HONDURAS"]
["HONG KONG"]
["HONGRIE"]
["INDE"]
["INDONÉSIE"]
["IRAN, RÉPUBLIQUE ISLAMIQUE D'"]
["IRAQ"]
["IRLANDE"]
["ISLANDE"]
["ISRAËL"]
["ITALIE"]
["JAMAÏQUE"]
["JAPON"]
["JERSEY"]
["JORDANIE"]
["KAZAKHSTAN"]
["KENYA"]
["KIRGHIZISTAN"]
["KIRIBATI"]
["KOWEÏT"]
["LAO, RÉPUBLIQUE DÉMOCRATIQUE POPULAIRE"]
["LESOTHO"]
["LETTONIE"]
["LIBAN"]
["LIBÉRIA"]
["LIBYE"]
["LITUANIE"]
["LUXEMBOURG"]
["MACAO"]
["MACÉDOINE, L'EX-RÉPUBLIQUE YOUGOSLAVE DE"]
["MADAGASCAR"]
["MALAISIE"]
["MALAWI"]
["MALDIVES"]
["MALI"]
["MALTE"]
["MAROC"]
["MARTINIQUE"]
["MAURICE"]
["MAURITANIE"]
["MAYOTTE"]
["MEXIQUE"]
["MICRONÉSIE, ÉTATS FÉDÉRÉS DE"]
["MOLDOVA"]
["MONACO"]
["MONGOLIE"]
["MONTÉNÉGRO"]
["MONTSERRAT"]
["MOZAMBIQUE"]
["MYANMAR"]
["NAMIBIE"]
["NAURU"]
["NÉPAL"]
["NICARAGUA"]
["NIGER"]
["NIGÉRIA"]
["NORVÈGE"]
["NOUVELLE-CALÉDONIE"]
["NOUVELLE-ZÉLANDE"]
["OMAN"]
["OUGANDA"]
["OUZBÉKISTAN"]
["PAKISTAN"]
["PALAOS"]
["PANAMA"]
["PAPOUASIE-NOUVELLE-GUINÉE"]
["PARAGUAY"]
["PAYS-BAS"]
["PÉROU"]
["PHILIPPINES"]
["POLOGNE"]
["POLYNÉSIE FRANÇAISE"]
["PORTO RICO"]
["PORTUGAL"]
["QATAR"]
["RÉUNION"]
["ROUMANIE"]
["ROYAUME-UNI"]
["RUSSIE, FÉDÉRATION DE"]
["RWANDA"]
["SAINT-BARTHÉLEMY"]
["SAO TOMÉ-ET-PRINCIPE"]
["SÉNÉGAL"]
["SERBIE"]
["SEYCHELLES"]
["SIERRA LEONE"]
["SINGAPOUR"]
["SLOVAQUIE"]
["SLOVÉNIE"]
["SOMALIE"]
["SOUDAN"]
["SOUDAN DU SUD"]
["SUÈDE"]
["SUISSE"]
["SWAZILAND"]
["SYRIENNE, RÉPUBLIQUE ARABE"]
["TADJIKISTAN"]
["TAÏWAN, PROVINCE DE CHINE"]
["TANZANIE, RÉPUBLIQUE UNIE DE"]
["TCHAD"]
["TCHÈQUE, RÉPUBLIQUE"]
["THAÏLANDE"]
["TOGO"]
["TRINITÉ-ET-TOBAGO"]
["TUNISIE"]
["TURKMÉNISTAN"]
["TURQUIE"]
["TUVALU"]
["UKRAINE"]
["URUGUAY"]
["VENEZUELA, RÉPUBLIQUE BOLIVARIENNE DU"]
["VIET NAM"]
["YÉMEN"]
["ZAMBIE"]
["ZIMBABWE"]