{"text_format":"1","workbook":"xlsx","n_sheets":2,"sheets":["BdD","EDIT"],"not_rendered":{"charts":0,"images":0,"macros":0,"external_links":0,"defined_names":0,"comments":0,"pivot_tables":0},"unopened":[],"bounds":{"document_bytes":16777216,"sheet_cells":100000,"rows_first":2000,"rows_last":500,"rows_between":2000,"halvings":0,"cell_chars":16384,"cell_head_chars":4096},"cells_cut":0,"cells_raw":0,"read":"whole","date_system":"1900"}

{"sheet":"BdD","index":0,"n_rows":27,"n_cols":8,"rows_kept":27,"cut":false,"hidden":false,"merged":[]}
[null,null,"Info_1","Info_2","Info_3","Info_4",null,"code"]
["Marcel",0,"E","Méléze","Marcello","Brunois",null,{"$f":"IF(B2>0,MAX($H$1:H1)+1,\"\")","v":""}]
["André",0,"C","Sapin","Xitana","Lyon",null,{"$f":"IF(B3>0,MAX($H$1:H2)+1,\"\")","v":""}]
["Marcel",12,"S","Cocotier","Galibot","Strasbourg",null,{"$f":"IF(B4>0,MAX($H$1:H3)+1,\"\")","v":1}]
["Renè",0,"B","Bouleau","Durand","Marseille",null,{"$f":"IF(B5>0,MAX($H$1:H4)+1,\"\")","v":""}]
["Renè",9,"P","Erable","Carline","Bourg-en -Bresse",null,{"$f":"IF(B6>0,MAX($H$1:H5)+1,\"\")","v":2}]
["Corinne",15,"V","Mimosa","Latour","Belfort",null,{"$f":"IF(B7>0,MAX($H$1:H6)+1,\"\")","v":3}]
["André",6,"M","Peuplier","Romara","Toulouse",null,{"$f":"IF(B8>0,MAX($H$1:H7)+1,\"\")","v":4}]
["Léa",4,"K","Pruniers","Banaci","Nantes",null,{"$f":"IF(B9>0,MAX($H$1:H8)+1,\"\")","v":5}]
["Patrick",13,"T","Buis","Hizarde","Colmar",null,{"$f":"IF(B10>0,MAX($H$1:H9)+1,\"\")","v":6}]
["Paul",8,"O","Olivier","Humbert","Pau",null,{"$f":"IF(B11>0,MAX($H$1:H10)+1,\"\")","v":7}]
["Corinne",1,"H","Orne","Morel","Vierzon",null,{"$f":"IF(B12>0,MAX($H$1:H11)+1,\"\")","v":8}]
["Léa",18,"Y","Charme","Oralando","Metz",null,{"$f":"IF(B13>0,MAX($H$1:H12)+1,\"\")","v":9}]
["Lucas",5,"L","Frêne","Blanquet","Montpellier",null,{"$f":"IF(B14>0,MAX($H$1:H13)+1,\"\")","v":10}]
["Paul",0,"A","Chêne","Martin","Paris",null,{"$f":"IF(B15>0,MAX($H$1:H14)+1,\"\")","v":""}]
["Chrystel",16,"W","Poirier","Matone","Nacy",null,{"$f":"IF(B16>0,MAX($H$1:H15)+1,\"\")","v":11}]
["Patrick",0,"F","Pin","Teilhol","Toul",null,{"$f":"IF(B17>0,MAX($H$1:H16)+1,\"\")","v":""}]
["Anne-Marie",7,"N","Châtaignier","Uberto","Perpignan",null,{"$f":"IF(B18>0,MAX($H$1:H17)+1,\"\")","v":12}]
["Lucas",19,"Z","Saule","Questimbert","Calais",null,{"$f":"IF(B19>0,MAX($H$1:H18)+1,\"\")","v":13}]
["Ewan",11,"R","Palmier","Fontanelle","Bellegarde",null,{"$f":"IF(B20>0,MAX($H$1:H19)+1,\"\")","v":14}]
["Eric",14,"U","Houx","Journey","Mulhouse",null,{"$f":"IF(B21>0,MAX($H$1:H20)+1,\"\")","v":15}]
["André",10,"Q","Séquoia","Esmerh","Gex",null,{"$f":"IF(B22>0,MAX($H$1:H21)+1,\"\")","v":16}]
["Eric",0,"G","Orme","Platère","Vezoul",null,{"$f":"IF(B23>0,MAX($H$1:H22)+1,\"\")","v":""}]
["Monique",17,"X","Abricotier","Nouche","Dijon",null,{"$f":"IF(B24>0,MAX($H$1:H23)+1,\"\")","v":17}]
["Monique",3,"J","Pommiers","Kourta","Brest",null,{"$f":"IF(B25>0,MAX($H$1:H24)+1,\"\")","v":18}]
["Chrystel",2,"I","Acacuia","Paquite","Limoges",null,{"$f":"IF(B26>0,MAX($H$1:H25)+1,\"\")","v":19}]
["Ewan",0,"D","Epicea","Abrani","Birdeaux",null,{"$f":"IF(B27>0,MAX($H$1:H26)+1,\"\")","v":""}]

{"sheet":"EDIT","index":1,"n_rows":26,"n_cols":6,"rows_kept":26,"cut":false,"hidden":false,"merged":[]}
[null,"Valeur","Info_1","Info_2","Info_3","Info_4"]
[{"$f":"IFERROR(INDEX(BdD!$A:$G,MATCH(ROW($A1),BdD!$H:$H,0),1),\"\")","v":"Marcel"},{"$f":"IFERROR(INDEX(BdD!$A:$G,MATCH(ROW($A1),BdD!$H:$H,0),2),\"\")","v":12},{"$f":"IFERROR(INDEX(BdD!$A:$G,MATCH(ROW($A1),BdD!$H:$H,0),3),\"\")","v":"S"},{"$f":"IFERROR(INDEX(BdD!$A:$G,MATCH(ROW($A1),BdD!$H:$H,0),4),\"\")","v":"Cocotier"},{"$f":"IFERROR(INDEX(BdD!$A:$G,MATCH(ROW($A1),BdD!$H:$H,0),5),\"\")","v":"Galibot"},{"$f":"IFERROR(INDEX(BdD!$A:$G,MATCH(ROW($A1),BdD!$H:$H,0),6),\"\")","v":"Strasbourg"}]
[{"$f":"IFERROR(INDEX(BdD!$A:$G,MATCH(ROW($A2),BdD!$H:$H,0),1),\"\")","v":"Renè"},{"$f":"IFERROR(INDEX(BdD!$A:$G,MATCH(ROW($A2),BdD!$H:$H,0),2),\"\")","v":9},{"$f":"IFERROR(INDEX(BdD!$A:$G,MATCH(ROW($A2),BdD!$H:$H,0),3),\"\")","v":"P"},{"$f":"IFERROR(INDEX(BdD!$A:$G,MATCH(ROW($A2),BdD!$H:$H,0),4),\"\")","v":"Erable"},{"$f":"IFERROR(INDEX(BdD!$A:$G,MATCH(ROW($A2),BdD!$H:$H,0),5),\"\")","v":"Carline"},{"$f":"IFERROR(INDEX(BdD!$A:$G,MATCH(ROW($A2),BdD!$H:$H,0),6),\"\")","v":"Bourg-en -Bresse"}]
[{"$f":"IFERROR(INDEX(BdD!$A:$G,MATCH(ROW($A3),BdD!$H:$H,0),1),\"\")","v":"Corinne"},{"$f":"IFERROR(INDEX(BdD!$A:$G,MATCH(ROW($A3),BdD!$H:$H,0),2),\"\")","v":15},{"$f":"IFERROR(INDEX(BdD!$A:$G,MATCH(ROW($A3),BdD!$H:$H,0),3),\"\")","v":"V"},{"$f":"IFERROR(INDEX(BdD!$A:$G,MATCH(ROW($A3),BdD!$H:$H,0),4),\"\")","v":"Mimosa"},{"$f":"IFERROR(INDEX(BdD!$A:$G,MATCH(ROW($A3),BdD!$H:$H,0),5),\"\")","v":"Latour"},{"$f":"IFERROR(INDEX(BdD!$A:$G,MATCH(ROW($A3),BdD!$H:$H,0),6),\"\")","v":"Belfort"}]
[{"$f":"IFERROR(INDEX(BdD!$A:$G,MATCH(ROW($A4),BdD!$H:$H,0),1),\"\")","v":"André"},{"$f":"IFERROR(INDEX(BdD!$A:$G,MATCH(ROW($A4),BdD!$H:$H,0),2),\"\")","v":6},{"$f":"IFERROR(INDEX(BdD!$A:$G,MATCH(ROW($A4),BdD!$H:$H,0),3),\"\")","v":"M"},{"$f":"IFERROR(INDEX(BdD!$A:$G,MATCH(ROW($A4),BdD!$H:$H,0),4),\"\")","v":"Peuplier"},{"$f":"IFERROR(INDEX(BdD!$A:$G,MATCH(ROW($A4),BdD!$H:$H,0),5),\"\")","v":"Romara"},{"$f":"IFERROR(INDEX(BdD!$A:$G,MATCH(ROW($A4),BdD!$H:$H,0),6),\"\")","v":"Toulouse"}]
[{"$f":"IFERROR(INDEX(BdD!$A:$G,MATCH(ROW($A5),BdD!$H:$H,0),1),\"\")","v":"Léa"},{"$f":"IFERROR(INDEX(BdD!$A:$G,MATCH(ROW($A5),BdD!$H:$H,0),2),\"\")","v":4},{"$f":"IFERROR(INDEX(BdD!$A:$G,MATCH(ROW($A5),BdD!$H:$H,0),3),\"\")","v":"K"},{"$f":"IFERROR(INDEX(BdD!$A:$G,MATCH(ROW($A5),BdD!$H:$H,0),4),\"\")","v":"Pruniers"},{"$f":"IFERROR(INDEX(BdD!$A:$G,MATCH(ROW($A5),BdD!$H:$H,0),5),\"\")","v":"Banaci"},{"$f":"IFERROR(INDEX(BdD!$A:$G,MATCH(ROW($A5),BdD!$H:$H,0),6),\"\")","v":"Nantes"}]
[{"$f":"IFERROR(INDEX(BdD!$A:$G,MATCH(ROW($A6),BdD!$H:$H,0),1),\"\")","v":"Patrick"},{"$f":"IFERROR(INDEX(BdD!$A:$G,MATCH(ROW($A6),BdD!$H:$H,0),2),\"\")","v":13},{"$f":"IFERROR(INDEX(BdD!$A:$G,MATCH(ROW($A6),BdD!$H:$H,0),3),\"\")","v":"T"},{"$f":"IFERROR(INDEX(BdD!$A:$G,MATCH(ROW($A6),BdD!$H:$H,0),4),\"\")","v":"Buis"},{"$f":"IFERROR(INDEX(BdD!$A:$G,MATCH(ROW($A6),BdD!$H:$H,0),5),\"\")","v":"Hizarde"},{"$f":"IFERROR(INDEX(BdD!$A:$G,MATCH(ROW($A6),BdD!$H:$H,0),6),\"\")","v":"Colmar"}]
[{"$f":"IFERROR(INDEX(BdD!$A:$G,MATCH(ROW($A7),BdD!$H:$H,0),1),\"\")","v":"Paul"},{"$f":"IFERROR(INDEX(BdD!$A:$G,MATCH(ROW($A7),BdD!$H:$H,0),2),\"\")","v":8},{"$f":"IFERROR(INDEX(BdD!$A:$G,MATCH(ROW($A7),BdD!$H:$H,0),3),\"\")","v":"O"},{"$f":"IFERROR(INDEX(BdD!$A:$G,MATCH(ROW($A7),BdD!$H:$H,0),4),\"\")","v":"Olivier"},{"$f":"IFERROR(INDEX(BdD!$A:$G,MATCH(ROW($A7),BdD!$H:$H,0),5),\"\")","v":"Humbert"},{"$f":"IFERROR(INDEX(BdD!$A:$G,MATCH(ROW($A7),BdD!$H:$H,0),6),\"\")","v":"Pau"}]
[{"$f":"IFERROR(INDEX(BdD!$A:$G,MATCH(ROW($A8),BdD!$H:$H,0),1),\"\")","v":"Corinne"},{"$f":"IFERROR(INDEX(BdD!$A:$G,MATCH(ROW($A8),BdD!$H:$H,0),2),\"\")","v":1},{"$f":"IFERROR(INDEX(BdD!$A:$G,MATCH(ROW($A8),BdD!$H:$H,0),3),\"\")","v":"H"},{"$f":"IFERROR(INDEX(BdD!$A:$G,MATCH(ROW($A8),BdD!$H:$H,0),4),\"\")","v":"Orne"},{"$f":"IFERROR(INDEX(BdD!$A:$G,MATCH(ROW($A8),BdD!$H:$H,0),5),\"\")","v":"Morel"},{"$f":"IFERROR(INDEX(BdD!$A:$G,MATCH(ROW($A8),BdD!$H:$H,0),6),\"\")","v":"Vierzon"}]
[{"$f":"IFERROR(INDEX(BdD!$A:$G,MATCH(ROW($A9),BdD!$H:$H,0),1),\"\")","v":"Léa"},{"$f":"IFERROR(INDEX(BdD!$A:$G,MATCH(ROW($A9),BdD!$H:$H,0),2),\"\")","v":18},{"$f":"IFERROR(INDEX(BdD!$A:$G,MATCH(ROW($A9),BdD!$H:$H,0),3),\"\")","v":"Y"},{"$f":"IFERROR(INDEX(BdD!$A:$G,MATCH(ROW($A9),BdD!$H:$H,0),4),\"\")","v":"Charme"},{"$f":"IFERROR(INDEX(BdD!$A:$G,MATCH(ROW($A9),BdD!$H:$H,0),5),\"\")","v":"Oralando"},{"$f":"IFERROR(INDEX(BdD!$A:$G,MATCH(ROW($A9),BdD!$H:$H,0),6),\"\")","v":"Metz"}]
[{"$f":"IFERROR(INDEX(BdD!$A:$G,MATCH(ROW($A10),BdD!$H:$H,0),1),\"\")","v":"Lucas"},{"$f":"IFERROR(INDEX(BdD!$A:$G,MATCH(ROW($A10),BdD!$H:$H,0),2),\"\")","v":5},{"$f":"IFERROR(INDEX(BdD!$A:$G,MATCH(ROW($A10),BdD!$H:$H,0),3),\"\")","v":"L"},{"$f":"IFERROR(INDEX(BdD!$A:$G,MATCH(ROW($A10),BdD!$H:$H,0),4),\"\")","v":"Frêne"},{"$f":"IFERROR(INDEX(BdD!$A:$G,MATCH(ROW($A10),BdD!$H:$H,0),5),\"\")","v":"Blanquet"},{"$f":"IFERROR(INDEX(BdD!$A:$G,MATCH(ROW($A10),BdD!$H:$H,0),6),\"\")","v":"Montpellier"}]
[{"$f":"IFERROR(INDEX(BdD!$A:$G,MATCH(ROW($A11),BdD!$H:$H,0),1),\"\")","v":"Chrystel"},{"$f":"IFERROR(INDEX(BdD!$A:$G,MATCH(ROW($A11),BdD!$H:$H,0),2),\"\")","v":16},{"$f":"IFERROR(INDEX(BdD!$A:$G,MATCH(ROW($A11),BdD!$H:$H,0),3),\"\")","v":"W"},{"$f":"IFERROR(INDEX(BdD!$A:$G,MATCH(ROW($A11),BdD!$H:$H,0),4),\"\")","v":"Poirier"},{"$f":"IFERROR(INDEX(BdD!$A:$G,MATCH(ROW($A11),BdD!$H:$H,0),5),\"\")","v":"Matone"},{"$f":"IFERROR(INDEX(BdD!$A:$G,MATCH(ROW($A11),BdD!$H:$H,0),6),\"\")","v":"Nacy"}]
[{"$f":"IFERROR(INDEX(BdD!$A:$G,MATCH(ROW($A12),BdD!$H:$H,0),1),\"\")","v":"Anne-Marie"},{"$f":"IFERROR(INDEX(BdD!$A:$G,MATCH(ROW($A12),BdD!$H:$H,0),2),\"\")","v":7},{"$f":"IFERROR(INDEX(BdD!$A:$G,MATCH(ROW($A12),BdD!$H:$H,0),3),\"\")","v":"N"},{"$f":"IFERROR(INDEX(BdD!$A:$G,MATCH(ROW($A12),BdD!$H:$H,0),4),\"\")","v":"Châtaignier"},{"$f":"IFERROR(INDEX(BdD!$A:$G,MATCH(ROW($A12),BdD!$H:$H,0),5),\"\")","v":"Uberto"},{"$f":"IFERROR(INDEX(BdD!$A:$G,MATCH(ROW($A12),BdD!$H:$H,0),6),\"\")","v":"Perpignan"}]
[{"$f":"IFERROR(INDEX(BdD!$A:$G,MATCH(ROW($A13),BdD!$H:$H,0),1),\"\")","v":"Lucas"},{"$f":"IFERROR(INDEX(BdD!$A:$G,MATCH(ROW($A13),BdD!$H:$H,0),2),\"\")","v":19},{"$f":"IFERROR(INDEX(BdD!$A:$G,MATCH(ROW($A13),BdD!$H:$H,0),3),\"\")","v":"Z"},{"$f":"IFERROR(INDEX(BdD!$A:$G,MATCH(ROW($A13),BdD!$H:$H,0),4),\"\")","v":"Saule"},{"$f":"IFERROR(INDEX(BdD!$A:$G,MATCH(ROW($A13),BdD!$H:$H,0),5),\"\")","v":"Questimbert"},{"$f":"IFERROR(INDEX(BdD!$A:$G,MATCH(ROW($A13),BdD!$H:$H,0),6),\"\")","v":"Calais"}]
[{"$f":"IFERROR(INDEX(BdD!$A:$G,MATCH(ROW($A14),BdD!$H:$H,0),1),\"\")","v":"Ewan"},{"$f":"IFERROR(INDEX(BdD!$A:$G,MATCH(ROW($A14),BdD!$H:$H,0),2),\"\")","v":11},{"$f":"IFERROR(INDEX(BdD!$A:$G,MATCH(ROW($A14),BdD!$H:$H,0),3),\"\")","v":"R"},{"$f":"IFERROR(INDEX(BdD!$A:$G,MATCH(ROW($A14),BdD!$H:$H,0),4),\"\")","v":"Palmier"},{"$f":"IFERROR(INDEX(BdD!$A:$G,MATCH(ROW($A14),BdD!$H:$H,0),5),\"\")","v":"Fontanelle"},{"$f":"IFERROR(INDEX(BdD!$A:$G,MATCH(ROW($A14),BdD!$H:$H,0),6),\"\")","v":"Bellegarde"}]
[{"$f":"IFERROR(INDEX(BdD!$A:$G,MATCH(ROW($A15),BdD!$H:$H,0),1),\"\")","v":"Eric"},{"$f":"IFERROR(INDEX(BdD!$A:$G,MATCH(ROW($A15),BdD!$H:$H,0),2),\"\")","v":14},{"$f":"IFERROR(INDEX(BdD!$A:$G,MATCH(ROW($A15),BdD!$H:$H,0),3),\"\")","v":"U"},{"$f":"IFERROR(INDEX(BdD!$A:$G,MATCH(ROW($A15),BdD!$H:$H,0),4),\"\")","v":"Houx"},{"$f":"IFERROR(INDEX(BdD!$A:$G,MATCH(ROW($A15),BdD!$H:$H,0),5),\"\")","v":"Journey"},{"$f":"IFERROR(INDEX(BdD!$A:$G,MATCH(ROW($A15),BdD!$H:$H,0),6),\"\")","v":"Mulhouse"}]
[{"$f":"IFERROR(INDEX(BdD!$A:$G,MATCH(ROW($A16),BdD!$H:$H,0),1),\"\")","v":"André"},{"$f":"IFERROR(INDEX(BdD!$A:$G,MATCH(ROW($A16),BdD!$H:$H,0),2),\"\")","v":10},{"$f":"IFERROR(INDEX(BdD!$A:$G,MATCH(ROW($A16),BdD!$H:$H,0),3),\"\")","v":"Q"},{"$f":"IFERROR(INDEX(BdD!$A:$G,MATCH(ROW($A16),BdD!$H:$H,0),4),\"\")","v":"Séquoia"},{"$f":"IFERROR(INDEX(BdD!$A:$G,MATCH(ROW($A16),BdD!$H:$H,0),5),\"\")","v":"Esmerh"},{"$f":"IFERROR(INDEX(BdD!$A:$G,MATCH(ROW($A16),BdD!$H:$H,0),6),\"\")","v":"Gex"}]
[{"$f":"IFERROR(INDEX(BdD!$A:$G,MATCH(ROW($A17),BdD!$H:$H,0),1),\"\")","v":"Monique"},{"$f":"IFERROR(INDEX(BdD!$A:$G,MATCH(ROW($A17),BdD!$H:$H,0),2),\"\")","v":17},{"$f":"IFERROR(INDEX(BdD!$A:$G,MATCH(ROW($A17),BdD!$H:$H,0),3),\"\")","v":"X"},{"$f":"IFERROR(INDEX(BdD!$A:$G,MATCH(ROW($A17),BdD!$H:$H,0),4),\"\")","v":"Abricotier"},{"$f":"IFERROR(INDEX(BdD!$A:$G,MATCH(ROW($A17),BdD!$H:$H,0),5),\"\")","v":"Nouche"},{"$f":"IFERROR(INDEX(BdD!$A:$G,MATCH(ROW($A17),BdD!$H:$H,0),6),\"\")","v":"Dijon"}]
[{"$f":"IFERROR(INDEX(BdD!$A:$G,MATCH(ROW($A18),BdD!$H:$H,0),1),\"\")","v":"Monique"},{"$f":"IFERROR(INDEX(BdD!$A:$G,MATCH(ROW($A18),BdD!$H:$H,0),2),\"\")","v":3},{"$f":"IFERROR(INDEX(BdD!$A:$G,MATCH(ROW($A18),BdD!$H:$H,0),3),\"\")","v":"J"},{"$f":"IFERROR(INDEX(BdD!$A:$G,MATCH(ROW($A18),BdD!$H:$H,0),4),\"\")","v":"Pommiers"},{"$f":"IFERROR(INDEX(BdD!$A:$G,MATCH(ROW($A18),BdD!$H:$H,0),5),\"\")","v":"Kourta"},{"$f":"IFERROR(INDEX(BdD!$A:$G,MATCH(ROW($A18),BdD!$H:$H,0),6),\"\")","v":"Brest"}]
[{"$f":"IFERROR(INDEX(BdD!$A:$G,MATCH(ROW($A19),BdD!$H:$H,0),1),\"\")","v":"Chrystel"},{"$f":"IFERROR(INDEX(BdD!$A:$G,MATCH(ROW($A19),BdD!$H:$H,0),2),\"\")","v":2},{"$f":"IFERROR(INDEX(BdD!$A:$G,MATCH(ROW($A19),BdD!$H:$H,0),3),\"\")","v":"I"},{"$f":"IFERROR(INDEX(BdD!$A:$G,MATCH(ROW($A19),BdD!$H:$H,0),4),\"\")","v":"Acacuia"},{"$f":"IFERROR(INDEX(BdD!$A:$G,MATCH(ROW($A19),BdD!$H:$H,0),5),\"\")","v":"Paquite"},{"$f":"IFERROR(INDEX(BdD!$A:$G,MATCH(ROW($A19),BdD!$H:$H,0),6),\"\")","v":"Limoges"}]
[{"$f":"IFERROR(INDEX(BdD!$A:$G,MATCH(ROW($A20),BdD!$H:$H,0),1),\"\")","v":""},{"$f":"IFERROR(INDEX(BdD!$A:$G,MATCH(ROW($A20),BdD!$H:$H,0),2),\"\")","v":""},{"$f":"IFERROR(INDEX(BdD!$A:$G,MATCH(ROW($A20),BdD!$H:$H,0),3),\"\")","v":""},{"$f":"IFERROR(INDEX(BdD!$A:$G,MATCH(ROW($A20),BdD!$H:$H,0),4),\"\")","v":""},{"$f":"IFERROR(INDEX(BdD!$A:$G,MATCH(ROW($A20),BdD!$H:$H,0),5),\"\")","v":""},{"$f":"IFERROR(INDEX(BdD!$A:$G,MATCH(ROW($A20),BdD!$H:$H,0),6),\"\")","v":""}]
[{"$f":"IFERROR(INDEX(BdD!$A:$G,MATCH(ROW($A21),BdD!$H:$H,0),1),\"\")","v":""},{"$f":"IFERROR(INDEX(BdD!$A:$G,MATCH(ROW($A21),BdD!$H:$H,0),2),\"\")","v":""},{"$f":"IFERROR(INDEX(BdD!$A:$G,MATCH(ROW($A21),BdD!$H:$H,0),3),\"\")","v":""},{"$f":"IFERROR(INDEX(BdD!$A:$G,MATCH(ROW($A21),BdD!$H:$H,0),4),\"\")","v":""},{"$f":"IFERROR(INDEX(BdD!$A:$G,MATCH(ROW($A21),BdD!$H:$H,0),5),\"\")","v":""},{"$f":"IFERROR(INDEX(BdD!$A:$G,MATCH(ROW($A21),BdD!$H:$H,0),6),\"\")","v":""}]
[{"$f":"IFERROR(INDEX(BdD!$A:$G,MATCH(ROW($A22),BdD!$H:$H,0),1),\"\")","v":""},{"$f":"IFERROR(INDEX(BdD!$A:$G,MATCH(ROW($A22),BdD!$H:$H,0),2),\"\")","v":""},{"$f":"IFERROR(INDEX(BdD!$A:$G,MATCH(ROW($A22),BdD!$H:$H,0),3),\"\")","v":""},{"$f":"IFERROR(INDEX(BdD!$A:$G,MATCH(ROW($A22),BdD!$H:$H,0),4),\"\")","v":""},{"$f":"IFERROR(INDEX(BdD!$A:$G,MATCH(ROW($A22),BdD!$H:$H,0),5),\"\")","v":""},{"$f":"IFERROR(INDEX(BdD!$A:$G,MATCH(ROW($A22),BdD!$H:$H,0),6),\"\")","v":""}]
[{"$f":"IFERROR(INDEX(BdD!$A:$G,MATCH(ROW($A23),BdD!$H:$H,0),1),\"\")","v":""},{"$f":"IFERROR(INDEX(BdD!$A:$G,MATCH(ROW($A23),BdD!$H:$H,0),2),\"\")","v":""},{"$f":"IFERROR(INDEX(BdD!$A:$G,MATCH(ROW($A23),BdD!$H:$H,0),3),\"\")","v":""},{"$f":"IFERROR(INDEX(BdD!$A:$G,MATCH(ROW($A23),BdD!$H:$H,0),4),\"\")","v":""},{"$f":"IFERROR(INDEX(BdD!$A:$G,MATCH(ROW($A23),BdD!$H:$H,0),5),\"\")","v":""},{"$f":"IFERROR(INDEX(BdD!$A:$G,MATCH(ROW($A23),BdD!$H:$H,0),6),\"\")","v":""}]
[{"$f":"IFERROR(INDEX(BdD!$A:$G,MATCH(ROW($A24),BdD!$H:$H,0),1),\"\")","v":""},{"$f":"IFERROR(INDEX(BdD!$A:$G,MATCH(ROW($A24),BdD!$H:$H,0),2),\"\")","v":""},{"$f":"IFERROR(INDEX(BdD!$A:$G,MATCH(ROW($A24),BdD!$H:$H,0),3),\"\")","v":""},{"$f":"IFERROR(INDEX(BdD!$A:$G,MATCH(ROW($A24),BdD!$H:$H,0),4),\"\")","v":""},{"$f":"IFERROR(INDEX(BdD!$A:$G,MATCH(ROW($A24),BdD!$H:$H,0),5),\"\")","v":""},{"$f":"IFERROR(INDEX(BdD!$A:$G,MATCH(ROW($A24),BdD!$H:$H,0),6),\"\")","v":""}]
[{"$f":"IFERROR(INDEX(BdD!$A:$G,MATCH(ROW($A25),BdD!$H:$H,0),1),\"\")","v":""},{"$f":"IFERROR(INDEX(BdD!$A:$G,MATCH(ROW($A25),BdD!$H:$H,0),2),\"\")","v":""},{"$f":"IFERROR(INDEX(BdD!$A:$G,MATCH(ROW($A25),BdD!$H:$H,0),3),\"\")","v":""},{"$f":"IFERROR(INDEX(BdD!$A:$G,MATCH(ROW($A25),BdD!$H:$H,0),4),\"\")","v":""},{"$f":"IFERROR(INDEX(BdD!$A:$G,MATCH(ROW($A25),BdD!$H:$H,0),5),\"\")","v":""},{"$f":"IFERROR(INDEX(BdD!$A:$G,MATCH(ROW($A25),BdD!$H:$H,0),6),\"\")","v":""}]