{"text_format":"1","workbook":"xlsx","n_sheets":16,"sheets":["Sommaire","OMT_77","OMT_91","OMT_94","Impression","Pages de garde","Feuilles de conf","Entretiens Valise","Devet","dossiers suspendu","ANNEXE_PS","Annexe_coffret","Annexe_3","Hors conduite","Fiche probleme","FP + HC"],"not_rendered":{"charts":0,"images":8,"macros":1,"external_links":0,"defined_names":7,"comments":0,"pivot_tables":0},"unopened":[],"bounds":{"document_bytes":16777216,"sheet_cells":100000,"rows_first":2000,"rows_last":500,"rows_between":2000,"halvings":0,"cell_chars":16384,"cell_head_chars":4096},"cells_cut":0,"cells_raw":0,"read":"whole","date_system":"1900"}

{"sheet":"Sommaire","index":0,"n_rows":26,"n_cols":19,"rows_kept":26,"cut":false,"hidden":false,"merged":[[28,17,40,22],[28,0,40,5],[23,6,40,16],[15,6,22,6],[15,16,22,16],[25,17,27,17],[25,18,27,22],[15,7,19,15],[20,7,22,15],[15,18,17,22],[15,17,17,17],[20,18,22,22],[20,17,22,17],[15,0,17,4],[20,0,22,4],[25,0,27,4],[0,0,9,23],[10,6,14,16],[13,0,14,5],[18,0,19,5],[23,0,24,5],[23,17,24,22],[18,17,19,22],[13,17,14,22],[10,17,12,17],[10,18,12,22],[10,0,12,4],[10,5,12,5],[15,5,17,5],[20,5,22,5],[25,5,27,5]]}
[]
[]
[]
[]
[]
[]
[]
[]
{"$rows_left_out":19}
{"sheet":"OMT_77","index":1,"n_rows":19,"n_cols":33,"rows_kept":19,"cut":false,"hidden":false,"merged":[[0,15,0,16],[9,9,9,10],[4,2,4,3],[8,5,8,7],[7,5,7,7],[6,5,6,7],[5,5,5,7]]}
[null,null,null,null,null,null,null,null,null,null,null,null,null,null,null,"ETAT VALISE VISION",null,"Voir tableau"]
[null,null,null,null,null,null,null,null,null,null,null,null,null,null,null,"Valise 1",{"$f":"'Entretiens Valise'!E4","v":"OK"}]
[null,null,null,null,null,null,null,null,null,null,null,null,null,null,null,"Valise 2",{"$f":"'Entretiens Valise'!E5","v":"OK"}]
[null,null,null,null,null,null,null,null,null,null,null,null,null,null,null,"Valise 3",{"$f":"'Entretiens Valise'!E6","v":"OK"}]
[null,"Nous sommes le : ","Raccourcis vers :"]
[null,{"$f":"TODAY()","v":"2015-08-31"},"Sommaire"]
[null,null,"Base Malten"]
[null,null,"Adresse Novexia"]
{"$rows_left_out":12}
{"sheet":"OMT_91","index":2,"n_rows":19,"n_cols":33,"rows_kept":19,"cut":false,"hidden":false,"merged":[[5,5,5,7],[0,15,0,16],[4,2,4,3],[9,9,9,10],[9,5,9,7],[8,5,8,7],[7,5,7,7],[6,5,6,7]]}
[null,null,null,null,null,null,null,null,null,null,null,null,null,null,null,"ETAT VALISE VISION",null,"Voir tableau"]
[null,null,null,null,null,null,null,null,null,null,null,null,null,null,null,"Valise 1",{"$f":"'Entretiens Valise'!E4","v":"OK"}]
[null,null,null,null,null,null,null,null,null,null,null,null,null,null,null,"Valise 2",{"$f":"'Entretiens Valise'!E5","v":"OK"}]
[null,null,null,null,null,null,null,null,null,null,null,null,null,null,null,"Valise 3",{"$f":"'Entretiens Valise'!E6","v":"OK"}]
[null,"Nous sommes le : ","Raccourcis vers :"]
[null,{"$f":"TODAY()","v":"2015-08-31"},"Sommaire"]
[null,null,"Base Malten"]
[null,null,"Adresse Novexia"]
{"$rows_left_out":12}
{"sheet":"OMT_94","index":3,"n_rows":20,"n_cols":33,"rows_kept":20,"cut":false,"hidden":false,"merged":[[5,5,5,7],[0,15,0,16],[4,2,4,3],[9,9,9,10],[9,5,9,7],[8,5,8,7],[7,5,7,7],[6,5,6,7]]}
[null,null,null,null,null,null,null,null,null,null,null,null,null,null,null,"ETAT VALISE VISION",null,"Voir tableau"]
[null,null,null,null,null,null,null,null,null,null,null,null,null,null,null,"Valise 1",{"$f":"'Entretiens Valise'!E4","v":"OK"}]
[null,null,null,null,null,null,null,null,null,null,null,null,null,null,null,"Valise 2",{"$f":"'Entretiens Valise'!E5","v":"OK"}]
[null,null,null,null,null,null,null,null,null,null,null,null,null,null,null,"Valise 3",{"$f":"'Entretiens Valise'!E6","v":"OK"}]
[null,"Nous sommes le : ","Raccourcis vers :"]
[null,{"$f":"TODAY()","v":"2015-08-31"},"Sommaire"]
[null,null,"Base Malten"]
[null,null,"Adresse Novexia"]
{"$rows_left_out":13}
{"sheet":"Impression","index":4,"n_rows":63,"n_cols":22,"rows_kept":63,"cut":false,"hidden":false,"merged":[[59,9,60,14],[59,15,60,15],[59,16,60,16],[61,9,61,14],[62,3,62,16],[57,7,58,7],[57,8,58,8],[58,0,60,0],[58,1,60,1],[59,2,60,2],[59,3,60,3],[59,4,60,4],[59,5,60,5],[59,8,60,8],[57,2,58,2],[57,3,58,3],[57,4,58,4],[57,5,58,5],[57,6,58,6],[52,9,53,14],[52,15,53,15],[52,16,53,16],[54,9,54,14],[55,3,55,16],[50,7,51,7],[50,8,51,8],[51,0,53,0],[51,1,53,1],[52,2,53,2],[52,3,53,3],[52,4,53,4],[52,5,53,5],[52,8,53,8],[50,2,51,2],[50,3,51,3],[50,4,51,4],[50,5,51,5],[50,6,51,6],[45,9,46,14],[45,15,46,15],[45,16,46,16],[47,9,47,14],[48,3,48,16],[43,7,44,7],[43,8,44,8],[44,0,46,0],[44,1,46,1],[45,2,46,2],[45,3,46,3],[45,4,46,4],[45,5,46,5],[45,8,46,8],[43,2,44,2],[43,3,44,3],[43,4,44,4],[43,5,44,5],[43,6,44,6],[38,9,39,14],[38,15,39,15],[38,16,39,16],[40,9,40,14],[41,3,41,16],[36,7,37,7],[36,8,37,8],[37,0,39,0],[37,1,39,1],[38,2,39,2],[38,3,39,3],[38,4,39,4],[38,5,39,5],[38,8,39,8],[36,2,37,2],[36,3,37,3],[36,4,37,4],[36,5,37,5],[36,6,37,6],[31,9,32,14],[31,15,32,15],[31,16,32,16],[33,9,33,14],[34,3,34,16],[29,7,30,7],[29,8,30,8],[30,0,32,0],[30,1,32,1],[31,2,32,2],[31,3,32,3],[31,4,32,4],[31,5,32,5],[31,8,32,8],[29,2,30,2],[29,3,30,3],[29,4,30,4],[29,5,30,5],[29,6,30,6],[24,9,25,14],[24,15,25,15],[24,16,25,16],[26,9,26,14],[27,3,27,16],[22,7,23,7],[22,8,23,8],[23,0,25,0],[23,1,25,1],[24,2,25,2],[24,3,25,3],[24,4,25,4],[24,5,25,5],[24,8,25,8],[22,2,23,2],[22,3,23,3],[22,4,23,4],[22,5,23,5],[22,6,23,6],[17,9,18,14],[17,15,18,15],[17,16,18,16],[19,9,19,14],[20,3,20,16],[15,7,16,7],[15,8,16,8],[16,0,18,0],[16,1,18,1],[17,2,18,2],[17,3,18,3],[17,4,18,4],[17,5,18,5],[17,8,18,8],[15,2,16,2],[15,3,16,3],[15,4,16,4],[15,5,16,5],[15,6,16,6],[10,9,11,14],[10,15,11,15],[10,16,11,16],[12,9,12,14],[13,3,13,16],[8,7,9,7],[8,8,9,8],[9,0,11,0],[9,1,11,1],[10,2,11,2],[10,3,11,3],[10,4,11,4],[10,5,11,5],[10,8,11,8],[8,2,9,2],[8,3,9,3],[8,4,9,4],[8,5,9,5],[8,6,9,6],[6,3,6,16],[2,0,4,0],[2,1,4,1],[3,2,4,2],[3,3,4,3],[3,4,4,4],[3,5,4,5],[1,2,2,2],[1,3,2,3],[1,4,2,4],[1,5,2,5],[1,6,2,6],[1,7,2,7],[1,8,2,8],[3,8,4,8],[3,9,4,14],[3,15,4,15],[3,16,4,16],[5,9,5,14]]}
[null,null,null,null,null,null,null,null,null,null,null,null,null,null,null,null,null,null,"Barre d'outil rapide"]
[null,null,"NOM",{"$f":"IF(A3=\"PC 91\", VLOOKUP(B3,OMT_91!$1:$1048576,2,0), IF(A3=\"PC 77\", VLOOKUP(B3,OMT_77!1:1048576,2,0), IF(A3=\"pc 94\", VLOOKUP(B3,OMT_94!1:1048576,2,0))))","v":false},"PS",{"$f":"IF(A3=\"PC 91\", VLOOKUP(B3,OMT_91!$1:$1048576,3,0), IF(A3=\"PC 77\", VLOOKUP(B3,OMT_77!1:1048576,3,0), IF(A3=\"pc 94\", VLOOKUP(B3,OMT_94!1:1048576,3,0))))","v":false},"DEPART",{"$f":"IF(A3=\"PC 91\", VLOOKUP(B3,OMT_91!$1:$1048576,4,0), IF(A3=\"PC 77\", VLOOKUP(B3,OMT_77!1:1048576,4,0), IF(A3=\"pc 94\", VLOOKUP(B3,OMT_94!1:1048576,4,0))))","v":false},"batterie",7,12,17,24,32,38,"MOIS",{"$f":"IF(A3=\"PC 91\", VLOOKUP(B3,OMT_91!$1:$1048576,17,0), IF(A3=\"PC 77\", VLOOKUP(B3,OMT_77!1:1048576,17,0), IF(A3=\"pc 94\", VLOOKUP(B3,OMT_94!1:1048576,17,0))))","v":false}]
[null,null,null,null,null,null,null,null,null,{"$f":"IF(A3=\"PC 91\", VLOOKUP(B3,OMT_91!$1:$1048576,10,0), IF(A3=\"PC 77\", VLOOKUP(B3,OMT_77!1:1048576,10,0), IF(A3=\"pc 94\", VLOOKUP(B3,OMT_94!1:1048576,10,0))))","v":false},{"$f":"IF(A3=\"PC 91\", VLOOKUP(B3,OMT_91!$1:$1048576,11,0), IF(A3=\"PC 77\", VLOOKUP(B3,OMT_77!1:1048576,11,0), IF(A3=\"pc 94\", VLOOKUP(B3,OMT_94!1:1048576,11,0))))","v":false},{"$f":"IF(A3=\"PC 91\", VLOOKUP(B3,OMT_91!$1:$1048576,12,0), IF(A3=\"PC 77\", VLOOKUP(B3,OMT_77!1:1048576,12,0), IF(A3=\"pc 94\", VLOOKUP(B3,OMT_94!1:1048576,12,0))))","v":false},{"$f":"IF(A3=\"PC 91\", VLOOKUP(B3,OMT_91!$1:$1048576,13,0), IF(A3=\"PC 77\", VLOOKUP(B3,OMT_77!1:1048576,13,0), IF(A3=\"pc 94\", VLOOKUP(B3,OMT_94!1:1048576,13,0))))","v":false},{"$f":"IF(A3=\"PC 91\", VLOOKUP(B3,OMT_91!$1:$1048576,14,0), IF(A3=\"PC 77\", VLOOKUP(B3,OMT_77!1:1048576,14,0), IF(A3=\"pc 94\", VLOOKUP(B3,OMT_94!1:1048576,14,0))))","v":false},{"$f":"IF(A3=\"PC 91\", VLOOKUP(B3,OMT_91!$1:$1048576,15,0), IF(A3=\"PC 77\", VLOOKUP(B3,OMT_77!1:1048576,15,0), IF(A3=\"pc 94\", VLOOKUP(B3,OMT_94!1:1048576,15,0))))","v":false},"ANNÉE",{"$f":"IF(A3=\"PC 91\", VLOOKUP(B3,OMT_91!$1:$1048576,16,0), IF(A3=\"PC 77\", VLOOKUP(B3,OMT_77!1:1048576,16,0), IF(A3=\"pc 94\", VLOOKUP(B3,OMT_94!1:1048576,16,0))))","v":false},null,null,null,null,"Sommaire"]
[null,null,"CELLULES",{"$f":"IF(A3=\"PC 91\", VLOOKUP(B3,OMT_91!$1:$1048576,18,0), IF(A3=\"PC 77\", VLOOKUP(B3,OMT_77!1:1048576,18,0), IF(A3=\"pc 94\", VLOOKUP(B3,OMT_94!1:1048576,18,0))))","v":false},"TEL",{"$f":"IF(A3=\"PC 91\", VLOOKUP(B3,OMT_91!$1:$1048576,21,0), IF(A3=\"PC 77\", VLOOKUP(B3,OMT_77!1:1048576,21,0), IF(A3=\"pc 94\", VLOOKUP(B3,OMT_94!1:1048576,21,0))))","v":false},"GPS N",{"$f":"IF(A3=\"PC 91\", VLOOKUP(B3,OMT_91!$1:$1048576,25,0), IF(A3=\"PC 77\", VLOOKUP(B3,OMT_77!1:1048576,25,0), IF(A3=\"pc 94\", VLOOKUP(B3,OMT_94!1:1048576,25,0))))","v":false},"VILLE",{"$f":"IF(A3=\"PC 91\", VLOOKUP(B3,OMT_91!$1:$1048576,22,0), IF(A3=\"PC 77\", VLOOKUP(B3,OMT_77!1:1048576,22,0), IF(A3=\"pc 94\", VLOOKUP(B3,OMT_94!1:1048576,22,0))))","v":false},null,null,null,null,null,"RUE",{"$f":"IF(A3=\"PC 91\", VLOOKUP(B3,OMT_91!$1:$1048576,24,0), IF(A3=\"PC 77\", VLOOKUP(B3,OMT_77!1:1048576,24,0), IF(A3=\"pc 94\", VLOOKUP(B3,OMT_94!1:1048576,24,0))))","v":false}]
[null,null,null,null,null,null,"GPS E",{"$f":"IF(A3=\"PC 91\", VLOOKUP(B3,OMT_91!$1:$1048576,26,0), IF(A3=\"PC 77\", VLOOKUP(B3,OMT_77!1:1048576,26,0), IF(A3=\"pc 94\", VLOOKUP(B3,OMT_94!1:1048576,26,0))))","v":false}]
[null,null,"NB VOIE",{"$f":"IF(A3=\"PC 91\", VLOOKUP(B3,OMT_91!$1:$1048576,20,0), IF(A3=\"PC 77\", VLOOKUP(B3,OMT_77!1:1048576,20,0), IF(A3=\"pc 94\", VLOOKUP(B3,OMT_94!1:1048576,20,0))))","v":false},"COFFRET",{"$f":"IF(A3=\"PC 91\", VLOOKUP(B3,OMT_91!$1:$1048576,9,0), IF(A3=\"PC 77\", VLOOKUP(B3,OMT_77!1:1048576,9,0), IF(A3=\"pc 94\", VLOOKUP(B3,OMT_94!1:1048576,9,0))))","v":false},"BAT.à 2",{"$f":"IF(A3=\"PC 91\", VLOOKUP(B3,OMT_91!$1:$1048576,29,0), IF(A3=\"PC 77\", VLOOKUP(B3,OMT_77!1:1048576,29,0), IF(A3=\"pc 94\", VLOOKUP(B3,OMT_94!1:1048576,29,0))))","v":false},"REGIME",{"$f":"IF(A3=\"PC 91\", VLOOKUP(B3,OMT_91!$1:$1048576,7,0), IF(A3=\"PC 77\", VLOOKUP(B3,OMT_77!1:1048576,7,0), IF(A3=\"pc 94\", VLOOKUP(B3,OMT_94!1:1048576,7,0))))","v":false},null,null,null,null,null,"AEE",{"$f":"IF(A3=\"PC 91\", VLOOKUP(B3,OMT_91!$1:$1048576,5,0), IF(A3=\"PC 77\", VLOOKUP(B3,OMT_77!1:1048576,5,0), IF(A3=\"pc 94\", VLOOKUP(B3,OMT_94!1:1048576,5,0))))","v":false}]
[null,null,"INFOS",{"$f":"IF(A3=\"PC 91\", VLOOKUP(B3,OMT_91!$1:$1048576,32,0), IF(A3=\"PC 77\", VLOOKUP(B3,OMT_77!1:1048576,32,0), IF(A3=\"pc 94\", VLOOKUP(B3,OMT_94!1:1048576,32,0))))","v":false}]
[]
{"$rows_left_out":56}
{"sheet":"Pages de garde","index":5,"n_rows":58,"n_cols":72,"rows_kept":58,"cut":false,"hidden":false,"merged":[[0,0,1,2],[0,3,1,5],[0,31,1,33],[0,28,1,30],[0,6,1,27],[3,0,3,2],[0,65,1,67],[0,68,1,70],[3,37,3,39],[3,40,3,50],[3,56,3,67],[3,68,3,70],[3,3,3,13],[4,3,4,13],[3,31,3,33],[4,31,4,33],[4,19,4,30],[3,19,3,30],[9,40,9,50],[12,37,12,39],[12,3,12,10],[12,11,12,13],[12,14,12,21],[12,22,12,24],[12,25,12,33],[12,48,12,50],[9,3,9,13],[6,3,6,13],[6,19,6,30],[6,31,6,33],[7,3,7,13],[7,19,7,30],[7,31,7,33],[4,68,4,70],[6,37,6,39],[6,40,6,50],[6,56,6,67],[6,68,6,70],[7,37,7,39],[7,40,7,50],[15,28,15,33],[16,0,16,2],[15,14,15,21],[15,22,15,27],[4,0,4,2],[9,0,9,2],[12,0,12,2],[6,0,6,2],[7,0,7,2],[17,0,17,2],[18,0,18,2],[19,0,19,2],[20,0,20,2],[18,3,18,13],[16,3,16,13],[17,3,17,13],[15,0,15,2],[15,3,15,13],[21,28,21,33],[20,28,20,33],[19,28,19,33],[18,28,18,33],[17,28,17,33],[16,28,16,33],[27,28,27,33],[26,28,26,33],[25,28,25,33],[24,28,24,33],[23,28,23,33],[22,28,22,33],[21,22,21,27],[20,22,20,27],[19,22,19,27],[18,22,18,27],[17,22,17,27],[16,22,16,27],[27,22,27,27],[26,22,26,27],[25,22,25,27],[24,22,24,27],[23,22,23,27],[22,22,22,27],[18,14,18,21],[17,14,17,21],[16,14,16,21],[27,14,27,21],[26,14,26,21],[25,14,25,21],[24,14,24,21],[23,14,23,21],[22,14,22,21],[21,3,21,13],[20,3,20,13],[19,3,19,13],[30,0,30,2],[30,3,30,13],[30,14,30,21],[27,3,27,13],[26,3,26,13],[25,3,25,13],[24,3,24,13],[23,3,23,13],[22,3,22,13],[21,14,21,21],[20,14,20,21],[19,14,19,21],[21,0,21,2],[22,0,22,2],[23,0,23,2],[24,0,24,2],[25,0,25,2],[27,0,27,2],[26,0,26,2],[42,0,43,2],[44,0,44,2],[42,3,43,10],[44,3,44,10],[42,20,42,33],[43,20,43,33],[30,22,30,27],[30,28,30,33],[33,0,34,2],[33,3,34,8],[33,28,33,33],[33,22,33,27],[34,28,34,33],[34,22,34,27],[57,0,59,4],[57,5,59,24],[0,37,1,39],[0,40,1,42],[0,43,1,64],[4,37,4,39],[4,40,4,50],[4,56,4,67],[9,37,9,39],[12,40,12,47],[50,25,50,33],[49,25,49,33],[48,25,48,33],[59,25,59,33],[58,25,58,33],[57,25,57,33],[56,25,56,33],[55,25,55,33],[54,25,54,33],[53,25,53,33],[52,25,52,33],[51,25,51,33],[39,0,40,2],[39,3,40,33],[42,37,43,39],[42,40,43,47],[33,37,34,39],[33,40,34,45],[33,59,33,64],[33,65,33,70],[12,51,12,58],[12,59,12,61],[12,62,12,70],[25,54,26,62],[19,63,20,70],[22,63,23,70],[25,63,26,70],[16,45,17,53],[16,54,17,62],[19,45,20,53],[19,54,20,62],[22,45,23,53],[22,54,23,62],[25,45,26,53],[56,66,56,70],[57,66,57,70],[58,66,58,70],[59,66,59,70],[59,62,59,65],[58,62,58,65],[57,62,57,65],[56,62,56,65],[57,37,59,41],[57,42,59,61],[55,62,55,65],[55,66,55,70],[54,62,54,65],[54,66,54,70],[16,37,17,44],[19,37,20,44],[22,37,23,44],[25,37,26,44],[16,63,17,70],[50,66,50,70],[50,62,50,65],[51,62,51,65],[53,62,53,65],[53,66,53,70],[52,66,52,70],[51,66,51,70],[52,62,52,65],[44,37,44,39],[44,40,44,47],[48,62,48,70],[49,66,49,70],[49,62,49,65],[39,37,40,39],[39,40,40,70]]}
["Dept.",null,null,null,null,null,{"$f":"IF(ISBLANK(D1),\" \", IF(D1=\"pc 91\", VLOOKUP(AC1,OMT_91!$1:$1048576,2,0), IF(D1=\"pc 77\", VLOOKUP(AC1,OMT_77!$1:$1048576,2,0),IF(D1=\"pc 94\", VLOOKUP(AC1,OMT_94!$1:$1048576,2,0)))))","v":" "},null,null,null,null,null,null,null,null,null,null,null,null,null,null,null,null,null,null,null,null,null,null,null,null,"PA",null,null,"Barre d'outil ",null,null,"Dept.",null,null,null,null,null,{"$f":"IF(ISBLANK(AO1),\" \", IF(AO1=\"pc 91\", VLOOKUP(BN1,OMT_91!$1:$1048576,2,0), IF(AO1=\"pc 77\", VLOOKUP(BN1,OMT_77!$1:$1048576,2,0),IF(AO1=\"pc 94\", VLOOKUP(BN1,OMT_94!$1:$1048576,2,0)))))","v":" "},null,null,null,null,null,null,null,null,null,null,null,null,null,null,null,null,null,null,null,null,null,null,null,null,"PA",null,null,"Barre d'outil "]
[]
[]
["Ville",null,null,{"$f":"IF(ISBLANK(D1),\" \", IF(D1=\"pc 91\", VLOOKUP(AC1,OMT_91!$1:$1048576,22,0), IF(D1=\"pc 77\", VLOOKUP(AC1,OMT_77!$1:$1048576,22,0),IF(D1=\"pc 94\", VLOOKUP(AC1,OMT_94!$1:$1048576,22,0)))))","v":" "},null,null,null,null,null,null,null,null,null,null,null,null,null,null,null,{"$f":"IF(ISBLANK(D1),\" \", IF(D1=\"pc 91\", VLOOKUP(AC1,OMT_91!$1:$1048576,25,0), IF(D1=\"pc 77\", VLOOKUP(AC1,OMT_77!$1:$1048576,25,0),IF(D1=\"pc 94\", VLOOKUP(AC1,OMT_94!$1:$1048576,25,0)))))","v":" "},null,null,null,null,null,null,null,null,null,null,null,"Nord",null,null,null,null,null,"Ville",null,null,{"$f":"IF(ISBLANK(AO1),\" \", IF(AO1=\"pc 91\", VLOOKUP(BN1,OMT_91!$1:$1048576,22,0), IF(AO1=\"pc 77\", VLOOKUP(BN1,OMT_77!$1:$1048576,22,0),IF(AO1=\"pc 94\", VLOOKUP(BN1,OMT_94!$1:$1048576,22,0)))))","v":" "},null,null,null,null,null,null,null,null,null,null,null,null,null,null,null,{"$f":"IF(ISBLANK(AO1),\" \", IF(AO1=\"pc 91\", VLOOKUP(BN1,OMT_91!$1:$1048576,25,0), IF(AO1=\"pc 77\", VLOOKUP(BN1,OMT_77!$1:$1048576,25,0),IF(AO1=\"pc 94\", VLOOKUP(BN1,OMT_94!$1:$1048576,25,0)))))","v":" "},null,null,null,null,null,null,null,null,null,null,null,"Nord"]
["Rue",null,null,{"$f":"IF(ISBLANK(D1),\" \", IF(D1=\"pc 91\", VLOOKUP(AC1,OMT_91!$1:$1048576,24,0), IF(D1=\"pc 77\", VLOOKUP(AC1,OMT_77!$1:$1048576,24,0),IF(D1=\"pc 94\", VLOOKUP(AC1,OMT_94!$1:$1048576,24,0)))))","v":" "},null,null,null,null,null,null,null,null,null,null,null,null,null,null,null,{"$f":"IF(ISBLANK(D1),\" \", IF(D1=\"pc 91\", VLOOKUP(AC1,OMT_91!$1:$1048576,26,0), IF(D1=\"pc 77\", VLOOKUP(AC1,OMT_77!$1:$1048576,26,0),IF(D1=\"pc 94\", VLOOKUP(AC1,OMT_94!$1:$1048576,26,0)))))","v":" "},null,null,null,null,null,null,null,null,null,null,null,"Est",null,null,null,null,null,"Rue",null,null,{"$f":"IF(ISBLANK(AO1),\" \", IF(AO1=\"pc 91\", VLOOKUP(BN1,OMT_91!$1:$1048576,24,0), IF(AO1=\"pc 77\", VLOOKUP(BN1,OMT_77!$1:$1048576,24,0),IF(AO1=\"pc 94\", VLOOKUP(BN1,OMT_94!$1:$1048576,24,0)))))","v":" "},null,null,null,null,null,null,null,null,null,null,null,null,null,null,null,{"$f":"IF(ISBLANK(AO1),\" \", IF(AO1=\"pc 91\", VLOOKUP(BN1,OMT_91!$1:$1048576,26,0), IF(AO1=\"pc 77\", VLOOKUP(BN1,OMT_77!$1:$1048576,26,0),IF(AO1=\"pc 94\", VLOOKUP(BN1,OMT_94!$1:$1048576,26,0)))))","v":" "},null,null,null,null,null,null,null,null,null,null,null,"Est"]
[]
["Source",null,null,{"$f":"IF(ISBLANK(D1),\" \", IF(D1=\"pc 91\", VLOOKUP(AC1,OMT_91!$1:$1048576,3,0), IF(D1=\"pc 77\", VLOOKUP(AC1,OMT_77!$1:$1048576,3,0),IF(D1=\"pc 94\", VLOOKUP(AC1,OMT_94!$1:$1048576,3,0)))))","v":" "},null,null,null,null,null,null,null,null,null,null,null,null,null,null,null,{"$f":"IF(ISBLANK(D1),\" \", IF(D1=\"pc 91\", VLOOKUP(AC1,OMT_91!$1:$1048576,5,0), IF(D1=\"pc 77\", VLOOKUP(AC1,OMT_77!$1:$1048576,5,0),IF(D1=\"pc 94\", VLOOKUP(AC1,OMT_94!$1:$1048576,5,0)))))","v":" "},null,null,null,null,null,null,null,null,null,null,null,"AEE",null,null,null,null,null,"Source",null,null,{"$f":"IF(ISBLANK(AO1),\" \", IF(AO1=\"pc 91\", VLOOKUP(BN1,OMT_91!$1:$1048576,3,0), IF(AO1=\"pc 77\", VLOOKUP(BN1,OMT_77!$1:$1048576,3,0),IF(AO1=\"pc 94\", VLOOKUP(BN1,OMT_94!$1:$1048576,3,0)))))","v":" "},null,null,null,null,null,null,null,null,null,null,null,null,null,null,null,{"$f":"IF(ISBLANK(AO1),\" \", IF(AO1=\"pc 91\", VLOOKUP(BN1,OMT_91!$1:$1048576,5,0), IF(AO1=\"pc 77\", VLOOKUP(BN1,OMT_77!$1:$1048576,5,0),IF(AO1=\"pc 94\", VLOOKUP(BN1,OMT_94!$1:$1048576,5,0)))))","v":" "},null,null,null,null,null,null,null,null,null,null,null,"AEE"]
["Départ",null,null,{"$f":"IF(ISBLANK(D1),\" \", IF(D1=\"pc 91\", VLOOKUP(AC1,OMT_91!$1:$1048576,4,0), IF(D1=\"pc 77\", VLOOKUP(AC1,OMT_77!$1:$1048576,4,0),IF(D1=\"pc 94\", VLOOKUP(AC1,OMT_94!$1:$1048576,4,0)))))","v":" "},null,null,null,null,null,null,null,null,null,null,null,null,null,null,null,{"$f":"IF(ISBLANK(D1),\" \", IF(D1=\"pc 91\", VLOOKUP(AC1,OMT_91!$1:$1048576,7,0), IF(D1=\"pc 77\", VLOOKUP(AC1,OMT_77!$1:$1048576,7,0),IF(D1=\"pc 94\", VLOOKUP(AC1,OMT_94!$1:$1048576,7,0)))))","v":" "},null,null,null,null,null,null,null,null,null,null,null,"Régime",null,null,null,null,null,"Départ",null,null,{"$f":"IF(ISBLANK(AO1),\" \", IF(AO1=\"pc 91\", VLOOKUP(BN1,OMT_91!$1:$1048576,4,0), IF(AO1=\"pc 77\", VLOOKUP(BN1,OMT_77!$1:$1048576,4,0),IF(AO1=\"pc 94\", VLOOKUP(BN1,OMT_94!$1:$1048576,4,0)))))","v":" "}]
{"$rows_left_out":51}
{"sheet":"Feuilles de conf","index":6,"n_rows":0,"n_cols":0,"rows_kept":0,"cut":false,"hidden":false,"merged":[]}

{"sheet":"Entretiens Valise","index":7,"n_rows":6,"n_cols":8,"rows_kept":6,"cut":false,"hidden":false,"merged":[]}
[]
[null,null,null,null,null,null,null,"Vers le sommaire"]
["n° valise","DERNIERE REVISION","DATE DU JOUR","PROCHAINE REVISION","ETAT"]
[1,"2015-01-15",{"$f":"TODAY()","v":"2015-08-31"},{"$f":"B4+730","v":"2017-01-14"},{"$f":"IF(C4>=D4, \"à réviser\",\"OK\")","v":"OK"}]
[2,"2015-05-27",{"$f":"TODAY()","v":"2015-08-31"},{"$f":"B5+730","v":"2017-05-26"},{"$f":"IF(C5>=D5, \"à réviser\",\"OK\")","v":"OK"}]
[3,"2015-05-27","2015-08-31","2017-05-26","OK"]

{"sheet":"Devet","index":8,"n_rows":0,"n_cols":0,"rows_kept":0,"cut":false,"hidden":false,"merged":[]}

{"sheet":"dossiers suspendu","index":9,"n_rows":0,"n_cols":0,"rows_kept":0,"cut":false,"hidden":false,"merged":[]}

{"sheet":"ANNEXE_PS","index":10,"n_rows":0,"n_cols":0,"rows_kept":0,"cut":false,"hidden":true,"merged":[]}

{"sheet":"Annexe_coffret","index":11,"n_rows":0,"n_cols":0,"rows_kept":0,"cut":false,"hidden":true,"merged":[]}

{"sheet":"Annexe_3","index":12,"n_rows":534,"n_cols":56,"rows_kept":534,"cut":false,"hidden":true,"merged":[]}
["Matériel HTA",null,"Agence",null,"communes 77","code postal 77",null,"communes 91","code postal 91",null,"communes 94","code postal 94",null,"chargé d'affaire","téléphone CA",null,"status",null,"tores",null,null,null,null,null,null,null,null,null,null,null,null,null,null,null,null,null,null,null,null,null,null,null,null,null,null,null,null,null,null,null,null,null,null,null,null,"PROTECTION FT"]
["cellule 1",null,"aee 1",null,"ACHÈRES-LA-FORÊT",77760,null,"ABBÉVILLE-LA-RIVIÈRE",91150,null,"ABLON SUR SEINE",94480,null,"ca1","01 00 00 00 00",null,"COFFRET A REMPLACER",null,"tores 1",null,null,null,null,null,null,null,null,null,null,null,"7Ah","12Ah","17AH","24Ah","32Ah","38Ah",null,null,null,null,null,null,null,null,null,null,null,null,null,null,null,null,null,null,null,"prot.1"]
["cellule 2",null,"aee 2",null,"AMILLIS",77120,null,"ANGERVILLE",91670,null,"ALFORTVILLE",94140,null,"ca2","2 00 00 00 00",null,"EN SERVICE",null,"tores 2",null,null,null,null,null,null,null,null,null,null,"coffret1",null,null,null,null,null,null,null,null,null,null,null,null,null,null,null,null,null,null,null,null,null,null,null,null,null,"prot.2"]
["cellule 3",null,"aee 3",null,"AMPONVILLE",77760,null,"ANGERVILLIERS",91470,null,"ATHIS-MONS",91200,null,"ca3","3 00 00 00 00",null,"EN TRAVAUX",null,"tores 3",null,null,null,null,null,null,null,null,null,null,"coffret2",null,null,null,null,null,1,null,null,null,null,null,null,null,null,null,null,null,null,null,null,null,null,null,null,null,"prot.3"]
["cellule 4",null,"aee 4",null,"ANDREZEL",77390,null,"ARPAJON",91290,null,"BOISSY SAINT LEGER",94470,null,"ca4","4 00 00 00 00",null,"FICHE PROBLEME",null,"tores 4",null,null,null,null,null,null,null,null,null,null,"coffret3",null,null,null,null,null,1,null,null,null,null,null,null,null,null,null,null,null,null,null,null,null,null,null,null,null,"prot.4"]
["cellule 5",null,"aee 5",null,"ANNET-SUR-MARNE",77410,null,"ARRANCOURT",91690,null,"BONNEUIL SUR MARNE",94380,null,"ca5","5 00 00 00 00",null,"FP+HC",null,"tores 5",null,null,null,null,null,null,null,null,null,null,"coffret4",null,null,null,1,null,null,null,null,null,null,null,null,null,null,null,null,null,null,null,null,null,null,null,null,null,"prot.5"]
["cellule 6",null,"aee 6",null,"ARBONNE-LA-FORÊT",77630,null,"ATHIS-MONS",91200,null,"BRUNOY",91800,null,"ca6","6 00 00 00 00",null,"FT OK",null,"tores 6",null,null,null,null,null,null,null,null,null,null,"coffret5",null,null,null,null,null,1,null,null,null,null,null,null,null,null,null,null,null,null,null,null,null,null,null,null,null,"prot.6"]
["cellule 7",null,"aee 7",null,"ARGENTIÈRES",77390,null,"AULNAY-SOUS-BOIS",93600,null,"CHEVILLY-LARUE",94550,null,"ca7","7 00 00 00 00",null,"HORS CONDUITE",null,"tores 7",null,null,null,null,null,null,null,null,null,null,"coffret6",null,null,null,null,null,1,null,null,null,null,null,null,null,null,null,null,null,null,null,null,null,null,null,null,null,"prot.7"]
{"$rows_left_out":527}
{"sheet":"Hors conduite","index":13,"n_rows":8,"n_cols":8,"rows_kept":8,"cut":false,"hidden":false,"merged":[[4,0,4,4]]}
[null,null,null,null,null,null,null,"statut"]
[null,null,null,null,null,null,null,"Hors conduite"]
[]
[]
["zone de renvoie des cellules"]
[]
["nom","poste source","depart","agence","status","observation"]
[null,null,null,null,null,null,null,"Lorsque les statuts changent, le tableau se range automatiquement"]
{"$rows_left_out":1}
{"sheet":"Fiche probleme","index":14,"n_rows":8,"n_cols":8,"rows_kept":8,"cut":false,"hidden":false,"merged":[[4,0,4,4]]}
[null,null,null,null,null,null,null,"Statut"]
[null,null,null,null,null,null,null,"Fiche probleme"]
[]
[]
["zone de renvoie des cellules"]
[]
["nom","poste source","depart","agence","status","observation"]
[null,null,null,null,null,null,null,"Lorsque les statuts changent, le tableau se range automatiquement"]
{"$rows_left_out":1}
{"sheet":"FP + HC","index":15,"n_rows":8,"n_cols":8,"rows_kept":8,"cut":false,"hidden":false,"merged":[[4,0,4,4]]}
[null,null,null,null,null,null,null,"Statut"]
[null,null,null,null,null,null,null,"FP +  HC"]
[]
[]
["zone de renvoie des cellules"]
[]
["nom","poste source","depart","agence","status","observation"]
[null,null,null,null,null,null,null,"Lorsque les statuts changent, le tableau se range automatiquement"]