{"text_format":"1","workbook":"xlsx","n_sheets":2,"sheets":["DONNEE","FICHE"],"not_rendered":{"charts":0,"images":0,"macros":1,"external_links":0,"defined_names":6,"comments":0,"pivot_tables":0},"unopened":[],"bounds":{"document_bytes":16777216,"sheet_cells":100000,"rows_first":2000,"rows_last":500,"rows_between":2000,"halvings":0,"cell_chars":16384,"cell_head_chars":4096},"cells_cut":0,"cells_raw":0,"read":"whole","date_system":"1900"}

{"sheet":"DONNEE","index":0,"n_rows":5,"n_cols":7,"rows_kept":5,"cut":false,"hidden":false,"merged":[]}
["N°","D U E","nom prénom","nom jeune fille","situation famille","n° SS","Nbre Enfants"]
[1,1548,"Aloxe  Corton","titi","M",12456,2]
[2,"5520D4","Passard  Alain"]
[3,"45D23","Jean  ALEX"]
[4,"32G1D","Jackson Mickaël"]

{"sheet":"FICHE","index":1,"n_rows":12,"n_cols":3,"rows_kept":12,"cut":false,"hidden":false,"merged":[[0,1,0,3]]}
[null,"RELAI"]
[null,"Matricule /N° DUE","=SOMME.SI(DONNEE!C2:C100;DONNEE!C5;DONNEE!A2:A100)"]
[null,"NOM Prénom","Aloxe  Corton"]
[null,"NOM DE JEUNE FILLE",{"$f":"IFERROR(VLOOKUP($C$3,DONNEE!$C$2:$G$10,2,0),\"\")","v":"titi"}]
[null,"SITUATION FAMILIALE",{"$f":"IFERROR(VLOOKUP($C$3,DONNEE!$C$2:$G$10,3,0),\"\")","v":"M"}]
[null,"N° de sécurité sociale",{"$f":"IFERROR(VLOOKUP($C$3,DONNEE!$C$2:$G$10,4,0),\"\")","v":12456}]
[null,"Nombre d'enfant(s)",{"$f":"IFERROR(VLOOKUP($C$3,DONNEE!$C$2:$G$10,5,0),\"\")","v":2}]
[null,"NATIONALITE",{"$f":"IFERROR(VLOOKUP($C$3,DONNEE!$C$2:$G$10,6,0),\"\")","v":""}]
[null,"Date de naissance",{"$f":"IFERROR(VLOOKUP($C$3,DONNEE!$C$2:$G$10,7,0),\"\")","v":""}]
[null,"Sexe",{"$f":"IFERROR(VLOOKUP($C$3,DONNEE!$C$2:$G$10,8,0),\"\")","v":""}]
[null,"Adresse",{"$f":"IFERROR(VLOOKUP($C$3,DONNEE!$C$2:$G$10,9,0),\"\")","v":""}]
[null,"Code postal ville",{"$f":"IFERROR(VLOOKUP($C$3,DONNEE!$C$2:$G$10,10,0),\"\")","v":""}]