{"text_format":"1","workbook":"xlsx","n_sheets":5,"sheets":["Feuil1","Accès planning","1ER SEMESTRE 2015","2EME SEMESTRE 2015","données"],"not_rendered":{"charts":0,"images":1,"macros":1,"external_links":3,"defined_names":45,"comments":1,"pivot_tables":0},"unopened":[],"bounds":{"document_bytes":16777216,"sheet_cells":100000,"rows_first":2000,"rows_last":500,"rows_between":2000,"halvings":0,"cell_chars":16384,"cell_head_chars":4096},"cells_cut":0,"cells_raw":0,"read":"whole","date_system":"1900"}

{"sheet":"Feuil1","index":0,"n_rows":50,"n_cols":8,"rows_kept":50,"cut":false,"hidden":false,"merged":[[11,0,11,1],[11,2,11,3],[0,0,0,7],[8,0,8,3],[9,5,10,5],[9,6,10,6],[10,0,10,1],[10,2,10,3]]}
["    FEUILLE DE DEMANDE DE REMPLACEMENT"]
[]
[]
[null,null,null,null,null,"AGENT ABSENT"]
[]
[null,null,null,null,null,"NOM","x"]
["N° de demande",null,{"$f":"+#REF!","v":{"$error":"#REF!"}},null,null,"PRENOM","y"]
[null,null,null,null,null,"TRI","fcl"]
["ABSENCE PREVUE",null,null,null,null,"FONCTION","cdb"]
[null,null,null,null,null,"SOCIETE",{"$f":"#REF!","v":{"$error":"#REF!"}}]
["DU",null,"AU"]
["2015-10-10",null,"2015-10-18"]
[]
[]
["DATE","HOR","P1","Accord\nAgent","P2","Accord\nAgent","P3","Accord\nAgent"]
[{"$f":"+A12","v":"2015-10-10"},{"$f":"IFERROR(INDEX([3]PLANNING!$D$3:$Y$29,MATCH('[3]F_Dde de remplacement'!$G$8,[3]PLANNING!$B$3:$B$29,0),MATCH('[3]F_Dde de remplacement'!$A16,[3]PLANNING!$D$2:$Y$2,0)),\"\")","v":"N"},{"$f":"IF(OR($B16=\"M\",$B16=\"N\",$B16=\"A\"),\n      IFERROR(\n            INDEX(\n                  OFFSET(\n                        INDIRECT(\"'\"&INT((MONTH(A16)-1)/6)+1&IF(INT((MONTH(A16)-1)/6)+1=1,\"ER SEMESTRE \",\"EME SEMESTRE \")&YEAR(A16)&\"'\"&\"!$B$9:$B$43\"),\n                        0,\n                        MATCH($A16,INDIRECT(\"'\"&INT((MONTH(A16)-1)/6)+1&IF(INT((MONTH(A16)-1)/6)+1=1,\"ER SEMESTRE \",\"EME SEMESTRE \")&YEAR(A16)&\"'\"&\"!$B$7:$HA$7\"),0)-DAY(A16)-2),\n                  MIN(IF((OFFSET(INDIRECT(\"'\"&INT((MONTH(A16)-1)/6)+1&IF(INT((MONTH(A16)-1)/6)+1=1,\"ER SEMESTRE \",\"EME SEMESTRE \")&YEAR(A16)&\"'\"&\"!$B$9:$B$43\"),\n                                         0,\n                                         MATCH($A16,INDIRECT(\"'\"&INT((MONTH(A16)-1)/6)+1&IF(INT((MONTH(A16)-1)/6)+1=1,\"ER SEMESTRE \",\"EME SEMESTRE \")&YEAR(A16)&\"'\"&\"!$B$7:$HA$7\"),0)-DAY(A16)-1)\n                                   =\"(\"&$G$9&\")\")\n                                   *(INDEX(INDIRECT(\"'\"&INT((MONTH(A16)-1)/6)+1&IF(INT((MONTH(A16)-1)/6)+1=1,\"ER SEMESTRE \",\"EME SEMESTRE \")&YEAR(A16)&\"'\"&\"!$B$9:$HA$43\"),\n                                            0,\n                                            MATCH($A16,INDIRECT(\"'\"&INT((MONTH(A16)-1)/6)+1&IF(INT((MONTH(A16)-1)/6)+1=1,\"ER SEMESTRE \",\"EME SEMESTRE \")&YEAR(A16)&\"'\"&\"!$B$7:$HA$7\"),0))\n                                    =\"J\"),\n                             ROW(INDIRECT(\"'\"&INT((MONTH(A16)-1)/6)+1&IF(INT((MONTH(A16)-1)/6)+1=1,\"ER SEMESTRE \",\"EME SEMESTRE \")&YEAR(A16)&\"'\"&\"!$D$9:$D$43\"))-8,\n                             9^9))),\n\n             IFERROR(\n                   INDEX(\n                          OFFSET(\n                                 INDIRECT(\"'\"&INT((MONTH(A16)-1)/6)+1&IF(INT((MONTH(A16)-1)/6)+1=1,\"ER SEMESTRE \",\"EME SEMESTRE \")&YEAR(A16)&\"'\"&\"!$B$9:$B$43\"),\n                                 0,\n                                 MATCH($A16,INDIRECT(\"'\"&INT((MONTH(A16)-1)/6)+1&IF(INT((MONTH(A16)-1)/6)+1=1,\"ER SEMESTRE \",\"EME SEMESTRE \")&YEAR(A16)&\"'\"&\"!$B$7:$HA$7\"),0)-DAY(A16)-2),\n                          MIN(IF((OFFSET(INDIRECT(\"'\"&INT((MONTH(A16)-1)/6)+1&IF(INT((MONTH(A16)-1)/6)+1=1,\"ER SEMESTRE \",\"EME SEMESTRE \")&YEAR(A16)&\"'\"&\"!$B$9:$B$43\"),\n                                                 0,\n                                                 MATCH($A16,INDIRECT(\"'\"&INT((MONTH(A16)-1)/6)+1&IF(INT((MONTH(A16)-1)/6)+1=1,\"ER SEMESTRE \",\"EME SEMESTRE \")&YEAR(A16)&\"'\"&\"!$B$7:$HA$7\"),0)-DAY(A16)-1)\n                                           =\"(\"&$G$9&\")\")\n                                           *(INDEX(INDIRECT(\"'\"&INT((MONTH(A16)-1)/6)+1&IF(INT((MONTH(A16)-1)/6)+1=1,\"ER SEMESTRE \",\"EME SEMESTRE \")&YEAR(A16)&\"'\"&\"!$B$9:$HA$43\"),\n                                                     0,\n                                                     MATCH($A16,INDIRECT(\"'\"&INT((MONTH(A16)-1)/6)+1&IF(INT((MONTH(A16)-1)/6)+1=1,\"ER SEMESTRE \",\"EME SEMESTRE \")&YEAR(A16)&\"'\"&\"!$B$7:$HA$7\"),0))\n                                             =\"R\"),\n                                     ROW(INDIRECT(\"'\"&INT((MONTH(A16)-1)/6)+1&IF(INT((MONTH(A16)-1)/6)+1=1,\"ER SEMESTRE \",\"EME SEMESTRE \")&YEAR(A16)&\"'\"&\"!$D$9:$D$43\"))-8,\n                                     9^9))),\n              \"\")),\n\"\")","v":"MRU"},null,{"$f":"IF(OR($B16=\"M\",$B16=\"N\",$B16=\"A\"),\n      IF(\n            IFERROR(\n                  INDEX(\n                        OFFSET(\n                              INDIRECT(\"'\"&INT((MONTH(A16)-1)/6)+1&IF(INT((MONTH(A16)-1)/6)+1=1,\"ER SEMESTRE \",\"EME SEMESTRE \")&YEAR(A16)&\"'\"&\"!$B$9:$B$43\"),\n                              0,\n                              MATCH($A16,INDIRECT(\"'\"&INT((MONTH(A16)-1)/6)+1&IF(INT((MONTH(A16)-1)/6)+1=1,\"ER SEMESTRE \",\"EME SEMESTRE \")&YEAR(A16)&\"'\"&\"!$B$7:$HA$7\"),0)-DAY(A16)-2),\n\n                        MIN(IF((OFFSET(\n                                                INDIRECT(\"'\"&INT((MONTH(A16)-1)/6)+1&IF(INT((MONTH(A16)-1)/6)+1=1,\"ER SEMESTRE \",\"EME SEMESTRE \")&YEAR(A16)&\"'\"&\"!$B$9:$B$43\"),\n                                                0,\n                                                MATCH($A16,INDIRECT(\"'\"&INT((MONTH(A16)-1)/6)+1&IF(INT((MONTH(A16)-1)/6)+1=1,\"ER SEMESTRE \",\"EME SEMESTRE \")&YEAR(A16)&\"'\"&\"!$B$7:$HA$7\"),0)-DAY(A16)-1)\n                                       =\"(\"&$G$9&\")\")\n                                       *(INDEX(INDIRECT(\"'\"&INT((MONTH(A16)-1)/6)+1&IF(INT((MONTH(A16)-1)/6)+1=1,\"ER SEMESTRE \",\"EME SEMESTRE \")&YEAR(A16)&\"'\"&\"!$B$9:$HA$43\"),\n                                                0,\n                                                MATCH($A16,INDIRECT(\"'\"&INT((MONTH(A16)-1)/6)+1&IF(INT((MONTH(A16)-1)/6)+1=1,\"ER SEMESTRE \",\"EME SEMESTRE \")&YEAR(A16)&\"'\"&\"!$B$7:$HA$7\"),0))\n                                       =\"J\"),\n                                ROW(INDIRECT(\"'\"&INT((MONTH(A16)-1)/6)+1&IF(INT((MONTH(A16)-1)/6)+1=1,\"ER SEMESTRE \",\"EME SEMESTRE \")&YEAR(A16)&\"'\"&\"!$D$9:$D$43\"))-8,\n                                9^9))),\"\")\n            =\"\",\n\n      IFERROR(\n            INDEX(\n                  OFFSET(\n                       INDIRECT(\"'\"&INT((MONTH(A16)-1)/6)+1&IF(INT((MONTH(A16)-1)/6)+1=1,\"ER SEMESTRE \",\"EME SEMESTRE \")&YEAR(A16)&\"'\"&\"!$B$9:$B$43\"),\n                               0,\n                               MATCH($A16,INDIRECT(\"'\"&INT((MONTH(A16)-1)/6)+1&IF(INT((MONTH(A16)-1)/6)+1=1,\"ER SEMESTRE \",\"EME SEMESTRE \")&YEAR(A16)&\"'\"&\"!$B$7:$HA$7\"),0)-DAY(A16)-2),\n                  SMALL(IF((OFFSET(\n                                                               INDIRECT(\"'\"&INT((MONTH(A16)-1)/6)+1&IF(INT((MONTH(A16)-1)/6)+1=1,\"ER SEMESTRE \",\"EME SEMESTRE \")&YEAR(A16)&\"'\"&\"!$B$9:$B$43\"),\n                                                               0,\n                                                               MATCH($A16,INDIRECT(\"'\"&INT((MONTH(A16)-1)/6)+1&IF(INT((MONTH(A16)-1)/6)+1=1,\"ER SEMESTRE \",\"EME SEMESTRE \")&YEAR(A16)&\"'\"&\"!$B$7:$HA$7\"),0)-DAY(A16)-1)\n                                                        =\"(\"&$G$9&\")\")*\n                                                        (INDEX(INDIRECT(\"'\"&INT((MONTH(A16)-1)/6)+1&IF(INT((MONTH(A16)-1)/6)+1=1,\"ER SEMESTRE \",\"EME SEMESTRE \")&YEAR(A16)&\"'\"&\"!$B$9:$HA$43\"),\n                                                               0,\n                                                               MATCH($A16,INDIRECT(\"'\"&INT((MONTH(A16)-1)/6)+1&IF(INT((MONTH(A16)-1)/6)+1=1,\"ER SEMESTRE \",\"EME SEMESTRE \")&YEAR(A16)&\"'\"&\"!$B$7:$HA$7\"),0))\n                                                         =\"R\"),\n                                                  ROW(INDIRECT(\"'\"&INT((MONTH(A16)-1)/6)+1&IF(INT((MONTH(A16)-1)/6)+1=1,\"ER SEMESTRE \",\"EME SEMESTRE \")&YEAR(A16)&\"'\"&\"!D$9:D$43\"))-8,\n                                                  9^9),\n                  2)),\n            \"\"),\n\n      IFERROR(\n             INDEX(\n                  OFFSET(\n                        INDIRECT(\"'\"&INT((MONTH(A16)-1)/6)+1&IF(INT((MONTH(A16)-1)/6)+1=1,\"ER SEMESTRE \",\"EME SEMESTRE \")&YEAR(A16)&\"'\"&\"!$B$9:$B$43\"),\n                              0,\n                              MATCH($A16,INDIRECT(\"'\"&INT((MONTH(A16)-1)/6)+1&IF(INT((MONTH(A16)-1)/6)+1=1,\"ER SEMESTRE \",\"EME SEMESTRE \")&YEAR(A16)&\"'\"&\"!$B$7:$HA$7\"),0)-DAY(A16)-2),\n                  MIN(IF((OFFSET(\n                                           INDIRECT(\"'\"&INT((MONTH(A16)-1)/6)+1&IF(INT((MONTH(A16)-1)/6)+1=1,\"ER SEMESTRE \",\"EME SEMESTRE \")&YEAR(A16)&\"'\"&\"!$B$9:$B$43\"),\n                                           0,\n                                           MATCH($A16,INDIRECT(\"'\"&INT((MONTH(A16)-1)/6)+1&IF(INT((MONTH(A16)-1)/6)+1=1,\"ER SEMESTRE \",\"EME SEMESTRE \")&YEAR(A16)&\"'\"&\"!$B$7:$HA$7\"),0)-DAY(A16)-1)\n                                   =\"(\"&$G$9&\")\")*\n                                   (INDEX(INDIRECT(\"'\"&INT((MONTH(A16)-1)/6)+1&IF(INT((MONTH(A16)-1)/6)+1=1,\"ER SEMESTRE \",\"EME SEMESTRE \")&YEAR(A16)&\"'\"&\"!$B$9:$HA$43\"),\n                                           0,\n                                           MATCH($A16,INDIRECT(\"'\"&INT((MONTH(A16)-1)/6)+1&IF(INT((MONTH(A16)-1)/6)+1=1,\"ER SEMESTRE \",\"EME SEMESTRE \")&YEAR(A16)&\"'\"&\"!$B$7:$HA$7\"),0))\n                                   =\"R\"),\n                             ROW(INDIRECT(\"'\"&INT((MONTH(A16)-1)/6)+1&IF(INT((MONTH(A16)-1)/6)+1=1,\"ER SEMESTRE \",\"EME SEMESTRE \")&YEAR(A16)&\"'\"&\"!D$9:D$43\"))-8,\n                             9^9))),\n            \"\")),\n      \"\")","v":"FCL"},null,{"$f":"IF(OR($B16=\"M\",$B16=\"N\",$B16=\"A\"),IF(\n\nIFERROR(INDEX(OFFSET(INDIRECT(\"'\"&INT((MONTH(A16)-1)/6)+1&IF(INT((MONTH(A16)-1)/6)+1=1,\"ER SEMESTRE \",\"EME SEMESTRE \")&YEAR(A16)&\"'\"&\"!$B$9:$B$43\"),0,MATCH($A16,INDIRECT(\"'\"&INT((MONTH(A16)-1)/6)+1&IF(INT((MONTH(A16)-1)/6)+1=1,\"ER SEMESTRE \",\"EME SEMESTRE \")&YEAR(A16)&\"'\"&\"!$B$7:$HA$7\"),0)-DAY(A16)-2),MIN(IF((OFFSET(INDIRECT(\"'\"&INT((MONTH(A16)-1)/6)+1&IF(INT((MONTH(A16)-1)/6)+1=1,\"ER SEMESTRE \",\"EME SEMESTRE \")&YEAR(A16)&\"'\"&\"!$B$9:$B$43\"),0,MATCH($A16,INDIRECT(\"'\"&INT((MONTH(A16)-1)/6)+1&IF(INT((MONTH(A16)-1)/6)+1=1,\"ER SEMESTRE \",\"EME SEMESTRE \")&YEAR(A16)&\"'\"&\"!$B$7:$HA$7\"),0)-DAY(A16)-1)=\"(\"&$G$9&\")\")*(INDEX(INDIRECT(\"'\"&INT((MONTH(A16)-1)/6)+1&IF(INT((MONTH(A16)-1)/6)+1=1,\"ER SEMESTRE \",\"EME SEMESTRE \")&YEAR(A16)&\"'\"&\"!$B$9:$HA$43\"),0,MATCH($A16,INDIRECT(\"'\"&INT((MONTH(A16)-1)/6)+1&IF(INT((MONTH(A16)-1)/6)+1=1,\"ER SEMESTRE \",\"EME SEMESTRE \")&YEAR(A16)&\"'\"&\"!$B$7:$HA$7\"),0))=\"J\"),ROW(INDIRECT(\"'\"&INT((MONTH(A16)-1)/6)+1&IF(INT((MONTH(A16)-1)/6)+1=1,\"ER SEMESTRE \",\"EME SEMESTRE \")&YEAR(A16)&\"'\"&\"!$D$9:$D$43\"))-8,9^9))),\"\")=\"\",\n\nIFERROR(\nINDEX(OFFSET(INDIRECT(\"'\"&INT((MONTH(A16)-1)/6)+1&IF(INT((MONTH(A16)-1)/6)+1=1,\"ER SEMESTRE \",\"EME SEMESTRE \")&YEAR(A16)&\"'\"&\"!$B$9:$B$43\"),0,MATCH($A16,INDIRECT(\"'\"&INT((MONTH(A16)-1)/6)+1&IF(INT((MONTH(A16)-1)/6)+1=1,\"ER SEMESTRE \",\"EME SEMESTRE \")&YEAR(A16)&\"'\"&\"!$B$7:$HA$7\"),0)-DAY(A16)-2),\nSMALL(IF((OFFSET(INDIRECT(\"'\"&INT((MONTH(A16)-1)/6)+1&IF(INT((MONTH(A16)-1)/6)+1=1,\"ER SEMESTRE \",\"EME SEMESTRE \")&YEAR(A16)&\"'\"&\"!$B$9:$B$43\"),0,MATCH($A16,INDIRECT(\"'\"&INT((MONTH(A16)-1)/6)+1&IF(INT((MONTH(A16)-1)/6)+1=1,\"ER SEMESTRE \",\"EME SEMESTRE \")&YEAR(A16)&\"'\"&\"!$B$7:$HA$7\"),0)-DAY(A16)-1)=\"(\"&$G$9&\")\")*(INDEX(INDIRECT(\"'\"&INT((MONTH(A16)-1)/6)+1&IF(INT((MONTH(A16)-1)/6)+1=1,\"ER SEMESTRE \",\"EME SEMESTRE \")&YEAR(A16)&\"'\"&\"!$B$9:$HA$43\"),0,MATCH($A16,INDIRECT(\"'\"&INT((MONTH(A16)-1)/6)+1&IF(INT((MONTH(A16)-1)/6)+1=1,\"ER SEMESTRE \",\"EME SEMESTRE \")&YEAR(A16)&\"'\"&\"!$B$7:$HA$7\"),0))=\"R\"),ROW(INDIRECT(\"'\"&INT((MONTH(A16)-1)/6)+1&IF(INT((MONTH(A16)-1)/6)+1=1,\"ER SEMESTRE \",\"EME SEMESTRE \")&YEAR(A16)&\"'\"&\"!D$9:D$43\"))-8,9^9),3)),\"\"),\n\n\nIFERROR(\nINDEX(OFFSET(INDIRECT(\"'\"&INT((MONTH(A16)-1)/6)+1&IF(INT((MONTH(A16)-1)/6)+1=1,\"ER SEMESTRE \",\"EME SEMESTRE \")&YEAR(A16)&\"'\"&\"!$B$9:$B$43\"),0,MATCH($A16,INDIRECT(\"'\"&INT((MONTH(A16)-1)/6)+1&IF(INT((MONTH(A16)-1)/6)+1=1,\"ER SEMESTRE \",\"EME SEMESTRE \")&YEAR(A16)&\"'\"&\"!$B$7:$HA$7\"),0)-DAY(A16)-2),\nSMALL(IF((OFFSET(INDIRECT(\"'\"&INT((MONTH(A16)-1)/6)+1&IF(INT((MONTH(A16)-1)/6)+1=1,\"ER SEMESTRE \",\"EME SEMESTRE \")&YEAR(A16)&\"'\"&\"!$B$9:$B$43\"),0,MATCH($A16,INDIRECT(\"'\"&INT((MONTH(A16)-1)/6)+1&IF(INT((MONTH(A16)-1)/6)+1=1,\"ER SEMESTRE \",\"EME SEMESTRE \")&YEAR(A16)&\"'\"&\"!$B$7:$HA$7\"),0)-DAY(A16)-1)=\"(\"&$G$9&\")\")*(INDEX(INDIRECT(\"'\"&INT((MONTH(A16)-1)/6)+1&IF(INT((MONTH(A16)-1)/6)+1=1,\"ER SEMESTRE \",\"EME SEMESTRE \")&YEAR(A16)&\"'\"&\"!$B$9:$HA$43\"),0,MATCH($A16,INDIRECT(\"'\"&INT((MONTH(A16)-1)/6)+1&IF(INT((MONTH(A16)-1)/6)+1=1,\"ER SEMESTRE \",\"EME SEMESTRE \")&YEAR(A16)&\"'\"&\"!$B$7:$HA$7\"),0))=\"R\"),ROW(INDIRECT(\"'\"&INT((MONTH(A16)-1)/6)+1&IF(INT((MONTH(A16)-1)/6)+1=1,\"ER SEMESTRE \",\"EME SEMESTRE \")&YEAR(A16)&\"'\"&\"!D$9:D$43\"))-8,9^9),2)),\"\")\n\n),\n\n\"\")","v":"PDO"}]
[{"$f":"IF(A16=\"\",\"\",IF(A16>=$C$12,\"\",A16+1))","v":"2015-10-11"},{"$f":"IFERROR(INDEX([3]PLANNING!$D$3:$Y$29,MATCH('[3]F_Dde de remplacement'!$G$8,[3]PLANNING!$B$3:$B$29,0),MATCH('[3]F_Dde de remplacement'!$A17,[3]PLANNING!$D$2:$Y$2,0)),\"\")","v":"R1"},{"$f":"IF(OR($B17=\"M\",$B17=\"N\",$B17=\"A\"),IFERROR(INDEX(OFFSET(INDIRECT(\"'\"&INT((MONTH(A17)-1)/6)+1&IF(INT((MONTH(A17)-1)/6)+1=1,\"ER SEMESTRE \",\"EME SEMESTRE \")&YEAR(A17)&\"'\"&\"!$B$9:$B$43\"),0,MATCH($A17,INDIRECT(\"'\"&INT((MONTH(A17)-1)/6)+1&IF(INT((MONTH(A17)-1)/6)+1=1,\"ER SEMESTRE \",\"EME SEMESTRE \")&YEAR(A17)&\"'\"&\"!$B$7:$HA$7\"),0)-DAY(A17)-2),MIN(IF((OFFSET(INDIRECT(\"'\"&INT((MONTH(A17)-1)/6)+1&IF(INT((MONTH(A17)-1)/6)+1=1,\"ER SEMESTRE \",\"EME SEMESTRE \")&YEAR(A17)&\"'\"&\"!$B$9:$B$43\"),0,MATCH($A17,INDIRECT(\"'\"&INT((MONTH(A17)-1)/6)+1&IF(INT((MONTH(A17)-1)/6)+1=1,\"ER SEMESTRE \",\"EME SEMESTRE \")&YEAR(A17)&\"'\"&\"!$B$7:$HA$7\"),0)-DAY(A17)-1)=\"(\"&$G$9&\")\")*(INDEX(INDIRECT(\"'\"&INT((MONTH(A17)-1)/6)+1&IF(INT((MONTH(A17)-1)/6)+1=1,\"ER SEMESTRE \",\"EME SEMESTRE \")&YEAR(A17)&\"'\"&\"!$B$9:$HA$43\"),0,MATCH($A17,INDIRECT(\"'\"&INT((MONTH(A17)-1)/6)+1&IF(INT((MONTH(A17)-1)/6)+1=1,\"ER SEMESTRE \",\"EME SEMESTRE \")&YEAR(A17)&\"'\"&\"!$B$7:$HA$7\"),0))=\"J\"),ROW(INDIRECT(\"'\"&INT((MONTH(A17)-1)/6)+1&IF(INT((MONTH(A17)-1)/6)+1=1,\"ER SEMESTRE \",\"EME SEMESTRE \")&YEAR(A17)&\"'\"&\"!$D$9:$D$43\"))-8,9^9))),IFERROR(INDEX(OFFSET(INDIRECT(\"'\"&INT((MONTH(A17)-1)/6)+1&IF(INT((MONTH(A17)-1)/6)+1=1,\"ER SEMESTRE \",\"EME SEMESTRE \")&YEAR(A17)&\"'\"&\"!$B$9:$B$43\"),0,MATCH($A17,INDIRECT(\"'\"&INT((MONTH(A17)-1)/6)+1&IF(INT((MONTH(A17)-1)/6)+1=1,\"ER SEMESTRE \",\"EME SEMESTRE \")&YEAR(A17)&\"'\"&\"!$B$7:$HA$7\"),0)-DAY(A17)-2),MIN(IF((OFFSET(INDIRECT(\"'\"&INT((MONTH(A17)-1)/6)+1&IF(INT((MONTH(A17)-1)/6)+1=1,\"ER SEMESTRE \",\"EME SEMESTRE \")&YEAR(A17)&\"'\"&\"!$B$9:$B$43\"),0,MATCH($A17,INDIRECT(\"'\"&INT((MONTH(A17)-1)/6)+1&IF(INT((MONTH(A17)-1)/6)+1=1,\"ER SEMESTRE \",\"EME SEMESTRE \")&YEAR(A17)&\"'\"&\"!$B$7:$HA$7\"),0)-DAY(A17)-1)=\"(\"&$G$9&\")\")*(INDEX(INDIRECT(\"'\"&INT((MONTH(A17)-1)/6)+1&IF(INT((MONTH(A17)-1)/6)+1=1,\"ER SEMESTRE \",\"EME SEMESTRE \")&YEAR(A17)&\"'\"&\"!$B$9:$HA$43\"),0,MATCH($A17,INDIRECT(\"'\"&INT((MONTH(A17)-1)/6)+1&IF(INT((MONTH(A17)-1)/6)+1=1,\"ER SEMESTRE \",\"EME SEMESTRE \")&YEAR(A17)&\"'\"&\"!$B$7:$HA$7\"),0))=\"R\"),ROW(INDIRECT(\"'\"&INT((MONTH(A17)-1)/6)+1&IF(INT((MONTH(A17)-1)/6)+1=1,\"ER SEMESTRE \",\"EME SEMESTRE \")&YEAR(A17)&\"'\"&\"!$D$9:$D$43\"))-8,9^9))),\"\")),\"\")","v":""},null,{"$f":"IF(OR($B17=\"M\",$B17=\"N\",$B17=\"A\"),IF(\nIFERROR(INDEX(OFFSET(INDIRECT(\"'\"&INT((MONTH(A17)-1)/6)+1&IF(INT((MONTH(A17)-1)/6)+1=1,\"ER SEMESTRE \",\"EME SEMESTRE \")&YEAR(A17)&\"'\"&\"!$B$9:$B$43\"),0,MATCH($A17,INDIRECT(\"'\"&INT((MONTH(A17)-1)/6)+1&IF(INT((MONTH(A17)-1)/6)+1=1,\"ER SEMESTRE \",\"EME SEMESTRE \")&YEAR(A17)&\"'\"&\"!$B$7:$HA$7\"),0)-DAY(A17)-2),MIN(IF((OFFSET(INDIRECT(\"'\"&INT((MONTH(A17)-1)/6)+1&IF(INT((MONTH(A17)-1)/6)+1=1,\"ER SEMESTRE \",\"EME SEMESTRE \")&YEAR(A17)&\"'\"&\"!$B$9:$B$43\"),0,MATCH($A17,INDIRECT(\"'\"&INT((MONTH(A17)-1)/6)+1&IF(INT((MONTH(A17)-1)/6)+1=1,\"ER SEMESTRE \",\"EME SEMESTRE \")&YEAR(A17)&\"'\"&\"!$B$7:$HA$7\"),0)-DAY(A17)-1)=\"(\"&$G$9&\")\")*(INDEX(INDIRECT(\"'\"&INT((MONTH(A17)-1)/6)+1&IF(INT((MONTH(A17)-1)/6)+1=1,\"ER SEMESTRE \",\"EME SEMESTRE \")&YEAR(A17)&\"'\"&\"!$B$9:$HA$43\"),0,MATCH($A17,INDIRECT(\"'\"&INT((MONTH(A17)-1)/6)+1&IF(INT((MONTH(A17)-1)/6)+1=1,\"ER SEMESTRE \",\"EME SEMESTRE \")&YEAR(A17)&\"'\"&\"!$B$7:$HA$7\"),0))=\"J\"),ROW(INDIRECT(\"'\"&INT((MONTH(A17)-1)/6)+1&IF(INT((MONTH(A17)-1)/6)+1=1,\"ER SEMESTRE \",\"EME SEMESTRE \")&YEAR(A17)&\"'\"&\"!$D$9:$D$43\"))-8,9^9))),\"\")=\"\",\n\nIFERROR(INDEX(OFFSET(INDIRECT(\"'\"&INT((MONTH(A17)-1)/6)+1&IF(INT((MONTH(A17)-1)/6)+1=1,\"ER SEMESTRE \",\"EME SEMESTRE \")&YEAR(A17)&\"'\"&\"!$B$9:$B$43\"),0,MATCH($A17,INDIRECT(\"'\"&INT((MONTH(A17)-1)/6)+1&IF(INT((MONTH(A17)-1)/6)+1=1,\"ER SEMESTRE \",\"EME SEMESTRE \")&YEAR(A17)&\"'\"&\"!$B$7:$HA$7\"),0)-DAY(A17)-2),SMALL(IF((OFFSET(INDIRECT(\"'\"&INT((MONTH(A17)-1)/6)+1&IF(INT((MONTH(A17)-1)/6)+1=1,\"ER SEMESTRE \",\"EME SEMESTRE \")&YEAR(A17)&\"'\"&\"!$B$9:$B$43\"),0,MATCH($A17,INDIRECT(\"'\"&INT((MONTH(A17)-1)/6)+1&IF(INT((MONTH(A17)-1)/6)+1=1,\"ER SEMESTRE \",\"EME SEMESTRE \")&YEAR(A17)&\"'\"&\"!$B$7:$HA$7\"),0)-DAY(A17)-1)=\"(\"&$G$9&\")\")*(INDEX(INDIRECT(\"'\"&INT((MONTH(A17)-1)/6)+1&IF(INT((MONTH(A17)-1)/6)+1=1,\"ER SEMESTRE \",\"EME SEMESTRE \")&YEAR(A17)&\"'\"&\"!$B$9:$HA$43\"),0,MATCH($A17,INDIRECT(\"'\"&INT((MONTH(A17)-1)/6)+1&IF(INT((MONTH(A17)-1)/6)+1=1,\"ER SEMESTRE \",\"EME SEMESTRE \")&YEAR(A17)&\"'\"&\"!$B$7:$HA$7\"),0))=\"R\"),ROW(INDIRECT(\"'\"&INT((MONTH(A17)-1)/6)+1&IF(INT((MONTH(A17)-1)/6)+1=1,\"ER SEMESTRE \",\"EME SEMESTRE \")&YEAR(A17)&\"'\"&\"!D$9:D$43\"))-8,9^9),2)),\"\"),\n\nIFERROR(\nINDEX(\nOFFSET(INDIRECT(\"'\"&INT((MONTH(A17)-1)/6)+1&IF(INT((MONTH(A17)-1)/6)+1=1,\"ER SEMESTRE \",\"EME SEMESTRE \")&YEAR(A17)&\"'\"&\"!$B$9:$B$43\"),0,MATCH($A17,INDIRECT(\"'\"&INT((MONTH(A17)-1)/6)+1&IF(INT((MONTH(A17)-1)/6)+1=1,\"ER SEMESTRE \",\"EME SEMESTRE \")&YEAR(A17)&\"'\"&\"!$B$7:$HA$7\"),0)-DAY(A17)-2),\n\nMIN(IF(\n(OFFSET(INDIRECT(\"'\"&INT((MONTH(A17)-1)/6)+1&IF(INT((MONTH(A17)-1)/6)+1=1,\"ER SEMESTRE \",\"EME SEMESTRE \")&YEAR(A17)&\"'\"&\"!$B$9:$B$43\"),0,MATCH($A17,INDIRECT(\"'\"&INT((MONTH(A17)-1)/6)+1&IF(INT((MONTH(A17)-1)/6)+1=1,\"ER SEMESTRE \",\"EME SEMESTRE \")&YEAR(A17)&\"'\"&\"!$B$7:$HA$7\"),0)-DAY(A17)-1)=\"(\"&$G$9&\")\")\n*\n(INDEX(INDIRECT(\"'\"&INT((MONTH(A17)-1)/6)+1&IF(INT((MONTH(A17)-1)/6)+1=1,\"ER SEMESTRE \",\"EME SEMESTRE \")&YEAR(A17)&\"'\"&\"!$B$9:$HA$43\"),0,MATCH($A17,INDIRECT(\"'\"&INT((MONTH(A17)-1)/6)+1&IF(INT((MONTH(A17)-1)/6)+1=1,\"ER SEMESTRE \",\"EME SEMESTRE \")&YEAR(A17)&\"'\"&\"!$B$7:$HA$7\"),0))=\"R\"),\n\nROW(INDIRECT(\"'\"&INT((MONTH(A17)-1)/6)+1&IF(INT((MONTH(A17)-1)/6)+1=1,\"ER SEMESTRE \",\"EME SEMESTRE \")&YEAR(A17)&\"'\"&\"!D$9:D$43\"))-8,\n\n9^9))),\"\")),\"\")","v":""},null,{"$f":"IF(OR($B17=\"M\",$B17=\"N\",$B17=\"A\"),IF(\n\nIFERROR(INDEX(OFFSET(INDIRECT(\"'\"&INT((MONTH(A17)-1)/6)+1&IF(INT((MONTH(A17)-1)/6)+1=1,\"ER SEMESTRE \",\"EME SEMESTRE \")&YEAR(A17)&\"'\"&\"!$B$9:$B$43\"),0,MATCH($A17,INDIRECT(\"'\"&INT((MONTH(A17)-1)/6)+1&IF(INT((MONTH(A17)-1)/6)+1=1,\"ER SEMESTRE \",\"EME SEMESTRE \")&YEAR(A17)&\"'\"&\"!$B$7:$HA$7\"),0)-DAY(A17)-2),MIN(IF((OFFSET(INDIRECT(\"'\"&INT((MONTH(A17)-1)/6)+1&IF(INT((MONTH(A17)-1)/6)+1=1,\"ER SEMESTRE \",\"EME SEMESTRE \")&YEAR(A17)&\"'\"&\"!$B$9:$B$43\"),0,MATCH($A17,INDIRECT(\"'\"&INT((MONTH(A17)-1)/6)+1&IF(INT((MONTH(A17)-1)/6)+1=1,\"ER SEMESTRE \",\"EME SEMESTRE \")&YEAR(A17)&\"'\"&\"!$B$7:$HA$7\"),0)-DAY(A17)-1)=\"(\"&$G$9&\")\")*(INDEX(INDIRECT(\"'\"&INT((MONTH(A17)-1)/6)+1&IF(INT((MONTH(A17)-1)/6)+1=1,\"ER SEMESTRE \",\"EME SEMESTRE \")&YEAR(A17)&\"'\"&\"!$B$9:$HA$43\"),0,MATCH($A17,INDIRECT(\"'\"&INT((MONTH(A17)-1)/6)+1&IF(INT((MONTH(A17)-1)/6)+1=1,\"ER SEMESTRE \",\"EME SEMESTRE \")&YEAR(A17)&\"'\"&\"!$B$7:$HA$7\"),0))=\"J\"),ROW(INDIRECT(\"'\"&INT((MONTH(A17)-1)/6)+1&IF(INT((MONTH(A17)-1)/6)+1=1,\"ER SEMESTRE \",\"EME SEMESTRE \")&YEAR(A17)&\"'\"&\"!$D$9:$D$43\"))-8,9^9))),\"\")=\"\",\n\nIFERROR(\nINDEX(OFFSET(INDIRECT(\"'\"&INT((MONTH(A17)-1)/6)+1&IF(INT((MONTH(A17)-1)/6)+1=1,\"ER SEMESTRE \",\"EME SEMESTRE \")&YEAR(A17)&\"'\"&\"!$B$9:$B$43\"),0,MATCH($A17,INDIRECT(\"'\"&INT((MONTH(A17)-1)/6)+1&IF(INT((MONTH(A17)-1)/6)+1=1,\"ER SEMESTRE \",\"EME SEMESTRE \")&YEAR(A17)&\"'\"&\"!$B$7:$HA$7\"),0)-DAY(A17)-2),\nSMALL(IF((OFFSET(INDIRECT(\"'\"&INT((MONTH(A17)-1)/6)+1&IF(INT((MONTH(A17)-1)/6)+1=1,\"ER SEMESTRE \",\"EME SEMESTRE \")&YEAR(A17)&\"'\"&\"!$B$9:$B$43\"),0,MATCH($A17,INDIRECT(\"'\"&INT((MONTH(A17)-1)/6)+1&IF(INT((MONTH(A17)-1)/6)+1=1,\"ER SEMESTRE \",\"EME SEMESTRE \")&YEAR(A17)&\"'\"&\"!$B$7:$HA$7\"),0)-DAY(A17)-1)=\"(\"&$G$9&\")\")*(INDEX(INDIRECT(\"'\"&INT((MONTH(A17)-1)/6)+1&IF(INT((MONTH(A17)-1)/6)+1=1,\"ER SEMESTRE \",\"EME SEMESTRE \")&YEAR(A17)&\"'\"&\"!$B$9:$HA$43\"),0,MATCH($A17,INDIRECT(\"'\"&INT((MONTH(A17)-1)/6)+1&IF(INT((MONTH(A17)-1)/6)+1=1,\"ER SEMESTRE \",\"EME SEMESTRE \")&YEAR(A17)&\"'\"&\"!$B$7:$HA$7\"),0))=\"R\"),ROW(INDIRECT(\"'\"&INT((MONTH(A17)-1)/6)+1&IF(INT((MONTH(A17)-1)/6)+1=1,\"ER SEMESTRE \",\"EME SEMESTRE \")&YEAR(A17)&\"'\"&\"!D$9:D$43\"))-8,9^9),3)),\"\"),\n\n\nIFERROR(\nINDEX(OFFSET(INDIRECT(\"'\"&INT((MONTH(A17)-1)/6)+1&IF(INT((MONTH(A17)-1)/6)+1=1,\"ER SEMESTRE \",\"EME SEMESTRE \")&YEAR(A17)&\"'\"&\"!$B$9:$B$43\"),0,MATCH($A17,INDIRECT(\"'\"&INT((MONTH(A17)-1)/6)+1&IF(INT((MONTH(A17)-1)/6)+1=1,\"ER SEMESTRE \",\"EME SEMESTRE \")&YEAR(A17)&\"'\"&\"!$B$7:$HA$7\"),0)-DAY(A17)-2),\nSMALL(IF((OFFSET(INDIRECT(\"'\"&INT((MONTH(A17)-1)/6)+1&IF(INT((MONTH(A17)-1)/6)+1=1,\"ER SEMESTRE \",\"EME SEMESTRE \")&YEAR(A17)&\"'\"&\"!$B$9:$B$43\"),0,MATCH($A17,INDIRECT(\"'\"&INT((MONTH(A17)-1)/6)+1&IF(INT((MONTH(A17)-1)/6)+1=1,\"ER SEMESTRE \",\"EME SEMESTRE \")&YEAR(A17)&\"'\"&\"!$B$7:$HA$7\"),0)-DAY(A17)-1)=\"(\"&$G$9&\")\")*(INDEX(INDIRECT(\"'\"&INT((MONTH(A17)-1)/6)+1&IF(INT((MONTH(A17)-1)/6)+1=1,\"ER SEMESTRE \",\"EME SEMESTRE \")&YEAR(A17)&\"'\"&\"!$B$9:$HA$43\"),0,MATCH($A17,INDIRECT(\"'\"&INT((MONTH(A17)-1)/6)+1&IF(INT((MONTH(A17)-1)/6)+1=1,\"ER SEMESTRE \",\"EME SEMESTRE \")&YEAR(A17)&\"'\"&\"!$B$7:$HA$7\"),0))=\"R\"),ROW(INDIRECT(\"'\"&INT((MONTH(A17)-1)/6)+1&IF(INT((MONTH(A17)-1)/6)+1=1,\"ER SEMESTRE \",\"EME SEMESTRE \")&YEAR(A17)&\"'\"&\"!D$9:D$43\"))-8,9^9),2)),\"\")\n\n),\n\n\"\")","v":""}]
[{"$f":"IF(A17=\"\",\"\",IF(A17>=$C$12,\"\",A17+1))","v":"2015-10-12"},{"$f":"IFERROR(INDEX([3]PLANNING!$D$3:$Y$29,MATCH('[3]F_Dde de remplacement'!$G$8,[3]PLANNING!$B$3:$B$29,0),MATCH('[3]F_Dde de remplacement'!$A18,[3]PLANNING!$D$2:$Y$2,0)),\"\")","v":"R2"},{"$f":"IF(OR($B18=\"M\",$B18=\"N\",$B18=\"A\"),IFERROR(INDEX(OFFSET(INDIRECT(\"'\"&INT((MONTH(A18)-1)/6)+1&IF(INT((MONTH(A18)-1)/6)+1=1,\"ER SEMESTRE \",\"EME SEMESTRE \")&YEAR(A18)&\"'\"&\"!$B$9:$B$43\"),0,MATCH($A18,INDIRECT(\"'\"&INT((MONTH(A18)-1)/6)+1&IF(INT((MONTH(A18)-1)/6)+1=1,\"ER SEMESTRE \",\"EME SEMESTRE \")&YEAR(A18)&\"'\"&\"!$B$7:$HA$7\"),0)-DAY(A18)-2),MIN(IF((OFFSET(INDIRECT(\"'\"&INT((MONTH(A18)-1)/6)+1&IF(INT((MONTH(A18)-1)/6)+1=1,\"ER SEMESTRE \",\"EME SEMESTRE \")&YEAR(A18)&\"'\"&\"!$B$9:$B$43\"),0,MATCH($A18,INDIRECT(\"'\"&INT((MONTH(A18)-1)/6)+1&IF(INT((MONTH(A18)-1)/6)+1=1,\"ER SEMESTRE \",\"EME SEMESTRE \")&YEAR(A18)&\"'\"&\"!$B$7:$HA$7\"),0)-DAY(A18)-1)=\"(\"&$G$9&\")\")*(INDEX(INDIRECT(\"'\"&INT((MONTH(A18)-1)/6)+1&IF(INT((MONTH(A18)-1)/6)+1=1,\"ER SEMESTRE \",\"EME SEMESTRE \")&YEAR(A18)&\"'\"&\"!$B$9:$HA$43\"),0,MATCH($A18,INDIRECT(\"'\"&INT((MONTH(A18)-1)/6)+1&IF(INT((MONTH(A18)-1)/6)+1=1,\"ER SEMESTRE \",\"EME SEMESTRE \")&YEAR(A18)&\"'\"&\"!$B$7:$HA$7\"),0))=\"J\"),ROW(INDIRECT(\"'\"&INT((MONTH(A18)-1)/6)+1&IF(INT((MONTH(A18)-1)/6)+1=1,\"ER SEMESTRE \",\"EME SEMESTRE \")&YEAR(A18)&\"'\"&\"!$D$9:$D$43\"))-8,9^9))),IFERROR(INDEX(OFFSET(INDIRECT(\"'\"&INT((MONTH(A18)-1)/6)+1&IF(INT((MONTH(A18)-1)/6)+1=1,\"ER SEMESTRE \",\"EME SEMESTRE \")&YEAR(A18)&\"'\"&\"!$B$9:$B$43\"),0,MATCH($A18,INDIRECT(\"'\"&INT((MONTH(A18)-1)/6)+1&IF(INT((MONTH(A18)-1)/6)+1=1,\"ER SEMESTRE \",\"EME SEMESTRE \")&YEAR(A18)&\"'\"&\"!$B$7:$HA$7\"),0)-DAY(A18)-2),MIN(IF((OFFSET(INDIRECT(\"'\"&INT((MONTH(A18)-1)/6)+1&IF(INT((MONTH(A18)-1)/6)+1=1,\"ER SEMESTRE \",\"EME SEMESTRE \")&YEAR(A18)&\"'\"&\"!$B$9:$B$43\"),0,MATCH($A18,INDIRECT(\"'\"&INT((MONTH(A18)-1)/6)+1&IF(INT((MONTH(A18)-1)/6)+1=1,\"ER SEMESTRE \",\"EME SEMESTRE \")&YEAR(A18)&\"'\"&\"!$B$7:$HA$7\"),0)-DAY(A18)-1)=\"(\"&$G$9&\")\")*(INDEX(INDIRECT(\"'\"&INT((MONTH(A18)-1)/6)+1&IF(INT((MONTH(A18)-1)/6)+1=1,\"ER SEMESTRE \",\"EME SEMESTRE \")&YEAR(A18)&\"'\"&\"!$B$9:$HA$43\"),0,MATCH($A18,INDIRECT(\"'\"&INT((MONTH(A18)-1)/6)+1&IF(INT((MONTH(A18)-1)/6)+1=1,\"ER SEMESTRE \",\"EME SEMESTRE \")&YEAR(A18)&\"'\"&\"!$B$7:$HA$7\"),0))=\"R\"),ROW(INDIRECT(\"'\"&INT((MONTH(A18)-1)/6)+1&IF(INT((MONTH(A18)-1)/6)+1=1,\"ER SEMESTRE \",\"EME SEMESTRE \")&YEAR(A18)&\"'\"&\"!$D$9:$D$43\"))-8,9^9))),\"\")),\"\")","v":""},null,{"$f":"IF(OR($B18=\"M\",$B18=\"N\",$B18=\"A\"),IF(\nIFERROR(INDEX(OFFSET(INDIRECT(\"'\"&INT((MONTH(A18)-1)/6)+1&IF(INT((MONTH(A18)-1)/6)+1=1,\"ER SEMESTRE \",\"EME SEMESTRE \")&YEAR(A18)&\"'\"&\"!$B$9:$B$43\"),0,MATCH($A18,INDIRECT(\"'\"&INT((MONTH(A18)-1)/6)+1&IF(INT((MONTH(A18)-1)/6)+1=1,\"ER SEMESTRE \",\"EME SEMESTRE \")&YEAR(A18)&\"'\"&\"!$B$7:$HA$7\"),0)-DAY(A18)-2),MIN(IF((OFFSET(INDIRECT(\"'\"&INT((MONTH(A18)-1)/6)+1&IF(INT((MONTH(A18)-1)/6)+1=1,\"ER SEMESTRE \",\"EME SEMESTRE \")&YEAR(A18)&\"'\"&\"!$B$9:$B$43\"),0,MATCH($A18,INDIRECT(\"'\"&INT((MONTH(A18)-1)/6)+1&IF(INT((MONTH(A18)-1)/6)+1=1,\"ER SEMESTRE \",\"EME SEMESTRE \")&YEAR(A18)&\"'\"&\"!$B$7:$HA$7\"),0)-DAY(A18)-1)=\"(\"&$G$9&\")\")*(INDEX(INDIRECT(\"'\"&INT((MONTH(A18)-1)/6)+1&IF(INT((MONTH(A18)-1)/6)+1=1,\"ER SEMESTRE \",\"EME SEMESTRE \")&YEAR(A18)&\"'\"&\"!$B$9:$HA$43\"),0,MATCH($A18,INDIRECT(\"'\"&INT((MONTH(A18)-1)/6)+1&IF(INT((MONTH(A18)-1)/6)+1=1,\"ER SEMESTRE \",\"EME SEMESTRE \")&YEAR(A18)&\"'\"&\"!$B$7:$HA$7\"),0))=\"J\"),ROW(INDIRECT(\"'\"&INT((MONTH(A18)-1)/6)+1&IF(INT((MONTH(A18)-1)/6)+1=1,\"ER SEMESTRE \",\"EME SEMESTRE \")&YEAR(A18)&\"'\"&\"!$D$9:$D$43\"))-8,9^9))),\"\")=\"\",\n\nIFERROR(INDEX(OFFSET(INDIRECT(\"'\"&INT((MONTH(A18)-1)/6)+1&IF(INT((MONTH(A18)-1)/6)+1=1,\"ER SEMESTRE \",\"EME SEMESTRE \")&YEAR(A18)&\"'\"&\"!$B$9:$B$43\"),0,MATCH($A18,INDIRECT(\"'\"&INT((MONTH(A18)-1)/6)+1&IF(INT((MONTH(A18)-1)/6)+1=1,\"ER SEMESTRE \",\"EME SEMESTRE \")&YEAR(A18)&\"'\"&\"!$B$7:$HA$7\"),0)-DAY(A18)-2),SMALL(IF((OFFSET(INDIRECT(\"'\"&INT((MONTH(A18)-1)/6)+1&IF(INT((MONTH(A18)-1)/6)+1=1,\"ER SEMESTRE \",\"EME SEMESTRE \")&YEAR(A18)&\"'\"&\"!$B$9:$B$43\"),0,MATCH($A18,INDIRECT(\"'\"&INT((MONTH(A18)-1)/6)+1&IF(INT((MONTH(A18)-1)/6)+1=1,\"ER SEMESTRE \",\"EME SEMESTRE \")&YEAR(A18)&\"'\"&\"!$B$7:$HA$7\"),0)-DAY(A18)-1)=\"(\"&$G$9&\")\")*(INDEX(INDIRECT(\"'\"&INT((MONTH(A18)-1)/6)+1&IF(INT((MONTH(A18)-1)/6)+1=1,\"ER SEMESTRE \",\"EME SEMESTRE \")&YEAR(A18)&\"'\"&\"!$B$9:$HA$43\"),0,MATCH($A18,INDIRECT(\"'\"&INT((MONTH(A18)-1)/6)+1&IF(INT((MONTH(A18)-1)/6)+1=1,\"ER SEMESTRE \",\"EME SEMESTRE \")&YEAR(A18)&\"'\"&\"!$B$7:$HA$7\"),0))=\"R\"),ROW(INDIRECT(\"'\"&INT((MONTH(A18)-1)/6)+1&IF(INT((MONTH(A18)-1)/6)+1=1,\"ER SEMESTRE \",\"EME SEMESTRE \")&YEAR(A18)&\"'\"&\"!D$9:D$43\"))-8,9^9),2)),\"\"),\n\nIFERROR(\nINDEX(\nOFFSET(INDIRECT(\"'\"&INT((MONTH(A18)-1)/6)+1&IF(INT((MONTH(A18)-1)/6)+1=1,\"ER SEMESTRE \",\"EME SEMESTRE \")&YEAR(A18)&\"'\"&\"!$B$9:$B$43\"),0,MATCH($A18,INDIRECT(\"'\"&INT((MONTH(A18)-1)/6)+1&IF(INT((MONTH(A18)-1)/6)+1=1,\"ER SEMESTRE \",\"EME SEMESTRE \")&YEAR(A18)&\"'\"&\"!$B$7:$HA$7\"),0)-DAY(A18)-2),\n\nMIN(IF(\n(OFFSET(INDIRECT(\"'\"&INT((MONTH(A18)-1)/6)+1&IF(INT((MONTH(A18)-1)/6)+1=1,\"ER SEMESTRE \",\"EME SEMESTRE \")&YEAR(A18)&\"'\"&\"!$B$9:$B$43\"),0,MATCH($A18,INDIRECT(\"'\"&INT((MONTH(A18)-1)/6)+1&IF(INT((MONTH(A18)-1)/6)+1=1,\"ER SEMESTRE \",\"EME SEMESTRE \")&YEAR(A18)&\"'\"&\"!$B$7:$HA$7\"),0)-DAY(A18)-1)=\"(\"&$G$9&\")\")\n*\n(INDEX(INDIRECT(\"'\"&INT((MONTH(A18)-1)/6)+1&IF(INT((MONTH(A18)-1)/6)+1=1,\"ER SEMESTRE \",\"EME SEMESTRE \")&YEAR(A18)&\"'\"&\"!$B$9:$HA$43\"),0,MATCH($A18,INDIRECT(\"'\"&INT((MONTH(A18)-1)/6)+1&IF(INT((MONTH(A18)-1)/6)+1=1,\"ER SEMESTRE \",\"EME SEMESTRE \")&YEAR(A18)&\"'\"&\"!$B$7:$HA$7\"),0))=\"R\"),\n\nROW(INDIRECT(\"'\"&INT((MONTH(A18)-1)/6)+1&IF(INT((MONTH(A18)-1)/6)+1=1,\"ER SEMESTRE \",\"EME SEMESTRE \")&YEAR(A18)&\"'\"&\"!D$9:D$43\"))-8,\n\n9^9))),\"\")),\"\")","v":""},null,{"$f":"IF(OR($B18=\"M\",$B18=\"N\",$B18=\"A\"),IF(\n\nIFERROR(INDEX(OFFSET(INDIRECT(\"'\"&INT((MONTH(A18)-1)/6)+1&IF(INT((MONTH(A18)-1)/6)+1=1,\"ER SEMESTRE \",\"EME SEMESTRE \")&YEAR(A18)&\"'\"&\"!$B$9:$B$43\"),0,MATCH($A18,INDIRECT(\"'\"&INT((MONTH(A18)-1)/6)+1&IF(INT((MONTH(A18)-1)/6)+1=1,\"ER SEMESTRE \",\"EME SEMESTRE \")&YEAR(A18)&\"'\"&\"!$B$7:$HA$7\"),0)-DAY(A18)-2),MIN(IF((OFFSET(INDIRECT(\"'\"&INT((MONTH(A18)-1)/6)+1&IF(INT((MONTH(A18)-1)/6)+1=1,\"ER SEMESTRE \",\"EME SEMESTRE \")&YEAR(A18)&\"'\"&\"!$B$9:$B$43\"),0,MATCH($A18,INDIRECT(\"'\"&INT((MONTH(A18)-1)/6)+1&IF(INT((MONTH(A18)-1)/6)+1=1,\"ER SEMESTRE \",\"EME SEMESTRE \")&YEAR(A18)&\"'\"&\"!$B$7:$HA$7\"),0)-DAY(A18)-1)=\"(\"&$G$9&\")\")*(INDEX(INDIRECT(\"'\"&INT((MONTH(A18)-1)/6)+1&IF(INT((MONTH(A18)-1)/6)+1=1,\"ER SEMESTRE \",\"EME SEMESTRE \")&YEAR(A18)&\"'\"&\"!$B$9:$HA$43\"),0,MATCH($A18,INDIRECT(\"'\"&INT((MONTH(A18)-1)/6)+1&IF(INT((MONTH(A18)-1)/6)+1=1,\"ER SEMESTRE \",\"EME SEMESTRE \")&YEAR(A18)&\"'\"&\"!$B$7:$HA$7\"),0))=\"J\"),ROW(INDIRECT(\"'\"&INT((MONTH(A18)-1)/6)+1&IF(INT((MONTH(A18)-1)/6)+1=1,\"ER SEMESTRE \",\"EME SEMESTRE \")&YEAR(A18)&\"'\"&\"!$D$9:$D$43\"))-8,9^9))),\"\")=\"\",\n\nIFERROR(\nINDEX(OFFSET(INDIRECT(\"'\"&INT((MONTH(A18)-1)/6)+1&IF(INT((MONTH(A18)-1)/6)+1=1,\"ER SEMESTRE \",\"EME SEMESTRE \")&YEAR(A18)&\"'\"&\"!$B$9:$B$43\"),0,MATCH($A18,INDIRECT(\"'\"&INT((MONTH(A18)-1)/6)+1&IF(INT((MONTH(A18)-1)/6)+1=1,\"ER SEMESTRE \",\"EME SEMESTRE \")&YEAR(A18)&\"'\"&\"!$B$7:$HA$7\"),0)-DAY(A18)-2),\nSMALL(IF((OFFSET(INDIRECT(\"'\"&INT((MONTH(A18)-1)/6)+1&IF(INT((MONTH(A18)-1)/6)+1=1,\"ER SEMESTRE \",\"EME SEMESTRE \")&YEAR(A18)&\"'\"&\"!$B$9:$B$43\"),0,MATCH($A18,INDIRECT(\"'\"&INT((MONTH(A18)-1)/6)+1&IF(INT((MONTH(A18)-1)/6)+1=1,\"ER SEMESTRE \",\"EME SEMESTRE \")&YEAR(A18)&\"'\"&\"!$B$7:$HA$7\"),0)-DAY(A18)-1)=\"(\"&$G$9&\")\")*(INDEX(INDIRECT(\"'\"&INT((MONTH(A18)-1)/6)+1&IF(INT((MONTH(A18)-1)/6)+1=1,\"ER SEMESTRE \",\"EME SEMESTRE \")&YEAR(A18)&\"'\"&\"!$B$9:$HA$43\"),0,MATCH($A18,INDIRECT(\"'\"&INT((MONTH(A18)-1)/6)+1&IF(INT((MONTH(A18)-1)/6)+1=1,\"ER SEMESTRE \",\"EME SEMESTRE \")&YEAR(A18)&\"'\"&\"!$B$7:$HA$7\"),0))=\"R\"),ROW(INDIRECT(\"'\"&INT((MONTH(A18)-1)/6)+1&IF(INT((MONTH(A18)-1)/6)+1=1,\"ER SEMESTRE \",\"EME SEMESTRE \")&YEAR(A18)&\"'\"&\"!D$9:D$43\"))-8,9^9),3)),\"\"),\n\n\nIFERROR(\nINDEX(OFFSET(INDIRECT(\"'\"&INT((MONTH(A18)-1)/6)+1&IF(INT((MONTH(A18)-1)/6)+1=1,\"ER SEMESTRE \",\"EME SEMESTRE \")&YEAR(A18)&\"'\"&\"!$B$9:$B$43\"),0,MATCH($A18,INDIRECT(\"'\"&INT((MONTH(A18)-1)/6)+1&IF(INT((MONTH(A18)-1)/6)+1=1,\"ER SEMESTRE \",\"EME SEMESTRE \")&YEAR(A18)&\"'\"&\"!$B$7:$HA$7\"),0)-DAY(A18)-2),\nSMALL(IF((OFFSET(INDIRECT(\"'\"&INT((MONTH(A18)-1)/6)+1&IF(INT((MONTH(A18)-1)/6)+1=1,\"ER SEMESTRE \",\"EME SEMESTRE \")&YEAR(A18)&\"'\"&\"!$B$9:$B$43\"),0,MATCH($A18,INDIRECT(\"'\"&INT((MONTH(A18)-1)/6)+1&IF(INT((MONTH(A18)-1)/6)+1=1,\"ER SEMESTRE \",\"EME SEMESTRE \")&YEAR(A18)&\"'\"&\"!$B$7:$HA$7\"),0)-DAY(A18)-1)=\"(\"&$G$9&\")\")*(INDEX(INDIRECT(\"'\"&INT((MONTH(A18)-1)/6)+1&IF(INT((MONTH(A18)-1)/6)+1=1,\"ER SEMESTRE \",\"EME SEMESTRE \")&YEAR(A18)&\"'\"&\"!$B$9:$HA$43\"),0,MATCH($A18,INDIRECT(\"'\"&INT((MONTH(A18)-1)/6)+1&IF(INT((MONTH(A18)-1)/6)+1=1,\"ER SEMESTRE \",\"EME SEMESTRE \")&YEAR(A18)&\"'\"&\"!$B$7:$HA$7\"),0))=\"R\"),ROW(INDIRECT(\"'\"&INT((MONTH(A18)-1)/6)+1&IF(INT((MONTH(A18)-1)/6)+1=1,\"ER SEMESTRE \",\"EME SEMESTRE \")&YEAR(A18)&\"'\"&\"!D$9:D$43\"))-8,9^9),2)),\"\")\n\n),\n\n\"\")","v":""}]
["2015-10-13",{"$f":"IFERROR(INDEX([3]PLANNING!$D$3:$Y$29,MATCH('[3]F_Dde de remplacement'!$G$8,[3]PLANNING!$B$3:$B$29,0),MATCH('[3]F_Dde de remplacement'!$A19,[3]PLANNING!$D$2:$Y$2,0)),\"\")","v":"R"},{"$f":"IF(OR($B19=\"M\",$B19=\"N\",$B19=\"A\"),IFERROR(INDEX(OFFSET(INDIRECT(\"'\"&INT((MONTH(A19)-1)/6)+1&IF(INT((MONTH(A19)-1)/6)+1=1,\"ER SEMESTRE \",\"EME SEMESTRE \")&YEAR(A19)&\"'\"&\"!$B$9:$B$43\"),0,MATCH($A19,INDIRECT(\"'\"&INT((MONTH(A19)-1)/6)+1&IF(INT((MONTH(A19)-1)/6)+1=1,\"ER SEMESTRE \",\"EME SEMESTRE \")&YEAR(A19)&\"'\"&\"!$B$7:$HA$7\"),0)-DAY(A19)-2),MIN(IF((OFFSET(INDIRECT(\"'\"&INT((MONTH(A19)-1)/6)+1&IF(INT((MONTH(A19)-1)/6)+1=1,\"ER SEMESTRE \",\"EME SEMESTRE \")&YEAR(A19)&\"'\"&\"!$B$9:$B$43\"),0,MATCH($A19,INDIRECT(\"'\"&INT((MONTH(A19)-1)/6)+1&IF(INT((MONTH(A19)-1)/6)+1=1,\"ER SEMESTRE \",\"EME SEMESTRE \")&YEAR(A19)&\"'\"&\"!$B$7:$HA$7\"),0)-DAY(A19)-1)=\"(\"&$G$9&\")\")*(INDEX(INDIRECT(\"'\"&INT((MONTH(A19)-1)/6)+1&IF(INT((MONTH(A19)-1)/6)+1=1,\"ER SEMESTRE \",\"EME SEMESTRE \")&YEAR(A19)&\"'\"&\"!$B$9:$HA$43\"),0,MATCH($A19,INDIRECT(\"'\"&INT((MONTH(A19)-1)/6)+1&IF(INT((MONTH(A19)-1)/6)+1=1,\"ER SEMESTRE \",\"EME SEMESTRE \")&YEAR(A19)&\"'\"&\"!$B$7:$HA$7\"),0))=\"J\"),ROW(INDIRECT(\"'\"&INT((MONTH(A19)-1)/6)+1&IF(INT((MONTH(A19)-1)/6)+1=1,\"ER SEMESTRE \",\"EME SEMESTRE \")&YEAR(A19)&\"'\"&\"!$D$9:$D$43\"))-8,9^9))),IFERROR(INDEX(OFFSET(INDIRECT(\"'\"&INT((MONTH(A19)-1)/6)+1&IF(INT((MONTH(A19)-1)/6)+1=1,\"ER SEMESTRE \",\"EME SEMESTRE \")&YEAR(A19)&\"'\"&\"!$B$9:$B$43\"),0,MATCH($A19,INDIRECT(\"'\"&INT((MONTH(A19)-1)/6)+1&IF(INT((MONTH(A19)-1)/6)+1=1,\"ER SEMESTRE \",\"EME SEMESTRE \")&YEAR(A19)&\"'\"&\"!$B$7:$HA$7\"),0)-DAY(A19)-2),MIN(IF((OFFSET(INDIRECT(\"'\"&INT((MONTH(A19)-1)/6)+1&IF(INT((MONTH(A19)-1)/6)+1=1,\"ER SEMESTRE \",\"EME SEMESTRE \")&YEAR(A19)&\"'\"&\"!$B$9:$B$43\"),0,MATCH($A19,INDIRECT(\"'\"&INT((MONTH(A19)-1)/6)+1&IF(INT((MONTH(A19)-1)/6)+1=1,\"ER SEMESTRE \",\"EME SEMESTRE \")&YEAR(A19)&\"'\"&\"!$B$7:$HA$7\"),0)-DAY(A19)-1)=\"(\"&$G$9&\")\")*(INDEX(INDIRECT(\"'\"&INT((MONTH(A19)-1)/6)+1&IF(INT((MONTH(A19)-1)/6)+1=1,\"ER SEMESTRE \",\"EME SEMESTRE \")&YEAR(A19)&\"'\"&\"!$B$9:$HA$43\"),0,MATCH($A19,INDIRECT(\"'\"&INT((MONTH(A19)-1)/6)+1&IF(INT((MONTH(A19)-1)/6)+1=1,\"ER SEMESTRE \",\"EME SEMESTRE \")&YEAR(A19)&\"'\"&\"!$B$7:$HA$7\"),0))=\"R\"),ROW(INDIRECT(\"'\"&INT((MONTH(A19)-1)/6)+1&IF(INT((MONTH(A19)-1)/6)+1=1,\"ER SEMESTRE \",\"EME SEMESTRE \")&YEAR(A19)&\"'\"&\"!$D$9:$D$43\"))-8,9^9))),\"\")),\"\")","v":""},null,{"$f":"IF(OR($B19=\"M\",$B19=\"N\",$B19=\"A\"),IF(\nIFERROR(INDEX(OFFSET(INDIRECT(\"'\"&INT((MONTH(A19)-1)/6)+1&IF(INT((MONTH(A19)-1)/6)+1=1,\"ER SEMESTRE \",\"EME SEMESTRE \")&YEAR(A19)&\"'\"&\"!$B$9:$B$43\"),0,MATCH($A19,INDIRECT(\"'\"&INT((MONTH(A19)-1)/6)+1&IF(INT((MONTH(A19)-1)/6)+1=1,\"ER SEMESTRE \",\"EME SEMESTRE \")&YEAR(A19)&\"'\"&\"!$B$7:$HA$7\"),0)-DAY(A19)-2),MIN(IF((OFFSET(INDIRECT(\"'\"&INT((MONTH(A19)-1)/6)+1&IF(INT((MONTH(A19)-1)/6)+1=1,\"ER SEMESTRE \",\"EME SEMESTRE \")&YEAR(A19)&\"'\"&\"!$B$9:$B$43\"),0,MATCH($A19,INDIRECT(\"'\"&INT((MONTH(A19)-1)/6)+1&IF(INT((MONTH(A19)-1)/6)+1=1,\"ER SEMESTRE \",\"EME SEMESTRE \")&YEAR(A19)&\"'\"&\"!$B$7:$HA$7\"),0)-DAY(A19)-1)=\"(\"&$G$9&\")\")*(INDEX(INDIRECT(\"'\"&INT((MONTH(A19)-1)/6)+1&IF(INT((MONTH(A19)-1)/6)+1=1,\"ER SEMESTRE \",\"EME SEMESTRE \")&YEAR(A19)&\"'\"&\"!$B$9:$HA$43\"),0,MATCH($A19,INDIRECT(\"'\"&INT((MONTH(A19)-1)/6)+1&IF(INT((MONTH(A19)-1)/6)+1=1,\"ER SEMESTRE \",\"EME SEMESTRE \")&YEAR(A19)&\"'\"&\"!$B$7:$HA$7\"),0))=\"J\"),ROW(INDIRECT(\"'\"&INT((MONTH(A19)-1)/6)+1&IF(INT((MONTH(A19)-1)/6)+1=1,\"ER SEMESTRE \",\"EME SEMESTRE \")&YEAR(A19)&\"'\"&\"!$D$9:$D$43\"))-8,9^9))),\"\")=\"\",\n\nIFERROR(INDEX(OFFSET(INDIRECT(\"'\"&INT((MONTH(A19)-1)/6)+1&IF(INT((MONTH(A19)-1)/6)+1=1,\"ER SEMESTRE \",\"EME SEMESTRE \")&YEAR(A19)&\"'\"&\"!$B$9:$B$43\"),0,MATCH($A19,INDIRECT(\"'\"&INT((MONTH(A19)-1)/6)+1&IF(INT((MONTH(A19)-1)/6)+1=1,\"ER SEMESTRE \",\"EME SEMESTRE \")&YEAR(A19)&\"'\"&\"!$B$7:$HA$7\"),0)-DAY(A19)-2),SMALL(IF((OFFSET(INDIRECT(\"'\"&INT((MONTH(A19)-1)/6)+1&IF(INT((MONTH(A19)-1)/6)+1=1,\"ER SEMESTRE \",\"EME SEMESTRE \")&YEAR(A19)&\"'\"&\"!$B$9:$B$43\"),0,MATCH($A19,INDIRECT(\"'\"&INT((MONTH(A19)-1)/6)+1&IF(INT((MONTH(A19)-1)/6)+1=1,\"ER SEMESTRE \",\"EME SEMESTRE \")&YEAR(A19)&\"'\"&\"!$B$7:$HA$7\"),0)-DAY(A19)-1)=\"(\"&$G$9&\")\")*(INDEX(INDIRECT(\"'\"&INT((MONTH(A19)-1)/6)+1&IF(INT((MONTH(A19)-1)/6)+1=1,\"ER SEMESTRE \",\"EME SEMESTRE \")&YEAR(A19)&\"'\"&\"!$B$9:$HA$43\"),0,MATCH($A19,INDIRECT(\"'\"&INT((MONTH(A19)-1)/6)+1&IF(INT((MONTH(A19)-1)/6)+1=1,\"ER SEMESTRE \",\"EME SEMESTRE \")&YEAR(A19)&\"'\"&\"!$B$7:$HA$7\"),0))=\"R\"),ROW(INDIRECT(\"'\"&INT((MONTH(A19)-1)/6)+1&IF(INT((MONTH(A19)-1)/6)+1=1,\"ER SEMESTRE \",\"EME SEMESTRE \")&YEAR(A19)&\"'\"&\"!D$9:D$43\"))-8,9^9),2)),\"\"),\n\nIFERROR(\nINDEX(\nOFFSET(INDIRECT(\"'\"&INT((MONTH(A19)-1)/6)+1&IF(INT((MONTH(A19)-1)/6)+1=1,\"ER SEMESTRE \",\"EME SEMESTRE \")&YEAR(A19)&\"'\"&\"!$B$9:$B$43\"),0,MATCH($A19,INDIRECT(\"'\"&INT((MONTH(A19)-1)/6)+1&IF(INT((MONTH(A19)-1)/6)+1=1,\"ER SEMESTRE \",\"EME SEMESTRE \")&YEAR(A19)&\"'\"&\"!$B$7:$HA$7\"),0)-DAY(A19)-2),\n\nMIN(IF(\n(OFFSET(INDIRECT(\"'\"&INT((MONTH(A19)-1)/6)+1&IF(INT((MONTH(A19)-1)/6)+1=1,\"ER SEMESTRE \",\"EME SEMESTRE \")&YEAR(A19)&\"'\"&\"!$B$9:$B$43\"),0,MATCH($A19,INDIRECT(\"'\"&INT((MONTH(A19)-1)/6)+1&IF(INT((MONTH(A19)-1)/6)+1=1,\"ER SEMESTRE \",\"EME SEMESTRE \")&YEAR(A19)&\"'\"&\"!$B$7:$HA$7\"),0)-DAY(A19)-1)=\"(\"&$G$9&\")\")\n*\n(INDEX(INDIRECT(\"'\"&INT((MONTH(A19)-1)/6)+1&IF(INT((MONTH(A19)-1)/6)+1=1,\"ER SEMESTRE \",\"EME SEMESTRE \")&YEAR(A19)&\"'\"&\"!$B$9:$HA$43\"),0,MATCH($A19,INDIRECT(\"'\"&INT((MONTH(A19)-1)/6)+1&IF(INT((MONTH(A19)-1)/6)+1=1,\"ER SEMESTRE \",\"EME SEMESTRE \")&YEAR(A19)&\"'\"&\"!$B$7:$HA$7\"),0))=\"R\"),\n\nROW(INDIRECT(\"'\"&INT((MONTH(A19)-1)/6)+1&IF(INT((MONTH(A19)-1)/6)+1=1,\"ER SEMESTRE \",\"EME SEMESTRE \")&YEAR(A19)&\"'\"&\"!D$9:D$43\"))-8,\n\n9^9))),\"\")),\"\")","v":""},null,{"$f":"IF(OR($B19=\"M\",$B19=\"N\",$B19=\"A\"),IF(\n\nIFERROR(INDEX(OFFSET(INDIRECT(\"'\"&INT((MONTH(A19)-1)/6)+1&IF(INT((MONTH(A19)-1)/6)+1=1,\"ER SEMESTRE \",\"EME SEMESTRE \")&YEAR(A19)&\"'\"&\"!$B$9:$B$43\"),0,MATCH($A19,INDIRECT(\"'\"&INT((MONTH(A19)-1)/6)+1&IF(INT((MONTH(A19)-1)/6)+1=1,\"ER SEMESTRE \",\"EME SEMESTRE \")&YEAR(A19)&\"'\"&\"!$B$7:$HA$7\"),0)-DAY(A19)-2),MIN(IF((OFFSET(INDIRECT(\"'\"&INT((MONTH(A19)-1)/6)+1&IF(INT((MONTH(A19)-1)/6)+1=1,\"ER SEMESTRE \",\"EME SEMESTRE \")&YEAR(A19)&\"'\"&\"!$B$9:$B$43\"),0,MATCH($A19,INDIRECT(\"'\"&INT((MONTH(A19)-1)/6)+1&IF(INT((MONTH(A19)-1)/6)+1=1,\"ER SEMESTRE \",\"EME SEMESTRE \")&YEAR(A19)&\"'\"&\"!$B$7:$HA$7\"),0)-DAY(A19)-1)=\"(\"&$G$9&\")\")*(INDEX(INDIRECT(\"'\"&INT((MONTH(A19)-1)/6)+1&IF(INT((MONTH(A19)-1)/6)+1=1,\"ER SEMESTRE \",\"EME SEMESTRE \")&YEAR(A19)&\"'\"&\"!$B$9:$HA$43\"),0,MATCH($A19,INDIRECT(\"'\"&INT((MONTH(A19)-1)/6)+1&IF(INT((MONTH(A19)-1)/6)+1=1,\"ER SEMESTRE \",\"EME SEMESTRE \")&YEAR(A19)&\"'\"&\"!$B$7:$HA$7\"),0))=\"J\"),ROW(INDIRECT(\"'\"&INT((MONTH(A19)-1)/6)+1&IF(INT((MONTH(A19)-1)/6)+1=1,\"ER SEMESTRE \",\"EME SEMESTRE \")&YEAR(A19)&\"'\"&\"!$D$9:$D$43\"))-8,9^9))),\"\")=\"\",\n\nIFERROR(\nINDEX(OFFSET(INDIRECT(\"'\"&INT((MONTH(A19)-1)/6)+1&IF(INT((MONTH(A19)-1)/6)+1=1,\"ER SEMESTRE \",\"EME SEMESTRE \")&YEAR(A19)&\"'\"&\"!$B$9:$B$43\"),0,MATCH($A19,INDIRECT(\"'\"&INT((MONTH(A19)-1)/6)+1&IF(INT((MONTH(A19)-1)/6)+1=1,\"ER SEMESTRE \",\"EME SEMESTRE \")&YEAR(A19)&\"'\"&\"!$B$7:$HA$7\"),0)-DAY(A19)-2),\nSMALL(IF((OFFSET(INDIRECT(\"'\"&INT((MONTH(A19)-1)/6)+1&IF(INT((MONTH(A19)-1)/6)+1=1,\"ER SEMESTRE \",\"EME SEMESTRE \")&YEAR(A19)&\"'\"&\"!$B$9:$B$43\"),0,MATCH($A19,INDIRECT(\"'\"&INT((MONTH(A19)-1)/6)+1&IF(INT((MONTH(A19)-1)/6)+1=1,\"ER SEMESTRE \",\"EME SEMESTRE \")&YEAR(A19)&\"'\"&\"!$B$7:$HA$7\"),0)-DAY(A19)-1)=\"(\"&$G$9&\")\")*(INDEX(INDIRECT(\"'\"&INT((MONTH(A19)-1)/6)+1&IF(INT((MONTH(A19)-1)/6)+1=1,\"ER SEMESTRE \",\"EME SEMESTRE \")&YEAR(A19)&\"'\"&\"!$B$9:$HA$43\"),0,MATCH($A19,INDIRECT(\"'\"&INT((MONTH(A19)-1)/6)+1&IF(INT((MONTH(A19)-1)/6)+1=1,\"ER SEMESTRE \",\"EME SEMESTRE \")&YEAR(A19)&\"'\"&\"!$B$7:$HA$7\"),0))=\"R\"),ROW(INDIRECT(\"'\"&INT((MONTH(A19)-1)/6)+1&IF(INT((MONTH(A19)-1)/6)+1=1,\"ER SEMESTRE \",\"EME SEMESTRE \")&YEAR(A19)&\"'\"&\"!D$9:D$43\"))-8,9^9),3)),\"\"),\n\n\nIFERROR(\nINDEX(OFFSET(INDIRECT(\"'\"&INT((MONTH(A19)-1)/6)+1&IF(INT((MONTH(A19)-1)/6)+1=1,\"ER SEMESTRE \",\"EME SEMESTRE \")&YEAR(A19)&\"'\"&\"!$B$9:$B$43\"),0,MATCH($A19,INDIRECT(\"'\"&INT((MONTH(A19)-1)/6)+1&IF(INT((MONTH(A19)-1)/6)+1=1,\"ER SEMESTRE \",\"EME SEMESTRE \")&YEAR(A19)&\"'\"&\"!$B$7:$HA$7\"),0)-DAY(A19)-2),\nSMALL(IF((OFFSET(INDIRECT(\"'\"&INT((MONTH(A19)-1)/6)+1&IF(INT((MONTH(A19)-1)/6)+1=1,\"ER SEMESTRE \",\"EME SEMESTRE \")&YEAR(A19)&\"'\"&\"!$B$9:$B$43\"),0,MATCH($A19,INDIRECT(\"'\"&INT((MONTH(A19)-1)/6)+1&IF(INT((MONTH(A19)-1)/6)+1=1,\"ER SEMESTRE \",\"EME SEMESTRE \")&YEAR(A19)&\"'\"&\"!$B$7:$HA$7\"),0)-DAY(A19)-1)=\"(\"&$G$9&\")\")*(INDEX(INDIRECT(\"'\"&INT((MONTH(A19)-1)/6)+1&IF(INT((MONTH(A19)-1)/6)+1=1,\"ER SEMESTRE \",\"EME SEMESTRE \")&YEAR(A19)&\"'\"&\"!$B$9:$HA$43\"),0,MATCH($A19,INDIRECT(\"'\"&INT((MONTH(A19)-1)/6)+1&IF(INT((MONTH(A19)-1)/6)+1=1,\"ER SEMESTRE \",\"EME SEMESTRE \")&YEAR(A19)&\"'\"&\"!$B$7:$HA$7\"),0))=\"R\"),ROW(INDIRECT(\"'\"&INT((MONTH(A19)-1)/6)+1&IF(INT((MONTH(A19)-1)/6)+1=1,\"ER SEMESTRE \",\"EME SEMESTRE \")&YEAR(A19)&\"'\"&\"!D$9:D$43\"))-8,9^9),2)),\"\")\n\n),\n\n\"\")","v":""}]
["2015-10-14",{"$f":"IFERROR(INDEX([3]PLANNING!$D$3:$Y$29,MATCH('[3]F_Dde de remplacement'!$G$8,[3]PLANNING!$B$3:$B$29,0),MATCH('[3]F_Dde de remplacement'!$A20,[3]PLANNING!$D$2:$Y$2,0)),\"\")","v":"F"},{"$f":"IF(OR($B20=\"M\",$B20=\"N\",$B20=\"A\"),IFERROR(INDEX(OFFSET(INDIRECT(\"'\"&INT((MONTH(A20)-1)/6)+1&IF(INT((MONTH(A20)-1)/6)+1=1,\"ER SEMESTRE \",\"EME SEMESTRE \")&YEAR(A20)&\"'\"&\"!$B$9:$B$43\"),0,MATCH($A20,INDIRECT(\"'\"&INT((MONTH(A20)-1)/6)+1&IF(INT((MONTH(A20)-1)/6)+1=1,\"ER SEMESTRE \",\"EME SEMESTRE \")&YEAR(A20)&\"'\"&\"!$B$7:$HA$7\"),0)-DAY(A20)-2),MIN(IF((OFFSET(INDIRECT(\"'\"&INT((MONTH(A20)-1)/6)+1&IF(INT((MONTH(A20)-1)/6)+1=1,\"ER SEMESTRE \",\"EME SEMESTRE \")&YEAR(A20)&\"'\"&\"!$B$9:$B$43\"),0,MATCH($A20,INDIRECT(\"'\"&INT((MONTH(A20)-1)/6)+1&IF(INT((MONTH(A20)-1)/6)+1=1,\"ER SEMESTRE \",\"EME SEMESTRE \")&YEAR(A20)&\"'\"&\"!$B$7:$HA$7\"),0)-DAY(A20)-1)=\"(\"&$G$9&\")\")*(INDEX(INDIRECT(\"'\"&INT((MONTH(A20)-1)/6)+1&IF(INT((MONTH(A20)-1)/6)+1=1,\"ER SEMESTRE \",\"EME SEMESTRE \")&YEAR(A20)&\"'\"&\"!$B$9:$HA$43\"),0,MATCH($A20,INDIRECT(\"'\"&INT((MONTH(A20)-1)/6)+1&IF(INT((MONTH(A20)-1)/6)+1=1,\"ER SEMESTRE \",\"EME SEMESTRE \")&YEAR(A20)&\"'\"&\"!$B$7:$HA$7\"),0))=\"J\"),ROW(INDIRECT(\"'\"&INT((MONTH(A20)-1)/6)+1&IF(INT((MONTH(A20)-1)/6)+1=1,\"ER SEMESTRE \",\"EME SEMESTRE \")&YEAR(A20)&\"'\"&\"!$D$9:$D$43\"))-8,9^9))),IFERROR(INDEX(OFFSET(INDIRECT(\"'\"&INT((MONTH(A20)-1)/6)+1&IF(INT((MONTH(A20)-1)/6)+1=1,\"ER SEMESTRE \",\"EME SEMESTRE \")&YEAR(A20)&\"'\"&\"!$B$9:$B$43\"),0,MATCH($A20,INDIRECT(\"'\"&INT((MONTH(A20)-1)/6)+1&IF(INT((MONTH(A20)-1)/6)+1=1,\"ER SEMESTRE \",\"EME SEMESTRE \")&YEAR(A20)&\"'\"&\"!$B$7:$HA$7\"),0)-DAY(A20)-2),MIN(IF((OFFSET(INDIRECT(\"'\"&INT((MONTH(A20)-1)/6)+1&IF(INT((MONTH(A20)-1)/6)+1=1,\"ER SEMESTRE \",\"EME SEMESTRE \")&YEAR(A20)&\"'\"&\"!$B$9:$B$43\"),0,MATCH($A20,INDIRECT(\"'\"&INT((MONTH(A20)-1)/6)+1&IF(INT((MONTH(A20)-1)/6)+1=1,\"ER SEMESTRE \",\"EME SEMESTRE \")&YEAR(A20)&\"'\"&\"!$B$7:$HA$7\"),0)-DAY(A20)-1)=\"(\"&$G$9&\")\")*(INDEX(INDIRECT(\"'\"&INT((MONTH(A20)-1)/6)+1&IF(INT((MONTH(A20)-1)/6)+1=1,\"ER SEMESTRE \",\"EME SEMESTRE \")&YEAR(A20)&\"'\"&\"!$B$9:$HA$43\"),0,MATCH($A20,INDIRECT(\"'\"&INT((MONTH(A20)-1)/6)+1&IF(INT((MONTH(A20)-1)/6)+1=1,\"ER SEMESTRE \",\"EME SEMESTRE \")&YEAR(A20)&\"'\"&\"!$B$7:$HA$7\"),0))=\"R\"),ROW(INDIRECT(\"'\"&INT((MONTH(A20)-1)/6)+1&IF(INT((MONTH(A20)-1)/6)+1=1,\"ER SEMESTRE \",\"EME SEMESTRE \")&YEAR(A20)&\"'\"&\"!$D$9:$D$43\"))-8,9^9))),\"\")),\"\")","v":""},null,{"$f":"IF(OR($B20=\"M\",$B20=\"N\",$B20=\"A\"),IF(\nIFERROR(INDEX(OFFSET(INDIRECT(\"'\"&INT((MONTH(A20)-1)/6)+1&IF(INT((MONTH(A20)-1)/6)+1=1,\"ER SEMESTRE \",\"EME SEMESTRE \")&YEAR(A20)&\"'\"&\"!$B$9:$B$43\"),0,MATCH($A20,INDIRECT(\"'\"&INT((MONTH(A20)-1)/6)+1&IF(INT((MONTH(A20)-1)/6)+1=1,\"ER SEMESTRE \",\"EME SEMESTRE \")&YEAR(A20)&\"'\"&\"!$B$7:$HA$7\"),0)-DAY(A20)-2),MIN(IF((OFFSET(INDIRECT(\"'\"&INT((MONTH(A20)-1)/6)+1&IF(INT((MONTH(A20)-1)/6)+1=1,\"ER SEMESTRE \",\"EME SEMESTRE \")&YEAR(A20)&\"'\"&\"!$B$9:$B$43\"),0,MATCH($A20,INDIRECT(\"'\"&INT((MONTH(A20)-1)/6)+1&IF(INT((MONTH(A20)-1)/6)+1=1,\"ER SEMESTRE \",\"EME SEMESTRE \")&YEAR(A20)&\"'\"&\"!$B$7:$HA$7\"),0)-DAY(A20)-1)=\"(\"&$G$9&\")\")*(INDEX(INDIRECT(\"'\"&INT((MONTH(A20)-1)/6)+1&IF(INT((MONTH(A20)-1)/6)+1=1,\"ER SEMESTRE \",\"EME SEMESTRE \")&YEAR(A20)&\"'\"&\"!$B$9:$HA$43\"),0,MATCH($A20,INDIRECT(\"'\"&INT((MONTH(A20)-1)/6)+1&IF(INT((MONTH(A20)-1)/6)+1=1,\"ER SEMESTRE \",\"EME SEMESTRE \")&YEAR(A20)&\"'\"&\"!$B$7:$HA$7\"),0))=\"J\"),ROW(INDIRECT(\"'\"&INT((MONTH(A20)-1)/6)+1&IF(INT((MONTH(A20)-1)/6)+1=1,\"ER SEMESTRE \",\"EME SEMESTRE \")&YEAR(A20)&\"'\"&\"!$D$9:$D$43\"))-8,9^9))),\"\")=\"\",\n\nIFERROR(INDEX(OFFSET(INDIRECT(\"'\"&INT((MONTH(A20)-1)/6)+1&IF(INT((MONTH(A20)-1)/6)+1=1,\"ER SEMESTRE \",\"EME SEMESTRE \")&YEAR(A20)&\"'\"&\"!$B$9:$B$43\"),0,MATCH($A20,INDIRECT(\"'\"&INT((MONTH(A20)-1)/6)+1&IF(INT((MONTH(A20)-1)/6)+1=1,\"ER SEMESTRE \",\"EME SEMESTRE \")&YEAR(A20)&\"'\"&\"!$B$7:$HA$7\"),0)-DAY(A20)-2),SMALL(IF((OFFSET(INDIRECT(\"'\"&INT((MONTH(A20)-1)/6)+1&IF(INT((MONTH(A20)-1)/6)+1=1,\"ER SEMESTRE \",\"EME SEMESTRE \")&YEAR(A20)&\"'\"&\"!$B$9:$B$43\"),0,MATCH($A20,INDIRECT(\"'\"&INT((MONTH(A20)-1)/6)+1&IF(INT((MONTH(A20)-1)/6)+1=1,\"ER SEMESTRE \",\"EME SEMESTRE \")&YEAR(A20)&\"'\"&\"!$B$7:$HA$7\"),0)-DAY(A20)-1)=\"(\"&$G$9&\")\")*(INDEX(INDIRECT(\"'\"&INT((MONTH(A20)-1)/6)+1&IF(INT((MONTH(A20)-1)/6)+1=1,\"ER SEMESTRE \",\"EME SEMESTRE \")&YEAR(A20)&\"'\"&\"!$B$9:$HA$43\"),0,MATCH($A20,INDIRECT(\"'\"&INT((MONTH(A20)-1)/6)+1&IF(INT((MONTH(A20)-1)/6)+1=1,\"ER SEMESTRE \",\"EME SEMESTRE \")&YEAR(A20)&\"'\"&\"!$B$7:$HA$7\"),0))=\"R\"),ROW(INDIRECT(\"'\"&INT((MONTH(A20)-1)/6)+1&IF(INT((MONTH(A20)-1)/6)+1=1,\"ER SEMESTRE \",\"EME SEMESTRE \")&YEAR(A20)&\"'\"&\"!D$9:D$43\"))-8,9^9),2)),\"\"),\n\nIFERROR(\nINDEX(\nOFFSET(INDIRECT(\"'\"&INT((MONTH(A20)-1)/6)+1&IF(INT((MONTH(A20)-1)/6)+1=1,\"ER SEMESTRE \",\"EME SEMESTRE \")&YEAR(A20)&\"'\"&\"!$B$9:$B$43\"),0,MATCH($A20,INDIRECT(\"'\"&INT((MONTH(A20)-1)/6)+1&IF(INT((MONTH(A20)-1)/6)+1=1,\"ER SEMESTRE \",\"EME SEMESTRE \")&YEAR(A20)&\"'\"&\"!$B$7:$HA$7\"),0)-DAY(A20)-2),\n\nMIN(IF(\n(OFFSET(INDIRECT(\"'\"&INT((MONTH(A20)-1)/6)+1&IF(INT((MONTH(A20)-1)/6)+1=1,\"ER SEMESTRE \",\"EME SEMESTRE \")&YEAR(A20)&\"'\"&\"!$B$9:$B$43\"),0,MATCH($A20,INDIRECT(\"'\"&INT((MONTH(A20)-1)/6)+1&IF(INT((MONTH(A20)-1)/6)+1=1,\"ER SEMESTRE \",\"EME SEMESTRE \")&YEAR(A20)&\"'\"&\"!$B$7:$HA$7\"),0)-DAY(A20)-1)=\"(\"&$G$9&\")\")\n*\n(INDEX(INDIRECT(\"'\"&INT((MONTH(A20)-1)/6)+1&IF(INT((MONTH(A20)-1)/6)+1=1,\"ER SEMESTRE \",\"EME SEMESTRE \")&YEAR(A20)&\"'\"&\"!$B$9:$HA$43\"),0,MATCH($A20,INDIRECT(\"'\"&INT((MONTH(A20)-1)/6)+1&IF(INT((MONTH(A20)-1)/6)+1=1,\"ER SEMESTRE \",\"EME SEMESTRE \")&YEAR(A20)&\"'\"&\"!$B$7:$HA$7\"),0))=\"R\"),\n\nROW(INDIRECT(\"'\"&INT((MONTH(A20)-1)/6)+1&IF(INT((MONTH(A20)-1)/6)+1=1,\"ER SEMESTRE \",\"EME SEMESTRE \")&YEAR(A20)&\"'\"&\"!D$9:D$43\"))-8,\n\n9^9))),\"\")),\"\")","v":""},null,{"$f":"IF(OR($B20=\"M\",$B20=\"N\",$B20=\"A\"),IF(\n\nIFERROR(INDEX(OFFSET(INDIRECT(\"'\"&INT((MONTH(A20)-1)/6)+1&IF(INT((MONTH(A20)-1)/6)+1=1,\"ER SEMESTRE \",\"EME SEMESTRE \")&YEAR(A20)&\"'\"&\"!$B$9:$B$43\"),0,MATCH($A20,INDIRECT(\"'\"&INT((MONTH(A20)-1)/6)+1&IF(INT((MONTH(A20)-1)/6)+1=1,\"ER SEMESTRE \",\"EME SEMESTRE \")&YEAR(A20)&\"'\"&\"!$B$7:$HA$7\"),0)-DAY(A20)-2),MIN(IF((OFFSET(INDIRECT(\"'\"&INT((MONTH(A20)-1)/6)+1&IF(INT((MONTH(A20)-1)/6)+1=1,\"ER SEMESTRE \",\"EME SEMESTRE \")&YEAR(A20)&\"'\"&\"!$B$9:$B$43\"),0,MATCH($A20,INDIRECT(\"'\"&INT((MONTH(A20)-1)/6)+1&IF(INT((MONTH(A20)-1)/6)+1=1,\"ER SEMESTRE \",\"EME SEMESTRE \")&YEAR(A20)&\"'\"&\"!$B$7:$HA$7\"),0)-DAY(A20)-1)=\"(\"&$G$9&\")\")*(INDEX(INDIRECT(\"'\"&INT((MONTH(A20)-1)/6)+1&IF(INT((MONTH(A20)-1)/6)+1=1,\"ER SEMESTRE \",\"EME SEMESTRE \")&YEAR(A20)&\"'\"&\"!$B$9:$HA$43\"),0,MATCH($A20,INDIRECT(\"'\"&INT((MONTH(A20)-1)/6)+1&IF(INT((MONTH(A20)-1)/6)+1=1,\"ER SEMESTRE \",\"EME SEMESTRE \")&YEAR(A20)&\"'\"&\"!$B$7:$HA$7\"),0))=\"J\"),ROW(INDIRECT(\"'\"&INT((MONTH(A20)-1)/6)+1&IF(INT((MONTH(A20)-1)/6)+1=1,\"ER SEMESTRE \",\"EME SEMESTRE \")&YEAR(A20)&\"'\"&\"!$D$9:$D$43\"))-8,9^9))),\"\")=\"\",\n\nIFERROR(\nINDEX(OFFSET(INDIRECT(\"'\"&INT((MONTH(A20)-1)/6)+1&IF(INT((MONTH(A20)-1)/6)+1=1,\"ER SEMESTRE \",\"EME SEMESTRE \")&YEAR(A20)&\"'\"&\"!$B$9:$B$43\"),0,MATCH($A20,INDIRECT(\"'\"&INT((MONTH(A20)-1)/6)+1&IF(INT((MONTH(A20)-1)/6)+1=1,\"ER SEMESTRE \",\"EME SEMESTRE \")&YEAR(A20)&\"'\"&\"!$B$7:$HA$7\"),0)-DAY(A20)-2),\nSMALL(IF((OFFSET(INDIRECT(\"'\"&INT((MONTH(A20)-1)/6)+1&IF(INT((MONTH(A20)-1)/6)+1=1,\"ER SEMESTRE \",\"EME SEMESTRE \")&YEAR(A20)&\"'\"&\"!$B$9:$B$43\"),0,MATCH($A20,INDIRECT(\"'\"&INT((MONTH(A20)-1)/6)+1&IF(INT((MONTH(A20)-1)/6)+1=1,\"ER SEMESTRE \",\"EME SEMESTRE \")&YEAR(A20)&\"'\"&\"!$B$7:$HA$7\"),0)-DAY(A20)-1)=\"(\"&$G$9&\")\")*(INDEX(INDIRECT(\"'\"&INT((MONTH(A20)-1)/6)+1&IF(INT((MONTH(A20)-1)/6)+1=1,\"ER SEMESTRE \",\"EME SEMESTRE \")&YEAR(A20)&\"'\"&\"!$B$9:$HA$43\"),0,MATCH($A20,INDIRECT(\"'\"&INT((MONTH(A20)-1)/6)+1&IF(INT((MONTH(A20)-1)/6)+1=1,\"ER SEMESTRE \",\"EME SEMESTRE \")&YEAR(A20)&\"'\"&\"!$B$7:$HA$7\"),0))=\"R\"),ROW(INDIRECT(\"'\"&INT((MONTH(A20)-1)/6)+1&IF(INT((MONTH(A20)-1)/6)+1=1,\"ER SEMESTRE \",\"EME SEMESTRE \")&YEAR(A20)&\"'\"&\"!D$9:D$43\"))-8,9^9),3)),\"\"),\n\n\nIFERROR(\nINDEX(OFFSET(INDIRECT(\"'\"&INT((MONTH(A20)-1)/6)+1&IF(INT((MONTH(A20)-1)/6)+1=1,\"ER SEMESTRE \",\"EME SEMESTRE \")&YEAR(A20)&\"'\"&\"!$B$9:$B$43\"),0,MATCH($A20,INDIRECT(\"'\"&INT((MONTH(A20)-1)/6)+1&IF(INT((MONTH(A20)-1)/6)+1=1,\"ER SEMESTRE \",\"EME SEMESTRE \")&YEAR(A20)&\"'\"&\"!$B$7:$HA$7\"),0)-DAY(A20)-2),\nSMALL(IF((OFFSET(INDIRECT(\"'\"&INT((MONTH(A20)-1)/6)+1&IF(INT((MONTH(A20)-1)/6)+1=1,\"ER SEMESTRE \",\"EME SEMESTRE \")&YEAR(A20)&\"'\"&\"!$B$9:$B$43\"),0,MATCH($A20,INDIRECT(\"'\"&INT((MONTH(A20)-1)/6)+1&IF(INT((MONTH(A20)-1)/6)+1=1,\"ER SEMESTRE \",\"EME SEMESTRE \")&YEAR(A20)&\"'\"&\"!$B$7:$HA$7\"),0)-DAY(A20)-1)=\"(\"&$G$9&\")\")*(INDEX(INDIRECT(\"'\"&INT((MONTH(A20)-1)/6)+1&IF(INT((MONTH(A20)-1)/6)+1=1,\"ER SEMESTRE \",\"EME SEMESTRE \")&YEAR(A20)&\"'\"&\"!$B$9:$HA$43\"),0,MATCH($A20,INDIRECT(\"'\"&INT((MONTH(A20)-1)/6)+1&IF(INT((MONTH(A20)-1)/6)+1=1,\"ER SEMESTRE \",\"EME SEMESTRE \")&YEAR(A20)&\"'\"&\"!$B$7:$HA$7\"),0))=\"R\"),ROW(INDIRECT(\"'\"&INT((MONTH(A20)-1)/6)+1&IF(INT((MONTH(A20)-1)/6)+1=1,\"ER SEMESTRE \",\"EME SEMESTRE \")&YEAR(A20)&\"'\"&\"!D$9:D$43\"))-8,9^9),2)),\"\")\n\n),\n\n\"\")","v":""}]
["2015-10-15",{"$f":"IFERROR(INDEX([3]PLANNING!$D$3:$Y$29,MATCH('[3]F_Dde de remplacement'!$G$8,[3]PLANNING!$B$3:$B$29,0),MATCH('[3]F_Dde de remplacement'!$A21,[3]PLANNING!$D$2:$Y$2,0)),\"\")","v":"R"},{"$f":"IF(OR($B21=\"M\",$B21=\"N\",$B21=\"A\"),IFERROR(INDEX(OFFSET(INDIRECT(\"'\"&INT((MONTH(A21)-1)/6)+1&IF(INT((MONTH(A21)-1)/6)+1=1,\"ER SEMESTRE \",\"EME SEMESTRE \")&YEAR(A21)&\"'\"&\"!$B$9:$B$43\"),0,MATCH($A21,INDIRECT(\"'\"&INT((MONTH(A21)-1)/6)+1&IF(INT((MONTH(A21)-1)/6)+1=1,\"ER SEMESTRE \",\"EME SEMESTRE \")&YEAR(A21)&\"'\"&\"!$B$7:$HA$7\"),0)-DAY(A21)-2),MIN(IF((OFFSET(INDIRECT(\"'\"&INT((MONTH(A21)-1)/6)+1&IF(INT((MONTH(A21)-1)/6)+1=1,\"ER SEMESTRE \",\"EME SEMESTRE \")&YEAR(A21)&\"'\"&\"!$B$9:$B$43\"),0,MATCH($A21,INDIRECT(\"'\"&INT((MONTH(A21)-1)/6)+1&IF(INT((MONTH(A21)-1)/6)+1=1,\"ER SEMESTRE \",\"EME SEMESTRE \")&YEAR(A21)&\"'\"&\"!$B$7:$HA$7\"),0)-DAY(A21)-1)=\"(\"&$G$9&\")\")*(INDEX(INDIRECT(\"'\"&INT((MONTH(A21)-1)/6)+1&IF(INT((MONTH(A21)-1)/6)+1=1,\"ER SEMESTRE \",\"EME SEMESTRE \")&YEAR(A21)&\"'\"&\"!$B$9:$HA$43\"),0,MATCH($A21,INDIRECT(\"'\"&INT((MONTH(A21)-1)/6)+1&IF(INT((MONTH(A21)-1)/6)+1=1,\"ER SEMESTRE \",\"EME SEMESTRE \")&YEAR(A21)&\"'\"&\"!$B$7:$HA$7\"),0))=\"J\"),ROW(INDIRECT(\"'\"&INT((MONTH(A21)-1)/6)+1&IF(INT((MONTH(A21)-1)/6)+1=1,\"ER SEMESTRE \",\"EME SEMESTRE \")&YEAR(A21)&\"'\"&\"!$D$9:$D$43\"))-8,9^9))),IFERROR(INDEX(OFFSET(INDIRECT(\"'\"&INT((MONTH(A21)-1)/6)+1&IF(INT((MONTH(A21)-1)/6)+1=1,\"ER SEMESTRE \",\"EME SEMESTRE \")&YEAR(A21)&\"'\"&\"!$B$9:$B$43\"),0,MATCH($A21,INDIRECT(\"'\"&INT((MONTH(A21)-1)/6)+1&IF(INT((MONTH(A21)-1)/6)+1=1,\"ER SEMESTRE \",\"EME SEMESTRE \")&YEAR(A21)&\"'\"&\"!$B$7:$HA$7\"),0)-DAY(A21)-2),MIN(IF((OFFSET(INDIRECT(\"'\"&INT((MONTH(A21)-1)/6)+1&IF(INT((MONTH(A21)-1)/6)+1=1,\"ER SEMESTRE \",\"EME SEMESTRE \")&YEAR(A21)&\"'\"&\"!$B$9:$B$43\"),0,MATCH($A21,INDIRECT(\"'\"&INT((MONTH(A21)-1)/6)+1&IF(INT((MONTH(A21)-1)/6)+1=1,\"ER SEMESTRE \",\"EME SEMESTRE \")&YEAR(A21)&\"'\"&\"!$B$7:$HA$7\"),0)-DAY(A21)-1)=\"(\"&$G$9&\")\")*(INDEX(INDIRECT(\"'\"&INT((MONTH(A21)-1)/6)+1&IF(INT((MONTH(A21)-1)/6)+1=1,\"ER SEMESTRE \",\"EME SEMESTRE \")&YEAR(A21)&\"'\"&\"!$B$9:$HA$43\"),0,MATCH($A21,INDIRECT(\"'\"&INT((MONTH(A21)-1)/6)+1&IF(INT((MONTH(A21)-1)/6)+1=1,\"ER SEMESTRE \",\"EME SEMESTRE \")&YEAR(A21)&\"'\"&\"!$B$7:$HA$7\"),0))=\"R\"),ROW(INDIRECT(\"'\"&INT((MONTH(A21)-1)/6)+1&IF(INT((MONTH(A21)-1)/6)+1=1,\"ER SEMESTRE \",\"EME SEMESTRE \")&YEAR(A21)&\"'\"&\"!$D$9:$D$43\"))-8,9^9))),\"\")),\"\")","v":""},null,{"$f":"IF(OR($B21=\"M\",$B21=\"N\",$B21=\"A\"),IF(\nIFERROR(INDEX(OFFSET(INDIRECT(\"'\"&INT((MONTH(A21)-1)/6)+1&IF(INT((MONTH(A21)-1)/6)+1=1,\"ER SEMESTRE \",\"EME SEMESTRE \")&YEAR(A21)&\"'\"&\"!$B$9:$B$43\"),0,MATCH($A21,INDIRECT(\"'\"&INT((MONTH(A21)-1)/6)+1&IF(INT((MONTH(A21)-1)/6)+1=1,\"ER SEMESTRE \",\"EME SEMESTRE \")&YEAR(A21)&\"'\"&\"!$B$7:$HA$7\"),0)-DAY(A21)-2),MIN(IF((OFFSET(INDIRECT(\"'\"&INT((MONTH(A21)-1)/6)+1&IF(INT((MONTH(A21)-1)/6)+1=1,\"ER SEMESTRE \",\"EME SEMESTRE \")&YEAR(A21)&\"'\"&\"!$B$9:$B$43\"),0,MATCH($A21,INDIRECT(\"'\"&INT((MONTH(A21)-1)/6)+1&IF(INT((MONTH(A21)-1)/6)+1=1,\"ER SEMESTRE \",\"EME SEMESTRE \")&YEAR(A21)&\"'\"&\"!$B$7:$HA$7\"),0)-DAY(A21)-1)=\"(\"&$G$9&\")\")*(INDEX(INDIRECT(\"'\"&INT((MONTH(A21)-1)/6)+1&IF(INT((MONTH(A21)-1)/6)+1=1,\"ER SEMESTRE \",\"EME SEMESTRE \")&YEAR(A21)&\"'\"&\"!$B$9:$HA$43\"),0,MATCH($A21,INDIRECT(\"'\"&INT((MONTH(A21)-1)/6)+1&IF(INT((MONTH(A21)-1)/6)+1=1,\"ER SEMESTRE \",\"EME SEMESTRE \")&YEAR(A21)&\"'\"&\"!$B$7:$HA$7\"),0))=\"J\"),ROW(INDIRECT(\"'\"&INT((MONTH(A21)-1)/6)+1&IF(INT((MONTH(A21)-1)/6)+1=1,\"ER SEMESTRE \",\"EME SEMESTRE \")&YEAR(A21)&\"'\"&\"!$D$9:$D$43\"))-8,9^9))),\"\")=\"\",\n\nIFERROR(INDEX(OFFSET(INDIRECT(\"'\"&INT((MONTH(A21)-1)/6)+1&IF(INT((MONTH(A21)-1)/6)+1=1,\"ER SEMESTRE \",\"EME SEMESTRE \")&YEAR(A21)&\"'\"&\"!$B$9:$B$43\"),0,MATCH($A21,INDIRECT(\"'\"&INT((MONTH(A21)-1)/6)+1&IF(INT((MONTH(A21)-1)/6)+1=1,\"ER SEMESTRE \",\"EME SEMESTRE \")&YEAR(A21)&\"'\"&\"!$B$7:$HA$7\"),0)-DAY(A21)-2),SMALL(IF((OFFSET(INDIRECT(\"'\"&INT((MONTH(A21)-1)/6)+1&IF(INT((MONTH(A21)-1)/6)+1=1,\"ER SEMESTRE \",\"EME SEMESTRE \")&YEAR(A21)&\"'\"&\"!$B$9:$B$43\"),0,MATCH($A21,INDIRECT(\"'\"&INT((MONTH(A21)-1)/6)+1&IF(INT((MONTH(A21)-1)/6)+1=1,\"ER SEMESTRE \",\"EME SEMESTRE \")&YEAR(A21)&\"'\"&\"!$B$7:$HA$7\"),0)-DAY(A21)-1)=\"(\"&$G$9&\")\")*(INDEX(INDIRECT(\"'\"&INT((MONTH(A21)-1)/6)+1&IF(INT((MONTH(A21)-1)/6)+1=1,\"ER SEMESTRE \",\"EME SEMESTRE \")&YEAR(A21)&\"'\"&\"!$B$9:$HA$43\"),0,MATCH($A21,INDIRECT(\"'\"&INT((MONTH(A21)-1)/6)+1&IF(INT((MONTH(A21)-1)/6)+1=1,\"ER SEMESTRE \",\"EME SEMESTRE \")&YEAR(A21)&\"'\"&\"!$B$7:$HA$7\"),0))=\"R\"),ROW(INDIRECT(\"'\"&INT((MONTH(A21)-1)/6)+1&IF(INT((MONTH(A21)-1)/6)+1=1,\"ER SEMESTRE \",\"EME SEMESTRE \")&YEAR(A21)&\"'\"&\"!D$9:D$43\"))-8,9^9),2)),\"\"),\n\nIFERROR(\nINDEX(\nOFFSET(INDIRECT(\"'\"&INT((MONTH(A21)-1)/6)+1&IF(INT((MONTH(A21)-1)/6)+1=1,\"ER SEMESTRE \",\"EME SEMESTRE \")&YEAR(A21)&\"'\"&\"!$B$9:$B$43\"),0,MATCH($A21,INDIRECT(\"'\"&INT((MONTH(A21)-1)/6)+1&IF(INT((MONTH(A21)-1)/6)+1=1,\"ER SEMESTRE \",\"EME SEMESTRE \")&YEAR(A21)&\"'\"&\"!$B$7:$HA$7\"),0)-DAY(A21)-2),\n\nMIN(IF(\n(OFFSET(INDIRECT(\"'\"&INT((MONTH(A21)-1)/6)+1&IF(INT((MONTH(A21)-1)/6)+1=1,\"ER SEMESTRE \",\"EME SEMESTRE \")&YEAR(A21)&\"'\"&\"!$B$9:$B$43\"),0,MATCH($A21,INDIRECT(\"'\"&INT((MONTH(A21)-1)/6)+1&IF(INT((MONTH(A21)-1)/6)+1=1,\"ER SEMESTRE \",\"EME SEMESTRE \")&YEAR(A21)&\"'\"&\"!$B$7:$HA$7\"),0)-DAY(A21)-1)=\"(\"&$G$9&\")\")\n*\n(INDEX(INDIRECT(\"'\"&INT((MONTH(A21)-1)/6)+1&IF(INT((MONTH(A21)-1)/6)+1=1,\"ER SEMESTRE \",\"EME SEMESTRE \")&YEAR(A21)&\"'\"&\"!$B$9:$HA$43\"),0,MATCH($A21,INDIRECT(\"'\"&INT((MONTH(A21)-1)/6)+1&IF(INT((MONTH(A21)-1)/6)+1=1,\"ER SEMESTRE \",\"EME SEMESTRE \")&YEAR(A21)&\"'\"&\"!$B$7:$HA$7\"),0))=\"R\"),\n\nROW(INDIRECT(\"'\"&INT((MONTH(A21)-1)/6)+1&IF(INT((MONTH(A21)-1)/6)+1=1,\"ER SEMESTRE \",\"EME SEMESTRE \")&YEAR(A21)&\"'\"&\"!D$9:D$43\"))-8,\n\n9^9))),\"\")),\"\")","v":""},null,{"$f":"IF(OR($B21=\"M\",$B21=\"N\",$B21=\"A\"),IF(\n\nIFERROR(INDEX(OFFSET(INDIRECT(\"'\"&INT((MONTH(A21)-1)/6)+1&IF(INT((MONTH(A21)-1)/6)+1=1,\"ER SEMESTRE \",\"EME SEMESTRE \")&YEAR(A21)&\"'\"&\"!$B$9:$B$43\"),0,MATCH($A21,INDIRECT(\"'\"&INT((MONTH(A21)-1)/6)+1&IF(INT((MONTH(A21)-1)/6)+1=1,\"ER SEMESTRE \",\"EME SEMESTRE \")&YEAR(A21)&\"'\"&\"!$B$7:$HA$7\"),0)-DAY(A21)-2),MIN(IF((OFFSET(INDIRECT(\"'\"&INT((MONTH(A21)-1)/6)+1&IF(INT((MONTH(A21)-1)/6)+1=1,\"ER SEMESTRE \",\"EME SEMESTRE \")&YEAR(A21)&\"'\"&\"!$B$9:$B$43\"),0,MATCH($A21,INDIRECT(\"'\"&INT((MONTH(A21)-1)/6)+1&IF(INT((MONTH(A21)-1)/6)+1=1,\"ER SEMESTRE \",\"EME SEMESTRE \")&YEAR(A21)&\"'\"&\"!$B$7:$HA$7\"),0)-DAY(A21)-1)=\"(\"&$G$9&\")\")*(INDEX(INDIRECT(\"'\"&INT((MONTH(A21)-1)/6)+1&IF(INT((MONTH(A21)-1)/6)+1=1,\"ER SEMESTRE \",\"EME SEMESTRE \")&YEAR(A21)&\"'\"&\"!$B$9:$HA$43\"),0,MATCH($A21,INDIRECT(\"'\"&INT((MONTH(A21)-1)/6)+1&IF(INT((MONTH(A21)-1)/6)+1=1,\"ER SEMESTRE \",\"EME SEMESTRE \")&YEAR(A21)&\"'\"&\"!$B$7:$HA$7\"),0))=\"J\"),ROW(INDIRECT(\"'\"&INT((MONTH(A21)-1)/6)+1&IF(INT((MONTH(A21)-1)/6)+1=1,\"ER SEMESTRE \",\"EME SEMESTRE \")&YEAR(A21)&\"'\"&\"!$D$9:$D$43\"))-8,9^9))),\"\")=\"\",\n\nIFERROR(\nINDEX(OFFSET(INDIRECT(\"'\"&INT((MONTH(A21)-1)/6)+1&IF(INT((MONTH(A21)-1)/6)+1=1,\"ER SEMESTRE \",\"EME SEMESTRE \")&YEAR(A21)&\"'\"&\"!$B$9:$B$43\"),0,MATCH($A21,INDIRECT(\"'\"&INT((MONTH(A21)-1)/6)+1&IF(INT((MONTH(A21)-1)/6)+1=1,\"ER SEMESTRE \",\"EME SEMESTRE \")&YEAR(A21)&\"'\"&\"!$B$7:$HA$7\"),0)-DAY(A21)-2),\nSMALL(IF((OFFSET(INDIRECT(\"'\"&INT((MONTH(A21)-1)/6)+1&IF(INT((MONTH(A21)-1)/6)+1=1,\"ER SEMESTRE \",\"EME SEMESTRE \")&YEAR(A21)&\"'\"&\"!$B$9:$B$43\"),0,MATCH($A21,INDIRECT(\"'\"&INT((MONTH(A21)-1)/6)+1&IF(INT((MONTH(A21)-1)/6)+1=1,\"ER SEMESTRE \",\"EME SEMESTRE \")&YEAR(A21)&\"'\"&\"!$B$7:$HA$7\"),0)-DAY(A21)-1)=\"(\"&$G$9&\")\")*(INDEX(INDIRECT(\"'\"&INT((MONTH(A21)-1)/6)+1&IF(INT((MONTH(A21)-1)/6)+1=1,\"ER SEMESTRE \",\"EME SEMESTRE \")&YEAR(A21)&\"'\"&\"!$B$9:$HA$43\"),0,MATCH($A21,INDIRECT(\"'\"&INT((MONTH(A21)-1)/6)+1&IF(INT((MONTH(A21)-1)/6)+1=1,\"ER SEMESTRE \",\"EME SEMESTRE \")&YEAR(A21)&\"'\"&\"!$B$7:$HA$7\"),0))=\"R\"),ROW(INDIRECT(\"'\"&INT((MONTH(A21)-1)/6)+1&IF(INT((MONTH(A21)-1)/6)+1=1,\"ER SEMESTRE \",\"EME SEMESTRE \")&YEAR(A21)&\"'\"&\"!D$9:D$43\"))-8,9^9),3)),\"\"),\n\n\nIFERROR(\nINDEX(OFFSET(INDIRECT(\"'\"&INT((MONTH(A21)-1)/6)+1&IF(INT((MONTH(A21)-1)/6)+1=1,\"ER SEMESTRE \",\"EME SEMESTRE \")&YEAR(A21)&\"'\"&\"!$B$9:$B$43\"),0,MATCH($A21,INDIRECT(\"'\"&INT((MONTH(A21)-1)/6)+1&IF(INT((MONTH(A21)-1)/6)+1=1,\"ER SEMESTRE \",\"EME SEMESTRE \")&YEAR(A21)&\"'\"&\"!$B$7:$HA$7\"),0)-DAY(A21)-2),\nSMALL(IF((OFFSET(INDIRECT(\"'\"&INT((MONTH(A21)-1)/6)+1&IF(INT((MONTH(A21)-1)/6)+1=1,\"ER SEMESTRE \",\"EME SEMESTRE \")&YEAR(A21)&\"'\"&\"!$B$9:$B$43\"),0,MATCH($A21,INDIRECT(\"'\"&INT((MONTH(A21)-1)/6)+1&IF(INT((MONTH(A21)-1)/6)+1=1,\"ER SEMESTRE \",\"EME SEMESTRE \")&YEAR(A21)&\"'\"&\"!$B$7:$HA$7\"),0)-DAY(A21)-1)=\"(\"&$G$9&\")\")*(INDEX(INDIRECT(\"'\"&INT((MONTH(A21)-1)/6)+1&IF(INT((MONTH(A21)-1)/6)+1=1,\"ER SEMESTRE \",\"EME SEMESTRE \")&YEAR(A21)&\"'\"&\"!$B$9:$HA$43\"),0,MATCH($A21,INDIRECT(\"'\"&INT((MONTH(A21)-1)/6)+1&IF(INT((MONTH(A21)-1)/6)+1=1,\"ER SEMESTRE \",\"EME SEMESTRE \")&YEAR(A21)&\"'\"&\"!$B$7:$HA$7\"),0))=\"R\"),ROW(INDIRECT(\"'\"&INT((MONTH(A21)-1)/6)+1&IF(INT((MONTH(A21)-1)/6)+1=1,\"ER SEMESTRE \",\"EME SEMESTRE \")&YEAR(A21)&\"'\"&\"!D$9:D$43\"))-8,9^9),2)),\"\")\n\n),\n\n\"\")","v":""}]
["2015-10-16",{"$f":"IFERROR(INDEX([3]PLANNING!$D$3:$Y$29,MATCH('[3]F_Dde de remplacement'!$G$8,[3]PLANNING!$B$3:$B$29,0),MATCH('[3]F_Dde de remplacement'!$A22,[3]PLANNING!$D$2:$Y$2,0)),\"\")","v":"R"},{"$f":"IF(OR($B22=\"M\",$B22=\"N\",$B22=\"A\"),IFERROR(INDEX(OFFSET(INDIRECT(\"'\"&INT((MONTH(A22)-1)/6)+1&IF(INT((MONTH(A22)-1)/6)+1=1,\"ER SEMESTRE \",\"EME SEMESTRE \")&YEAR(A22)&\"'\"&\"!$B$9:$B$43\"),0,MATCH($A22,INDIRECT(\"'\"&INT((MONTH(A22)-1)/6)+1&IF(INT((MONTH(A22)-1)/6)+1=1,\"ER SEMESTRE \",\"EME SEMESTRE \")&YEAR(A22)&\"'\"&\"!$B$7:$HA$7\"),0)-DAY(A22)-2),MIN(IF((OFFSET(INDIRECT(\"'\"&INT((MONTH(A22)-1)/6)+1&IF(INT((MONTH(A22)-1)/6)+1=1,\"ER SEMESTRE \",\"EME SEMESTRE \")&YEAR(A22)&\"'\"&\"!$B$9:$B$43\"),0,MATCH($A22,INDIRECT(\"'\"&INT((MONTH(A22)-1)/6)+1&IF(INT((MONTH(A22)-1)/6)+1=1,\"ER SEMESTRE \",\"EME SEMESTRE \")&YEAR(A22)&\"'\"&\"!$B$7:$HA$7\"),0)-DAY(A22)-1)=\"(\"&$G$9&\")\")*(INDEX(INDIRECT(\"'\"&INT((MONTH(A22)-1)/6)+1&IF(INT((MONTH(A22)-1)/6)+1=1,\"ER SEMESTRE \",\"EME SEMESTRE \")&YEAR(A22)&\"'\"&\"!$B$9:$HA$43\"),0,MATCH($A22,INDIRECT(\"'\"&INT((MONTH(A22)-1)/6)+1&IF(INT((MONTH(A22)-1)/6)+1=1,\"ER SEMESTRE \",\"EME SEMESTRE \")&YEAR(A22)&\"'\"&\"!$B$7:$HA$7\"),0))=\"J\"),ROW(INDIRECT(\"'\"&INT((MONTH(A22)-1)/6)+1&IF(INT((MONTH(A22)-1)/6)+1=1,\"ER SEMESTRE \",\"EME SEMESTRE \")&YEAR(A22)&\"'\"&\"!$D$9:$D$43\"))-8,9^9))),IFERROR(INDEX(OFFSET(INDIRECT(\"'\"&INT((MONTH(A22)-1)/6)+1&IF(INT((MONTH(A22)-1)/6)+1=1,\"ER SEMESTRE \",\"EME SEMESTRE \")&YEAR(A22)&\"'\"&\"!$B$9:$B$43\"),0,MATCH($A22,INDIRECT(\"'\"&INT((MONTH(A22)-1)/6)+1&IF(INT((MONTH(A22)-1)/6)+1=1,\"ER SEMESTRE \",\"EME SEMESTRE \")&YEAR(A22)&\"'\"&\"!$B$7:$HA$7\"),0)-DAY(A22)-2),MIN(IF((OFFSET(INDIRECT(\"'\"&INT((MONTH(A22)-1)/6)+1&IF(INT((MONTH(A22)-1)/6)+1=1,\"ER SEMESTRE \",\"EME SEMESTRE \")&YEAR(A22)&\"'\"&\"!$B$9:$B$43\"),0,MATCH($A22,INDIRECT(\"'\"&INT((MONTH(A22)-1)/6)+1&IF(INT((MONTH(A22)-1)/6)+1=1,\"ER SEMESTRE \",\"EME SEMESTRE \")&YEAR(A22)&\"'\"&\"!$B$7:$HA$7\"),0)-DAY(A22)-1)=\"(\"&$G$9&\")\")*(INDEX(INDIRECT(\"'\"&INT((MONTH(A22)-1)/6)+1&IF(INT((MONTH(A22)-1)/6)+1=1,\"ER SEMESTRE \",\"EME SEMESTRE \")&YEAR(A22)&\"'\"&\"!$B$9:$HA$43\"),0,MATCH($A22,INDIRECT(\"'\"&INT((MONTH(A22)-1)/6)+1&IF(INT((MONTH(A22)-1)/6)+1=1,\"ER SEMESTRE \",\"EME SEMESTRE \")&YEAR(A22)&\"'\"&\"!$B$7:$HA$7\"),0))=\"R\"),ROW(INDIRECT(\"'\"&INT((MONTH(A22)-1)/6)+1&IF(INT((MONTH(A22)-1)/6)+1=1,\"ER SEMESTRE \",\"EME SEMESTRE \")&YEAR(A22)&\"'\"&\"!$D$9:$D$43\"))-8,9^9))),\"\")),\"\")","v":""},null,{"$f":"IF(OR($B22=\"M\",$B22=\"N\",$B22=\"A\"),IF(\nIFERROR(INDEX(OFFSET(INDIRECT(\"'\"&INT((MONTH(A22)-1)/6)+1&IF(INT((MONTH(A22)-1)/6)+1=1,\"ER SEMESTRE \",\"EME SEMESTRE \")&YEAR(A22)&\"'\"&\"!$B$9:$B$43\"),0,MATCH($A22,INDIRECT(\"'\"&INT((MONTH(A22)-1)/6)+1&IF(INT((MONTH(A22)-1)/6)+1=1,\"ER SEMESTRE \",\"EME SEMESTRE \")&YEAR(A22)&\"'\"&\"!$B$7:$HA$7\"),0)-DAY(A22)-2),MIN(IF((OFFSET(INDIRECT(\"'\"&INT((MONTH(A22)-1)/6)+1&IF(INT((MONTH(A22)-1)/6)+1=1,\"ER SEMESTRE \",\"EME SEMESTRE \")&YEAR(A22)&\"'\"&\"!$B$9:$B$43\"),0,MATCH($A22,INDIRECT(\"'\"&INT((MONTH(A22)-1)/6)+1&IF(INT((MONTH(A22)-1)/6)+1=1,\"ER SEMESTRE \",\"EME SEMESTRE \")&YEAR(A22)&\"'\"&\"!$B$7:$HA$7\"),0)-DAY(A22)-1)=\"(\"&$G$9&\")\")*(INDEX(INDIRECT(\"'\"&INT((MONTH(A22)-1)/6)+1&IF(INT((MONTH(A22)-1)/6)+1=1,\"ER SEMESTRE \",\"EME SEMESTRE \")&YEAR(A22)&\"'\"&\"!$B$9:$HA$43\"),0,MATCH($A22,INDIRECT(\"'\"&INT((MONTH(A22)-1)/6)+1&IF(INT((MONTH(A22)-1)/6)+1=1,\"ER SEMESTRE \",\"EME SEMESTRE \")&YEAR(A22)&\"'\"&\"!$B$7:$HA$7\"),0))=\"J\"),ROW(INDIRECT(\"'\"&INT((MONTH(A22)-1)/6)+1&IF(INT((MONTH(A22)-1)/6)+1=1,\"ER SEMESTRE \",\"EME SEMESTRE \")&YEAR(A22)&\"'\"&\"!$D$9:$D$43\"))-8,9^9))),\"\")=\"\",\n\nIFERROR(INDEX(OFFSET(INDIRECT(\"'\"&INT((MONTH(A22)-1)/6)+1&IF(INT((MONTH(A22)-1)/6)+1=1,\"ER SEMESTRE \",\"EME SEMESTRE \")&YEAR(A22)&\"'\"&\"!$B$9:$B$43\"),0,MATCH($A22,INDIRECT(\"'\"&INT((MONTH(A22)-1)/6)+1&IF(INT((MONTH(A22)-1)/6)+1=1,\"ER SEMESTRE \",\"EME SEMESTRE \")&YEAR(A22)&\"'\"&\"!$B$7:$HA$7\"),0)-DAY(A22)-2),SMALL(IF((OFFSET(INDIRECT(\"'\"&INT((MONTH(A22)-1)/6)+1&IF(INT((MONTH(A22)-1)/6)+1=1,\"ER SEMESTRE \",\"EME SEMESTRE \")&YEAR(A22)&\"'\"&\"!$B$9:$B$43\"),0,MATCH($A22,INDIRECT(\"'\"&INT((MONTH(A22)-1)/6)+1&IF(INT((MONTH(A22)-1)/6)+1=1,\"ER SEMESTRE \",\"EME SEMESTRE \")&YEAR(A22)&\"'\"&\"!$B$7:$HA$7\"),0)-DAY(A22)-1)=\"(\"&$G$9&\")\")*(INDEX(INDIRECT(\"'\"&INT((MONTH(A22)-1)/6)+1&IF(INT((MONTH(A22)-1)/6)+1=1,\"ER SEMESTRE \",\"EME SEMESTRE \")&YEAR(A22)&\"'\"&\"!$B$9:$HA$43\"),0,MATCH($A22,INDIRECT(\"'\"&INT((MONTH(A22)-1)/6)+1&IF(INT((MONTH(A22)-1)/6)+1=1,\"ER SEMESTRE \",\"EME SEMESTRE \")&YEAR(A22)&\"'\"&\"!$B$7:$HA$7\"),0))=\"R\"),ROW(INDIRECT(\"'\"&INT((MONTH(A22)-1)/6)+1&IF(INT((MONTH(A22)-1)/6)+1=1,\"ER SEMESTRE \",\"EME SEMESTRE \")&YEAR(A22)&\"'\"&\"!D$9:D$43\"))-8,9^9),2)),\"\"),\n\nIFERROR(\nINDEX(\nOFFSET(INDIRECT(\"'\"&INT((MONTH(A22)-1)/6)+1&IF(INT((MONTH(A22)-1)/6)+1=1,\"ER SEMESTRE \",\"EME SEMESTRE \")&YEAR(A22)&\"'\"&\"!$B$9:$B$43\"),0,MATCH($A22,INDIRECT(\"'\"&INT((MONTH(A22)-1)/6)+1&IF(INT((MONTH(A22)-1)/6)+1=1,\"ER SEMESTRE \",\"EME SEMESTRE \")&YEAR(A22)&\"'\"&\"!$B$7:$HA$7\"),0)-DAY(A22)-2),\n\nMIN(IF(\n(OFFSET(INDIRECT(\"'\"&INT((MONTH(A22)-1)/6)+1&IF(INT((MONTH(A22)-1)/6)+1=1,\"ER SEMESTRE \",\"EME SEMESTRE \")&YEAR(A22)&\"'\"&\"!$B$9:$B$43\"),0,MATCH($A22,INDIRECT(\"'\"&INT((MONTH(A22)-1)/6)+1&IF(INT((MONTH(A22)-1)/6)+1=1,\"ER SEMESTRE \",\"EME SEMESTRE \")&YEAR(A22)&\"'\"&\"!$B$7:$HA$7\"),0)-DAY(A22)-1)=\"(\"&$G$9&\")\")\n*\n(INDEX(INDIRECT(\"'\"&INT((MONTH(A22)-1)/6)+1&IF(INT((MONTH(A22)-1)/6)+1=1,\"ER SEMESTRE \",\"EME SEMESTRE \")&YEAR(A22)&\"'\"&\"!$B$9:$HA$43\"),0,MATCH($A22,INDIRECT(\"'\"&INT((MONTH(A22)-1)/6)+1&IF(INT((MONTH(A22)-1)/6)+1=1,\"ER SEMESTRE \",\"EME SEMESTRE \")&YEAR(A22)&\"'\"&\"!$B$7:$HA$7\"),0))=\"R\"),\n\nROW(INDIRECT(\"'\"&INT((MONTH(A22)-1)/6)+1&IF(INT((MONTH(A22)-1)/6)+1=1,\"ER SEMESTRE \",\"EME SEMESTRE \")&YEAR(A22)&\"'\"&\"!D$9:D$43\"))-8,\n\n9^9))),\"\")),\"\")","v":""},null,{"$f":"IF(OR($B22=\"M\",$B22=\"N\",$B22=\"A\"),IF(\n\nIFERROR(INDEX(OFFSET(INDIRECT(\"'\"&INT((MONTH(A22)-1)/6)+1&IF(INT((MONTH(A22)-1)/6)+1=1,\"ER SEMESTRE \",\"EME SEMESTRE \")&YEAR(A22)&\"'\"&\"!$B$9:$B$43\"),0,MATCH($A22,INDIRECT(\"'\"&INT((MONTH(A22)-1)/6)+1&IF(INT((MONTH(A22)-1)/6)+1=1,\"ER SEMESTRE \",\"EME SEMESTRE \")&YEAR(A22)&\"'\"&\"!$B$7:$HA$7\"),0)-DAY(A22)-2),MIN(IF((OFFSET(INDIRECT(\"'\"&INT((MONTH(A22)-1)/6)+1&IF(INT((MONTH(A22)-1)/6)+1=1,\"ER SEMESTRE \",\"EME SEMESTRE \")&YEAR(A22)&\"'\"&\"!$B$9:$B$43\"),0,MATCH($A22,INDIRECT(\"'\"&INT((MONTH(A22)-1)/6)+1&IF(INT((MONTH(A22)-1)/6)+1=1,\"ER SEMESTRE \",\"EME SEMESTRE \")&YEAR(A22)&\"'\"&\"!$B$7:$HA$7\"),0)-DAY(A22)-1)=\"(\"&$G$9&\")\")*(INDEX(INDIRECT(\"'\"&INT((MONTH(A22)-1)/6)+1&IF(INT((MONTH(A22)-1)/6)+1=1,\"ER SEMESTRE \",\"EME SEMESTRE \")&YEAR(A22)&\"'\"&\"!$B$9:$HA$43\"),0,MATCH($A22,INDIRECT(\"'\"&INT((MONTH(A22)-1)/6)+1&IF(INT((MONTH(A22)-1)/6)+1=1,\"ER SEMESTRE \",\"EME SEMESTRE \")&YEAR(A22)&\"'\"&\"!$B$7:$HA$7\"),0))=\"J\"),ROW(INDIRECT(\"'\"&INT((MONTH(A22)-1)/6)+1&IF(INT((MONTH(A22)-1)/6)+1=1,\"ER SEMESTRE \",\"EME SEMESTRE \")&YEAR(A22)&\"'\"&\"!$D$9:$D$43\"))-8,9^9))),\"\")=\"\",\n\nIFERROR(\nINDEX(OFFSET(INDIRECT(\"'\"&INT((MONTH(A22)-1)/6)+1&IF(INT((MONTH(A22)-1)/6)+1=1,\"ER SEMESTRE \",\"EME SEMESTRE \")&YEAR(A22)&\"'\"&\"!$B$9:$B$43\"),0,MATCH($A22,INDIRECT(\"'\"&INT((MONTH(A22)-1)/6)+1&IF(INT((MONTH(A22)-1)/6)+1=1,\"ER SEMESTRE \",\"EME SEMESTRE \")&YEAR(A22)&\"'\"&\"!$B$7:$HA$7\"),0)-DAY(A22)-2),\nSMALL(IF((OFFSET(INDIRECT(\"'\"&INT((MONTH(A22)-1)/6)+1&IF(INT((MONTH(A22)-1)/6)+1=1,\"ER SEMESTRE \",\"EME SEMESTRE \")&YEAR(A22)&\"'\"&\"!$B$9:$B$43\"),0,MATCH($A22,INDIRECT(\"'\"&INT((MONTH(A22)-1)/6)+1&IF(INT((MONTH(A22)-1)/6)+1=1,\"ER SEMESTRE \",\"EME SEMESTRE \")&YEAR(A22)&\"'\"&\"!$B$7:$HA$7\"),0)-DAY(A22)-1)=\"(\"&$G$9&\")\")*(INDEX(INDIRECT(\"'\"&INT((MONTH(A22)-1)/6)+1&IF(INT((MONTH(A22)-1)/6)+1=1,\"ER SEMESTRE \",\"EME SEMESTRE \")&YEAR(A22)&\"'\"&\"!$B$9:$HA$43\"),0,MATCH($A22,INDIRECT(\"'\"&INT((MONTH(A22)-1)/6)+1&IF(INT((MONTH(A22)-1)/6)+1=1,\"ER SEMESTRE \",\"EME SEMESTRE \")&YEAR(A22)&\"'\"&\"!$B$7:$HA$7\"),0))=\"R\"),ROW(INDIRECT(\"'\"&INT((MONTH(A22)-1)/6)+1&IF(INT((MONTH(A22)-1)/6)+1=1,\"ER SEMESTRE \",\"EME SEMESTRE \")&YEAR(A22)&\"'\"&\"!D$9:D$43\"))-8,9^9),3)),\"\"),\n\n\nIFERROR(\nINDEX(OFFSET(INDIRECT(\"'\"&INT((MONTH(A22)-1)/6)+1&IF(INT((MONTH(A22)-1)/6)+1=1,\"ER SEMESTRE \",\"EME SEMESTRE \")&YEAR(A22)&\"'\"&\"!$B$9:$B$43\"),0,MATCH($A22,INDIRECT(\"'\"&INT((MONTH(A22)-1)/6)+1&IF(INT((MONTH(A22)-1)/6)+1=1,\"ER SEMESTRE \",\"EME SEMESTRE \")&YEAR(A22)&\"'\"&\"!$B$7:$HA$7\"),0)-DAY(A22)-2),\nSMALL(IF((OFFSET(INDIRECT(\"'\"&INT((MONTH(A22)-1)/6)+1&IF(INT((MONTH(A22)-1)/6)+1=1,\"ER SEMESTRE \",\"EME SEMESTRE \")&YEAR(A22)&\"'\"&\"!$B$9:$B$43\"),0,MATCH($A22,INDIRECT(\"'\"&INT((MONTH(A22)-1)/6)+1&IF(INT((MONTH(A22)-1)/6)+1=1,\"ER SEMESTRE \",\"EME SEMESTRE \")&YEAR(A22)&\"'\"&\"!$B$7:$HA$7\"),0)-DAY(A22)-1)=\"(\"&$G$9&\")\")*(INDEX(INDIRECT(\"'\"&INT((MONTH(A22)-1)/6)+1&IF(INT((MONTH(A22)-1)/6)+1=1,\"ER SEMESTRE \",\"EME SEMESTRE \")&YEAR(A22)&\"'\"&\"!$B$9:$HA$43\"),0,MATCH($A22,INDIRECT(\"'\"&INT((MONTH(A22)-1)/6)+1&IF(INT((MONTH(A22)-1)/6)+1=1,\"ER SEMESTRE \",\"EME SEMESTRE \")&YEAR(A22)&\"'\"&\"!$B$7:$HA$7\"),0))=\"R\"),ROW(INDIRECT(\"'\"&INT((MONTH(A22)-1)/6)+1&IF(INT((MONTH(A22)-1)/6)+1=1,\"ER SEMESTRE \",\"EME SEMESTRE \")&YEAR(A22)&\"'\"&\"!D$9:D$43\"))-8,9^9),2)),\"\")\n\n),\n\n\"\")","v":""}]
["2015-10-17",{"$f":"IFERROR(INDEX([3]PLANNING!$D$3:$Y$29,MATCH('[3]F_Dde de remplacement'!$G$8,[3]PLANNING!$B$3:$B$29,0),MATCH('[3]F_Dde de remplacement'!$A23,[3]PLANNING!$D$2:$Y$2,0)),\"\")","v":"M"},{"$f":"IF(OR($B23=\"M\",$B23=\"N\",$B23=\"A\"),IFERROR(INDEX(OFFSET(INDIRECT(\"'\"&INT((MONTH(A23)-1)/6)+1&IF(INT((MONTH(A23)-1)/6)+1=1,\"ER SEMESTRE \",\"EME SEMESTRE \")&YEAR(A23)&\"'\"&\"!$B$9:$B$43\"),0,MATCH($A23,INDIRECT(\"'\"&INT((MONTH(A23)-1)/6)+1&IF(INT((MONTH(A23)-1)/6)+1=1,\"ER SEMESTRE \",\"EME SEMESTRE \")&YEAR(A23)&\"'\"&\"!$B$7:$HA$7\"),0)-DAY(A23)-2),MIN(IF((OFFSET(INDIRECT(\"'\"&INT((MONTH(A23)-1)/6)+1&IF(INT((MONTH(A23)-1)/6)+1=1,\"ER SEMESTRE \",\"EME SEMESTRE \")&YEAR(A23)&\"'\"&\"!$B$9:$B$43\"),0,MATCH($A23,INDIRECT(\"'\"&INT((MONTH(A23)-1)/6)+1&IF(INT((MONTH(A23)-1)/6)+1=1,\"ER SEMESTRE \",\"EME SEMESTRE \")&YEAR(A23)&\"'\"&\"!$B$7:$HA$7\"),0)-DAY(A23)-1)=\"(\"&$G$9&\")\")*(INDEX(INDIRECT(\"'\"&INT((MONTH(A23)-1)/6)+1&IF(INT((MONTH(A23)-1)/6)+1=1,\"ER SEMESTRE \",\"EME SEMESTRE \")&YEAR(A23)&\"'\"&\"!$B$9:$HA$43\"),0,MATCH($A23,INDIRECT(\"'\"&INT((MONTH(A23)-1)/6)+1&IF(INT((MONTH(A23)-1)/6)+1=1,\"ER SEMESTRE \",\"EME SEMESTRE \")&YEAR(A23)&\"'\"&\"!$B$7:$HA$7\"),0))=\"J\"),ROW(INDIRECT(\"'\"&INT((MONTH(A23)-1)/6)+1&IF(INT((MONTH(A23)-1)/6)+1=1,\"ER SEMESTRE \",\"EME SEMESTRE \")&YEAR(A23)&\"'\"&\"!$D$9:$D$43\"))-8,9^9))),IFERROR(INDEX(OFFSET(INDIRECT(\"'\"&INT((MONTH(A23)-1)/6)+1&IF(INT((MONTH(A23)-1)/6)+1=1,\"ER SEMESTRE \",\"EME SEMESTRE \")&YEAR(A23)&\"'\"&\"!$B$9:$B$43\"),0,MATCH($A23,INDIRECT(\"'\"&INT((MONTH(A23)-1)/6)+1&IF(INT((MONTH(A23)-1)/6)+1=1,\"ER SEMESTRE \",\"EME SEMESTRE \")&YEAR(A23)&\"'\"&\"!$B$7:$HA$7\"),0)-DAY(A23)-2),MIN(IF((OFFSET(INDIRECT(\"'\"&INT((MONTH(A23)-1)/6)+1&IF(INT((MONTH(A23)-1)/6)+1=1,\"ER SEMESTRE \",\"EME SEMESTRE \")&YEAR(A23)&\"'\"&\"!$B$9:$B$43\"),0,MATCH($A23,INDIRECT(\"'\"&INT((MONTH(A23)-1)/6)+1&IF(INT((MONTH(A23)-1)/6)+1=1,\"ER SEMESTRE \",\"EME SEMESTRE \")&YEAR(A23)&\"'\"&\"!$B$7:$HA$7\"),0)-DAY(A23)-1)=\"(\"&$G$9&\")\")*(INDEX(INDIRECT(\"'\"&INT((MONTH(A23)-1)/6)+1&IF(INT((MONTH(A23)-1)/6)+1=1,\"ER SEMESTRE \",\"EME SEMESTRE \")&YEAR(A23)&\"'\"&\"!$B$9:$HA$43\"),0,MATCH($A23,INDIRECT(\"'\"&INT((MONTH(A23)-1)/6)+1&IF(INT((MONTH(A23)-1)/6)+1=1,\"ER SEMESTRE \",\"EME SEMESTRE \")&YEAR(A23)&\"'\"&\"!$B$7:$HA$7\"),0))=\"R\"),ROW(INDIRECT(\"'\"&INT((MONTH(A23)-1)/6)+1&IF(INT((MONTH(A23)-1)/6)+1=1,\"ER SEMESTRE \",\"EME SEMESTRE \")&YEAR(A23)&\"'\"&\"!$D$9:$D$43\"))-8,9^9))),\"\")),\"\")","v":"JGF"},null,{"$f":"IF(OR($B23=\"M\",$B23=\"N\",$B23=\"A\"),IF(\nIFERROR(INDEX(OFFSET(INDIRECT(\"'\"&INT((MONTH(A23)-1)/6)+1&IF(INT((MONTH(A23)-1)/6)+1=1,\"ER SEMESTRE \",\"EME SEMESTRE \")&YEAR(A23)&\"'\"&\"!$B$9:$B$43\"),0,MATCH($A23,INDIRECT(\"'\"&INT((MONTH(A23)-1)/6)+1&IF(INT((MONTH(A23)-1)/6)+1=1,\"ER SEMESTRE \",\"EME SEMESTRE \")&YEAR(A23)&\"'\"&\"!$B$7:$HA$7\"),0)-DAY(A23)-2),MIN(IF((OFFSET(INDIRECT(\"'\"&INT((MONTH(A23)-1)/6)+1&IF(INT((MONTH(A23)-1)/6)+1=1,\"ER SEMESTRE \",\"EME SEMESTRE \")&YEAR(A23)&\"'\"&\"!$B$9:$B$43\"),0,MATCH($A23,INDIRECT(\"'\"&INT((MONTH(A23)-1)/6)+1&IF(INT((MONTH(A23)-1)/6)+1=1,\"ER SEMESTRE \",\"EME SEMESTRE \")&YEAR(A23)&\"'\"&\"!$B$7:$HA$7\"),0)-DAY(A23)-1)=\"(\"&$G$9&\")\")*(INDEX(INDIRECT(\"'\"&INT((MONTH(A23)-1)/6)+1&IF(INT((MONTH(A23)-1)/6)+1=1,\"ER SEMESTRE \",\"EME SEMESTRE \")&YEAR(A23)&\"'\"&\"!$B$9:$HA$43\"),0,MATCH($A23,INDIRECT(\"'\"&INT((MONTH(A23)-1)/6)+1&IF(INT((MONTH(A23)-1)/6)+1=1,\"ER SEMESTRE \",\"EME SEMESTRE \")&YEAR(A23)&\"'\"&\"!$B$7:$HA$7\"),0))=\"J\"),ROW(INDIRECT(\"'\"&INT((MONTH(A23)-1)/6)+1&IF(INT((MONTH(A23)-1)/6)+1=1,\"ER SEMESTRE \",\"EME SEMESTRE \")&YEAR(A23)&\"'\"&\"!$D$9:$D$43\"))-8,9^9))),\"\")=\"\",\n\nIFERROR(INDEX(OFFSET(INDIRECT(\"'\"&INT((MONTH(A23)-1)/6)+1&IF(INT((MONTH(A23)-1)/6)+1=1,\"ER SEMESTRE \",\"EME SEMESTRE \")&YEAR(A23)&\"'\"&\"!$B$9:$B$43\"),0,MATCH($A23,INDIRECT(\"'\"&INT((MONTH(A23)-1)/6)+1&IF(INT((MONTH(A23)-1)/6)+1=1,\"ER SEMESTRE \",\"EME SEMESTRE \")&YEAR(A23)&\"'\"&\"!$B$7:$HA$7\"),0)-DAY(A23)-2),SMALL(IF((OFFSET(INDIRECT(\"'\"&INT((MONTH(A23)-1)/6)+1&IF(INT((MONTH(A23)-1)/6)+1=1,\"ER SEMESTRE \",\"EME SEMESTRE \")&YEAR(A23)&\"'\"&\"!$B$9:$B$43\"),0,MATCH($A23,INDIRECT(\"'\"&INT((MONTH(A23)-1)/6)+1&IF(INT((MONTH(A23)-1)/6)+1=1,\"ER SEMESTRE \",\"EME SEMESTRE \")&YEAR(A23)&\"'\"&\"!$B$7:$HA$7\"),0)-DAY(A23)-1)=\"(\"&$G$9&\")\")*(INDEX(INDIRECT(\"'\"&INT((MONTH(A23)-1)/6)+1&IF(INT((MONTH(A23)-1)/6)+1=1,\"ER SEMESTRE \",\"EME SEMESTRE \")&YEAR(A23)&\"'\"&\"!$B$9:$HA$43\"),0,MATCH($A23,INDIRECT(\"'\"&INT((MONTH(A23)-1)/6)+1&IF(INT((MONTH(A23)-1)/6)+1=1,\"ER SEMESTRE \",\"EME SEMESTRE \")&YEAR(A23)&\"'\"&\"!$B$7:$HA$7\"),0))=\"R\"),ROW(INDIRECT(\"'\"&INT((MONTH(A23)-1)/6)+1&IF(INT((MONTH(A23)-1)/6)+1=1,\"ER SEMESTRE \",\"EME SEMESTRE \")&YEAR(A23)&\"'\"&\"!D$9:D$43\"))-8,9^9),2)),\"\"),\n\nIFERROR(\nINDEX(\nOFFSET(INDIRECT(\"'\"&INT((MONTH(A23)-1)/6)+1&IF(INT((MONTH(A23)-1)/6)+1=1,\"ER SEMESTRE \",\"EME SEMESTRE \")&YEAR(A23)&\"'\"&\"!$B$9:$B$43\"),0,MATCH($A23,INDIRECT(\"'\"&INT((MONTH(A23)-1)/6)+1&IF(INT((MONTH(A23)-1)/6)+1=1,\"ER SEMESTRE \",\"EME SEMESTRE \")&YEAR(A23)&\"'\"&\"!$B$7:$HA$7\"),0)-DAY(A23)-2),\n\nMIN(IF(\n(OFFSET(INDIRECT(\"'\"&INT((MONTH(A23)-1)/6)+1&IF(INT((MONTH(A23)-1)/6)+1=1,\"ER SEMESTRE \",\"EME SEMESTRE \")&YEAR(A23)&\"'\"&\"!$B$9:$B$43\"),0,MATCH($A23,INDIRECT(\"'\"&INT((MONTH(A23)-1)/6)+1&IF(INT((MONTH(A23)-1)/6)+1=1,\"ER SEMESTRE \",\"EME SEMESTRE \")&YEAR(A23)&\"'\"&\"!$B$7:$HA$7\"),0)-DAY(A23)-1)=\"(\"&$G$9&\")\")\n*\n(INDEX(INDIRECT(\"'\"&INT((MONTH(A23)-1)/6)+1&IF(INT((MONTH(A23)-1)/6)+1=1,\"ER SEMESTRE \",\"EME SEMESTRE \")&YEAR(A23)&\"'\"&\"!$B$9:$HA$43\"),0,MATCH($A23,INDIRECT(\"'\"&INT((MONTH(A23)-1)/6)+1&IF(INT((MONTH(A23)-1)/6)+1=1,\"ER SEMESTRE \",\"EME SEMESTRE \")&YEAR(A23)&\"'\"&\"!$B$7:$HA$7\"),0))=\"R\"),\n\nROW(INDIRECT(\"'\"&INT((MONTH(A23)-1)/6)+1&IF(INT((MONTH(A23)-1)/6)+1=1,\"ER SEMESTRE \",\"EME SEMESTRE \")&YEAR(A23)&\"'\"&\"!D$9:D$43\"))-8,\n\n9^9))),\"\")),\"\")","v":"GBA"},null,{"$f":"IF(OR($B23=\"M\",$B23=\"N\",$B23=\"A\"),IF(\n\nIFERROR(INDEX(OFFSET(INDIRECT(\"'\"&INT((MONTH(A23)-1)/6)+1&IF(INT((MONTH(A23)-1)/6)+1=1,\"ER SEMESTRE \",\"EME SEMESTRE \")&YEAR(A23)&\"'\"&\"!$B$9:$B$43\"),0,MATCH($A23,INDIRECT(\"'\"&INT((MONTH(A23)-1)/6)+1&IF(INT((MONTH(A23)-1)/6)+1=1,\"ER SEMESTRE \",\"EME SEMESTRE \")&YEAR(A23)&\"'\"&\"!$B$7:$HA$7\"),0)-DAY(A23)-2),MIN(IF((OFFSET(INDIRECT(\"'\"&INT((MONTH(A23)-1)/6)+1&IF(INT((MONTH(A23)-1)/6)+1=1,\"ER SEMESTRE \",\"EME SEMESTRE \")&YEAR(A23)&\"'\"&\"!$B$9:$B$43\"),0,MATCH($A23,INDIRECT(\"'\"&INT((MONTH(A23)-1)/6)+1&IF(INT((MONTH(A23)-1)/6)+1=1,\"ER SEMESTRE \",\"EME SEMESTRE \")&YEAR(A23)&\"'\"&\"!$B$7:$HA$7\"),0)-DAY(A23)-1)=\"(\"&$G$9&\")\")*(INDEX(INDIRECT(\"'\"&INT((MONTH(A23)-1)/6)+1&IF(INT((MONTH(A23)-1)/6)+1=1,\"ER SEMESTRE \",\"EME SEMESTRE \")&YEAR(A23)&\"'\"&\"!$B$9:$HA$43\"),0,MATCH($A23,INDIRECT(\"'\"&INT((MONTH(A23)-1)/6)+1&IF(INT((MONTH(A23)-1)/6)+1=1,\"ER SEMESTRE \",\"EME SEMESTRE \")&YEAR(A23)&\"'\"&\"!$B$7:$HA$7\"),0))=\"J\"),ROW(INDIRECT(\"'\"&INT((MONTH(A23)-1)/6)+1&IF(INT((MONTH(A23)-1)/6)+1=1,\"ER SEMESTRE \",\"EME SEMESTRE \")&YEAR(A23)&\"'\"&\"!$D$9:$D$43\"))-8,9^9))),\"\")=\"\",\n\nIFERROR(\nINDEX(OFFSET(INDIRECT(\"'\"&INT((MONTH(A23)-1)/6)+1&IF(INT((MONTH(A23)-1)/6)+1=1,\"ER SEMESTRE \",\"EME SEMESTRE \")&YEAR(A23)&\"'\"&\"!$B$9:$B$43\"),0,MATCH($A23,INDIRECT(\"'\"&INT((MONTH(A23)-1)/6)+1&IF(INT((MONTH(A23)-1)/6)+1=1,\"ER SEMESTRE \",\"EME SEMESTRE \")&YEAR(A23)&\"'\"&\"!$B$7:$HA$7\"),0)-DAY(A23)-2),\nSMALL(IF((OFFSET(INDIRECT(\"'\"&INT((MONTH(A23)-1)/6)+1&IF(INT((MONTH(A23)-1)/6)+1=1,\"ER SEMESTRE \",\"EME SEMESTRE \")&YEAR(A23)&\"'\"&\"!$B$9:$B$43\"),0,MATCH($A23,INDIRECT(\"'\"&INT((MONTH(A23)-1)/6)+1&IF(INT((MONTH(A23)-1)/6)+1=1,\"ER SEMESTRE \",\"EME SEMESTRE \")&YEAR(A23)&\"'\"&\"!$B$7:$HA$7\"),0)-DAY(A23)-1)=\"(\"&$G$9&\")\")*(INDEX(INDIRECT(\"'\"&INT((MONTH(A23)-1)/6)+1&IF(INT((MONTH(A23)-1)/6)+1=1,\"ER SEMESTRE \",\"EME SEMESTRE \")&YEAR(A23)&\"'\"&\"!$B$9:$HA$43\"),0,MATCH($A23,INDIRECT(\"'\"&INT((MONTH(A23)-1)/6)+1&IF(INT((MONTH(A23)-1)/6)+1=1,\"ER SEMESTRE \",\"EME SEMESTRE \")&YEAR(A23)&\"'\"&\"!$B$7:$HA$7\"),0))=\"R\"),ROW(INDIRECT(\"'\"&INT((MONTH(A23)-1)/6)+1&IF(INT((MONTH(A23)-1)/6)+1=1,\"ER SEMESTRE \",\"EME SEMESTRE \")&YEAR(A23)&\"'\"&\"!D$9:D$43\"))-8,9^9),3)),\"\"),\n\n\nIFERROR(\nINDEX(OFFSET(INDIRECT(\"'\"&INT((MONTH(A23)-1)/6)+1&IF(INT((MONTH(A23)-1)/6)+1=1,\"ER SEMESTRE \",\"EME SEMESTRE \")&YEAR(A23)&\"'\"&\"!$B$9:$B$43\"),0,MATCH($A23,INDIRECT(\"'\"&INT((MONTH(A23)-1)/6)+1&IF(INT((MONTH(A23)-1)/6)+1=1,\"ER SEMESTRE \",\"EME SEMESTRE \")&YEAR(A23)&\"'\"&\"!$B$7:$HA$7\"),0)-DAY(A23)-2),\nSMALL(IF((OFFSET(INDIRECT(\"'\"&INT((MONTH(A23)-1)/6)+1&IF(INT((MONTH(A23)-1)/6)+1=1,\"ER SEMESTRE \",\"EME SEMESTRE \")&YEAR(A23)&\"'\"&\"!$B$9:$B$43\"),0,MATCH($A23,INDIRECT(\"'\"&INT((MONTH(A23)-1)/6)+1&IF(INT((MONTH(A23)-1)/6)+1=1,\"ER SEMESTRE \",\"EME SEMESTRE \")&YEAR(A23)&\"'\"&\"!$B$7:$HA$7\"),0)-DAY(A23)-1)=\"(\"&$G$9&\")\")*(INDEX(INDIRECT(\"'\"&INT((MONTH(A23)-1)/6)+1&IF(INT((MONTH(A23)-1)/6)+1=1,\"ER SEMESTRE \",\"EME SEMESTRE \")&YEAR(A23)&\"'\"&\"!$B$9:$HA$43\"),0,MATCH($A23,INDIRECT(\"'\"&INT((MONTH(A23)-1)/6)+1&IF(INT((MONTH(A23)-1)/6)+1=1,\"ER SEMESTRE \",\"EME SEMESTRE \")&YEAR(A23)&\"'\"&\"!$B$7:$HA$7\"),0))=\"R\"),ROW(INDIRECT(\"'\"&INT((MONTH(A23)-1)/6)+1&IF(INT((MONTH(A23)-1)/6)+1=1,\"ER SEMESTRE \",\"EME SEMESTRE \")&YEAR(A23)&\"'\"&\"!D$9:D$43\"))-8,9^9),2)),\"\")\n\n),\n\n\"\")","v":"JLE"}]
["2015-10-18",{"$f":"IFERROR(INDEX([3]PLANNING!$D$3:$Y$29,MATCH('[3]F_Dde de remplacement'!$G$8,[3]PLANNING!$B$3:$B$29,0),MATCH('[3]F_Dde de remplacement'!$A24,[3]PLANNING!$D$2:$Y$2,0)),\"\")","v":"M"},{"$f":"IF(OR($B24=\"M\",$B24=\"N\",$B24=\"A\"),IFERROR(INDEX(OFFSET(INDIRECT(\"'\"&INT((MONTH(A24)-1)/6)+1&IF(INT((MONTH(A24)-1)/6)+1=1,\"ER SEMESTRE \",\"EME SEMESTRE \")&YEAR(A24)&\"'\"&\"!$B$9:$B$43\"),0,MATCH($A24,INDIRECT(\"'\"&INT((MONTH(A24)-1)/6)+1&IF(INT((MONTH(A24)-1)/6)+1=1,\"ER SEMESTRE \",\"EME SEMESTRE \")&YEAR(A24)&\"'\"&\"!$B$7:$HA$7\"),0)-DAY(A24)-2),MIN(IF((OFFSET(INDIRECT(\"'\"&INT((MONTH(A24)-1)/6)+1&IF(INT((MONTH(A24)-1)/6)+1=1,\"ER SEMESTRE \",\"EME SEMESTRE \")&YEAR(A24)&\"'\"&\"!$B$9:$B$43\"),0,MATCH($A24,INDIRECT(\"'\"&INT((MONTH(A24)-1)/6)+1&IF(INT((MONTH(A24)-1)/6)+1=1,\"ER SEMESTRE \",\"EME SEMESTRE \")&YEAR(A24)&\"'\"&\"!$B$7:$HA$7\"),0)-DAY(A24)-1)=\"(\"&$G$9&\")\")*(INDEX(INDIRECT(\"'\"&INT((MONTH(A24)-1)/6)+1&IF(INT((MONTH(A24)-1)/6)+1=1,\"ER SEMESTRE \",\"EME SEMESTRE \")&YEAR(A24)&\"'\"&\"!$B$9:$HA$43\"),0,MATCH($A24,INDIRECT(\"'\"&INT((MONTH(A24)-1)/6)+1&IF(INT((MONTH(A24)-1)/6)+1=1,\"ER SEMESTRE \",\"EME SEMESTRE \")&YEAR(A24)&\"'\"&\"!$B$7:$HA$7\"),0))=\"J\"),ROW(INDIRECT(\"'\"&INT((MONTH(A24)-1)/6)+1&IF(INT((MONTH(A24)-1)/6)+1=1,\"ER SEMESTRE \",\"EME SEMESTRE \")&YEAR(A24)&\"'\"&\"!$D$9:$D$43\"))-8,9^9))),IFERROR(INDEX(OFFSET(INDIRECT(\"'\"&INT((MONTH(A24)-1)/6)+1&IF(INT((MONTH(A24)-1)/6)+1=1,\"ER SEMESTRE \",\"EME SEMESTRE \")&YEAR(A24)&\"'\"&\"!$B$9:$B$43\"),0,MATCH($A24,INDIRECT(\"'\"&INT((MONTH(A24)-1)/6)+1&IF(INT((MONTH(A24)-1)/6)+1=1,\"ER SEMESTRE \",\"EME SEMESTRE \")&YEAR(A24)&\"'\"&\"!$B$7:$HA$7\"),0)-DAY(A24)-2),MIN(IF((OFFSET(INDIRECT(\"'\"&INT((MONTH(A24)-1)/6)+1&IF(INT((MONTH(A24)-1)/6)+1=1,\"ER SEMESTRE \",\"EME SEMESTRE \")&YEAR(A24)&\"'\"&\"!$B$9:$B$43\"),0,MATCH($A24,INDIRECT(\"'\"&INT((MONTH(A24)-1)/6)+1&IF(INT((MONTH(A24)-1)/6)+1=1,\"ER SEMESTRE \",\"EME SEMESTRE \")&YEAR(A24)&\"'\"&\"!$B$7:$HA$7\"),0)-DAY(A24)-1)=\"(\"&$G$9&\")\")*(INDEX(INDIRECT(\"'\"&INT((MONTH(A24)-1)/6)+1&IF(INT((MONTH(A24)-1)/6)+1=1,\"ER SEMESTRE \",\"EME SEMESTRE \")&YEAR(A24)&\"'\"&\"!$B$9:$HA$43\"),0,MATCH($A24,INDIRECT(\"'\"&INT((MONTH(A24)-1)/6)+1&IF(INT((MONTH(A24)-1)/6)+1=1,\"ER SEMESTRE \",\"EME SEMESTRE \")&YEAR(A24)&\"'\"&\"!$B$7:$HA$7\"),0))=\"R\"),ROW(INDIRECT(\"'\"&INT((MONTH(A24)-1)/6)+1&IF(INT((MONTH(A24)-1)/6)+1=1,\"ER SEMESTRE \",\"EME SEMESTRE \")&YEAR(A24)&\"'\"&\"!$D$9:$D$43\"))-8,9^9))),\"\")),\"\")","v":"JGF"},null,{"$f":"IF(OR($B24=\"M\",$B24=\"N\",$B24=\"A\"),IF(\nIFERROR(INDEX(OFFSET(INDIRECT(\"'\"&INT((MONTH(A24)-1)/6)+1&IF(INT((MONTH(A24)-1)/6)+1=1,\"ER SEMESTRE \",\"EME SEMESTRE \")&YEAR(A24)&\"'\"&\"!$B$9:$B$43\"),0,MATCH($A24,INDIRECT(\"'\"&INT((MONTH(A24)-1)/6)+1&IF(INT((MONTH(A24)-1)/6)+1=1,\"ER SEMESTRE \",\"EME SEMESTRE \")&YEAR(A24)&\"'\"&\"!$B$7:$HA$7\"),0)-DAY(A24)-2),MIN(IF((OFFSET(INDIRECT(\"'\"&INT((MONTH(A24)-1)/6)+1&IF(INT((MONTH(A24)-1)/6)+1=1,\"ER SEMESTRE \",\"EME SEMESTRE \")&YEAR(A24)&\"'\"&\"!$B$9:$B$43\"),0,MATCH($A24,INDIRECT(\"'\"&INT((MONTH(A24)-1)/6)+1&IF(INT((MONTH(A24)-1)/6)+1=1,\"ER SEMESTRE \",\"EME SEMESTRE \")&YEAR(A24)&\"'\"&\"!$B$7:$HA$7\"),0)-DAY(A24)-1)=\"(\"&$G$9&\")\")*(INDEX(INDIRECT(\"'\"&INT((MONTH(A24)-1)/6)+1&IF(INT((MONTH(A24)-1)/6)+1=1,\"ER SEMESTRE \",\"EME SEMESTRE \")&YEAR(A24)&\"'\"&\"!$B$9:$HA$43\"),0,MATCH($A24,INDIRECT(\"'\"&INT((MONTH(A24)-1)/6)+1&IF(INT((MONTH(A24)-1)/6)+1=1,\"ER SEMESTRE \",\"EME SEMESTRE \")&YEAR(A24)&\"'\"&\"!$B$7:$HA$7\"),0))=\"J\"),ROW(INDIRECT(\"'\"&INT((MONTH(A24)-1)/6)+1&IF(INT((MONTH(A24)-1)/6)+1=1,\"ER SEMESTRE \",\"EME SEMESTRE \")&YEAR(A24)&\"'\"&\"!$D$9:$D$43\"))-8,9^9))),\"\")=\"\",\n\nIFERROR(INDEX(OFFSET(INDIRECT(\"'\"&INT((MONTH(A24)-1)/6)+1&IF(INT((MONTH(A24)-1)/6)+1=1,\"ER SEMESTRE \",\"EME SEMESTRE \")&YEAR(A24)&\"'\"&\"!$B$9:$B$43\"),0,MATCH($A24,INDIRECT(\"'\"&INT((MONTH(A24)-1)/6)+1&IF(INT((MONTH(A24)-1)/6)+1=1,\"ER SEMESTRE \",\"EME SEMESTRE \")&YEAR(A24)&\"'\"&\"!$B$7:$HA$7\"),0)-DAY(A24)-2),SMALL(IF((OFFSET(INDIRECT(\"'\"&INT((MONTH(A24)-1)/6)+1&IF(INT((MONTH(A24)-1)/6)+1=1,\"ER SEMESTRE \",\"EME SEMESTRE \")&YEAR(A24)&\"'\"&\"!$B$9:$B$43\"),0,MATCH($A24,INDIRECT(\"'\"&INT((MONTH(A24)-1)/6)+1&IF(INT((MONTH(A24)-1)/6)+1=1,\"ER SEMESTRE \",\"EME SEMESTRE \")&YEAR(A24)&\"'\"&\"!$B$7:$HA$7\"),0)-DAY(A24)-1)=\"(\"&$G$9&\")\")*(INDEX(INDIRECT(\"'\"&INT((MONTH(A24)-1)/6)+1&IF(INT((MONTH(A24)-1)/6)+1=1,\"ER SEMESTRE \",\"EME SEMESTRE \")&YEAR(A24)&\"'\"&\"!$B$9:$HA$43\"),0,MATCH($A24,INDIRECT(\"'\"&INT((MONTH(A24)-1)/6)+1&IF(INT((MONTH(A24)-1)/6)+1=1,\"ER SEMESTRE \",\"EME SEMESTRE \")&YEAR(A24)&\"'\"&\"!$B$7:$HA$7\"),0))=\"R\"),ROW(INDIRECT(\"'\"&INT((MONTH(A24)-1)/6)+1&IF(INT((MONTH(A24)-1)/6)+1=1,\"ER SEMESTRE \",\"EME SEMESTRE \")&YEAR(A24)&\"'\"&\"!D$9:D$43\"))-8,9^9),2)),\"\"),\n\nIFERROR(\nINDEX(\nOFFSET(INDIRECT(\"'\"&INT((MONTH(A24)-1)/6)+1&IF(INT((MONTH(A24)-1)/6)+1=1,\"ER SEMESTRE \",\"EME SEMESTRE \")&YEAR(A24)&\"'\"&\"!$B$9:$B$43\"),0,MATCH($A24,INDIRECT(\"'\"&INT((MONTH(A24)-1)/6)+1&IF(INT((MONTH(A24)-1)/6)+1=1,\"ER SEMESTRE \",\"EME SEMESTRE \")&YEAR(A24)&\"'\"&\"!$B$7:$HA$7\"),0)-DAY(A24)-2),\n\nMIN(IF(\n(OFFSET(INDIRECT(\"'\"&INT((MONTH(A24)-1)/6)+1&IF(INT((MONTH(A24)-1)/6)+1=1,\"ER SEMESTRE \",\"EME SEMESTRE \")&YEAR(A24)&\"'\"&\"!$B$9:$B$43\"),0,MATCH($A24,INDIRECT(\"'\"&INT((MONTH(A24)-1)/6)+1&IF(INT((MONTH(A24)-1)/6)+1=1,\"ER SEMESTRE \",\"EME SEMESTRE \")&YEAR(A24)&\"'\"&\"!$B$7:$HA$7\"),0)-DAY(A24)-1)=\"(\"&$G$9&\")\")\n*\n(INDEX(INDIRECT(\"'\"&INT((MONTH(A24)-1)/6)+1&IF(INT((MONTH(A24)-1)/6)+1=1,\"ER SEMESTRE \",\"EME SEMESTRE \")&YEAR(A24)&\"'\"&\"!$B$9:$HA$43\"),0,MATCH($A24,INDIRECT(\"'\"&INT((MONTH(A24)-1)/6)+1&IF(INT((MONTH(A24)-1)/6)+1=1,\"ER SEMESTRE \",\"EME SEMESTRE \")&YEAR(A24)&\"'\"&\"!$B$7:$HA$7\"),0))=\"R\"),\n\nROW(INDIRECT(\"'\"&INT((MONTH(A24)-1)/6)+1&IF(INT((MONTH(A24)-1)/6)+1=1,\"ER SEMESTRE \",\"EME SEMESTRE \")&YEAR(A24)&\"'\"&\"!D$9:D$43\"))-8,\n\n9^9))),\"\")),\"\")","v":"GBA"},null,{"$f":"IF(OR($B24=\"M\",$B24=\"N\",$B24=\"A\"),IF(\n\nIFERROR(INDEX(OFFSET(INDIRECT(\"'\"&INT((MONTH(A24)-1)/6)+1&IF(INT((MONTH(A24)-1)/6)+1=1,\"ER SEMESTRE \",\"EME SEMESTRE \")&YEAR(A24)&\"'\"&\"!$B$9:$B$43\"),0,MATCH($A24,INDIRECT(\"'\"&INT((MONTH(A24)-1)/6)+1&IF(INT((MONTH(A24)-1)/6)+1=1,\"ER SEMESTRE \",\"EME SEMESTRE \")&YEAR(A24)&\"'\"&\"!$B$7:$HA$7\"),0)-DAY(A24)-2),MIN(IF((OFFSET(INDIRECT(\"'\"&INT((MONTH(A24)-1)/6)+1&IF(INT((MONTH(A24)-1)/6)+1=1,\"ER SEMESTRE \",\"EME SEMESTRE \")&YEAR(A24)&\"'\"&\"!$B$9:$B$43\"),0,MATCH($A24,INDIRECT(\"'\"&INT((MONTH(A24)-1)/6)+1&IF(INT((MONTH(A24)-1)/6)+1=1,\"ER SEMESTRE \",\"EME SEMESTRE \")&YEAR(A24)&\"'\"&\"!$B$7:$HA$7\"),0)-DAY(A24)-1)=\"(\"&$G$9&\")\")*(INDEX(INDIRECT(\"'\"&INT((MONTH(A24)-1)/6)+1&IF(INT((MONTH(A24)-1)/6)+1=1,\"ER SEMESTRE \",\"EME SEMESTRE \")&YEAR(A24)&\"'\"&\"!$B$9:$HA$43\"),0,MATCH($A24,INDIRECT(\"'\"&INT((MONTH(A24)-1)/6)+1&IF(INT((MONTH(A24)-1)/6)+1=1,\"ER SEMESTRE \",\"EME SEMESTRE \")&YEAR(A24)&\"'\"&\"!$B$7:$HA$7\"),0))=\"J\"),ROW(INDIRECT(\"'\"&INT((MONTH(A24)-1)/6)+1&IF(INT((MONTH(A24)-1)/6)+1=1,\"ER SEMESTRE \",\"EME SEMESTRE \")&YEAR(A24)&\"'\"&\"!$D$9:$D$43\"))-8,9^9))),\"\")=\"\",\n\nIFERROR(\nINDEX(OFFSET(INDIRECT(\"'\"&INT((MONTH(A24)-1)/6)+1&IF(INT((MONTH(A24)-1)/6)+1=1,\"ER SEMESTRE \",\"EME SEMESTRE \")&YEAR(A24)&\"'\"&\"!$B$9:$B$43\"),0,MATCH($A24,INDIRECT(\"'\"&INT((MONTH(A24)-1)/6)+1&IF(INT((MONTH(A24)-1)/6)+1=1,\"ER SEMESTRE \",\"EME SEMESTRE \")&YEAR(A24)&\"'\"&\"!$B$7:$HA$7\"),0)-DAY(A24)-2),\nSMALL(IF((OFFSET(INDIRECT(\"'\"&INT((MONTH(A24)-1)/6)+1&IF(INT((MONTH(A24)-1)/6)+1=1,\"ER SEMESTRE \",\"EME SEMESTRE \")&YEAR(A24)&\"'\"&\"!$B$9:$B$43\"),0,MATCH($A24,INDIRECT(\"'\"&INT((MONTH(A24)-1)/6)+1&IF(INT((MONTH(A24)-1)/6)+1=1,\"ER SEMESTRE \",\"EME SEMESTRE \")&YEAR(A24)&\"'\"&\"!$B$7:$HA$7\"),0)-DAY(A24)-1)=\"(\"&$G$9&\")\")*(INDEX(INDIRECT(\"'\"&INT((MONTH(A24)-1)/6)+1&IF(INT((MONTH(A24)-1)/6)+1=1,\"ER SEMESTRE \",\"EME SEMESTRE \")&YEAR(A24)&\"'\"&\"!$B$9:$HA$43\"),0,MATCH($A24,INDIRECT(\"'\"&INT((MONTH(A24)-1)/6)+1&IF(INT((MONTH(A24)-1)/6)+1=1,\"ER SEMESTRE \",\"EME SEMESTRE \")&YEAR(A24)&\"'\"&\"!$B$7:$HA$7\"),0))=\"R\"),ROW(INDIRECT(\"'\"&INT((MONTH(A24)-1)/6)+1&IF(INT((MONTH(A24)-1)/6)+1=1,\"ER SEMESTRE \",\"EME SEMESTRE \")&YEAR(A24)&\"'\"&\"!D$9:D$43\"))-8,9^9),3)),\"\"),\n\n\nIFERROR(\nINDEX(OFFSET(INDIRECT(\"'\"&INT((MONTH(A24)-1)/6)+1&IF(INT((MONTH(A24)-1)/6)+1=1,\"ER SEMESTRE \",\"EME SEMESTRE \")&YEAR(A24)&\"'\"&\"!$B$9:$B$43\"),0,MATCH($A24,INDIRECT(\"'\"&INT((MONTH(A24)-1)/6)+1&IF(INT((MONTH(A24)-1)/6)+1=1,\"ER SEMESTRE \",\"EME SEMESTRE \")&YEAR(A24)&\"'\"&\"!$B$7:$HA$7\"),0)-DAY(A24)-2),\nSMALL(IF((OFFSET(INDIRECT(\"'\"&INT((MONTH(A24)-1)/6)+1&IF(INT((MONTH(A24)-1)/6)+1=1,\"ER SEMESTRE \",\"EME SEMESTRE \")&YEAR(A24)&\"'\"&\"!$B$9:$B$43\"),0,MATCH($A24,INDIRECT(\"'\"&INT((MONTH(A24)-1)/6)+1&IF(INT((MONTH(A24)-1)/6)+1=1,\"ER SEMESTRE \",\"EME SEMESTRE \")&YEAR(A24)&\"'\"&\"!$B$7:$HA$7\"),0)-DAY(A24)-1)=\"(\"&$G$9&\")\")*(INDEX(INDIRECT(\"'\"&INT((MONTH(A24)-1)/6)+1&IF(INT((MONTH(A24)-1)/6)+1=1,\"ER SEMESTRE \",\"EME SEMESTRE \")&YEAR(A24)&\"'\"&\"!$B$9:$HA$43\"),0,MATCH($A24,INDIRECT(\"'\"&INT((MONTH(A24)-1)/6)+1&IF(INT((MONTH(A24)-1)/6)+1=1,\"ER SEMESTRE \",\"EME SEMESTRE \")&YEAR(A24)&\"'\"&\"!$B$7:$HA$7\"),0))=\"R\"),ROW(INDIRECT(\"'\"&INT((MONTH(A24)-1)/6)+1&IF(INT((MONTH(A24)-1)/6)+1=1,\"ER SEMESTRE \",\"EME SEMESTRE \")&YEAR(A24)&\"'\"&\"!D$9:D$43\"))-8,9^9),2)),\"\")\n\n),\n\n\"\")","v":"JLE"}]
["",{"$f":"IFERROR(INDEX([3]PLANNING!$D$3:$Y$29,MATCH('[3]F_Dde de remplacement'!$G$8,[3]PLANNING!$B$3:$B$29,0),MATCH('[3]F_Dde de remplacement'!$A25,[3]PLANNING!$D$2:$Y$2,0)),\"\")","v":""},{"$f":"IF(OR($B25=\"M\",$B25=\"N\",$B25=\"A\"),IFERROR(INDEX(OFFSET(INDIRECT(\"'\"&INT((MONTH(A25)-1)/6)+1&IF(INT((MONTH(A25)-1)/6)+1=1,\"ER SEMESTRE \",\"EME SEMESTRE \")&YEAR(A25)&\"'\"&\"!$B$9:$B$43\"),0,MATCH($A25,INDIRECT(\"'\"&INT((MONTH(A25)-1)/6)+1&IF(INT((MONTH(A25)-1)/6)+1=1,\"ER SEMESTRE \",\"EME SEMESTRE \")&YEAR(A25)&\"'\"&\"!$B$7:$HA$7\"),0)-DAY(A25)-2),MIN(IF((OFFSET(INDIRECT(\"'\"&INT((MONTH(A25)-1)/6)+1&IF(INT((MONTH(A25)-1)/6)+1=1,\"ER SEMESTRE \",\"EME SEMESTRE \")&YEAR(A25)&\"'\"&\"!$B$9:$B$43\"),0,MATCH($A25,INDIRECT(\"'\"&INT((MONTH(A25)-1)/6)+1&IF(INT((MONTH(A25)-1)/6)+1=1,\"ER SEMESTRE \",\"EME SEMESTRE \")&YEAR(A25)&\"'\"&\"!$B$7:$HA$7\"),0)-DAY(A25)-1)=\"(\"&$G$9&\")\")*(INDEX(INDIRECT(\"'\"&INT((MONTH(A25)-1)/6)+1&IF(INT((MONTH(A25)-1)/6)+1=1,\"ER SEMESTRE \",\"EME SEMESTRE \")&YEAR(A25)&\"'\"&\"!$B$9:$HA$43\"),0,MATCH($A25,INDIRECT(\"'\"&INT((MONTH(A25)-1)/6)+1&IF(INT((MONTH(A25)-1)/6)+1=1,\"ER SEMESTRE \",\"EME SEMESTRE \")&YEAR(A25)&\"'\"&\"!$B$7:$HA$7\"),0))=\"J\"),ROW(INDIRECT(\"'\"&INT((MONTH(A25)-1)/6)+1&IF(INT((MONTH(A25)-1)/6)+1=1,\"ER SEMESTRE \",\"EME SEMESTRE \")&YEAR(A25)&\"'\"&\"!$D$9:$D$43\"))-8,9^9))),IFERROR(INDEX(OFFSET(INDIRECT(\"'\"&INT((MONTH(A25)-1)/6)+1&IF(INT((MONTH(A25)-1)/6)+1=1,\"ER SEMESTRE \",\"EME SEMESTRE \")&YEAR(A25)&\"'\"&\"!$B$9:$B$43\"),0,MATCH($A25,INDIRECT(\"'\"&INT((MONTH(A25)-1)/6)+1&IF(INT((MONTH(A25)-1)/6)+1=1,\"ER SEMESTRE \",\"EME SEMESTRE \")&YEAR(A25)&\"'\"&\"!$B$7:$HA$7\"),0)-DAY(A25)-2),MIN(IF((OFFSET(INDIRECT(\"'\"&INT((MONTH(A25)-1)/6)+1&IF(INT((MONTH(A25)-1)/6)+1=1,\"ER SEMESTRE \",\"EME SEMESTRE \")&YEAR(A25)&\"'\"&\"!$B$9:$B$43\"),0,MATCH($A25,INDIRECT(\"'\"&INT((MONTH(A25)-1)/6)+1&IF(INT((MONTH(A25)-1)/6)+1=1,\"ER SEMESTRE \",\"EME SEMESTRE \")&YEAR(A25)&\"'\"&\"!$B$7:$HA$7\"),0)-DAY(A25)-1)=\"(\"&$G$9&\")\")*(INDEX(INDIRECT(\"'\"&INT((MONTH(A25)-1)/6)+1&IF(INT((MONTH(A25)-1)/6)+1=1,\"ER SEMESTRE \",\"EME SEMESTRE \")&YEAR(A25)&\"'\"&\"!$B$9:$HA$43\"),0,MATCH($A25,INDIRECT(\"'\"&INT((MONTH(A25)-1)/6)+1&IF(INT((MONTH(A25)-1)/6)+1=1,\"ER SEMESTRE \",\"EME SEMESTRE \")&YEAR(A25)&\"'\"&\"!$B$7:$HA$7\"),0))=\"R\"),ROW(INDIRECT(\"'\"&INT((MONTH(A25)-1)/6)+1&IF(INT((MONTH(A25)-1)/6)+1=1,\"ER SEMESTRE \",\"EME SEMESTRE \")&YEAR(A25)&\"'\"&\"!$D$9:$D$43\"))-8,9^9))),\"\")),\"\")","v":""},null,{"$f":"IF(OR($B25=\"M\",$B25=\"N\",$B25=\"A\"),IF(\nIFERROR(INDEX(OFFSET(INDIRECT(\"'\"&INT((MONTH(A25)-1)/6)+1&IF(INT((MONTH(A25)-1)/6)+1=1,\"ER SEMESTRE \",\"EME SEMESTRE \")&YEAR(A25)&\"'\"&\"!$B$9:$B$43\"),0,MATCH($A25,INDIRECT(\"'\"&INT((MONTH(A25)-1)/6)+1&IF(INT((MONTH(A25)-1)/6)+1=1,\"ER SEMESTRE \",\"EME SEMESTRE \")&YEAR(A25)&\"'\"&\"!$B$7:$HA$7\"),0)-DAY(A25)-2),MIN(IF((OFFSET(INDIRECT(\"'\"&INT((MONTH(A25)-1)/6)+1&IF(INT((MONTH(A25)-1)/6)+1=1,\"ER SEMESTRE \",\"EME SEMESTRE \")&YEAR(A25)&\"'\"&\"!$B$9:$B$43\"),0,MATCH($A25,INDIRECT(\"'\"&INT((MONTH(A25)-1)/6)+1&IF(INT((MONTH(A25)-1)/6)+1=1,\"ER SEMESTRE \",\"EME SEMESTRE \")&YEAR(A25)&\"'\"&\"!$B$7:$HA$7\"),0)-DAY(A25)-1)=\"(\"&$G$9&\")\")*(INDEX(INDIRECT(\"'\"&INT((MONTH(A25)-1)/6)+1&IF(INT((MONTH(A25)-1)/6)+1=1,\"ER SEMESTRE \",\"EME SEMESTRE \")&YEAR(A25)&\"'\"&\"!$B$9:$HA$43\"),0,MATCH($A25,INDIRECT(\"'\"&INT((MONTH(A25)-1)/6)+1&IF(INT((MONTH(A25)-1)/6)+1=1,\"ER SEMESTRE \",\"EME SEMESTRE \")&YEAR(A25)&\"'\"&\"!$B$7:$HA$7\"),0))=\"J\"),ROW(INDIRECT(\"'\"&INT((MONTH(A25)-1)/6)+1&IF(INT((MONTH(A25)-1)/6)+1=1,\"ER SEMESTRE \",\"EME SEMESTRE \")&YEAR(A25)&\"'\"&\"!$D$9:$D$43\"))-8,9^9))),\"\")=\"\",\n\nIFERROR(INDEX(OFFSET(INDIRECT(\"'\"&INT((MONTH(A25)-1)/6)+1&IF(INT((MONTH(A25)-1)/6)+1=1,\"ER SEMESTRE \",\"EME SEMESTRE \")&YEAR(A25)&\"'\"&\"!$B$9:$B$43\"),0,MATCH($A25,INDIRECT(\"'\"&INT((MONTH(A25)-1)/6)+1&IF(INT((MONTH(A25)-1)/6)+1=1,\"ER SEMESTRE \",\"EME SEMESTRE \")&YEAR(A25)&\"'\"&\"!$B$7:$HA$7\"),0)-DAY(A25)-2),SMALL(IF((OFFSET(INDIRECT(\"'\"&INT((MONTH(A25)-1)/6)+1&IF(INT((MONTH(A25)-1)/6)+1=1,\"ER SEMESTRE \",\"EME SEMESTRE \")&YEAR(A25)&\"'\"&\"!$B$9:$B$43\"),0,MATCH($A25,INDIRECT(\"'\"&INT((MONTH(A25)-1)/6)+1&IF(INT((MONTH(A25)-1)/6)+1=1,\"ER SEMESTRE \",\"EME SEMESTRE \")&YEAR(A25)&\"'\"&\"!$B$7:$HA$7\"),0)-DAY(A25)-1)=\"(\"&$G$9&\")\")*(INDEX(INDIRECT(\"'\"&INT((MONTH(A25)-1)/6)+1&IF(INT((MONTH(A25)-1)/6)+1=1,\"ER SEMESTRE \",\"EME SEMESTRE \")&YEAR(A25)&\"'\"&\"!$B$9:$HA$43\"),0,MATCH($A25,INDIRECT(\"'\"&INT((MONTH(A25)-1)/6)+1&IF(INT((MONTH(A25)-1)/6)+1=1,\"ER SEMESTRE \",\"EME SEMESTRE \")&YEAR(A25)&\"'\"&\"!$B$7:$HA$7\"),0))=\"R\"),ROW(INDIRECT(\"'\"&INT((MONTH(A25)-1)/6)+1&IF(INT((MONTH(A25)-1)/6)+1=1,\"ER SEMESTRE \",\"EME SEMESTRE \")&YEAR(A25)&\"'\"&\"!D$9:D$43\"))-8,9^9),2)),\"\"),\n\nIFERROR(\nINDEX(\nOFFSET(INDIRECT(\"'\"&INT((MONTH(A25)-1)/6)+1&IF(INT((MONTH(A25)-1)/6)+1=1,\"ER SEMESTRE \",\"EME SEMESTRE \")&YEAR(A25)&\"'\"&\"!$B$9:$B$43\"),0,MATCH($A25,INDIRECT(\"'\"&INT((MONTH(A25)-1)/6)+1&IF(INT((MONTH(A25)-1)/6)+1=1,\"ER SEMESTRE \",\"EME SEMESTRE \")&YEAR(A25)&\"'\"&\"!$B$7:$HA$7\"),0)-DAY(A25)-2),\n\nMIN(IF(\n(OFFSET(INDIRECT(\"'\"&INT((MONTH(A25)-1)/6)+1&IF(INT((MONTH(A25)-1)/6)+1=1,\"ER SEMESTRE \",\"EME SEMESTRE \")&YEAR(A25)&\"'\"&\"!$B$9:$B$43\"),0,MATCH($A25,INDIRECT(\"'\"&INT((MONTH(A25)-1)/6)+1&IF(INT((MONTH(A25)-1)/6)+1=1,\"ER SEMESTRE \",\"EME SEMESTRE \")&YEAR(A25)&\"'\"&\"!$B$7:$HA$7\"),0)-DAY(A25)-1)=\"(\"&$G$9&\")\")\n*\n(INDEX(INDIRECT(\"'\"&INT((MONTH(A25)-1)/6)+1&IF(INT((MONTH(A25)-1)/6)+1=1,\"ER SEMESTRE \",\"EME SEMESTRE \")&YEAR(A25)&\"'\"&\"!$B$9:$HA$43\"),0,MATCH($A25,INDIRECT(\"'\"&INT((MONTH(A25)-1)/6)+1&IF(INT((MONTH(A25)-1)/6)+1=1,\"ER SEMESTRE \",\"EME SEMESTRE \")&YEAR(A25)&\"'\"&\"!$B$7:$HA$7\"),0))=\"R\"),\n\nROW(INDIRECT(\"'\"&INT((MONTH(A25)-1)/6)+1&IF(INT((MONTH(A25)-1)/6)+1=1,\"ER SEMESTRE \",\"EME SEMESTRE \")&YEAR(A25)&\"'\"&\"!D$9:D$43\"))-8,\n\n9^9))),\"\")),\"\")","v":""},null,{"$f":"IF(OR($B25=\"M\",$B25=\"N\",$B25=\"A\"),IF(\n\nIFERROR(INDEX(OFFSET(INDIRECT(\"'\"&INT((MONTH(A25)-1)/6)+1&IF(INT((MONTH(A25)-1)/6)+1=1,\"ER SEMESTRE \",\"EME SEMESTRE \")&YEAR(A25)&\"'\"&\"!$B$9:$B$43\"),0,MATCH($A25,INDIRECT(\"'\"&INT((MONTH(A25)-1)/6)+1&IF(INT((MONTH(A25)-1)/6)+1=1,\"ER SEMESTRE \",\"EME SEMESTRE \")&YEAR(A25)&\"'\"&\"!$B$7:$HA$7\"),0)-DAY(A25)-2),MIN(IF((OFFSET(INDIRECT(\"'\"&INT((MONTH(A25)-1)/6)+1&IF(INT((MONTH(A25)-1)/6)+1=1,\"ER SEMESTRE \",\"EME SEMESTRE \")&YEAR(A25)&\"'\"&\"!$B$9:$B$43\"),0,MATCH($A25,INDIRECT(\"'\"&INT((MONTH(A25)-1)/6)+1&IF(INT((MONTH(A25)-1)/6)+1=1,\"ER SEMESTRE \",\"EME SEMESTRE \")&YEAR(A25)&\"'\"&\"!$B$7:$HA$7\"),0)-DAY(A25)-1)=\"(\"&$G$9&\")\")*(INDEX(INDIRECT(\"'\"&INT((MONTH(A25)-1)/6)+1&IF(INT((MONTH(A25)-1)/6)+1=1,\"ER SEMESTRE \",\"EME SEMESTRE \")&YEAR(A25)&\"'\"&\"!$B$9:$HA$43\"),0,MATCH($A25,INDIRECT(\"'\"&INT((MONTH(A25)-1)/6)+1&IF(INT((MONTH(A25)-1)/6)+1=1,\"ER SEMESTRE \",\"EME SEMESTRE \")&YEAR(A25)&\"'\"&\"!$B$7:$HA$7\"),0))=\"J\"),ROW(INDIRECT(\"'\"&INT((MONTH(A25)-1)/6)+1&IF(INT((MONTH(A25)-1)/6)+1=1,\"ER SEMESTRE \",\"EME SEMESTRE \")&YEAR(A25)&\"'\"&\"!$D$9:$D$43\"))-8,9^9))),\"\")=\"\",\n\nIFERROR(\nINDEX(OFFSET(INDIRECT(\"'\"&INT((MONTH(A25)-1)/6)+1&IF(INT((MONTH(A25)-1)/6)+1=1,\"ER SEMESTRE \",\"EME SEMESTRE \")&YEAR(A25)&\"'\"&\"!$B$9:$B$43\"),0,MATCH($A25,INDIRECT(\"'\"&INT((MONTH(A25)-1)/6)+1&IF(INT((MONTH(A25)-1)/6)+1=1,\"ER SEMESTRE \",\"EME SEMESTRE \")&YEAR(A25)&\"'\"&\"!$B$7:$HA$7\"),0)-DAY(A25)-2),\nSMALL(IF((OFFSET(INDIRECT(\"'\"&INT((MONTH(A25)-1)/6)+1&IF(INT((MONTH(A25)-1)/6)+1=1,\"ER SEMESTRE \",\"EME SEMESTRE \")&YEAR(A25)&\"'\"&\"!$B$9:$B$43\"),0,MATCH($A25,INDIRECT(\"'\"&INT((MONTH(A25)-1)/6)+1&IF(INT((MONTH(A25)-1)/6)+1=1,\"ER SEMESTRE \",\"EME SEMESTRE \")&YEAR(A25)&\"'\"&\"!$B$7:$HA$7\"),0)-DAY(A25)-1)=\"(\"&$G$9&\")\")*(INDEX(INDIRECT(\"'\"&INT((MONTH(A25)-1)/6)+1&IF(INT((MONTH(A25)-1)/6)+1=1,\"ER SEMESTRE \",\"EME SEMESTRE \")&YEAR(A25)&\"'\"&\"!$B$9:$HA$43\"),0,MATCH($A25,INDIRECT(\"'\"&INT((MONTH(A25)-1)/6)+1&IF(INT((MONTH(A25)-1)/6)+1=1,\"ER SEMESTRE \",\"EME SEMESTRE \")&YEAR(A25)&\"'\"&\"!$B$7:$HA$7\"),0))=\"R\"),ROW(INDIRECT(\"'\"&INT((MONTH(A25)-1)/6)+1&IF(INT((MONTH(A25)-1)/6)+1=1,\"ER SEMESTRE \",\"EME SEMESTRE \")&YEAR(A25)&\"'\"&\"!D$9:D$43\"))-8,9^9),3)),\"\"),\n\n\nIFERROR(\nINDEX(OFFSET(INDIRECT(\"'\"&INT((MONTH(A25)-1)/6)+1&IF(INT((MONTH(A25)-1)/6)+1=1,\"ER SEMESTRE \",\"EME SEMESTRE \")&YEAR(A25)&\"'\"&\"!$B$9:$B$43\"),0,MATCH($A25,INDIRECT(\"'\"&INT((MONTH(A25)-1)/6)+1&IF(INT((MONTH(A25)-1)/6)+1=1,\"ER SEMESTRE \",\"EME SEMESTRE \")&YEAR(A25)&\"'\"&\"!$B$7:$HA$7\"),0)-DAY(A25)-2),\nSMALL(IF((OFFSET(INDIRECT(\"'\"&INT((MONTH(A25)-1)/6)+1&IF(INT((MONTH(A25)-1)/6)+1=1,\"ER SEMESTRE \",\"EME SEMESTRE \")&YEAR(A25)&\"'\"&\"!$B$9:$B$43\"),0,MATCH($A25,INDIRECT(\"'\"&INT((MONTH(A25)-1)/6)+1&IF(INT((MONTH(A25)-1)/6)+1=1,\"ER SEMESTRE \",\"EME SEMESTRE \")&YEAR(A25)&\"'\"&\"!$B$7:$HA$7\"),0)-DAY(A25)-1)=\"(\"&$G$9&\")\")*(INDEX(INDIRECT(\"'\"&INT((MONTH(A25)-1)/6)+1&IF(INT((MONTH(A25)-1)/6)+1=1,\"ER SEMESTRE \",\"EME SEMESTRE \")&YEAR(A25)&\"'\"&\"!$B$9:$HA$43\"),0,MATCH($A25,INDIRECT(\"'\"&INT((MONTH(A25)-1)/6)+1&IF(INT((MONTH(A25)-1)/6)+1=1,\"ER SEMESTRE \",\"EME SEMESTRE \")&YEAR(A25)&\"'\"&\"!$B$7:$HA$7\"),0))=\"R\"),ROW(INDIRECT(\"'\"&INT((MONTH(A25)-1)/6)+1&IF(INT((MONTH(A25)-1)/6)+1=1,\"ER SEMESTRE \",\"EME SEMESTRE \")&YEAR(A25)&\"'\"&\"!D$9:D$43\"))-8,9^9),2)),\"\")\n\n),\n\n\"\")","v":""}]
["",{"$f":"IFERROR(INDEX([3]PLANNING!$D$3:$Y$29,MATCH('[3]F_Dde de remplacement'!$G$8,[3]PLANNING!$B$3:$B$29,0),MATCH('[3]F_Dde de remplacement'!$A26,[3]PLANNING!$D$2:$Y$2,0)),\"\")","v":""},{"$f":"IF(OR($B26=\"M\",$B26=\"N\",$B26=\"A\"),IFERROR(INDEX(OFFSET(INDIRECT(\"'\"&INT((MONTH(A26)-1)/6)+1&IF(INT((MONTH(A26)-1)/6)+1=1,\"ER SEMESTRE \",\"EME SEMESTRE \")&YEAR(A26)&\"'\"&\"!$B$9:$B$43\"),0,MATCH($A26,INDIRECT(\"'\"&INT((MONTH(A26)-1)/6)+1&IF(INT((MONTH(A26)-1)/6)+1=1,\"ER SEMESTRE \",\"EME SEMESTRE \")&YEAR(A26)&\"'\"&\"!$B$7:$HA$7\"),0)-DAY(A26)-2),MIN(IF((OFFSET(INDIRECT(\"'\"&INT((MONTH(A26)-1)/6)+1&IF(INT((MONTH(A26)-1)/6)+1=1,\"ER SEMESTRE \",\"EME SEMESTRE \")&YEAR(A26)&\"'\"&\"!$B$9:$B$43\"),0,MATCH($A26,INDIRECT(\"'\"&INT((MONTH(A26)-1)/6)+1&IF(INT((MONTH(A26)-1)/6)+1=1,\"ER SEMESTRE \",\"EME SEMESTRE \")&YEAR(A26)&\"'\"&\"!$B$7:$HA$7\"),0)-DAY(A26)-1)=\"(\"&$G$9&\")\")*(INDEX(INDIRECT(\"'\"&INT((MONTH(A26)-1)/6)+1&IF(INT((MONTH(A26)-1)/6)+1=1,\"ER SEMESTRE \",\"EME SEMESTRE \")&YEAR(A26)&\"'\"&\"!$B$9:$HA$43\"),0,MATCH($A26,INDIRECT(\"'\"&INT((MONTH(A26)-1)/6)+1&IF(INT((MONTH(A26)-1)/6)+1=1,\"ER SEMESTRE \",\"EME SEMESTRE \")&YEAR(A26)&\"'\"&\"!$B$7:$HA$7\"),0))=\"J\"),ROW(INDIRECT(\"'\"&INT((MONTH(A26)-1)/6)+1&IF(INT((MONTH(A26)-1)/6)+1=1,\"ER SEMESTRE \",\"EME SEMESTRE \")&YEAR(A26)&\"'\"&\"!$D$9:$D$43\"))-8,9^9))),IFERROR(INDEX(OFFSET(INDIRECT(\"'\"&INT((MONTH(A26)-1)/6)+1&IF(INT((MONTH(A26)-1)/6)+1=1,\"ER SEMESTRE \",\"EME SEMESTRE \")&YEAR(A26)&\"'\"&\"!$B$9:$B$43\"),0,MATCH($A26,INDIRECT(\"'\"&INT((MONTH(A26)-1)/6)+1&IF(INT((MONTH(A26)-1)/6)+1=1,\"ER SEMESTRE \",\"EME SEMESTRE \")&YEAR(A26)&\"'\"&\"!$B$7:$HA$7\"),0)-DAY(A26)-2),MIN(IF((OFFSET(INDIRECT(\"'\"&INT((MONTH(A26)-1)/6)+1&IF(INT((MONTH(A26)-1)/6)+1=1,\"ER SEMESTRE \",\"EME SEMESTRE \")&YEAR(A26)&\"'\"&\"!$B$9:$B$43\"),0,MATCH($A26,INDIRECT(\"'\"&INT((MONTH(A26)-1)/6)+1&IF(INT((MONTH(A26)-1)/6)+1=1,\"ER SEMESTRE \",\"EME SEMESTRE \")&YEAR(A26)&\"'\"&\"!$B$7:$HA$7\"),0)-DAY(A26)-1)=\"(\"&$G$9&\")\")*(INDEX(INDIRECT(\"'\"&INT((MONTH(A26)-1)/6)+1&IF(INT((MONTH(A26)-1)/6)+1=1,\"ER SEMESTRE \",\"EME SEMESTRE \")&YEAR(A26)&\"'\"&\"!$B$9:$HA$43\"),0,MATCH($A26,INDIRECT(\"'\"&INT((MONTH(A26)-1)/6)+1&IF(INT((MONTH(A26)-1)/6)+1=1,\"ER SEMESTRE \",\"EME SEMESTRE \")&YEAR(A26)&\"'\"&\"!$B$7:$HA$7\"),0))=\"R\"),ROW(INDIRECT(\"'\"&INT((MONTH(A26)-1)/6)+1&IF(INT((MONTH(A26)-1)/6)+1=1,\"ER SEMESTRE \",\"EME SEMESTRE \")&YEAR(A26)&\"'\"&\"!$D$9:$D$43\"))-8,9^9))),\"\")),\"\")","v":""},null,{"$f":"IF(OR($B26=\"M\",$B26=\"N\",$B26=\"A\"),IF(\nIFERROR(INDEX(OFFSET(INDIRECT(\"'\"&INT((MONTH(A26)-1)/6)+1&IF(INT((MONTH(A26)-1)/6)+1=1,\"ER SEMESTRE \",\"EME SEMESTRE \")&YEAR(A26)&\"'\"&\"!$B$9:$B$43\"),0,MATCH($A26,INDIRECT(\"'\"&INT((MONTH(A26)-1)/6)+1&IF(INT((MONTH(A26)-1)/6)+1=1,\"ER SEMESTRE \",\"EME SEMESTRE \")&YEAR(A26)&\"'\"&\"!$B$7:$HA$7\"),0)-DAY(A26)-2),MIN(IF((OFFSET(INDIRECT(\"'\"&INT((MONTH(A26)-1)/6)+1&IF(INT((MONTH(A26)-1)/6)+1=1,\"ER SEMESTRE \",\"EME SEMESTRE \")&YEAR(A26)&\"'\"&\"!$B$9:$B$43\"),0,MATCH($A26,INDIRECT(\"'\"&INT((MONTH(A26)-1)/6)+1&IF(INT((MONTH(A26)-1)/6)+1=1,\"ER SEMESTRE \",\"EME SEMESTRE \")&YEAR(A26)&\"'\"&\"!$B$7:$HA$7\"),0)-DAY(A26)-1)=\"(\"&$G$9&\")\")*(INDEX(INDIRECT(\"'\"&INT((MONTH(A26)-1)/6)+1&IF(INT((MONTH(A26)-1)/6)+1=1,\"ER SEMESTRE \",\"EME SEMESTRE \")&YEAR(A26)&\"'\"&\"!$B$9:$HA$43\"),0,MATCH($A26,INDIRECT(\"'\"&INT((MONTH(A26)-1)/6)+1&IF(INT((MONTH(A26)-1)/6)+1=1,\"ER SEMESTRE \",\"EME SEMESTRE \")&YEAR(A26)&\"'\"&\"!$B$7:$HA$7\"),0))=\"J\"),ROW(INDIRECT(\"'\"&INT((MONTH(A26)-1)/6)+1&IF(INT((MONTH(A26)-1)/6)+1=1,\"ER SEMESTRE \",\"EME SEMESTRE \")&YEAR(A26)&\"'\"&\"!$D$9:$D$43\"))-8,9^9))),\"\")=\"\",\n\nIFERROR(INDEX(OFFSET(INDIRECT(\"'\"&INT((MONTH(A26)-1)/6)+1&IF(INT((MONTH(A26)-1)/6)+1=1,\"ER SEMESTRE \",\"EME SEMESTRE \")&YEAR(A26)&\"'\"&\"!$B$9:$B$43\"),0,MATCH($A26,INDIRECT(\"'\"&INT((MONTH(A26)-1)/6)+1&IF(INT((MONTH(A26)-1)/6)+1=1,\"ER SEMESTRE \",\"EME SEMESTRE \")&YEAR(A26)&\"'\"&\"!$B$7:$HA$7\"),0)-DAY(A26)-2),SMALL(IF((OFFSET(INDIRECT(\"'\"&INT((MONTH(A26)-1)/6)+1&IF(INT((MONTH(A26)-1)/6)+1=1,\"ER SEMESTRE \",\"EME SEMESTRE \")&YEAR(A26)&\"'\"&\"!$B$9:$B$43\"),0,MATCH($A26,INDIRECT(\"'\"&INT((MONTH(A26)-1)/6)+1&IF(INT((MONTH(A26)-1)/6)+1=1,\"ER SEMESTRE \",\"EME SEMESTRE \")&YEAR(A26)&\"'\"&\"!$B$7:$HA$7\"),0)-DAY(A26)-1)=\"(\"&$G$9&\")\")*(INDEX(INDIRECT(\"'\"&INT((MONTH(A26)-1)/6)+1&IF(INT((MONTH(A26)-1)/6)+1=1,\"ER SEMESTRE \",\"EME SEMESTRE \")&YEAR(A26)&\"'\"&\"!$B$9:$HA$43\"),0,MATCH($A26,INDIRECT(\"'\"&INT((MONTH(A26)-1)/6)+1&IF(INT((MONTH(A26)-1)/6)+1=1,\"ER SEMESTRE \",\"EME SEMESTRE \")&YEAR(A26)&\"'\"&\"!$B$7:$HA$7\"),0))=\"R\"),ROW(INDIRECT(\"'\"&INT((MONTH(A26)-1)/6)+1&IF(INT((MONTH(A26)-1)/6)+1=1,\"ER SEMESTRE \",\"EME SEMESTRE \")&YEAR(A26)&\"'\"&\"!D$9:D$43\"))-8,9^9),2)),\"\"),\n\nIFERROR(\nINDEX(\nOFFSET(INDIRECT(\"'\"&INT((MONTH(A26)-1)/6)+1&IF(INT((MONTH(A26)-1)/6)+1=1,\"ER SEMESTRE \",\"EME SEMESTRE \")&YEAR(A26)&\"'\"&\"!$B$9:$B$43\"),0,MATCH($A26,INDIRECT(\"'\"&INT((MONTH(A26)-1)/6)+1&IF(INT((MONTH(A26)-1)/6)+1=1,\"ER SEMESTRE \",\"EME SEMESTRE \")&YEAR(A26)&\"'\"&\"!$B$7:$HA$7\"),0)-DAY(A26)-2),\n\nMIN(IF(\n(OFFSET(INDIRECT(\"'\"&INT((MONTH(A26)-1)/6)+1&IF(INT((MONTH(A26)-1)/6)+1=1,\"ER SEMESTRE \",\"EME SEMESTRE \")&YEAR(A26)&\"'\"&\"!$B$9:$B$43\"),0,MATCH($A26,INDIRECT(\"'\"&INT((MONTH(A26)-1)/6)+1&IF(INT((MONTH(A26)-1)/6)+1=1,\"ER SEMESTRE \",\"EME SEMESTRE \")&YEAR(A26)&\"'\"&\"!$B$7:$HA$7\"),0)-DAY(A26)-1)=\"(\"&$G$9&\")\")\n*\n(INDEX(INDIRECT(\"'\"&INT((MONTH(A26)-1)/6)+1&IF(INT((MONTH(A26)-1)/6)+1=1,\"ER SEMESTRE \",\"EME SEMESTRE \")&YEAR(A26)&\"'\"&\"!$B$9:$HA$43\"),0,MATCH($A26,INDIRECT(\"'\"&INT((MONTH(A26)-1)/6)+1&IF(INT((MONTH(A26)-1)/6)+1=1,\"ER SEMESTRE \",\"EME SEMESTRE \")&YEAR(A26)&\"'\"&\"!$B$7:$HA$7\"),0))=\"R\"),\n\nROW(INDIRECT(\"'\"&INT((MONTH(A26)-1)/6)+1&IF(INT((MONTH(A26)-1)/6)+1=1,\"ER SEMESTRE \",\"EME SEMESTRE \")&YEAR(A26)&\"'\"&\"!D$9:D$43\"))-8,\n\n9^9))),\"\")),\"\")","v":""},null,{"$f":"IF(OR($B26=\"M\",$B26=\"N\",$B26=\"A\"),IF(\n\nIFERROR(INDEX(OFFSET(INDIRECT(\"'\"&INT((MONTH(A26)-1)/6)+1&IF(INT((MONTH(A26)-1)/6)+1=1,\"ER SEMESTRE \",\"EME SEMESTRE \")&YEAR(A26)&\"'\"&\"!$B$9:$B$43\"),0,MATCH($A26,INDIRECT(\"'\"&INT((MONTH(A26)-1)/6)+1&IF(INT((MONTH(A26)-1)/6)+1=1,\"ER SEMESTRE \",\"EME SEMESTRE \")&YEAR(A26)&\"'\"&\"!$B$7:$HA$7\"),0)-DAY(A26)-2),MIN(IF((OFFSET(INDIRECT(\"'\"&INT((MONTH(A26)-1)/6)+1&IF(INT((MONTH(A26)-1)/6)+1=1,\"ER SEMESTRE \",\"EME SEMESTRE \")&YEAR(A26)&\"'\"&\"!$B$9:$B$43\"),0,MATCH($A26,INDIRECT(\"'\"&INT((MONTH(A26)-1)/6)+1&IF(INT((MONTH(A26)-1)/6)+1=1,\"ER SEMESTRE \",\"EME SEMESTRE \")&YEAR(A26)&\"'\"&\"!$B$7:$HA$7\"),0)-DAY(A26)-1)=\"(\"&$G$9&\")\")*(INDEX(INDIRECT(\"'\"&INT((MONTH(A26)-1)/6)+1&IF(INT((MONTH(A26)-1)/6)+1=1,\"ER SEMESTRE \",\"EME SEMESTRE \")&YEAR(A26)&\"'\"&\"!$B$9:$HA$43\"),0,MATCH($A26,INDIRECT(\"'\"&INT((MONTH(A26)-1)/6)+1&IF(INT((MONTH(A26)-1)/6)+1=1,\"ER SEMESTRE \",\"EME SEMESTRE \")&YEAR(A26)&\"'\"&\"!$B$7:$HA$7\"),0))=\"J\"),ROW(INDIRECT(\"'\"&INT((MONTH(A26)-1)/6)+1&IF(INT((MONTH(A26)-1)/6)+1=1,\"ER SEMESTRE \",\"EME SEMESTRE \")&YEAR(A26)&\"'\"&\"!$D$9:$D$43\"))-8,9^9))),\"\")=\"\",\n\nIFERROR(\nINDEX(OFFSET(INDIRECT(\"'\"&INT((MONTH(A26)-1)/6)+1&IF(INT((MONTH(A26)-1)/6)+1=1,\"ER SEMESTRE \",\"EME SEMESTRE \")&YEAR(A26)&\"'\"&\"!$B$9:$B$43\"),0,MATCH($A26,INDIRECT(\"'\"&INT((MONTH(A26)-1)/6)+1&IF(INT((MONTH(A26)-1)/6)+1=1,\"ER SEMESTRE \",\"EME SEMESTRE \")&YEAR(A26)&\"'\"&\"!$B$7:$HA$7\"),0)-DAY(A26)-2),\nSMALL(IF((OFFSET(INDIRECT(\"'\"&INT((MONTH(A26)-1)/6)+1&IF(INT((MONTH(A26)-1)/6)+1=1,\"ER SEMESTRE \",\"EME SEMESTRE \")&YEAR(A26)&\"'\"&\"!$B$9:$B$43\"),0,MATCH($A26,INDIRECT(\"'\"&INT((MONTH(A26)-1)/6)+1&IF(INT((MONTH(A26)-1)/6)+1=1,\"ER SEMESTRE \",\"EME SEMESTRE \")&YEAR(A26)&\"'\"&\"!$B$7:$HA$7\"),0)-DAY(A26)-1)=\"(\"&$G$9&\")\")*(INDEX(INDIRECT(\"'\"&INT((MONTH(A26)-1)/6)+1&IF(INT((MONTH(A26)-1)/6)+1=1,\"ER SEMESTRE \",\"EME SEMESTRE \")&YEAR(A26)&\"'\"&\"!$B$9:$HA$43\"),0,MATCH($A26,INDIRECT(\"'\"&INT((MONTH(A26)-1)/6)+1&IF(INT((MONTH(A26)-1)/6)+1=1,\"ER SEMESTRE \",\"EME SEMESTRE \")&YEAR(A26)&\"'\"&\"!$B$7:$HA$7\"),0))=\"R\"),ROW(INDIRECT(\"'\"&INT((MONTH(A26)-1)/6)+1&IF(INT((MONTH(A26)-1)/6)+1=1,\"ER SEMESTRE \",\"EME SEMESTRE \")&YEAR(A26)&\"'\"&\"!D$9:D$43\"))-8,9^9),3)),\"\"),\n\n\nIFERROR(\nINDEX(OFFSET(INDIRECT(\"'\"&INT((MONTH(A26)-1)/6)+1&IF(INT((MONTH(A26)-1)/6)+1=1,\"ER SEMESTRE \",\"EME SEMESTRE \")&YEAR(A26)&\"'\"&\"!$B$9:$B$43\"),0,MATCH($A26,INDIRECT(\"'\"&INT((MONTH(A26)-1)/6)+1&IF(INT((MONTH(A26)-1)/6)+1=1,\"ER SEMESTRE \",\"EME SEMESTRE \")&YEAR(A26)&\"'\"&\"!$B$7:$HA$7\"),0)-DAY(A26)-2),\nSMALL(IF((OFFSET(INDIRECT(\"'\"&INT((MONTH(A26)-1)/6)+1&IF(INT((MONTH(A26)-1)/6)+1=1,\"ER SEMESTRE \",\"EME SEMESTRE \")&YEAR(A26)&\"'\"&\"!$B$9:$B$43\"),0,MATCH($A26,INDIRECT(\"'\"&INT((MONTH(A26)-1)/6)+1&IF(INT((MONTH(A26)-1)/6)+1=1,\"ER SEMESTRE \",\"EME SEMESTRE \")&YEAR(A26)&\"'\"&\"!$B$7:$HA$7\"),0)-DAY(A26)-1)=\"(\"&$G$9&\")\")*(INDEX(INDIRECT(\"'\"&INT((MONTH(A26)-1)/6)+1&IF(INT((MONTH(A26)-1)/6)+1=1,\"ER SEMESTRE \",\"EME SEMESTRE \")&YEAR(A26)&\"'\"&\"!$B$9:$HA$43\"),0,MATCH($A26,INDIRECT(\"'\"&INT((MONTH(A26)-1)/6)+1&IF(INT((MONTH(A26)-1)/6)+1=1,\"ER SEMESTRE \",\"EME SEMESTRE \")&YEAR(A26)&\"'\"&\"!$B$7:$HA$7\"),0))=\"R\"),ROW(INDIRECT(\"'\"&INT((MONTH(A26)-1)/6)+1&IF(INT((MONTH(A26)-1)/6)+1=1,\"ER SEMESTRE \",\"EME SEMESTRE \")&YEAR(A26)&\"'\"&\"!D$9:D$43\"))-8,9^9),2)),\"\")\n\n),\n\n\"\")","v":""}]
["",{"$f":"IFERROR(INDEX([3]PLANNING!$D$3:$Y$29,MATCH('[3]F_Dde de remplacement'!$G$8,[3]PLANNING!$B$3:$B$29,0),MATCH('[3]F_Dde de remplacement'!$A27,[3]PLANNING!$D$2:$Y$2,0)),\"\")","v":""},{"$f":"IF(OR($B27=\"M\",$B27=\"N\",$B27=\"A\"),IFERROR(INDEX(OFFSET(INDIRECT(\"'\"&INT((MONTH(A27)-1)/6)+1&IF(INT((MONTH(A27)-1)/6)+1=1,\"ER SEMESTRE \",\"EME SEMESTRE \")&YEAR(A27)&\"'\"&\"!$B$9:$B$43\"),0,MATCH($A27,INDIRECT(\"'\"&INT((MONTH(A27)-1)/6)+1&IF(INT((MONTH(A27)-1)/6)+1=1,\"ER SEMESTRE \",\"EME SEMESTRE \")&YEAR(A27)&\"'\"&\"!$B$7:$HA$7\"),0)-DAY(A27)-2),MIN(IF((OFFSET(INDIRECT(\"'\"&INT((MONTH(A27)-1)/6)+1&IF(INT((MONTH(A27)-1)/6)+1=1,\"ER SEMESTRE \",\"EME SEMESTRE \")&YEAR(A27)&\"'\"&\"!$B$9:$B$43\"),0,MATCH($A27,INDIRECT(\"'\"&INT((MONTH(A27)-1)/6)+1&IF(INT((MONTH(A27)-1)/6)+1=1,\"ER SEMESTRE \",\"EME SEMESTRE \")&YEAR(A27)&\"'\"&\"!$B$7:$HA$7\"),0)-DAY(A27)-1)=\"(\"&$G$9&\")\")*(INDEX(INDIRECT(\"'\"&INT((MONTH(A27)-1)/6)+1&IF(INT((MONTH(A27)-1)/6)+1=1,\"ER SEMESTRE \",\"EME SEMESTRE \")&YEAR(A27)&\"'\"&\"!$B$9:$HA$43\"),0,MATCH($A27,INDIRECT(\"'\"&INT((MONTH(A27)-1)/6)+1&IF(INT((MONTH(A27)-1)/6)+1=1,\"ER SEMESTRE \",\"EME SEMESTRE \")&YEAR(A27)&\"'\"&\"!$B$7:$HA$7\"),0))=\"J\"),ROW(INDIRECT(\"'\"&INT((MONTH(A27)-1)/6)+1&IF(INT((MONTH(A27)-1)/6)+1=1,\"ER SEMESTRE \",\"EME SEMESTRE \")&YEAR(A27)&\"'\"&\"!$D$9:$D$43\"))-8,9^9))),IFERROR(INDEX(OFFSET(INDIRECT(\"'\"&INT((MONTH(A27)-1)/6)+1&IF(INT((MONTH(A27)-1)/6)+1=1,\"ER SEMESTRE \",\"EME SEMESTRE \")&YEAR(A27)&\"'\"&\"!$B$9:$B$43\"),0,MATCH($A27,INDIRECT(\"'\"&INT((MONTH(A27)-1)/6)+1&IF(INT((MONTH(A27)-1)/6)+1=1,\"ER SEMESTRE \",\"EME SEMESTRE \")&YEAR(A27)&\"'\"&\"!$B$7:$HA$7\"),0)-DAY(A27)-2),MIN(IF((OFFSET(INDIRECT(\"'\"&INT((MONTH(A27)-1)/6)+1&IF(INT((MONTH(A27)-1)/6)+1=1,\"ER SEMESTRE \",\"EME SEMESTRE \")&YEAR(A27)&\"'\"&\"!$B$9:$B$43\"),0,MATCH($A27,INDIRECT(\"'\"&INT((MONTH(A27)-1)/6)+1&IF(INT((MONTH(A27)-1)/6)+1=1,\"ER SEMESTRE \",\"EME SEMESTRE \")&YEAR(A27)&\"'\"&\"!$B$7:$HA$7\"),0)-DAY(A27)-1)=\"(\"&$G$9&\")\")*(INDEX(INDIRECT(\"'\"&INT((MONTH(A27)-1)/6)+1&IF(INT((MONTH(A27)-1)/6)+1=1,\"ER SEMESTRE \",\"EME SEMESTRE \")&YEAR(A27)&\"'\"&\"!$B$9:$HA$43\"),0,MATCH($A27,INDIRECT(\"'\"&INT((MONTH(A27)-1)/6)+1&IF(INT((MONTH(A27)-1)/6)+1=1,\"ER SEMESTRE \",\"EME SEMESTRE \")&YEAR(A27)&\"'\"&\"!$B$7:$HA$7\"),0))=\"R\"),ROW(INDIRECT(\"'\"&INT((MONTH(A27)-1)/6)+1&IF(INT((MONTH(A27)-1)/6)+1=1,\"ER SEMESTRE \",\"EME SEMESTRE \")&YEAR(A27)&\"'\"&\"!$D$9:$D$43\"))-8,9^9))),\"\")),\"\")","v":""},null,{"$f":"IF(OR($B27=\"M\",$B27=\"N\",$B27=\"A\"),IF(\nIFERROR(INDEX(OFFSET(INDIRECT(\"'\"&INT((MONTH(A27)-1)/6)+1&IF(INT((MONTH(A27)-1)/6)+1=1,\"ER SEMESTRE \",\"EME SEMESTRE \")&YEAR(A27)&\"'\"&\"!$B$9:$B$43\"),0,MATCH($A27,INDIRECT(\"'\"&INT((MONTH(A27)-1)/6)+1&IF(INT((MONTH(A27)-1)/6)+1=1,\"ER SEMESTRE \",\"EME SEMESTRE \")&YEAR(A27)&\"'\"&\"!$B$7:$HA$7\"),0)-DAY(A27)-2),MIN(IF((OFFSET(INDIRECT(\"'\"&INT((MONTH(A27)-1)/6)+1&IF(INT((MONTH(A27)-1)/6)+1=1,\"ER SEMESTRE \",\"EME SEMESTRE \")&YEAR(A27)&\"'\"&\"!$B$9:$B$43\"),0,MATCH($A27,INDIRECT(\"'\"&INT((MONTH(A27)-1)/6)+1&IF(INT((MONTH(A27)-1)/6)+1=1,\"ER SEMESTRE \",\"EME SEMESTRE \")&YEAR(A27)&\"'\"&\"!$B$7:$HA$7\"),0)-DAY(A27)-1)=\"(\"&$G$9&\")\")*(INDEX(INDIRECT(\"'\"&INT((MONTH(A27)-1)/6)+1&IF(INT((MONTH(A27)-1)/6)+1=1,\"ER SEMESTRE \",\"EME SEMESTRE \")&YEAR(A27)&\"'\"&\"!$B$9:$HA$43\"),0,MATCH($A27,INDIRECT(\"'\"&INT((MONTH(A27)-1)/6)+1&IF(INT((MONTH(A27)-1)/6)+1=1,\"ER SEMESTRE \",\"EME SEMESTRE \")&YEAR(A27)&\"'\"&\"!$B$7:$HA$7\"),0))=\"J\"),ROW(INDIRECT(\"'\"&INT((MONTH(A27)-1)/6)+1&IF(INT((MONTH(A27)-1)/6)+1=1,\"ER SEMESTRE \",\"EME SEMESTRE \")&YEAR(A27)&\"'\"&\"!$D$9:$D$43\"))-8,9^9))),\"\")=\"\",\n\nIFERROR(INDEX(OFFSET(INDIRECT(\"'\"&INT((MONTH(A27)-1)/6)+1&IF(INT((MONTH(A27)-1)/6)+1=1,\"ER SEMESTRE \",\"EME SEMESTRE \")&YEAR(A27)&\"'\"&\"!$B$9:$B$43\"),0,MATCH($A27,INDIRECT(\"'\"&INT((MONTH(A27)-1)/6)+1&IF(INT((MONTH(A27)-1)/6)+1=1,\"ER SEMESTRE \",\"EME SEMESTRE \")&YEAR(A27)&\"'\"&\"!$B$7:$HA$7\"),0)-DAY(A27)-2),SMALL(IF((OFFSET(INDIRECT(\"'\"&INT((MONTH(A27)-1)/6)+1&IF(INT((MONTH(A27)-1)/6)+1=1,\"ER SEMESTRE \",\"EME SEMESTRE \")&YEAR(A27)&\"'\"&\"!$B$9:$B$43\"),0,MATCH($A27,INDIRECT(\"'\"&INT((MONTH(A27)-1)/6)+1&IF(INT((MONTH(A27)-1)/6)+1=1,\"ER SEMESTRE \",\"EME SEMESTRE \")&YEAR(A27)&\"'\"&\"!$B$7:$HA$7\"),0)-DAY(A27)-1)=\"(\"&$G$9&\")\")*(INDEX(INDIRECT(\"'\"&INT((MONTH(A27)-1)/6)+1&IF(INT((MONTH(A27)-1)/6)+1=1,\"ER SEMESTRE \",\"EME SEMESTRE \")&YEAR(A27)&\"'\"&\"!$B$9:$HA$43\"),0,MATCH($A27,INDIRECT(\"'\"&INT((MONTH(A27)-1)/6)+1&IF(INT((MONTH(A27)-1)/6)+1=1,\"ER SEMESTRE \",\"EME SEMESTRE \")&YEAR(A27)&\"'\"&\"!$B$7:$HA$7\"),0))=\"R\"),ROW(INDIRECT(\"'\"&INT((MONTH(A27)-1)/6)+1&IF(INT((MONTH(A27)-1)/6)+1=1,\"ER SEMESTRE \",\"EME SEMESTRE \")&YEAR(A27)&\"'\"&\"!D$9:D$43\"))-8,9^9),2)),\"\"),\n\nIFERROR(\nINDEX(\nOFFSET(INDIRECT(\"'\"&INT((MONTH(A27)-1)/6)+1&IF(INT((MONTH(A27)-1)/6)+1=1,\"ER SEMESTRE \",\"EME SEMESTRE \")&YEAR(A27)&\"'\"&\"!$B$9:$B$43\"),0,MATCH($A27,INDIRECT(\"'\"&INT((MONTH(A27)-1)/6)+1&IF(INT((MONTH(A27)-1)/6)+1=1,\"ER SEMESTRE \",\"EME SEMESTRE \")&YEAR(A27)&\"'\"&\"!$B$7:$HA$7\"),0)-DAY(A27)-2),\n\nMIN(IF(\n(OFFSET(INDIRECT(\"'\"&INT((MONTH(A27)-1)/6)+1&IF(INT((MONTH(A27)-1)/6)+1=1,\"ER SEMESTRE \",\"EME SEMESTRE \")&YEAR(A27)&\"'\"&\"!$B$9:$B$43\"),0,MATCH($A27,INDIRECT(\"'\"&INT((MONTH(A27)-1)/6)+1&IF(INT((MONTH(A27)-1)/6)+1=1,\"ER SEMESTRE \",\"EME SEMESTRE \")&YEAR(A27)&\"'\"&\"!$B$7:$HA$7\"),0)-DAY(A27)-1)=\"(\"&$G$9&\")\")\n*\n(INDEX(INDIRECT(\"'\"&INT((MONTH(A27)-1)/6)+1&IF(INT((MONTH(A27)-1)/6)+1=1,\"ER SEMESTRE \",\"EME SEMESTRE \")&YEAR(A27)&\"'\"&\"!$B$9:$HA$43\"),0,MATCH($A27,INDIRECT(\"'\"&INT((MONTH(A27)-1)/6)+1&IF(INT((MONTH(A27)-1)/6)+1=1,\"ER SEMESTRE \",\"EME SEMESTRE \")&YEAR(A27)&\"'\"&\"!$B$7:$HA$7\"),0))=\"R\"),\n\nROW(INDIRECT(\"'\"&INT((MONTH(A27)-1)/6)+1&IF(INT((MONTH(A27)-1)/6)+1=1,\"ER SEMESTRE \",\"EME SEMESTRE \")&YEAR(A27)&\"'\"&\"!D$9:D$43\"))-8,\n\n9^9))),\"\")),\"\")","v":""},null,{"$f":"IF(OR($B27=\"M\",$B27=\"N\",$B27=\"A\"),IF(\n\nIFERROR(INDEX(OFFSET(INDIRECT(\"'\"&INT((MONTH(A27)-1)/6)+1&IF(INT((MONTH(A27)-1)/6)+1=1,\"ER SEMESTRE \",\"EME SEMESTRE \")&YEAR(A27)&\"'\"&\"!$B$9:$B$43\"),0,MATCH($A27,INDIRECT(\"'\"&INT((MONTH(A27)-1)/6)+1&IF(INT((MONTH(A27)-1)/6)+1=1,\"ER SEMESTRE \",\"EME SEMESTRE \")&YEAR(A27)&\"'\"&\"!$B$7:$HA$7\"),0)-DAY(A27)-2),MIN(IF((OFFSET(INDIRECT(\"'\"&INT((MONTH(A27)-1)/6)+1&IF(INT((MONTH(A27)-1)/6)+1=1,\"ER SEMESTRE \",\"EME SEMESTRE \")&YEAR(A27)&\"'\"&\"!$B$9:$B$43\"),0,MATCH($A27,INDIRECT(\"'\"&INT((MONTH(A27)-1)/6)+1&IF(INT((MONTH(A27)-1)/6)+1=1,\"ER SEMESTRE \",\"EME SEMESTRE \")&YEAR(A27)&\"'\"&\"!$B$7:$HA$7\"),0)-DAY(A27)-1)=\"(\"&$G$9&\")\")*(INDEX(INDIRECT(\"'\"&INT((MONTH(A27)-1)/6)+1&IF(INT((MONTH(A27)-1)/6)+1=1,\"ER SEMESTRE \",\"EME SEMESTRE \")&YEAR(A27)&\"'\"&\"!$B$9:$HA$43\"),0,MATCH($A27,INDIRECT(\"'\"&INT((MONTH(A27)-1)/6)+1&IF(INT((MONTH(A27)-1)/6)+1=1,\"ER SEMESTRE \",\"EME SEMESTRE \")&YEAR(A27)&\"'\"&\"!$B$7:$HA$7\"),0))=\"J\"),ROW(INDIRECT(\"'\"&INT((MONTH(A27)-1)/6)+1&IF(INT((MONTH(A27)-1)/6)+1=1,\"ER SEMESTRE \",\"EME SEMESTRE \")&YEAR(A27)&\"'\"&\"!$D$9:$D$43\"))-8,9^9))),\"\")=\"\",\n\nIFERROR(\nINDEX(OFFSET(INDIRECT(\"'\"&INT((MONTH(A27)-1)/6)+1&IF(INT((MONTH(A27)-1)/6)+1=1,\"ER SEMESTRE \",\"EME SEMESTRE \")&YEAR(A27)&\"'\"&\"!$B$9:$B$43\"),0,MATCH($A27,INDIRECT(\"'\"&INT((MONTH(A27)-1)/6)+1&IF(INT((MONTH(A27)-1)/6)+1=1,\"ER SEMESTRE \",\"EME SEMESTRE \")&YEAR(A27)&\"'\"&\"!$B$7:$HA$7\"),0)-DAY(A27)-2),\nSMALL(IF((OFFSET(INDIRECT(\"'\"&INT((MONTH(A27)-1)/6)+1&IF(INT((MONTH(A27)-1)/6)+1=1,\"ER SEMESTRE \",\"EME SEMESTRE \")&YEAR(A27)&\"'\"&\"!$B$9:$B$43\"),0,MATCH($A27,INDIRECT(\"'\"&INT((MONTH(A27)-1)/6)+1&IF(INT((MONTH(A27)-1)/6)+1=1,\"ER SEMESTRE \",\"EME SEMESTRE \")&YEAR(A27)&\"'\"&\"!$B$7:$HA$7\"),0)-DAY(A27)-1)=\"(\"&$G$9&\")\")*(INDEX(INDIRECT(\"'\"&INT((MONTH(A27)-1)/6)+1&IF(INT((MONTH(A27)-1)/6)+1=1,\"ER SEMESTRE \",\"EME SEMESTRE \")&YEAR(A27)&\"'\"&\"!$B$9:$HA$43\"),0,MATCH($A27,INDIRECT(\"'\"&INT((MONTH(A27)-1)/6)+1&IF(INT((MONTH(A27)-1)/6)+1=1,\"ER SEMESTRE \",\"EME SEMESTRE \")&YEAR(A27)&\"'\"&\"!$B$7:$HA$7\"),0))=\"R\"),ROW(INDIRECT(\"'\"&INT((MONTH(A27)-1)/6)+1&IF(INT((MONTH(A27)-1)/6)+1=1,\"ER SEMESTRE \",\"EME SEMESTRE \")&YEAR(A27)&\"'\"&\"!D$9:D$43\"))-8,9^9),3)),\"\"),\n\n\nIFERROR(\nINDEX(OFFSET(INDIRECT(\"'\"&INT((MONTH(A27)-1)/6)+1&IF(INT((MONTH(A27)-1)/6)+1=1,\"ER SEMESTRE \",\"EME SEMESTRE \")&YEAR(A27)&\"'\"&\"!$B$9:$B$43\"),0,MATCH($A27,INDIRECT(\"'\"&INT((MONTH(A27)-1)/6)+1&IF(INT((MONTH(A27)-1)/6)+1=1,\"ER SEMESTRE \",\"EME SEMESTRE \")&YEAR(A27)&\"'\"&\"!$B$7:$HA$7\"),0)-DAY(A27)-2),\nSMALL(IF((OFFSET(INDIRECT(\"'\"&INT((MONTH(A27)-1)/6)+1&IF(INT((MONTH(A27)-1)/6)+1=1,\"ER SEMESTRE \",\"EME SEMESTRE \")&YEAR(A27)&\"'\"&\"!$B$9:$B$43\"),0,MATCH($A27,INDIRECT(\"'\"&INT((MONTH(A27)-1)/6)+1&IF(INT((MONTH(A27)-1)/6)+1=1,\"ER SEMESTRE \",\"EME SEMESTRE \")&YEAR(A27)&\"'\"&\"!$B$7:$HA$7\"),0)-DAY(A27)-1)=\"(\"&$G$9&\")\")*(INDEX(INDIRECT(\"'\"&INT((MONTH(A27)-1)/6)+1&IF(INT((MONTH(A27)-1)/6)+1=1,\"ER SEMESTRE \",\"EME SEMESTRE \")&YEAR(A27)&\"'\"&\"!$B$9:$HA$43\"),0,MATCH($A27,INDIRECT(\"'\"&INT((MONTH(A27)-1)/6)+1&IF(INT((MONTH(A27)-1)/6)+1=1,\"ER SEMESTRE \",\"EME SEMESTRE \")&YEAR(A27)&\"'\"&\"!$B$7:$HA$7\"),0))=\"R\"),ROW(INDIRECT(\"'\"&INT((MONTH(A27)-1)/6)+1&IF(INT((MONTH(A27)-1)/6)+1=1,\"ER SEMESTRE \",\"EME SEMESTRE \")&YEAR(A27)&\"'\"&\"!D$9:D$43\"))-8,9^9),2)),\"\")\n\n),\n\n\"\")","v":""}]
["",{"$f":"IFERROR(INDEX([3]PLANNING!$D$3:$Y$29,MATCH('[3]F_Dde de remplacement'!$G$8,[3]PLANNING!$B$3:$B$29,0),MATCH('[3]F_Dde de remplacement'!$A28,[3]PLANNING!$D$2:$Y$2,0)),\"\")","v":""},{"$f":"IF(OR($B28=\"M\",$B28=\"N\",$B28=\"A\"),IFERROR(INDEX(OFFSET(INDIRECT(\"'\"&INT((MONTH(A28)-1)/6)+1&IF(INT((MONTH(A28)-1)/6)+1=1,\"ER SEMESTRE \",\"EME SEMESTRE \")&YEAR(A28)&\"'\"&\"!$B$9:$B$43\"),0,MATCH($A28,INDIRECT(\"'\"&INT((MONTH(A28)-1)/6)+1&IF(INT((MONTH(A28)-1)/6)+1=1,\"ER SEMESTRE \",\"EME SEMESTRE \")&YEAR(A28)&\"'\"&\"!$B$7:$HA$7\"),0)-DAY(A28)-2),MIN(IF((OFFSET(INDIRECT(\"'\"&INT((MONTH(A28)-1)/6)+1&IF(INT((MONTH(A28)-1)/6)+1=1,\"ER SEMESTRE \",\"EME SEMESTRE \")&YEAR(A28)&\"'\"&\"!$B$9:$B$43\"),0,MATCH($A28,INDIRECT(\"'\"&INT((MONTH(A28)-1)/6)+1&IF(INT((MONTH(A28)-1)/6)+1=1,\"ER SEMESTRE \",\"EME SEMESTRE \")&YEAR(A28)&\"'\"&\"!$B$7:$HA$7\"),0)-DAY(A28)-1)=\"(\"&$G$9&\")\")*(INDEX(INDIRECT(\"'\"&INT((MONTH(A28)-1)/6)+1&IF(INT((MONTH(A28)-1)/6)+1=1,\"ER SEMESTRE \",\"EME SEMESTRE \")&YEAR(A28)&\"'\"&\"!$B$9:$HA$43\"),0,MATCH($A28,INDIRECT(\"'\"&INT((MONTH(A28)-1)/6)+1&IF(INT((MONTH(A28)-1)/6)+1=1,\"ER SEMESTRE \",\"EME SEMESTRE \")&YEAR(A28)&\"'\"&\"!$B$7:$HA$7\"),0))=\"J\"),ROW(INDIRECT(\"'\"&INT((MONTH(A28)-1)/6)+1&IF(INT((MONTH(A28)-1)/6)+1=1,\"ER SEMESTRE \",\"EME SEMESTRE \")&YEAR(A28)&\"'\"&\"!$D$9:$D$43\"))-8,9^9))),IFERROR(INDEX(OFFSET(INDIRECT(\"'\"&INT((MONTH(A28)-1)/6)+1&IF(INT((MONTH(A28)-1)/6)+1=1,\"ER SEMESTRE \",\"EME SEMESTRE \")&YEAR(A28)&\"'\"&\"!$B$9:$B$43\"),0,MATCH($A28,INDIRECT(\"'\"&INT((MONTH(A28)-1)/6)+1&IF(INT((MONTH(A28)-1)/6)+1=1,\"ER SEMESTRE \",\"EME SEMESTRE \")&YEAR(A28)&\"'\"&\"!$B$7:$HA$7\"),0)-DAY(A28)-2),MIN(IF((OFFSET(INDIRECT(\"'\"&INT((MONTH(A28)-1)/6)+1&IF(INT((MONTH(A28)-1)/6)+1=1,\"ER SEMESTRE \",\"EME SEMESTRE \")&YEAR(A28)&\"'\"&\"!$B$9:$B$43\"),0,MATCH($A28,INDIRECT(\"'\"&INT((MONTH(A28)-1)/6)+1&IF(INT((MONTH(A28)-1)/6)+1=1,\"ER SEMESTRE \",\"EME SEMESTRE \")&YEAR(A28)&\"'\"&\"!$B$7:$HA$7\"),0)-DAY(A28)-1)=\"(\"&$G$9&\")\")*(INDEX(INDIRECT(\"'\"&INT((MONTH(A28)-1)/6)+1&IF(INT((MONTH(A28)-1)/6)+1=1,\"ER SEMESTRE \",\"EME SEMESTRE \")&YEAR(A28)&\"'\"&\"!$B$9:$HA$43\"),0,MATCH($A28,INDIRECT(\"'\"&INT((MONTH(A28)-1)/6)+1&IF(INT((MONTH(A28)-1)/6)+1=1,\"ER SEMESTRE \",\"EME SEMESTRE \")&YEAR(A28)&\"'\"&\"!$B$7:$HA$7\"),0))=\"R\"),ROW(INDIRECT(\"'\"&INT((MONTH(A28)-1)/6)+1&IF(INT((MONTH(A28)-1)/6)+1=1,\"ER SEMESTRE \",\"EME SEMESTRE \")&YEAR(A28)&\"'\"&\"!$D$9:$D$43\"))-8,9^9))),\"\")),\"\")","v":""},null,{"$f":"IF(OR($B28=\"M\",$B28=\"N\",$B28=\"A\"),IF(\nIFERROR(INDEX(OFFSET(INDIRECT(\"'\"&INT((MONTH(A28)-1)/6)+1&IF(INT((MONTH(A28)-1)/6)+1=1,\"ER SEMESTRE \",\"EME SEMESTRE \")&YEAR(A28)&\"'\"&\"!$B$9:$B$43\"),0,MATCH($A28,INDIRECT(\"'\"&INT((MONTH(A28)-1)/6)+1&IF(INT((MONTH(A28)-1)/6)+1=1,\"ER SEMESTRE \",\"EME SEMESTRE \")&YEAR(A28)&\"'\"&\"!$B$7:$HA$7\"),0)-DAY(A28)-2),MIN(IF((OFFSET(INDIRECT(\"'\"&INT((MONTH(A28)-1)/6)+1&IF(INT((MONTH(A28)-1)/6)+1=1,\"ER SEMESTRE \",\"EME SEMESTRE \")&YEAR(A28)&\"'\"&\"!$B$9:$B$43\"),0,MATCH($A28,INDIRECT(\"'\"&INT((MONTH(A28)-1)/6)+1&IF(INT((MONTH(A28)-1)/6)+1=1,\"ER SEMESTRE \",\"EME SEMESTRE \")&YEAR(A28)&\"'\"&\"!$B$7:$HA$7\"),0)-DAY(A28)-1)=\"(\"&$G$9&\")\")*(INDEX(INDIRECT(\"'\"&INT((MONTH(A28)-1)/6)+1&IF(INT((MONTH(A28)-1)/6)+1=1,\"ER SEMESTRE \",\"EME SEMESTRE \")&YEAR(A28)&\"'\"&\"!$B$9:$HA$43\"),0,MATCH($A28,INDIRECT(\"'\"&INT((MONTH(A28)-1)/6)+1&IF(INT((MONTH(A28)-1)/6)+1=1,\"ER SEMESTRE \",\"EME SEMESTRE \")&YEAR(A28)&\"'\"&\"!$B$7:$HA$7\"),0))=\"J\"),ROW(INDIRECT(\"'\"&INT((MONTH(A28)-1)/6)+1&IF(INT((MONTH(A28)-1)/6)+1=1,\"ER SEMESTRE \",\"EME SEMESTRE \")&YEAR(A28)&\"'\"&\"!$D$9:$D$43\"))-8,9^9))),\"\")=\"\",\n\nIFERROR(INDEX(OFFSET(INDIRECT(\"'\"&INT((MONTH(A28)-1)/6)+1&IF(INT((MONTH(A28)-1)/6)+1=1,\"ER SEMESTRE \",\"EME SEMESTRE \")&YEAR(A28)&\"'\"&\"!$B$9:$B$43\"),0,MATCH($A28,INDIRECT(\"'\"&INT((MONTH(A28)-1)/6)+1&IF(INT((MONTH(A28)-1)/6)+1=1,\"ER SEMESTRE \",\"EME SEMESTRE \")&YEAR(A28)&\"'\"&\"!$B$7:$HA$7\"),0)-DAY(A28)-2),SMALL(IF((OFFSET(INDIRECT(\"'\"&INT((MONTH(A28)-1)/6)+1&IF(INT((MONTH(A28)-1)/6)+1=1,\"ER SEMESTRE \",\"EME SEMESTRE \")&YEAR(A28)&\"'\"&\"!$B$9:$B$43\"),0,MATCH($A28,INDIRECT(\"'\"&INT((MONTH(A28)-1)/6)+1&IF(INT((MONTH(A28)-1)/6)+1=1,\"ER SEMESTRE \",\"EME SEMESTRE \")&YEAR(A28)&\"'\"&\"!$B$7:$HA$7\"),0)-DAY(A28)-1)=\"(\"&$G$9&\")\")*(INDEX(INDIRECT(\"'\"&INT((MONTH(A28)-1)/6)+1&IF(INT((MONTH(A28)-1)/6)+1=1,\"ER SEMESTRE \",\"EME SEMESTRE \")&YEAR(A28)&\"'\"&\"!$B$9:$HA$43\"),0,MATCH($A28,INDIRECT(\"'\"&INT((MONTH(A28)-1)/6)+1&IF(INT((MONTH(A28)-1)/6)+1=1,\"ER SEMESTRE \",\"EME SEMESTRE \")&YEAR(A28)&\"'\"&\"!$B$7:$HA$7\"),0))=\"R\"),ROW(INDIRECT(\"'\"&INT((MONTH(A28)-1)/6)+1&IF(INT((MONTH(A28)-1)/6)+1=1,\"ER SEMESTRE \",\"EME SEMESTRE \")&YEAR(A28)&\"'\"&\"!D$9:D$43\"))-8,9^9),2)),\"\"),\n\nIFERROR(\nINDEX(\nOFFSET(INDIRECT(\"'\"&INT((MONTH(A28)-1)/6)+1&IF(INT((MONTH(A28)-1)/6)+1=1,\"ER SEMESTRE \",\"EME SEMESTRE \")&YEAR(A28)&\"'\"&\"!$B$9:$B$43\"),0,MATCH($A28,INDIRECT(\"'\"&INT((MONTH(A28)-1)/6)+1&IF(INT((MONTH(A28)-1)/6)+1=1,\"ER SEMESTRE \",\"EME SEMESTRE \")&YEAR(A28)&\"'\"&\"!$B$7:$HA$7\"),0)-DAY(A28)-2),\n\nMIN(IF(\n(OFFSET(INDIRECT(\"'\"&INT((MONTH(A28)-1)/6)+1&IF(INT((MONTH(A28)-1)/6)+1=1,\"ER SEMESTRE \",\"EME SEMESTRE \")&YEAR(A28)&\"'\"&\"!$B$9:$B$43\"),0,MATCH($A28,INDIRECT(\"'\"&INT((MONTH(A28)-1)/6)+1&IF(INT((MONTH(A28)-1)/6)+1=1,\"ER SEMESTRE \",\"EME SEMESTRE \")&YEAR(A28)&\"'\"&\"!$B$7:$HA$7\"),0)-DAY(A28)-1)=\"(\"&$G$9&\")\")\n*\n(INDEX(INDIRECT(\"'\"&INT((MONTH(A28)-1)/6)+1&IF(INT((MONTH(A28)-1)/6)+1=1,\"ER SEMESTRE \",\"EME SEMESTRE \")&YEAR(A28)&\"'\"&\"!$B$9:$HA$43\"),0,MATCH($A28,INDIRECT(\"'\"&INT((MONTH(A28)-1)/6)+1&IF(INT((MONTH(A28)-1)/6)+1=1,\"ER SEMESTRE \",\"EME SEMESTRE \")&YEAR(A28)&\"'\"&\"!$B$7:$HA$7\"),0))=\"R\"),\n\nROW(INDIRECT(\"'\"&INT((MONTH(A28)-1)/6)+1&IF(INT((MONTH(A28)-1)/6)+1=1,\"ER SEMESTRE \",\"EME SEMESTRE \")&YEAR(A28)&\"'\"&\"!D$9:D$43\"))-8,\n\n9^9))),\"\")),\"\")","v":""},null,{"$f":"IF(OR($B28=\"M\",$B28=\"N\",$B28=\"A\"),IF(\n\nIFERROR(INDEX(OFFSET(INDIRECT(\"'\"&INT((MONTH(A28)-1)/6)+1&IF(INT((MONTH(A28)-1)/6)+1=1,\"ER SEMESTRE \",\"EME SEMESTRE \")&YEAR(A28)&\"'\"&\"!$B$9:$B$43\"),0,MATCH($A28,INDIRECT(\"'\"&INT((MONTH(A28)-1)/6)+1&IF(INT((MONTH(A28)-1)/6)+1=1,\"ER SEMESTRE \",\"EME SEMESTRE \")&YEAR(A28)&\"'\"&\"!$B$7:$HA$7\"),0)-DAY(A28)-2),MIN(IF((OFFSET(INDIRECT(\"'\"&INT((MONTH(A28)-1)/6)+1&IF(INT((MONTH(A28)-1)/6)+1=1,\"ER SEMESTRE \",\"EME SEMESTRE \")&YEAR(A28)&\"'\"&\"!$B$9:$B$43\"),0,MATCH($A28,INDIRECT(\"'\"&INT((MONTH(A28)-1)/6)+1&IF(INT((MONTH(A28)-1)/6)+1=1,\"ER SEMESTRE \",\"EME SEMESTRE \")&YEAR(A28)&\"'\"&\"!$B$7:$HA$7\"),0)-DAY(A28)-1)=\"(\"&$G$9&\")\")*(INDEX(INDIRECT(\"'\"&INT((MONTH(A28)-1)/6)+1&IF(INT((MONTH(A28)-1)/6)+1=1,\"ER SEMESTRE \",\"EME SEMESTRE \")&YEAR(A28)&\"'\"&\"!$B$9:$HA$43\"),0,MATCH($A28,INDIRECT(\"'\"&INT((MONTH(A28)-1)/6)+1&IF(INT((MONTH(A28)-1)/6)+1=1,\"ER SEMESTRE \",\"EME SEMESTRE \")&YEAR(A28)&\"'\"&\"!$B$7:$HA$7\"),0))=\"J\"),ROW(INDIRECT(\"'\"&INT((MONTH(A28)-1)/6)+1&IF(INT((MONTH(A28)-1)/6)+1=1,\"ER SEMESTRE \",\"EME SEMESTRE \")&YEAR(A28)&\"'\"&\"!$D$9:$D$43\"))-8,9^9))),\"\")=\"\",\n\nIFERROR(\nINDEX(OFFSET(INDIRECT(\"'\"&INT((MONTH(A28)-1)/6)+1&IF(INT((MONTH(A28)-1)/6)+1=1,\"ER SEMESTRE \",\"EME SEMESTRE \")&YEAR(A28)&\"'\"&\"!$B$9:$B$43\"),0,MATCH($A28,INDIRECT(\"'\"&INT((MONTH(A28)-1)/6)+1&IF(INT((MONTH(A28)-1)/6)+1=1,\"ER SEMESTRE \",\"EME SEMESTRE \")&YEAR(A28)&\"'\"&\"!$B$7:$HA$7\"),0)-DAY(A28)-2),\nSMALL(IF((OFFSET(INDIRECT(\"'\"&INT((MONTH(A28)-1)/6)+1&IF(INT((MONTH(A28)-1)/6)+1=1,\"ER SEMESTRE \",\"EME SEMESTRE \")&YEAR(A28)&\"'\"&\"!$B$9:$B$43\"),0,MATCH($A28,INDIRECT(\"'\"&INT((MONTH(A28)-1)/6)+1&IF(INT((MONTH(A28)-1)/6)+1=1,\"ER SEMESTRE \",\"EME SEMESTRE \")&YEAR(A28)&\"'\"&\"!$B$7:$HA$7\"),0)-DAY(A28)-1)=\"(\"&$G$9&\")\")*(INDEX(INDIRECT(\"'\"&INT((MONTH(A28)-1)/6)+1&IF(INT((MONTH(A28)-1)/6)+1=1,\"ER SEMESTRE \",\"EME SEMESTRE \")&YEAR(A28)&\"'\"&\"!$B$9:$HA$43\"),0,MATCH($A28,INDIRECT(\"'\"&INT((MONTH(A28)-1)/6)+1&IF(INT((MONTH(A28)-1)/6)+1=1,\"ER SEMESTRE \",\"EME SEMESTRE \")&YEAR(A28)&\"'\"&\"!$B$7:$HA$7\"),0))=\"R\"),ROW(INDIRECT(\"'\"&INT((MONTH(A28)-1)/6)+1&IF(INT((MONTH(A28)-1)/6)+1=1,\"ER SEMESTRE \",\"EME SEMESTRE \")&YEAR(A28)&\"'\"&\"!D$9:D$43\"))-8,9^9),3)),\"\"),\n\n\nIFERROR(\nINDEX(OFFSET(INDIRECT(\"'\"&INT((MONTH(A28)-1)/6)+1&IF(INT((MONTH(A28)-1)/6)+1=1,\"ER SEMESTRE \",\"EME SEMESTRE \")&YEAR(A28)&\"'\"&\"!$B$9:$B$43\"),0,MATCH($A28,INDIRECT(\"'\"&INT((MONTH(A28)-1)/6)+1&IF(INT((MONTH(A28)-1)/6)+1=1,\"ER SEMESTRE \",\"EME SEMESTRE \")&YEAR(A28)&\"'\"&\"!$B$7:$HA$7\"),0)-DAY(A28)-2),\nSMALL(IF((OFFSET(INDIRECT(\"'\"&INT((MONTH(A28)-1)/6)+1&IF(INT((MONTH(A28)-1)/6)+1=1,\"ER SEMESTRE \",\"EME SEMESTRE \")&YEAR(A28)&\"'\"&\"!$B$9:$B$43\"),0,MATCH($A28,INDIRECT(\"'\"&INT((MONTH(A28)-1)/6)+1&IF(INT((MONTH(A28)-1)/6)+1=1,\"ER SEMESTRE \",\"EME SEMESTRE \")&YEAR(A28)&\"'\"&\"!$B$7:$HA$7\"),0)-DAY(A28)-1)=\"(\"&$G$9&\")\")*(INDEX(INDIRECT(\"'\"&INT((MONTH(A28)-1)/6)+1&IF(INT((MONTH(A28)-1)/6)+1=1,\"ER SEMESTRE \",\"EME SEMESTRE \")&YEAR(A28)&\"'\"&\"!$B$9:$HA$43\"),0,MATCH($A28,INDIRECT(\"'\"&INT((MONTH(A28)-1)/6)+1&IF(INT((MONTH(A28)-1)/6)+1=1,\"ER SEMESTRE \",\"EME SEMESTRE \")&YEAR(A28)&\"'\"&\"!$B$7:$HA$7\"),0))=\"R\"),ROW(INDIRECT(\"'\"&INT((MONTH(A28)-1)/6)+1&IF(INT((MONTH(A28)-1)/6)+1=1,\"ER SEMESTRE \",\"EME SEMESTRE \")&YEAR(A28)&\"'\"&\"!D$9:D$43\"))-8,9^9),2)),\"\")\n\n),\n\n\"\")","v":""}]
["",{"$f":"IFERROR(INDEX([3]PLANNING!$D$3:$Y$29,MATCH('[3]F_Dde de remplacement'!$G$8,[3]PLANNING!$B$3:$B$29,0),MATCH('[3]F_Dde de remplacement'!$A29,[3]PLANNING!$D$2:$Y$2,0)),\"\")","v":""},{"$f":"IF(OR($B29=\"M\",$B29=\"N\",$B29=\"A\"),IFERROR(INDEX(OFFSET(INDIRECT(\"'\"&INT((MONTH(A29)-1)/6)+1&IF(INT((MONTH(A29)-1)/6)+1=1,\"ER SEMESTRE \",\"EME SEMESTRE \")&YEAR(A29)&\"'\"&\"!$B$9:$B$43\"),0,MATCH($A29,INDIRECT(\"'\"&INT((MONTH(A29)-1)/6)+1&IF(INT((MONTH(A29)-1)/6)+1=1,\"ER SEMESTRE \",\"EME SEMESTRE \")&YEAR(A29)&\"'\"&\"!$B$7:$HA$7\"),0)-DAY(A29)-2),MIN(IF((OFFSET(INDIRECT(\"'\"&INT((MONTH(A29)-1)/6)+1&IF(INT((MONTH(A29)-1)/6)+1=1,\"ER SEMESTRE \",\"EME SEMESTRE \")&YEAR(A29)&\"'\"&\"!$B$9:$B$43\"),0,MATCH($A29,INDIRECT(\"'\"&INT((MONTH(A29)-1)/6)+1&IF(INT((MONTH(A29)-1)/6)+1=1,\"ER SEMESTRE \",\"EME SEMESTRE \")&YEAR(A29)&\"'\"&\"!$B$7:$HA$7\"),0)-DAY(A29)-1)=\"(\"&$G$9&\")\")*(INDEX(INDIRECT(\"'\"&INT((MONTH(A29)-1)/6)+1&IF(INT((MONTH(A29)-1)/6)+1=1,\"ER SEMESTRE \",\"EME SEMESTRE \")&YEAR(A29)&\"'\"&\"!$B$9:$HA$43\"),0,MATCH($A29,INDIRECT(\"'\"&INT((MONTH(A29)-1)/6)+1&IF(INT((MONTH(A29)-1)/6)+1=1,\"ER SEMESTRE \",\"EME SEMESTRE \")&YEAR(A29)&\"'\"&\"!$B$7:$HA$7\"),0))=\"J\"),ROW(INDIRECT(\"'\"&INT((MONTH(A29)-1)/6)+1&IF(INT((MONTH(A29)-1)/6)+1=1,\"ER SEMESTRE \",\"EME SEMESTRE \")&YEAR(A29)&\"'\"&\"!$D$9:$D$43\"))-8,9^9))),IFERROR(INDEX(OFFSET(INDIRECT(\"'\"&INT((MONTH(A29)-1)/6)+1&IF(INT((MONTH(A29)-1)/6)+1=1,\"ER SEMESTRE \",\"EME SEMESTRE \")&YEAR(A29)&\"'\"&\"!$B$9:$B$43\"),0,MATCH($A29,INDIRECT(\"'\"&INT((MONTH(A29)-1)/6)+1&IF(INT((MONTH(A29)-1)/6)+1=1,\"ER SEMESTRE \",\"EME SEMESTRE \")&YEAR(A29)&\"'\"&\"!$B$7:$HA$7\"),0)-DAY(A29)-2),MIN(IF((OFFSET(INDIRECT(\"'\"&INT((MONTH(A29)-1)/6)+1&IF(INT((MONTH(A29)-1)/6)+1=1,\"ER SEMESTRE \",\"EME SEMESTRE \")&YEAR(A29)&\"'\"&\"!$B$9:$B$43\"),0,MATCH($A29,INDIRECT(\"'\"&INT((MONTH(A29)-1)/6)+1&IF(INT((MONTH(A29)-1)/6)+1=1,\"ER SEMESTRE \",\"EME SEMESTRE \")&YEAR(A29)&\"'\"&\"!$B$7:$HA$7\"),0)-DAY(A29)-1)=\"(\"&$G$9&\")\")*(INDEX(INDIRECT(\"'\"&INT((MONTH(A29)-1)/6)+1&IF(INT((MONTH(A29)-1)/6)+1=1,\"ER SEMESTRE \",\"EME SEMESTRE \")&YEAR(A29)&\"'\"&\"!$B$9:$HA$43\"),0,MATCH($A29,INDIRECT(\"'\"&INT((MONTH(A29)-1)/6)+1&IF(INT((MONTH(A29)-1)/6)+1=1,\"ER SEMESTRE \",\"EME SEMESTRE \")&YEAR(A29)&\"'\"&\"!$B$7:$HA$7\"),0))=\"R\"),ROW(INDIRECT(\"'\"&INT((MONTH(A29)-1)/6)+1&IF(INT((MONTH(A29)-1)/6)+1=1,\"ER SEMESTRE \",\"EME SEMESTRE \")&YEAR(A29)&\"'\"&\"!$D$9:$D$43\"))-8,9^9))),\"\")),\"\")","v":""},null,{"$f":"IF(OR($B29=\"M\",$B29=\"N\",$B29=\"A\"),IF(\nIFERROR(INDEX(OFFSET(INDIRECT(\"'\"&INT((MONTH(A29)-1)/6)+1&IF(INT((MONTH(A29)-1)/6)+1=1,\"ER SEMESTRE \",\"EME SEMESTRE \")&YEAR(A29)&\"'\"&\"!$B$9:$B$43\"),0,MATCH($A29,INDIRECT(\"'\"&INT((MONTH(A29)-1)/6)+1&IF(INT((MONTH(A29)-1)/6)+1=1,\"ER SEMESTRE \",\"EME SEMESTRE \")&YEAR(A29)&\"'\"&\"!$B$7:$HA$7\"),0)-DAY(A29)-2),MIN(IF((OFFSET(INDIRECT(\"'\"&INT((MONTH(A29)-1)/6)+1&IF(INT((MONTH(A29)-1)/6)+1=1,\"ER SEMESTRE \",\"EME SEMESTRE \")&YEAR(A29)&\"'\"&\"!$B$9:$B$43\"),0,MATCH($A29,INDIRECT(\"'\"&INT((MONTH(A29)-1)/6)+1&IF(INT((MONTH(A29)-1)/6)+1=1,\"ER SEMESTRE \",\"EME SEMESTRE \")&YEAR(A29)&\"'\"&\"!$B$7:$HA$7\"),0)-DAY(A29)-1)=\"(\"&$G$9&\")\")*(INDEX(INDIRECT(\"'\"&INT((MONTH(A29)-1)/6)+1&IF(INT((MONTH(A29)-1)/6)+1=1,\"ER SEMESTRE \",\"EME SEMESTRE \")&YEAR(A29)&\"'\"&\"!$B$9:$HA$43\"),0,MATCH($A29,INDIRECT(\"'\"&INT((MONTH(A29)-1)/6)+1&IF(INT((MONTH(A29)-1)/6)+1=1,\"ER SEMESTRE \",\"EME SEMESTRE \")&YEAR(A29)&\"'\"&\"!$B$7:$HA$7\"),0))=\"J\"),ROW(INDIRECT(\"'\"&INT((MONTH(A29)-1)/6)+1&IF(INT((MONTH(A29)-1)/6)+1=1,\"ER SEMESTRE \",\"EME SEMESTRE \")&YEAR(A29)&\"'\"&\"!$D$9:$D$43\"))-8,9^9))),\"\")=\"\",\n\nIFERROR(INDEX(OFFSET(INDIRECT(\"'\"&INT((MONTH(A29)-1)/6)+1&IF(INT((MONTH(A29)-1)/6)+1=1,\"ER SEMESTRE \",\"EME SEMESTRE \")&YEAR(A29)&\"'\"&\"!$B$9:$B$43\"),0,MATCH($A29,INDIRECT(\"'\"&INT((MONTH(A29)-1)/6)+1&IF(INT((MONTH(A29)-1)/6)+1=1,\"ER SEMESTRE \",\"EME SEMESTRE \")&YEAR(A29)&\"'\"&\"!$B$7:$HA$7\"),0)-DAY(A29)-2),SMALL(IF((OFFSET(INDIRECT(\"'\"&INT((MONTH(A29)-1)/6)+1&IF(INT((MONTH(A29)-1)/6)+1=1,\"ER SEMESTRE \",\"EME SEMESTRE \")&YEAR(A29)&\"'\"&\"!$B$9:$B$43\"),0,MATCH($A29,INDIRECT(\"'\"&INT((MONTH(A29)-1)/6)+1&IF(INT((MONTH(A29)-1)/6)+1=1,\"ER SEMESTRE \",\"EME SEMESTRE \")&YEAR(A29)&\"'\"&\"!$B$7:$HA$7\"),0)-DAY(A29)-1)=\"(\"&$G$9&\")\")*(INDEX(INDIRECT(\"'\"&INT((MONTH(A29)-1)/6)+1&IF(INT((MONTH(A29)-1)/6)+1=1,\"ER SEMESTRE \",\"EME SEMESTRE \")&YEAR(A29)&\"'\"&\"!$B$9:$HA$43\"),0,MATCH($A29,INDIRECT(\"'\"&INT((MONTH(A29)-1)/6)+1&IF(INT((MONTH(A29)-1)/6)+1=1,\"ER SEMESTRE \",\"EME SEMESTRE \")&YEAR(A29)&\"'\"&\"!$B$7:$HA$7\"),0))=\"R\"),ROW(INDIRECT(\"'\"&INT((MONTH(A29)-1)/6)+1&IF(INT((MONTH(A29)-1)/6)+1=1,\"ER SEMESTRE \",\"EME SEMESTRE \")&YEAR(A29)&\"'\"&\"!D$9:D$43\"))-8,9^9),2)),\"\"),\n\nIFERROR(\nINDEX(\nOFFSET(INDIRECT(\"'\"&INT((MONTH(A29)-1)/6)+1&IF(INT((MONTH(A29)-1)/6)+1=1,\"ER SEMESTRE \",\"EME SEMESTRE \")&YEAR(A29)&\"'\"&\"!$B$9:$B$43\"),0,MATCH($A29,INDIRECT(\"'\"&INT((MONTH(A29)-1)/6)+1&IF(INT((MONTH(A29)-1)/6)+1=1,\"ER SEMESTRE \",\"EME SEMESTRE \")&YEAR(A29)&\"'\"&\"!$B$7:$HA$7\"),0)-DAY(A29)-2),\n\nMIN(IF(\n(OFFSET(INDIRECT(\"'\"&INT((MONTH(A29)-1)/6)+1&IF(INT((MONTH(A29)-1)/6)+1=1,\"ER SEMESTRE \",\"EME SEMESTRE \")&YEAR(A29)&\"'\"&\"!$B$9:$B$43\"),0,MATCH($A29,INDIRECT(\"'\"&INT((MONTH(A29)-1)/6)+1&IF(INT((MONTH(A29)-1)/6)+1=1,\"ER SEMESTRE \",\"EME SEMESTRE \")&YEAR(A29)&\"'\"&\"!$B$7:$HA$7\"),0)-DAY(A29)-1)=\"(\"&$G$9&\")\")\n*\n(INDEX(INDIRECT(\"'\"&INT((MONTH(A29)-1)/6)+1&IF(INT((MONTH(A29)-1)/6)+1=1,\"ER SEMESTRE \",\"EME SEMESTRE \")&YEAR(A29)&\"'\"&\"!$B$9:$HA$43\"),0,MATCH($A29,INDIRECT(\"'\"&INT((MONTH(A29)-1)/6)+1&IF(INT((MONTH(A29)-1)/6)+1=1,\"ER SEMESTRE \",\"EME SEMESTRE \")&YEAR(A29)&\"'\"&\"!$B$7:$HA$7\"),0))=\"R\"),\n\nROW(INDIRECT(\"'\"&INT((MONTH(A29)-1)/6)+1&IF(INT((MONTH(A29)-1)/6)+1=1,\"ER SEMESTRE \",\"EME SEMESTRE \")&YEAR(A29)&\"'\"&\"!D$9:D$43\"))-8,\n\n9^9))),\"\")),\"\")","v":""},null,{"$f":"IF(OR($B29=\"M\",$B29=\"N\",$B29=\"A\"),IF(\n\nIFERROR(INDEX(OFFSET(INDIRECT(\"'\"&INT((MONTH(A29)-1)/6)+1&IF(INT((MONTH(A29)-1)/6)+1=1,\"ER SEMESTRE \",\"EME SEMESTRE \")&YEAR(A29)&\"'\"&\"!$B$9:$B$43\"),0,MATCH($A29,INDIRECT(\"'\"&INT((MONTH(A29)-1)/6)+1&IF(INT((MONTH(A29)-1)/6)+1=1,\"ER SEMESTRE \",\"EME SEMESTRE \")&YEAR(A29)&\"'\"&\"!$B$7:$HA$7\"),0)-DAY(A29)-2),MIN(IF((OFFSET(INDIRECT(\"'\"&INT((MONTH(A29)-1)/6)+1&IF(INT((MONTH(A29)-1)/6)+1=1,\"ER SEMESTRE \",\"EME SEMESTRE \")&YEAR(A29)&\"'\"&\"!$B$9:$B$43\"),0,MATCH($A29,INDIRECT(\"'\"&INT((MONTH(A29)-1)/6)+1&IF(INT((MONTH(A29)-1)/6)+1=1,\"ER SEMESTRE \",\"EME SEMESTRE \")&YEAR(A29)&\"'\"&\"!$B$7:$HA$7\"),0)-DAY(A29)-1)=\"(\"&$G$9&\")\")*(INDEX(INDIRECT(\"'\"&INT((MONTH(A29)-1)/6)+1&IF(INT((MONTH(A29)-1)/6)+1=1,\"ER SEMESTRE \",\"EME SEMESTRE \")&YEAR(A29)&\"'\"&\"!$B$9:$HA$43\"),0,MATCH($A29,INDIRECT(\"'\"&INT((MONTH(A29)-1)/6)+1&IF(INT((MONTH(A29)-1)/6)+1=1,\"ER SEMESTRE \",\"EME SEMESTRE \")&YEAR(A29)&\"'\"&\"!$B$7:$HA$7\"),0))=\"J\"),ROW(INDIRECT(\"'\"&INT((MONTH(A29)-1)/6)+1&IF(INT((MONTH(A29)-1)/6)+1=1,\"ER SEMESTRE \",\"EME SEMESTRE \")&YEAR(A29)&\"'\"&\"!$D$9:$D$43\"))-8,9^9))),\"\")=\"\",\n\nIFERROR(\nINDEX(OFFSET(INDIRECT(\"'\"&INT((MONTH(A29)-1)/6)+1&IF(INT((MONTH(A29)-1)/6)+1=1,\"ER SEMESTRE \",\"EME SEMESTRE \")&YEAR(A29)&\"'\"&\"!$B$9:$B$43\"),0,MATCH($A29,INDIRECT(\"'\"&INT((MONTH(A29)-1)/6)+1&IF(INT((MONTH(A29)-1)/6)+1=1,\"ER SEMESTRE \",\"EME SEMESTRE \")&YEAR(A29)&\"'\"&\"!$B$7:$HA$7\"),0)-DAY(A29)-2),\nSMALL(IF((OFFSET(INDIRECT(\"'\"&INT((MONTH(A29)-1)/6)+1&IF(INT((MONTH(A29)-1)/6)+1=1,\"ER SEMESTRE \",\"EME SEMESTRE \")&YEAR(A29)&\"'\"&\"!$B$9:$B$43\"),0,MATCH($A29,INDIRECT(\"'\"&INT((MONTH(A29)-1)/6)+1&IF(INT((MONTH(A29)-1)/6)+1=1,\"ER SEMESTRE \",\"EME SEMESTRE \")&YEAR(A29)&\"'\"&\"!$B$7:$HA$7\"),0)-DAY(A29)-1)=\"(\"&$G$9&\")\")*(INDEX(INDIRECT(\"'\"&INT((MONTH(A29)-1)/6)+1&IF(INT((MONTH(A29)-1)/6)+1=1,\"ER SEMESTRE \",\"EME SEMESTRE \")&YEAR(A29)&\"'\"&\"!$B$9:$HA$43\"),0,MATCH($A29,INDIRECT(\"'\"&INT((MONTH(A29)-1)/6)+1&IF(INT((MONTH(A29)-1)/6)+1=1,\"ER SEMESTRE \",\"EME SEMESTRE \")&YEAR(A29)&\"'\"&\"!$B$7:$HA$7\"),0))=\"R\"),ROW(INDIRECT(\"'\"&INT((MONTH(A29)-1)/6)+1&IF(INT((MONTH(A29)-1)/6)+1=1,\"ER SEMESTRE \",\"EME SEMESTRE \")&YEAR(A29)&\"'\"&\"!D$9:D$43\"))-8,9^9),3)),\"\"),\n\n\nIFERROR(\nINDEX(OFFSET(INDIRECT(\"'\"&INT((MONTH(A29)-1)/6)+1&IF(INT((MONTH(A29)-1)/6)+1=1,\"ER SEMESTRE \",\"EME SEMESTRE \")&YEAR(A29)&\"'\"&\"!$B$9:$B$43\"),0,MATCH($A29,INDIRECT(\"'\"&INT((MONTH(A29)-1)/6)+1&IF(INT((MONTH(A29)-1)/6)+1=1,\"ER SEMESTRE \",\"EME SEMESTRE \")&YEAR(A29)&\"'\"&\"!$B$7:$HA$7\"),0)-DAY(A29)-2),\nSMALL(IF((OFFSET(INDIRECT(\"'\"&INT((MONTH(A29)-1)/6)+1&IF(INT((MONTH(A29)-1)/6)+1=1,\"ER SEMESTRE \",\"EME SEMESTRE \")&YEAR(A29)&\"'\"&\"!$B$9:$B$43\"),0,MATCH($A29,INDIRECT(\"'\"&INT((MONTH(A29)-1)/6)+1&IF(INT((MONTH(A29)-1)/6)+1=1,\"ER SEMESTRE \",\"EME SEMESTRE \")&YEAR(A29)&\"'\"&\"!$B$7:$HA$7\"),0)-DAY(A29)-1)=\"(\"&$G$9&\")\")*(INDEX(INDIRECT(\"'\"&INT((MONTH(A29)-1)/6)+1&IF(INT((MONTH(A29)-1)/6)+1=1,\"ER SEMESTRE \",\"EME SEMESTRE \")&YEAR(A29)&\"'\"&\"!$B$9:$HA$43\"),0,MATCH($A29,INDIRECT(\"'\"&INT((MONTH(A29)-1)/6)+1&IF(INT((MONTH(A29)-1)/6)+1=1,\"ER SEMESTRE \",\"EME SEMESTRE \")&YEAR(A29)&\"'\"&\"!$B$7:$HA$7\"),0))=\"R\"),ROW(INDIRECT(\"'\"&INT((MONTH(A29)-1)/6)+1&IF(INT((MONTH(A29)-1)/6)+1=1,\"ER SEMESTRE \",\"EME SEMESTRE \")&YEAR(A29)&\"'\"&\"!D$9:D$43\"))-8,9^9),2)),\"\")\n\n),\n\n\"\")","v":""}]
["",{"$f":"IFERROR(INDEX([3]PLANNING!$D$3:$Y$29,MATCH('[3]F_Dde de remplacement'!$G$8,[3]PLANNING!$B$3:$B$29,0),MATCH('[3]F_Dde de remplacement'!$A30,[3]PLANNING!$D$2:$Y$2,0)),\"\")","v":""},{"$f":"IF(OR($B30=\"M\",$B30=\"N\",$B30=\"A\"),IFERROR(INDEX(OFFSET(INDIRECT(\"'\"&INT((MONTH(A30)-1)/6)+1&IF(INT((MONTH(A30)-1)/6)+1=1,\"ER SEMESTRE \",\"EME SEMESTRE \")&YEAR(A30)&\"'\"&\"!$B$9:$B$43\"),0,MATCH($A30,INDIRECT(\"'\"&INT((MONTH(A30)-1)/6)+1&IF(INT((MONTH(A30)-1)/6)+1=1,\"ER SEMESTRE \",\"EME SEMESTRE \")&YEAR(A30)&\"'\"&\"!$B$7:$HA$7\"),0)-DAY(A30)-2),MIN(IF((OFFSET(INDIRECT(\"'\"&INT((MONTH(A30)-1)/6)+1&IF(INT((MONTH(A30)-1)/6)+1=1,\"ER SEMESTRE \",\"EME SEMESTRE \")&YEAR(A30)&\"'\"&\"!$B$9:$B$43\"),0,MATCH($A30,INDIRECT(\"'\"&INT((MONTH(A30)-1)/6)+1&IF(INT((MONTH(A30)-1)/6)+1=1,\"ER SEMESTRE \",\"EME SEMESTRE \")&YEAR(A30)&\"'\"&\"!$B$7:$HA$7\"),0)-DAY(A30)-1)=\"(\"&$G$9&\")\")*(INDEX(INDIRECT(\"'\"&INT((MONTH(A30)-1)/6)+1&IF(INT((MONTH(A30)-1)/6)+1=1,\"ER SEMESTRE \",\"EME SEMESTRE \")&YEAR(A30)&\"'\"&\"!$B$9:$HA$43\"),0,MATCH($A30,INDIRECT(\"'\"&INT((MONTH(A30)-1)/6)+1&IF(INT((MONTH(A30)-1)/6)+1=1,\"ER SEMESTRE \",\"EME SEMESTRE \")&YEAR(A30)&\"'\"&\"!$B$7:$HA$7\"),0))=\"J\"),ROW(INDIRECT(\"'\"&INT((MONTH(A30)-1)/6)+1&IF(INT((MONTH(A30)-1)/6)+1=1,\"ER SEMESTRE \",\"EME SEMESTRE \")&YEAR(A30)&\"'\"&\"!$D$9:$D$43\"))-8,9^9))),IFERROR(INDEX(OFFSET(INDIRECT(\"'\"&INT((MONTH(A30)-1)/6)+1&IF(INT((MONTH(A30)-1)/6)+1=1,\"ER SEMESTRE \",\"EME SEMESTRE \")&YEAR(A30)&\"'\"&\"!$B$9:$B$43\"),0,MATCH($A30,INDIRECT(\"'\"&INT((MONTH(A30)-1)/6)+1&IF(INT((MONTH(A30)-1)/6)+1=1,\"ER SEMESTRE \",\"EME SEMESTRE \")&YEAR(A30)&\"'\"&\"!$B$7:$HA$7\"),0)-DAY(A30)-2),MIN(IF((OFFSET(INDIRECT(\"'\"&INT((MONTH(A30)-1)/6)+1&IF(INT((MONTH(A30)-1)/6)+1=1,\"ER SEMESTRE \",\"EME SEMESTRE \")&YEAR(A30)&\"'\"&\"!$B$9:$B$43\"),0,MATCH($A30,INDIRECT(\"'\"&INT((MONTH(A30)-1)/6)+1&IF(INT((MONTH(A30)-1)/6)+1=1,\"ER SEMESTRE \",\"EME SEMESTRE \")&YEAR(A30)&\"'\"&\"!$B$7:$HA$7\"),0)-DAY(A30)-1)=\"(\"&$G$9&\")\")*(INDEX(INDIRECT(\"'\"&INT((MONTH(A30)-1)/6)+1&IF(INT((MONTH(A30)-1)/6)+1=1,\"ER SEMESTRE \",\"EME SEMESTRE \")&YEAR(A30)&\"'\"&\"!$B$9:$HA$43\"),0,MATCH($A30,INDIRECT(\"'\"&INT((MONTH(A30)-1)/6)+1&IF(INT((MONTH(A30)-1)/6)+1=1,\"ER SEMESTRE \",\"EME SEMESTRE \")&YEAR(A30)&\"'\"&\"!$B$7:$HA$7\"),0))=\"R\"),ROW(INDIRECT(\"'\"&INT((MONTH(A30)-1)/6)+1&IF(INT((MONTH(A30)-1)/6)+1=1,\"ER SEMESTRE \",\"EME SEMESTRE \")&YEAR(A30)&\"'\"&\"!$D$9:$D$43\"))-8,9^9))),\"\")),\"\")","v":""},null,{"$f":"IF(OR($B30=\"M\",$B30=\"N\",$B30=\"A\"),IF(\nIFERROR(INDEX(OFFSET(INDIRECT(\"'\"&INT((MONTH(A30)-1)/6)+1&IF(INT((MONTH(A30)-1)/6)+1=1,\"ER SEMESTRE \",\"EME SEMESTRE \")&YEAR(A30)&\"'\"&\"!$B$9:$B$43\"),0,MATCH($A30,INDIRECT(\"'\"&INT((MONTH(A30)-1)/6)+1&IF(INT((MONTH(A30)-1)/6)+1=1,\"ER SEMESTRE \",\"EME SEMESTRE \")&YEAR(A30)&\"'\"&\"!$B$7:$HA$7\"),0)-DAY(A30)-2),MIN(IF((OFFSET(INDIRECT(\"'\"&INT((MONTH(A30)-1)/6)+1&IF(INT((MONTH(A30)-1)/6)+1=1,\"ER SEMESTRE \",\"EME SEMESTRE \")&YEAR(A30)&\"'\"&\"!$B$9:$B$43\"),0,MATCH($A30,INDIRECT(\"'\"&INT((MONTH(A30)-1)/6)+1&IF(INT((MONTH(A30)-1)/6)+1=1,\"ER SEMESTRE \",\"EME SEMESTRE \")&YEAR(A30)&\"'\"&\"!$B$7:$HA$7\"),0)-DAY(A30)-1)=\"(\"&$G$9&\")\")*(INDEX(INDIRECT(\"'\"&INT((MONTH(A30)-1)/6)+1&IF(INT((MONTH(A30)-1)/6)+1=1,\"ER SEMESTRE \",\"EME SEMESTRE \")&YEAR(A30)&\"'\"&\"!$B$9:$HA$43\"),0,MATCH($A30,INDIRECT(\"'\"&INT((MONTH(A30)-1)/6)+1&IF(INT((MONTH(A30)-1)/6)+1=1,\"ER SEMESTRE \",\"EME SEMESTRE \")&YEAR(A30)&\"'\"&\"!$B$7:$HA$7\"),0))=\"J\"),ROW(INDIRECT(\"'\"&INT((MONTH(A30)-1)/6)+1&IF(INT((MONTH(A30)-1)/6)+1=1,\"ER SEMESTRE \",\"EME SEMESTRE \")&YEAR(A30)&\"'\"&\"!$D$9:$D$43\"))-8,9^9))),\"\")=\"\",\n\nIFERROR(INDEX(OFFSET(INDIRECT(\"'\"&INT((MONTH(A30)-1)/6)+1&IF(INT((MONTH(A30)-1)/6)+1=1,\"ER SEMESTRE \",\"EME SEMESTRE \")&YEAR(A30)&\"'\"&\"!$B$9:$B$43\"),0,MATCH($A30,INDIRECT(\"'\"&INT((MONTH(A30)-1)/6)+1&IF(INT((MONTH(A30)-1)/6)+1=1,\"ER SEMESTRE \",\"EME SEMESTRE \")&YEAR(A30)&\"'\"&\"!$B$7:$HA$7\"),0)-DAY(A30)-2),SMALL(IF((OFFSET(INDIRECT(\"'\"&INT((MONTH(A30)-1)/6)+1&IF(INT((MONTH(A30)-1)/6)+1=1,\"ER SEMESTRE \",\"EME SEMESTRE \")&YEAR(A30)&\"'\"&\"!$B$9:$B$43\"),0,MATCH($A30,INDIRECT(\"'\"&INT((MONTH(A30)-1)/6)+1&IF(INT((MONTH(A30)-1)/6)+1=1,\"ER SEMESTRE \",\"EME SEMESTRE \")&YEAR(A30)&\"'\"&\"!$B$7:$HA$7\"),0)-DAY(A30)-1)=\"(\"&$G$9&\")\")*(INDEX(INDIRECT(\"'\"&INT((MONTH(A30)-1)/6)+1&IF(INT((MONTH(A30)-1)/6)+1=1,\"ER SEMESTRE \",\"EME SEMESTRE \")&YEAR(A30)&\"'\"&\"!$B$9:$HA$43\"),0,MATCH($A30,INDIRECT(\"'\"&INT((MONTH(A30)-1)/6)+1&IF(INT((MONTH(A30)-1)/6)+1=1,\"ER SEMESTRE \",\"EME SEMESTRE \")&YEAR(A30)&\"'\"&\"!$B$7:$HA$7\"),0))=\"R\"),ROW(INDIRECT(\"'\"&INT((MONTH(A30)-1)/6)+1&IF(INT((MONTH(A30)-1)/6)+1=1,\"ER SEMESTRE \",\"EME SEMESTRE \")&YEAR(A30)&\"'\"&\"!D$9:D$43\"))-8,9^9),2)),\"\"),\n\nIFERROR(\nINDEX(\nOFFSET(INDIRECT(\"'\"&INT((MONTH(A30)-1)/6)+1&IF(INT((MONTH(A30)-1)/6)+1=1,\"ER SEMESTRE \",\"EME SEMESTRE \")&YEAR(A30)&\"'\"&\"!$B$9:$B$43\"),0,MATCH($A30,INDIRECT(\"'\"&INT((MONTH(A30)-1)/6)+1&IF(INT((MONTH(A30)-1)/6)+1=1,\"ER SEMESTRE \",\"EME SEMESTRE \")&YEAR(A30)&\"'\"&\"!$B$7:$HA$7\"),0)-DAY(A30)-2),\n\nMIN(IF(\n(OFFSET(INDIRECT(\"'\"&INT((MONTH(A30)-1)/6)+1&IF(INT((MONTH(A30)-1)/6)+1=1,\"ER SEMESTRE \",\"EME SEMESTRE \")&YEAR(A30)&\"'\"&\"!$B$9:$B$43\"),0,MATCH($A30,INDIRECT(\"'\"&INT((MONTH(A30)-1)/6)+1&IF(INT((MONTH(A30)-1)/6)+1=1,\"ER SEMESTRE \",\"EME SEMESTRE \")&YEAR(A30)&\"'\"&\"!$B$7:$HA$7\"),0)-DAY(A30)-1)=\"(\"&$G$9&\")\")\n*\n(INDEX(INDIRECT(\"'\"&INT((MONTH(A30)-1)/6)+1&IF(INT((MONTH(A30)-1)/6)+1=1,\"ER SEMESTRE \",\"EME SEMESTRE \")&YEAR(A30)&\"'\"&\"!$B$9:$HA$43\"),0,MATCH($A30,INDIRECT(\"'\"&INT((MONTH(A30)-1)/6)+1&IF(INT((MONTH(A30)-1)/6)+1=1,\"ER SEMESTRE \",\"EME SEMESTRE \")&YEAR(A30)&\"'\"&\"!$B$7:$HA$7\"),0))=\"R\"),\n\nROW(INDIRECT(\"'\"&INT((MONTH(A30)-1)/6)+1&IF(INT((MONTH(A30)-1)/6)+1=1,\"ER SEMESTRE \",\"EME SEMESTRE \")&YEAR(A30)&\"'\"&\"!D$9:D$43\"))-8,\n\n9^9))),\"\")),\"\")","v":""},null,{"$f":"IF(OR($B30=\"M\",$B30=\"N\",$B30=\"A\"),IF(\n\nIFERROR(INDEX(OFFSET(INDIRECT(\"'\"&INT((MONTH(A30)-1)/6)+1&IF(INT((MONTH(A30)-1)/6)+1=1,\"ER SEMESTRE \",\"EME SEMESTRE \")&YEAR(A30)&\"'\"&\"!$B$9:$B$43\"),0,MATCH($A30,INDIRECT(\"'\"&INT((MONTH(A30)-1)/6)+1&IF(INT((MONTH(A30)-1)/6)+1=1,\"ER SEMESTRE \",\"EME SEMESTRE \")&YEAR(A30)&\"'\"&\"!$B$7:$HA$7\"),0)-DAY(A30)-2),MIN(IF((OFFSET(INDIRECT(\"'\"&INT((MONTH(A30)-1)/6)+1&IF(INT((MONTH(A30)-1)/6)+1=1,\"ER SEMESTRE \",\"EME SEMESTRE \")&YEAR(A30)&\"'\"&\"!$B$9:$B$43\"),0,MATCH($A30,INDIRECT(\"'\"&INT((MONTH(A30)-1)/6)+1&IF(INT((MONTH(A30)-1)/6)+1=1,\"ER SEMESTRE \",\"EME SEMESTRE \")&YEAR(A30)&\"'\"&\"!$B$7:$HA$7\"),0)-DAY(A30)-1)=\"(\"&$G$9&\")\")*(INDEX(INDIRECT(\"'\"&INT((MONTH(A30)-1)/6)+1&IF(INT((MONTH(A30)-1)/6)+1=1,\"ER SEMESTRE \",\"EME SEMESTRE \")&YEAR(A30)&\"'\"&\"!$B$9:$HA$43\"),0,MATCH($A30,INDIRECT(\"'\"&INT((MONTH(A30)-1)/6)+1&IF(INT((MONTH(A30)-1)/6)+1=1,\"ER SEMESTRE \",\"EME SEMESTRE \")&YEAR(A30)&\"'\"&\"!$B$7:$HA$7\"),0))=\"J\"),ROW(INDIRECT(\"'\"&INT((MONTH(A30)-1)/6)+1&IF(INT((MONTH(A30)-1)/6)+1=1,\"ER SEMESTRE \",\"EME SEMESTRE \")&YEAR(A30)&\"'\"&\"!$D$9:$D$43\"))-8,9^9))),\"\")=\"\",\n\nIFERROR(\nINDEX(OFFSET(INDIRECT(\"'\"&INT((MONTH(A30)-1)/6)+1&IF(INT((MONTH(A30)-1)/6)+1=1,\"ER SEMESTRE \",\"EME SEMESTRE \")&YEAR(A30)&\"'\"&\"!$B$9:$B$43\"),0,MATCH($A30,INDIRECT(\"'\"&INT((MONTH(A30)-1)/6)+1&IF(INT((MONTH(A30)-1)/6)+1=1,\"ER SEMESTRE \",\"EME SEMESTRE \")&YEAR(A30)&\"'\"&\"!$B$7:$HA$7\"),0)-DAY(A30)-2),\nSMALL(IF((OFFSET(INDIRECT(\"'\"&INT((MONTH(A30)-1)/6)+1&IF(INT((MONTH(A30)-1)/6)+1=1,\"ER SEMESTRE \",\"EME SEMESTRE \")&YEAR(A30)&\"'\"&\"!$B$9:$B$43\"),0,MATCH($A30,INDIRECT(\"'\"&INT((MONTH(A30)-1)/6)+1&IF(INT((MONTH(A30)-1)/6)+1=1,\"ER SEMESTRE \",\"EME SEMESTRE \")&YEAR(A30)&\"'\"&\"!$B$7:$HA$7\"),0)-DAY(A30)-1)=\"(\"&$G$9&\")\")*(INDEX(INDIRECT(\"'\"&INT((MONTH(A30)-1)/6)+1&IF(INT((MONTH(A30)-1)/6)+1=1,\"ER SEMESTRE \",\"EME SEMESTRE \")&YEAR(A30)&\"'\"&\"!$B$9:$HA$43\"),0,MATCH($A30,INDIRECT(\"'\"&INT((MONTH(A30)-1)/6)+1&IF(INT((MONTH(A30)-1)/6)+1=1,\"ER SEMESTRE \",\"EME SEMESTRE \")&YEAR(A30)&\"'\"&\"!$B$7:$HA$7\"),0))=\"R\"),ROW(INDIRECT(\"'\"&INT((MONTH(A30)-1)/6)+1&IF(INT((MONTH(A30)-1)/6)+1=1,\"ER SEMESTRE \",\"EME SEMESTRE \")&YEAR(A30)&\"'\"&\"!D$9:D$43\"))-8,9^9),3)),\"\"),\n\n\nIFERROR(\nINDEX(OFFSET(INDIRECT(\"'\"&INT((MONTH(A30)-1)/6)+1&IF(INT((MONTH(A30)-1)/6)+1=1,\"ER SEMESTRE \",\"EME SEMESTRE \")&YEAR(A30)&\"'\"&\"!$B$9:$B$43\"),0,MATCH($A30,INDIRECT(\"'\"&INT((MONTH(A30)-1)/6)+1&IF(INT((MONTH(A30)-1)/6)+1=1,\"ER SEMESTRE \",\"EME SEMESTRE \")&YEAR(A30)&\"'\"&\"!$B$7:$HA$7\"),0)-DAY(A30)-2),\nSMALL(IF((OFFSET(INDIRECT(\"'\"&INT((MONTH(A30)-1)/6)+1&IF(INT((MONTH(A30)-1)/6)+1=1,\"ER SEMESTRE \",\"EME SEMESTRE \")&YEAR(A30)&\"'\"&\"!$B$9:$B$43\"),0,MATCH($A30,INDIRECT(\"'\"&INT((MONTH(A30)-1)/6)+1&IF(INT((MONTH(A30)-1)/6)+1=1,\"ER SEMESTRE \",\"EME SEMESTRE \")&YEAR(A30)&\"'\"&\"!$B$7:$HA$7\"),0)-DAY(A30)-1)=\"(\"&$G$9&\")\")*(INDEX(INDIRECT(\"'\"&INT((MONTH(A30)-1)/6)+1&IF(INT((MONTH(A30)-1)/6)+1=1,\"ER SEMESTRE \",\"EME SEMESTRE \")&YEAR(A30)&\"'\"&\"!$B$9:$HA$43\"),0,MATCH($A30,INDIRECT(\"'\"&INT((MONTH(A30)-1)/6)+1&IF(INT((MONTH(A30)-1)/6)+1=1,\"ER SEMESTRE \",\"EME SEMESTRE \")&YEAR(A30)&\"'\"&\"!$B$7:$HA$7\"),0))=\"R\"),ROW(INDIRECT(\"'\"&INT((MONTH(A30)-1)/6)+1&IF(INT((MONTH(A30)-1)/6)+1=1,\"ER SEMESTRE \",\"EME SEMESTRE \")&YEAR(A30)&\"'\"&\"!D$9:D$43\"))-8,9^9),2)),\"\")\n\n),\n\n\"\")","v":""}]
["",{"$f":"IFERROR(INDEX([3]PLANNING!$D$3:$Y$29,MATCH('[3]F_Dde de remplacement'!$G$8,[3]PLANNING!$B$3:$B$29,0),MATCH('[3]F_Dde de remplacement'!$A31,[3]PLANNING!$D$2:$Y$2,0)),\"\")","v":""},{"$f":"IF(OR($B31=\"M\",$B31=\"N\",$B31=\"A\"),IFERROR(INDEX(OFFSET(INDIRECT(\"'\"&INT((MONTH(A31)-1)/6)+1&IF(INT((MONTH(A31)-1)/6)+1=1,\"ER SEMESTRE \",\"EME SEMESTRE \")&YEAR(A31)&\"'\"&\"!$B$9:$B$43\"),0,MATCH($A31,INDIRECT(\"'\"&INT((MONTH(A31)-1)/6)+1&IF(INT((MONTH(A31)-1)/6)+1=1,\"ER SEMESTRE \",\"EME SEMESTRE \")&YEAR(A31)&\"'\"&\"!$B$7:$HA$7\"),0)-DAY(A31)-2),MIN(IF((OFFSET(INDIRECT(\"'\"&INT((MONTH(A31)-1)/6)+1&IF(INT((MONTH(A31)-1)/6)+1=1,\"ER SEMESTRE \",\"EME SEMESTRE \")&YEAR(A31)&\"'\"&\"!$B$9:$B$43\"),0,MATCH($A31,INDIRECT(\"'\"&INT((MONTH(A31)-1)/6)+1&IF(INT((MONTH(A31)-1)/6)+1=1,\"ER SEMESTRE \",\"EME SEMESTRE \")&YEAR(A31)&\"'\"&\"!$B$7:$HA$7\"),0)-DAY(A31)-1)=\"(\"&$G$9&\")\")*(INDEX(INDIRECT(\"'\"&INT((MONTH(A31)-1)/6)+1&IF(INT((MONTH(A31)-1)/6)+1=1,\"ER SEMESTRE \",\"EME SEMESTRE \")&YEAR(A31)&\"'\"&\"!$B$9:$HA$43\"),0,MATCH($A31,INDIRECT(\"'\"&INT((MONTH(A31)-1)/6)+1&IF(INT((MONTH(A31)-1)/6)+1=1,\"ER SEMESTRE \",\"EME SEMESTRE \")&YEAR(A31)&\"'\"&\"!$B$7:$HA$7\"),0))=\"J\"),ROW(INDIRECT(\"'\"&INT((MONTH(A31)-1)/6)+1&IF(INT((MONTH(A31)-1)/6)+1=1,\"ER SEMESTRE \",\"EME SEMESTRE \")&YEAR(A31)&\"'\"&\"!$D$9:$D$43\"))-8,9^9))),IFERROR(INDEX(OFFSET(INDIRECT(\"'\"&INT((MONTH(A31)-1)/6)+1&IF(INT((MONTH(A31)-1)/6)+1=1,\"ER SEMESTRE \",\"EME SEMESTRE \")&YEAR(A31)&\"'\"&\"!$B$9:$B$43\"),0,MATCH($A31,INDIRECT(\"'\"&INT((MONTH(A31)-1)/6)+1&IF(INT((MONTH(A31)-1)/6)+1=1,\"ER SEMESTRE \",\"EME SEMESTRE \")&YEAR(A31)&\"'\"&\"!$B$7:$HA$7\"),0)-DAY(A31)-2),MIN(IF((OFFSET(INDIRECT(\"'\"&INT((MONTH(A31)-1)/6)+1&IF(INT((MONTH(A31)-1)/6)+1=1,\"ER SEMESTRE \",\"EME SEMESTRE \")&YEAR(A31)&\"'\"&\"!$B$9:$B$43\"),0,MATCH($A31,INDIRECT(\"'\"&INT((MONTH(A31)-1)/6)+1&IF(INT((MONTH(A31)-1)/6)+1=1,\"ER SEMESTRE \",\"EME SEMESTRE \")&YEAR(A31)&\"'\"&\"!$B$7:$HA$7\"),0)-DAY(A31)-1)=\"(\"&$G$9&\")\")*(INDEX(INDIRECT(\"'\"&INT((MONTH(A31)-1)/6)+1&IF(INT((MONTH(A31)-1)/6)+1=1,\"ER SEMESTRE \",\"EME SEMESTRE \")&YEAR(A31)&\"'\"&\"!$B$9:$HA$43\"),0,MATCH($A31,INDIRECT(\"'\"&INT((MONTH(A31)-1)/6)+1&IF(INT((MONTH(A31)-1)/6)+1=1,\"ER SEMESTRE \",\"EME SEMESTRE \")&YEAR(A31)&\"'\"&\"!$B$7:$HA$7\"),0))=\"R\"),ROW(INDIRECT(\"'\"&INT((MONTH(A31)-1)/6)+1&IF(INT((MONTH(A31)-1)/6)+1=1,\"ER SEMESTRE \",\"EME SEMESTRE \")&YEAR(A31)&\"'\"&\"!$D$9:$D$43\"))-8,9^9))),\"\")),\"\")","v":""},null,{"$f":"IF(OR($B31=\"M\",$B31=\"N\",$B31=\"A\"),IF(\nIFERROR(INDEX(OFFSET(INDIRECT(\"'\"&INT((MONTH(A31)-1)/6)+1&IF(INT((MONTH(A31)-1)/6)+1=1,\"ER SEMESTRE \",\"EME SEMESTRE \")&YEAR(A31)&\"'\"&\"!$B$9:$B$43\"),0,MATCH($A31,INDIRECT(\"'\"&INT((MONTH(A31)-1)/6)+1&IF(INT((MONTH(A31)-1)/6)+1=1,\"ER SEMESTRE \",\"EME SEMESTRE \")&YEAR(A31)&\"'\"&\"!$B$7:$HA$7\"),0)-DAY(A31)-2),MIN(IF((OFFSET(INDIRECT(\"'\"&INT((MONTH(A31)-1)/6)+1&IF(INT((MONTH(A31)-1)/6)+1=1,\"ER SEMESTRE \",\"EME SEMESTRE \")&YEAR(A31)&\"'\"&\"!$B$9:$B$43\"),0,MATCH($A31,INDIRECT(\"'\"&INT((MONTH(A31)-1)/6)+1&IF(INT((MONTH(A31)-1)/6)+1=1,\"ER SEMESTRE \",\"EME SEMESTRE \")&YEAR(A31)&\"'\"&\"!$B$7:$HA$7\"),0)-DAY(A31)-1)=\"(\"&$G$9&\")\")*(INDEX(INDIRECT(\"'\"&INT((MONTH(A31)-1)/6)+1&IF(INT((MONTH(A31)-1)/6)+1=1,\"ER SEMESTRE \",\"EME SEMESTRE \")&YEAR(A31)&\"'\"&\"!$B$9:$HA$43\"),0,MATCH($A31,INDIRECT(\"'\"&INT((MONTH(A31)-1)/6)+1&IF(INT((MONTH(A31)-1)/6)+1=1,\"ER SEMESTRE \",\"EME SEMESTRE \")&YEAR(A31)&\"'\"&\"!$B$7:$HA$7\"),0))=\"J\"),ROW(INDIRECT(\"'\"&INT((MONTH(A31)-1)/6)+1&IF(INT((MONTH(A31)-1)/6)+1=1,\"ER SEMESTRE \",\"EME SEMESTRE \")&YEAR(A31)&\"'\"&\"!$D$9:$D$43\"))-8,9^9))),\"\")=\"\",\n\nIFERROR(INDEX(OFFSET(INDIRECT(\"'\"&INT((MONTH(A31)-1)/6)+1&IF(INT((MONTH(A31)-1)/6)+1=1,\"ER SEMESTRE \",\"EME SEMESTRE \")&YEAR(A31)&\"'\"&\"!$B$9:$B$43\"),0,MATCH($A31,INDIRECT(\"'\"&INT((MONTH(A31)-1)/6)+1&IF(INT((MONTH(A31)-1)/6)+1=1,\"ER SEMESTRE \",\"EME SEMESTRE \")&YEAR(A31)&\"'\"&\"!$B$7:$HA$7\"),0)-DAY(A31)-2),SMALL(IF((OFFSET(INDIRECT(\"'\"&INT((MONTH(A31)-1)/6)+1&IF(INT((MONTH(A31)-1)/6)+1=1,\"ER SEMESTRE \",\"EME SEMESTRE \")&YEAR(A31)&\"'\"&\"!$B$9:$B$43\"),0,MATCH($A31,INDIRECT(\"'\"&INT((MONTH(A31)-1)/6)+1&IF(INT((MONTH(A31)-1)/6)+1=1,\"ER SEMESTRE \",\"EME SEMESTRE \")&YEAR(A31)&\"'\"&\"!$B$7:$HA$7\"),0)-DAY(A31)-1)=\"(\"&$G$9&\")\")*(INDEX(INDIRECT(\"'\"&INT((MONTH(A31)-1)/6)+1&IF(INT((MONTH(A31)-1)/6)+1=1,\"ER SEMESTRE \",\"EME SEMESTRE \")&YEAR(A31)&\"'\"&\"!$B$9:$HA$43\"),0,MATCH($A31,INDIRECT(\"'\"&INT((MONTH(A31)-1)/6)+1&IF(INT((MONTH(A31)-1)/6)+1=1,\"ER SEMESTRE \",\"EME SEMESTRE \")&YEAR(A31)&\"'\"&\"!$B$7:$HA$7\"),0))=\"R\"),ROW(INDIRECT(\"'\"&INT((MONTH(A31)-1)/6)+1&IF(INT((MONTH(A31)-1)/6)+1=1,\"ER SEMESTRE \",\"EME SEMESTRE \")&YEAR(A31)&\"'\"&\"!D$9:D$43\"))-8,9^9),2)),\"\"),\n\nIFERROR(\nINDEX(\nOFFSET(INDIRECT(\"'\"&INT((MONTH(A31)-1)/6)+1&IF(INT((MONTH(A31)-1)/6)+1=1,\"ER SEMESTRE \",\"EME SEMESTRE \")&YEAR(A31)&\"'\"&\"!$B$9:$B$43\"),0,MATCH($A31,INDIRECT(\"'\"&INT((MONTH(A31)-1)/6)+1&IF(INT((MONTH(A31)-1)/6)+1=1,\"ER SEMESTRE \",\"EME SEMESTRE \")&YEAR(A31)&\"'\"&\"!$B$7:$HA$7\"),0)-DAY(A31)-2),\n\nMIN(IF(\n(OFFSET(INDIRECT(\"'\"&INT((MONTH(A31)-1)/6)+1&IF(INT((MONTH(A31)-1)/6)+1=1,\"ER SEMESTRE \",\"EME SEMESTRE \")&YEAR(A31)&\"'\"&\"!$B$9:$B$43\"),0,MATCH($A31,INDIRECT(\"'\"&INT((MONTH(A31)-1)/6)+1&IF(INT((MONTH(A31)-1)/6)+1=1,\"ER SEMESTRE \",\"EME SEMESTRE \")&YEAR(A31)&\"'\"&\"!$B$7:$HA$7\"),0)-DAY(A31)-1)=\"(\"&$G$9&\")\")\n*\n(INDEX(INDIRECT(\"'\"&INT((MONTH(A31)-1)/6)+1&IF(INT((MONTH(A31)-1)/6)+1=1,\"ER SEMESTRE \",\"EME SEMESTRE \")&YEAR(A31)&\"'\"&\"!$B$9:$HA$43\"),0,MATCH($A31,INDIRECT(\"'\"&INT((MONTH(A31)-1)/6)+1&IF(INT((MONTH(A31)-1)/6)+1=1,\"ER SEMESTRE \",\"EME SEMESTRE \")&YEAR(A31)&\"'\"&\"!$B$7:$HA$7\"),0))=\"R\"),\n\nROW(INDIRECT(\"'\"&INT((MONTH(A31)-1)/6)+1&IF(INT((MONTH(A31)-1)/6)+1=1,\"ER SEMESTRE \",\"EME SEMESTRE \")&YEAR(A31)&\"'\"&\"!D$9:D$43\"))-8,\n\n9^9))),\"\")),\"\")","v":""},null,{"$f":"IF(OR($B31=\"M\",$B31=\"N\",$B31=\"A\"),IF(\n\nIFERROR(INDEX(OFFSET(INDIRECT(\"'\"&INT((MONTH(A31)-1)/6)+1&IF(INT((MONTH(A31)-1)/6)+1=1,\"ER SEMESTRE \",\"EME SEMESTRE \")&YEAR(A31)&\"'\"&\"!$B$9:$B$43\"),0,MATCH($A31,INDIRECT(\"'\"&INT((MONTH(A31)-1)/6)+1&IF(INT((MONTH(A31)-1)/6)+1=1,\"ER SEMESTRE \",\"EME SEMESTRE \")&YEAR(A31)&\"'\"&\"!$B$7:$HA$7\"),0)-DAY(A31)-2),MIN(IF((OFFSET(INDIRECT(\"'\"&INT((MONTH(A31)-1)/6)+1&IF(INT((MONTH(A31)-1)/6)+1=1,\"ER SEMESTRE \",\"EME SEMESTRE \")&YEAR(A31)&\"'\"&\"!$B$9:$B$43\"),0,MATCH($A31,INDIRECT(\"'\"&INT((MONTH(A31)-1)/6)+1&IF(INT((MONTH(A31)-1)/6)+1=1,\"ER SEMESTRE \",\"EME SEMESTRE \")&YEAR(A31)&\"'\"&\"!$B$7:$HA$7\"),0)-DAY(A31)-1)=\"(\"&$G$9&\")\")*(INDEX(INDIRECT(\"'\"&INT((MONTH(A31)-1)/6)+1&IF(INT((MONTH(A31)-1)/6)+1=1,\"ER SEMESTRE \",\"EME SEMESTRE \")&YEAR(A31)&\"'\"&\"!$B$9:$HA$43\"),0,MATCH($A31,INDIRECT(\"'\"&INT((MONTH(A31)-1)/6)+1&IF(INT((MONTH(A31)-1)/6)+1=1,\"ER SEMESTRE \",\"EME SEMESTRE \")&YEAR(A31)&\"'\"&\"!$B$7:$HA$7\"),0))=\"J\"),ROW(INDIRECT(\"'\"&INT((MONTH(A31)-1)/6)+1&IF(INT((MONTH(A31)-1)/6)+1=1,\"ER SEMESTRE \",\"EME SEMESTRE \")&YEAR(A31)&\"'\"&\"!$D$9:$D$43\"))-8,9^9))),\"\")=\"\",\n\nIFERROR(\nINDEX(OFFSET(INDIRECT(\"'\"&INT((MONTH(A31)-1)/6)+1&IF(INT((MONTH(A31)-1)/6)+1=1,\"ER SEMESTRE \",\"EME SEMESTRE \")&YEAR(A31)&\"'\"&\"!$B$9:$B$43\"),0,MATCH($A31,INDIRECT(\"'\"&INT((MONTH(A31)-1)/6)+1&IF(INT((MONTH(A31)-1)/6)+1=1,\"ER SEMESTRE \",\"EME SEMESTRE \")&YEAR(A31)&\"'\"&\"!$B$7:$HA$7\"),0)-DAY(A31)-2),\nSMALL(IF((OFFSET(INDIRECT(\"'\"&INT((MONTH(A31)-1)/6)+1&IF(INT((MONTH(A31)-1)/6)+1=1,\"ER SEMESTRE \",\"EME SEMESTRE \")&YEAR(A31)&\"'\"&\"!$B$9:$B$43\"),0,MATCH($A31,INDIRECT(\"'\"&INT((MONTH(A31)-1)/6)+1&IF(INT((MONTH(A31)-1)/6)+1=1,\"ER SEMESTRE \",\"EME SEMESTRE \")&YEAR(A31)&\"'\"&\"!$B$7:$HA$7\"),0)-DAY(A31)-1)=\"(\"&$G$9&\")\")*(INDEX(INDIRECT(\"'\"&INT((MONTH(A31)-1)/6)+1&IF(INT((MONTH(A31)-1)/6)+1=1,\"ER SEMESTRE \",\"EME SEMESTRE \")&YEAR(A31)&\"'\"&\"!$B$9:$HA$43\"),0,MATCH($A31,INDIRECT(\"'\"&INT((MONTH(A31)-1)/6)+1&IF(INT((MONTH(A31)-1)/6)+1=1,\"ER SEMESTRE \",\"EME SEMESTRE \")&YEAR(A31)&\"'\"&\"!$B$7:$HA$7\"),0))=\"R\"),ROW(INDIRECT(\"'\"&INT((MONTH(A31)-1)/6)+1&IF(INT((MONTH(A31)-1)/6)+1=1,\"ER SEMESTRE \",\"EME SEMESTRE \")&YEAR(A31)&\"'\"&\"!D$9:D$43\"))-8,9^9),3)),\"\"),\n\n\nIFERROR(\nINDEX(OFFSET(INDIRECT(\"'\"&INT((MONTH(A31)-1)/6)+1&IF(INT((MONTH(A31)-1)/6)+1=1,\"ER SEMESTRE \",\"EME SEMESTRE \")&YEAR(A31)&\"'\"&\"!$B$9:$B$43\"),0,MATCH($A31,INDIRECT(\"'\"&INT((MONTH(A31)-1)/6)+1&IF(INT((MONTH(A31)-1)/6)+1=1,\"ER SEMESTRE \",\"EME SEMESTRE \")&YEAR(A31)&\"'\"&\"!$B$7:$HA$7\"),0)-DAY(A31)-2),\nSMALL(IF((OFFSET(INDIRECT(\"'\"&INT((MONTH(A31)-1)/6)+1&IF(INT((MONTH(A31)-1)/6)+1=1,\"ER SEMESTRE \",\"EME SEMESTRE \")&YEAR(A31)&\"'\"&\"!$B$9:$B$43\"),0,MATCH($A31,INDIRECT(\"'\"&INT((MONTH(A31)-1)/6)+1&IF(INT((MONTH(A31)-1)/6)+1=1,\"ER SEMESTRE \",\"EME SEMESTRE \")&YEAR(A31)&\"'\"&\"!$B$7:$HA$7\"),0)-DAY(A31)-1)=\"(\"&$G$9&\")\")*(INDEX(INDIRECT(\"'\"&INT((MONTH(A31)-1)/6)+1&IF(INT((MONTH(A31)-1)/6)+1=1,\"ER SEMESTRE \",\"EME SEMESTRE \")&YEAR(A31)&\"'\"&\"!$B$9:$HA$43\"),0,MATCH($A31,INDIRECT(\"'\"&INT((MONTH(A31)-1)/6)+1&IF(INT((MONTH(A31)-1)/6)+1=1,\"ER SEMESTRE \",\"EME SEMESTRE \")&YEAR(A31)&\"'\"&\"!$B$7:$HA$7\"),0))=\"R\"),ROW(INDIRECT(\"'\"&INT((MONTH(A31)-1)/6)+1&IF(INT((MONTH(A31)-1)/6)+1=1,\"ER SEMESTRE \",\"EME SEMESTRE \")&YEAR(A31)&\"'\"&\"!D$9:D$43\"))-8,9^9),2)),\"\")\n\n),\n\n\"\")","v":""}]
["",{"$f":"IFERROR(INDEX([3]PLANNING!$D$3:$Y$29,MATCH('[3]F_Dde de remplacement'!$G$8,[3]PLANNING!$B$3:$B$29,0),MATCH('[3]F_Dde de remplacement'!$A32,[3]PLANNING!$D$2:$Y$2,0)),\"\")","v":""},{"$f":"IF(OR($B32=\"M\",$B32=\"N\",$B32=\"A\"),IFERROR(INDEX(OFFSET(INDIRECT(\"'\"&INT((MONTH(A32)-1)/6)+1&IF(INT((MONTH(A32)-1)/6)+1=1,\"ER SEMESTRE \",\"EME SEMESTRE \")&YEAR(A32)&\"'\"&\"!$B$9:$B$43\"),0,MATCH($A32,INDIRECT(\"'\"&INT((MONTH(A32)-1)/6)+1&IF(INT((MONTH(A32)-1)/6)+1=1,\"ER SEMESTRE \",\"EME SEMESTRE \")&YEAR(A32)&\"'\"&\"!$B$7:$HA$7\"),0)-DAY(A32)-2),MIN(IF((OFFSET(INDIRECT(\"'\"&INT((MONTH(A32)-1)/6)+1&IF(INT((MONTH(A32)-1)/6)+1=1,\"ER SEMESTRE \",\"EME SEMESTRE \")&YEAR(A32)&\"'\"&\"!$B$9:$B$43\"),0,MATCH($A32,INDIRECT(\"'\"&INT((MONTH(A32)-1)/6)+1&IF(INT((MONTH(A32)-1)/6)+1=1,\"ER SEMESTRE \",\"EME SEMESTRE \")&YEAR(A32)&\"'\"&\"!$B$7:$HA$7\"),0)-DAY(A32)-1)=\"(\"&$G$9&\")\")*(INDEX(INDIRECT(\"'\"&INT((MONTH(A32)-1)/6)+1&IF(INT((MONTH(A32)-1)/6)+1=1,\"ER SEMESTRE \",\"EME SEMESTRE \")&YEAR(A32)&\"'\"&\"!$B$9:$HA$43\"),0,MATCH($A32,INDIRECT(\"'\"&INT((MONTH(A32)-1)/6)+1&IF(INT((MONTH(A32)-1)/6)+1=1,\"ER SEMESTRE \",\"EME SEMESTRE \")&YEAR(A32)&\"'\"&\"!$B$7:$HA$7\"),0))=\"J\"),ROW(INDIRECT(\"'\"&INT((MONTH(A32)-1)/6)+1&IF(INT((MONTH(A32)-1)/6)+1=1,\"ER SEMESTRE \",\"EME SEMESTRE \")&YEAR(A32)&\"'\"&\"!$D$9:$D$43\"))-8,9^9))),IFERROR(INDEX(OFFSET(INDIRECT(\"'\"&INT((MONTH(A32)-1)/6)+1&IF(INT((MONTH(A32)-1)/6)+1=1,\"ER SEMESTRE \",\"EME SEMESTRE \")&YEAR(A32)&\"'\"&\"!$B$9:$B$43\"),0,MATCH($A32,INDIRECT(\"'\"&INT((MONTH(A32)-1)/6)+1&IF(INT((MONTH(A32)-1)/6)+1=1,\"ER SEMESTRE \",\"EME SEMESTRE \")&YEAR(A32)&\"'\"&\"!$B$7:$HA$7\"),0)-DAY(A32)-2),MIN(IF((OFFSET(INDIRECT(\"'\"&INT((MONTH(A32)-1)/6)+1&IF(INT((MONTH(A32)-1)/6)+1=1,\"ER SEMESTRE \",\"EME SEMESTRE \")&YEAR(A32)&\"'\"&\"!$B$9:$B$43\"),0,MATCH($A32,INDIRECT(\"'\"&INT((MONTH(A32)-1)/6)+1&IF(INT((MONTH(A32)-1)/6)+1=1,\"ER SEMESTRE \",\"EME SEMESTRE \")&YEAR(A32)&\"'\"&\"!$B$7:$HA$7\"),0)-DAY(A32)-1)=\"(\"&$G$9&\")\")*(INDEX(INDIRECT(\"'\"&INT((MONTH(A32)-1)/6)+1&IF(INT((MONTH(A32)-1)/6)+1=1,\"ER SEMESTRE \",\"EME SEMESTRE \")&YEAR(A32)&\"'\"&\"!$B$9:$HA$43\"),0,MATCH($A32,INDIRECT(\"'\"&INT((MONTH(A32)-1)/6)+1&IF(INT((MONTH(A32)-1)/6)+1=1,\"ER SEMESTRE \",\"EME SEMESTRE \")&YEAR(A32)&\"'\"&\"!$B$7:$HA$7\"),0))=\"R\"),ROW(INDIRECT(\"'\"&INT((MONTH(A32)-1)/6)+1&IF(INT((MONTH(A32)-1)/6)+1=1,\"ER SEMESTRE \",\"EME SEMESTRE \")&YEAR(A32)&\"'\"&\"!$D$9:$D$43\"))-8,9^9))),\"\")),\"\")","v":""},null,{"$f":"IF(OR($B32=\"M\",$B32=\"N\",$B32=\"A\"),IF(\nIFERROR(INDEX(OFFSET(INDIRECT(\"'\"&INT((MONTH(A32)-1)/6)+1&IF(INT((MONTH(A32)-1)/6)+1=1,\"ER SEMESTRE \",\"EME SEMESTRE \")&YEAR(A32)&\"'\"&\"!$B$9:$B$43\"),0,MATCH($A32,INDIRECT(\"'\"&INT((MONTH(A32)-1)/6)+1&IF(INT((MONTH(A32)-1)/6)+1=1,\"ER SEMESTRE \",\"EME SEMESTRE \")&YEAR(A32)&\"'\"&\"!$B$7:$HA$7\"),0)-DAY(A32)-2),MIN(IF((OFFSET(INDIRECT(\"'\"&INT((MONTH(A32)-1)/6)+1&IF(INT((MONTH(A32)-1)/6)+1=1,\"ER SEMESTRE \",\"EME SEMESTRE \")&YEAR(A32)&\"'\"&\"!$B$9:$B$43\"),0,MATCH($A32,INDIRECT(\"'\"&INT((MONTH(A32)-1)/6)+1&IF(INT((MONTH(A32)-1)/6)+1=1,\"ER SEMESTRE \",\"EME SEMESTRE \")&YEAR(A32)&\"'\"&\"!$B$7:$HA$7\"),0)-DAY(A32)-1)=\"(\"&$G$9&\")\")*(INDEX(INDIRECT(\"'\"&INT((MONTH(A32)-1)/6)+1&IF(INT((MONTH(A32)-1)/6)+1=1,\"ER SEMESTRE \",\"EME SEMESTRE \")&YEAR(A32)&\"'\"&\"!$B$9:$HA$43\"),0,MATCH($A32,INDIRECT(\"'\"&INT((MONTH(A32)-1)/6)+1&IF(INT((MONTH(A32)-1)/6)+1=1,\"ER SEMESTRE \",\"EME SEMESTRE \")&YEAR(A32)&\"'\"&\"!$B$7:$HA$7\"),0))=\"J\"),ROW(INDIRECT(\"'\"&INT((MONTH(A32)-1)/6)+1&IF(INT((MONTH(A32)-1)/6)+1=1,\"ER SEMESTRE \",\"EME SEMESTRE \")&YEAR(A32)&\"'\"&\"!$D$9:$D$43\"))-8,9^9))),\"\")=\"\",\n\nIFERROR(INDEX(OFFSET(INDIRECT(\"'\"&INT((MONTH(A32)-1)/6)+1&IF(INT((MONTH(A32)-1)/6)+1=1,\"ER SEMESTRE \",\"EME SEMESTRE \")&YEAR(A32)&\"'\"&\"!$B$9:$B$43\"),0,MATCH($A32,INDIRECT(\"'\"&INT((MONTH(A32)-1)/6)+1&IF(INT((MONTH(A32)-1)/6)+1=1,\"ER SEMESTRE \",\"EME SEMESTRE \")&YEAR(A32)&\"'\"&\"!$B$7:$HA$7\"),0)-DAY(A32)-2),SMALL(IF((OFFSET(INDIRECT(\"'\"&INT((MONTH(A32)-1)/6)+1&IF(INT((MONTH(A32)-1)/6)+1=1,\"ER SEMESTRE \",\"EME SEMESTRE \")&YEAR(A32)&\"'\"&\"!$B$9:$B$43\"),0,MATCH($A32,INDIRECT(\"'\"&INT((MONTH(A32)-1)/6)+1&IF(INT((MONTH(A32)-1)/6)+1=1,\"ER SEMESTRE \",\"EME SEMESTRE \")&YEAR(A32)&\"'\"&\"!$B$7:$HA$7\"),0)-DAY(A32)-1)=\"(\"&$G$9&\")\")*(INDEX(INDIRECT(\"'\"&INT((MONTH(A32)-1)/6)+1&IF(INT((MONTH(A32)-1)/6)+1=1,\"ER SEMESTRE \",\"EME SEMESTRE \")&YEAR(A32)&\"'\"&\"!$B$9:$HA$43\"),0,MATCH($A32,INDIRECT(\"'\"&INT((MONTH(A32)-1)/6)+1&IF(INT((MONTH(A32)-1)/6)+1=1,\"ER SEMESTRE \",\"EME SEMESTRE \")&YEAR(A32)&\"'\"&\"!$B$7:$HA$7\"),0))=\"R\"),ROW(INDIRECT(\"'\"&INT((MONTH(A32)-1)/6)+1&IF(INT((MONTH(A32)-1)/6)+1=1,\"ER SEMESTRE \",\"EME SEMESTRE \")&YEAR(A32)&\"'\"&\"!D$9:D$43\"))-8,9^9),2)),\"\"),\n\nIFERROR(\nINDEX(\nOFFSET(INDIRECT(\"'\"&INT((MONTH(A32)-1)/6)+1&IF(INT((MONTH(A32)-1)/6)+1=1,\"ER SEMESTRE \",\"EME SEMESTRE \")&YEAR(A32)&\"'\"&\"!$B$9:$B$43\"),0,MATCH($A32,INDIRECT(\"'\"&INT((MONTH(A32)-1)/6)+1&IF(INT((MONTH(A32)-1)/6)+1=1,\"ER SEMESTRE \",\"EME SEMESTRE \")&YEAR(A32)&\"'\"&\"!$B$7:$HA$7\"),0)-DAY(A32)-2),\n\nMIN(IF(\n(OFFSET(INDIRECT(\"'\"&INT((MONTH(A32)-1)/6)+1&IF(INT((MONTH(A32)-1)/6)+1=1,\"ER SEMESTRE \",\"EME SEMESTRE \")&YEAR(A32)&\"'\"&\"!$B$9:$B$43\"),0,MATCH($A32,INDIRECT(\"'\"&INT((MONTH(A32)-1)/6)+1&IF(INT((MONTH(A32)-1)/6)+1=1,\"ER SEMESTRE \",\"EME SEMESTRE \")&YEAR(A32)&\"'\"&\"!$B$7:$HA$7\"),0)-DAY(A32)-1)=\"(\"&$G$9&\")\")\n*\n(INDEX(INDIRECT(\"'\"&INT((MONTH(A32)-1)/6)+1&IF(INT((MONTH(A32)-1)/6)+1=1,\"ER SEMESTRE \",\"EME SEMESTRE \")&YEAR(A32)&\"'\"&\"!$B$9:$HA$43\"),0,MATCH($A32,INDIRECT(\"'\"&INT((MONTH(A32)-1)/6)+1&IF(INT((MONTH(A32)-1)/6)+1=1,\"ER SEMESTRE \",\"EME SEMESTRE \")&YEAR(A32)&\"'\"&\"!$B$7:$HA$7\"),0))=\"R\"),\n\nROW(INDIRECT(\"'\"&INT((MONTH(A32)-1)/6)+1&IF(INT((MONTH(A32)-1)/6)+1=1,\"ER SEMESTRE \",\"EME SEMESTRE \")&YEAR(A32)&\"'\"&\"!D$9:D$43\"))-8,\n\n9^9))),\"\")),\"\")","v":""},null,{"$f":"IF(OR($B32=\"M\",$B32=\"N\",$B32=\"A\"),IF(\n\nIFERROR(INDEX(OFFSET(INDIRECT(\"'\"&INT((MONTH(A32)-1)/6)+1&IF(INT((MONTH(A32)-1)/6)+1=1,\"ER SEMESTRE \",\"EME SEMESTRE \")&YEAR(A32)&\"'\"&\"!$B$9:$B$43\"),0,MATCH($A32,INDIRECT(\"'\"&INT((MONTH(A32)-1)/6)+1&IF(INT((MONTH(A32)-1)/6)+1=1,\"ER SEMESTRE \",\"EME SEMESTRE \")&YEAR(A32)&\"'\"&\"!$B$7:$HA$7\"),0)-DAY(A32)-2),MIN(IF((OFFSET(INDIRECT(\"'\"&INT((MONTH(A32)-1)/6)+1&IF(INT((MONTH(A32)-1)/6)+1=1,\"ER SEMESTRE \",\"EME SEMESTRE \")&YEAR(A32)&\"'\"&\"!$B$9:$B$43\"),0,MATCH($A32,INDIRECT(\"'\"&INT((MONTH(A32)-1)/6)+1&IF(INT((MONTH(A32)-1)/6)+1=1,\"ER SEMESTRE \",\"EME SEMESTRE \")&YEAR(A32)&\"'\"&\"!$B$7:$HA$7\"),0)-DAY(A32)-1)=\"(\"&$G$9&\")\")*(INDEX(INDIRECT(\"'\"&INT((MONTH(A32)-1)/6)+1&IF(INT((MONTH(A32)-1)/6)+1=1,\"ER SEMESTRE \",\"EME SEMESTRE \")&YEAR(A32)&\"'\"&\"!$B$9:$HA$43\"),0,MATCH($A32,INDIRECT(\"'\"&INT((MONTH(A32)-1)/6)+1&IF(INT((MONTH(A32)-1)/6)+1=1,\"ER SEMESTRE \",\"EME SEMESTRE \")&YEAR(A32)&\"'\"&\"!$B$7:$HA$7\"),0))=\"J\"),ROW(INDIRECT(\"'\"&INT((MONTH(A32)-1)/6)+1&IF(INT((MONTH(A32)-1)/6)+1=1,\"ER SEMESTRE \",\"EME SEMESTRE \")&YEAR(A32)&\"'\"&\"!$D$9:$D$43\"))-8,9^9))),\"\")=\"\",\n\nIFERROR(\nINDEX(OFFSET(INDIRECT(\"'\"&INT((MONTH(A32)-1)/6)+1&IF(INT((MONTH(A32)-1)/6)+1=1,\"ER SEMESTRE \",\"EME SEMESTRE \")&YEAR(A32)&\"'\"&\"!$B$9:$B$43\"),0,MATCH($A32,INDIRECT(\"'\"&INT((MONTH(A32)-1)/6)+1&IF(INT((MONTH(A32)-1)/6)+1=1,\"ER SEMESTRE \",\"EME SEMESTRE \")&YEAR(A32)&\"'\"&\"!$B$7:$HA$7\"),0)-DAY(A32)-2),\nSMALL(IF((OFFSET(INDIRECT(\"'\"&INT((MONTH(A32)-1)/6)+1&IF(INT((MONTH(A32)-1)/6)+1=1,\"ER SEMESTRE \",\"EME SEMESTRE \")&YEAR(A32)&\"'\"&\"!$B$9:$B$43\"),0,MATCH($A32,INDIRECT(\"'\"&INT((MONTH(A32)-1)/6)+1&IF(INT((MONTH(A32)-1)/6)+1=1,\"ER SEMESTRE \",\"EME SEMESTRE \")&YEAR(A32)&\"'\"&\"!$B$7:$HA$7\"),0)-DAY(A32)-1)=\"(\"&$G$9&\")\")*(INDEX(INDIRECT(\"'\"&INT((MONTH(A32)-1)/6)+1&IF(INT((MONTH(A32)-1)/6)+1=1,\"ER SEMESTRE \",\"EME SEMESTRE \")&YEAR(A32)&\"'\"&\"!$B$9:$HA$43\"),0,MATCH($A32,INDIRECT(\"'\"&INT((MONTH(A32)-1)/6)+1&IF(INT((MONTH(A32)-1)/6)+1=1,\"ER SEMESTRE \",\"EME SEMESTRE \")&YEAR(A32)&\"'\"&\"!$B$7:$HA$7\"),0))=\"R\"),ROW(INDIRECT(\"'\"&INT((MONTH(A32)-1)/6)+1&IF(INT((MONTH(A32)-1)/6)+1=1,\"ER SEMESTRE \",\"EME SEMESTRE \")&YEAR(A32)&\"'\"&\"!D$9:D$43\"))-8,9^9),3)),\"\"),\n\n\nIFERROR(\nINDEX(OFFSET(INDIRECT(\"'\"&INT((MONTH(A32)-1)/6)+1&IF(INT((MONTH(A32)-1)/6)+1=1,\"ER SEMESTRE \",\"EME SEMESTRE \")&YEAR(A32)&\"'\"&\"!$B$9:$B$43\"),0,MATCH($A32,INDIRECT(\"'\"&INT((MONTH(A32)-1)/6)+1&IF(INT((MONTH(A32)-1)/6)+1=1,\"ER SEMESTRE \",\"EME SEMESTRE \")&YEAR(A32)&\"'\"&\"!$B$7:$HA$7\"),0)-DAY(A32)-2),\nSMALL(IF((OFFSET(INDIRECT(\"'\"&INT((MONTH(A32)-1)/6)+1&IF(INT((MONTH(A32)-1)/6)+1=1,\"ER SEMESTRE \",\"EME SEMESTRE \")&YEAR(A32)&\"'\"&\"!$B$9:$B$43\"),0,MATCH($A32,INDIRECT(\"'\"&INT((MONTH(A32)-1)/6)+1&IF(INT((MONTH(A32)-1)/6)+1=1,\"ER SEMESTRE \",\"EME SEMESTRE \")&YEAR(A32)&\"'\"&\"!$B$7:$HA$7\"),0)-DAY(A32)-1)=\"(\"&$G$9&\")\")*(INDEX(INDIRECT(\"'\"&INT((MONTH(A32)-1)/6)+1&IF(INT((MONTH(A32)-1)/6)+1=1,\"ER SEMESTRE \",\"EME SEMESTRE \")&YEAR(A32)&\"'\"&\"!$B$9:$HA$43\"),0,MATCH($A32,INDIRECT(\"'\"&INT((MONTH(A32)-1)/6)+1&IF(INT((MONTH(A32)-1)/6)+1=1,\"ER SEMESTRE \",\"EME SEMESTRE \")&YEAR(A32)&\"'\"&\"!$B$7:$HA$7\"),0))=\"R\"),ROW(INDIRECT(\"'\"&INT((MONTH(A32)-1)/6)+1&IF(INT((MONTH(A32)-1)/6)+1=1,\"ER SEMESTRE \",\"EME SEMESTRE \")&YEAR(A32)&\"'\"&\"!D$9:D$43\"))-8,9^9),2)),\"\")\n\n),\n\n\"\")","v":""}]
["",{"$f":"IFERROR(INDEX([3]PLANNING!$D$3:$Y$29,MATCH('[3]F_Dde de remplacement'!$G$8,[3]PLANNING!$B$3:$B$29,0),MATCH('[3]F_Dde de remplacement'!$A33,[3]PLANNING!$D$2:$Y$2,0)),\"\")","v":""},{"$f":"IF(OR($B33=\"M\",$B33=\"N\",$B33=\"A\"),IFERROR(INDEX(OFFSET(INDIRECT(\"'\"&INT((MONTH(A33)-1)/6)+1&IF(INT((MONTH(A33)-1)/6)+1=1,\"ER SEMESTRE \",\"EME SEMESTRE \")&YEAR(A33)&\"'\"&\"!$B$9:$B$43\"),0,MATCH($A33,INDIRECT(\"'\"&INT((MONTH(A33)-1)/6)+1&IF(INT((MONTH(A33)-1)/6)+1=1,\"ER SEMESTRE \",\"EME SEMESTRE \")&YEAR(A33)&\"'\"&\"!$B$7:$HA$7\"),0)-DAY(A33)-2),MIN(IF((OFFSET(INDIRECT(\"'\"&INT((MONTH(A33)-1)/6)+1&IF(INT((MONTH(A33)-1)/6)+1=1,\"ER SEMESTRE \",\"EME SEMESTRE \")&YEAR(A33)&\"'\"&\"!$B$9:$B$43\"),0,MATCH($A33,INDIRECT(\"'\"&INT((MONTH(A33)-1)/6)+1&IF(INT((MONTH(A33)-1)/6)+1=1,\"ER SEMESTRE \",\"EME SEMESTRE \")&YEAR(A33)&\"'\"&\"!$B$7:$HA$7\"),0)-DAY(A33)-1)=\"(\"&$G$9&\")\")*(INDEX(INDIRECT(\"'\"&INT((MONTH(A33)-1)/6)+1&IF(INT((MONTH(A33)-1)/6)+1=1,\"ER SEMESTRE \",\"EME SEMESTRE \")&YEAR(A33)&\"'\"&\"!$B$9:$HA$43\"),0,MATCH($A33,INDIRECT(\"'\"&INT((MONTH(A33)-1)/6)+1&IF(INT((MONTH(A33)-1)/6)+1=1,\"ER SEMESTRE \",\"EME SEMESTRE \")&YEAR(A33)&\"'\"&\"!$B$7:$HA$7\"),0))=\"J\"),ROW(INDIRECT(\"'\"&INT((MONTH(A33)-1)/6)+1&IF(INT((MONTH(A33)-1)/6)+1=1,\"ER SEMESTRE \",\"EME SEMESTRE \")&YEAR(A33)&\"'\"&\"!$D$9:$D$43\"))-8,9^9))),IFERROR(INDEX(OFFSET(INDIRECT(\"'\"&INT((MONTH(A33)-1)/6)+1&IF(INT((MONTH(A33)-1)/6)+1=1,\"ER SEMESTRE \",\"EME SEMESTRE \")&YEAR(A33)&\"'\"&\"!$B$9:$B$43\"),0,MATCH($A33,INDIRECT(\"'\"&INT((MONTH(A33)-1)/6)+1&IF(INT((MONTH(A33)-1)/6)+1=1,\"ER SEMESTRE \",\"EME SEMESTRE \")&YEAR(A33)&\"'\"&\"!$B$7:$HA$7\"),0)-DAY(A33)-2),MIN(IF((OFFSET(INDIRECT(\"'\"&INT((MONTH(A33)-1)/6)+1&IF(INT((MONTH(A33)-1)/6)+1=1,\"ER SEMESTRE \",\"EME SEMESTRE \")&YEAR(A33)&\"'\"&\"!$B$9:$B$43\"),0,MATCH($A33,INDIRECT(\"'\"&INT((MONTH(A33)-1)/6)+1&IF(INT((MONTH(A33)-1)/6)+1=1,\"ER SEMESTRE \",\"EME SEMESTRE \")&YEAR(A33)&\"'\"&\"!$B$7:$HA$7\"),0)-DAY(A33)-1)=\"(\"&$G$9&\")\")*(INDEX(INDIRECT(\"'\"&INT((MONTH(A33)-1)/6)+1&IF(INT((MONTH(A33)-1)/6)+1=1,\"ER SEMESTRE \",\"EME SEMESTRE \")&YEAR(A33)&\"'\"&\"!$B$9:$HA$43\"),0,MATCH($A33,INDIRECT(\"'\"&INT((MONTH(A33)-1)/6)+1&IF(INT((MONTH(A33)-1)/6)+1=1,\"ER SEMESTRE \",\"EME SEMESTRE \")&YEAR(A33)&\"'\"&\"!$B$7:$HA$7\"),0))=\"R\"),ROW(INDIRECT(\"'\"&INT((MONTH(A33)-1)/6)+1&IF(INT((MONTH(A33)-1)/6)+1=1,\"ER SEMESTRE \",\"EME SEMESTRE \")&YEAR(A33)&\"'\"&\"!$D$9:$D$43\"))-8,9^9))),\"\")),\"\")","v":""},null,{"$f":"IF(OR($B33=\"M\",$B33=\"N\",$B33=\"A\"),IF(\nIFERROR(INDEX(OFFSET(INDIRECT(\"'\"&INT((MONTH(A33)-1)/6)+1&IF(INT((MONTH(A33)-1)/6)+1=1,\"ER SEMESTRE \",\"EME SEMESTRE \")&YEAR(A33)&\"'\"&\"!$B$9:$B$43\"),0,MATCH($A33,INDIRECT(\"'\"&INT((MONTH(A33)-1)/6)+1&IF(INT((MONTH(A33)-1)/6)+1=1,\"ER SEMESTRE \",\"EME SEMESTRE \")&YEAR(A33)&\"'\"&\"!$B$7:$HA$7\"),0)-DAY(A33)-2),MIN(IF((OFFSET(INDIRECT(\"'\"&INT((MONTH(A33)-1)/6)+1&IF(INT((MONTH(A33)-1)/6)+1=1,\"ER SEMESTRE \",\"EME SEMESTRE \")&YEAR(A33)&\"'\"&\"!$B$9:$B$43\"),0,MATCH($A33,INDIRECT(\"'\"&INT((MONTH(A33)-1)/6)+1&IF(INT((MONTH(A33)-1)/6)+1=1,\"ER SEMESTRE \",\"EME SEMESTRE \")&YEAR(A33)&\"'\"&\"!$B$7:$HA$7\"),0)-DAY(A33)-1)=\"(\"&$G$9&\")\")*(INDEX(INDIRECT(\"'\"&INT((MONTH(A33)-1)/6)+1&IF(INT((MONTH(A33)-1)/6)+1=1,\"ER SEMESTRE \",\"EME SEMESTRE \")&YEAR(A33)&\"'\"&\"!$B$9:$HA$43\"),0,MATCH($A33,INDIRECT(\"'\"&INT((MONTH(A33)-1)/6)+1&IF(INT((MONTH(A33)-1)/6)+1=1,\"ER SEMESTRE \",\"EME SEMESTRE \")&YEAR(A33)&\"'\"&\"!$B$7:$HA$7\"),0))=\"J\"),ROW(INDIRECT(\"'\"&INT((MONTH(A33)-1)/6)+1&IF(INT((MONTH(A33)-1)/6)+1=1,\"ER SEMESTRE \",\"EME SEMESTRE \")&YEAR(A33)&\"'\"&\"!$D$9:$D$43\"))-8,9^9))),\"\")=\"\",\n\nIFERROR(INDEX(OFFSET(INDIRECT(\"'\"&INT((MONTH(A33)-1)/6)+1&IF(INT((MONTH(A33)-1)/6)+1=1,\"ER SEMESTRE \",\"EME SEMESTRE \")&YEAR(A33)&\"'\"&\"!$B$9:$B$43\"),0,MATCH($A33,INDIRECT(\"'\"&INT((MONTH(A33)-1)/6)+1&IF(INT((MONTH(A33)-1)/6)+1=1,\"ER SEMESTRE \",\"EME SEMESTRE \")&YEAR(A33)&\"'\"&\"!$B$7:$HA$7\"),0)-DAY(A33)-2),SMALL(IF((OFFSET(INDIRECT(\"'\"&INT((MONTH(A33)-1)/6)+1&IF(INT((MONTH(A33)-1)/6)+1=1,\"ER SEMESTRE \",\"EME SEMESTRE \")&YEAR(A33)&\"'\"&\"!$B$9:$B$43\"),0,MATCH($A33,INDIRECT(\"'\"&INT((MONTH(A33)-1)/6)+1&IF(INT((MONTH(A33)-1)/6)+1=1,\"ER SEMESTRE \",\"EME SEMESTRE \")&YEAR(A33)&\"'\"&\"!$B$7:$HA$7\"),0)-DAY(A33)-1)=\"(\"&$G$9&\")\")*(INDEX(INDIRECT(\"'\"&INT((MONTH(A33)-1)/6)+1&IF(INT((MONTH(A33)-1)/6)+1=1,\"ER SEMESTRE \",\"EME SEMESTRE \")&YEAR(A33)&\"'\"&\"!$B$9:$HA$43\"),0,MATCH($A33,INDIRECT(\"'\"&INT((MONTH(A33)-1)/6)+1&IF(INT((MONTH(A33)-1)/6)+1=1,\"ER SEMESTRE \",\"EME SEMESTRE \")&YEAR(A33)&\"'\"&\"!$B$7:$HA$7\"),0))=\"R\"),ROW(INDIRECT(\"'\"&INT((MONTH(A33)-1)/6)+1&IF(INT((MONTH(A33)-1)/6)+1=1,\"ER SEMESTRE \",\"EME SEMESTRE \")&YEAR(A33)&\"'\"&\"!D$9:D$43\"))-8,9^9),2)),\"\"),\n\nIFERROR(\nINDEX(\nOFFSET(INDIRECT(\"'\"&INT((MONTH(A33)-1)/6)+1&IF(INT((MONTH(A33)-1)/6)+1=1,\"ER SEMESTRE \",\"EME SEMESTRE \")&YEAR(A33)&\"'\"&\"!$B$9:$B$43\"),0,MATCH($A33,INDIRECT(\"'\"&INT((MONTH(A33)-1)/6)+1&IF(INT((MONTH(A33)-1)/6)+1=1,\"ER SEMESTRE \",\"EME SEMESTRE \")&YEAR(A33)&\"'\"&\"!$B$7:$HA$7\"),0)-DAY(A33)-2),\n\nMIN(IF(\n(OFFSET(INDIRECT(\"'\"&INT((MONTH(A33)-1)/6)+1&IF(INT((MONTH(A33)-1)/6)+1=1,\"ER SEMESTRE \",\"EME SEMESTRE \")&YEAR(A33)&\"'\"&\"!$B$9:$B$43\"),0,MATCH($A33,INDIRECT(\"'\"&INT((MONTH(A33)-1)/6)+1&IF(INT((MONTH(A33)-1)/6)+1=1,\"ER SEMESTRE \",\"EME SEMESTRE \")&YEAR(A33)&\"'\"&\"!$B$7:$HA$7\"),0)-DAY(A33)-1)=\"(\"&$G$9&\")\")\n*\n(INDEX(INDIRECT(\"'\"&INT((MONTH(A33)-1)/6)+1&IF(INT((MONTH(A33)-1)/6)+1=1,\"ER SEMESTRE \",\"EME SEMESTRE \")&YEAR(A33)&\"'\"&\"!$B$9:$HA$43\"),0,MATCH($A33,INDIRECT(\"'\"&INT((MONTH(A33)-1)/6)+1&IF(INT((MONTH(A33)-1)/6)+1=1,\"ER SEMESTRE \",\"EME SEMESTRE \")&YEAR(A33)&\"'\"&\"!$B$7:$HA$7\"),0))=\"R\"),\n\nROW(INDIRECT(\"'\"&INT((MONTH(A33)-1)/6)+1&IF(INT((MONTH(A33)-1)/6)+1=1,\"ER SEMESTRE \",\"EME SEMESTRE \")&YEAR(A33)&\"'\"&\"!D$9:D$43\"))-8,\n\n9^9))),\"\")),\"\")","v":""},null,{"$f":"IF(OR($B33=\"M\",$B33=\"N\",$B33=\"A\"),IF(\n\nIFERROR(INDEX(OFFSET(INDIRECT(\"'\"&INT((MONTH(A33)-1)/6)+1&IF(INT((MONTH(A33)-1)/6)+1=1,\"ER SEMESTRE \",\"EME SEMESTRE \")&YEAR(A33)&\"'\"&\"!$B$9:$B$43\"),0,MATCH($A33,INDIRECT(\"'\"&INT((MONTH(A33)-1)/6)+1&IF(INT((MONTH(A33)-1)/6)+1=1,\"ER SEMESTRE \",\"EME SEMESTRE \")&YEAR(A33)&\"'\"&\"!$B$7:$HA$7\"),0)-DAY(A33)-2),MIN(IF((OFFSET(INDIRECT(\"'\"&INT((MONTH(A33)-1)/6)+1&IF(INT((MONTH(A33)-1)/6)+1=1,\"ER SEMESTRE \",\"EME SEMESTRE \")&YEAR(A33)&\"'\"&\"!$B$9:$B$43\"),0,MATCH($A33,INDIRECT(\"'\"&INT((MONTH(A33)-1)/6)+1&IF(INT((MONTH(A33)-1)/6)+1=1,\"ER SEMESTRE \",\"EME SEMESTRE \")&YEAR(A33)&\"'\"&\"!$B$7:$HA$7\"),0)-DAY(A33)-1)=\"(\"&$G$9&\")\")*(INDEX(INDIRECT(\"'\"&INT((MONTH(A33)-1)/6)+1&IF(INT((MONTH(A33)-1)/6)+1=1,\"ER SEMESTRE \",\"EME SEMESTRE \")&YEAR(A33)&\"'\"&\"!$B$9:$HA$43\"),0,MATCH($A33,INDIRECT(\"'\"&INT((MONTH(A33)-1)/6)+1&IF(INT((MONTH(A33)-1)/6)+1=1,\"ER SEMESTRE \",\"EME SEMESTRE \")&YEAR(A33)&\"'\"&\"!$B$7:$HA$7\"),0))=\"J\"),ROW(INDIRECT(\"'\"&INT((MONTH(A33)-1)/6)+1&IF(INT((MONTH(A33)-1)/6)+1=1,\"ER SEMESTRE \",\"EME SEMESTRE \")&YEAR(A33)&\"'\"&\"!$D$9:$D$43\"))-8,9^9))),\"\")=\"\",\n\nIFERROR(\nINDEX(OFFSET(INDIRECT(\"'\"&INT((MONTH(A33)-1)/6)+1&IF(INT((MONTH(A33)-1)/6)+1=1,\"ER SEMESTRE \",\"EME SEMESTRE \")&YEAR(A33)&\"'\"&\"!$B$9:$B$43\"),0,MATCH($A33,INDIRECT(\"'\"&INT((MONTH(A33)-1)/6)+1&IF(INT((MONTH(A33)-1)/6)+1=1,\"ER SEMESTRE \",\"EME SEMESTRE \")&YEAR(A33)&\"'\"&\"!$B$7:$HA$7\"),0)-DAY(A33)-2),\nSMALL(IF((OFFSET(INDIRECT(\"'\"&INT((MONTH(A33)-1)/6)+1&IF(INT((MONTH(A33)-1)/6)+1=1,\"ER SEMESTRE \",\"EME SEMESTRE \")&YEAR(A33)&\"'\"&\"!$B$9:$B$43\"),0,MATCH($A33,INDIRECT(\"'\"&INT((MONTH(A33)-1)/6)+1&IF(INT((MONTH(A33)-1)/6)+1=1,\"ER SEMESTRE \",\"EME SEMESTRE \")&YEAR(A33)&\"'\"&\"!$B$7:$HA$7\"),0)-DAY(A33)-1)=\"(\"&$G$9&\")\")*(INDEX(INDIRECT(\"'\"&INT((MONTH(A33)-1)/6)+1&IF(INT((MONTH(A33)-1)/6)+1=1,\"ER SEMESTRE \",\"EME SEMESTRE \")&YEAR(A33)&\"'\"&\"!$B$9:$HA$43\"),0,MATCH($A33,INDIRECT(\"'\"&INT((MONTH(A33)-1)/6)+1&IF(INT((MONTH(A33)-1)/6)+1=1,\"ER SEMESTRE \",\"EME SEMESTRE \")&YEAR(A33)&\"'\"&\"!$B$7:$HA$7\"),0))=\"R\"),ROW(INDIRECT(\"'\"&INT((MONTH(A33)-1)/6)+1&IF(INT((MONTH(A33)-1)/6)+1=1,\"ER SEMESTRE \",\"EME SEMESTRE \")&YEAR(A33)&\"'\"&\"!D$9:D$43\"))-8,9^9),3)),\"\"),\n\n\nIFERROR(\nINDEX(OFFSET(INDIRECT(\"'\"&INT((MONTH(A33)-1)/6)+1&IF(INT((MONTH(A33)-1)/6)+1=1,\"ER SEMESTRE \",\"EME SEMESTRE \")&YEAR(A33)&\"'\"&\"!$B$9:$B$43\"),0,MATCH($A33,INDIRECT(\"'\"&INT((MONTH(A33)-1)/6)+1&IF(INT((MONTH(A33)-1)/6)+1=1,\"ER SEMESTRE \",\"EME SEMESTRE \")&YEAR(A33)&\"'\"&\"!$B$7:$HA$7\"),0)-DAY(A33)-2),\nSMALL(IF((OFFSET(INDIRECT(\"'\"&INT((MONTH(A33)-1)/6)+1&IF(INT((MONTH(A33)-1)/6)+1=1,\"ER SEMESTRE \",\"EME SEMESTRE \")&YEAR(A33)&\"'\"&\"!$B$9:$B$43\"),0,MATCH($A33,INDIRECT(\"'\"&INT((MONTH(A33)-1)/6)+1&IF(INT((MONTH(A33)-1)/6)+1=1,\"ER SEMESTRE \",\"EME SEMESTRE \")&YEAR(A33)&\"'\"&\"!$B$7:$HA$7\"),0)-DAY(A33)-1)=\"(\"&$G$9&\")\")*(INDEX(INDIRECT(\"'\"&INT((MONTH(A33)-1)/6)+1&IF(INT((MONTH(A33)-1)/6)+1=1,\"ER SEMESTRE \",\"EME SEMESTRE \")&YEAR(A33)&\"'\"&\"!$B$9:$HA$43\"),0,MATCH($A33,INDIRECT(\"'\"&INT((MONTH(A33)-1)/6)+1&IF(INT((MONTH(A33)-1)/6)+1=1,\"ER SEMESTRE \",\"EME SEMESTRE \")&YEAR(A33)&\"'\"&\"!$B$7:$HA$7\"),0))=\"R\"),ROW(INDIRECT(\"'\"&INT((MONTH(A33)-1)/6)+1&IF(INT((MONTH(A33)-1)/6)+1=1,\"ER SEMESTRE \",\"EME SEMESTRE \")&YEAR(A33)&\"'\"&\"!D$9:D$43\"))-8,9^9),2)),\"\")\n\n),\n\n\"\")","v":""}]
["",{"$f":"IFERROR(INDEX([3]PLANNING!$D$3:$Y$29,MATCH('[3]F_Dde de remplacement'!$G$8,[3]PLANNING!$B$3:$B$29,0),MATCH('[3]F_Dde de remplacement'!$A34,[3]PLANNING!$D$2:$Y$2,0)),\"\")","v":""},{"$f":"IF(OR($B34=\"M\",$B34=\"N\",$B34=\"A\"),IFERROR(INDEX(OFFSET(INDIRECT(\"'\"&INT((MONTH(A34)-1)/6)+1&IF(INT((MONTH(A34)-1)/6)+1=1,\"ER SEMESTRE \",\"EME SEMESTRE \")&YEAR(A34)&\"'\"&\"!$B$9:$B$43\"),0,MATCH($A34,INDIRECT(\"'\"&INT((MONTH(A34)-1)/6)+1&IF(INT((MONTH(A34)-1)/6)+1=1,\"ER SEMESTRE \",\"EME SEMESTRE \")&YEAR(A34)&\"'\"&\"!$B$7:$HA$7\"),0)-DAY(A34)-2),MIN(IF((OFFSET(INDIRECT(\"'\"&INT((MONTH(A34)-1)/6)+1&IF(INT((MONTH(A34)-1)/6)+1=1,\"ER SEMESTRE \",\"EME SEMESTRE \")&YEAR(A34)&\"'\"&\"!$B$9:$B$43\"),0,MATCH($A34,INDIRECT(\"'\"&INT((MONTH(A34)-1)/6)+1&IF(INT((MONTH(A34)-1)/6)+1=1,\"ER SEMESTRE \",\"EME SEMESTRE \")&YEAR(A34)&\"'\"&\"!$B$7:$HA$7\"),0)-DAY(A34)-1)=\"(\"&$G$9&\")\")*(INDEX(INDIRECT(\"'\"&INT((MONTH(A34)-1)/6)+1&IF(INT((MONTH(A34)-1)/6)+1=1,\"ER SEMESTRE \",\"EME SEMESTRE \")&YEAR(A34)&\"'\"&\"!$B$9:$HA$43\"),0,MATCH($A34,INDIRECT(\"'\"&INT((MONTH(A34)-1)/6)+1&IF(INT((MONTH(A34)-1)/6)+1=1,\"ER SEMESTRE \",\"EME SEMESTRE \")&YEAR(A34)&\"'\"&\"!$B$7:$HA$7\"),0))=\"J\"),ROW(INDIRECT(\"'\"&INT((MONTH(A34)-1)/6)+1&IF(INT((MONTH(A34)-1)/6)+1=1,\"ER SEMESTRE \",\"EME SEMESTRE \")&YEAR(A34)&\"'\"&\"!$D$9:$D$43\"))-8,9^9))),IFERROR(INDEX(OFFSET(INDIRECT(\"'\"&INT((MONTH(A34)-1)/6)+1&IF(INT((MONTH(A34)-1)/6)+1=1,\"ER SEMESTRE \",\"EME SEMESTRE \")&YEAR(A34)&\"'\"&\"!$B$9:$B$43\"),0,MATCH($A34,INDIRECT(\"'\"&INT((MONTH(A34)-1)/6)+1&IF(INT((MONTH(A34)-1)/6)+1=1,\"ER SEMESTRE \",\"EME SEMESTRE \")&YEAR(A34)&\"'\"&\"!$B$7:$HA$7\"),0)-DAY(A34)-2),MIN(IF((OFFSET(INDIRECT(\"'\"&INT((MONTH(A34)-1)/6)+1&IF(INT((MONTH(A34)-1)/6)+1=1,\"ER SEMESTRE \",\"EME SEMESTRE \")&YEAR(A34)&\"'\"&\"!$B$9:$B$43\"),0,MATCH($A34,INDIRECT(\"'\"&INT((MONTH(A34)-1)/6)+1&IF(INT((MONTH(A34)-1)/6)+1=1,\"ER SEMESTRE \",\"EME SEMESTRE \")&YEAR(A34)&\"'\"&\"!$B$7:$HA$7\"),0)-DAY(A34)-1)=\"(\"&$G$9&\")\")*(INDEX(INDIRECT(\"'\"&INT((MONTH(A34)-1)/6)+1&IF(INT((MONTH(A34)-1)/6)+1=1,\"ER SEMESTRE \",\"EME SEMESTRE \")&YEAR(A34)&\"'\"&\"!$B$9:$HA$43\"),0,MATCH($A34,INDIRECT(\"'\"&INT((MONTH(A34)-1)/6)+1&IF(INT((MONTH(A34)-1)/6)+1=1,\"ER SEMESTRE \",\"EME SEMESTRE \")&YEAR(A34)&\"'\"&\"!$B$7:$HA$7\"),0))=\"R\"),ROW(INDIRECT(\"'\"&INT((MONTH(A34)-1)/6)+1&IF(INT((MONTH(A34)-1)/6)+1=1,\"ER SEMESTRE \",\"EME SEMESTRE \")&YEAR(A34)&\"'\"&\"!$D$9:$D$43\"))-8,9^9))),\"\")),\"\")","v":""},null,{"$f":"IF(OR($B34=\"M\",$B34=\"N\",$B34=\"A\"),IF(\nIFERROR(INDEX(OFFSET(INDIRECT(\"'\"&INT((MONTH(A34)-1)/6)+1&IF(INT((MONTH(A34)-1)/6)+1=1,\"ER SEMESTRE \",\"EME SEMESTRE \")&YEAR(A34)&\"'\"&\"!$B$9:$B$43\"),0,MATCH($A34,INDIRECT(\"'\"&INT((MONTH(A34)-1)/6)+1&IF(INT((MONTH(A34)-1)/6)+1=1,\"ER SEMESTRE \",\"EME SEMESTRE \")&YEAR(A34)&\"'\"&\"!$B$7:$HA$7\"),0)-DAY(A34)-2),MIN(IF((OFFSET(INDIRECT(\"'\"&INT((MONTH(A34)-1)/6)+1&IF(INT((MONTH(A34)-1)/6)+1=1,\"ER SEMESTRE \",\"EME SEMESTRE \")&YEAR(A34)&\"'\"&\"!$B$9:$B$43\"),0,MATCH($A34,INDIRECT(\"'\"&INT((MONTH(A34)-1)/6)+1&IF(INT((MONTH(A34)-1)/6)+1=1,\"ER SEMESTRE \",\"EME SEMESTRE \")&YEAR(A34)&\"'\"&\"!$B$7:$HA$7\"),0)-DAY(A34)-1)=\"(\"&$G$9&\")\")*(INDEX(INDIRECT(\"'\"&INT((MONTH(A34)-1)/6)+1&IF(INT((MONTH(A34)-1)/6)+1=1,\"ER SEMESTRE \",\"EME SEMESTRE \")&YEAR(A34)&\"'\"&\"!$B$9:$HA$43\"),0,MATCH($A34,INDIRECT(\"'\"&INT((MONTH(A34)-1)/6)+1&IF(INT((MONTH(A34)-1)/6)+1=1,\"ER SEMESTRE \",\"EME SEMESTRE \")&YEAR(A34)&\"'\"&\"!$B$7:$HA$7\"),0))=\"J\"),ROW(INDIRECT(\"'\"&INT((MONTH(A34)-1)/6)+1&IF(INT((MONTH(A34)-1)/6)+1=1,\"ER SEMESTRE \",\"EME SEMESTRE \")&YEAR(A34)&\"'\"&\"!$D$9:$D$43\"))-8,9^9))),\"\")=\"\",\n\nIFERROR(INDEX(OFFSET(INDIRECT(\"'\"&INT((MONTH(A34)-1)/6)+1&IF(INT((MONTH(A34)-1)/6)+1=1,\"ER SEMESTRE \",\"EME SEMESTRE \")&YEAR(A34)&\"'\"&\"!$B$9:$B$43\"),0,MATCH($A34,INDIRECT(\"'\"&INT((MONTH(A34)-1)/6)+1&IF(INT((MONTH(A34)-1)/6)+1=1,\"ER SEMESTRE \",\"EME SEMESTRE \")&YEAR(A34)&\"'\"&\"!$B$7:$HA$7\"),0)-DAY(A34)-2),SMALL(IF((OFFSET(INDIRECT(\"'\"&INT((MONTH(A34)-1)/6)+1&IF(INT((MONTH(A34)-1)/6)+1=1,\"ER SEMESTRE \",\"EME SEMESTRE \")&YEAR(A34)&\"'\"&\"!$B$9:$B$43\"),0,MATCH($A34,INDIRECT(\"'\"&INT((MONTH(A34)-1)/6)+1&IF(INT((MONTH(A34)-1)/6)+1=1,\"ER SEMESTRE \",\"EME SEMESTRE \")&YEAR(A34)&\"'\"&\"!$B$7:$HA$7\"),0)-DAY(A34)-1)=\"(\"&$G$9&\")\")*(INDEX(INDIRECT(\"'\"&INT((MONTH(A34)-1)/6)+1&IF(INT((MONTH(A34)-1)/6)+1=1,\"ER SEMESTRE \",\"EME SEMESTRE \")&YEAR(A34)&\"'\"&\"!$B$9:$HA$43\"),0,MATCH($A34,INDIRECT(\"'\"&INT((MONTH(A34)-1)/6)+1&IF(INT((MONTH(A34)-1)/6)+1=1,\"ER SEMESTRE \",\"EME SEMESTRE \")&YEAR(A34)&\"'\"&\"!$B$7:$HA$7\"),0))=\"R\"),ROW(INDIRECT(\"'\"&INT((MONTH(A34)-1)/6)+1&IF(INT((MONTH(A34)-1)/6)+1=1,\"ER SEMESTRE \",\"EME SEMESTRE \")&YEAR(A34)&\"'\"&\"!D$9:D$43\"))-8,9^9),2)),\"\"),\n\nIFERROR(\nINDEX(\nOFFSET(INDIRECT(\"'\"&INT((MONTH(A34)-1)/6)+1&IF(INT((MONTH(A34)-1)/6)+1=1,\"ER SEMESTRE \",\"EME SEMESTRE \")&YEAR(A34)&\"'\"&\"!$B$9:$B$43\"),0,MATCH($A34,INDIRECT(\"'\"&INT((MONTH(A34)-1)/6)+1&IF(INT((MONTH(A34)-1)/6)+1=1,\"ER SEMESTRE \",\"EME SEMESTRE \")&YEAR(A34)&\"'\"&\"!$B$7:$HA$7\"),0)-DAY(A34)-2),\n\nMIN(IF(\n(OFFSET(INDIRECT(\"'\"&INT((MONTH(A34)-1)/6)+1&IF(INT((MONTH(A34)-1)/6)+1=1,\"ER SEMESTRE \",\"EME SEMESTRE \")&YEAR(A34)&\"'\"&\"!$B$9:$B$43\"),0,MATCH($A34,INDIRECT(\"'\"&INT((MONTH(A34)-1)/6)+1&IF(INT((MONTH(A34)-1)/6)+1=1,\"ER SEMESTRE \",\"EME SEMESTRE \")&YEAR(A34)&\"'\"&\"!$B$7:$HA$7\"),0)-DAY(A34)-1)=\"(\"&$G$9&\")\")\n*\n(INDEX(INDIRECT(\"'\"&INT((MONTH(A34)-1)/6)+1&IF(INT((MONTH(A34)-1)/6)+1=1,\"ER SEMESTRE \",\"EME SEMESTRE \")&YEAR(A34)&\"'\"&\"!$B$9:$HA$43\"),0,MATCH($A34,INDIRECT(\"'\"&INT((MONTH(A34)-1)/6)+1&IF(INT((MONTH(A34)-1)/6)+1=1,\"ER SEMESTRE \",\"EME SEMESTRE \")&YEAR(A34)&\"'\"&\"!$B$7:$HA$7\"),0))=\"R\"),\n\nROW(INDIRECT(\"'\"&INT((MONTH(A34)-1)/6)+1&IF(INT((MONTH(A34)-1)/6)+1=1,\"ER SEMESTRE \",\"EME SEMESTRE \")&YEAR(A34)&\"'\"&\"!D$9:D$43\"))-8,\n\n9^9))),\"\")),\"\")","v":""},null,{"$f":"IF(OR($B34=\"M\",$B34=\"N\",$B34=\"A\"),IF(\n\nIFERROR(INDEX(OFFSET(INDIRECT(\"'\"&INT((MONTH(A34)-1)/6)+1&IF(INT((MONTH(A34)-1)/6)+1=1,\"ER SEMESTRE \",\"EME SEMESTRE \")&YEAR(A34)&\"'\"&\"!$B$9:$B$43\"),0,MATCH($A34,INDIRECT(\"'\"&INT((MONTH(A34)-1)/6)+1&IF(INT((MONTH(A34)-1)/6)+1=1,\"ER SEMESTRE \",\"EME SEMESTRE \")&YEAR(A34)&\"'\"&\"!$B$7:$HA$7\"),0)-DAY(A34)-2),MIN(IF((OFFSET(INDIRECT(\"'\"&INT((MONTH(A34)-1)/6)+1&IF(INT((MONTH(A34)-1)/6)+1=1,\"ER SEMESTRE \",\"EME SEMESTRE \")&YEAR(A34)&\"'\"&\"!$B$9:$B$43\"),0,MATCH($A34,INDIRECT(\"'\"&INT((MONTH(A34)-1)/6)+1&IF(INT((MONTH(A34)-1)/6)+1=1,\"ER SEMESTRE \",\"EME SEMESTRE \")&YEAR(A34)&\"'\"&\"!$B$7:$HA$7\"),0)-DAY(A34)-1)=\"(\"&$G$9&\")\")*(INDEX(INDIRECT(\"'\"&INT((MONTH(A34)-1)/6)+1&IF(INT((MONTH(A34)-1)/6)+1=1,\"ER SEMESTRE \",\"EME SEMESTRE \")&YEAR(A34)&\"'\"&\"!$B$9:$HA$43\"),0,MATCH($A34,INDIRECT(\"'\"&INT((MONTH(A34)-1)/6)+1&IF(INT((MONTH(A34)-1)/6)+1=1,\"ER SEMESTRE \",\"EME SEMESTRE \")&YEAR(A34)&\"'\"&\"!$B$7:$HA$7\"),0))=\"J\"),ROW(INDIRECT(\"'\"&INT((MONTH(A34)-1)/6)+1&IF(INT((MONTH(A34)-1)/6)+1=1,\"ER SEMESTRE \",\"EME SEMESTRE \")&YEAR(A34)&\"'\"&\"!$D$9:$D$43\"))-8,9^9))),\"\")=\"\",\n\nIFERROR(\nINDEX(OFFSET(INDIRECT(\"'\"&INT((MONTH(A34)-1)/6)+1&IF(INT((MONTH(A34)-1)/6)+1=1,\"ER SEMESTRE \",\"EME SEMESTRE \")&YEAR(A34)&\"'\"&\"!$B$9:$B$43\"),0,MATCH($A34,INDIRECT(\"'\"&INT((MONTH(A34)-1)/6)+1&IF(INT((MONTH(A34)-1)/6)+1=1,\"ER SEMESTRE \",\"EME SEMESTRE \")&YEAR(A34)&\"'\"&\"!$B$7:$HA$7\"),0)-DAY(A34)-2),\nSMALL(IF((OFFSET(INDIRECT(\"'\"&INT((MONTH(A34)-1)/6)+1&IF(INT((MONTH(A34)-1)/6)+1=1,\"ER SEMESTRE \",\"EME SEMESTRE \")&YEAR(A34)&\"'\"&\"!$B$9:$B$43\"),0,MATCH($A34,INDIRECT(\"'\"&INT((MONTH(A34)-1)/6)+1&IF(INT((MONTH(A34)-1)/6)+1=1,\"ER SEMESTRE \",\"EME SEMESTRE \")&YEAR(A34)&\"'\"&\"!$B$7:$HA$7\"),0)-DAY(A34)-1)=\"(\"&$G$9&\")\")*(INDEX(INDIRECT(\"'\"&INT((MONTH(A34)-1)/6)+1&IF(INT((MONTH(A34)-1)/6)+1=1,\"ER SEMESTRE \",\"EME SEMESTRE \")&YEAR(A34)&\"'\"&\"!$B$9:$HA$43\"),0,MATCH($A34,INDIRECT(\"'\"&INT((MONTH(A34)-1)/6)+1&IF(INT((MONTH(A34)-1)/6)+1=1,\"ER SEMESTRE \",\"EME SEMESTRE \")&YEAR(A34)&\"'\"&\"!$B$7:$HA$7\"),0))=\"R\"),ROW(INDIRECT(\"'\"&INT((MONTH(A34)-1)/6)+1&IF(INT((MONTH(A34)-1)/6)+1=1,\"ER SEMESTRE \",\"EME SEMESTRE \")&YEAR(A34)&\"'\"&\"!D$9:D$43\"))-8,9^9),3)),\"\"),\n\n\nIFERROR(\nINDEX(OFFSET(INDIRECT(\"'\"&INT((MONTH(A34)-1)/6)+1&IF(INT((MONTH(A34)-1)/6)+1=1,\"ER SEMESTRE \",\"EME SEMESTRE \")&YEAR(A34)&\"'\"&\"!$B$9:$B$43\"),0,MATCH($A34,INDIRECT(\"'\"&INT((MONTH(A34)-1)/6)+1&IF(INT((MONTH(A34)-1)/6)+1=1,\"ER SEMESTRE \",\"EME SEMESTRE \")&YEAR(A34)&\"'\"&\"!$B$7:$HA$7\"),0)-DAY(A34)-2),\nSMALL(IF((OFFSET(INDIRECT(\"'\"&INT((MONTH(A34)-1)/6)+1&IF(INT((MONTH(A34)-1)/6)+1=1,\"ER SEMESTRE \",\"EME SEMESTRE \")&YEAR(A34)&\"'\"&\"!$B$9:$B$43\"),0,MATCH($A34,INDIRECT(\"'\"&INT((MONTH(A34)-1)/6)+1&IF(INT((MONTH(A34)-1)/6)+1=1,\"ER SEMESTRE \",\"EME SEMESTRE \")&YEAR(A34)&\"'\"&\"!$B$7:$HA$7\"),0)-DAY(A34)-1)=\"(\"&$G$9&\")\")*(INDEX(INDIRECT(\"'\"&INT((MONTH(A34)-1)/6)+1&IF(INT((MONTH(A34)-1)/6)+1=1,\"ER SEMESTRE \",\"EME SEMESTRE \")&YEAR(A34)&\"'\"&\"!$B$9:$HA$43\"),0,MATCH($A34,INDIRECT(\"'\"&INT((MONTH(A34)-1)/6)+1&IF(INT((MONTH(A34)-1)/6)+1=1,\"ER SEMESTRE \",\"EME SEMESTRE \")&YEAR(A34)&\"'\"&\"!$B$7:$HA$7\"),0))=\"R\"),ROW(INDIRECT(\"'\"&INT((MONTH(A34)-1)/6)+1&IF(INT((MONTH(A34)-1)/6)+1=1,\"ER SEMESTRE \",\"EME SEMESTRE \")&YEAR(A34)&\"'\"&\"!D$9:D$43\"))-8,9^9),2)),\"\")\n\n),\n\n\"\")","v":""}]
["",{"$f":"IFERROR(INDEX([3]PLANNING!$D$3:$Y$29,MATCH('[3]F_Dde de remplacement'!$G$8,[3]PLANNING!$B$3:$B$29,0),MATCH('[3]F_Dde de remplacement'!$A35,[3]PLANNING!$D$2:$Y$2,0)),\"\")","v":""},{"$f":"IF(OR($B35=\"M\",$B35=\"N\",$B35=\"A\"),IFERROR(INDEX(OFFSET(INDIRECT(\"'\"&INT((MONTH(A35)-1)/6)+1&IF(INT((MONTH(A35)-1)/6)+1=1,\"ER SEMESTRE \",\"EME SEMESTRE \")&YEAR(A35)&\"'\"&\"!$B$9:$B$43\"),0,MATCH($A35,INDIRECT(\"'\"&INT((MONTH(A35)-1)/6)+1&IF(INT((MONTH(A35)-1)/6)+1=1,\"ER SEMESTRE \",\"EME SEMESTRE \")&YEAR(A35)&\"'\"&\"!$B$7:$HA$7\"),0)-DAY(A35)-2),MIN(IF((OFFSET(INDIRECT(\"'\"&INT((MONTH(A35)-1)/6)+1&IF(INT((MONTH(A35)-1)/6)+1=1,\"ER SEMESTRE \",\"EME SEMESTRE \")&YEAR(A35)&\"'\"&\"!$B$9:$B$43\"),0,MATCH($A35,INDIRECT(\"'\"&INT((MONTH(A35)-1)/6)+1&IF(INT((MONTH(A35)-1)/6)+1=1,\"ER SEMESTRE \",\"EME SEMESTRE \")&YEAR(A35)&\"'\"&\"!$B$7:$HA$7\"),0)-DAY(A35)-1)=\"(\"&$G$9&\")\")*(INDEX(INDIRECT(\"'\"&INT((MONTH(A35)-1)/6)+1&IF(INT((MONTH(A35)-1)/6)+1=1,\"ER SEMESTRE \",\"EME SEMESTRE \")&YEAR(A35)&\"'\"&\"!$B$9:$HA$43\"),0,MATCH($A35,INDIRECT(\"'\"&INT((MONTH(A35)-1)/6)+1&IF(INT((MONTH(A35)-1)/6)+1=1,\"ER SEMESTRE \",\"EME SEMESTRE \")&YEAR(A35)&\"'\"&\"!$B$7:$HA$7\"),0))=\"J\"),ROW(INDIRECT(\"'\"&INT((MONTH(A35)-1)/6)+1&IF(INT((MONTH(A35)-1)/6)+1=1,\"ER SEMESTRE \",\"EME SEMESTRE \")&YEAR(A35)&\"'\"&\"!$D$9:$D$43\"))-8,9^9))),IFERROR(INDEX(OFFSET(INDIRECT(\"'\"&INT((MONTH(A35)-1)/6)+1&IF(INT((MONTH(A35)-1)/6)+1=1,\"ER SEMESTRE \",\"EME SEMESTRE \")&YEAR(A35)&\"'\"&\"!$B$9:$B$43\"),0,MATCH($A35,INDIRECT(\"'\"&INT((MONTH(A35)-1)/6)+1&IF(INT((MONTH(A35)-1)/6)+1=1,\"ER SEMESTRE \",\"EME SEMESTRE \")&YEAR(A35)&\"'\"&\"!$B$7:$HA$7\"),0)-DAY(A35)-2),MIN(IF((OFFSET(INDIRECT(\"'\"&INT((MONTH(A35)-1)/6)+1&IF(INT((MONTH(A35)-1)/6)+1=1,\"ER SEMESTRE \",\"EME SEMESTRE \")&YEAR(A35)&\"'\"&\"!$B$9:$B$43\"),0,MATCH($A35,INDIRECT(\"'\"&INT((MONTH(A35)-1)/6)+1&IF(INT((MONTH(A35)-1)/6)+1=1,\"ER SEMESTRE \",\"EME SEMESTRE \")&YEAR(A35)&\"'\"&\"!$B$7:$HA$7\"),0)-DAY(A35)-1)=\"(\"&$G$9&\")\")*(INDEX(INDIRECT(\"'\"&INT((MONTH(A35)-1)/6)+1&IF(INT((MONTH(A35)-1)/6)+1=1,\"ER SEMESTRE \",\"EME SEMESTRE \")&YEAR(A35)&\"'\"&\"!$B$9:$HA$43\"),0,MATCH($A35,INDIRECT(\"'\"&INT((MONTH(A35)-1)/6)+1&IF(INT((MONTH(A35)-1)/6)+1=1,\"ER SEMESTRE \",\"EME SEMESTRE \")&YEAR(A35)&\"'\"&\"!$B$7:$HA$7\"),0))=\"R\"),ROW(INDIRECT(\"'\"&INT((MONTH(A35)-1)/6)+1&IF(INT((MONTH(A35)-1)/6)+1=1,\"ER SEMESTRE \",\"EME SEMESTRE \")&YEAR(A35)&\"'\"&\"!$D$9:$D$43\"))-8,9^9))),\"\")),\"\")","v":""},null,{"$f":"IF(OR($B35=\"M\",$B35=\"N\",$B35=\"A\"),IF(\nIFERROR(INDEX(OFFSET(INDIRECT(\"'\"&INT((MONTH(A35)-1)/6)+1&IF(INT((MONTH(A35)-1)/6)+1=1,\"ER SEMESTRE \",\"EME SEMESTRE \")&YEAR(A35)&\"'\"&\"!$B$9:$B$43\"),0,MATCH($A35,INDIRECT(\"'\"&INT((MONTH(A35)-1)/6)+1&IF(INT((MONTH(A35)-1)/6)+1=1,\"ER SEMESTRE \",\"EME SEMESTRE \")&YEAR(A35)&\"'\"&\"!$B$7:$HA$7\"),0)-DAY(A35)-2),MIN(IF((OFFSET(INDIRECT(\"'\"&INT((MONTH(A35)-1)/6)+1&IF(INT((MONTH(A35)-1)/6)+1=1,\"ER SEMESTRE \",\"EME SEMESTRE \")&YEAR(A35)&\"'\"&\"!$B$9:$B$43\"),0,MATCH($A35,INDIRECT(\"'\"&INT((MONTH(A35)-1)/6)+1&IF(INT((MONTH(A35)-1)/6)+1=1,\"ER SEMESTRE \",\"EME SEMESTRE \")&YEAR(A35)&\"'\"&\"!$B$7:$HA$7\"),0)-DAY(A35)-1)=\"(\"&$G$9&\")\")*(INDEX(INDIRECT(\"'\"&INT((MONTH(A35)-1)/6)+1&IF(INT((MONTH(A35)-1)/6)+1=1,\"ER SEMESTRE \",\"EME SEMESTRE \")&YEAR(A35)&\"'\"&\"!$B$9:$HA$43\"),0,MATCH($A35,INDIRECT(\"'\"&INT((MONTH(A35)-1)/6)+1&IF(INT((MONTH(A35)-1)/6)+1=1,\"ER SEMESTRE \",\"EME SEMESTRE \")&YEAR(A35)&\"'\"&\"!$B$7:$HA$7\"),0))=\"J\"),ROW(INDIRECT(\"'\"&INT((MONTH(A35)-1)/6)+1&IF(INT((MONTH(A35)-1)/6)+1=1,\"ER SEMESTRE \",\"EME SEMESTRE \")&YEAR(A35)&\"'\"&\"!$D$9:$D$43\"))-8,9^9))),\"\")=\"\",\n\nIFERROR(INDEX(OFFSET(INDIRECT(\"'\"&INT((MONTH(A35)-1)/6)+1&IF(INT((MONTH(A35)-1)/6)+1=1,\"ER SEMESTRE \",\"EME SEMESTRE \")&YEAR(A35)&\"'\"&\"!$B$9:$B$43\"),0,MATCH($A35,INDIRECT(\"'\"&INT((MONTH(A35)-1)/6)+1&IF(INT((MONTH(A35)-1)/6)+1=1,\"ER SEMESTRE \",\"EME SEMESTRE \")&YEAR(A35)&\"'\"&\"!$B$7:$HA$7\"),0)-DAY(A35)-2),SMALL(IF((OFFSET(INDIRECT(\"'\"&INT((MONTH(A35)-1)/6)+1&IF(INT((MONTH(A35)-1)/6)+1=1,\"ER SEMESTRE \",\"EME SEMESTRE \")&YEAR(A35)&\"'\"&\"!$B$9:$B$43\"),0,MATCH($A35,INDIRECT(\"'\"&INT((MONTH(A35)-1)/6)+1&IF(INT((MONTH(A35)-1)/6)+1=1,\"ER SEMESTRE \",\"EME SEMESTRE \")&YEAR(A35)&\"'\"&\"!$B$7:$HA$7\"),0)-DAY(A35)-1)=\"(\"&$G$9&\")\")*(INDEX(INDIRECT(\"'\"&INT((MONTH(A35)-1)/6)+1&IF(INT((MONTH(A35)-1)/6)+1=1,\"ER SEMESTRE \",\"EME SEMESTRE \")&YEAR(A35)&\"'\"&\"!$B$9:$HA$43\"),0,MATCH($A35,INDIRECT(\"'\"&INT((MONTH(A35)-1)/6)+1&IF(INT((MONTH(A35)-1)/6)+1=1,\"ER SEMESTRE \",\"EME SEMESTRE \")&YEAR(A35)&\"'\"&\"!$B$7:$HA$7\"),0))=\"R\"),ROW(INDIRECT(\"'\"&INT((MONTH(A35)-1)/6)+1&IF(INT((MONTH(A35)-1)/6)+1=1,\"ER SEMESTRE \",\"EME SEMESTRE \")&YEAR(A35)&\"'\"&\"!D$9:D$43\"))-8,9^9),2)),\"\"),\n\nIFERROR(\nINDEX(\nOFFSET(INDIRECT(\"'\"&INT((MONTH(A35)-1)/6)+1&IF(INT((MONTH(A35)-1)/6)+1=1,\"ER SEMESTRE \",\"EME SEMESTRE \")&YEAR(A35)&\"'\"&\"!$B$9:$B$43\"),0,MATCH($A35,INDIRECT(\"'\"&INT((MONTH(A35)-1)/6)+1&IF(INT((MONTH(A35)-1)/6)+1=1,\"ER SEMESTRE \",\"EME SEMESTRE \")&YEAR(A35)&\"'\"&\"!$B$7:$HA$7\"),0)-DAY(A35)-2),\n\nMIN(IF(\n(OFFSET(INDIRECT(\"'\"&INT((MONTH(A35)-1)/6)+1&IF(INT((MONTH(A35)-1)/6)+1=1,\"ER SEMESTRE \",\"EME SEMESTRE \")&YEAR(A35)&\"'\"&\"!$B$9:$B$43\"),0,MATCH($A35,INDIRECT(\"'\"&INT((MONTH(A35)-1)/6)+1&IF(INT((MONTH(A35)-1)/6)+1=1,\"ER SEMESTRE \",\"EME SEMESTRE \")&YEAR(A35)&\"'\"&\"!$B$7:$HA$7\"),0)-DAY(A35)-1)=\"(\"&$G$9&\")\")\n*\n(INDEX(INDIRECT(\"'\"&INT((MONTH(A35)-1)/6)+1&IF(INT((MONTH(A35)-1)/6)+1=1,\"ER SEMESTRE \",\"EME SEMESTRE \")&YEAR(A35)&\"'\"&\"!$B$9:$HA$43\"),0,MATCH($A35,INDIRECT(\"'\"&INT((MONTH(A35)-1)/6)+1&IF(INT((MONTH(A35)-1)/6)+1=1,\"ER SEMESTRE \",\"EME SEMESTRE \")&YEAR(A35)&\"'\"&\"!$B$7:$HA$7\"),0))=\"R\"),\n\nROW(INDIRECT(\"'\"&INT((MONTH(A35)-1)/6)+1&IF(INT((MONTH(A35)-1)/6)+1=1,\"ER SEMESTRE \",\"EME SEMESTRE \")&YEAR(A35)&\"'\"&\"!D$9:D$43\"))-8,\n\n9^9))),\"\")),\"\")","v":""},null,{"$f":"IF(OR($B35=\"M\",$B35=\"N\",$B35=\"A\"),IF(\n\nIFERROR(INDEX(OFFSET(INDIRECT(\"'\"&INT((MONTH(A35)-1)/6)+1&IF(INT((MONTH(A35)-1)/6)+1=1,\"ER SEMESTRE \",\"EME SEMESTRE \")&YEAR(A35)&\"'\"&\"!$B$9:$B$43\"),0,MATCH($A35,INDIRECT(\"'\"&INT((MONTH(A35)-1)/6)+1&IF(INT((MONTH(A35)-1)/6)+1=1,\"ER SEMESTRE \",\"EME SEMESTRE \")&YEAR(A35)&\"'\"&\"!$B$7:$HA$7\"),0)-DAY(A35)-2),MIN(IF((OFFSET(INDIRECT(\"'\"&INT((MONTH(A35)-1)/6)+1&IF(INT((MONTH(A35)-1)/6)+1=1,\"ER SEMESTRE \",\"EME SEMESTRE \")&YEAR(A35)&\"'\"&\"!$B$9:$B$43\"),0,MATCH($A35,INDIRECT(\"'\"&INT((MONTH(A35)-1)/6)+1&IF(INT((MONTH(A35)-1)/6)+1=1,\"ER SEMESTRE \",\"EME SEMESTRE \")&YEAR(A35)&\"'\"&\"!$B$7:$HA$7\"),0)-DAY(A35)-1)=\"(\"&$G$9&\")\")*(INDEX(INDIRECT(\"'\"&INT((MONTH(A35)-1)/6)+1&IF(INT((MONTH(A35)-1)/6)+1=1,\"ER SEMESTRE \",\"EME SEMESTRE \")&YEAR(A35)&\"'\"&\"!$B$9:$HA$43\"),0,MATCH($A35,INDIRECT(\"'\"&INT((MONTH(A35)-1)/6)+1&IF(INT((MONTH(A35)-1)/6)+1=1,\"ER SEMESTRE \",\"EME SEMESTRE \")&YEAR(A35)&\"'\"&\"!$B$7:$HA$7\"),0))=\"J\"),ROW(INDIRECT(\"'\"&INT((MONTH(A35)-1)/6)+1&IF(INT((MONTH(A35)-1)/6)+1=1,\"ER SEMESTRE \",\"EME SEMESTRE \")&YEAR(A35)&\"'\"&\"!$D$9:$D$43\"))-8,9^9))),\"\")=\"\",\n\nIFERROR(\nINDEX(OFFSET(INDIRECT(\"'\"&INT((MONTH(A35)-1)/6)+1&IF(INT((MONTH(A35)-1)/6)+1=1,\"ER SEMESTRE \",\"EME SEMESTRE \")&YEAR(A35)&\"'\"&\"!$B$9:$B$43\"),0,MATCH($A35,INDIRECT(\"'\"&INT((MONTH(A35)-1)/6)+1&IF(INT((MONTH(A35)-1)/6)+1=1,\"ER SEMESTRE \",\"EME SEMESTRE \")&YEAR(A35)&\"'\"&\"!$B$7:$HA$7\"),0)-DAY(A35)-2),\nSMALL(IF((OFFSET(INDIRECT(\"'\"&INT((MONTH(A35)-1)/6)+1&IF(INT((MONTH(A35)-1)/6)+1=1,\"ER SEMESTRE \",\"EME SEMESTRE \")&YEAR(A35)&\"'\"&\"!$B$9:$B$43\"),0,MATCH($A35,INDIRECT(\"'\"&INT((MONTH(A35)-1)/6)+1&IF(INT((MONTH(A35)-1)/6)+1=1,\"ER SEMESTRE \",\"EME SEMESTRE \")&YEAR(A35)&\"'\"&\"!$B$7:$HA$7\"),0)-DAY(A35)-1)=\"(\"&$G$9&\")\")*(INDEX(INDIRECT(\"'\"&INT((MONTH(A35)-1)/6)+1&IF(INT((MONTH(A35)-1)/6)+1=1,\"ER SEMESTRE \",\"EME SEMESTRE \")&YEAR(A35)&\"'\"&\"!$B$9:$HA$43\"),0,MATCH($A35,INDIRECT(\"'\"&INT((MONTH(A35)-1)/6)+1&IF(INT((MONTH(A35)-1)/6)+1=1,\"ER SEMESTRE \",\"EME SEMESTRE \")&YEAR(A35)&\"'\"&\"!$B$7:$HA$7\"),0))=\"R\"),ROW(INDIRECT(\"'\"&INT((MONTH(A35)-1)/6)+1&IF(INT((MONTH(A35)-1)/6)+1=1,\"ER SEMESTRE \",\"EME SEMESTRE \")&YEAR(A35)&\"'\"&\"!D$9:D$43\"))-8,9^9),3)),\"\"),\n\n\nIFERROR(\nINDEX(OFFSET(INDIRECT(\"'\"&INT((MONTH(A35)-1)/6)+1&IF(INT((MONTH(A35)-1)/6)+1=1,\"ER SEMESTRE \",\"EME SEMESTRE \")&YEAR(A35)&\"'\"&\"!$B$9:$B$43\"),0,MATCH($A35,INDIRECT(\"'\"&INT((MONTH(A35)-1)/6)+1&IF(INT((MONTH(A35)-1)/6)+1=1,\"ER SEMESTRE \",\"EME SEMESTRE \")&YEAR(A35)&\"'\"&\"!$B$7:$HA$7\"),0)-DAY(A35)-2),\nSMALL(IF((OFFSET(INDIRECT(\"'\"&INT((MONTH(A35)-1)/6)+1&IF(INT((MONTH(A35)-1)/6)+1=1,\"ER SEMESTRE \",\"EME SEMESTRE \")&YEAR(A35)&\"'\"&\"!$B$9:$B$43\"),0,MATCH($A35,INDIRECT(\"'\"&INT((MONTH(A35)-1)/6)+1&IF(INT((MONTH(A35)-1)/6)+1=1,\"ER SEMESTRE \",\"EME SEMESTRE \")&YEAR(A35)&\"'\"&\"!$B$7:$HA$7\"),0)-DAY(A35)-1)=\"(\"&$G$9&\")\")*(INDEX(INDIRECT(\"'\"&INT((MONTH(A35)-1)/6)+1&IF(INT((MONTH(A35)-1)/6)+1=1,\"ER SEMESTRE \",\"EME SEMESTRE \")&YEAR(A35)&\"'\"&\"!$B$9:$HA$43\"),0,MATCH($A35,INDIRECT(\"'\"&INT((MONTH(A35)-1)/6)+1&IF(INT((MONTH(A35)-1)/6)+1=1,\"ER SEMESTRE \",\"EME SEMESTRE \")&YEAR(A35)&\"'\"&\"!$B$7:$HA$7\"),0))=\"R\"),ROW(INDIRECT(\"'\"&INT((MONTH(A35)-1)/6)+1&IF(INT((MONTH(A35)-1)/6)+1=1,\"ER SEMESTRE \",\"EME SEMESTRE \")&YEAR(A35)&\"'\"&\"!D$9:D$43\"))-8,9^9),2)),\"\")\n\n),\n\n\"\")","v":""}]
["",{"$f":"IFERROR(INDEX([3]PLANNING!$D$3:$Y$29,MATCH('[3]F_Dde de remplacement'!$G$8,[3]PLANNING!$B$3:$B$29,0),MATCH('[3]F_Dde de remplacement'!$A36,[3]PLANNING!$D$2:$Y$2,0)),\"\")","v":""},{"$f":"IF(OR($B36=\"M\",$B36=\"N\",$B36=\"A\"),IFERROR(INDEX(OFFSET(INDIRECT(\"'\"&INT((MONTH(A36)-1)/6)+1&IF(INT((MONTH(A36)-1)/6)+1=1,\"ER SEMESTRE \",\"EME SEMESTRE \")&YEAR(A36)&\"'\"&\"!$B$9:$B$43\"),0,MATCH($A36,INDIRECT(\"'\"&INT((MONTH(A36)-1)/6)+1&IF(INT((MONTH(A36)-1)/6)+1=1,\"ER SEMESTRE \",\"EME SEMESTRE \")&YEAR(A36)&\"'\"&\"!$B$7:$HA$7\"),0)-DAY(A36)-2),MIN(IF((OFFSET(INDIRECT(\"'\"&INT((MONTH(A36)-1)/6)+1&IF(INT((MONTH(A36)-1)/6)+1=1,\"ER SEMESTRE \",\"EME SEMESTRE \")&YEAR(A36)&\"'\"&\"!$B$9:$B$43\"),0,MATCH($A36,INDIRECT(\"'\"&INT((MONTH(A36)-1)/6)+1&IF(INT((MONTH(A36)-1)/6)+1=1,\"ER SEMESTRE \",\"EME SEMESTRE \")&YEAR(A36)&\"'\"&\"!$B$7:$HA$7\"),0)-DAY(A36)-1)=\"(\"&$G$9&\")\")*(INDEX(INDIRECT(\"'\"&INT((MONTH(A36)-1)/6)+1&IF(INT((MONTH(A36)-1)/6)+1=1,\"ER SEMESTRE \",\"EME SEMESTRE \")&YEAR(A36)&\"'\"&\"!$B$9:$HA$43\"),0,MATCH($A36,INDIRECT(\"'\"&INT((MONTH(A36)-1)/6)+1&IF(INT((MONTH(A36)-1)/6)+1=1,\"ER SEMESTRE \",\"EME SEMESTRE \")&YEAR(A36)&\"'\"&\"!$B$7:$HA$7\"),0))=\"J\"),ROW(INDIRECT(\"'\"&INT((MONTH(A36)-1)/6)+1&IF(INT((MONTH(A36)-1)/6)+1=1,\"ER SEMESTRE \",\"EME SEMESTRE \")&YEAR(A36)&\"'\"&\"!$D$9:$D$43\"))-8,9^9))),IFERROR(INDEX(OFFSET(INDIRECT(\"'\"&INT((MONTH(A36)-1)/6)+1&IF(INT((MONTH(A36)-1)/6)+1=1,\"ER SEMESTRE \",\"EME SEMESTRE \")&YEAR(A36)&\"'\"&\"!$B$9:$B$43\"),0,MATCH($A36,INDIRECT(\"'\"&INT((MONTH(A36)-1)/6)+1&IF(INT((MONTH(A36)-1)/6)+1=1,\"ER SEMESTRE \",\"EME SEMESTRE \")&YEAR(A36)&\"'\"&\"!$B$7:$HA$7\"),0)-DAY(A36)-2),MIN(IF((OFFSET(INDIRECT(\"'\"&INT((MONTH(A36)-1)/6)+1&IF(INT((MONTH(A36)-1)/6)+1=1,\"ER SEMESTRE \",\"EME SEMESTRE \")&YEAR(A36)&\"'\"&\"!$B$9:$B$43\"),0,MATCH($A36,INDIRECT(\"'\"&INT((MONTH(A36)-1)/6)+1&IF(INT((MONTH(A36)-1)/6)+1=1,\"ER SEMESTRE \",\"EME SEMESTRE \")&YEAR(A36)&\"'\"&\"!$B$7:$HA$7\"),0)-DAY(A36)-1)=\"(\"&$G$9&\")\")*(INDEX(INDIRECT(\"'\"&INT((MONTH(A36)-1)/6)+1&IF(INT((MONTH(A36)-1)/6)+1=1,\"ER SEMESTRE \",\"EME SEMESTRE \")&YEAR(A36)&\"'\"&\"!$B$9:$HA$43\"),0,MATCH($A36,INDIRECT(\"'\"&INT((MONTH(A36)-1)/6)+1&IF(INT((MONTH(A36)-1)/6)+1=1,\"ER SEMESTRE \",\"EME SEMESTRE \")&YEAR(A36)&\"'\"&\"!$B$7:$HA$7\"),0))=\"R\"),ROW(INDIRECT(\"'\"&INT((MONTH(A36)-1)/6)+1&IF(INT((MONTH(A36)-1)/6)+1=1,\"ER SEMESTRE \",\"EME SEMESTRE \")&YEAR(A36)&\"'\"&\"!$D$9:$D$43\"))-8,9^9))),\"\")),\"\")","v":""},null,{"$f":"IF(OR($B36=\"M\",$B36=\"N\",$B36=\"A\"),IF(\nIFERROR(INDEX(OFFSET(INDIRECT(\"'\"&INT((MONTH(A36)-1)/6)+1&IF(INT((MONTH(A36)-1)/6)+1=1,\"ER SEMESTRE \",\"EME SEMESTRE \")&YEAR(A36)&\"'\"&\"!$B$9:$B$43\"),0,MATCH($A36,INDIRECT(\"'\"&INT((MONTH(A36)-1)/6)+1&IF(INT((MONTH(A36)-1)/6)+1=1,\"ER SEMESTRE \",\"EME SEMESTRE \")&YEAR(A36)&\"'\"&\"!$B$7:$HA$7\"),0)-DAY(A36)-2),MIN(IF((OFFSET(INDIRECT(\"'\"&INT((MONTH(A36)-1)/6)+1&IF(INT((MONTH(A36)-1)/6)+1=1,\"ER SEMESTRE \",\"EME SEMESTRE \")&YEAR(A36)&\"'\"&\"!$B$9:$B$43\"),0,MATCH($A36,INDIRECT(\"'\"&INT((MONTH(A36)-1)/6)+1&IF(INT((MONTH(A36)-1)/6)+1=1,\"ER SEMESTRE \",\"EME SEMESTRE \")&YEAR(A36)&\"'\"&\"!$B$7:$HA$7\"),0)-DAY(A36)-1)=\"(\"&$G$9&\")\")*(INDEX(INDIRECT(\"'\"&INT((MONTH(A36)-1)/6)+1&IF(INT((MONTH(A36)-1)/6)+1=1,\"ER SEMESTRE \",\"EME SEMESTRE \")&YEAR(A36)&\"'\"&\"!$B$9:$HA$43\"),0,MATCH($A36,INDIRECT(\"'\"&INT((MONTH(A36)-1)/6)+1&IF(INT((MONTH(A36)-1)/6)+1=1,\"ER SEMESTRE \",\"EME SEMESTRE \")&YEAR(A36)&\"'\"&\"!$B$7:$HA$7\"),0))=\"J\"),ROW(INDIRECT(\"'\"&INT((MONTH(A36)-1)/6)+1&IF(INT((MONTH(A36)-1)/6)+1=1,\"ER SEMESTRE \",\"EME SEMESTRE \")&YEAR(A36)&\"'\"&\"!$D$9:$D$43\"))-8,9^9))),\"\")=\"\",\n\nIFERROR(INDEX(OFFSET(INDIRECT(\"'\"&INT((MONTH(A36)-1)/6)+1&IF(INT((MONTH(A36)-1)/6)+1=1,\"ER SEMESTRE \",\"EME SEMESTRE \")&YEAR(A36)&\"'\"&\"!$B$9:$B$43\"),0,MATCH($A36,INDIRECT(\"'\"&INT((MONTH(A36)-1)/6)+1&IF(INT((MONTH(A36)-1)/6)+1=1,\"ER SEMESTRE \",\"EME SEMESTRE \")&YEAR(A36)&\"'\"&\"!$B$7:$HA$7\"),0)-DAY(A36)-2),SMALL(IF((OFFSET(INDIRECT(\"'\"&INT((MONTH(A36)-1)/6)+1&IF(INT((MONTH(A36)-1)/6)+1=1,\"ER SEMESTRE \",\"EME SEMESTRE \")&YEAR(A36)&\"'\"&\"!$B$9:$B$43\"),0,MATCH($A36,INDIRECT(\"'\"&INT((MONTH(A36)-1)/6)+1&IF(INT((MONTH(A36)-1)/6)+1=1,\"ER SEMESTRE \",\"EME SEMESTRE \")&YEAR(A36)&\"'\"&\"!$B$7:$HA$7\"),0)-DAY(A36)-1)=\"(\"&$G$9&\")\")*(INDEX(INDIRECT(\"'\"&INT((MONTH(A36)-1)/6)+1&IF(INT((MONTH(A36)-1)/6)+1=1,\"ER SEMESTRE \",\"EME SEMESTRE \")&YEAR(A36)&\"'\"&\"!$B$9:$HA$43\"),0,MATCH($A36,INDIRECT(\"'\"&INT((MONTH(A36)-1)/6)+1&IF(INT((MONTH(A36)-1)/6)+1=1,\"ER SEMESTRE \",\"EME SEMESTRE \")&YEAR(A36)&\"'\"&\"!$B$7:$HA$7\"),0))=\"R\"),ROW(INDIRECT(\"'\"&INT((MONTH(A36)-1)/6)+1&IF(INT((MONTH(A36)-1)/6)+1=1,\"ER SEMESTRE \",\"EME SEMESTRE \")&YEAR(A36)&\"'\"&\"!D$9:D$43\"))-8,9^9),2)),\"\"),\n\nIFERROR(\nINDEX(\nOFFSET(INDIRECT(\"'\"&INT((MONTH(A36)-1)/6)+1&IF(INT((MONTH(A36)-1)/6)+1=1,\"ER SEMESTRE \",\"EME SEMESTRE \")&YEAR(A36)&\"'\"&\"!$B$9:$B$43\"),0,MATCH($A36,INDIRECT(\"'\"&INT((MONTH(A36)-1)/6)+1&IF(INT((MONTH(A36)-1)/6)+1=1,\"ER SEMESTRE \",\"EME SEMESTRE \")&YEAR(A36)&\"'\"&\"!$B$7:$HA$7\"),0)-DAY(A36)-2),\n\nMIN(IF(\n(OFFSET(INDIRECT(\"'\"&INT((MONTH(A36)-1)/6)+1&IF(INT((MONTH(A36)-1)/6)+1=1,\"ER SEMESTRE \",\"EME SEMESTRE \")&YEAR(A36)&\"'\"&\"!$B$9:$B$43\"),0,MATCH($A36,INDIRECT(\"'\"&INT((MONTH(A36)-1)/6)+1&IF(INT((MONTH(A36)-1)/6)+1=1,\"ER SEMESTRE \",\"EME SEMESTRE \")&YEAR(A36)&\"'\"&\"!$B$7:$HA$7\"),0)-DAY(A36)-1)=\"(\"&$G$9&\")\")\n*\n(INDEX(INDIRECT(\"'\"&INT((MONTH(A36)-1)/6)+1&IF(INT((MONTH(A36)-1)/6)+1=1,\"ER SEMESTRE \",\"EME SEMESTRE \")&YEAR(A36)&\"'\"&\"!$B$9:$HA$43\"),0,MATCH($A36,INDIRECT(\"'\"&INT((MONTH(A36)-1)/6)+1&IF(INT((MONTH(A36)-1)/6)+1=1,\"ER SEMESTRE \",\"EME SEMESTRE \")&YEAR(A36)&\"'\"&\"!$B$7:$HA$7\"),0))=\"R\"),\n\nROW(INDIRECT(\"'\"&INT((MONTH(A36)-1)/6)+1&IF(INT((MONTH(A36)-1)/6)+1=1,\"ER SEMESTRE \",\"EME SEMESTRE \")&YEAR(A36)&\"'\"&\"!D$9:D$43\"))-8,\n\n9^9))),\"\")),\"\")","v":""},null,{"$f":"IF(OR($B36=\"M\",$B36=\"N\",$B36=\"A\"),IF(\n\nIFERROR(INDEX(OFFSET(INDIRECT(\"'\"&INT((MONTH(A36)-1)/6)+1&IF(INT((MONTH(A36)-1)/6)+1=1,\"ER SEMESTRE \",\"EME SEMESTRE \")&YEAR(A36)&\"'\"&\"!$B$9:$B$43\"),0,MATCH($A36,INDIRECT(\"'\"&INT((MONTH(A36)-1)/6)+1&IF(INT((MONTH(A36)-1)/6)+1=1,\"ER SEMESTRE \",\"EME SEMESTRE \")&YEAR(A36)&\"'\"&\"!$B$7:$HA$7\"),0)-DAY(A36)-2),MIN(IF((OFFSET(INDIRECT(\"'\"&INT((MONTH(A36)-1)/6)+1&IF(INT((MONTH(A36)-1)/6)+1=1,\"ER SEMESTRE \",\"EME SEMESTRE \")&YEAR(A36)&\"'\"&\"!$B$9:$B$43\"),0,MATCH($A36,INDIRECT(\"'\"&INT((MONTH(A36)-1)/6)+1&IF(INT((MONTH(A36)-1)/6)+1=1,\"ER SEMESTRE \",\"EME SEMESTRE \")&YEAR(A36)&\"'\"&\"!$B$7:$HA$7\"),0)-DAY(A36)-1)=\"(\"&$G$9&\")\")*(INDEX(INDIRECT(\"'\"&INT((MONTH(A36)-1)/6)+1&IF(INT((MONTH(A36)-1)/6)+1=1,\"ER SEMESTRE \",\"EME SEMESTRE \")&YEAR(A36)&\"'\"&\"!$B$9:$HA$43\"),0,MATCH($A36,INDIRECT(\"'\"&INT((MONTH(A36)-1)/6)+1&IF(INT((MONTH(A36)-1)/6)+1=1,\"ER SEMESTRE \",\"EME SEMESTRE \")&YEAR(A36)&\"'\"&\"!$B$7:$HA$7\"),0))=\"J\"),ROW(INDIRECT(\"'\"&INT((MONTH(A36)-1)/6)+1&IF(INT((MONTH(A36)-1)/6)+1=1,\"ER SEMESTRE \",\"EME SEMESTRE \")&YEAR(A36)&\"'\"&\"!$D$9:$D$43\"))-8,9^9))),\"\")=\"\",\n\nIFERROR(\nINDEX(OFFSET(INDIRECT(\"'\"&INT((MONTH(A36)-1)/6)+1&IF(INT((MONTH(A36)-1)/6)+1=1,\"ER SEMESTRE \",\"EME SEMESTRE \")&YEAR(A36)&\"'\"&\"!$B$9:$B$43\"),0,MATCH($A36,INDIRECT(\"'\"&INT((MONTH(A36)-1)/6)+1&IF(INT((MONTH(A36)-1)/6)+1=1,\"ER SEMESTRE \",\"EME SEMESTRE \")&YEAR(A36)&\"'\"&\"!$B$7:$HA$7\"),0)-DAY(A36)-2),\nSMALL(IF((OFFSET(INDIRECT(\"'\"&INT((MONTH(A36)-1)/6)+1&IF(INT((MONTH(A36)-1)/6)+1=1,\"ER SEMESTRE \",\"EME SEMESTRE \")&YEAR(A36)&\"'\"&\"!$B$9:$B$43\"),0,MATCH($A36,INDIRECT(\"'\"&INT((MONTH(A36)-1)/6)+1&IF(INT((MONTH(A36)-1)/6)+1=1,\"ER SEMESTRE \",\"EME SEMESTRE \")&YEAR(A36)&\"'\"&\"!$B$7:$HA$7\"),0)-DAY(A36)-1)=\"(\"&$G$9&\")\")*(INDEX(INDIRECT(\"'\"&INT((MONTH(A36)-1)/6)+1&IF(INT((MONTH(A36)-1)/6)+1=1,\"ER SEMESTRE \",\"EME SEMESTRE \")&YEAR(A36)&\"'\"&\"!$B$9:$HA$43\"),0,MATCH($A36,INDIRECT(\"'\"&INT((MONTH(A36)-1)/6)+1&IF(INT((MONTH(A36)-1)/6)+1=1,\"ER SEMESTRE \",\"EME SEMESTRE \")&YEAR(A36)&\"'\"&\"!$B$7:$HA$7\"),0))=\"R\"),ROW(INDIRECT(\"'\"&INT((MONTH(A36)-1)/6)+1&IF(INT((MONTH(A36)-1)/6)+1=1,\"ER SEMESTRE \",\"EME SEMESTRE \")&YEAR(A36)&\"'\"&\"!D$9:D$43\"))-8,9^9),3)),\"\"),\n\n\nIFERROR(\nINDEX(OFFSET(INDIRECT(\"'\"&INT((MONTH(A36)-1)/6)+1&IF(INT((MONTH(A36)-1)/6)+1=1,\"ER SEMESTRE \",\"EME SEMESTRE \")&YEAR(A36)&\"'\"&\"!$B$9:$B$43\"),0,MATCH($A36,INDIRECT(\"'\"&INT((MONTH(A36)-1)/6)+1&IF(INT((MONTH(A36)-1)/6)+1=1,\"ER SEMESTRE \",\"EME SEMESTRE \")&YEAR(A36)&\"'\"&\"!$B$7:$HA$7\"),0)-DAY(A36)-2),\nSMALL(IF((OFFSET(INDIRECT(\"'\"&INT((MONTH(A36)-1)/6)+1&IF(INT((MONTH(A36)-1)/6)+1=1,\"ER SEMESTRE \",\"EME SEMESTRE \")&YEAR(A36)&\"'\"&\"!$B$9:$B$43\"),0,MATCH($A36,INDIRECT(\"'\"&INT((MONTH(A36)-1)/6)+1&IF(INT((MONTH(A36)-1)/6)+1=1,\"ER SEMESTRE \",\"EME SEMESTRE \")&YEAR(A36)&\"'\"&\"!$B$7:$HA$7\"),0)-DAY(A36)-1)=\"(\"&$G$9&\")\")*(INDEX(INDIRECT(\"'\"&INT((MONTH(A36)-1)/6)+1&IF(INT((MONTH(A36)-1)/6)+1=1,\"ER SEMESTRE \",\"EME SEMESTRE \")&YEAR(A36)&\"'\"&\"!$B$9:$HA$43\"),0,MATCH($A36,INDIRECT(\"'\"&INT((MONTH(A36)-1)/6)+1&IF(INT((MONTH(A36)-1)/6)+1=1,\"ER SEMESTRE \",\"EME SEMESTRE \")&YEAR(A36)&\"'\"&\"!$B$7:$HA$7\"),0))=\"R\"),ROW(INDIRECT(\"'\"&INT((MONTH(A36)-1)/6)+1&IF(INT((MONTH(A36)-1)/6)+1=1,\"ER SEMESTRE \",\"EME SEMESTRE \")&YEAR(A36)&\"'\"&\"!D$9:D$43\"))-8,9^9),2)),\"\")\n\n),\n\n\"\")","v":""}]
["",{"$f":"IFERROR(INDEX([3]PLANNING!$D$3:$Y$29,MATCH('[3]F_Dde de remplacement'!$G$8,[3]PLANNING!$B$3:$B$29,0),MATCH('[3]F_Dde de remplacement'!$A37,[3]PLANNING!$D$2:$Y$2,0)),\"\")","v":""},{"$f":"IF(OR($B37=\"M\",$B37=\"N\",$B37=\"A\"),IFERROR(INDEX(OFFSET(INDIRECT(\"'\"&INT((MONTH(A37)-1)/6)+1&IF(INT((MONTH(A37)-1)/6)+1=1,\"ER SEMESTRE \",\"EME SEMESTRE \")&YEAR(A37)&\"'\"&\"!$B$9:$B$43\"),0,MATCH($A37,INDIRECT(\"'\"&INT((MONTH(A37)-1)/6)+1&IF(INT((MONTH(A37)-1)/6)+1=1,\"ER SEMESTRE \",\"EME SEMESTRE \")&YEAR(A37)&\"'\"&\"!$B$7:$HA$7\"),0)-DAY(A37)-2),MIN(IF((OFFSET(INDIRECT(\"'\"&INT((MONTH(A37)-1)/6)+1&IF(INT((MONTH(A37)-1)/6)+1=1,\"ER SEMESTRE \",\"EME SEMESTRE \")&YEAR(A37)&\"'\"&\"!$B$9:$B$43\"),0,MATCH($A37,INDIRECT(\"'\"&INT((MONTH(A37)-1)/6)+1&IF(INT((MONTH(A37)-1)/6)+1=1,\"ER SEMESTRE \",\"EME SEMESTRE \")&YEAR(A37)&\"'\"&\"!$B$7:$HA$7\"),0)-DAY(A37)-1)=\"(\"&$G$9&\")\")*(INDEX(INDIRECT(\"'\"&INT((MONTH(A37)-1)/6)+1&IF(INT((MONTH(A37)-1)/6)+1=1,\"ER SEMESTRE \",\"EME SEMESTRE \")&YEAR(A37)&\"'\"&\"!$B$9:$HA$43\"),0,MATCH($A37,INDIRECT(\"'\"&INT((MONTH(A37)-1)/6)+1&IF(INT((MONTH(A37)-1)/6)+1=1,\"ER SEMESTRE \",\"EME SEMESTRE \")&YEAR(A37)&\"'\"&\"!$B$7:$HA$7\"),0))=\"J\"),ROW(INDIRECT(\"'\"&INT((MONTH(A37)-1)/6)+1&IF(INT((MONTH(A37)-1)/6)+1=1,\"ER SEMESTRE \",\"EME SEMESTRE \")&YEAR(A37)&\"'\"&\"!$D$9:$D$43\"))-8,9^9))),IFERROR(INDEX(OFFSET(INDIRECT(\"'\"&INT((MONTH(A37)-1)/6)+1&IF(INT((MONTH(A37)-1)/6)+1=1,\"ER SEMESTRE \",\"EME SEMESTRE \")&YEAR(A37)&\"'\"&\"!$B$9:$B$43\"),0,MATCH($A37,INDIRECT(\"'\"&INT((MONTH(A37)-1)/6)+1&IF(INT((MONTH(A37)-1)/6)+1=1,\"ER SEMESTRE \",\"EME SEMESTRE \")&YEAR(A37)&\"'\"&\"!$B$7:$HA$7\"),0)-DAY(A37)-2),MIN(IF((OFFSET(INDIRECT(\"'\"&INT((MONTH(A37)-1)/6)+1&IF(INT((MONTH(A37)-1)/6)+1=1,\"ER SEMESTRE \",\"EME SEMESTRE \")&YEAR(A37)&\"'\"&\"!$B$9:$B$43\"),0,MATCH($A37,INDIRECT(\"'\"&INT((MONTH(A37)-1)/6)+1&IF(INT((MONTH(A37)-1)/6)+1=1,\"ER SEMESTRE \",\"EME SEMESTRE \")&YEAR(A37)&\"'\"&\"!$B$7:$HA$7\"),0)-DAY(A37)-1)=\"(\"&$G$9&\")\")*(INDEX(INDIRECT(\"'\"&INT((MONTH(A37)-1)/6)+1&IF(INT((MONTH(A37)-1)/6)+1=1,\"ER SEMESTRE \",\"EME SEMESTRE \")&YEAR(A37)&\"'\"&\"!$B$9:$HA$43\"),0,MATCH($A37,INDIRECT(\"'\"&INT((MONTH(A37)-1)/6)+1&IF(INT((MONTH(A37)-1)/6)+1=1,\"ER SEMESTRE \",\"EME SEMESTRE \")&YEAR(A37)&\"'\"&\"!$B$7:$HA$7\"),0))=\"R\"),ROW(INDIRECT(\"'\"&INT((MONTH(A37)-1)/6)+1&IF(INT((MONTH(A37)-1)/6)+1=1,\"ER SEMESTRE \",\"EME SEMESTRE \")&YEAR(A37)&\"'\"&\"!$D$9:$D$43\"))-8,9^9))),\"\")),\"\")","v":""},null,{"$f":"IF(OR($B37=\"M\",$B37=\"N\",$B37=\"A\"),IF(\nIFERROR(INDEX(OFFSET(INDIRECT(\"'\"&INT((MONTH(A37)-1)/6)+1&IF(INT((MONTH(A37)-1)/6)+1=1,\"ER SEMESTRE \",\"EME SEMESTRE \")&YEAR(A37)&\"'\"&\"!$B$9:$B$43\"),0,MATCH($A37,INDIRECT(\"'\"&INT((MONTH(A37)-1)/6)+1&IF(INT((MONTH(A37)-1)/6)+1=1,\"ER SEMESTRE \",\"EME SEMESTRE \")&YEAR(A37)&\"'\"&\"!$B$7:$HA$7\"),0)-DAY(A37)-2),MIN(IF((OFFSET(INDIRECT(\"'\"&INT((MONTH(A37)-1)/6)+1&IF(INT((MONTH(A37)-1)/6)+1=1,\"ER SEMESTRE \",\"EME SEMESTRE \")&YEAR(A37)&\"'\"&\"!$B$9:$B$43\"),0,MATCH($A37,INDIRECT(\"'\"&INT((MONTH(A37)-1)/6)+1&IF(INT((MONTH(A37)-1)/6)+1=1,\"ER SEMESTRE \",\"EME SEMESTRE \")&YEAR(A37)&\"'\"&\"!$B$7:$HA$7\"),0)-DAY(A37)-1)=\"(\"&$G$9&\")\")*(INDEX(INDIRECT(\"'\"&INT((MONTH(A37)-1)/6)+1&IF(INT((MONTH(A37)-1)/6)+1=1,\"ER SEMESTRE \",\"EME SEMESTRE \")&YEAR(A37)&\"'\"&\"!$B$9:$HA$43\"),0,MATCH($A37,INDIRECT(\"'\"&INT((MONTH(A37)-1)/6)+1&IF(INT((MONTH(A37)-1)/6)+1=1,\"ER SEMESTRE \",\"EME SEMESTRE \")&YEAR(A37)&\"'\"&\"!$B$7:$HA$7\"),0))=\"J\"),ROW(INDIRECT(\"'\"&INT((MONTH(A37)-1)/6)+1&IF(INT((MONTH(A37)-1)/6)+1=1,\"ER SEMESTRE \",\"EME SEMESTRE \")&YEAR(A37)&\"'\"&\"!$D$9:$D$43\"))-8,9^9))),\"\")=\"\",\n\nIFERROR(INDEX(OFFSET(INDIRECT(\"'\"&INT((MONTH(A37)-1)/6)+1&IF(INT((MONTH(A37)-1)/6)+1=1,\"ER SEMESTRE \",\"EME SEMESTRE \")&YEAR(A37)&\"'\"&\"!$B$9:$B$43\"),0,MATCH($A37,INDIRECT(\"'\"&INT((MONTH(A37)-1)/6)+1&IF(INT((MONTH(A37)-1)/6)+1=1,\"ER SEMESTRE \",\"EME SEMESTRE \")&YEAR(A37)&\"'\"&\"!$B$7:$HA$7\"),0)-DAY(A37)-2),SMALL(IF((OFFSET(INDIRECT(\"'\"&INT((MONTH(A37)-1)/6)+1&IF(INT((MONTH(A37)-1)/6)+1=1,\"ER SEMESTRE \",\"EME SEMESTRE \")&YEAR(A37)&\"'\"&\"!$B$9:$B$43\"),0,MATCH($A37,INDIRECT(\"'\"&INT((MONTH(A37)-1)/6)+1&IF(INT((MONTH(A37)-1)/6)+1=1,\"ER SEMESTRE \",\"EME SEMESTRE \")&YEAR(A37)&\"'\"&\"!$B$7:$HA$7\"),0)-DAY(A37)-1)=\"(\"&$G$9&\")\")*(INDEX(INDIRECT(\"'\"&INT((MONTH(A37)-1)/6)+1&IF(INT((MONTH(A37)-1)/6)+1=1,\"ER SEMESTRE \",\"EME SEMESTRE \")&YEAR(A37)&\"'\"&\"!$B$9:$HA$43\"),0,MATCH($A37,INDIRECT(\"'\"&INT((MONTH(A37)-1)/6)+1&IF(INT((MONTH(A37)-1)/6)+1=1,\"ER SEMESTRE \",\"EME SEMESTRE \")&YEAR(A37)&\"'\"&\"!$B$7:$HA$7\"),0))=\"R\"),ROW(INDIRECT(\"'\"&INT((MONTH(A37)-1)/6)+1&IF(INT((MONTH(A37)-1)/6)+1=1,\"ER SEMESTRE \",\"EME SEMESTRE \")&YEAR(A37)&\"'\"&\"!D$9:D$43\"))-8,9^9),2)),\"\"),\n\nIFERROR(\nINDEX(\nOFFSET(INDIRECT(\"'\"&INT((MONTH(A37)-1)/6)+1&IF(INT((MONTH(A37)-1)/6)+1=1,\"ER SEMESTRE \",\"EME SEMESTRE \")&YEAR(A37)&\"'\"&\"!$B$9:$B$43\"),0,MATCH($A37,INDIRECT(\"'\"&INT((MONTH(A37)-1)/6)+1&IF(INT((MONTH(A37)-1)/6)+1=1,\"ER SEMESTRE \",\"EME SEMESTRE \")&YEAR(A37)&\"'\"&\"!$B$7:$HA$7\"),0)-DAY(A37)-2),\n\nMIN(IF(\n(OFFSET(INDIRECT(\"'\"&INT((MONTH(A37)-1)/6)+1&IF(INT((MONTH(A37)-1)/6)+1=1,\"ER SEMESTRE \",\"EME SEMESTRE \")&YEAR(A37)&\"'\"&\"!$B$9:$B$43\"),0,MATCH($A37,INDIRECT(\"'\"&INT((MONTH(A37)-1)/6)+1&IF(INT((MONTH(A37)-1)/6)+1=1,\"ER SEMESTRE \",\"EME SEMESTRE \")&YEAR(A37)&\"'\"&\"!$B$7:$HA$7\"),0)-DAY(A37)-1)=\"(\"&$G$9&\")\")\n*\n(INDEX(INDIRECT(\"'\"&INT((MONTH(A37)-1)/6)+1&IF(INT((MONTH(A37)-1)/6)+1=1,\"ER SEMESTRE \",\"EME SEMESTRE \")&YEAR(A37)&\"'\"&\"!$B$9:$HA$43\"),0,MATCH($A37,INDIRECT(\"'\"&INT((MONTH(A37)-1)/6)+1&IF(INT((MONTH(A37)-1)/6)+1=1,\"ER SEMESTRE \",\"EME SEMESTRE \")&YEAR(A37)&\"'\"&\"!$B$7:$HA$7\"),0))=\"R\"),\n\nROW(INDIRECT(\"'\"&INT((MONTH(A37)-1)/6)+1&IF(INT((MONTH(A37)-1)/6)+1=1,\"ER SEMESTRE \",\"EME SEMESTRE \")&YEAR(A37)&\"'\"&\"!D$9:D$43\"))-8,\n\n9^9))),\"\")),\"\")","v":""},null,{"$f":"IF(OR($B37=\"M\",$B37=\"N\",$B37=\"A\"),IF(\n\nIFERROR(INDEX(OFFSET(INDIRECT(\"'\"&INT((MONTH(A37)-1)/6)+1&IF(INT((MONTH(A37)-1)/6)+1=1,\"ER SEMESTRE \",\"EME SEMESTRE \")&YEAR(A37)&\"'\"&\"!$B$9:$B$43\"),0,MATCH($A37,INDIRECT(\"'\"&INT((MONTH(A37)-1)/6)+1&IF(INT((MONTH(A37)-1)/6)+1=1,\"ER SEMESTRE \",\"EME SEMESTRE \")&YEAR(A37)&\"'\"&\"!$B$7:$HA$7\"),0)-DAY(A37)-2),MIN(IF((OFFSET(INDIRECT(\"'\"&INT((MONTH(A37)-1)/6)+1&IF(INT((MONTH(A37)-1)/6)+1=1,\"ER SEMESTRE \",\"EME SEMESTRE \")&YEAR(A37)&\"'\"&\"!$B$9:$B$43\"),0,MATCH($A37,INDIRECT(\"'\"&INT((MONTH(A37)-1)/6)+1&IF(INT((MONTH(A37)-1)/6)+1=1,\"ER SEMESTRE \",\"EME SEMESTRE \")&YEAR(A37)&\"'\"&\"!$B$7:$HA$7\"),0)-DAY(A37)-1)=\"(\"&$G$9&\")\")*(INDEX(INDIRECT(\"'\"&INT((MONTH(A37)-1)/6)+1&IF(INT((MONTH(A37)-1)/6)+1=1,\"ER SEMESTRE \",\"EME SEMESTRE \")&YEAR(A37)&\"'\"&\"!$B$9:$HA$43\"),0,MATCH($A37,INDIRECT(\"'\"&INT((MONTH(A37)-1)/6)+1&IF(INT((MONTH(A37)-1)/6)+1=1,\"ER SEMESTRE \",\"EME SEMESTRE \")&YEAR(A37)&\"'\"&\"!$B$7:$HA$7\"),0))=\"J\"),ROW(INDIRECT(\"'\"&INT((MONTH(A37)-1)/6)+1&IF(INT((MONTH(A37)-1)/6)+1=1,\"ER SEMESTRE \",\"EME SEMESTRE \")&YEAR(A37)&\"'\"&\"!$D$9:$D$43\"))-8,9^9))),\"\")=\"\",\n\nIFERROR(\nINDEX(OFFSET(INDIRECT(\"'\"&INT((MONTH(A37)-1)/6)+1&IF(INT((MONTH(A37)-1)/6)+1=1,\"ER SEMESTRE \",\"EME SEMESTRE \")&YEAR(A37)&\"'\"&\"!$B$9:$B$43\"),0,MATCH($A37,INDIRECT(\"'\"&INT((MONTH(A37)-1)/6)+1&IF(INT((MONTH(A37)-1)/6)+1=1,\"ER SEMESTRE \",\"EME SEMESTRE \")&YEAR(A37)&\"'\"&\"!$B$7:$HA$7\"),0)-DAY(A37)-2),\nSMALL(IF((OFFSET(INDIRECT(\"'\"&INT((MONTH(A37)-1)/6)+1&IF(INT((MONTH(A37)-1)/6)+1=1,\"ER SEMESTRE \",\"EME SEMESTRE \")&YEAR(A37)&\"'\"&\"!$B$9:$B$43\"),0,MATCH($A37,INDIRECT(\"'\"&INT((MONTH(A37)-1)/6)+1&IF(INT((MONTH(A37)-1)/6)+1=1,\"ER SEMESTRE \",\"EME SEMESTRE \")&YEAR(A37)&\"'\"&\"!$B$7:$HA$7\"),0)-DAY(A37)-1)=\"(\"&$G$9&\")\")*(INDEX(INDIRECT(\"'\"&INT((MONTH(A37)-1)/6)+1&IF(INT((MONTH(A37)-1)/6)+1=1,\"ER SEMESTRE \",\"EME SEMESTRE \")&YEAR(A37)&\"'\"&\"!$B$9:$HA$43\"),0,MATCH($A37,INDIRECT(\"'\"&INT((MONTH(A37)-1)/6)+1&IF(INT((MONTH(A37)-1)/6)+1=1,\"ER SEMESTRE \",\"EME SEMESTRE \")&YEAR(A37)&\"'\"&\"!$B$7:$HA$7\"),0))=\"R\"),ROW(INDIRECT(\"'\"&INT((MONTH(A37)-1)/6)+1&IF(INT((MONTH(A37)-1)/6)+1=1,\"ER SEMESTRE \",\"EME SEMESTRE \")&YEAR(A37)&\"'\"&\"!D$9:D$43\"))-8,9^9),3)),\"\"),\n\n\nIFERROR(\nINDEX(OFFSET(INDIRECT(\"'\"&INT((MONTH(A37)-1)/6)+1&IF(INT((MONTH(A37)-1)/6)+1=1,\"ER SEMESTRE \",\"EME SEMESTRE \")&YEAR(A37)&\"'\"&\"!$B$9:$B$43\"),0,MATCH($A37,INDIRECT(\"'\"&INT((MONTH(A37)-1)/6)+1&IF(INT((MONTH(A37)-1)/6)+1=1,\"ER SEMESTRE \",\"EME SEMESTRE \")&YEAR(A37)&\"'\"&\"!$B$7:$HA$7\"),0)-DAY(A37)-2),\nSMALL(IF((OFFSET(INDIRECT(\"'\"&INT((MONTH(A37)-1)/6)+1&IF(INT((MONTH(A37)-1)/6)+1=1,\"ER SEMESTRE \",\"EME SEMESTRE \")&YEAR(A37)&\"'\"&\"!$B$9:$B$43\"),0,MATCH($A37,INDIRECT(\"'\"&INT((MONTH(A37)-1)/6)+1&IF(INT((MONTH(A37)-1)/6)+1=1,\"ER SEMESTRE \",\"EME SEMESTRE \")&YEAR(A37)&\"'\"&\"!$B$7:$HA$7\"),0)-DAY(A37)-1)=\"(\"&$G$9&\")\")*(INDEX(INDIRECT(\"'\"&INT((MONTH(A37)-1)/6)+1&IF(INT((MONTH(A37)-1)/6)+1=1,\"ER SEMESTRE \",\"EME SEMESTRE \")&YEAR(A37)&\"'\"&\"!$B$9:$HA$43\"),0,MATCH($A37,INDIRECT(\"'\"&INT((MONTH(A37)-1)/6)+1&IF(INT((MONTH(A37)-1)/6)+1=1,\"ER SEMESTRE \",\"EME SEMESTRE \")&YEAR(A37)&\"'\"&\"!$B$7:$HA$7\"),0))=\"R\"),ROW(INDIRECT(\"'\"&INT((MONTH(A37)-1)/6)+1&IF(INT((MONTH(A37)-1)/6)+1=1,\"ER SEMESTRE \",\"EME SEMESTRE \")&YEAR(A37)&\"'\"&\"!D$9:D$43\"))-8,9^9),2)),\"\")\n\n),\n\n\"\")","v":""}]
["",{"$f":"IFERROR(INDEX([3]PLANNING!$D$3:$Y$29,MATCH('[3]F_Dde de remplacement'!$G$8,[3]PLANNING!$B$3:$B$29,0),MATCH('[3]F_Dde de remplacement'!$A38,[3]PLANNING!$D$2:$Y$2,0)),\"\")","v":""},{"$f":"IF(OR($B38=\"M\",$B38=\"N\",$B38=\"A\"),IFERROR(INDEX(OFFSET(INDIRECT(\"'\"&INT((MONTH(A38)-1)/6)+1&IF(INT((MONTH(A38)-1)/6)+1=1,\"ER SEMESTRE \",\"EME SEMESTRE \")&YEAR(A38)&\"'\"&\"!$B$9:$B$43\"),0,MATCH($A38,INDIRECT(\"'\"&INT((MONTH(A38)-1)/6)+1&IF(INT((MONTH(A38)-1)/6)+1=1,\"ER SEMESTRE \",\"EME SEMESTRE \")&YEAR(A38)&\"'\"&\"!$B$7:$HA$7\"),0)-DAY(A38)-2),MIN(IF((OFFSET(INDIRECT(\"'\"&INT((MONTH(A38)-1)/6)+1&IF(INT((MONTH(A38)-1)/6)+1=1,\"ER SEMESTRE \",\"EME SEMESTRE \")&YEAR(A38)&\"'\"&\"!$B$9:$B$43\"),0,MATCH($A38,INDIRECT(\"'\"&INT((MONTH(A38)-1)/6)+1&IF(INT((MONTH(A38)-1)/6)+1=1,\"ER SEMESTRE \",\"EME SEMESTRE \")&YEAR(A38)&\"'\"&\"!$B$7:$HA$7\"),0)-DAY(A38)-1)=\"(\"&$G$9&\")\")*(INDEX(INDIRECT(\"'\"&INT((MONTH(A38)-1)/6)+1&IF(INT((MONTH(A38)-1)/6)+1=1,\"ER SEMESTRE \",\"EME SEMESTRE \")&YEAR(A38)&\"'\"&\"!$B$9:$HA$43\"),0,MATCH($A38,INDIRECT(\"'\"&INT((MONTH(A38)-1)/6)+1&IF(INT((MONTH(A38)-1)/6)+1=1,\"ER SEMESTRE \",\"EME SEMESTRE \")&YEAR(A38)&\"'\"&\"!$B$7:$HA$7\"),0))=\"J\"),ROW(INDIRECT(\"'\"&INT((MONTH(A38)-1)/6)+1&IF(INT((MONTH(A38)-1)/6)+1=1,\"ER SEMESTRE \",\"EME SEMESTRE \")&YEAR(A38)&\"'\"&\"!$D$9:$D$43\"))-8,9^9))),IFERROR(INDEX(OFFSET(INDIRECT(\"'\"&INT((MONTH(A38)-1)/6)+1&IF(INT((MONTH(A38)-1)/6)+1=1,\"ER SEMESTRE \",\"EME SEMESTRE \")&YEAR(A38)&\"'\"&\"!$B$9:$B$43\"),0,MATCH($A38,INDIRECT(\"'\"&INT((MONTH(A38)-1)/6)+1&IF(INT((MONTH(A38)-1)/6)+1=1,\"ER SEMESTRE \",\"EME SEMESTRE \")&YEAR(A38)&\"'\"&\"!$B$7:$HA$7\"),0)-DAY(A38)-2),MIN(IF((OFFSET(INDIRECT(\"'\"&INT((MONTH(A38)-1)/6)+1&IF(INT((MONTH(A38)-1)/6)+1=1,\"ER SEMESTRE \",\"EME SEMESTRE \")&YEAR(A38)&\"'\"&\"!$B$9:$B$43\"),0,MATCH($A38,INDIRECT(\"'\"&INT((MONTH(A38)-1)/6)+1&IF(INT((MONTH(A38)-1)/6)+1=1,\"ER SEMESTRE \",\"EME SEMESTRE \")&YEAR(A38)&\"'\"&\"!$B$7:$HA$7\"),0)-DAY(A38)-1)=\"(\"&$G$9&\")\")*(INDEX(INDIRECT(\"'\"&INT((MONTH(A38)-1)/6)+1&IF(INT((MONTH(A38)-1)/6)+1=1,\"ER SEMESTRE \",\"EME SEMESTRE \")&YEAR(A38)&\"'\"&\"!$B$9:$HA$43\"),0,MATCH($A38,INDIRECT(\"'\"&INT((MONTH(A38)-1)/6)+1&IF(INT((MONTH(A38)-1)/6)+1=1,\"ER SEMESTRE \",\"EME SEMESTRE \")&YEAR(A38)&\"'\"&\"!$B$7:$HA$7\"),0))=\"R\"),ROW(INDIRECT(\"'\"&INT((MONTH(A38)-1)/6)+1&IF(INT((MONTH(A38)-1)/6)+1=1,\"ER SEMESTRE \",\"EME SEMESTRE \")&YEAR(A38)&\"'\"&\"!$D$9:$D$43\"))-8,9^9))),\"\")),\"\")","v":""},null,{"$f":"IF(OR($B38=\"M\",$B38=\"N\",$B38=\"A\"),IF(\nIFERROR(INDEX(OFFSET(INDIRECT(\"'\"&INT((MONTH(A38)-1)/6)+1&IF(INT((MONTH(A38)-1)/6)+1=1,\"ER SEMESTRE \",\"EME SEMESTRE \")&YEAR(A38)&\"'\"&\"!$B$9:$B$43\"),0,MATCH($A38,INDIRECT(\"'\"&INT((MONTH(A38)-1)/6)+1&IF(INT((MONTH(A38)-1)/6)+1=1,\"ER SEMESTRE \",\"EME SEMESTRE \")&YEAR(A38)&\"'\"&\"!$B$7:$HA$7\"),0)-DAY(A38)-2),MIN(IF((OFFSET(INDIRECT(\"'\"&INT((MONTH(A38)-1)/6)+1&IF(INT((MONTH(A38)-1)/6)+1=1,\"ER SEMESTRE \",\"EME SEMESTRE \")&YEAR(A38)&\"'\"&\"!$B$9:$B$43\"),0,MATCH($A38,INDIRECT(\"'\"&INT((MONTH(A38)-1)/6)+1&IF(INT((MONTH(A38)-1)/6)+1=1,\"ER SEMESTRE \",\"EME SEMESTRE \")&YEAR(A38)&\"'\"&\"!$B$7:$HA$7\"),0)-DAY(A38)-1)=\"(\"&$G$9&\")\")*(INDEX(INDIRECT(\"'\"&INT((MONTH(A38)-1)/6)+1&IF(INT((MONTH(A38)-1)/6)+1=1,\"ER SEMESTRE \",\"EME SEMESTRE \")&YEAR(A38)&\"'\"&\"!$B$9:$HA$43\"),0,MATCH($A38,INDIRECT(\"'\"&INT((MONTH(A38)-1)/6)+1&IF(INT((MONTH(A38)-1)/6)+1=1,\"ER SEMESTRE \",\"EME SEMESTRE \")&YEAR(A38)&\"'\"&\"!$B$7:$HA$7\"),0))=\"J\"),ROW(INDIRECT(\"'\"&INT((MONTH(A38)-1)/6)+1&IF(INT((MONTH(A38)-1)/6)+1=1,\"ER SEMESTRE \",\"EME SEMESTRE \")&YEAR(A38)&\"'\"&\"!$D$9:$D$43\"))-8,9^9))),\"\")=\"\",\n\nIFERROR(INDEX(OFFSET(INDIRECT(\"'\"&INT((MONTH(A38)-1)/6)+1&IF(INT((MONTH(A38)-1)/6)+1=1,\"ER SEMESTRE \",\"EME SEMESTRE \")&YEAR(A38)&\"'\"&\"!$B$9:$B$43\"),0,MATCH($A38,INDIRECT(\"'\"&INT((MONTH(A38)-1)/6)+1&IF(INT((MONTH(A38)-1)/6)+1=1,\"ER SEMESTRE \",\"EME SEMESTRE \")&YEAR(A38)&\"'\"&\"!$B$7:$HA$7\"),0)-DAY(A38)-2),SMALL(IF((OFFSET(INDIRECT(\"'\"&INT((MONTH(A38)-1)/6)+1&IF(INT((MONTH(A38)-1)/6)+1=1,\"ER SEMESTRE \",\"EME SEMESTRE \")&YEAR(A38)&\"'\"&\"!$B$9:$B$43\"),0,MATCH($A38,INDIRECT(\"'\"&INT((MONTH(A38)-1)/6)+1&IF(INT((MONTH(A38)-1)/6)+1=1,\"ER SEMESTRE \",\"EME SEMESTRE \")&YEAR(A38)&\"'\"&\"!$B$7:$HA$7\"),0)-DAY(A38)-1)=\"(\"&$G$9&\")\")*(INDEX(INDIRECT(\"'\"&INT((MONTH(A38)-1)/6)+1&IF(INT((MONTH(A38)-1)/6)+1=1,\"ER SEMESTRE \",\"EME SEMESTRE \")&YEAR(A38)&\"'\"&\"!$B$9:$HA$43\"),0,MATCH($A38,INDIRECT(\"'\"&INT((MONTH(A38)-1)/6)+1&IF(INT((MONTH(A38)-1)/6)+1=1,\"ER SEMESTRE \",\"EME SEMESTRE \")&YEAR(A38)&\"'\"&\"!$B$7:$HA$7\"),0))=\"R\"),ROW(INDIRECT(\"'\"&INT((MONTH(A38)-1)/6)+1&IF(INT((MONTH(A38)-1)/6)+1=1,\"ER SEMESTRE \",\"EME SEMESTRE \")&YEAR(A38)&\"'\"&\"!D$9:D$43\"))-8,9^9),2)),\"\"),\n\nIFERROR(\nINDEX(\nOFFSET(INDIRECT(\"'\"&INT((MONTH(A38)-1)/6)+1&IF(INT((MONTH(A38)-1)/6)+1=1,\"ER SEMESTRE \",\"EME SEMESTRE \")&YEAR(A38)&\"'\"&\"!$B$9:$B$43\"),0,MATCH($A38,INDIRECT(\"'\"&INT((MONTH(A38)-1)/6)+1&IF(INT((MONTH(A38)-1)/6)+1=1,\"ER SEMESTRE \",\"EME SEMESTRE \")&YEAR(A38)&\"'\"&\"!$B$7:$HA$7\"),0)-DAY(A38)-2),\n\nMIN(IF(\n(OFFSET(INDIRECT(\"'\"&INT((MONTH(A38)-1)/6)+1&IF(INT((MONTH(A38)-1)/6)+1=1,\"ER SEMESTRE \",\"EME SEMESTRE \")&YEAR(A38)&\"'\"&\"!$B$9:$B$43\"),0,MATCH($A38,INDIRECT(\"'\"&INT((MONTH(A38)-1)/6)+1&IF(INT((MONTH(A38)-1)/6)+1=1,\"ER SEMESTRE \",\"EME SEMESTRE \")&YEAR(A38)&\"'\"&\"!$B$7:$HA$7\"),0)-DAY(A38)-1)=\"(\"&$G$9&\")\")\n*\n(INDEX(INDIRECT(\"'\"&INT((MONTH(A38)-1)/6)+1&IF(INT((MONTH(A38)-1)/6)+1=1,\"ER SEMESTRE \",\"EME SEMESTRE \")&YEAR(A38)&\"'\"&\"!$B$9:$HA$43\"),0,MATCH($A38,INDIRECT(\"'\"&INT((MONTH(A38)-1)/6)+1&IF(INT((MONTH(A38)-1)/6)+1=1,\"ER SEMESTRE \",\"EME SEMESTRE \")&YEAR(A38)&\"'\"&\"!$B$7:$HA$7\"),0))=\"R\"),\n\nROW(INDIRECT(\"'\"&INT((MONTH(A38)-1)/6)+1&IF(INT((MONTH(A38)-1)/6)+1=1,\"ER SEMESTRE \",\"EME SEMESTRE \")&YEAR(A38)&\"'\"&\"!D$9:D$43\"))-8,\n\n9^9))),\"\")),\"\")","v":""},null,{"$f":"IF(OR($B38=\"M\",$B38=\"N\",$B38=\"A\"),IF(\n\nIFERROR(INDEX(OFFSET(INDIRECT(\"'\"&INT((MONTH(A38)-1)/6)+1&IF(INT((MONTH(A38)-1)/6)+1=1,\"ER SEMESTRE \",\"EME SEMESTRE \")&YEAR(A38)&\"'\"&\"!$B$9:$B$43\"),0,MATCH($A38,INDIRECT(\"'\"&INT((MONTH(A38)-1)/6)+1&IF(INT((MONTH(A38)-1)/6)+1=1,\"ER SEMESTRE \",\"EME SEMESTRE \")&YEAR(A38)&\"'\"&\"!$B$7:$HA$7\"),0)-DAY(A38)-2),MIN(IF((OFFSET(INDIRECT(\"'\"&INT((MONTH(A38)-1)/6)+1&IF(INT((MONTH(A38)-1)/6)+1=1,\"ER SEMESTRE \",\"EME SEMESTRE \")&YEAR(A38)&\"'\"&\"!$B$9:$B$43\"),0,MATCH($A38,INDIRECT(\"'\"&INT((MONTH(A38)-1)/6)+1&IF(INT((MONTH(A38)-1)/6)+1=1,\"ER SEMESTRE \",\"EME SEMESTRE \")&YEAR(A38)&\"'\"&\"!$B$7:$HA$7\"),0)-DAY(A38)-1)=\"(\"&$G$9&\")\")*(INDEX(INDIRECT(\"'\"&INT((MONTH(A38)-1)/6)+1&IF(INT((MONTH(A38)-1)/6)+1=1,\"ER SEMESTRE \",\"EME SEMESTRE \")&YEAR(A38)&\"'\"&\"!$B$9:$HA$43\"),0,MATCH($A38,INDIRECT(\"'\"&INT((MONTH(A38)-1)/6)+1&IF(INT((MONTH(A38)-1)/6)+1=1,\"ER SEMESTRE \",\"EME SEMESTRE \")&YEAR(A38)&\"'\"&\"!$B$7:$HA$7\"),0))=\"J\"),ROW(INDIRECT(\"'\"&INT((MONTH(A38)-1)/6)+1&IF(INT((MONTH(A38)-1)/6)+1=1,\"ER SEMESTRE \",\"EME SEMESTRE \")&YEAR(A38)&\"'\"&\"!$D$9:$D$43\"))-8,9^9))),\"\")=\"\",\n\nIFERROR(\nINDEX(OFFSET(INDIRECT(\"'\"&INT((MONTH(A38)-1)/6)+1&IF(INT((MONTH(A38)-1)/6)+1=1,\"ER SEMESTRE \",\"EME SEMESTRE \")&YEAR(A38)&\"'\"&\"!$B$9:$B$43\"),0,MATCH($A38,INDIRECT(\"'\"&INT((MONTH(A38)-1)/6)+1&IF(INT((MONTH(A38)-1)/6)+1=1,\"ER SEMESTRE \",\"EME SEMESTRE \")&YEAR(A38)&\"'\"&\"!$B$7:$HA$7\"),0)-DAY(A38)-2),\nSMALL(IF((OFFSET(INDIRECT(\"'\"&INT((MONTH(A38)-1)/6)+1&IF(INT((MONTH(A38)-1)/6)+1=1,\"ER SEMESTRE \",\"EME SEMESTRE \")&YEAR(A38)&\"'\"&\"!$B$9:$B$43\"),0,MATCH($A38,INDIRECT(\"'\"&INT((MONTH(A38)-1)/6)+1&IF(INT((MONTH(A38)-1)/6)+1=1,\"ER SEMESTRE \",\"EME SEMESTRE \")&YEAR(A38)&\"'\"&\"!$B$7:$HA$7\"),0)-DAY(A38)-1)=\"(\"&$G$9&\")\")*(INDEX(INDIRECT(\"'\"&INT((MONTH(A38)-1)/6)+1&IF(INT((MONTH(A38)-1)/6)+1=1,\"ER SEMESTRE \",\"EME SEMESTRE \")&YEAR(A38)&\"'\"&\"!$B$9:$HA$43\"),0,MATCH($A38,INDIRECT(\"'\"&INT((MONTH(A38)-1)/6)+1&IF(INT((MONTH(A38)-1)/6)+1=1,\"ER SEMESTRE \",\"EME SEMESTRE \")&YEAR(A38)&\"'\"&\"!$B$7:$HA$7\"),0))=\"R\"),ROW(INDIRECT(\"'\"&INT((MONTH(A38)-1)/6)+1&IF(INT((MONTH(A38)-1)/6)+1=1,\"ER SEMESTRE \",\"EME SEMESTRE \")&YEAR(A38)&\"'\"&\"!D$9:D$43\"))-8,9^9),3)),\"\"),\n\n\nIFERROR(\nINDEX(OFFSET(INDIRECT(\"'\"&INT((MONTH(A38)-1)/6)+1&IF(INT((MONTH(A38)-1)/6)+1=1,\"ER SEMESTRE \",\"EME SEMESTRE \")&YEAR(A38)&\"'\"&\"!$B$9:$B$43\"),0,MATCH($A38,INDIRECT(\"'\"&INT((MONTH(A38)-1)/6)+1&IF(INT((MONTH(A38)-1)/6)+1=1,\"ER SEMESTRE \",\"EME SEMESTRE \")&YEAR(A38)&\"'\"&\"!$B$7:$HA$7\"),0)-DAY(A38)-2),\nSMALL(IF((OFFSET(INDIRECT(\"'\"&INT((MONTH(A38)-1)/6)+1&IF(INT((MONTH(A38)-1)/6)+1=1,\"ER SEMESTRE \",\"EME SEMESTRE \")&YEAR(A38)&\"'\"&\"!$B$9:$B$43\"),0,MATCH($A38,INDIRECT(\"'\"&INT((MONTH(A38)-1)/6)+1&IF(INT((MONTH(A38)-1)/6)+1=1,\"ER SEMESTRE \",\"EME SEMESTRE \")&YEAR(A38)&\"'\"&\"!$B$7:$HA$7\"),0)-DAY(A38)-1)=\"(\"&$G$9&\")\")*(INDEX(INDIRECT(\"'\"&INT((MONTH(A38)-1)/6)+1&IF(INT((MONTH(A38)-1)/6)+1=1,\"ER SEMESTRE \",\"EME SEMESTRE \")&YEAR(A38)&\"'\"&\"!$B$9:$HA$43\"),0,MATCH($A38,INDIRECT(\"'\"&INT((MONTH(A38)-1)/6)+1&IF(INT((MONTH(A38)-1)/6)+1=1,\"ER SEMESTRE \",\"EME SEMESTRE \")&YEAR(A38)&\"'\"&\"!$B$7:$HA$7\"),0))=\"R\"),ROW(INDIRECT(\"'\"&INT((MONTH(A38)-1)/6)+1&IF(INT((MONTH(A38)-1)/6)+1=1,\"ER SEMESTRE \",\"EME SEMESTRE \")&YEAR(A38)&\"'\"&\"!D$9:D$43\"))-8,9^9),2)),\"\")\n\n),\n\n\"\")","v":""}]
["",{"$f":"IFERROR(INDEX([3]PLANNING!$D$3:$Y$29,MATCH('[3]F_Dde de remplacement'!$G$8,[3]PLANNING!$B$3:$B$29,0),MATCH('[3]F_Dde de remplacement'!$A39,[3]PLANNING!$D$2:$Y$2,0)),\"\")","v":""},{"$f":"IF(OR($B39=\"M\",$B39=\"N\",$B39=\"A\"),IFERROR(INDEX(OFFSET(INDIRECT(\"'\"&INT((MONTH(A39)-1)/6)+1&IF(INT((MONTH(A39)-1)/6)+1=1,\"ER SEMESTRE \",\"EME SEMESTRE \")&YEAR(A39)&\"'\"&\"!$B$9:$B$43\"),0,MATCH($A39,INDIRECT(\"'\"&INT((MONTH(A39)-1)/6)+1&IF(INT((MONTH(A39)-1)/6)+1=1,\"ER SEMESTRE \",\"EME SEMESTRE \")&YEAR(A39)&\"'\"&\"!$B$7:$HA$7\"),0)-DAY(A39)-2),MIN(IF((OFFSET(INDIRECT(\"'\"&INT((MONTH(A39)-1)/6)+1&IF(INT((MONTH(A39)-1)/6)+1=1,\"ER SEMESTRE \",\"EME SEMESTRE \")&YEAR(A39)&\"'\"&\"!$B$9:$B$43\"),0,MATCH($A39,INDIRECT(\"'\"&INT((MONTH(A39)-1)/6)+1&IF(INT((MONTH(A39)-1)/6)+1=1,\"ER SEMESTRE \",\"EME SEMESTRE \")&YEAR(A39)&\"'\"&\"!$B$7:$HA$7\"),0)-DAY(A39)-1)=\"(\"&$G$9&\")\")*(INDEX(INDIRECT(\"'\"&INT((MONTH(A39)-1)/6)+1&IF(INT((MONTH(A39)-1)/6)+1=1,\"ER SEMESTRE \",\"EME SEMESTRE \")&YEAR(A39)&\"'\"&\"!$B$9:$HA$43\"),0,MATCH($A39,INDIRECT(\"'\"&INT((MONTH(A39)-1)/6)+1&IF(INT((MONTH(A39)-1)/6)+1=1,\"ER SEMESTRE \",\"EME SEMESTRE \")&YEAR(A39)&\"'\"&\"!$B$7:$HA$7\"),0))=\"J\"),ROW(INDIRECT(\"'\"&INT((MONTH(A39)-1)/6)+1&IF(INT((MONTH(A39)-1)/6)+1=1,\"ER SEMESTRE \",\"EME SEMESTRE \")&YEAR(A39)&\"'\"&\"!$D$9:$D$43\"))-8,9^9))),IFERROR(INDEX(OFFSET(INDIRECT(\"'\"&INT((MONTH(A39)-1)/6)+1&IF(INT((MONTH(A39)-1)/6)+1=1,\"ER SEMESTRE \",\"EME SEMESTRE \")&YEAR(A39)&\"'\"&\"!$B$9:$B$43\"),0,MATCH($A39,INDIRECT(\"'\"&INT((MONTH(A39)-1)/6)+1&IF(INT((MONTH(A39)-1)/6)+1=1,\"ER SEMESTRE \",\"EME SEMESTRE \")&YEAR(A39)&\"'\"&\"!$B$7:$HA$7\"),0)-DAY(A39)-2),MIN(IF((OFFSET(INDIRECT(\"'\"&INT((MONTH(A39)-1)/6)+1&IF(INT((MONTH(A39)-1)/6)+1=1,\"ER SEMESTRE \",\"EME SEMESTRE \")&YEAR(A39)&\"'\"&\"!$B$9:$B$43\"),0,MATCH($A39,INDIRECT(\"'\"&INT((MONTH(A39)-1)/6)+1&IF(INT((MONTH(A39)-1)/6)+1=1,\"ER SEMESTRE \",\"EME SEMESTRE \")&YEAR(A39)&\"'\"&\"!$B$7:$HA$7\"),0)-DAY(A39)-1)=\"(\"&$G$9&\")\")*(INDEX(INDIRECT(\"'\"&INT((MONTH(A39)-1)/6)+1&IF(INT((MONTH(A39)-1)/6)+1=1,\"ER SEMESTRE \",\"EME SEMESTRE \")&YEAR(A39)&\"'\"&\"!$B$9:$HA$43\"),0,MATCH($A39,INDIRECT(\"'\"&INT((MONTH(A39)-1)/6)+1&IF(INT((MONTH(A39)-1)/6)+1=1,\"ER SEMESTRE \",\"EME SEMESTRE \")&YEAR(A39)&\"'\"&\"!$B$7:$HA$7\"),0))=\"R\"),ROW(INDIRECT(\"'\"&INT((MONTH(A39)-1)/6)+1&IF(INT((MONTH(A39)-1)/6)+1=1,\"ER SEMESTRE \",\"EME SEMESTRE \")&YEAR(A39)&\"'\"&\"!$D$9:$D$43\"))-8,9^9))),\"\")),\"\")","v":""},null,{"$f":"IF(OR($B39=\"M\",$B39=\"N\",$B39=\"A\"),IF(\nIFERROR(INDEX(OFFSET(INDIRECT(\"'\"&INT((MONTH(A39)-1)/6)+1&IF(INT((MONTH(A39)-1)/6)+1=1,\"ER SEMESTRE \",\"EME SEMESTRE \")&YEAR(A39)&\"'\"&\"!$B$9:$B$43\"),0,MATCH($A39,INDIRECT(\"'\"&INT((MONTH(A39)-1)/6)+1&IF(INT((MONTH(A39)-1)/6)+1=1,\"ER SEMESTRE \",\"EME SEMESTRE \")&YEAR(A39)&\"'\"&\"!$B$7:$HA$7\"),0)-DAY(A39)-2),MIN(IF((OFFSET(INDIRECT(\"'\"&INT((MONTH(A39)-1)/6)+1&IF(INT((MONTH(A39)-1)/6)+1=1,\"ER SEMESTRE \",\"EME SEMESTRE \")&YEAR(A39)&\"'\"&\"!$B$9:$B$43\"),0,MATCH($A39,INDIRECT(\"'\"&INT((MONTH(A39)-1)/6)+1&IF(INT((MONTH(A39)-1)/6)+1=1,\"ER SEMESTRE \",\"EME SEMESTRE \")&YEAR(A39)&\"'\"&\"!$B$7:$HA$7\"),0)-DAY(A39)-1)=\"(\"&$G$9&\")\")*(INDEX(INDIRECT(\"'\"&INT((MONTH(A39)-1)/6)+1&IF(INT((MONTH(A39)-1)/6)+1=1,\"ER SEMESTRE \",\"EME SEMESTRE \")&YEAR(A39)&\"'\"&\"!$B$9:$HA$43\"),0,MATCH($A39,INDIRECT(\"'\"&INT((MONTH(A39)-1)/6)+1&IF(INT((MONTH(A39)-1)/6)+1=1,\"ER SEMESTRE \",\"EME SEMESTRE \")&YEAR(A39)&\"'\"&\"!$B$7:$HA$7\"),0))=\"J\"),ROW(INDIRECT(\"'\"&INT((MONTH(A39)-1)/6)+1&IF(INT((MONTH(A39)-1)/6)+1=1,\"ER SEMESTRE \",\"EME SEMESTRE \")&YEAR(A39)&\"'\"&\"!$D$9:$D$43\"))-8,9^9))),\"\")=\"\",\n\nIFERROR(INDEX(OFFSET(INDIRECT(\"'\"&INT((MONTH(A39)-1)/6)+1&IF(INT((MONTH(A39)-1)/6)+1=1,\"ER SEMESTRE \",\"EME SEMESTRE \")&YEAR(A39)&\"'\"&\"!$B$9:$B$43\"),0,MATCH($A39,INDIRECT(\"'\"&INT((MONTH(A39)-1)/6)+1&IF(INT((MONTH(A39)-1)/6)+1=1,\"ER SEMESTRE \",\"EME SEMESTRE \")&YEAR(A39)&\"'\"&\"!$B$7:$HA$7\"),0)-DAY(A39)-2),SMALL(IF((OFFSET(INDIRECT(\"'\"&INT((MONTH(A39)-1)/6)+1&IF(INT((MONTH(A39)-1)/6)+1=1,\"ER SEMESTRE \",\"EME SEMESTRE \")&YEAR(A39)&\"'\"&\"!$B$9:$B$43\"),0,MATCH($A39,INDIRECT(\"'\"&INT((MONTH(A39)-1)/6)+1&IF(INT((MONTH(A39)-1)/6)+1=1,\"ER SEMESTRE \",\"EME SEMESTRE \")&YEAR(A39)&\"'\"&\"!$B$7:$HA$7\"),0)-DAY(A39)-1)=\"(\"&$G$9&\")\")*(INDEX(INDIRECT(\"'\"&INT((MONTH(A39)-1)/6)+1&IF(INT((MONTH(A39)-1)/6)+1=1,\"ER SEMESTRE \",\"EME SEMESTRE \")&YEAR(A39)&\"'\"&\"!$B$9:$HA$43\"),0,MATCH($A39,INDIRECT(\"'\"&INT((MONTH(A39)-1)/6)+1&IF(INT((MONTH(A39)-1)/6)+1=1,\"ER SEMESTRE \",\"EME SEMESTRE \")&YEAR(A39)&\"'\"&\"!$B$7:$HA$7\"),0))=\"R\"),ROW(INDIRECT(\"'\"&INT((MONTH(A39)-1)/6)+1&IF(INT((MONTH(A39)-1)/6)+1=1,\"ER SEMESTRE \",\"EME SEMESTRE \")&YEAR(A39)&\"'\"&\"!D$9:D$43\"))-8,9^9),2)),\"\"),\n\nIFERROR(\nINDEX(\nOFFSET(INDIRECT(\"'\"&INT((MONTH(A39)-1)/6)+1&IF(INT((MONTH(A39)-1)/6)+1=1,\"ER SEMESTRE \",\"EME SEMESTRE \")&YEAR(A39)&\"'\"&\"!$B$9:$B$43\"),0,MATCH($A39,INDIRECT(\"'\"&INT((MONTH(A39)-1)/6)+1&IF(INT((MONTH(A39)-1)/6)+1=1,\"ER SEMESTRE \",\"EME SEMESTRE \")&YEAR(A39)&\"'\"&\"!$B$7:$HA$7\"),0)-DAY(A39)-2),\n\nMIN(IF(\n(OFFSET(INDIRECT(\"'\"&INT((MONTH(A39)-1)/6)+1&IF(INT((MONTH(A39)-1)/6)+1=1,\"ER SEMESTRE \",\"EME SEMESTRE \")&YEAR(A39)&\"'\"&\"!$B$9:$B$43\"),0,MATCH($A39,INDIRECT(\"'\"&INT((MONTH(A39)-1)/6)+1&IF(INT((MONTH(A39)-1)/6)+1=1,\"ER SEMESTRE \",\"EME SEMESTRE \")&YEAR(A39)&\"'\"&\"!$B$7:$HA$7\"),0)-DAY(A39)-1)=\"(\"&$G$9&\")\")\n*\n(INDEX(INDIRECT(\"'\"&INT((MONTH(A39)-1)/6)+1&IF(INT((MONTH(A39)-1)/6)+1=1,\"ER SEMESTRE \",\"EME SEMESTRE \")&YEAR(A39)&\"'\"&\"!$B$9:$HA$43\"),0,MATCH($A39,INDIRECT(\"'\"&INT((MONTH(A39)-1)/6)+1&IF(INT((MONTH(A39)-1)/6)+1=1,\"ER SEMESTRE \",\"EME SEMESTRE \")&YEAR(A39)&\"'\"&\"!$B$7:$HA$7\"),0))=\"R\"),\n\nROW(INDIRECT(\"'\"&INT((MONTH(A39)-1)/6)+1&IF(INT((MONTH(A39)-1)/6)+1=1,\"ER SEMESTRE \",\"EME SEMESTRE \")&YEAR(A39)&\"'\"&\"!D$9:D$43\"))-8,\n\n9^9))),\"\")),\"\")","v":""},null,{"$f":"IF(OR($B39=\"M\",$B39=\"N\",$B39=\"A\"),IF(\n\nIFERROR(INDEX(OFFSET(INDIRECT(\"'\"&INT((MONTH(A39)-1)/6)+1&IF(INT((MONTH(A39)-1)/6)+1=1,\"ER SEMESTRE \",\"EME SEMESTRE \")&YEAR(A39)&\"'\"&\"!$B$9:$B$43\"),0,MATCH($A39,INDIRECT(\"'\"&INT((MONTH(A39)-1)/6)+1&IF(INT((MONTH(A39)-1)/6)+1=1,\"ER SEMESTRE \",\"EME SEMESTRE \")&YEAR(A39)&\"'\"&\"!$B$7:$HA$7\"),0)-DAY(A39)-2),MIN(IF((OFFSET(INDIRECT(\"'\"&INT((MONTH(A39)-1)/6)+1&IF(INT((MONTH(A39)-1)/6)+1=1,\"ER SEMESTRE \",\"EME SEMESTRE \")&YEAR(A39)&\"'\"&\"!$B$9:$B$43\"),0,MATCH($A39,INDIRECT(\"'\"&INT((MONTH(A39)-1)/6)+1&IF(INT((MONTH(A39)-1)/6)+1=1,\"ER SEMESTRE \",\"EME SEMESTRE \")&YEAR(A39)&\"'\"&\"!$B$7:$HA$7\"),0)-DAY(A39)-1)=\"(\"&$G$9&\")\")*(INDEX(INDIRECT(\"'\"&INT((MONTH(A39)-1)/6)+1&IF(INT((MONTH(A39)-1)/6)+1=1,\"ER SEMESTRE \",\"EME SEMESTRE \")&YEAR(A39)&\"'\"&\"!$B$9:$HA$43\"),0,MATCH($A39,INDIRECT(\"'\"&INT((MONTH(A39)-1)/6)+1&IF(INT((MONTH(A39)-1)/6)+1=1,\"ER SEMESTRE \",\"EME SEMESTRE \")&YEAR(A39)&\"'\"&\"!$B$7:$HA$7\"),0))=\"J\"),ROW(INDIRECT(\"'\"&INT((MONTH(A39)-1)/6)+1&IF(INT((MONTH(A39)-1)/6)+1=1,\"ER SEMESTRE \",\"EME SEMESTRE \")&YEAR(A39)&\"'\"&\"!$D$9:$D$43\"))-8,9^9))),\"\")=\"\",\n\nIFERROR(\nINDEX(OFFSET(INDIRECT(\"'\"&INT((MONTH(A39)-1)/6)+1&IF(INT((MONTH(A39)-1)/6)+1=1,\"ER SEMESTRE \",\"EME SEMESTRE \")&YEAR(A39)&\"'\"&\"!$B$9:$B$43\"),0,MATCH($A39,INDIRECT(\"'\"&INT((MONTH(A39)-1)/6)+1&IF(INT((MONTH(A39)-1)/6)+1=1,\"ER SEMESTRE \",\"EME SEMESTRE \")&YEAR(A39)&\"'\"&\"!$B$7:$HA$7\"),0)-DAY(A39)-2),\nSMALL(IF((OFFSET(INDIRECT(\"'\"&INT((MONTH(A39)-1)/6)+1&IF(INT((MONTH(A39)-1)/6)+1=1,\"ER SEMESTRE \",\"EME SEMESTRE \")&YEAR(A39)&\"'\"&\"!$B$9:$B$43\"),0,MATCH($A39,INDIRECT(\"'\"&INT((MONTH(A39)-1)/6)+1&IF(INT((MONTH(A39)-1)/6)+1=1,\"ER SEMESTRE \",\"EME SEMESTRE \")&YEAR(A39)&\"'\"&\"!$B$7:$HA$7\"),0)-DAY(A39)-1)=\"(\"&$G$9&\")\")*(INDEX(INDIRECT(\"'\"&INT((MONTH(A39)-1)/6)+1&IF(INT((MONTH(A39)-1)/6)+1=1,\"ER SEMESTRE \",\"EME SEMESTRE \")&YEAR(A39)&\"'\"&\"!$B$9:$HA$43\"),0,MATCH($A39,INDIRECT(\"'\"&INT((MONTH(A39)-1)/6)+1&IF(INT((MONTH(A39)-1)/6)+1=1,\"ER SEMESTRE \",\"EME SEMESTRE \")&YEAR(A39)&\"'\"&\"!$B$7:$HA$7\"),0))=\"R\"),ROW(INDIRECT(\"'\"&INT((MONTH(A39)-1)/6)+1&IF(INT((MONTH(A39)-1)/6)+1=1,\"ER SEMESTRE \",\"EME SEMESTRE \")&YEAR(A39)&\"'\"&\"!D$9:D$43\"))-8,9^9),3)),\"\"),\n\n\nIFERROR(\nINDEX(OFFSET(INDIRECT(\"'\"&INT((MONTH(A39)-1)/6)+1&IF(INT((MONTH(A39)-1)/6)+1=1,\"ER SEMESTRE \",\"EME SEMESTRE \")&YEAR(A39)&\"'\"&\"!$B$9:$B$43\"),0,MATCH($A39,INDIRECT(\"'\"&INT((MONTH(A39)-1)/6)+1&IF(INT((MONTH(A39)-1)/6)+1=1,\"ER SEMESTRE \",\"EME SEMESTRE \")&YEAR(A39)&\"'\"&\"!$B$7:$HA$7\"),0)-DAY(A39)-2),\nSMALL(IF((OFFSET(INDIRECT(\"'\"&INT((MONTH(A39)-1)/6)+1&IF(INT((MONTH(A39)-1)/6)+1=1,\"ER SEMESTRE \",\"EME SEMESTRE \")&YEAR(A39)&\"'\"&\"!$B$9:$B$43\"),0,MATCH($A39,INDIRECT(\"'\"&INT((MONTH(A39)-1)/6)+1&IF(INT((MONTH(A39)-1)/6)+1=1,\"ER SEMESTRE \",\"EME SEMESTRE \")&YEAR(A39)&\"'\"&\"!$B$7:$HA$7\"),0)-DAY(A39)-1)=\"(\"&$G$9&\")\")*(INDEX(INDIRECT(\"'\"&INT((MONTH(A39)-1)/6)+1&IF(INT((MONTH(A39)-1)/6)+1=1,\"ER SEMESTRE \",\"EME SEMESTRE \")&YEAR(A39)&\"'\"&\"!$B$9:$HA$43\"),0,MATCH($A39,INDIRECT(\"'\"&INT((MONTH(A39)-1)/6)+1&IF(INT((MONTH(A39)-1)/6)+1=1,\"ER SEMESTRE \",\"EME SEMESTRE \")&YEAR(A39)&\"'\"&\"!$B$7:$HA$7\"),0))=\"R\"),ROW(INDIRECT(\"'\"&INT((MONTH(A39)-1)/6)+1&IF(INT((MONTH(A39)-1)/6)+1=1,\"ER SEMESTRE \",\"EME SEMESTRE \")&YEAR(A39)&\"'\"&\"!D$9:D$43\"))-8,9^9),2)),\"\")\n\n),\n\n\"\")","v":""}]
["",{"$f":"IFERROR(INDEX([3]PLANNING!$D$3:$Y$29,MATCH('[3]F_Dde de remplacement'!$G$8,[3]PLANNING!$B$3:$B$29,0),MATCH('[3]F_Dde de remplacement'!$A40,[3]PLANNING!$D$2:$Y$2,0)),\"\")","v":""},{"$f":"IF(OR($B40=\"M\",$B40=\"N\",$B40=\"A\"),IFERROR(INDEX(OFFSET(INDIRECT(\"'\"&INT((MONTH(A40)-1)/6)+1&IF(INT((MONTH(A40)-1)/6)+1=1,\"ER SEMESTRE \",\"EME SEMESTRE \")&YEAR(A40)&\"'\"&\"!$B$9:$B$43\"),0,MATCH($A40,INDIRECT(\"'\"&INT((MONTH(A40)-1)/6)+1&IF(INT((MONTH(A40)-1)/6)+1=1,\"ER SEMESTRE \",\"EME SEMESTRE \")&YEAR(A40)&\"'\"&\"!$B$7:$HA$7\"),0)-DAY(A40)-2),MIN(IF((OFFSET(INDIRECT(\"'\"&INT((MONTH(A40)-1)/6)+1&IF(INT((MONTH(A40)-1)/6)+1=1,\"ER SEMESTRE \",\"EME SEMESTRE \")&YEAR(A40)&\"'\"&\"!$B$9:$B$43\"),0,MATCH($A40,INDIRECT(\"'\"&INT((MONTH(A40)-1)/6)+1&IF(INT((MONTH(A40)-1)/6)+1=1,\"ER SEMESTRE \",\"EME SEMESTRE \")&YEAR(A40)&\"'\"&\"!$B$7:$HA$7\"),0)-DAY(A40)-1)=\"(\"&$G$9&\")\")*(INDEX(INDIRECT(\"'\"&INT((MONTH(A40)-1)/6)+1&IF(INT((MONTH(A40)-1)/6)+1=1,\"ER SEMESTRE \",\"EME SEMESTRE \")&YEAR(A40)&\"'\"&\"!$B$9:$HA$43\"),0,MATCH($A40,INDIRECT(\"'\"&INT((MONTH(A40)-1)/6)+1&IF(INT((MONTH(A40)-1)/6)+1=1,\"ER SEMESTRE \",\"EME SEMESTRE \")&YEAR(A40)&\"'\"&\"!$B$7:$HA$7\"),0))=\"J\"),ROW(INDIRECT(\"'\"&INT((MONTH(A40)-1)/6)+1&IF(INT((MONTH(A40)-1)/6)+1=1,\"ER SEMESTRE \",\"EME SEMESTRE \")&YEAR(A40)&\"'\"&\"!$D$9:$D$43\"))-8,9^9))),IFERROR(INDEX(OFFSET(INDIRECT(\"'\"&INT((MONTH(A40)-1)/6)+1&IF(INT((MONTH(A40)-1)/6)+1=1,\"ER SEMESTRE \",\"EME SEMESTRE \")&YEAR(A40)&\"'\"&\"!$B$9:$B$43\"),0,MATCH($A40,INDIRECT(\"'\"&INT((MONTH(A40)-1)/6)+1&IF(INT((MONTH(A40)-1)/6)+1=1,\"ER SEMESTRE \",\"EME SEMESTRE \")&YEAR(A40)&\"'\"&\"!$B$7:$HA$7\"),0)-DAY(A40)-2),MIN(IF((OFFSET(INDIRECT(\"'\"&INT((MONTH(A40)-1)/6)+1&IF(INT((MONTH(A40)-1)/6)+1=1,\"ER SEMESTRE \",\"EME SEMESTRE \")&YEAR(A40)&\"'\"&\"!$B$9:$B$43\"),0,MATCH($A40,INDIRECT(\"'\"&INT((MONTH(A40)-1)/6)+1&IF(INT((MONTH(A40)-1)/6)+1=1,\"ER SEMESTRE \",\"EME SEMESTRE \")&YEAR(A40)&\"'\"&\"!$B$7:$HA$7\"),0)-DAY(A40)-1)=\"(\"&$G$9&\")\")*(INDEX(INDIRECT(\"'\"&INT((MONTH(A40)-1)/6)+1&IF(INT((MONTH(A40)-1)/6)+1=1,\"ER SEMESTRE \",\"EME SEMESTRE \")&YEAR(A40)&\"'\"&\"!$B$9:$HA$43\"),0,MATCH($A40,INDIRECT(\"'\"&INT((MONTH(A40)-1)/6)+1&IF(INT((MONTH(A40)-1)/6)+1=1,\"ER SEMESTRE \",\"EME SEMESTRE \")&YEAR(A40)&\"'\"&\"!$B$7:$HA$7\"),0))=\"R\"),ROW(INDIRECT(\"'\"&INT((MONTH(A40)-1)/6)+1&IF(INT((MONTH(A40)-1)/6)+1=1,\"ER SEMESTRE \",\"EME SEMESTRE \")&YEAR(A40)&\"'\"&\"!$D$9:$D$43\"))-8,9^9))),\"\")),\"\")","v":""},null,{"$f":"IF(OR($B40=\"M\",$B40=\"N\",$B40=\"A\"),IF(\nIFERROR(INDEX(OFFSET(INDIRECT(\"'\"&INT((MONTH(A40)-1)/6)+1&IF(INT((MONTH(A40)-1)/6)+1=1,\"ER SEMESTRE \",\"EME SEMESTRE \")&YEAR(A40)&\"'\"&\"!$B$9:$B$43\"),0,MATCH($A40,INDIRECT(\"'\"&INT((MONTH(A40)-1)/6)+1&IF(INT((MONTH(A40)-1)/6)+1=1,\"ER SEMESTRE \",\"EME SEMESTRE \")&YEAR(A40)&\"'\"&\"!$B$7:$HA$7\"),0)-DAY(A40)-2),MIN(IF((OFFSET(INDIRECT(\"'\"&INT((MONTH(A40)-1)/6)+1&IF(INT((MONTH(A40)-1)/6)+1=1,\"ER SEMESTRE \",\"EME SEMESTRE \")&YEAR(A40)&\"'\"&\"!$B$9:$B$43\"),0,MATCH($A40,INDIRECT(\"'\"&INT((MONTH(A40)-1)/6)+1&IF(INT((MONTH(A40)-1)/6)+1=1,\"ER SEMESTRE \",\"EME SEMESTRE \")&YEAR(A40)&\"'\"&\"!$B$7:$HA$7\"),0)-DAY(A40)-1)=\"(\"&$G$9&\")\")*(INDEX(INDIRECT(\"'\"&INT((MONTH(A40)-1)/6)+1&IF(INT((MONTH(A40)-1)/6)+1=1,\"ER SEMESTRE \",\"EME SEMESTRE \")&YEAR(A40)&\"'\"&\"!$B$9:$HA$43\"),0,MATCH($A40,INDIRECT(\"'\"&INT((MONTH(A40)-1)/6)+1&IF(INT((MONTH(A40)-1)/6)+1=1,\"ER SEMESTRE \",\"EME SEMESTRE \")&YEAR(A40)&\"'\"&\"!$B$7:$HA$7\"),0))=\"J\"),ROW(INDIRECT(\"'\"&INT((MONTH(A40)-1)/6)+1&IF(INT((MONTH(A40)-1)/6)+1=1,\"ER SEMESTRE \",\"EME SEMESTRE \")&YEAR(A40)&\"'\"&\"!$D$9:$D$43\"))-8,9^9))),\"\")=\"\",\n\nIFERROR(INDEX(OFFSET(INDIRECT(\"'\"&INT((MONTH(A40)-1)/6)+1&IF(INT((MONTH(A40)-1)/6)+1=1,\"ER SEMESTRE \",\"EME SEMESTRE \")&YEAR(A40)&\"'\"&\"!$B$9:$B$43\"),0,MATCH($A40,INDIRECT(\"'\"&INT((MONTH(A40)-1)/6)+1&IF(INT((MONTH(A40)-1)/6)+1=1,\"ER SEMESTRE \",\"EME SEMESTRE \")&YEAR(A40)&\"'\"&\"!$B$7:$HA$7\"),0)-DAY(A40)-2),SMALL(IF((OFFSET(INDIRECT(\"'\"&INT((MONTH(A40)-1)/6)+1&IF(INT((MONTH(A40)-1)/6)+1=1,\"ER SEMESTRE \",\"EME SEMESTRE \")&YEAR(A40)&\"'\"&\"!$B$9:$B$43\"),0,MATCH($A40,INDIRECT(\"'\"&INT((MONTH(A40)-1)/6)+1&IF(INT((MONTH(A40)-1)/6)+1=1,\"ER SEMESTRE \",\"EME SEMESTRE \")&YEAR(A40)&\"'\"&\"!$B$7:$HA$7\"),0)-DAY(A40)-1)=\"(\"&$G$9&\")\")*(INDEX(INDIRECT(\"'\"&INT((MONTH(A40)-1)/6)+1&IF(INT((MONTH(A40)-1)/6)+1=1,\"ER SEMESTRE \",\"EME SEMESTRE \")&YEAR(A40)&\"'\"&\"!$B$9:$HA$43\"),0,MATCH($A40,INDIRECT(\"'\"&INT((MONTH(A40)-1)/6)+1&IF(INT((MONTH(A40)-1)/6)+1=1,\"ER SEMESTRE \",\"EME SEMESTRE \")&YEAR(A40)&\"'\"&\"!$B$7:$HA$7\"),0))=\"R\"),ROW(INDIRECT(\"'\"&INT((MONTH(A40)-1)/6)+1&IF(INT((MONTH(A40)-1)/6)+1=1,\"ER SEMESTRE \",\"EME SEMESTRE \")&YEAR(A40)&\"'\"&\"!D$9:D$43\"))-8,9^9),2)),\"\"),\n\nIFERROR(\nINDEX(\nOFFSET(INDIRECT(\"'\"&INT((MONTH(A40)-1)/6)+1&IF(INT((MONTH(A40)-1)/6)+1=1,\"ER SEMESTRE \",\"EME SEMESTRE \")&YEAR(A40)&\"'\"&\"!$B$9:$B$43\"),0,MATCH($A40,INDIRECT(\"'\"&INT((MONTH(A40)-1)/6)+1&IF(INT((MONTH(A40)-1)/6)+1=1,\"ER SEMESTRE \",\"EME SEMESTRE \")&YEAR(A40)&\"'\"&\"!$B$7:$HA$7\"),0)-DAY(A40)-2),\n\nMIN(IF(\n(OFFSET(INDIRECT(\"'\"&INT((MONTH(A40)-1)/6)+1&IF(INT((MONTH(A40)-1)/6)+1=1,\"ER SEMESTRE \",\"EME SEMESTRE \")&YEAR(A40)&\"'\"&\"!$B$9:$B$43\"),0,MATCH($A40,INDIRECT(\"'\"&INT((MONTH(A40)-1)/6)+1&IF(INT((MONTH(A40)-1)/6)+1=1,\"ER SEMESTRE \",\"EME SEMESTRE \")&YEAR(A40)&\"'\"&\"!$B$7:$HA$7\"),0)-DAY(A40)-1)=\"(\"&$G$9&\")\")\n*\n(INDEX(INDIRECT(\"'\"&INT((MONTH(A40)-1)/6)+1&IF(INT((MONTH(A40)-1)/6)+1=1,\"ER SEMESTRE \",\"EME SEMESTRE \")&YEAR(A40)&\"'\"&\"!$B$9:$HA$43\"),0,MATCH($A40,INDIRECT(\"'\"&INT((MONTH(A40)-1)/6)+1&IF(INT((MONTH(A40)-1)/6)+1=1,\"ER SEMESTRE \",\"EME SEMESTRE \")&YEAR(A40)&\"'\"&\"!$B$7:$HA$7\"),0))=\"R\"),\n\nROW(INDIRECT(\"'\"&INT((MONTH(A40)-1)/6)+1&IF(INT((MONTH(A40)-1)/6)+1=1,\"ER SEMESTRE \",\"EME SEMESTRE \")&YEAR(A40)&\"'\"&\"!D$9:D$43\"))-8,\n\n9^9))),\"\")),\"\")","v":""},null,{"$f":"IF(OR($B40=\"M\",$B40=\"N\",$B40=\"A\"),IF(\n\nIFERROR(INDEX(OFFSET(INDIRECT(\"'\"&INT((MONTH(A40)-1)/6)+1&IF(INT((MONTH(A40)-1)/6)+1=1,\"ER SEMESTRE \",\"EME SEMESTRE \")&YEAR(A40)&\"'\"&\"!$B$9:$B$43\"),0,MATCH($A40,INDIRECT(\"'\"&INT((MONTH(A40)-1)/6)+1&IF(INT((MONTH(A40)-1)/6)+1=1,\"ER SEMESTRE \",\"EME SEMESTRE \")&YEAR(A40)&\"'\"&\"!$B$7:$HA$7\"),0)-DAY(A40)-2),MIN(IF((OFFSET(INDIRECT(\"'\"&INT((MONTH(A40)-1)/6)+1&IF(INT((MONTH(A40)-1)/6)+1=1,\"ER SEMESTRE \",\"EME SEMESTRE \")&YEAR(A40)&\"'\"&\"!$B$9:$B$43\"),0,MATCH($A40,INDIRECT(\"'\"&INT((MONTH(A40)-1)/6)+1&IF(INT((MONTH(A40)-1)/6)+1=1,\"ER SEMESTRE \",\"EME SEMESTRE \")&YEAR(A40)&\"'\"&\"!$B$7:$HA$7\"),0)-DAY(A40)-1)=\"(\"&$G$9&\")\")*(INDEX(INDIRECT(\"'\"&INT((MONTH(A40)-1)/6)+1&IF(INT((MONTH(A40)-1)/6)+1=1,\"ER SEMESTRE \",\"EME SEMESTRE \")&YEAR(A40)&\"'\"&\"!$B$9:$HA$43\"),0,MATCH($A40,INDIRECT(\"'\"&INT((MONTH(A40)-1)/6)+1&IF(INT((MONTH(A40)-1)/6)+1=1,\"ER SEMESTRE \",\"EME SEMESTRE \")&YEAR(A40)&\"'\"&\"!$B$7:$HA$7\"),0))=\"J\"),ROW(INDIRECT(\"'\"&INT((MONTH(A40)-1)/6)+1&IF(INT((MONTH(A40)-1)/6)+1=1,\"ER SEMESTRE \",\"EME SEMESTRE \")&YEAR(A40)&\"'\"&\"!$D$9:$D$43\"))-8,9^9))),\"\")=\"\",\n\nIFERROR(\nINDEX(OFFSET(INDIRECT(\"'\"&INT((MONTH(A40)-1)/6)+1&IF(INT((MONTH(A40)-1)/6)+1=1,\"ER SEMESTRE \",\"EME SEMESTRE \")&YEAR(A40)&\"'\"&\"!$B$9:$B$43\"),0,MATCH($A40,INDIRECT(\"'\"&INT((MONTH(A40)-1)/6)+1&IF(INT((MONTH(A40)-1)/6)+1=1,\"ER SEMESTRE \",\"EME SEMESTRE \")&YEAR(A40)&\"'\"&\"!$B$7:$HA$7\"),0)-DAY(A40)-2),\nSMALL(IF((OFFSET(INDIRECT(\"'\"&INT((MONTH(A40)-1)/6)+1&IF(INT((MONTH(A40)-1)/6)+1=1,\"ER SEMESTRE \",\"EME SEMESTRE \")&YEAR(A40)&\"'\"&\"!$B$9:$B$43\"),0,MATCH($A40,INDIRECT(\"'\"&INT((MONTH(A40)-1)/6)+1&IF(INT((MONTH(A40)-1)/6)+1=1,\"ER SEMESTRE \",\"EME SEMESTRE \")&YEAR(A40)&\"'\"&\"!$B$7:$HA$7\"),0)-DAY(A40)-1)=\"(\"&$G$9&\")\")*(INDEX(INDIRECT(\"'\"&INT((MONTH(A40)-1)/6)+1&IF(INT((MONTH(A40)-1)/6)+1=1,\"ER SEMESTRE \",\"EME SEMESTRE \")&YEAR(A40)&\"'\"&\"!$B$9:$HA$43\"),0,MATCH($A40,INDIRECT(\"'\"&INT((MONTH(A40)-1)/6)+1&IF(INT((MONTH(A40)-1)/6)+1=1,\"ER SEMESTRE \",\"EME SEMESTRE \")&YEAR(A40)&\"'\"&\"!$B$7:$HA$7\"),0))=\"R\"),ROW(INDIRECT(\"'\"&INT((MONTH(A40)-1)/6)+1&IF(INT((MONTH(A40)-1)/6)+1=1,\"ER SEMESTRE \",\"EME SEMESTRE \")&YEAR(A40)&\"'\"&\"!D$9:D$43\"))-8,9^9),3)),\"\"),\n\n\nIFERROR(\nINDEX(OFFSET(INDIRECT(\"'\"&INT((MONTH(A40)-1)/6)+1&IF(INT((MONTH(A40)-1)/6)+1=1,\"ER SEMESTRE \",\"EME SEMESTRE \")&YEAR(A40)&\"'\"&\"!$B$9:$B$43\"),0,MATCH($A40,INDIRECT(\"'\"&INT((MONTH(A40)-1)/6)+1&IF(INT((MONTH(A40)-1)/6)+1=1,\"ER SEMESTRE \",\"EME SEMESTRE \")&YEAR(A40)&\"'\"&\"!$B$7:$HA$7\"),0)-DAY(A40)-2),\nSMALL(IF((OFFSET(INDIRECT(\"'\"&INT((MONTH(A40)-1)/6)+1&IF(INT((MONTH(A40)-1)/6)+1=1,\"ER SEMESTRE \",\"EME SEMESTRE \")&YEAR(A40)&\"'\"&\"!$B$9:$B$43\"),0,MATCH($A40,INDIRECT(\"'\"&INT((MONTH(A40)-1)/6)+1&IF(INT((MONTH(A40)-1)/6)+1=1,\"ER SEMESTRE \",\"EME SEMESTRE \")&YEAR(A40)&\"'\"&\"!$B$7:$HA$7\"),0)-DAY(A40)-1)=\"(\"&$G$9&\")\")*(INDEX(INDIRECT(\"'\"&INT((MONTH(A40)-1)/6)+1&IF(INT((MONTH(A40)-1)/6)+1=1,\"ER SEMESTRE \",\"EME SEMESTRE \")&YEAR(A40)&\"'\"&\"!$B$9:$HA$43\"),0,MATCH($A40,INDIRECT(\"'\"&INT((MONTH(A40)-1)/6)+1&IF(INT((MONTH(A40)-1)/6)+1=1,\"ER SEMESTRE \",\"EME SEMESTRE \")&YEAR(A40)&\"'\"&\"!$B$7:$HA$7\"),0))=\"R\"),ROW(INDIRECT(\"'\"&INT((MONTH(A40)-1)/6)+1&IF(INT((MONTH(A40)-1)/6)+1=1,\"ER SEMESTRE \",\"EME SEMESTRE \")&YEAR(A40)&\"'\"&\"!D$9:D$43\"))-8,9^9),2)),\"\")\n\n),\n\n\"\")","v":""}]
["",{"$f":"IFERROR(INDEX([3]PLANNING!$D$3:$Y$29,MATCH('[3]F_Dde de remplacement'!$G$8,[3]PLANNING!$B$3:$B$29,0),MATCH('[3]F_Dde de remplacement'!$A41,[3]PLANNING!$D$2:$Y$2,0)),\"\")","v":""},{"$f":"IF(OR($B41=\"M\",$B41=\"N\",$B41=\"A\"),IFERROR(INDEX(OFFSET(INDIRECT(\"'\"&INT((MONTH(A41)-1)/6)+1&IF(INT((MONTH(A41)-1)/6)+1=1,\"ER SEMESTRE \",\"EME SEMESTRE \")&YEAR(A41)&\"'\"&\"!$B$9:$B$43\"),0,MATCH($A41,INDIRECT(\"'\"&INT((MONTH(A41)-1)/6)+1&IF(INT((MONTH(A41)-1)/6)+1=1,\"ER SEMESTRE \",\"EME SEMESTRE \")&YEAR(A41)&\"'\"&\"!$B$7:$HA$7\"),0)-DAY(A41)-2),MIN(IF((OFFSET(INDIRECT(\"'\"&INT((MONTH(A41)-1)/6)+1&IF(INT((MONTH(A41)-1)/6)+1=1,\"ER SEMESTRE \",\"EME SEMESTRE \")&YEAR(A41)&\"'\"&\"!$B$9:$B$43\"),0,MATCH($A41,INDIRECT(\"'\"&INT((MONTH(A41)-1)/6)+1&IF(INT((MONTH(A41)-1)/6)+1=1,\"ER SEMESTRE \",\"EME SEMESTRE \")&YEAR(A41)&\"'\"&\"!$B$7:$HA$7\"),0)-DAY(A41)-1)=\"(\"&$G$9&\")\")*(INDEX(INDIRECT(\"'\"&INT((MONTH(A41)-1)/6)+1&IF(INT((MONTH(A41)-1)/6)+1=1,\"ER SEMESTRE \",\"EME SEMESTRE \")&YEAR(A41)&\"'\"&\"!$B$9:$HA$43\"),0,MATCH($A41,INDIRECT(\"'\"&INT((MONTH(A41)-1)/6)+1&IF(INT((MONTH(A41)-1)/6)+1=1,\"ER SEMESTRE \",\"EME SEMESTRE \")&YEAR(A41)&\"'\"&\"!$B$7:$HA$7\"),0))=\"J\"),ROW(INDIRECT(\"'\"&INT((MONTH(A41)-1)/6)+1&IF(INT((MONTH(A41)-1)/6)+1=1,\"ER SEMESTRE \",\"EME SEMESTRE \")&YEAR(A41)&\"'\"&\"!$D$9:$D$43\"))-8,9^9))),IFERROR(INDEX(OFFSET(INDIRECT(\"'\"&INT((MONTH(A41)-1)/6)+1&IF(INT((MONTH(A41)-1)/6)+1=1,\"ER SEMESTRE \",\"EME SEMESTRE \")&YEAR(A41)&\"'\"&\"!$B$9:$B$43\"),0,MATCH($A41,INDIRECT(\"'\"&INT((MONTH(A41)-1)/6)+1&IF(INT((MONTH(A41)-1)/6)+1=1,\"ER SEMESTRE \",\"EME SEMESTRE \")&YEAR(A41)&\"'\"&\"!$B$7:$HA$7\"),0)-DAY(A41)-2),MIN(IF((OFFSET(INDIRECT(\"'\"&INT((MONTH(A41)-1)/6)+1&IF(INT((MONTH(A41)-1)/6)+1=1,\"ER SEMESTRE \",\"EME SEMESTRE \")&YEAR(A41)&\"'\"&\"!$B$9:$B$43\"),0,MATCH($A41,INDIRECT(\"'\"&INT((MONTH(A41)-1)/6)+1&IF(INT((MONTH(A41)-1)/6)+1=1,\"ER SEMESTRE \",\"EME SEMESTRE \")&YEAR(A41)&\"'\"&\"!$B$7:$HA$7\"),0)-DAY(A41)-1)=\"(\"&$G$9&\")\")*(INDEX(INDIRECT(\"'\"&INT((MONTH(A41)-1)/6)+1&IF(INT((MONTH(A41)-1)/6)+1=1,\"ER SEMESTRE \",\"EME SEMESTRE \")&YEAR(A41)&\"'\"&\"!$B$9:$HA$43\"),0,MATCH($A41,INDIRECT(\"'\"&INT((MONTH(A41)-1)/6)+1&IF(INT((MONTH(A41)-1)/6)+1=1,\"ER SEMESTRE \",\"EME SEMESTRE \")&YEAR(A41)&\"'\"&\"!$B$7:$HA$7\"),0))=\"R\"),ROW(INDIRECT(\"'\"&INT((MONTH(A41)-1)/6)+1&IF(INT((MONTH(A41)-1)/6)+1=1,\"ER SEMESTRE \",\"EME SEMESTRE \")&YEAR(A41)&\"'\"&\"!$D$9:$D$43\"))-8,9^9))),\"\")),\"\")","v":""},null,{"$f":"IF(OR($B41=\"M\",$B41=\"N\",$B41=\"A\"),IF(\nIFERROR(INDEX(OFFSET(INDIRECT(\"'\"&INT((MONTH(A41)-1)/6)+1&IF(INT((MONTH(A41)-1)/6)+1=1,\"ER SEMESTRE \",\"EME SEMESTRE \")&YEAR(A41)&\"'\"&\"!$B$9:$B$43\"),0,MATCH($A41,INDIRECT(\"'\"&INT((MONTH(A41)-1)/6)+1&IF(INT((MONTH(A41)-1)/6)+1=1,\"ER SEMESTRE \",\"EME SEMESTRE \")&YEAR(A41)&\"'\"&\"!$B$7:$HA$7\"),0)-DAY(A41)-2),MIN(IF((OFFSET(INDIRECT(\"'\"&INT((MONTH(A41)-1)/6)+1&IF(INT((MONTH(A41)-1)/6)+1=1,\"ER SEMESTRE \",\"EME SEMESTRE \")&YEAR(A41)&\"'\"&\"!$B$9:$B$43\"),0,MATCH($A41,INDIRECT(\"'\"&INT((MONTH(A41)-1)/6)+1&IF(INT((MONTH(A41)-1)/6)+1=1,\"ER SEMESTRE \",\"EME SEMESTRE \")&YEAR(A41)&\"'\"&\"!$B$7:$HA$7\"),0)-DAY(A41)-1)=\"(\"&$G$9&\")\")*(INDEX(INDIRECT(\"'\"&INT((MONTH(A41)-1)/6)+1&IF(INT((MONTH(A41)-1)/6)+1=1,\"ER SEMESTRE \",\"EME SEMESTRE \")&YEAR(A41)&\"'\"&\"!$B$9:$HA$43\"),0,MATCH($A41,INDIRECT(\"'\"&INT((MONTH(A41)-1)/6)+1&IF(INT((MONTH(A41)-1)/6)+1=1,\"ER SEMESTRE \",\"EME SEMESTRE \")&YEAR(A41)&\"'\"&\"!$B$7:$HA$7\"),0))=\"J\"),ROW(INDIRECT(\"'\"&INT((MONTH(A41)-1)/6)+1&IF(INT((MONTH(A41)-1)/6)+1=1,\"ER SEMESTRE \",\"EME SEMESTRE \")&YEAR(A41)&\"'\"&\"!$D$9:$D$43\"))-8,9^9))),\"\")=\"\",\n\nIFERROR(INDEX(OFFSET(INDIRECT(\"'\"&INT((MONTH(A41)-1)/6)+1&IF(INT((MONTH(A41)-1)/6)+1=1,\"ER SEMESTRE \",\"EME SEMESTRE \")&YEAR(A41)&\"'\"&\"!$B$9:$B$43\"),0,MATCH($A41,INDIRECT(\"'\"&INT((MONTH(A41)-1)/6)+1&IF(INT((MONTH(A41)-1)/6)+1=1,\"ER SEMESTRE \",\"EME SEMESTRE \")&YEAR(A41)&\"'\"&\"!$B$7:$HA$7\"),0)-DAY(A41)-2),SMALL(IF((OFFSET(INDIRECT(\"'\"&INT((MONTH(A41)-1)/6)+1&IF(INT((MONTH(A41)-1)/6)+1=1,\"ER SEMESTRE \",\"EME SEMESTRE \")&YEAR(A41)&\"'\"&\"!$B$9:$B$43\"),0,MATCH($A41,INDIRECT(\"'\"&INT((MONTH(A41)-1)/6)+1&IF(INT((MONTH(A41)-1)/6)+1=1,\"ER SEMESTRE \",\"EME SEMESTRE \")&YEAR(A41)&\"'\"&\"!$B$7:$HA$7\"),0)-DAY(A41)-1)=\"(\"&$G$9&\")\")*(INDEX(INDIRECT(\"'\"&INT((MONTH(A41)-1)/6)+1&IF(INT((MONTH(A41)-1)/6)+1=1,\"ER SEMESTRE \",\"EME SEMESTRE \")&YEAR(A41)&\"'\"&\"!$B$9:$HA$43\"),0,MATCH($A41,INDIRECT(\"'\"&INT((MONTH(A41)-1)/6)+1&IF(INT((MONTH(A41)-1)/6)+1=1,\"ER SEMESTRE \",\"EME SEMESTRE \")&YEAR(A41)&\"'\"&\"!$B$7:$HA$7\"),0))=\"R\"),ROW(INDIRECT(\"'\"&INT((MONTH(A41)-1)/6)+1&IF(INT((MONTH(A41)-1)/6)+1=1,\"ER SEMESTRE \",\"EME SEMESTRE \")&YEAR(A41)&\"'\"&\"!D$9:D$43\"))-8,9^9),2)),\"\"),\n\nIFERROR(\nINDEX(\nOFFSET(INDIRECT(\"'\"&INT((MONTH(A41)-1)/6)+1&IF(INT((MONTH(A41)-1)/6)+1=1,\"ER SEMESTRE \",\"EME SEMESTRE \")&YEAR(A41)&\"'\"&\"!$B$9:$B$43\"),0,MATCH($A41,INDIRECT(\"'\"&INT((MONTH(A41)-1)/6)+1&IF(INT((MONTH(A41)-1)/6)+1=1,\"ER SEMESTRE \",\"EME SEMESTRE \")&YEAR(A41)&\"'\"&\"!$B$7:$HA$7\"),0)-DAY(A41)-2),\n\nMIN(IF(\n(OFFSET(INDIRECT(\"'\"&INT((MONTH(A41)-1)/6)+1&IF(INT((MONTH(A41)-1)/6)+1=1,\"ER SEMESTRE \",\"EME SEMESTRE \")&YEAR(A41)&\"'\"&\"!$B$9:$B$43\"),0,MATCH($A41,INDIRECT(\"'\"&INT((MONTH(A41)-1)/6)+1&IF(INT((MONTH(A41)-1)/6)+1=1,\"ER SEMESTRE \",\"EME SEMESTRE \")&YEAR(A41)&\"'\"&\"!$B$7:$HA$7\"),0)-DAY(A41)-1)=\"(\"&$G$9&\")\")\n*\n(INDEX(INDIRECT(\"'\"&INT((MONTH(A41)-1)/6)+1&IF(INT((MONTH(A41)-1)/6)+1=1,\"ER SEMESTRE \",\"EME SEMESTRE \")&YEAR(A41)&\"'\"&\"!$B$9:$HA$43\"),0,MATCH($A41,INDIRECT(\"'\"&INT((MONTH(A41)-1)/6)+1&IF(INT((MONTH(A41)-1)/6)+1=1,\"ER SEMESTRE \",\"EME SEMESTRE \")&YEAR(A41)&\"'\"&\"!$B$7:$HA$7\"),0))=\"R\"),\n\nROW(INDIRECT(\"'\"&INT((MONTH(A41)-1)/6)+1&IF(INT((MONTH(A41)-1)/6)+1=1,\"ER SEMESTRE \",\"EME SEMESTRE \")&YEAR(A41)&\"'\"&\"!D$9:D$43\"))-8,\n\n9^9))),\"\")),\"\")","v":""},null,{"$f":"IF(OR($B41=\"M\",$B41=\"N\",$B41=\"A\"),IF(\n\nIFERROR(INDEX(OFFSET(INDIRECT(\"'\"&INT((MONTH(A41)-1)/6)+1&IF(INT((MONTH(A41)-1)/6)+1=1,\"ER SEMESTRE \",\"EME SEMESTRE \")&YEAR(A41)&\"'\"&\"!$B$9:$B$43\"),0,MATCH($A41,INDIRECT(\"'\"&INT((MONTH(A41)-1)/6)+1&IF(INT((MONTH(A41)-1)/6)+1=1,\"ER SEMESTRE \",\"EME SEMESTRE \")&YEAR(A41)&\"'\"&\"!$B$7:$HA$7\"),0)-DAY(A41)-2),MIN(IF((OFFSET(INDIRECT(\"'\"&INT((MONTH(A41)-1)/6)+1&IF(INT((MONTH(A41)-1)/6)+1=1,\"ER SEMESTRE \",\"EME SEMESTRE \")&YEAR(A41)&\"'\"&\"!$B$9:$B$43\"),0,MATCH($A41,INDIRECT(\"'\"&INT((MONTH(A41)-1)/6)+1&IF(INT((MONTH(A41)-1)/6)+1=1,\"ER SEMESTRE \",\"EME SEMESTRE \")&YEAR(A41)&\"'\"&\"!$B$7:$HA$7\"),0)-DAY(A41)-1)=\"(\"&$G$9&\")\")*(INDEX(INDIRECT(\"'\"&INT((MONTH(A41)-1)/6)+1&IF(INT((MONTH(A41)-1)/6)+1=1,\"ER SEMESTRE \",\"EME SEMESTRE \")&YEAR(A41)&\"'\"&\"!$B$9:$HA$43\"),0,MATCH($A41,INDIRECT(\"'\"&INT((MONTH(A41)-1)/6)+1&IF(INT((MONTH(A41)-1)/6)+1=1,\"ER SEMESTRE \",\"EME SEMESTRE \")&YEAR(A41)&\"'\"&\"!$B$7:$HA$7\"),0))=\"J\"),ROW(INDIRECT(\"'\"&INT((MONTH(A41)-1)/6)+1&IF(INT((MONTH(A41)-1)/6)+1=1,\"ER SEMESTRE \",\"EME SEMESTRE \")&YEAR(A41)&\"'\"&\"!$D$9:$D$43\"))-8,9^9))),\"\")=\"\",\n\nIFERROR(\nINDEX(OFFSET(INDIRECT(\"'\"&INT((MONTH(A41)-1)/6)+1&IF(INT((MONTH(A41)-1)/6)+1=1,\"ER SEMESTRE \",\"EME SEMESTRE \")&YEAR(A41)&\"'\"&\"!$B$9:$B$43\"),0,MATCH($A41,INDIRECT(\"'\"&INT((MONTH(A41)-1)/6)+1&IF(INT((MONTH(A41)-1)/6)+1=1,\"ER SEMESTRE \",\"EME SEMESTRE \")&YEAR(A41)&\"'\"&\"!$B$7:$HA$7\"),0)-DAY(A41)-2),\nSMALL(IF((OFFSET(INDIRECT(\"'\"&INT((MONTH(A41)-1)/6)+1&IF(INT((MONTH(A41)-1)/6)+1=1,\"ER SEMESTRE \",\"EME SEMESTRE \")&YEAR(A41)&\"'\"&\"!$B$9:$B$43\"),0,MATCH($A41,INDIRECT(\"'\"&INT((MONTH(A41)-1)/6)+1&IF(INT((MONTH(A41)-1)/6)+1=1,\"ER SEMESTRE \",\"EME SEMESTRE \")&YEAR(A41)&\"'\"&\"!$B$7:$HA$7\"),0)-DAY(A41)-1)=\"(\"&$G$9&\")\")*(INDEX(INDIRECT(\"'\"&INT((MONTH(A41)-1)/6)+1&IF(INT((MONTH(A41)-1)/6)+1=1,\"ER SEMESTRE \",\"EME SEMESTRE \")&YEAR(A41)&\"'\"&\"!$B$9:$HA$43\"),0,MATCH($A41,INDIRECT(\"'\"&INT((MONTH(A41)-1)/6)+1&IF(INT((MONTH(A41)-1)/6)+1=1,\"ER SEMESTRE \",\"EME SEMESTRE \")&YEAR(A41)&\"'\"&\"!$B$7:$HA$7\"),0))=\"R\"),ROW(INDIRECT(\"'\"&INT((MONTH(A41)-1)/6)+1&IF(INT((MONTH(A41)-1)/6)+1=1,\"ER SEMESTRE \",\"EME SEMESTRE \")&YEAR(A41)&\"'\"&\"!D$9:D$43\"))-8,9^9),3)),\"\"),\n\n\nIFERROR(\nINDEX(OFFSET(INDIRECT(\"'\"&INT((MONTH(A41)-1)/6)+1&IF(INT((MONTH(A41)-1)/6)+1=1,\"ER SEMESTRE \",\"EME SEMESTRE \")&YEAR(A41)&\"'\"&\"!$B$9:$B$43\"),0,MATCH($A41,INDIRECT(\"'\"&INT((MONTH(A41)-1)/6)+1&IF(INT((MONTH(A41)-1)/6)+1=1,\"ER SEMESTRE \",\"EME SEMESTRE \")&YEAR(A41)&\"'\"&\"!$B$7:$HA$7\"),0)-DAY(A41)-2),\nSMALL(IF((OFFSET(INDIRECT(\"'\"&INT((MONTH(A41)-1)/6)+1&IF(INT((MONTH(A41)-1)/6)+1=1,\"ER SEMESTRE \",\"EME SEMESTRE \")&YEAR(A41)&\"'\"&\"!$B$9:$B$43\"),0,MATCH($A41,INDIRECT(\"'\"&INT((MONTH(A41)-1)/6)+1&IF(INT((MONTH(A41)-1)/6)+1=1,\"ER SEMESTRE \",\"EME SEMESTRE \")&YEAR(A41)&\"'\"&\"!$B$7:$HA$7\"),0)-DAY(A41)-1)=\"(\"&$G$9&\")\")*(INDEX(INDIRECT(\"'\"&INT((MONTH(A41)-1)/6)+1&IF(INT((MONTH(A41)-1)/6)+1=1,\"ER SEMESTRE \",\"EME SEMESTRE \")&YEAR(A41)&\"'\"&\"!$B$9:$HA$43\"),0,MATCH($A41,INDIRECT(\"'\"&INT((MONTH(A41)-1)/6)+1&IF(INT((MONTH(A41)-1)/6)+1=1,\"ER SEMESTRE \",\"EME SEMESTRE \")&YEAR(A41)&\"'\"&\"!$B$7:$HA$7\"),0))=\"R\"),ROW(INDIRECT(\"'\"&INT((MONTH(A41)-1)/6)+1&IF(INT((MONTH(A41)-1)/6)+1=1,\"ER SEMESTRE \",\"EME SEMESTRE \")&YEAR(A41)&\"'\"&\"!D$9:D$43\"))-8,9^9),2)),\"\")\n\n),\n\n\"\")","v":""}]
["",{"$f":"IFERROR(INDEX([3]PLANNING!$D$3:$Y$29,MATCH('[3]F_Dde de remplacement'!$G$8,[3]PLANNING!$B$3:$B$29,0),MATCH('[3]F_Dde de remplacement'!$A42,[3]PLANNING!$D$2:$Y$2,0)),\"\")","v":""},{"$f":"IF(OR($B42=\"M\",$B42=\"N\",$B42=\"A\"),IFERROR(INDEX(OFFSET(INDIRECT(\"'\"&INT((MONTH(A42)-1)/6)+1&IF(INT((MONTH(A42)-1)/6)+1=1,\"ER SEMESTRE \",\"EME SEMESTRE \")&YEAR(A42)&\"'\"&\"!$B$9:$B$43\"),0,MATCH($A42,INDIRECT(\"'\"&INT((MONTH(A42)-1)/6)+1&IF(INT((MONTH(A42)-1)/6)+1=1,\"ER SEMESTRE \",\"EME SEMESTRE \")&YEAR(A42)&\"'\"&\"!$B$7:$HA$7\"),0)-DAY(A42)-2),MIN(IF((OFFSET(INDIRECT(\"'\"&INT((MONTH(A42)-1)/6)+1&IF(INT((MONTH(A42)-1)/6)+1=1,\"ER SEMESTRE \",\"EME SEMESTRE \")&YEAR(A42)&\"'\"&\"!$B$9:$B$43\"),0,MATCH($A42,INDIRECT(\"'\"&INT((MONTH(A42)-1)/6)+1&IF(INT((MONTH(A42)-1)/6)+1=1,\"ER SEMESTRE \",\"EME SEMESTRE \")&YEAR(A42)&\"'\"&\"!$B$7:$HA$7\"),0)-DAY(A42)-1)=\"(\"&$G$9&\")\")*(INDEX(INDIRECT(\"'\"&INT((MONTH(A42)-1)/6)+1&IF(INT((MONTH(A42)-1)/6)+1=1,\"ER SEMESTRE \",\"EME SEMESTRE \")&YEAR(A42)&\"'\"&\"!$B$9:$HA$43\"),0,MATCH($A42,INDIRECT(\"'\"&INT((MONTH(A42)-1)/6)+1&IF(INT((MONTH(A42)-1)/6)+1=1,\"ER SEMESTRE \",\"EME SEMESTRE \")&YEAR(A42)&\"'\"&\"!$B$7:$HA$7\"),0))=\"J\"),ROW(INDIRECT(\"'\"&INT((MONTH(A42)-1)/6)+1&IF(INT((MONTH(A42)-1)/6)+1=1,\"ER SEMESTRE \",\"EME SEMESTRE \")&YEAR(A42)&\"'\"&\"!$D$9:$D$43\"))-8,9^9))),IFERROR(INDEX(OFFSET(INDIRECT(\"'\"&INT((MONTH(A42)-1)/6)+1&IF(INT((MONTH(A42)-1)/6)+1=1,\"ER SEMESTRE \",\"EME SEMESTRE \")&YEAR(A42)&\"'\"&\"!$B$9:$B$43\"),0,MATCH($A42,INDIRECT(\"'\"&INT((MONTH(A42)-1)/6)+1&IF(INT((MONTH(A42)-1)/6)+1=1,\"ER SEMESTRE \",\"EME SEMESTRE \")&YEAR(A42)&\"'\"&\"!$B$7:$HA$7\"),0)-DAY(A42)-2),MIN(IF((OFFSET(INDIRECT(\"'\"&INT((MONTH(A42)-1)/6)+1&IF(INT((MONTH(A42)-1)/6)+1=1,\"ER SEMESTRE \",\"EME SEMESTRE \")&YEAR(A42)&\"'\"&\"!$B$9:$B$43\"),0,MATCH($A42,INDIRECT(\"'\"&INT((MONTH(A42)-1)/6)+1&IF(INT((MONTH(A42)-1)/6)+1=1,\"ER SEMESTRE \",\"EME SEMESTRE \")&YEAR(A42)&\"'\"&\"!$B$7:$HA$7\"),0)-DAY(A42)-1)=\"(\"&$G$9&\")\")*(INDEX(INDIRECT(\"'\"&INT((MONTH(A42)-1)/6)+1&IF(INT((MONTH(A42)-1)/6)+1=1,\"ER SEMESTRE \",\"EME SEMESTRE \")&YEAR(A42)&\"'\"&\"!$B$9:$HA$43\"),0,MATCH($A42,INDIRECT(\"'\"&INT((MONTH(A42)-1)/6)+1&IF(INT((MONTH(A42)-1)/6)+1=1,\"ER SEMESTRE \",\"EME SEMESTRE \")&YEAR(A42)&\"'\"&\"!$B$7:$HA$7\"),0))=\"R\"),ROW(INDIRECT(\"'\"&INT((MONTH(A42)-1)/6)+1&IF(INT((MONTH(A42)-1)/6)+1=1,\"ER SEMESTRE \",\"EME SEMESTRE \")&YEAR(A42)&\"'\"&\"!$D$9:$D$43\"))-8,9^9))),\"\")),\"\")","v":""},null,{"$f":"IF(OR($B42=\"M\",$B42=\"N\",$B42=\"A\"),IF(\nIFERROR(INDEX(OFFSET(INDIRECT(\"'\"&INT((MONTH(A42)-1)/6)+1&IF(INT((MONTH(A42)-1)/6)+1=1,\"ER SEMESTRE \",\"EME SEMESTRE \")&YEAR(A42)&\"'\"&\"!$B$9:$B$43\"),0,MATCH($A42,INDIRECT(\"'\"&INT((MONTH(A42)-1)/6)+1&IF(INT((MONTH(A42)-1)/6)+1=1,\"ER SEMESTRE \",\"EME SEMESTRE \")&YEAR(A42)&\"'\"&\"!$B$7:$HA$7\"),0)-DAY(A42)-2),MIN(IF((OFFSET(INDIRECT(\"'\"&INT((MONTH(A42)-1)/6)+1&IF(INT((MONTH(A42)-1)/6)+1=1,\"ER SEMESTRE \",\"EME SEMESTRE \")&YEAR(A42)&\"'\"&\"!$B$9:$B$43\"),0,MATCH($A42,INDIRECT(\"'\"&INT((MONTH(A42)-1)/6)+1&IF(INT((MONTH(A42)-1)/6)+1=1,\"ER SEMESTRE \",\"EME SEMESTRE \")&YEAR(A42)&\"'\"&\"!$B$7:$HA$7\"),0)-DAY(A42)-1)=\"(\"&$G$9&\")\")*(INDEX(INDIRECT(\"'\"&INT((MONTH(A42)-1)/6)+1&IF(INT((MONTH(A42)-1)/6)+1=1,\"ER SEMESTRE \",\"EME SEMESTRE \")&YEAR(A42)&\"'\"&\"!$B$9:$HA$43\"),0,MATCH($A42,INDIRECT(\"'\"&INT((MONTH(A42)-1)/6)+1&IF(INT((MONTH(A42)-1)/6)+1=1,\"ER SEMESTRE \",\"EME SEMESTRE \")&YEAR(A42)&\"'\"&\"!$B$7:$HA$7\"),0))=\"J\"),ROW(INDIRECT(\"'\"&INT((MONTH(A42)-1)/6)+1&IF(INT((MONTH(A42)-1)/6)+1=1,\"ER SEMESTRE \",\"EME SEMESTRE \")&YEAR(A42)&\"'\"&\"!$D$9:$D$43\"))-8,9^9))),\"\")=\"\",\n\nIFERROR(INDEX(OFFSET(INDIRECT(\"'\"&INT((MONTH(A42)-1)/6)+1&IF(INT((MONTH(A42)-1)/6)+1=1,\"ER SEMESTRE \",\"EME SEMESTRE \")&YEAR(A42)&\"'\"&\"!$B$9:$B$43\"),0,MATCH($A42,INDIRECT(\"'\"&INT((MONTH(A42)-1)/6)+1&IF(INT((MONTH(A42)-1)/6)+1=1,\"ER SEMESTRE \",\"EME SEMESTRE \")&YEAR(A42)&\"'\"&\"!$B$7:$HA$7\"),0)-DAY(A42)-2),SMALL(IF((OFFSET(INDIRECT(\"'\"&INT((MONTH(A42)-1)/6)+1&IF(INT((MONTH(A42)-1)/6)+1=1,\"ER SEMESTRE \",\"EME SEMESTRE \")&YEAR(A42)&\"'\"&\"!$B$9:$B$43\"),0,MATCH($A42,INDIRECT(\"'\"&INT((MONTH(A42)-1)/6)+1&IF(INT((MONTH(A42)-1)/6)+1=1,\"ER SEMESTRE \",\"EME SEMESTRE \")&YEAR(A42)&\"'\"&\"!$B$7:$HA$7\"),0)-DAY(A42)-1)=\"(\"&$G$9&\")\")*(INDEX(INDIRECT(\"'\"&INT((MONTH(A42)-1)/6)+1&IF(INT((MONTH(A42)-1)/6)+1=1,\"ER SEMESTRE \",\"EME SEMESTRE \")&YEAR(A42)&\"'\"&\"!$B$9:$HA$43\"),0,MATCH($A42,INDIRECT(\"'\"&INT((MONTH(A42)-1)/6)+1&IF(INT((MONTH(A42)-1)/6)+1=1,\"ER SEMESTRE \",\"EME SEMESTRE \")&YEAR(A42)&\"'\"&\"!$B$7:$HA$7\"),0))=\"R\"),ROW(INDIRECT(\"'\"&INT((MONTH(A42)-1)/6)+1&IF(INT((MONTH(A42)-1)/6)+1=1,\"ER SEMESTRE \",\"EME SEMESTRE \")&YEAR(A42)&\"'\"&\"!D$9:D$43\"))-8,9^9),2)),\"\"),\n\nIFERROR(\nINDEX(\nOFFSET(INDIRECT(\"'\"&INT((MONTH(A42)-1)/6)+1&IF(INT((MONTH(A42)-1)/6)+1=1,\"ER SEMESTRE \",\"EME SEMESTRE \")&YEAR(A42)&\"'\"&\"!$B$9:$B$43\"),0,MATCH($A42,INDIRECT(\"'\"&INT((MONTH(A42)-1)/6)+1&IF(INT((MONTH(A42)-1)/6)+1=1,\"ER SEMESTRE \",\"EME SEMESTRE \")&YEAR(A42)&\"'\"&\"!$B$7:$HA$7\"),0)-DAY(A42)-2),\n\nMIN(IF(\n(OFFSET(INDIRECT(\"'\"&INT((MONTH(A42)-1)/6)+1&IF(INT((MONTH(A42)-1)/6)+1=1,\"ER SEMESTRE \",\"EME SEMESTRE \")&YEAR(A42)&\"'\"&\"!$B$9:$B$43\"),0,MATCH($A42,INDIRECT(\"'\"&INT((MONTH(A42)-1)/6)+1&IF(INT((MONTH(A42)-1)/6)+1=1,\"ER SEMESTRE \",\"EME SEMESTRE \")&YEAR(A42)&\"'\"&\"!$B$7:$HA$7\"),0)-DAY(A42)-1)=\"(\"&$G$9&\")\")\n*\n(INDEX(INDIRECT(\"'\"&INT((MONTH(A42)-1)/6)+1&IF(INT((MONTH(A42)-1)/6)+1=1,\"ER SEMESTRE \",\"EME SEMESTRE \")&YEAR(A42)&\"'\"&\"!$B$9:$HA$43\"),0,MATCH($A42,INDIRECT(\"'\"&INT((MONTH(A42)-1)/6)+1&IF(INT((MONTH(A42)-1)/6)+1=1,\"ER SEMESTRE \",\"EME SEMESTRE \")&YEAR(A42)&\"'\"&\"!$B$7:$HA$7\"),0))=\"R\"),\n\nROW(INDIRECT(\"'\"&INT((MONTH(A42)-1)/6)+1&IF(INT((MONTH(A42)-1)/6)+1=1,\"ER SEMESTRE \",\"EME SEMESTRE \")&YEAR(A42)&\"'\"&\"!D$9:D$43\"))-8,\n\n9^9))),\"\")),\"\")","v":""},null,{"$f":"IF(OR($B42=\"M\",$B42=\"N\",$B42=\"A\"),IF(\n\nIFERROR(INDEX(OFFSET(INDIRECT(\"'\"&INT((MONTH(A42)-1)/6)+1&IF(INT((MONTH(A42)-1)/6)+1=1,\"ER SEMESTRE \",\"EME SEMESTRE \")&YEAR(A42)&\"'\"&\"!$B$9:$B$43\"),0,MATCH($A42,INDIRECT(\"'\"&INT((MONTH(A42)-1)/6)+1&IF(INT((MONTH(A42)-1)/6)+1=1,\"ER SEMESTRE \",\"EME SEMESTRE \")&YEAR(A42)&\"'\"&\"!$B$7:$HA$7\"),0)-DAY(A42)-2),MIN(IF((OFFSET(INDIRECT(\"'\"&INT((MONTH(A42)-1)/6)+1&IF(INT((MONTH(A42)-1)/6)+1=1,\"ER SEMESTRE \",\"EME SEMESTRE \")&YEAR(A42)&\"'\"&\"!$B$9:$B$43\"),0,MATCH($A42,INDIRECT(\"'\"&INT((MONTH(A42)-1)/6)+1&IF(INT((MONTH(A42)-1)/6)+1=1,\"ER SEMESTRE \",\"EME SEMESTRE \")&YEAR(A42)&\"'\"&\"!$B$7:$HA$7\"),0)-DAY(A42)-1)=\"(\"&$G$9&\")\")*(INDEX(INDIRECT(\"'\"&INT((MONTH(A42)-1)/6)+1&IF(INT((MONTH(A42)-1)/6)+1=1,\"ER SEMESTRE \",\"EME SEMESTRE \")&YEAR(A42)&\"'\"&\"!$B$9:$HA$43\"),0,MATCH($A42,INDIRECT(\"'\"&INT((MONTH(A42)-1)/6)+1&IF(INT((MONTH(A42)-1)/6)+1=1,\"ER SEMESTRE \",\"EME SEMESTRE \")&YEAR(A42)&\"'\"&\"!$B$7:$HA$7\"),0))=\"J\"),ROW(INDIRECT(\"'\"&INT((MONTH(A42)-1)/6)+1&IF(INT((MONTH(A42)-1)/6)+1=1,\"ER SEMESTRE \",\"EME SEMESTRE \")&YEAR(A42)&\"'\"&\"!$D$9:$D$43\"))-8,9^9))),\"\")=\"\",\n\nIFERROR(\nINDEX(OFFSET(INDIRECT(\"'\"&INT((MONTH(A42)-1)/6)+1&IF(INT((MONTH(A42)-1)/6)+1=1,\"ER SEMESTRE \",\"EME SEMESTRE \")&YEAR(A42)&\"'\"&\"!$B$9:$B$43\"),0,MATCH($A42,INDIRECT(\"'\"&INT((MONTH(A42)-1)/6)+1&IF(INT((MONTH(A42)-1)/6)+1=1,\"ER SEMESTRE \",\"EME SEMESTRE \")&YEAR(A42)&\"'\"&\"!$B$7:$HA$7\"),0)-DAY(A42)-2),\nSMALL(IF((OFFSET(INDIRECT(\"'\"&INT((MONTH(A42)-1)/6)+1&IF(INT((MONTH(A42)-1)/6)+1=1,\"ER SEMESTRE \",\"EME SEMESTRE \")&YEAR(A42)&\"'\"&\"!$B$9:$B$43\"),0,MATCH($A42,INDIRECT(\"'\"&INT((MONTH(A42)-1)/6)+1&IF(INT((MONTH(A42)-1)/6)+1=1,\"ER SEMESTRE \",\"EME SEMESTRE \")&YEAR(A42)&\"'\"&\"!$B$7:$HA$7\"),0)-DAY(A42)-1)=\"(\"&$G$9&\")\")*(INDEX(INDIRECT(\"'\"&INT((MONTH(A42)-1)/6)+1&IF(INT((MONTH(A42)-1)/6)+1=1,\"ER SEMESTRE \",\"EME SEMESTRE \")&YEAR(A42)&\"'\"&\"!$B$9:$HA$43\"),0,MATCH($A42,INDIRECT(\"'\"&INT((MONTH(A42)-1)/6)+1&IF(INT((MONTH(A42)-1)/6)+1=1,\"ER SEMESTRE \",\"EME SEMESTRE \")&YEAR(A42)&\"'\"&\"!$B$7:$HA$7\"),0))=\"R\"),ROW(INDIRECT(\"'\"&INT((MONTH(A42)-1)/6)+1&IF(INT((MONTH(A42)-1)/6)+1=1,\"ER SEMESTRE \",\"EME SEMESTRE \")&YEAR(A42)&\"'\"&\"!D$9:D$43\"))-8,9^9),3)),\"\"),\n\n\nIFERROR(\nINDEX(OFFSET(INDIRECT(\"'\"&INT((MONTH(A42)-1)/6)+1&IF(INT((MONTH(A42)-1)/6)+1=1,\"ER SEMESTRE \",\"EME SEMESTRE \")&YEAR(A42)&\"'\"&\"!$B$9:$B$43\"),0,MATCH($A42,INDIRECT(\"'\"&INT((MONTH(A42)-1)/6)+1&IF(INT((MONTH(A42)-1)/6)+1=1,\"ER SEMESTRE \",\"EME SEMESTRE \")&YEAR(A42)&\"'\"&\"!$B$7:$HA$7\"),0)-DAY(A42)-2),\nSMALL(IF((OFFSET(INDIRECT(\"'\"&INT((MONTH(A42)-1)/6)+1&IF(INT((MONTH(A42)-1)/6)+1=1,\"ER SEMESTRE \",\"EME SEMESTRE \")&YEAR(A42)&\"'\"&\"!$B$9:$B$43\"),0,MATCH($A42,INDIRECT(\"'\"&INT((MONTH(A42)-1)/6)+1&IF(INT((MONTH(A42)-1)/6)+1=1,\"ER SEMESTRE \",\"EME SEMESTRE \")&YEAR(A42)&\"'\"&\"!$B$7:$HA$7\"),0)-DAY(A42)-1)=\"(\"&$G$9&\")\")*(INDEX(INDIRECT(\"'\"&INT((MONTH(A42)-1)/6)+1&IF(INT((MONTH(A42)-1)/6)+1=1,\"ER SEMESTRE \",\"EME SEMESTRE \")&YEAR(A42)&\"'\"&\"!$B$9:$HA$43\"),0,MATCH($A42,INDIRECT(\"'\"&INT((MONTH(A42)-1)/6)+1&IF(INT((MONTH(A42)-1)/6)+1=1,\"ER SEMESTRE \",\"EME SEMESTRE \")&YEAR(A42)&\"'\"&\"!$B$7:$HA$7\"),0))=\"R\"),ROW(INDIRECT(\"'\"&INT((MONTH(A42)-1)/6)+1&IF(INT((MONTH(A42)-1)/6)+1=1,\"ER SEMESTRE \",\"EME SEMESTRE \")&YEAR(A42)&\"'\"&\"!D$9:D$43\"))-8,9^9),2)),\"\")\n\n),\n\n\"\")","v":""}]
["",{"$f":"IFERROR(INDEX([3]PLANNING!$D$3:$Y$29,MATCH('[3]F_Dde de remplacement'!$G$8,[3]PLANNING!$B$3:$B$29,0),MATCH('[3]F_Dde de remplacement'!$A43,[3]PLANNING!$D$2:$Y$2,0)),\"\")","v":""},{"$f":"IF(OR($B43=\"M\",$B43=\"N\",$B43=\"A\"),IFERROR(INDEX(OFFSET(INDIRECT(\"'\"&INT((MONTH(A43)-1)/6)+1&IF(INT((MONTH(A43)-1)/6)+1=1,\"ER SEMESTRE \",\"EME SEMESTRE \")&YEAR(A43)&\"'\"&\"!$B$9:$B$43\"),0,MATCH($A43,INDIRECT(\"'\"&INT((MONTH(A43)-1)/6)+1&IF(INT((MONTH(A43)-1)/6)+1=1,\"ER SEMESTRE \",\"EME SEMESTRE \")&YEAR(A43)&\"'\"&\"!$B$7:$HA$7\"),0)-DAY(A43)-2),MIN(IF((OFFSET(INDIRECT(\"'\"&INT((MONTH(A43)-1)/6)+1&IF(INT((MONTH(A43)-1)/6)+1=1,\"ER SEMESTRE \",\"EME SEMESTRE \")&YEAR(A43)&\"'\"&\"!$B$9:$B$43\"),0,MATCH($A43,INDIRECT(\"'\"&INT((MONTH(A43)-1)/6)+1&IF(INT((MONTH(A43)-1)/6)+1=1,\"ER SEMESTRE \",\"EME SEMESTRE \")&YEAR(A43)&\"'\"&\"!$B$7:$HA$7\"),0)-DAY(A43)-1)=\"(\"&$G$9&\")\")*(INDEX(INDIRECT(\"'\"&INT((MONTH(A43)-1)/6)+1&IF(INT((MONTH(A43)-1)/6)+1=1,\"ER SEMESTRE \",\"EME SEMESTRE \")&YEAR(A43)&\"'\"&\"!$B$9:$HA$43\"),0,MATCH($A43,INDIRECT(\"'\"&INT((MONTH(A43)-1)/6)+1&IF(INT((MONTH(A43)-1)/6)+1=1,\"ER SEMESTRE \",\"EME SEMESTRE \")&YEAR(A43)&\"'\"&\"!$B$7:$HA$7\"),0))=\"J\"),ROW(INDIRECT(\"'\"&INT((MONTH(A43)-1)/6)+1&IF(INT((MONTH(A43)-1)/6)+1=1,\"ER SEMESTRE \",\"EME SEMESTRE \")&YEAR(A43)&\"'\"&\"!$D$9:$D$43\"))-8,9^9))),IFERROR(INDEX(OFFSET(INDIRECT(\"'\"&INT((MONTH(A43)-1)/6)+1&IF(INT((MONTH(A43)-1)/6)+1=1,\"ER SEMESTRE \",\"EME SEMESTRE \")&YEAR(A43)&\"'\"&\"!$B$9:$B$43\"),0,MATCH($A43,INDIRECT(\"'\"&INT((MONTH(A43)-1)/6)+1&IF(INT((MONTH(A43)-1)/6)+1=1,\"ER SEMESTRE \",\"EME SEMESTRE \")&YEAR(A43)&\"'\"&\"!$B$7:$HA$7\"),0)-DAY(A43)-2),MIN(IF((OFFSET(INDIRECT(\"'\"&INT((MONTH(A43)-1)/6)+1&IF(INT((MONTH(A43)-1)/6)+1=1,\"ER SEMESTRE \",\"EME SEMESTRE \")&YEAR(A43)&\"'\"&\"!$B$9:$B$43\"),0,MATCH($A43,INDIRECT(\"'\"&INT((MONTH(A43)-1)/6)+1&IF(INT((MONTH(A43)-1)/6)+1=1,\"ER SEMESTRE \",\"EME SEMESTRE \")&YEAR(A43)&\"'\"&\"!$B$7:$HA$7\"),0)-DAY(A43)-1)=\"(\"&$G$9&\")\")*(INDEX(INDIRECT(\"'\"&INT((MONTH(A43)-1)/6)+1&IF(INT((MONTH(A43)-1)/6)+1=1,\"ER SEMESTRE \",\"EME SEMESTRE \")&YEAR(A43)&\"'\"&\"!$B$9:$HA$43\"),0,MATCH($A43,INDIRECT(\"'\"&INT((MONTH(A43)-1)/6)+1&IF(INT((MONTH(A43)-1)/6)+1=1,\"ER SEMESTRE \",\"EME SEMESTRE \")&YEAR(A43)&\"'\"&\"!$B$7:$HA$7\"),0))=\"R\"),ROW(INDIRECT(\"'\"&INT((MONTH(A43)-1)/6)+1&IF(INT((MONTH(A43)-1)/6)+1=1,\"ER SEMESTRE \",\"EME SEMESTRE \")&YEAR(A43)&\"'\"&\"!$D$9:$D$43\"))-8,9^9))),\"\")),\"\")","v":""},null,{"$f":"IF(OR($B43=\"M\",$B43=\"N\",$B43=\"A\"),IF(\nIFERROR(INDEX(OFFSET(INDIRECT(\"'\"&INT((MONTH(A43)-1)/6)+1&IF(INT((MONTH(A43)-1)/6)+1=1,\"ER SEMESTRE \",\"EME SEMESTRE \")&YEAR(A43)&\"'\"&\"!$B$9:$B$43\"),0,MATCH($A43,INDIRECT(\"'\"&INT((MONTH(A43)-1)/6)+1&IF(INT((MONTH(A43)-1)/6)+1=1,\"ER SEMESTRE \",\"EME SEMESTRE \")&YEAR(A43)&\"'\"&\"!$B$7:$HA$7\"),0)-DAY(A43)-2),MIN(IF((OFFSET(INDIRECT(\"'\"&INT((MONTH(A43)-1)/6)+1&IF(INT((MONTH(A43)-1)/6)+1=1,\"ER SEMESTRE \",\"EME SEMESTRE \")&YEAR(A43)&\"'\"&\"!$B$9:$B$43\"),0,MATCH($A43,INDIRECT(\"'\"&INT((MONTH(A43)-1)/6)+1&IF(INT((MONTH(A43)-1)/6)+1=1,\"ER SEMESTRE \",\"EME SEMESTRE \")&YEAR(A43)&\"'\"&\"!$B$7:$HA$7\"),0)-DAY(A43)-1)=\"(\"&$G$9&\")\")*(INDEX(INDIRECT(\"'\"&INT((MONTH(A43)-1)/6)+1&IF(INT((MONTH(A43)-1)/6)+1=1,\"ER SEMESTRE \",\"EME SEMESTRE \")&YEAR(A43)&\"'\"&\"!$B$9:$HA$43\"),0,MATCH($A43,INDIRECT(\"'\"&INT((MONTH(A43)-1)/6)+1&IF(INT((MONTH(A43)-1)/6)+1=1,\"ER SEMESTRE \",\"EME SEMESTRE \")&YEAR(A43)&\"'\"&\"!$B$7:$HA$7\"),0))=\"J\"),ROW(INDIRECT(\"'\"&INT((MONTH(A43)-1)/6)+1&IF(INT((MONTH(A43)-1)/6)+1=1,\"ER SEMESTRE \",\"EME SEMESTRE \")&YEAR(A43)&\"'\"&\"!$D$9:$D$43\"))-8,9^9))),\"\")=\"\",\n\nIFERROR(INDEX(OFFSET(INDIRECT(\"'\"&INT((MONTH(A43)-1)/6)+1&IF(INT((MONTH(A43)-1)/6)+1=1,\"ER SEMESTRE \",\"EME SEMESTRE \")&YEAR(A43)&\"'\"&\"!$B$9:$B$43\"),0,MATCH($A43,INDIRECT(\"'\"&INT((MONTH(A43)-1)/6)+1&IF(INT((MONTH(A43)-1)/6)+1=1,\"ER SEMESTRE \",\"EME SEMESTRE \")&YEAR(A43)&\"'\"&\"!$B$7:$HA$7\"),0)-DAY(A43)-2),SMALL(IF((OFFSET(INDIRECT(\"'\"&INT((MONTH(A43)-1)/6)+1&IF(INT((MONTH(A43)-1)/6)+1=1,\"ER SEMESTRE \",\"EME SEMESTRE \")&YEAR(A43)&\"'\"&\"!$B$9:$B$43\"),0,MATCH($A43,INDIRECT(\"'\"&INT((MONTH(A43)-1)/6)+1&IF(INT((MONTH(A43)-1)/6)+1=1,\"ER SEMESTRE \",\"EME SEMESTRE \")&YEAR(A43)&\"'\"&\"!$B$7:$HA$7\"),0)-DAY(A43)-1)=\"(\"&$G$9&\")\")*(INDEX(INDIRECT(\"'\"&INT((MONTH(A43)-1)/6)+1&IF(INT((MONTH(A43)-1)/6)+1=1,\"ER SEMESTRE \",\"EME SEMESTRE \")&YEAR(A43)&\"'\"&\"!$B$9:$HA$43\"),0,MATCH($A43,INDIRECT(\"'\"&INT((MONTH(A43)-1)/6)+1&IF(INT((MONTH(A43)-1)/6)+1=1,\"ER SEMESTRE \",\"EME SEMESTRE \")&YEAR(A43)&\"'\"&\"!$B$7:$HA$7\"),0))=\"R\"),ROW(INDIRECT(\"'\"&INT((MONTH(A43)-1)/6)+1&IF(INT((MONTH(A43)-1)/6)+1=1,\"ER SEMESTRE \",\"EME SEMESTRE \")&YEAR(A43)&\"'\"&\"!D$9:D$43\"))-8,9^9),2)),\"\"),\n\nIFERROR(\nINDEX(\nOFFSET(INDIRECT(\"'\"&INT((MONTH(A43)-1)/6)+1&IF(INT((MONTH(A43)-1)/6)+1=1,\"ER SEMESTRE \",\"EME SEMESTRE \")&YEAR(A43)&\"'\"&\"!$B$9:$B$43\"),0,MATCH($A43,INDIRECT(\"'\"&INT((MONTH(A43)-1)/6)+1&IF(INT((MONTH(A43)-1)/6)+1=1,\"ER SEMESTRE \",\"EME SEMESTRE \")&YEAR(A43)&\"'\"&\"!$B$7:$HA$7\"),0)-DAY(A43)-2),\n\nMIN(IF(\n(OFFSET(INDIRECT(\"'\"&INT((MONTH(A43)-1)/6)+1&IF(INT((MONTH(A43)-1)/6)+1=1,\"ER SEMESTRE \",\"EME SEMESTRE \")&YEAR(A43)&\"'\"&\"!$B$9:$B$43\"),0,MATCH($A43,INDIRECT(\"'\"&INT((MONTH(A43)-1)/6)+1&IF(INT((MONTH(A43)-1)/6)+1=1,\"ER SEMESTRE \",\"EME SEMESTRE \")&YEAR(A43)&\"'\"&\"!$B$7:$HA$7\"),0)-DAY(A43)-1)=\"(\"&$G$9&\")\")\n*\n(INDEX(INDIRECT(\"'\"&INT((MONTH(A43)-1)/6)+1&IF(INT((MONTH(A43)-1)/6)+1=1,\"ER SEMESTRE \",\"EME SEMESTRE \")&YEAR(A43)&\"'\"&\"!$B$9:$HA$43\"),0,MATCH($A43,INDIRECT(\"'\"&INT((MONTH(A43)-1)/6)+1&IF(INT((MONTH(A43)-1)/6)+1=1,\"ER SEMESTRE \",\"EME SEMESTRE \")&YEAR(A43)&\"'\"&\"!$B$7:$HA$7\"),0))=\"R\"),\n\nROW(INDIRECT(\"'\"&INT((MONTH(A43)-1)/6)+1&IF(INT((MONTH(A43)-1)/6)+1=1,\"ER SEMESTRE \",\"EME SEMESTRE \")&YEAR(A43)&\"'\"&\"!D$9:D$43\"))-8,\n\n9^9))),\"\")),\"\")","v":""},null,{"$f":"IF(OR($B43=\"M\",$B43=\"N\",$B43=\"A\"),IF(\n\nIFERROR(INDEX(OFFSET(INDIRECT(\"'\"&INT((MONTH(A43)-1)/6)+1&IF(INT((MONTH(A43)-1)/6)+1=1,\"ER SEMESTRE \",\"EME SEMESTRE \")&YEAR(A43)&\"'\"&\"!$B$9:$B$43\"),0,MATCH($A43,INDIRECT(\"'\"&INT((MONTH(A43)-1)/6)+1&IF(INT((MONTH(A43)-1)/6)+1=1,\"ER SEMESTRE \",\"EME SEMESTRE \")&YEAR(A43)&\"'\"&\"!$B$7:$HA$7\"),0)-DAY(A43)-2),MIN(IF((OFFSET(INDIRECT(\"'\"&INT((MONTH(A43)-1)/6)+1&IF(INT((MONTH(A43)-1)/6)+1=1,\"ER SEMESTRE \",\"EME SEMESTRE \")&YEAR(A43)&\"'\"&\"!$B$9:$B$43\"),0,MATCH($A43,INDIRECT(\"'\"&INT((MONTH(A43)-1)/6)+1&IF(INT((MONTH(A43)-1)/6)+1=1,\"ER SEMESTRE \",\"EME SEMESTRE \")&YEAR(A43)&\"'\"&\"!$B$7:$HA$7\"),0)-DAY(A43)-1)=\"(\"&$G$9&\")\")*(INDEX(INDIRECT(\"'\"&INT((MONTH(A43)-1)/6)+1&IF(INT((MONTH(A43)-1)/6)+1=1,\"ER SEMESTRE \",\"EME SEMESTRE \")&YEAR(A43)&\"'\"&\"!$B$9:$HA$43\"),0,MATCH($A43,INDIRECT(\"'\"&INT((MONTH(A43)-1)/6)+1&IF(INT((MONTH(A43)-1)/6)+1=1,\"ER SEMESTRE \",\"EME SEMESTRE \")&YEAR(A43)&\"'\"&\"!$B$7:$HA$7\"),0))=\"J\"),ROW(INDIRECT(\"'\"&INT((MONTH(A43)-1)/6)+1&IF(INT((MONTH(A43)-1)/6)+1=1,\"ER SEMESTRE \",\"EME SEMESTRE \")&YEAR(A43)&\"'\"&\"!$D$9:$D$43\"))-8,9^9))),\"\")=\"\",\n\nIFERROR(\nINDEX(OFFSET(INDIRECT(\"'\"&INT((MONTH(A43)-1)/6)+1&IF(INT((MONTH(A43)-1)/6)+1=1,\"ER SEMESTRE \",\"EME SEMESTRE \")&YEAR(A43)&\"'\"&\"!$B$9:$B$43\"),0,MATCH($A43,INDIRECT(\"'\"&INT((MONTH(A43)-1)/6)+1&IF(INT((MONTH(A43)-1)/6)+1=1,\"ER SEMESTRE \",\"EME SEMESTRE \")&YEAR(A43)&\"'\"&\"!$B$7:$HA$7\"),0)-DAY(A43)-2),\nSMALL(IF((OFFSET(INDIRECT(\"'\"&INT((MONTH(A43)-1)/6)+1&IF(INT((MONTH(A43)-1)/6)+1=1,\"ER SEMESTRE \",\"EME SEMESTRE \")&YEAR(A43)&\"'\"&\"!$B$9:$B$43\"),0,MATCH($A43,INDIRECT(\"'\"&INT((MONTH(A43)-1)/6)+1&IF(INT((MONTH(A43)-1)/6)+1=1,\"ER SEMESTRE \",\"EME SEMESTRE \")&YEAR(A43)&\"'\"&\"!$B$7:$HA$7\"),0)-DAY(A43)-1)=\"(\"&$G$9&\")\")*(INDEX(INDIRECT(\"'\"&INT((MONTH(A43)-1)/6)+1&IF(INT((MONTH(A43)-1)/6)+1=1,\"ER SEMESTRE \",\"EME SEMESTRE \")&YEAR(A43)&\"'\"&\"!$B$9:$HA$43\"),0,MATCH($A43,INDIRECT(\"'\"&INT((MONTH(A43)-1)/6)+1&IF(INT((MONTH(A43)-1)/6)+1=1,\"ER SEMESTRE \",\"EME SEMESTRE \")&YEAR(A43)&\"'\"&\"!$B$7:$HA$7\"),0))=\"R\"),ROW(INDIRECT(\"'\"&INT((MONTH(A43)-1)/6)+1&IF(INT((MONTH(A43)-1)/6)+1=1,\"ER SEMESTRE \",\"EME SEMESTRE \")&YEAR(A43)&\"'\"&\"!D$9:D$43\"))-8,9^9),3)),\"\"),\n\n\nIFERROR(\nINDEX(OFFSET(INDIRECT(\"'\"&INT((MONTH(A43)-1)/6)+1&IF(INT((MONTH(A43)-1)/6)+1=1,\"ER SEMESTRE \",\"EME SEMESTRE \")&YEAR(A43)&\"'\"&\"!$B$9:$B$43\"),0,MATCH($A43,INDIRECT(\"'\"&INT((MONTH(A43)-1)/6)+1&IF(INT((MONTH(A43)-1)/6)+1=1,\"ER SEMESTRE \",\"EME SEMESTRE \")&YEAR(A43)&\"'\"&\"!$B$7:$HA$7\"),0)-DAY(A43)-2),\nSMALL(IF((OFFSET(INDIRECT(\"'\"&INT((MONTH(A43)-1)/6)+1&IF(INT((MONTH(A43)-1)/6)+1=1,\"ER SEMESTRE \",\"EME SEMESTRE \")&YEAR(A43)&\"'\"&\"!$B$9:$B$43\"),0,MATCH($A43,INDIRECT(\"'\"&INT((MONTH(A43)-1)/6)+1&IF(INT((MONTH(A43)-1)/6)+1=1,\"ER SEMESTRE \",\"EME SEMESTRE \")&YEAR(A43)&\"'\"&\"!$B$7:$HA$7\"),0)-DAY(A43)-1)=\"(\"&$G$9&\")\")*(INDEX(INDIRECT(\"'\"&INT((MONTH(A43)-1)/6)+1&IF(INT((MONTH(A43)-1)/6)+1=1,\"ER SEMESTRE \",\"EME SEMESTRE \")&YEAR(A43)&\"'\"&\"!$B$9:$HA$43\"),0,MATCH($A43,INDIRECT(\"'\"&INT((MONTH(A43)-1)/6)+1&IF(INT((MONTH(A43)-1)/6)+1=1,\"ER SEMESTRE \",\"EME SEMESTRE \")&YEAR(A43)&\"'\"&\"!$B$7:$HA$7\"),0))=\"R\"),ROW(INDIRECT(\"'\"&INT((MONTH(A43)-1)/6)+1&IF(INT((MONTH(A43)-1)/6)+1=1,\"ER SEMESTRE \",\"EME SEMESTRE \")&YEAR(A43)&\"'\"&\"!D$9:D$43\"))-8,9^9),2)),\"\")\n\n),\n\n\"\")","v":""}]
["",{"$f":"IFERROR(INDEX([3]PLANNING!$D$3:$Y$29,MATCH('[3]F_Dde de remplacement'!$G$8,[3]PLANNING!$B$3:$B$29,0),MATCH('[3]F_Dde de remplacement'!$A44,[3]PLANNING!$D$2:$Y$2,0)),\"\")","v":""},{"$f":"IF(OR($B44=\"M\",$B44=\"N\",$B44=\"A\"),IFERROR(INDEX(OFFSET(INDIRECT(\"'\"&INT((MONTH(A44)-1)/6)+1&IF(INT((MONTH(A44)-1)/6)+1=1,\"ER SEMESTRE \",\"EME SEMESTRE \")&YEAR(A44)&\"'\"&\"!$B$9:$B$43\"),0,MATCH($A44,INDIRECT(\"'\"&INT((MONTH(A44)-1)/6)+1&IF(INT((MONTH(A44)-1)/6)+1=1,\"ER SEMESTRE \",\"EME SEMESTRE \")&YEAR(A44)&\"'\"&\"!$B$7:$HA$7\"),0)-DAY(A44)-2),MIN(IF((OFFSET(INDIRECT(\"'\"&INT((MONTH(A44)-1)/6)+1&IF(INT((MONTH(A44)-1)/6)+1=1,\"ER SEMESTRE \",\"EME SEMESTRE \")&YEAR(A44)&\"'\"&\"!$B$9:$B$43\"),0,MATCH($A44,INDIRECT(\"'\"&INT((MONTH(A44)-1)/6)+1&IF(INT((MONTH(A44)-1)/6)+1=1,\"ER SEMESTRE \",\"EME SEMESTRE \")&YEAR(A44)&\"'\"&\"!$B$7:$HA$7\"),0)-DAY(A44)-1)=\"(\"&$G$9&\")\")*(INDEX(INDIRECT(\"'\"&INT((MONTH(A44)-1)/6)+1&IF(INT((MONTH(A44)-1)/6)+1=1,\"ER SEMESTRE \",\"EME SEMESTRE \")&YEAR(A44)&\"'\"&\"!$B$9:$HA$43\"),0,MATCH($A44,INDIRECT(\"'\"&INT((MONTH(A44)-1)/6)+1&IF(INT((MONTH(A44)-1)/6)+1=1,\"ER SEMESTRE \",\"EME SEMESTRE \")&YEAR(A44)&\"'\"&\"!$B$7:$HA$7\"),0))=\"J\"),ROW(INDIRECT(\"'\"&INT((MONTH(A44)-1)/6)+1&IF(INT((MONTH(A44)-1)/6)+1=1,\"ER SEMESTRE \",\"EME SEMESTRE \")&YEAR(A44)&\"'\"&\"!$D$9:$D$43\"))-8,9^9))),IFERROR(INDEX(OFFSET(INDIRECT(\"'\"&INT((MONTH(A44)-1)/6)+1&IF(INT((MONTH(A44)-1)/6)+1=1,\"ER SEMESTRE \",\"EME SEMESTRE \")&YEAR(A44)&\"'\"&\"!$B$9:$B$43\"),0,MATCH($A44,INDIRECT(\"'\"&INT((MONTH(A44)-1)/6)+1&IF(INT((MONTH(A44)-1)/6)+1=1,\"ER SEMESTRE \",\"EME SEMESTRE \")&YEAR(A44)&\"'\"&\"!$B$7:$HA$7\"),0)-DAY(A44)-2),MIN(IF((OFFSET(INDIRECT(\"'\"&INT((MONTH(A44)-1)/6)+1&IF(INT((MONTH(A44)-1)/6)+1=1,\"ER SEMESTRE \",\"EME SEMESTRE \")&YEAR(A44)&\"'\"&\"!$B$9:$B$43\"),0,MATCH($A44,INDIRECT(\"'\"&INT((MONTH(A44)-1)/6)+1&IF(INT((MONTH(A44)-1)/6)+1=1,\"ER SEMESTRE \",\"EME SEMESTRE \")&YEAR(A44)&\"'\"&\"!$B$7:$HA$7\"),0)-DAY(A44)-1)=\"(\"&$G$9&\")\")*(INDEX(INDIRECT(\"'\"&INT((MONTH(A44)-1)/6)+1&IF(INT((MONTH(A44)-1)/6)+1=1,\"ER SEMESTRE \",\"EME SEMESTRE \")&YEAR(A44)&\"'\"&\"!$B$9:$HA$43\"),0,MATCH($A44,INDIRECT(\"'\"&INT((MONTH(A44)-1)/6)+1&IF(INT((MONTH(A44)-1)/6)+1=1,\"ER SEMESTRE \",\"EME SEMESTRE \")&YEAR(A44)&\"'\"&\"!$B$7:$HA$7\"),0))=\"R\"),ROW(INDIRECT(\"'\"&INT((MONTH(A44)-1)/6)+1&IF(INT((MONTH(A44)-1)/6)+1=1,\"ER SEMESTRE \",\"EME SEMESTRE \")&YEAR(A44)&\"'\"&\"!$D$9:$D$43\"))-8,9^9))),\"\")),\"\")","v":""},null,{"$f":"IF(OR($B44=\"M\",$B44=\"N\",$B44=\"A\"),IF(\nIFERROR(INDEX(OFFSET(INDIRECT(\"'\"&INT((MONTH(A44)-1)/6)+1&IF(INT((MONTH(A44)-1)/6)+1=1,\"ER SEMESTRE \",\"EME SEMESTRE \")&YEAR(A44)&\"'\"&\"!$B$9:$B$43\"),0,MATCH($A44,INDIRECT(\"'\"&INT((MONTH(A44)-1)/6)+1&IF(INT((MONTH(A44)-1)/6)+1=1,\"ER SEMESTRE \",\"EME SEMESTRE \")&YEAR(A44)&\"'\"&\"!$B$7:$HA$7\"),0)-DAY(A44)-2),MIN(IF((OFFSET(INDIRECT(\"'\"&INT((MONTH(A44)-1)/6)+1&IF(INT((MONTH(A44)-1)/6)+1=1,\"ER SEMESTRE \",\"EME SEMESTRE \")&YEAR(A44)&\"'\"&\"!$B$9:$B$43\"),0,MATCH($A44,INDIRECT(\"'\"&INT((MONTH(A44)-1)/6)+1&IF(INT((MONTH(A44)-1)/6)+1=1,\"ER SEMESTRE \",\"EME SEMESTRE \")&YEAR(A44)&\"'\"&\"!$B$7:$HA$7\"),0)-DAY(A44)-1)=\"(\"&$G$9&\")\")*(INDEX(INDIRECT(\"'\"&INT((MONTH(A44)-1)/6)+1&IF(INT((MONTH(A44)-1)/6)+1=1,\"ER SEMESTRE \",\"EME SEMESTRE \")&YEAR(A44)&\"'\"&\"!$B$9:$HA$43\"),0,MATCH($A44,INDIRECT(\"'\"&INT((MONTH(A44)-1)/6)+1&IF(INT((MONTH(A44)-1)/6)+1=1,\"ER SEMESTRE \",\"EME SEMESTRE \")&YEAR(A44)&\"'\"&\"!$B$7:$HA$7\"),0))=\"J\"),ROW(INDIRECT(\"'\"&INT((MONTH(A44)-1)/6)+1&IF(INT((MONTH(A44)-1)/6)+1=1,\"ER SEMESTRE \",\"EME SEMESTRE \")&YEAR(A44)&\"'\"&\"!$D$9:$D$43\"))-8,9^9))),\"\")=\"\",\n\nIFERROR(INDEX(OFFSET(INDIRECT(\"'\"&INT((MONTH(A44)-1)/6)+1&IF(INT((MONTH(A44)-1)/6)+1=1,\"ER SEMESTRE \",\"EME SEMESTRE \")&YEAR(A44)&\"'\"&\"!$B$9:$B$43\"),0,MATCH($A44,INDIRECT(\"'\"&INT((MONTH(A44)-1)/6)+1&IF(INT((MONTH(A44)-1)/6)+1=1,\"ER SEMESTRE \",\"EME SEMESTRE \")&YEAR(A44)&\"'\"&\"!$B$7:$HA$7\"),0)-DAY(A44)-2),SMALL(IF((OFFSET(INDIRECT(\"'\"&INT((MONTH(A44)-1)/6)+1&IF(INT((MONTH(A44)-1)/6)+1=1,\"ER SEMESTRE \",\"EME SEMESTRE \")&YEAR(A44)&\"'\"&\"!$B$9:$B$43\"),0,MATCH($A44,INDIRECT(\"'\"&INT((MONTH(A44)-1)/6)+1&IF(INT((MONTH(A44)-1)/6)+1=1,\"ER SEMESTRE \",\"EME SEMESTRE \")&YEAR(A44)&\"'\"&\"!$B$7:$HA$7\"),0)-DAY(A44)-1)=\"(\"&$G$9&\")\")*(INDEX(INDIRECT(\"'\"&INT((MONTH(A44)-1)/6)+1&IF(INT((MONTH(A44)-1)/6)+1=1,\"ER SEMESTRE \",\"EME SEMESTRE \")&YEAR(A44)&\"'\"&\"!$B$9:$HA$43\"),0,MATCH($A44,INDIRECT(\"'\"&INT((MONTH(A44)-1)/6)+1&IF(INT((MONTH(A44)-1)/6)+1=1,\"ER SEMESTRE \",\"EME SEMESTRE \")&YEAR(A44)&\"'\"&\"!$B$7:$HA$7\"),0))=\"R\"),ROW(INDIRECT(\"'\"&INT((MONTH(A44)-1)/6)+1&IF(INT((MONTH(A44)-1)/6)+1=1,\"ER SEMESTRE \",\"EME SEMESTRE \")&YEAR(A44)&\"'\"&\"!D$9:D$43\"))-8,9^9),2)),\"\"),\n\nIFERROR(\nINDEX(\nOFFSET(INDIRECT(\"'\"&INT((MONTH(A44)-1)/6)+1&IF(INT((MONTH(A44)-1)/6)+1=1,\"ER SEMESTRE \",\"EME SEMESTRE \")&YEAR(A44)&\"'\"&\"!$B$9:$B$43\"),0,MATCH($A44,INDIRECT(\"'\"&INT((MONTH(A44)-1)/6)+1&IF(INT((MONTH(A44)-1)/6)+1=1,\"ER SEMESTRE \",\"EME SEMESTRE \")&YEAR(A44)&\"'\"&\"!$B$7:$HA$7\"),0)-DAY(A44)-2),\n\nMIN(IF(\n(OFFSET(INDIRECT(\"'\"&INT((MONTH(A44)-1)/6)+1&IF(INT((MONTH(A44)-1)/6)+1=1,\"ER SEMESTRE \",\"EME SEMESTRE \")&YEAR(A44)&\"'\"&\"!$B$9:$B$43\"),0,MATCH($A44,INDIRECT(\"'\"&INT((MONTH(A44)-1)/6)+1&IF(INT((MONTH(A44)-1)/6)+1=1,\"ER SEMESTRE \",\"EME SEMESTRE \")&YEAR(A44)&\"'\"&\"!$B$7:$HA$7\"),0)-DAY(A44)-1)=\"(\"&$G$9&\")\")\n*\n(INDEX(INDIRECT(\"'\"&INT((MONTH(A44)-1)/6)+1&IF(INT((MONTH(A44)-1)/6)+1=1,\"ER SEMESTRE \",\"EME SEMESTRE \")&YEAR(A44)&\"'\"&\"!$B$9:$HA$43\"),0,MATCH($A44,INDIRECT(\"'\"&INT((MONTH(A44)-1)/6)+1&IF(INT((MONTH(A44)-1)/6)+1=1,\"ER SEMESTRE \",\"EME SEMESTRE \")&YEAR(A44)&\"'\"&\"!$B$7:$HA$7\"),0))=\"R\"),\n\nROW(INDIRECT(\"'\"&INT((MONTH(A44)-1)/6)+1&IF(INT((MONTH(A44)-1)/6)+1=1,\"ER SEMESTRE \",\"EME SEMESTRE \")&YEAR(A44)&\"'\"&\"!D$9:D$43\"))-8,\n\n9^9))),\"\")),\"\")","v":""},null,{"$f":"IF(OR($B44=\"M\",$B44=\"N\",$B44=\"A\"),IF(\n\nIFERROR(INDEX(OFFSET(INDIRECT(\"'\"&INT((MONTH(A44)-1)/6)+1&IF(INT((MONTH(A44)-1)/6)+1=1,\"ER SEMESTRE \",\"EME SEMESTRE \")&YEAR(A44)&\"'\"&\"!$B$9:$B$43\"),0,MATCH($A44,INDIRECT(\"'\"&INT((MONTH(A44)-1)/6)+1&IF(INT((MONTH(A44)-1)/6)+1=1,\"ER SEMESTRE \",\"EME SEMESTRE \")&YEAR(A44)&\"'\"&\"!$B$7:$HA$7\"),0)-DAY(A44)-2),MIN(IF((OFFSET(INDIRECT(\"'\"&INT((MONTH(A44)-1)/6)+1&IF(INT((MONTH(A44)-1)/6)+1=1,\"ER SEMESTRE \",\"EME SEMESTRE \")&YEAR(A44)&\"'\"&\"!$B$9:$B$43\"),0,MATCH($A44,INDIRECT(\"'\"&INT((MONTH(A44)-1)/6)+1&IF(INT((MONTH(A44)-1)/6)+1=1,\"ER SEMESTRE \",\"EME SEMESTRE \")&YEAR(A44)&\"'\"&\"!$B$7:$HA$7\"),0)-DAY(A44)-1)=\"(\"&$G$9&\")\")*(INDEX(INDIRECT(\"'\"&INT((MONTH(A44)-1)/6)+1&IF(INT((MONTH(A44)-1)/6)+1=1,\"ER SEMESTRE \",\"EME SEMESTRE \")&YEAR(A44)&\"'\"&\"!$B$9:$HA$43\"),0,MATCH($A44,INDIRECT(\"'\"&INT((MONTH(A44)-1)/6)+1&IF(INT((MONTH(A44)-1)/6)+1=1,\"ER SEMESTRE \",\"EME SEMESTRE \")&YEAR(A44)&\"'\"&\"!$B$7:$HA$7\"),0))=\"J\"),ROW(INDIRECT(\"'\"&INT((MONTH(A44)-1)/6)+1&IF(INT((MONTH(A44)-1)/6)+1=1,\"ER SEMESTRE \",\"EME SEMESTRE \")&YEAR(A44)&\"'\"&\"!$D$9:$D$43\"))-8,9^9))),\"\")=\"\",\n\nIFERROR(\nINDEX(OFFSET(INDIRECT(\"'\"&INT((MONTH(A44)-1)/6)+1&IF(INT((MONTH(A44)-1)/6)+1=1,\"ER SEMESTRE \",\"EME SEMESTRE \")&YEAR(A44)&\"'\"&\"!$B$9:$B$43\"),0,MATCH($A44,INDIRECT(\"'\"&INT((MONTH(A44)-1)/6)+1&IF(INT((MONTH(A44)-1)/6)+1=1,\"ER SEMESTRE \",\"EME SEMESTRE \")&YEAR(A44)&\"'\"&\"!$B$7:$HA$7\"),0)-DAY(A44)-2),\nSMALL(IF((OFFSET(INDIRECT(\"'\"&INT((MONTH(A44)-1)/6)+1&IF(INT((MONTH(A44)-1)/6)+1=1,\"ER SEMESTRE \",\"EME SEMESTRE \")&YEAR(A44)&\"'\"&\"!$B$9:$B$43\"),0,MATCH($A44,INDIRECT(\"'\"&INT((MONTH(A44)-1)/6)+1&IF(INT((MONTH(A44)-1)/6)+1=1,\"ER SEMESTRE \",\"EME SEMESTRE \")&YEAR(A44)&\"'\"&\"!$B$7:$HA$7\"),0)-DAY(A44)-1)=\"(\"&$G$9&\")\")*(INDEX(INDIRECT(\"'\"&INT((MONTH(A44)-1)/6)+1&IF(INT((MONTH(A44)-1)/6)+1=1,\"ER SEMESTRE \",\"EME SEMESTRE \")&YEAR(A44)&\"'\"&\"!$B$9:$HA$43\"),0,MATCH($A44,INDIRECT(\"'\"&INT((MONTH(A44)-1)/6)+1&IF(INT((MONTH(A44)-1)/6)+1=1,\"ER SEMESTRE \",\"EME SEMESTRE \")&YEAR(A44)&\"'\"&\"!$B$7:$HA$7\"),0))=\"R\"),ROW(INDIRECT(\"'\"&INT((MONTH(A44)-1)/6)+1&IF(INT((MONTH(A44)-1)/6)+1=1,\"ER SEMESTRE \",\"EME SEMESTRE \")&YEAR(A44)&\"'\"&\"!D$9:D$43\"))-8,9^9),3)),\"\"),\n\n\nIFERROR(\nINDEX(OFFSET(INDIRECT(\"'\"&INT((MONTH(A44)-1)/6)+1&IF(INT((MONTH(A44)-1)/6)+1=1,\"ER SEMESTRE \",\"EME SEMESTRE \")&YEAR(A44)&\"'\"&\"!$B$9:$B$43\"),0,MATCH($A44,INDIRECT(\"'\"&INT((MONTH(A44)-1)/6)+1&IF(INT((MONTH(A44)-1)/6)+1=1,\"ER SEMESTRE \",\"EME SEMESTRE \")&YEAR(A44)&\"'\"&\"!$B$7:$HA$7\"),0)-DAY(A44)-2),\nSMALL(IF((OFFSET(INDIRECT(\"'\"&INT((MONTH(A44)-1)/6)+1&IF(INT((MONTH(A44)-1)/6)+1=1,\"ER SEMESTRE \",\"EME SEMESTRE \")&YEAR(A44)&\"'\"&\"!$B$9:$B$43\"),0,MATCH($A44,INDIRECT(\"'\"&INT((MONTH(A44)-1)/6)+1&IF(INT((MONTH(A44)-1)/6)+1=1,\"ER SEMESTRE \",\"EME SEMESTRE \")&YEAR(A44)&\"'\"&\"!$B$7:$HA$7\"),0)-DAY(A44)-1)=\"(\"&$G$9&\")\")*(INDEX(INDIRECT(\"'\"&INT((MONTH(A44)-1)/6)+1&IF(INT((MONTH(A44)-1)/6)+1=1,\"ER SEMESTRE \",\"EME SEMESTRE \")&YEAR(A44)&\"'\"&\"!$B$9:$HA$43\"),0,MATCH($A44,INDIRECT(\"'\"&INT((MONTH(A44)-1)/6)+1&IF(INT((MONTH(A44)-1)/6)+1=1,\"ER SEMESTRE \",\"EME SEMESTRE \")&YEAR(A44)&\"'\"&\"!$B$7:$HA$7\"),0))=\"R\"),ROW(INDIRECT(\"'\"&INT((MONTH(A44)-1)/6)+1&IF(INT((MONTH(A44)-1)/6)+1=1,\"ER SEMESTRE \",\"EME SEMESTRE \")&YEAR(A44)&\"'\"&\"!D$9:D$43\"))-8,9^9),2)),\"\")\n\n),\n\n\"\")","v":""}]
["",{"$f":"IFERROR(INDEX([3]PLANNING!$D$3:$Y$29,MATCH('[3]F_Dde de remplacement'!$G$8,[3]PLANNING!$B$3:$B$29,0),MATCH('[3]F_Dde de remplacement'!$A45,[3]PLANNING!$D$2:$Y$2,0)),\"\")","v":""},{"$f":"IF(OR($B45=\"M\",$B45=\"N\",$B45=\"A\"),IFERROR(INDEX(OFFSET(INDIRECT(\"'\"&INT((MONTH(A45)-1)/6)+1&IF(INT((MONTH(A45)-1)/6)+1=1,\"ER SEMESTRE \",\"EME SEMESTRE \")&YEAR(A45)&\"'\"&\"!$B$9:$B$43\"),0,MATCH($A45,INDIRECT(\"'\"&INT((MONTH(A45)-1)/6)+1&IF(INT((MONTH(A45)-1)/6)+1=1,\"ER SEMESTRE \",\"EME SEMESTRE \")&YEAR(A45)&\"'\"&\"!$B$7:$HA$7\"),0)-DAY(A45)-2),MIN(IF((OFFSET(INDIRECT(\"'\"&INT((MONTH(A45)-1)/6)+1&IF(INT((MONTH(A45)-1)/6)+1=1,\"ER SEMESTRE \",\"EME SEMESTRE \")&YEAR(A45)&\"'\"&\"!$B$9:$B$43\"),0,MATCH($A45,INDIRECT(\"'\"&INT((MONTH(A45)-1)/6)+1&IF(INT((MONTH(A45)-1)/6)+1=1,\"ER SEMESTRE \",\"EME SEMESTRE \")&YEAR(A45)&\"'\"&\"!$B$7:$HA$7\"),0)-DAY(A45)-1)=\"(\"&$G$9&\")\")*(INDEX(INDIRECT(\"'\"&INT((MONTH(A45)-1)/6)+1&IF(INT((MONTH(A45)-1)/6)+1=1,\"ER SEMESTRE \",\"EME SEMESTRE \")&YEAR(A45)&\"'\"&\"!$B$9:$HA$43\"),0,MATCH($A45,INDIRECT(\"'\"&INT((MONTH(A45)-1)/6)+1&IF(INT((MONTH(A45)-1)/6)+1=1,\"ER SEMESTRE \",\"EME SEMESTRE \")&YEAR(A45)&\"'\"&\"!$B$7:$HA$7\"),0))=\"J\"),ROW(INDIRECT(\"'\"&INT((MONTH(A45)-1)/6)+1&IF(INT((MONTH(A45)-1)/6)+1=1,\"ER SEMESTRE \",\"EME SEMESTRE \")&YEAR(A45)&\"'\"&\"!$D$9:$D$43\"))-8,9^9))),IFERROR(INDEX(OFFSET(INDIRECT(\"'\"&INT((MONTH(A45)-1)/6)+1&IF(INT((MONTH(A45)-1)/6)+1=1,\"ER SEMESTRE \",\"EME SEMESTRE \")&YEAR(A45)&\"'\"&\"!$B$9:$B$43\"),0,MATCH($A45,INDIRECT(\"'\"&INT((MONTH(A45)-1)/6)+1&IF(INT((MONTH(A45)-1)/6)+1=1,\"ER SEMESTRE \",\"EME SEMESTRE \")&YEAR(A45)&\"'\"&\"!$B$7:$HA$7\"),0)-DAY(A45)-2),MIN(IF((OFFSET(INDIRECT(\"'\"&INT((MONTH(A45)-1)/6)+1&IF(INT((MONTH(A45)-1)/6)+1=1,\"ER SEMESTRE \",\"EME SEMESTRE \")&YEAR(A45)&\"'\"&\"!$B$9:$B$43\"),0,MATCH($A45,INDIRECT(\"'\"&INT((MONTH(A45)-1)/6)+1&IF(INT((MONTH(A45)-1)/6)+1=1,\"ER SEMESTRE \",\"EME SEMESTRE \")&YEAR(A45)&\"'\"&\"!$B$7:$HA$7\"),0)-DAY(A45)-1)=\"(\"&$G$9&\")\")*(INDEX(INDIRECT(\"'\"&INT((MONTH(A45)-1)/6)+1&IF(INT((MONTH(A45)-1)/6)+1=1,\"ER SEMESTRE \",\"EME SEMESTRE \")&YEAR(A45)&\"'\"&\"!$B$9:$HA$43\"),0,MATCH($A45,INDIRECT(\"'\"&INT((MONTH(A45)-1)/6)+1&IF(INT((MONTH(A45)-1)/6)+1=1,\"ER SEMESTRE \",\"EME SEMESTRE \")&YEAR(A45)&\"'\"&\"!$B$7:$HA$7\"),0))=\"R\"),ROW(INDIRECT(\"'\"&INT((MONTH(A45)-1)/6)+1&IF(INT((MONTH(A45)-1)/6)+1=1,\"ER SEMESTRE \",\"EME SEMESTRE \")&YEAR(A45)&\"'\"&\"!$D$9:$D$43\"))-8,9^9))),\"\")),\"\")","v":""},null,{"$f":"IF(OR($B45=\"M\",$B45=\"N\",$B45=\"A\"),IF(\nIFERROR(INDEX(OFFSET(INDIRECT(\"'\"&INT((MONTH(A45)-1)/6)+1&IF(INT((MONTH(A45)-1)/6)+1=1,\"ER SEMESTRE \",\"EME SEMESTRE \")&YEAR(A45)&\"'\"&\"!$B$9:$B$43\"),0,MATCH($A45,INDIRECT(\"'\"&INT((MONTH(A45)-1)/6)+1&IF(INT((MONTH(A45)-1)/6)+1=1,\"ER SEMESTRE \",\"EME SEMESTRE \")&YEAR(A45)&\"'\"&\"!$B$7:$HA$7\"),0)-DAY(A45)-2),MIN(IF((OFFSET(INDIRECT(\"'\"&INT((MONTH(A45)-1)/6)+1&IF(INT((MONTH(A45)-1)/6)+1=1,\"ER SEMESTRE \",\"EME SEMESTRE \")&YEAR(A45)&\"'\"&\"!$B$9:$B$43\"),0,MATCH($A45,INDIRECT(\"'\"&INT((MONTH(A45)-1)/6)+1&IF(INT((MONTH(A45)-1)/6)+1=1,\"ER SEMESTRE \",\"EME SEMESTRE \")&YEAR(A45)&\"'\"&\"!$B$7:$HA$7\"),0)-DAY(A45)-1)=\"(\"&$G$9&\")\")*(INDEX(INDIRECT(\"'\"&INT((MONTH(A45)-1)/6)+1&IF(INT((MONTH(A45)-1)/6)+1=1,\"ER SEMESTRE \",\"EME SEMESTRE \")&YEAR(A45)&\"'\"&\"!$B$9:$HA$43\"),0,MATCH($A45,INDIRECT(\"'\"&INT((MONTH(A45)-1)/6)+1&IF(INT((MONTH(A45)-1)/6)+1=1,\"ER SEMESTRE \",\"EME SEMESTRE \")&YEAR(A45)&\"'\"&\"!$B$7:$HA$7\"),0))=\"J\"),ROW(INDIRECT(\"'\"&INT((MONTH(A45)-1)/6)+1&IF(INT((MONTH(A45)-1)/6)+1=1,\"ER SEMESTRE \",\"EME SEMESTRE \")&YEAR(A45)&\"'\"&\"!$D$9:$D$43\"))-8,9^9))),\"\")=\"\",\n\nIFERROR(INDEX(OFFSET(INDIRECT(\"'\"&INT((MONTH(A45)-1)/6)+1&IF(INT((MONTH(A45)-1)/6)+1=1,\"ER SEMESTRE \",\"EME SEMESTRE \")&YEAR(A45)&\"'\"&\"!$B$9:$B$43\"),0,MATCH($A45,INDIRECT(\"'\"&INT((MONTH(A45)-1)/6)+1&IF(INT((MONTH(A45)-1)/6)+1=1,\"ER SEMESTRE \",\"EME SEMESTRE \")&YEAR(A45)&\"'\"&\"!$B$7:$HA$7\"),0)-DAY(A45)-2),SMALL(IF((OFFSET(INDIRECT(\"'\"&INT((MONTH(A45)-1)/6)+1&IF(INT((MONTH(A45)-1)/6)+1=1,\"ER SEMESTRE \",\"EME SEMESTRE \")&YEAR(A45)&\"'\"&\"!$B$9:$B$43\"),0,MATCH($A45,INDIRECT(\"'\"&INT((MONTH(A45)-1)/6)+1&IF(INT((MONTH(A45)-1)/6)+1=1,\"ER SEMESTRE \",\"EME SEMESTRE \")&YEAR(A45)&\"'\"&\"!$B$7:$HA$7\"),0)-DAY(A45)-1)=\"(\"&$G$9&\")\")*(INDEX(INDIRECT(\"'\"&INT((MONTH(A45)-1)/6)+1&IF(INT((MONTH(A45)-1)/6)+1=1,\"ER SEMESTRE \",\"EME SEMESTRE \")&YEAR(A45)&\"'\"&\"!$B$9:$HA$43\"),0,MATCH($A45,INDIRECT(\"'\"&INT((MONTH(A45)-1)/6)+1&IF(INT((MONTH(A45)-1)/6)+1=1,\"ER SEMESTRE \",\"EME SEMESTRE \")&YEAR(A45)&\"'\"&\"!$B$7:$HA$7\"),0))=\"R\"),ROW(INDIRECT(\"'\"&INT((MONTH(A45)-1)/6)+1&IF(INT((MONTH(A45)-1)/6)+1=1,\"ER SEMESTRE \",\"EME SEMESTRE \")&YEAR(A45)&\"'\"&\"!D$9:D$43\"))-8,9^9),2)),\"\"),\n\nIFERROR(\nINDEX(\nOFFSET(INDIRECT(\"'\"&INT((MONTH(A45)-1)/6)+1&IF(INT((MONTH(A45)-1)/6)+1=1,\"ER SEMESTRE \",\"EME SEMESTRE \")&YEAR(A45)&\"'\"&\"!$B$9:$B$43\"),0,MATCH($A45,INDIRECT(\"'\"&INT((MONTH(A45)-1)/6)+1&IF(INT((MONTH(A45)-1)/6)+1=1,\"ER SEMESTRE \",\"EME SEMESTRE \")&YEAR(A45)&\"'\"&\"!$B$7:$HA$7\"),0)-DAY(A45)-2),\n\nMIN(IF(\n(OFFSET(INDIRECT(\"'\"&INT((MONTH(A45)-1)/6)+1&IF(INT((MONTH(A45)-1)/6)+1=1,\"ER SEMESTRE \",\"EME SEMESTRE \")&YEAR(A45)&\"'\"&\"!$B$9:$B$43\"),0,MATCH($A45,INDIRECT(\"'\"&INT((MONTH(A45)-1)/6)+1&IF(INT((MONTH(A45)-1)/6)+1=1,\"ER SEMESTRE \",\"EME SEMESTRE \")&YEAR(A45)&\"'\"&\"!$B$7:$HA$7\"),0)-DAY(A45)-1)=\"(\"&$G$9&\")\")\n*\n(INDEX(INDIRECT(\"'\"&INT((MONTH(A45)-1)/6)+1&IF(INT((MONTH(A45)-1)/6)+1=1,\"ER SEMESTRE \",\"EME SEMESTRE \")&YEAR(A45)&\"'\"&\"!$B$9:$HA$43\"),0,MATCH($A45,INDIRECT(\"'\"&INT((MONTH(A45)-1)/6)+1&IF(INT((MONTH(A45)-1)/6)+1=1,\"ER SEMESTRE \",\"EME SEMESTRE \")&YEAR(A45)&\"'\"&\"!$B$7:$HA$7\"),0))=\"R\"),\n\nROW(INDIRECT(\"'\"&INT((MONTH(A45)-1)/6)+1&IF(INT((MONTH(A45)-1)/6)+1=1,\"ER SEMESTRE \",\"EME SEMESTRE \")&YEAR(A45)&\"'\"&\"!D$9:D$43\"))-8,\n\n9^9))),\"\")),\"\")","v":""},null,{"$f":"IF(OR($B45=\"M\",$B45=\"N\",$B45=\"A\"),IF(\n\nIFERROR(INDEX(OFFSET(INDIRECT(\"'\"&INT((MONTH(A45)-1)/6)+1&IF(INT((MONTH(A45)-1)/6)+1=1,\"ER SEMESTRE \",\"EME SEMESTRE \")&YEAR(A45)&\"'\"&\"!$B$9:$B$43\"),0,MATCH($A45,INDIRECT(\"'\"&INT((MONTH(A45)-1)/6)+1&IF(INT((MONTH(A45)-1)/6)+1=1,\"ER SEMESTRE \",\"EME SEMESTRE \")&YEAR(A45)&\"'\"&\"!$B$7:$HA$7\"),0)-DAY(A45)-2),MIN(IF((OFFSET(INDIRECT(\"'\"&INT((MONTH(A45)-1)/6)+1&IF(INT((MONTH(A45)-1)/6)+1=1,\"ER SEMESTRE \",\"EME SEMESTRE \")&YEAR(A45)&\"'\"&\"!$B$9:$B$43\"),0,MATCH($A45,INDIRECT(\"'\"&INT((MONTH(A45)-1)/6)+1&IF(INT((MONTH(A45)-1)/6)+1=1,\"ER SEMESTRE \",\"EME SEMESTRE \")&YEAR(A45)&\"'\"&\"!$B$7:$HA$7\"),0)-DAY(A45)-1)=\"(\"&$G$9&\")\")*(INDEX(INDIRECT(\"'\"&INT((MONTH(A45)-1)/6)+1&IF(INT((MONTH(A45)-1)/6)+1=1,\"ER SEMESTRE \",\"EME SEMESTRE \")&YEAR(A45)&\"'\"&\"!$B$9:$HA$43\"),0,MATCH($A45,INDIRECT(\"'\"&INT((MONTH(A45)-1)/6)+1&IF(INT((MONTH(A45)-1)/6)+1=1,\"ER SEMESTRE \",\"EME SEMESTRE \")&YEAR(A45)&\"'\"&\"!$B$7:$HA$7\"),0))=\"J\"),ROW(INDIRECT(\"'\"&INT((MONTH(A45)-1)/6)+1&IF(INT((MONTH(A45)-1)/6)+1=1,\"ER SEMESTRE \",\"EME SEMESTRE \")&YEAR(A45)&\"'\"&\"!$D$9:$D$43\"))-8,9^9))),\"\")=\"\",\n\nIFERROR(\nINDEX(OFFSET(INDIRECT(\"'\"&INT((MONTH(A45)-1)/6)+1&IF(INT((MONTH(A45)-1)/6)+1=1,\"ER SEMESTRE \",\"EME SEMESTRE \")&YEAR(A45)&\"'\"&\"!$B$9:$B$43\"),0,MATCH($A45,INDIRECT(\"'\"&INT((MONTH(A45)-1)/6)+1&IF(INT((MONTH(A45)-1)/6)+1=1,\"ER SEMESTRE \",\"EME SEMESTRE \")&YEAR(A45)&\"'\"&\"!$B$7:$HA$7\"),0)-DAY(A45)-2),\nSMALL(IF((OFFSET(INDIRECT(\"'\"&INT((MONTH(A45)-1)/6)+1&IF(INT((MONTH(A45)-1)/6)+1=1,\"ER SEMESTRE \",\"EME SEMESTRE \")&YEAR(A45)&\"'\"&\"!$B$9:$B$43\"),0,MATCH($A45,INDIRECT(\"'\"&INT((MONTH(A45)-1)/6)+1&IF(INT((MONTH(A45)-1)/6)+1=1,\"ER SEMESTRE \",\"EME SEMESTRE \")&YEAR(A45)&\"'\"&\"!$B$7:$HA$7\"),0)-DAY(A45)-1)=\"(\"&$G$9&\")\")*(INDEX(INDIRECT(\"'\"&INT((MONTH(A45)-1)/6)+1&IF(INT((MONTH(A45)-1)/6)+1=1,\"ER SEMESTRE \",\"EME SEMESTRE \")&YEAR(A45)&\"'\"&\"!$B$9:$HA$43\"),0,MATCH($A45,INDIRECT(\"'\"&INT((MONTH(A45)-1)/6)+1&IF(INT((MONTH(A45)-1)/6)+1=1,\"ER SEMESTRE \",\"EME SEMESTRE \")&YEAR(A45)&\"'\"&\"!$B$7:$HA$7\"),0))=\"R\"),ROW(INDIRECT(\"'\"&INT((MONTH(A45)-1)/6)+1&IF(INT((MONTH(A45)-1)/6)+1=1,\"ER SEMESTRE \",\"EME SEMESTRE \")&YEAR(A45)&\"'\"&\"!D$9:D$43\"))-8,9^9),3)),\"\"),\n\n\nIFERROR(\nINDEX(OFFSET(INDIRECT(\"'\"&INT((MONTH(A45)-1)/6)+1&IF(INT((MONTH(A45)-1)/6)+1=1,\"ER SEMESTRE \",\"EME SEMESTRE \")&YEAR(A45)&\"'\"&\"!$B$9:$B$43\"),0,MATCH($A45,INDIRECT(\"'\"&INT((MONTH(A45)-1)/6)+1&IF(INT((MONTH(A45)-1)/6)+1=1,\"ER SEMESTRE \",\"EME SEMESTRE \")&YEAR(A45)&\"'\"&\"!$B$7:$HA$7\"),0)-DAY(A45)-2),\nSMALL(IF((OFFSET(INDIRECT(\"'\"&INT((MONTH(A45)-1)/6)+1&IF(INT((MONTH(A45)-1)/6)+1=1,\"ER SEMESTRE \",\"EME SEMESTRE \")&YEAR(A45)&\"'\"&\"!$B$9:$B$43\"),0,MATCH($A45,INDIRECT(\"'\"&INT((MONTH(A45)-1)/6)+1&IF(INT((MONTH(A45)-1)/6)+1=1,\"ER SEMESTRE \",\"EME SEMESTRE \")&YEAR(A45)&\"'\"&\"!$B$7:$HA$7\"),0)-DAY(A45)-1)=\"(\"&$G$9&\")\")*(INDEX(INDIRECT(\"'\"&INT((MONTH(A45)-1)/6)+1&IF(INT((MONTH(A45)-1)/6)+1=1,\"ER SEMESTRE \",\"EME SEMESTRE \")&YEAR(A45)&\"'\"&\"!$B$9:$HA$43\"),0,MATCH($A45,INDIRECT(\"'\"&INT((MONTH(A45)-1)/6)+1&IF(INT((MONTH(A45)-1)/6)+1=1,\"ER SEMESTRE \",\"EME SEMESTRE \")&YEAR(A45)&\"'\"&\"!$B$7:$HA$7\"),0))=\"R\"),ROW(INDIRECT(\"'\"&INT((MONTH(A45)-1)/6)+1&IF(INT((MONTH(A45)-1)/6)+1=1,\"ER SEMESTRE \",\"EME SEMESTRE \")&YEAR(A45)&\"'\"&\"!D$9:D$43\"))-8,9^9),2)),\"\")\n\n),\n\n\"\")","v":""}]
["",{"$f":"IFERROR(INDEX([3]PLANNING!$D$3:$Y$29,MATCH('[3]F_Dde de remplacement'!$G$8,[3]PLANNING!$B$3:$B$29,0),MATCH('[3]F_Dde de remplacement'!$A46,[3]PLANNING!$D$2:$Y$2,0)),\"\")","v":""},{"$f":"IF(OR($B46=\"M\",$B46=\"N\",$B46=\"A\"),IFERROR(INDEX(OFFSET(INDIRECT(\"'\"&INT((MONTH(A46)-1)/6)+1&IF(INT((MONTH(A46)-1)/6)+1=1,\"ER SEMESTRE \",\"EME SEMESTRE \")&YEAR(A46)&\"'\"&\"!$B$9:$B$43\"),0,MATCH($A46,INDIRECT(\"'\"&INT((MONTH(A46)-1)/6)+1&IF(INT((MONTH(A46)-1)/6)+1=1,\"ER SEMESTRE \",\"EME SEMESTRE \")&YEAR(A46)&\"'\"&\"!$B$7:$HA$7\"),0)-DAY(A46)-2),MIN(IF((OFFSET(INDIRECT(\"'\"&INT((MONTH(A46)-1)/6)+1&IF(INT((MONTH(A46)-1)/6)+1=1,\"ER SEMESTRE \",\"EME SEMESTRE \")&YEAR(A46)&\"'\"&\"!$B$9:$B$43\"),0,MATCH($A46,INDIRECT(\"'\"&INT((MONTH(A46)-1)/6)+1&IF(INT((MONTH(A46)-1)/6)+1=1,\"ER SEMESTRE \",\"EME SEMESTRE \")&YEAR(A46)&\"'\"&\"!$B$7:$HA$7\"),0)-DAY(A46)-1)=\"(\"&$G$9&\")\")*(INDEX(INDIRECT(\"'\"&INT((MONTH(A46)-1)/6)+1&IF(INT((MONTH(A46)-1)/6)+1=1,\"ER SEMESTRE \",\"EME SEMESTRE \")&YEAR(A46)&\"'\"&\"!$B$9:$HA$43\"),0,MATCH($A46,INDIRECT(\"'\"&INT((MONTH(A46)-1)/6)+1&IF(INT((MONTH(A46)-1)/6)+1=1,\"ER SEMESTRE \",\"EME SEMESTRE \")&YEAR(A46)&\"'\"&\"!$B$7:$HA$7\"),0))=\"J\"),ROW(INDIRECT(\"'\"&INT((MONTH(A46)-1)/6)+1&IF(INT((MONTH(A46)-1)/6)+1=1,\"ER SEMESTRE \",\"EME SEMESTRE \")&YEAR(A46)&\"'\"&\"!$D$9:$D$43\"))-8,9^9))),IFERROR(INDEX(OFFSET(INDIRECT(\"'\"&INT((MONTH(A46)-1)/6)+1&IF(INT((MONTH(A46)-1)/6)+1=1,\"ER SEMESTRE \",\"EME SEMESTRE \")&YEAR(A46)&\"'\"&\"!$B$9:$B$43\"),0,MATCH($A46,INDIRECT(\"'\"&INT((MONTH(A46)-1)/6)+1&IF(INT((MONTH(A46)-1)/6)+1=1,\"ER SEMESTRE \",\"EME SEMESTRE \")&YEAR(A46)&\"'\"&\"!$B$7:$HA$7\"),0)-DAY(A46)-2),MIN(IF((OFFSET(INDIRECT(\"'\"&INT((MONTH(A46)-1)/6)+1&IF(INT((MONTH(A46)-1)/6)+1=1,\"ER SEMESTRE \",\"EME SEMESTRE \")&YEAR(A46)&\"'\"&\"!$B$9:$B$43\"),0,MATCH($A46,INDIRECT(\"'\"&INT((MONTH(A46)-1)/6)+1&IF(INT((MONTH(A46)-1)/6)+1=1,\"ER SEMESTRE \",\"EME SEMESTRE \")&YEAR(A46)&\"'\"&\"!$B$7:$HA$7\"),0)-DAY(A46)-1)=\"(\"&$G$9&\")\")*(INDEX(INDIRECT(\"'\"&INT((MONTH(A46)-1)/6)+1&IF(INT((MONTH(A46)-1)/6)+1=1,\"ER SEMESTRE \",\"EME SEMESTRE \")&YEAR(A46)&\"'\"&\"!$B$9:$HA$43\"),0,MATCH($A46,INDIRECT(\"'\"&INT((MONTH(A46)-1)/6)+1&IF(INT((MONTH(A46)-1)/6)+1=1,\"ER SEMESTRE \",\"EME SEMESTRE \")&YEAR(A46)&\"'\"&\"!$B$7:$HA$7\"),0))=\"R\"),ROW(INDIRECT(\"'\"&INT((MONTH(A46)-1)/6)+1&IF(INT((MONTH(A46)-1)/6)+1=1,\"ER SEMESTRE \",\"EME SEMESTRE \")&YEAR(A46)&\"'\"&\"!$D$9:$D$43\"))-8,9^9))),\"\")),\"\")","v":""},null,{"$f":"IF(OR($B46=\"M\",$B46=\"N\",$B46=\"A\"),IF(\nIFERROR(INDEX(OFFSET(INDIRECT(\"'\"&INT((MONTH(A46)-1)/6)+1&IF(INT((MONTH(A46)-1)/6)+1=1,\"ER SEMESTRE \",\"EME SEMESTRE \")&YEAR(A46)&\"'\"&\"!$B$9:$B$43\"),0,MATCH($A46,INDIRECT(\"'\"&INT((MONTH(A46)-1)/6)+1&IF(INT((MONTH(A46)-1)/6)+1=1,\"ER SEMESTRE \",\"EME SEMESTRE \")&YEAR(A46)&\"'\"&\"!$B$7:$HA$7\"),0)-DAY(A46)-2),MIN(IF((OFFSET(INDIRECT(\"'\"&INT((MONTH(A46)-1)/6)+1&IF(INT((MONTH(A46)-1)/6)+1=1,\"ER SEMESTRE \",\"EME SEMESTRE \")&YEAR(A46)&\"'\"&\"!$B$9:$B$43\"),0,MATCH($A46,INDIRECT(\"'\"&INT((MONTH(A46)-1)/6)+1&IF(INT((MONTH(A46)-1)/6)+1=1,\"ER SEMESTRE \",\"EME SEMESTRE \")&YEAR(A46)&\"'\"&\"!$B$7:$HA$7\"),0)-DAY(A46)-1)=\"(\"&$G$9&\")\")*(INDEX(INDIRECT(\"'\"&INT((MONTH(A46)-1)/6)+1&IF(INT((MONTH(A46)-1)/6)+1=1,\"ER SEMESTRE \",\"EME SEMESTRE \")&YEAR(A46)&\"'\"&\"!$B$9:$HA$43\"),0,MATCH($A46,INDIRECT(\"'\"&INT((MONTH(A46)-1)/6)+1&IF(INT((MONTH(A46)-1)/6)+1=1,\"ER SEMESTRE \",\"EME SEMESTRE \")&YEAR(A46)&\"'\"&\"!$B$7:$HA$7\"),0))=\"J\"),ROW(INDIRECT(\"'\"&INT((MONTH(A46)-1)/6)+1&IF(INT((MONTH(A46)-1)/6)+1=1,\"ER SEMESTRE \",\"EME SEMESTRE \")&YEAR(A46)&\"'\"&\"!$D$9:$D$43\"))-8,9^9))),\"\")=\"\",\n\nIFERROR(INDEX(OFFSET(INDIRECT(\"'\"&INT((MONTH(A46)-1)/6)+1&IF(INT((MONTH(A46)-1)/6)+1=1,\"ER SEMESTRE \",\"EME SEMESTRE \")&YEAR(A46)&\"'\"&\"!$B$9:$B$43\"),0,MATCH($A46,INDIRECT(\"'\"&INT((MONTH(A46)-1)/6)+1&IF(INT((MONTH(A46)-1)/6)+1=1,\"ER SEMESTRE \",\"EME SEMESTRE \")&YEAR(A46)&\"'\"&\"!$B$7:$HA$7\"),0)-DAY(A46)-2),SMALL(IF((OFFSET(INDIRECT(\"'\"&INT((MONTH(A46)-1)/6)+1&IF(INT((MONTH(A46)-1)/6)+1=1,\"ER SEMESTRE \",\"EME SEMESTRE \")&YEAR(A46)&\"'\"&\"!$B$9:$B$43\"),0,MATCH($A46,INDIRECT(\"'\"&INT((MONTH(A46)-1)/6)+1&IF(INT((MONTH(A46)-1)/6)+1=1,\"ER SEMESTRE \",\"EME SEMESTRE \")&YEAR(A46)&\"'\"&\"!$B$7:$HA$7\"),0)-DAY(A46)-1)=\"(\"&$G$9&\")\")*(INDEX(INDIRECT(\"'\"&INT((MONTH(A46)-1)/6)+1&IF(INT((MONTH(A46)-1)/6)+1=1,\"ER SEMESTRE \",\"EME SEMESTRE \")&YEAR(A46)&\"'\"&\"!$B$9:$HA$43\"),0,MATCH($A46,INDIRECT(\"'\"&INT((MONTH(A46)-1)/6)+1&IF(INT((MONTH(A46)-1)/6)+1=1,\"ER SEMESTRE \",\"EME SEMESTRE \")&YEAR(A46)&\"'\"&\"!$B$7:$HA$7\"),0))=\"R\"),ROW(INDIRECT(\"'\"&INT((MONTH(A46)-1)/6)+1&IF(INT((MONTH(A46)-1)/6)+1=1,\"ER SEMESTRE \",\"EME SEMESTRE \")&YEAR(A46)&\"'\"&\"!D$9:D$43\"))-8,9^9),2)),\"\"),\n\nIFERROR(\nINDEX(\nOFFSET(INDIRECT(\"'\"&INT((MONTH(A46)-1)/6)+1&IF(INT((MONTH(A46)-1)/6)+1=1,\"ER SEMESTRE \",\"EME SEMESTRE \")&YEAR(A46)&\"'\"&\"!$B$9:$B$43\"),0,MATCH($A46,INDIRECT(\"'\"&INT((MONTH(A46)-1)/6)+1&IF(INT((MONTH(A46)-1)/6)+1=1,\"ER SEMESTRE \",\"EME SEMESTRE \")&YEAR(A46)&\"'\"&\"!$B$7:$HA$7\"),0)-DAY(A46)-2),\n\nMIN(IF(\n(OFFSET(INDIRECT(\"'\"&INT((MONTH(A46)-1)/6)+1&IF(INT((MONTH(A46)-1)/6)+1=1,\"ER SEMESTRE \",\"EME SEMESTRE \")&YEAR(A46)&\"'\"&\"!$B$9:$B$43\"),0,MATCH($A46,INDIRECT(\"'\"&INT((MONTH(A46)-1)/6)+1&IF(INT((MONTH(A46)-1)/6)+1=1,\"ER SEMESTRE \",\"EME SEMESTRE \")&YEAR(A46)&\"'\"&\"!$B$7:$HA$7\"),0)-DAY(A46)-1)=\"(\"&$G$9&\")\")\n*\n(INDEX(INDIRECT(\"'\"&INT((MONTH(A46)-1)/6)+1&IF(INT((MONTH(A46)-1)/6)+1=1,\"ER SEMESTRE \",\"EME SEMESTRE \")&YEAR(A46)&\"'\"&\"!$B$9:$HA$43\"),0,MATCH($A46,INDIRECT(\"'\"&INT((MONTH(A46)-1)/6)+1&IF(INT((MONTH(A46)-1)/6)+1=1,\"ER SEMESTRE \",\"EME SEMESTRE \")&YEAR(A46)&\"'\"&\"!$B$7:$HA$7\"),0))=\"R\"),\n\nROW(INDIRECT(\"'\"&INT((MONTH(A46)-1)/6)+1&IF(INT((MONTH(A46)-1)/6)+1=1,\"ER SEMESTRE \",\"EME SEMESTRE \")&YEAR(A46)&\"'\"&\"!D$9:D$43\"))-8,\n\n9^9))),\"\")),\"\")","v":""},null,{"$f":"IF(OR($B46=\"M\",$B46=\"N\",$B46=\"A\"),IF(\n\nIFERROR(INDEX(OFFSET(INDIRECT(\"'\"&INT((MONTH(A46)-1)/6)+1&IF(INT((MONTH(A46)-1)/6)+1=1,\"ER SEMESTRE \",\"EME SEMESTRE \")&YEAR(A46)&\"'\"&\"!$B$9:$B$43\"),0,MATCH($A46,INDIRECT(\"'\"&INT((MONTH(A46)-1)/6)+1&IF(INT((MONTH(A46)-1)/6)+1=1,\"ER SEMESTRE \",\"EME SEMESTRE \")&YEAR(A46)&\"'\"&\"!$B$7:$HA$7\"),0)-DAY(A46)-2),MIN(IF((OFFSET(INDIRECT(\"'\"&INT((MONTH(A46)-1)/6)+1&IF(INT((MONTH(A46)-1)/6)+1=1,\"ER SEMESTRE \",\"EME SEMESTRE \")&YEAR(A46)&\"'\"&\"!$B$9:$B$43\"),0,MATCH($A46,INDIRECT(\"'\"&INT((MONTH(A46)-1)/6)+1&IF(INT((MONTH(A46)-1)/6)+1=1,\"ER SEMESTRE \",\"EME SEMESTRE \")&YEAR(A46)&\"'\"&\"!$B$7:$HA$7\"),0)-DAY(A46)-1)=\"(\"&$G$9&\")\")*(INDEX(INDIRECT(\"'\"&INT((MONTH(A46)-1)/6)+1&IF(INT((MONTH(A46)-1)/6)+1=1,\"ER SEMESTRE \",\"EME SEMESTRE \")&YEAR(A46)&\"'\"&\"!$B$9:$HA$43\"),0,MATCH($A46,INDIRECT(\"'\"&INT((MONTH(A46)-1)/6)+1&IF(INT((MONTH(A46)-1)/6)+1=1,\"ER SEMESTRE \",\"EME SEMESTRE \")&YEAR(A46)&\"'\"&\"!$B$7:$HA$7\"),0))=\"J\"),ROW(INDIRECT(\"'\"&INT((MONTH(A46)-1)/6)+1&IF(INT((MONTH(A46)-1)/6)+1=1,\"ER SEMESTRE \",\"EME SEMESTRE \")&YEAR(A46)&\"'\"&\"!$D$9:$D$43\"))-8,9^9))),\"\")=\"\",\n\nIFERROR(\nINDEX(OFFSET(INDIRECT(\"'\"&INT((MONTH(A46)-1)/6)+1&IF(INT((MONTH(A46)-1)/6)+1=1,\"ER SEMESTRE \",\"EME SEMESTRE \")&YEAR(A46)&\"'\"&\"!$B$9:$B$43\"),0,MATCH($A46,INDIRECT(\"'\"&INT((MONTH(A46)-1)/6)+1&IF(INT((MONTH(A46)-1)/6)+1=1,\"ER SEMESTRE \",\"EME SEMESTRE \")&YEAR(A46)&\"'\"&\"!$B$7:$HA$7\"),0)-DAY(A46)-2),\nSMALL(IF((OFFSET(INDIRECT(\"'\"&INT((MONTH(A46)-1)/6)+1&IF(INT((MONTH(A46)-1)/6)+1=1,\"ER SEMESTRE \",\"EME SEMESTRE \")&YEAR(A46)&\"'\"&\"!$B$9:$B$43\"),0,MATCH($A46,INDIRECT(\"'\"&INT((MONTH(A46)-1)/6)+1&IF(INT((MONTH(A46)-1)/6)+1=1,\"ER SEMESTRE \",\"EME SEMESTRE \")&YEAR(A46)&\"'\"&\"!$B$7:$HA$7\"),0)-DAY(A46)-1)=\"(\"&$G$9&\")\")*(INDEX(INDIRECT(\"'\"&INT((MONTH(A46)-1)/6)+1&IF(INT((MONTH(A46)-1)/6)+1=1,\"ER SEMESTRE \",\"EME SEMESTRE \")&YEAR(A46)&\"'\"&\"!$B$9:$HA$43\"),0,MATCH($A46,INDIRECT(\"'\"&INT((MONTH(A46)-1)/6)+1&IF(INT((MONTH(A46)-1)/6)+1=1,\"ER SEMESTRE \",\"EME SEMESTRE \")&YEAR(A46)&\"'\"&\"!$B$7:$HA$7\"),0))=\"R\"),ROW(INDIRECT(\"'\"&INT((MONTH(A46)-1)/6)+1&IF(INT((MONTH(A46)-1)/6)+1=1,\"ER SEMESTRE \",\"EME SEMESTRE \")&YEAR(A46)&\"'\"&\"!D$9:D$43\"))-8,9^9),3)),\"\"),\n\n\nIFERROR(\nINDEX(OFFSET(INDIRECT(\"'\"&INT((MONTH(A46)-1)/6)+1&IF(INT((MONTH(A46)-1)/6)+1=1,\"ER SEMESTRE \",\"EME SEMESTRE \")&YEAR(A46)&\"'\"&\"!$B$9:$B$43\"),0,MATCH($A46,INDIRECT(\"'\"&INT((MONTH(A46)-1)/6)+1&IF(INT((MONTH(A46)-1)/6)+1=1,\"ER SEMESTRE \",\"EME SEMESTRE \")&YEAR(A46)&\"'\"&\"!$B$7:$HA$7\"),0)-DAY(A46)-2),\nSMALL(IF((OFFSET(INDIRECT(\"'\"&INT((MONTH(A46)-1)/6)+1&IF(INT((MONTH(A46)-1)/6)+1=1,\"ER SEMESTRE \",\"EME SEMESTRE \")&YEAR(A46)&\"'\"&\"!$B$9:$B$43\"),0,MATCH($A46,INDIRECT(\"'\"&INT((MONTH(A46)-1)/6)+1&IF(INT((MONTH(A46)-1)/6)+1=1,\"ER SEMESTRE \",\"EME SEMESTRE \")&YEAR(A46)&\"'\"&\"!$B$7:$HA$7\"),0)-DAY(A46)-1)=\"(\"&$G$9&\")\")*(INDEX(INDIRECT(\"'\"&INT((MONTH(A46)-1)/6)+1&IF(INT((MONTH(A46)-1)/6)+1=1,\"ER SEMESTRE \",\"EME SEMESTRE \")&YEAR(A46)&\"'\"&\"!$B$9:$HA$43\"),0,MATCH($A46,INDIRECT(\"'\"&INT((MONTH(A46)-1)/6)+1&IF(INT((MONTH(A46)-1)/6)+1=1,\"ER SEMESTRE \",\"EME SEMESTRE \")&YEAR(A46)&\"'\"&\"!$B$7:$HA$7\"),0))=\"R\"),ROW(INDIRECT(\"'\"&INT((MONTH(A46)-1)/6)+1&IF(INT((MONTH(A46)-1)/6)+1=1,\"ER SEMESTRE \",\"EME SEMESTRE \")&YEAR(A46)&\"'\"&\"!D$9:D$43\"))-8,9^9),2)),\"\")\n\n),\n\n\"\")","v":""}]
["",{"$f":"IFERROR(INDEX([3]PLANNING!$D$3:$Y$29,MATCH('[3]F_Dde de remplacement'!$G$8,[3]PLANNING!$B$3:$B$29,0),MATCH('[3]F_Dde de remplacement'!$A47,[3]PLANNING!$D$2:$Y$2,0)),\"\")","v":""},{"$f":"IF(OR($B47=\"M\",$B47=\"N\",$B47=\"A\"),IFERROR(INDEX(OFFSET(INDIRECT(\"'\"&INT((MONTH(A47)-1)/6)+1&IF(INT((MONTH(A47)-1)/6)+1=1,\"ER SEMESTRE \",\"EME SEMESTRE \")&YEAR(A47)&\"'\"&\"!$B$9:$B$43\"),0,MATCH($A47,INDIRECT(\"'\"&INT((MONTH(A47)-1)/6)+1&IF(INT((MONTH(A47)-1)/6)+1=1,\"ER SEMESTRE \",\"EME SEMESTRE \")&YEAR(A47)&\"'\"&\"!$B$7:$HA$7\"),0)-DAY(A47)-2),MIN(IF((OFFSET(INDIRECT(\"'\"&INT((MONTH(A47)-1)/6)+1&IF(INT((MONTH(A47)-1)/6)+1=1,\"ER SEMESTRE \",\"EME SEMESTRE \")&YEAR(A47)&\"'\"&\"!$B$9:$B$43\"),0,MATCH($A47,INDIRECT(\"'\"&INT((MONTH(A47)-1)/6)+1&IF(INT((MONTH(A47)-1)/6)+1=1,\"ER SEMESTRE \",\"EME SEMESTRE \")&YEAR(A47)&\"'\"&\"!$B$7:$HA$7\"),0)-DAY(A47)-1)=\"(\"&$G$9&\")\")*(INDEX(INDIRECT(\"'\"&INT((MONTH(A47)-1)/6)+1&IF(INT((MONTH(A47)-1)/6)+1=1,\"ER SEMESTRE \",\"EME SEMESTRE \")&YEAR(A47)&\"'\"&\"!$B$9:$HA$43\"),0,MATCH($A47,INDIRECT(\"'\"&INT((MONTH(A47)-1)/6)+1&IF(INT((MONTH(A47)-1)/6)+1=1,\"ER SEMESTRE \",\"EME SEMESTRE \")&YEAR(A47)&\"'\"&\"!$B$7:$HA$7\"),0))=\"J\"),ROW(INDIRECT(\"'\"&INT((MONTH(A47)-1)/6)+1&IF(INT((MONTH(A47)-1)/6)+1=1,\"ER SEMESTRE \",\"EME SEMESTRE \")&YEAR(A47)&\"'\"&\"!$D$9:$D$43\"))-8,9^9))),IFERROR(INDEX(OFFSET(INDIRECT(\"'\"&INT((MONTH(A47)-1)/6)+1&IF(INT((MONTH(A47)-1)/6)+1=1,\"ER SEMESTRE \",\"EME SEMESTRE \")&YEAR(A47)&\"'\"&\"!$B$9:$B$43\"),0,MATCH($A47,INDIRECT(\"'\"&INT((MONTH(A47)-1)/6)+1&IF(INT((MONTH(A47)-1)/6)+1=1,\"ER SEMESTRE \",\"EME SEMESTRE \")&YEAR(A47)&\"'\"&\"!$B$7:$HA$7\"),0)-DAY(A47)-2),MIN(IF((OFFSET(INDIRECT(\"'\"&INT((MONTH(A47)-1)/6)+1&IF(INT((MONTH(A47)-1)/6)+1=1,\"ER SEMESTRE \",\"EME SEMESTRE \")&YEAR(A47)&\"'\"&\"!$B$9:$B$43\"),0,MATCH($A47,INDIRECT(\"'\"&INT((MONTH(A47)-1)/6)+1&IF(INT((MONTH(A47)-1)/6)+1=1,\"ER SEMESTRE \",\"EME SEMESTRE \")&YEAR(A47)&\"'\"&\"!$B$7:$HA$7\"),0)-DAY(A47)-1)=\"(\"&$G$9&\")\")*(INDEX(INDIRECT(\"'\"&INT((MONTH(A47)-1)/6)+1&IF(INT((MONTH(A47)-1)/6)+1=1,\"ER SEMESTRE \",\"EME SEMESTRE \")&YEAR(A47)&\"'\"&\"!$B$9:$HA$43\"),0,MATCH($A47,INDIRECT(\"'\"&INT((MONTH(A47)-1)/6)+1&IF(INT((MONTH(A47)-1)/6)+1=1,\"ER SEMESTRE \",\"EME SEMESTRE \")&YEAR(A47)&\"'\"&\"!$B$7:$HA$7\"),0))=\"R\"),ROW(INDIRECT(\"'\"&INT((MONTH(A47)-1)/6)+1&IF(INT((MONTH(A47)-1)/6)+1=1,\"ER SEMESTRE \",\"EME SEMESTRE \")&YEAR(A47)&\"'\"&\"!$D$9:$D$43\"))-8,9^9))),\"\")),\"\")","v":""},null,{"$f":"IF(OR($B47=\"M\",$B47=\"N\",$B47=\"A\"),IF(\nIFERROR(INDEX(OFFSET(INDIRECT(\"'\"&INT((MONTH(A47)-1)/6)+1&IF(INT((MONTH(A47)-1)/6)+1=1,\"ER SEMESTRE \",\"EME SEMESTRE \")&YEAR(A47)&\"'\"&\"!$B$9:$B$43\"),0,MATCH($A47,INDIRECT(\"'\"&INT((MONTH(A47)-1)/6)+1&IF(INT((MONTH(A47)-1)/6)+1=1,\"ER SEMESTRE \",\"EME SEMESTRE \")&YEAR(A47)&\"'\"&\"!$B$7:$HA$7\"),0)-DAY(A47)-2),MIN(IF((OFFSET(INDIRECT(\"'\"&INT((MONTH(A47)-1)/6)+1&IF(INT((MONTH(A47)-1)/6)+1=1,\"ER SEMESTRE \",\"EME SEMESTRE \")&YEAR(A47)&\"'\"&\"!$B$9:$B$43\"),0,MATCH($A47,INDIRECT(\"'\"&INT((MONTH(A47)-1)/6)+1&IF(INT((MONTH(A47)-1)/6)+1=1,\"ER SEMESTRE \",\"EME SEMESTRE \")&YEAR(A47)&\"'\"&\"!$B$7:$HA$7\"),0)-DAY(A47)-1)=\"(\"&$G$9&\")\")*(INDEX(INDIRECT(\"'\"&INT((MONTH(A47)-1)/6)+1&IF(INT((MONTH(A47)-1)/6)+1=1,\"ER SEMESTRE \",\"EME SEMESTRE \")&YEAR(A47)&\"'\"&\"!$B$9:$HA$43\"),0,MATCH($A47,INDIRECT(\"'\"&INT((MONTH(A47)-1)/6)+1&IF(INT((MONTH(A47)-1)/6)+1=1,\"ER SEMESTRE \",\"EME SEMESTRE \")&YEAR(A47)&\"'\"&\"!$B$7:$HA$7\"),0))=\"J\"),ROW(INDIRECT(\"'\"&INT((MONTH(A47)-1)/6)+1&IF(INT((MONTH(A47)-1)/6)+1=1,\"ER SEMESTRE \",\"EME SEMESTRE \")&YEAR(A47)&\"'\"&\"!$D$9:$D$43\"))-8,9^9))),\"\")=\"\",\n\nIFERROR(INDEX(OFFSET(INDIRECT(\"'\"&INT((MONTH(A47)-1)/6)+1&IF(INT((MONTH(A47)-1)/6)+1=1,\"ER SEMESTRE \",\"EME SEMESTRE \")&YEAR(A47)&\"'\"&\"!$B$9:$B$43\"),0,MATCH($A47,INDIRECT(\"'\"&INT((MONTH(A47)-1)/6)+1&IF(INT((MONTH(A47)-1)/6)+1=1,\"ER SEMESTRE \",\"EME SEMESTRE \")&YEAR(A47)&\"'\"&\"!$B$7:$HA$7\"),0)-DAY(A47)-2),SMALL(IF((OFFSET(INDIRECT(\"'\"&INT((MONTH(A47)-1)/6)+1&IF(INT((MONTH(A47)-1)/6)+1=1,\"ER SEMESTRE \",\"EME SEMESTRE \")&YEAR(A47)&\"'\"&\"!$B$9:$B$43\"),0,MATCH($A47,INDIRECT(\"'\"&INT((MONTH(A47)-1)/6)+1&IF(INT((MONTH(A47)-1)/6)+1=1,\"ER SEMESTRE \",\"EME SEMESTRE \")&YEAR(A47)&\"'\"&\"!$B$7:$HA$7\"),0)-DAY(A47)-1)=\"(\"&$G$9&\")\")*(INDEX(INDIRECT(\"'\"&INT((MONTH(A47)-1)/6)+1&IF(INT((MONTH(A47)-1)/6)+1=1,\"ER SEMESTRE \",\"EME SEMESTRE \")&YEAR(A47)&\"'\"&\"!$B$9:$HA$43\"),0,MATCH($A47,INDIRECT(\"'\"&INT((MONTH(A47)-1)/6)+1&IF(INT((MONTH(A47)-1)/6)+1=1,\"ER SEMESTRE \",\"EME SEMESTRE \")&YEAR(A47)&\"'\"&\"!$B$7:$HA$7\"),0))=\"R\"),ROW(INDIRECT(\"'\"&INT((MONTH(A47)-1)/6)+1&IF(INT((MONTH(A47)-1)/6)+1=1,\"ER SEMESTRE \",\"EME SEMESTRE \")&YEAR(A47)&\"'\"&\"!D$9:D$43\"))-8,9^9),2)),\"\"),\n\nIFERROR(\nINDEX(\nOFFSET(INDIRECT(\"'\"&INT((MONTH(A47)-1)/6)+1&IF(INT((MONTH(A47)-1)/6)+1=1,\"ER SEMESTRE \",\"EME SEMESTRE \")&YEAR(A47)&\"'\"&\"!$B$9:$B$43\"),0,MATCH($A47,INDIRECT(\"'\"&INT((MONTH(A47)-1)/6)+1&IF(INT((MONTH(A47)-1)/6)+1=1,\"ER SEMESTRE \",\"EME SEMESTRE \")&YEAR(A47)&\"'\"&\"!$B$7:$HA$7\"),0)-DAY(A47)-2),\n\nMIN(IF(\n(OFFSET(INDIRECT(\"'\"&INT((MONTH(A47)-1)/6)+1&IF(INT((MONTH(A47)-1)/6)+1=1,\"ER SEMESTRE \",\"EME SEMESTRE \")&YEAR(A47)&\"'\"&\"!$B$9:$B$43\"),0,MATCH($A47,INDIRECT(\"'\"&INT((MONTH(A47)-1)/6)+1&IF(INT((MONTH(A47)-1)/6)+1=1,\"ER SEMESTRE \",\"EME SEMESTRE \")&YEAR(A47)&\"'\"&\"!$B$7:$HA$7\"),0)-DAY(A47)-1)=\"(\"&$G$9&\")\")\n*\n(INDEX(INDIRECT(\"'\"&INT((MONTH(A47)-1)/6)+1&IF(INT((MONTH(A47)-1)/6)+1=1,\"ER SEMESTRE \",\"EME SEMESTRE \")&YEAR(A47)&\"'\"&\"!$B$9:$HA$43\"),0,MATCH($A47,INDIRECT(\"'\"&INT((MONTH(A47)-1)/6)+1&IF(INT((MONTH(A47)-1)/6)+1=1,\"ER SEMESTRE \",\"EME SEMESTRE \")&YEAR(A47)&\"'\"&\"!$B$7:$HA$7\"),0))=\"R\"),\n\nROW(INDIRECT(\"'\"&INT((MONTH(A47)-1)/6)+1&IF(INT((MONTH(A47)-1)/6)+1=1,\"ER SEMESTRE \",\"EME SEMESTRE \")&YEAR(A47)&\"'\"&\"!D$9:D$43\"))-8,\n\n9^9))),\"\")),\"\")","v":""},null,{"$f":"IF(OR($B47=\"M\",$B47=\"N\",$B47=\"A\"),IF(\n\nIFERROR(INDEX(OFFSET(INDIRECT(\"'\"&INT((MONTH(A47)-1)/6)+1&IF(INT((MONTH(A47)-1)/6)+1=1,\"ER SEMESTRE \",\"EME SEMESTRE \")&YEAR(A47)&\"'\"&\"!$B$9:$B$43\"),0,MATCH($A47,INDIRECT(\"'\"&INT((MONTH(A47)-1)/6)+1&IF(INT((MONTH(A47)-1)/6)+1=1,\"ER SEMESTRE \",\"EME SEMESTRE \")&YEAR(A47)&\"'\"&\"!$B$7:$HA$7\"),0)-DAY(A47)-2),MIN(IF((OFFSET(INDIRECT(\"'\"&INT((MONTH(A47)-1)/6)+1&IF(INT((MONTH(A47)-1)/6)+1=1,\"ER SEMESTRE \",\"EME SEMESTRE \")&YEAR(A47)&\"'\"&\"!$B$9:$B$43\"),0,MATCH($A47,INDIRECT(\"'\"&INT((MONTH(A47)-1)/6)+1&IF(INT((MONTH(A47)-1)/6)+1=1,\"ER SEMESTRE \",\"EME SEMESTRE \")&YEAR(A47)&\"'\"&\"!$B$7:$HA$7\"),0)-DAY(A47)-1)=\"(\"&$G$9&\")\")*(INDEX(INDIRECT(\"'\"&INT((MONTH(A47)-1)/6)+1&IF(INT((MONTH(A47)-1)/6)+1=1,\"ER SEMESTRE \",\"EME SEMESTRE \")&YEAR(A47)&\"'\"&\"!$B$9:$HA$43\"),0,MATCH($A47,INDIRECT(\"'\"&INT((MONTH(A47)-1)/6)+1&IF(INT((MONTH(A47)-1)/6)+1=1,\"ER SEMESTRE \",\"EME SEMESTRE \")&YEAR(A47)&\"'\"&\"!$B$7:$HA$7\"),0))=\"J\"),ROW(INDIRECT(\"'\"&INT((MONTH(A47)-1)/6)+1&IF(INT((MONTH(A47)-1)/6)+1=1,\"ER SEMESTRE \",\"EME SEMESTRE \")&YEAR(A47)&\"'\"&\"!$D$9:$D$43\"))-8,9^9))),\"\")=\"\",\n\nIFERROR(\nINDEX(OFFSET(INDIRECT(\"'\"&INT((MONTH(A47)-1)/6)+1&IF(INT((MONTH(A47)-1)/6)+1=1,\"ER SEMESTRE \",\"EME SEMESTRE \")&YEAR(A47)&\"'\"&\"!$B$9:$B$43\"),0,MATCH($A47,INDIRECT(\"'\"&INT((MONTH(A47)-1)/6)+1&IF(INT((MONTH(A47)-1)/6)+1=1,\"ER SEMESTRE \",\"EME SEMESTRE \")&YEAR(A47)&\"'\"&\"!$B$7:$HA$7\"),0)-DAY(A47)-2),\nSMALL(IF((OFFSET(INDIRECT(\"'\"&INT((MONTH(A47)-1)/6)+1&IF(INT((MONTH(A47)-1)/6)+1=1,\"ER SEMESTRE \",\"EME SEMESTRE \")&YEAR(A47)&\"'\"&\"!$B$9:$B$43\"),0,MATCH($A47,INDIRECT(\"'\"&INT((MONTH(A47)-1)/6)+1&IF(INT((MONTH(A47)-1)/6)+1=1,\"ER SEMESTRE \",\"EME SEMESTRE \")&YEAR(A47)&\"'\"&\"!$B$7:$HA$7\"),0)-DAY(A47)-1)=\"(\"&$G$9&\")\")*(INDEX(INDIRECT(\"'\"&INT((MONTH(A47)-1)/6)+1&IF(INT((MONTH(A47)-1)/6)+1=1,\"ER SEMESTRE \",\"EME SEMESTRE \")&YEAR(A47)&\"'\"&\"!$B$9:$HA$43\"),0,MATCH($A47,INDIRECT(\"'\"&INT((MONTH(A47)-1)/6)+1&IF(INT((MONTH(A47)-1)/6)+1=1,\"ER SEMESTRE \",\"EME SEMESTRE \")&YEAR(A47)&\"'\"&\"!$B$7:$HA$7\"),0))=\"R\"),ROW(INDIRECT(\"'\"&INT((MONTH(A47)-1)/6)+1&IF(INT((MONTH(A47)-1)/6)+1=1,\"ER SEMESTRE \",\"EME SEMESTRE \")&YEAR(A47)&\"'\"&\"!D$9:D$43\"))-8,9^9),3)),\"\"),\n\n\nIFERROR(\nINDEX(OFFSET(INDIRECT(\"'\"&INT((MONTH(A47)-1)/6)+1&IF(INT((MONTH(A47)-1)/6)+1=1,\"ER SEMESTRE \",\"EME SEMESTRE \")&YEAR(A47)&\"'\"&\"!$B$9:$B$43\"),0,MATCH($A47,INDIRECT(\"'\"&INT((MONTH(A47)-1)/6)+1&IF(INT((MONTH(A47)-1)/6)+1=1,\"ER SEMESTRE \",\"EME SEMESTRE \")&YEAR(A47)&\"'\"&\"!$B$7:$HA$7\"),0)-DAY(A47)-2),\nSMALL(IF((OFFSET(INDIRECT(\"'\"&INT((MONTH(A47)-1)/6)+1&IF(INT((MONTH(A47)-1)/6)+1=1,\"ER SEMESTRE \",\"EME SEMESTRE \")&YEAR(A47)&\"'\"&\"!$B$9:$B$43\"),0,MATCH($A47,INDIRECT(\"'\"&INT((MONTH(A47)-1)/6)+1&IF(INT((MONTH(A47)-1)/6)+1=1,\"ER SEMESTRE \",\"EME SEMESTRE \")&YEAR(A47)&\"'\"&\"!$B$7:$HA$7\"),0)-DAY(A47)-1)=\"(\"&$G$9&\")\")*(INDEX(INDIRECT(\"'\"&INT((MONTH(A47)-1)/6)+1&IF(INT((MONTH(A47)-1)/6)+1=1,\"ER SEMESTRE \",\"EME SEMESTRE \")&YEAR(A47)&\"'\"&\"!$B$9:$HA$43\"),0,MATCH($A47,INDIRECT(\"'\"&INT((MONTH(A47)-1)/6)+1&IF(INT((MONTH(A47)-1)/6)+1=1,\"ER SEMESTRE \",\"EME SEMESTRE \")&YEAR(A47)&\"'\"&\"!$B$7:$HA$7\"),0))=\"R\"),ROW(INDIRECT(\"'\"&INT((MONTH(A47)-1)/6)+1&IF(INT((MONTH(A47)-1)/6)+1=1,\"ER SEMESTRE \",\"EME SEMESTRE \")&YEAR(A47)&\"'\"&\"!D$9:D$43\"))-8,9^9),2)),\"\")\n\n),\n\n\"\")","v":""}]
["",{"$f":"IFERROR(INDEX([3]PLANNING!$D$3:$Y$29,MATCH('[3]F_Dde de remplacement'!$G$8,[3]PLANNING!$B$3:$B$29,0),MATCH('[3]F_Dde de remplacement'!$A48,[3]PLANNING!$D$2:$Y$2,0)),\"\")","v":""},{"$f":"IF(OR($B48=\"M\",$B48=\"N\",$B48=\"A\"),IFERROR(INDEX(OFFSET(INDIRECT(\"'\"&INT((MONTH(A48)-1)/6)+1&IF(INT((MONTH(A48)-1)/6)+1=1,\"ER SEMESTRE \",\"EME SEMESTRE \")&YEAR(A48)&\"'\"&\"!$B$9:$B$43\"),0,MATCH($A48,INDIRECT(\"'\"&INT((MONTH(A48)-1)/6)+1&IF(INT((MONTH(A48)-1)/6)+1=1,\"ER SEMESTRE \",\"EME SEMESTRE \")&YEAR(A48)&\"'\"&\"!$B$7:$HA$7\"),0)-DAY(A48)-2),MIN(IF((OFFSET(INDIRECT(\"'\"&INT((MONTH(A48)-1)/6)+1&IF(INT((MONTH(A48)-1)/6)+1=1,\"ER SEMESTRE \",\"EME SEMESTRE \")&YEAR(A48)&\"'\"&\"!$B$9:$B$43\"),0,MATCH($A48,INDIRECT(\"'\"&INT((MONTH(A48)-1)/6)+1&IF(INT((MONTH(A48)-1)/6)+1=1,\"ER SEMESTRE \",\"EME SEMESTRE \")&YEAR(A48)&\"'\"&\"!$B$7:$HA$7\"),0)-DAY(A48)-1)=\"(\"&$G$9&\")\")*(INDEX(INDIRECT(\"'\"&INT((MONTH(A48)-1)/6)+1&IF(INT((MONTH(A48)-1)/6)+1=1,\"ER SEMESTRE \",\"EME SEMESTRE \")&YEAR(A48)&\"'\"&\"!$B$9:$HA$43\"),0,MATCH($A48,INDIRECT(\"'\"&INT((MONTH(A48)-1)/6)+1&IF(INT((MONTH(A48)-1)/6)+1=1,\"ER SEMESTRE \",\"EME SEMESTRE \")&YEAR(A48)&\"'\"&\"!$B$7:$HA$7\"),0))=\"J\"),ROW(INDIRECT(\"'\"&INT((MONTH(A48)-1)/6)+1&IF(INT((MONTH(A48)-1)/6)+1=1,\"ER SEMESTRE \",\"EME SEMESTRE \")&YEAR(A48)&\"'\"&\"!$D$9:$D$43\"))-8,9^9))),IFERROR(INDEX(OFFSET(INDIRECT(\"'\"&INT((MONTH(A48)-1)/6)+1&IF(INT((MONTH(A48)-1)/6)+1=1,\"ER SEMESTRE \",\"EME SEMESTRE \")&YEAR(A48)&\"'\"&\"!$B$9:$B$43\"),0,MATCH($A48,INDIRECT(\"'\"&INT((MONTH(A48)-1)/6)+1&IF(INT((MONTH(A48)-1)/6)+1=1,\"ER SEMESTRE \",\"EME SEMESTRE \")&YEAR(A48)&\"'\"&\"!$B$7:$HA$7\"),0)-DAY(A48)-2),MIN(IF((OFFSET(INDIRECT(\"'\"&INT((MONTH(A48)-1)/6)+1&IF(INT((MONTH(A48)-1)/6)+1=1,\"ER SEMESTRE \",\"EME SEMESTRE \")&YEAR(A48)&\"'\"&\"!$B$9:$B$43\"),0,MATCH($A48,INDIRECT(\"'\"&INT((MONTH(A48)-1)/6)+1&IF(INT((MONTH(A48)-1)/6)+1=1,\"ER SEMESTRE \",\"EME SEMESTRE \")&YEAR(A48)&\"'\"&\"!$B$7:$HA$7\"),0)-DAY(A48)-1)=\"(\"&$G$9&\")\")*(INDEX(INDIRECT(\"'\"&INT((MONTH(A48)-1)/6)+1&IF(INT((MONTH(A48)-1)/6)+1=1,\"ER SEMESTRE \",\"EME SEMESTRE \")&YEAR(A48)&\"'\"&\"!$B$9:$HA$43\"),0,MATCH($A48,INDIRECT(\"'\"&INT((MONTH(A48)-1)/6)+1&IF(INT((MONTH(A48)-1)/6)+1=1,\"ER SEMESTRE \",\"EME SEMESTRE \")&YEAR(A48)&\"'\"&\"!$B$7:$HA$7\"),0))=\"R\"),ROW(INDIRECT(\"'\"&INT((MONTH(A48)-1)/6)+1&IF(INT((MONTH(A48)-1)/6)+1=1,\"ER SEMESTRE \",\"EME SEMESTRE \")&YEAR(A48)&\"'\"&\"!$D$9:$D$43\"))-8,9^9))),\"\")),\"\")","v":""},null,{"$f":"IF(OR($B48=\"M\",$B48=\"N\",$B48=\"A\"),IF(\nIFERROR(INDEX(OFFSET(INDIRECT(\"'\"&INT((MONTH(A48)-1)/6)+1&IF(INT((MONTH(A48)-1)/6)+1=1,\"ER SEMESTRE \",\"EME SEMESTRE \")&YEAR(A48)&\"'\"&\"!$B$9:$B$43\"),0,MATCH($A48,INDIRECT(\"'\"&INT((MONTH(A48)-1)/6)+1&IF(INT((MONTH(A48)-1)/6)+1=1,\"ER SEMESTRE \",\"EME SEMESTRE \")&YEAR(A48)&\"'\"&\"!$B$7:$HA$7\"),0)-DAY(A48)-2),MIN(IF((OFFSET(INDIRECT(\"'\"&INT((MONTH(A48)-1)/6)+1&IF(INT((MONTH(A48)-1)/6)+1=1,\"ER SEMESTRE \",\"EME SEMESTRE \")&YEAR(A48)&\"'\"&\"!$B$9:$B$43\"),0,MATCH($A48,INDIRECT(\"'\"&INT((MONTH(A48)-1)/6)+1&IF(INT((MONTH(A48)-1)/6)+1=1,\"ER SEMESTRE \",\"EME SEMESTRE \")&YEAR(A48)&\"'\"&\"!$B$7:$HA$7\"),0)-DAY(A48)-1)=\"(\"&$G$9&\")\")*(INDEX(INDIRECT(\"'\"&INT((MONTH(A48)-1)/6)+1&IF(INT((MONTH(A48)-1)/6)+1=1,\"ER SEMESTRE \",\"EME SEMESTRE \")&YEAR(A48)&\"'\"&\"!$B$9:$HA$43\"),0,MATCH($A48,INDIRECT(\"'\"&INT((MONTH(A48)-1)/6)+1&IF(INT((MONTH(A48)-1)/6)+1=1,\"ER SEMESTRE \",\"EME SEMESTRE \")&YEAR(A48)&\"'\"&\"!$B$7:$HA$7\"),0))=\"J\"),ROW(INDIRECT(\"'\"&INT((MONTH(A48)-1)/6)+1&IF(INT((MONTH(A48)-1)/6)+1=1,\"ER SEMESTRE \",\"EME SEMESTRE \")&YEAR(A48)&\"'\"&\"!$D$9:$D$43\"))-8,9^9))),\"\")=\"\",\n\nIFERROR(INDEX(OFFSET(INDIRECT(\"'\"&INT((MONTH(A48)-1)/6)+1&IF(INT((MONTH(A48)-1)/6)+1=1,\"ER SEMESTRE \",\"EME SEMESTRE \")&YEAR(A48)&\"'\"&\"!$B$9:$B$43\"),0,MATCH($A48,INDIRECT(\"'\"&INT((MONTH(A48)-1)/6)+1&IF(INT((MONTH(A48)-1)/6)+1=1,\"ER SEMESTRE \",\"EME SEMESTRE \")&YEAR(A48)&\"'\"&\"!$B$7:$HA$7\"),0)-DAY(A48)-2),SMALL(IF((OFFSET(INDIRECT(\"'\"&INT((MONTH(A48)-1)/6)+1&IF(INT((MONTH(A48)-1)/6)+1=1,\"ER SEMESTRE \",\"EME SEMESTRE \")&YEAR(A48)&\"'\"&\"!$B$9:$B$43\"),0,MATCH($A48,INDIRECT(\"'\"&INT((MONTH(A48)-1)/6)+1&IF(INT((MONTH(A48)-1)/6)+1=1,\"ER SEMESTRE \",\"EME SEMESTRE \")&YEAR(A48)&\"'\"&\"!$B$7:$HA$7\"),0)-DAY(A48)-1)=\"(\"&$G$9&\")\")*(INDEX(INDIRECT(\"'\"&INT((MONTH(A48)-1)/6)+1&IF(INT((MONTH(A48)-1)/6)+1=1,\"ER SEMESTRE \",\"EME SEMESTRE \")&YEAR(A48)&\"'\"&\"!$B$9:$HA$43\"),0,MATCH($A48,INDIRECT(\"'\"&INT((MONTH(A48)-1)/6)+1&IF(INT((MONTH(A48)-1)/6)+1=1,\"ER SEMESTRE \",\"EME SEMESTRE \")&YEAR(A48)&\"'\"&\"!$B$7:$HA$7\"),0))=\"R\"),ROW(INDIRECT(\"'\"&INT((MONTH(A48)-1)/6)+1&IF(INT((MONTH(A48)-1)/6)+1=1,\"ER SEMESTRE \",\"EME SEMESTRE \")&YEAR(A48)&\"'\"&\"!D$9:D$43\"))-8,9^9),2)),\"\"),\n\nIFERROR(\nINDEX(\nOFFSET(INDIRECT(\"'\"&INT((MONTH(A48)-1)/6)+1&IF(INT((MONTH(A48)-1)/6)+1=1,\"ER SEMESTRE \",\"EME SEMESTRE \")&YEAR(A48)&\"'\"&\"!$B$9:$B$43\"),0,MATCH($A48,INDIRECT(\"'\"&INT((MONTH(A48)-1)/6)+1&IF(INT((MONTH(A48)-1)/6)+1=1,\"ER SEMESTRE \",\"EME SEMESTRE \")&YEAR(A48)&\"'\"&\"!$B$7:$HA$7\"),0)-DAY(A48)-2),\n\nMIN(IF(\n(OFFSET(INDIRECT(\"'\"&INT((MONTH(A48)-1)/6)+1&IF(INT((MONTH(A48)-1)/6)+1=1,\"ER SEMESTRE \",\"EME SEMESTRE \")&YEAR(A48)&\"'\"&\"!$B$9:$B$43\"),0,MATCH($A48,INDIRECT(\"'\"&INT((MONTH(A48)-1)/6)+1&IF(INT((MONTH(A48)-1)/6)+1=1,\"ER SEMESTRE \",\"EME SEMESTRE \")&YEAR(A48)&\"'\"&\"!$B$7:$HA$7\"),0)-DAY(A48)-1)=\"(\"&$G$9&\")\")\n*\n(INDEX(INDIRECT(\"'\"&INT((MONTH(A48)-1)/6)+1&IF(INT((MONTH(A48)-1)/6)+1=1,\"ER SEMESTRE \",\"EME SEMESTRE \")&YEAR(A48)&\"'\"&\"!$B$9:$HA$43\"),0,MATCH($A48,INDIRECT(\"'\"&INT((MONTH(A48)-1)/6)+1&IF(INT((MONTH(A48)-1)/6)+1=1,\"ER SEMESTRE \",\"EME SEMESTRE \")&YEAR(A48)&\"'\"&\"!$B$7:$HA$7\"),0))=\"R\"),\n\nROW(INDIRECT(\"'\"&INT((MONTH(A48)-1)/6)+1&IF(INT((MONTH(A48)-1)/6)+1=1,\"ER SEMESTRE \",\"EME SEMESTRE \")&YEAR(A48)&\"'\"&\"!D$9:D$43\"))-8,\n\n9^9))),\"\")),\"\")","v":""},null,{"$f":"IF(OR($B48=\"M\",$B48=\"N\",$B48=\"A\"),IF(\n\nIFERROR(INDEX(OFFSET(INDIRECT(\"'\"&INT((MONTH(A48)-1)/6)+1&IF(INT((MONTH(A48)-1)/6)+1=1,\"ER SEMESTRE \",\"EME SEMESTRE \")&YEAR(A48)&\"'\"&\"!$B$9:$B$43\"),0,MATCH($A48,INDIRECT(\"'\"&INT((MONTH(A48)-1)/6)+1&IF(INT((MONTH(A48)-1)/6)+1=1,\"ER SEMESTRE \",\"EME SEMESTRE \")&YEAR(A48)&\"'\"&\"!$B$7:$HA$7\"),0)-DAY(A48)-2),MIN(IF((OFFSET(INDIRECT(\"'\"&INT((MONTH(A48)-1)/6)+1&IF(INT((MONTH(A48)-1)/6)+1=1,\"ER SEMESTRE \",\"EME SEMESTRE \")&YEAR(A48)&\"'\"&\"!$B$9:$B$43\"),0,MATCH($A48,INDIRECT(\"'\"&INT((MONTH(A48)-1)/6)+1&IF(INT((MONTH(A48)-1)/6)+1=1,\"ER SEMESTRE \",\"EME SEMESTRE \")&YEAR(A48)&\"'\"&\"!$B$7:$HA$7\"),0)-DAY(A48)-1)=\"(\"&$G$9&\")\")*(INDEX(INDIRECT(\"'\"&INT((MONTH(A48)-1)/6)+1&IF(INT((MONTH(A48)-1)/6)+1=1,\"ER SEMESTRE \",\"EME SEMESTRE \")&YEAR(A48)&\"'\"&\"!$B$9:$HA$43\"),0,MATCH($A48,INDIRECT(\"'\"&INT((MONTH(A48)-1)/6)+1&IF(INT((MONTH(A48)-1)/6)+1=1,\"ER SEMESTRE \",\"EME SEMESTRE \")&YEAR(A48)&\"'\"&\"!$B$7:$HA$7\"),0))=\"J\"),ROW(INDIRECT(\"'\"&INT((MONTH(A48)-1)/6)+1&IF(INT((MONTH(A48)-1)/6)+1=1,\"ER SEMESTRE \",\"EME SEMESTRE \")&YEAR(A48)&\"'\"&\"!$D$9:$D$43\"))-8,9^9))),\"\")=\"\",\n\nIFERROR(\nINDEX(OFFSET(INDIRECT(\"'\"&INT((MONTH(A48)-1)/6)+1&IF(INT((MONTH(A48)-1)/6)+1=1,\"ER SEMESTRE \",\"EME SEMESTRE \")&YEAR(A48)&\"'\"&\"!$B$9:$B$43\"),0,MATCH($A48,INDIRECT(\"'\"&INT((MONTH(A48)-1)/6)+1&IF(INT((MONTH(A48)-1)/6)+1=1,\"ER SEMESTRE \",\"EME SEMESTRE \")&YEAR(A48)&\"'\"&\"!$B$7:$HA$7\"),0)-DAY(A48)-2),\nSMALL(IF((OFFSET(INDIRECT(\"'\"&INT((MONTH(A48)-1)/6)+1&IF(INT((MONTH(A48)-1)/6)+1=1,\"ER SEMESTRE \",\"EME SEMESTRE \")&YEAR(A48)&\"'\"&\"!$B$9:$B$43\"),0,MATCH($A48,INDIRECT(\"'\"&INT((MONTH(A48)-1)/6)+1&IF(INT((MONTH(A48)-1)/6)+1=1,\"ER SEMESTRE \",\"EME SEMESTRE \")&YEAR(A48)&\"'\"&\"!$B$7:$HA$7\"),0)-DAY(A48)-1)=\"(\"&$G$9&\")\")*(INDEX(INDIRECT(\"'\"&INT((MONTH(A48)-1)/6)+1&IF(INT((MONTH(A48)-1)/6)+1=1,\"ER SEMESTRE \",\"EME SEMESTRE \")&YEAR(A48)&\"'\"&\"!$B$9:$HA$43\"),0,MATCH($A48,INDIRECT(\"'\"&INT((MONTH(A48)-1)/6)+1&IF(INT((MONTH(A48)-1)/6)+1=1,\"ER SEMESTRE \",\"EME SEMESTRE \")&YEAR(A48)&\"'\"&\"!$B$7:$HA$7\"),0))=\"R\"),ROW(INDIRECT(\"'\"&INT((MONTH(A48)-1)/6)+1&IF(INT((MONTH(A48)-1)/6)+1=1,\"ER SEMESTRE \",\"EME SEMESTRE \")&YEAR(A48)&\"'\"&\"!D$9:D$43\"))-8,9^9),3)),\"\"),\n\n\nIFERROR(\nINDEX(OFFSET(INDIRECT(\"'\"&INT((MONTH(A48)-1)/6)+1&IF(INT((MONTH(A48)-1)/6)+1=1,\"ER SEMESTRE \",\"EME SEMESTRE \")&YEAR(A48)&\"'\"&\"!$B$9:$B$43\"),0,MATCH($A48,INDIRECT(\"'\"&INT((MONTH(A48)-1)/6)+1&IF(INT((MONTH(A48)-1)/6)+1=1,\"ER SEMESTRE \",\"EME SEMESTRE \")&YEAR(A48)&\"'\"&\"!$B$7:$HA$7\"),0)-DAY(A48)-2),\nSMALL(IF((OFFSET(INDIRECT(\"'\"&INT((MONTH(A48)-1)/6)+1&IF(INT((MONTH(A48)-1)/6)+1=1,\"ER SEMESTRE \",\"EME SEMESTRE \")&YEAR(A48)&\"'\"&\"!$B$9:$B$43\"),0,MATCH($A48,INDIRECT(\"'\"&INT((MONTH(A48)-1)/6)+1&IF(INT((MONTH(A48)-1)/6)+1=1,\"ER SEMESTRE \",\"EME SEMESTRE \")&YEAR(A48)&\"'\"&\"!$B$7:$HA$7\"),0)-DAY(A48)-1)=\"(\"&$G$9&\")\")*(INDEX(INDIRECT(\"'\"&INT((MONTH(A48)-1)/6)+1&IF(INT((MONTH(A48)-1)/6)+1=1,\"ER SEMESTRE \",\"EME SEMESTRE \")&YEAR(A48)&\"'\"&\"!$B$9:$HA$43\"),0,MATCH($A48,INDIRECT(\"'\"&INT((MONTH(A48)-1)/6)+1&IF(INT((MONTH(A48)-1)/6)+1=1,\"ER SEMESTRE \",\"EME SEMESTRE \")&YEAR(A48)&\"'\"&\"!$B$7:$HA$7\"),0))=\"R\"),ROW(INDIRECT(\"'\"&INT((MONTH(A48)-1)/6)+1&IF(INT((MONTH(A48)-1)/6)+1=1,\"ER SEMESTRE \",\"EME SEMESTRE \")&YEAR(A48)&\"'\"&\"!D$9:D$43\"))-8,9^9),2)),\"\")\n\n),\n\n\"\")","v":""}]
["",{"$f":"IFERROR(INDEX([3]PLANNING!$D$3:$Y$29,MATCH('[3]F_Dde de remplacement'!$G$8,[3]PLANNING!$B$3:$B$29,0),MATCH('[3]F_Dde de remplacement'!$A49,[3]PLANNING!$D$2:$Y$2,0)),\"\")","v":""},{"$f":"IF(OR($B49=\"M\",$B49=\"N\",$B49=\"A\"),IFERROR(INDEX(OFFSET(INDIRECT(\"'\"&INT((MONTH(A49)-1)/6)+1&IF(INT((MONTH(A49)-1)/6)+1=1,\"ER SEMESTRE \",\"EME SEMESTRE \")&YEAR(A49)&\"'\"&\"!$B$9:$B$43\"),0,MATCH($A49,INDIRECT(\"'\"&INT((MONTH(A49)-1)/6)+1&IF(INT((MONTH(A49)-1)/6)+1=1,\"ER SEMESTRE \",\"EME SEMESTRE \")&YEAR(A49)&\"'\"&\"!$B$7:$HA$7\"),0)-DAY(A49)-2),MIN(IF((OFFSET(INDIRECT(\"'\"&INT((MONTH(A49)-1)/6)+1&IF(INT((MONTH(A49)-1)/6)+1=1,\"ER SEMESTRE \",\"EME SEMESTRE \")&YEAR(A49)&\"'\"&\"!$B$9:$B$43\"),0,MATCH($A49,INDIRECT(\"'\"&INT((MONTH(A49)-1)/6)+1&IF(INT((MONTH(A49)-1)/6)+1=1,\"ER SEMESTRE \",\"EME SEMESTRE \")&YEAR(A49)&\"'\"&\"!$B$7:$HA$7\"),0)-DAY(A49)-1)=\"(\"&$G$9&\")\")*(INDEX(INDIRECT(\"'\"&INT((MONTH(A49)-1)/6)+1&IF(INT((MONTH(A49)-1)/6)+1=1,\"ER SEMESTRE \",\"EME SEMESTRE \")&YEAR(A49)&\"'\"&\"!$B$9:$HA$43\"),0,MATCH($A49,INDIRECT(\"'\"&INT((MONTH(A49)-1)/6)+1&IF(INT((MONTH(A49)-1)/6)+1=1,\"ER SEMESTRE \",\"EME SEMESTRE \")&YEAR(A49)&\"'\"&\"!$B$7:$HA$7\"),0))=\"J\"),ROW(INDIRECT(\"'\"&INT((MONTH(A49)-1)/6)+1&IF(INT((MONTH(A49)-1)/6)+1=1,\"ER SEMESTRE \",\"EME SEMESTRE \")&YEAR(A49)&\"'\"&\"!$D$9:$D$43\"))-8,9^9))),IFERROR(INDEX(OFFSET(INDIRECT(\"'\"&INT((MONTH(A49)-1)/6)+1&IF(INT((MONTH(A49)-1)/6)+1=1,\"ER SEMESTRE \",\"EME SEMESTRE \")&YEAR(A49)&\"'\"&\"!$B$9:$B$43\"),0,MATCH($A49,INDIRECT(\"'\"&INT((MONTH(A49)-1)/6)+1&IF(INT((MONTH(A49)-1)/6)+1=1,\"ER SEMESTRE \",\"EME SEMESTRE \")&YEAR(A49)&\"'\"&\"!$B$7:$HA$7\"),0)-DAY(A49)-2),MIN(IF((OFFSET(INDIRECT(\"'\"&INT((MONTH(A49)-1)/6)+1&IF(INT((MONTH(A49)-1)/6)+1=1,\"ER SEMESTRE \",\"EME SEMESTRE \")&YEAR(A49)&\"'\"&\"!$B$9:$B$43\"),0,MATCH($A49,INDIRECT(\"'\"&INT((MONTH(A49)-1)/6)+1&IF(INT((MONTH(A49)-1)/6)+1=1,\"ER SEMESTRE \",\"EME SEMESTRE \")&YEAR(A49)&\"'\"&\"!$B$7:$HA$7\"),0)-DAY(A49)-1)=\"(\"&$G$9&\")\")*(INDEX(INDIRECT(\"'\"&INT((MONTH(A49)-1)/6)+1&IF(INT((MONTH(A49)-1)/6)+1=1,\"ER SEMESTRE \",\"EME SEMESTRE \")&YEAR(A49)&\"'\"&\"!$B$9:$HA$43\"),0,MATCH($A49,INDIRECT(\"'\"&INT((MONTH(A49)-1)/6)+1&IF(INT((MONTH(A49)-1)/6)+1=1,\"ER SEMESTRE \",\"EME SEMESTRE \")&YEAR(A49)&\"'\"&\"!$B$7:$HA$7\"),0))=\"R\"),ROW(INDIRECT(\"'\"&INT((MONTH(A49)-1)/6)+1&IF(INT((MONTH(A49)-1)/6)+1=1,\"ER SEMESTRE \",\"EME SEMESTRE \")&YEAR(A49)&\"'\"&\"!$D$9:$D$43\"))-8,9^9))),\"\")),\"\")","v":""},null,{"$f":"IF(OR($B49=\"M\",$B49=\"N\",$B49=\"A\"),IF(\nIFERROR(INDEX(OFFSET(INDIRECT(\"'\"&INT((MONTH(A49)-1)/6)+1&IF(INT((MONTH(A49)-1)/6)+1=1,\"ER SEMESTRE \",\"EME SEMESTRE \")&YEAR(A49)&\"'\"&\"!$B$9:$B$43\"),0,MATCH($A49,INDIRECT(\"'\"&INT((MONTH(A49)-1)/6)+1&IF(INT((MONTH(A49)-1)/6)+1=1,\"ER SEMESTRE \",\"EME SEMESTRE \")&YEAR(A49)&\"'\"&\"!$B$7:$HA$7\"),0)-DAY(A49)-2),MIN(IF((OFFSET(INDIRECT(\"'\"&INT((MONTH(A49)-1)/6)+1&IF(INT((MONTH(A49)-1)/6)+1=1,\"ER SEMESTRE \",\"EME SEMESTRE \")&YEAR(A49)&\"'\"&\"!$B$9:$B$43\"),0,MATCH($A49,INDIRECT(\"'\"&INT((MONTH(A49)-1)/6)+1&IF(INT((MONTH(A49)-1)/6)+1=1,\"ER SEMESTRE \",\"EME SEMESTRE \")&YEAR(A49)&\"'\"&\"!$B$7:$HA$7\"),0)-DAY(A49)-1)=\"(\"&$G$9&\")\")*(INDEX(INDIRECT(\"'\"&INT((MONTH(A49)-1)/6)+1&IF(INT((MONTH(A49)-1)/6)+1=1,\"ER SEMESTRE \",\"EME SEMESTRE \")&YEAR(A49)&\"'\"&\"!$B$9:$HA$43\"),0,MATCH($A49,INDIRECT(\"'\"&INT((MONTH(A49)-1)/6)+1&IF(INT((MONTH(A49)-1)/6)+1=1,\"ER SEMESTRE \",\"EME SEMESTRE \")&YEAR(A49)&\"'\"&\"!$B$7:$HA$7\"),0))=\"J\"),ROW(INDIRECT(\"'\"&INT((MONTH(A49)-1)/6)+1&IF(INT((MONTH(A49)-1)/6)+1=1,\"ER SEMESTRE \",\"EME SEMESTRE \")&YEAR(A49)&\"'\"&\"!$D$9:$D$43\"))-8,9^9))),\"\")=\"\",\n\nIFERROR(INDEX(OFFSET(INDIRECT(\"'\"&INT((MONTH(A49)-1)/6)+1&IF(INT((MONTH(A49)-1)/6)+1=1,\"ER SEMESTRE \",\"EME SEMESTRE \")&YEAR(A49)&\"'\"&\"!$B$9:$B$43\"),0,MATCH($A49,INDIRECT(\"'\"&INT((MONTH(A49)-1)/6)+1&IF(INT((MONTH(A49)-1)/6)+1=1,\"ER SEMESTRE \",\"EME SEMESTRE \")&YEAR(A49)&\"'\"&\"!$B$7:$HA$7\"),0)-DAY(A49)-2),SMALL(IF((OFFSET(INDIRECT(\"'\"&INT((MONTH(A49)-1)/6)+1&IF(INT((MONTH(A49)-1)/6)+1=1,\"ER SEMESTRE \",\"EME SEMESTRE \")&YEAR(A49)&\"'\"&\"!$B$9:$B$43\"),0,MATCH($A49,INDIRECT(\"'\"&INT((MONTH(A49)-1)/6)+1&IF(INT((MONTH(A49)-1)/6)+1=1,\"ER SEMESTRE \",\"EME SEMESTRE \")&YEAR(A49)&\"'\"&\"!$B$7:$HA$7\"),0)-DAY(A49)-1)=\"(\"&$G$9&\")\")*(INDEX(INDIRECT(\"'\"&INT((MONTH(A49)-1)/6)+1&IF(INT((MONTH(A49)-1)/6)+1=1,\"ER SEMESTRE \",\"EME SEMESTRE \")&YEAR(A49)&\"'\"&\"!$B$9:$HA$43\"),0,MATCH($A49,INDIRECT(\"'\"&INT((MONTH(A49)-1)/6)+1&IF(INT((MONTH(A49)-1)/6)+1=1,\"ER SEMESTRE \",\"EME SEMESTRE \")&YEAR(A49)&\"'\"&\"!$B$7:$HA$7\"),0))=\"R\"),ROW(INDIRECT(\"'\"&INT((MONTH(A49)-1)/6)+1&IF(INT((MONTH(A49)-1)/6)+1=1,\"ER SEMESTRE \",\"EME SEMESTRE \")&YEAR(A49)&\"'\"&\"!D$9:D$43\"))-8,9^9),2)),\"\"),\n\nIFERROR(\nINDEX(\nOFFSET(INDIRECT(\"'\"&INT((MONTH(A49)-1)/6)+1&IF(INT((MONTH(A49)-1)/6)+1=1,\"ER SEMESTRE \",\"EME SEMESTRE \")&YEAR(A49)&\"'\"&\"!$B$9:$B$43\"),0,MATCH($A49,INDIRECT(\"'\"&INT((MONTH(A49)-1)/6)+1&IF(INT((MONTH(A49)-1)/6)+1=1,\"ER SEMESTRE \",\"EME SEMESTRE \")&YEAR(A49)&\"'\"&\"!$B$7:$HA$7\"),0)-DAY(A49)-2),\n\nMIN(IF(\n(OFFSET(INDIRECT(\"'\"&INT((MONTH(A49)-1)/6)+1&IF(INT((MONTH(A49)-1)/6)+1=1,\"ER SEMESTRE \",\"EME SEMESTRE \")&YEAR(A49)&\"'\"&\"!$B$9:$B$43\"),0,MATCH($A49,INDIRECT(\"'\"&INT((MONTH(A49)-1)/6)+1&IF(INT((MONTH(A49)-1)/6)+1=1,\"ER SEMESTRE \",\"EME SEMESTRE \")&YEAR(A49)&\"'\"&\"!$B$7:$HA$7\"),0)-DAY(A49)-1)=\"(\"&$G$9&\")\")\n*\n(INDEX(INDIRECT(\"'\"&INT((MONTH(A49)-1)/6)+1&IF(INT((MONTH(A49)-1)/6)+1=1,\"ER SEMESTRE \",\"EME SEMESTRE \")&YEAR(A49)&\"'\"&\"!$B$9:$HA$43\"),0,MATCH($A49,INDIRECT(\"'\"&INT((MONTH(A49)-1)/6)+1&IF(INT((MONTH(A49)-1)/6)+1=1,\"ER SEMESTRE \",\"EME SEMESTRE \")&YEAR(A49)&\"'\"&\"!$B$7:$HA$7\"),0))=\"R\"),\n\nROW(INDIRECT(\"'\"&INT((MONTH(A49)-1)/6)+1&IF(INT((MONTH(A49)-1)/6)+1=1,\"ER SEMESTRE \",\"EME SEMESTRE \")&YEAR(A49)&\"'\"&\"!D$9:D$43\"))-8,\n\n9^9))),\"\")),\"\")","v":""},null,{"$f":"IF(OR($B49=\"M\",$B49=\"N\",$B49=\"A\"),IF(\n\nIFERROR(INDEX(OFFSET(INDIRECT(\"'\"&INT((MONTH(A49)-1)/6)+1&IF(INT((MONTH(A49)-1)/6)+1=1,\"ER SEMESTRE \",\"EME SEMESTRE \")&YEAR(A49)&\"'\"&\"!$B$9:$B$43\"),0,MATCH($A49,INDIRECT(\"'\"&INT((MONTH(A49)-1)/6)+1&IF(INT((MONTH(A49)-1)/6)+1=1,\"ER SEMESTRE \",\"EME SEMESTRE \")&YEAR(A49)&\"'\"&\"!$B$7:$HA$7\"),0)-DAY(A49)-2),MIN(IF((OFFSET(INDIRECT(\"'\"&INT((MONTH(A49)-1)/6)+1&IF(INT((MONTH(A49)-1)/6)+1=1,\"ER SEMESTRE \",\"EME SEMESTRE \")&YEAR(A49)&\"'\"&\"!$B$9:$B$43\"),0,MATCH($A49,INDIRECT(\"'\"&INT((MONTH(A49)-1)/6)+1&IF(INT((MONTH(A49)-1)/6)+1=1,\"ER SEMESTRE \",\"EME SEMESTRE \")&YEAR(A49)&\"'\"&\"!$B$7:$HA$7\"),0)-DAY(A49)-1)=\"(\"&$G$9&\")\")*(INDEX(INDIRECT(\"'\"&INT((MONTH(A49)-1)/6)+1&IF(INT((MONTH(A49)-1)/6)+1=1,\"ER SEMESTRE \",\"EME SEMESTRE \")&YEAR(A49)&\"'\"&\"!$B$9:$HA$43\"),0,MATCH($A49,INDIRECT(\"'\"&INT((MONTH(A49)-1)/6)+1&IF(INT((MONTH(A49)-1)/6)+1=1,\"ER SEMESTRE \",\"EME SEMESTRE \")&YEAR(A49)&\"'\"&\"!$B$7:$HA$7\"),0))=\"J\"),ROW(INDIRECT(\"'\"&INT((MONTH(A49)-1)/6)+1&IF(INT((MONTH(A49)-1)/6)+1=1,\"ER SEMESTRE \",\"EME SEMESTRE \")&YEAR(A49)&\"'\"&\"!$D$9:$D$43\"))-8,9^9))),\"\")=\"\",\n\nIFERROR(\nINDEX(OFFSET(INDIRECT(\"'\"&INT((MONTH(A49)-1)/6)+1&IF(INT((MONTH(A49)-1)/6)+1=1,\"ER SEMESTRE \",\"EME SEMESTRE \")&YEAR(A49)&\"'\"&\"!$B$9:$B$43\"),0,MATCH($A49,INDIRECT(\"'\"&INT((MONTH(A49)-1)/6)+1&IF(INT((MONTH(A49)-1)/6)+1=1,\"ER SEMESTRE \",\"EME SEMESTRE \")&YEAR(A49)&\"'\"&\"!$B$7:$HA$7\"),0)-DAY(A49)-2),\nSMALL(IF((OFFSET(INDIRECT(\"'\"&INT((MONTH(A49)-1)/6)+1&IF(INT((MONTH(A49)-1)/6)+1=1,\"ER SEMESTRE \",\"EME SEMESTRE \")&YEAR(A49)&\"'\"&\"!$B$9:$B$43\"),0,MATCH($A49,INDIRECT(\"'\"&INT((MONTH(A49)-1)/6)+1&IF(INT((MONTH(A49)-1)/6)+1=1,\"ER SEMESTRE \",\"EME SEMESTRE \")&YEAR(A49)&\"'\"&\"!$B$7:$HA$7\"),0)-DAY(A49)-1)=\"(\"&$G$9&\")\")*(INDEX(INDIRECT(\"'\"&INT((MONTH(A49)-1)/6)+1&IF(INT((MONTH(A49)-1)/6)+1=1,\"ER SEMESTRE \",\"EME SEMESTRE \")&YEAR(A49)&\"'\"&\"!$B$9:$HA$43\"),0,MATCH($A49,INDIRECT(\"'\"&INT((MONTH(A49)-1)/6)+1&IF(INT((MONTH(A49)-1)/6)+1=1,\"ER SEMESTRE \",\"EME SEMESTRE \")&YEAR(A49)&\"'\"&\"!$B$7:$HA$7\"),0))=\"R\"),ROW(INDIRECT(\"'\"&INT((MONTH(A49)-1)/6)+1&IF(INT((MONTH(A49)-1)/6)+1=1,\"ER SEMESTRE \",\"EME SEMESTRE \")&YEAR(A49)&\"'\"&\"!D$9:D$43\"))-8,9^9),3)),\"\"),\n\n\nIFERROR(\nINDEX(OFFSET(INDIRECT(\"'\"&INT((MONTH(A49)-1)/6)+1&IF(INT((MONTH(A49)-1)/6)+1=1,\"ER SEMESTRE \",\"EME SEMESTRE \")&YEAR(A49)&\"'\"&\"!$B$9:$B$43\"),0,MATCH($A49,INDIRECT(\"'\"&INT((MONTH(A49)-1)/6)+1&IF(INT((MONTH(A49)-1)/6)+1=1,\"ER SEMESTRE \",\"EME SEMESTRE \")&YEAR(A49)&\"'\"&\"!$B$7:$HA$7\"),0)-DAY(A49)-2),\nSMALL(IF((OFFSET(INDIRECT(\"'\"&INT((MONTH(A49)-1)/6)+1&IF(INT((MONTH(A49)-1)/6)+1=1,\"ER SEMESTRE \",\"EME SEMESTRE \")&YEAR(A49)&\"'\"&\"!$B$9:$B$43\"),0,MATCH($A49,INDIRECT(\"'\"&INT((MONTH(A49)-1)/6)+1&IF(INT((MONTH(A49)-1)/6)+1=1,\"ER SEMESTRE \",\"EME SEMESTRE \")&YEAR(A49)&\"'\"&\"!$B$7:$HA$7\"),0)-DAY(A49)-1)=\"(\"&$G$9&\")\")*(INDEX(INDIRECT(\"'\"&INT((MONTH(A49)-1)/6)+1&IF(INT((MONTH(A49)-1)/6)+1=1,\"ER SEMESTRE \",\"EME SEMESTRE \")&YEAR(A49)&\"'\"&\"!$B$9:$HA$43\"),0,MATCH($A49,INDIRECT(\"'\"&INT((MONTH(A49)-1)/6)+1&IF(INT((MONTH(A49)-1)/6)+1=1,\"ER SEMESTRE \",\"EME SEMESTRE \")&YEAR(A49)&\"'\"&\"!$B$7:$HA$7\"),0))=\"R\"),ROW(INDIRECT(\"'\"&INT((MONTH(A49)-1)/6)+1&IF(INT((MONTH(A49)-1)/6)+1=1,\"ER SEMESTRE \",\"EME SEMESTRE \")&YEAR(A49)&\"'\"&\"!D$9:D$43\"))-8,9^9),2)),\"\")\n\n),\n\n\"\")","v":""}]
["",{"$f":"IFERROR(INDEX([3]PLANNING!$D$3:$Y$29,MATCH('[3]F_Dde de remplacement'!$G$8,[3]PLANNING!$B$3:$B$29,0),MATCH('[3]F_Dde de remplacement'!$A50,[3]PLANNING!$D$2:$Y$2,0)),\"\")","v":""},{"$f":"IF(OR($B50=\"M\",$B50=\"N\",$B50=\"A\"),IFERROR(INDEX(OFFSET(INDIRECT(\"'\"&INT((MONTH(A50)-1)/6)+1&IF(INT((MONTH(A50)-1)/6)+1=1,\"ER SEMESTRE \",\"EME SEMESTRE \")&YEAR(A50)&\"'\"&\"!$B$9:$B$43\"),0,MATCH($A50,INDIRECT(\"'\"&INT((MONTH(A50)-1)/6)+1&IF(INT((MONTH(A50)-1)/6)+1=1,\"ER SEMESTRE \",\"EME SEMESTRE \")&YEAR(A50)&\"'\"&\"!$B$7:$HA$7\"),0)-DAY(A50)-2),MIN(IF((OFFSET(INDIRECT(\"'\"&INT((MONTH(A50)-1)/6)+1&IF(INT((MONTH(A50)-1)/6)+1=1,\"ER SEMESTRE \",\"EME SEMESTRE \")&YEAR(A50)&\"'\"&\"!$B$9:$B$43\"),0,MATCH($A50,INDIRECT(\"'\"&INT((MONTH(A50)-1)/6)+1&IF(INT((MONTH(A50)-1)/6)+1=1,\"ER SEMESTRE \",\"EME SEMESTRE \")&YEAR(A50)&\"'\"&\"!$B$7:$HA$7\"),0)-DAY(A50)-1)=\"(\"&$G$9&\")\")*(INDEX(INDIRECT(\"'\"&INT((MONTH(A50)-1)/6)+1&IF(INT((MONTH(A50)-1)/6)+1=1,\"ER SEMESTRE \",\"EME SEMESTRE \")&YEAR(A50)&\"'\"&\"!$B$9:$HA$43\"),0,MATCH($A50,INDIRECT(\"'\"&INT((MONTH(A50)-1)/6)+1&IF(INT((MONTH(A50)-1)/6)+1=1,\"ER SEMESTRE \",\"EME SEMESTRE \")&YEAR(A50)&\"'\"&\"!$B$7:$HA$7\"),0))=\"J\"),ROW(INDIRECT(\"'\"&INT((MONTH(A50)-1)/6)+1&IF(INT((MONTH(A50)-1)/6)+1=1,\"ER SEMESTRE \",\"EME SEMESTRE \")&YEAR(A50)&\"'\"&\"!$D$9:$D$43\"))-8,9^9))),IFERROR(INDEX(OFFSET(INDIRECT(\"'\"&INT((MONTH(A50)-1)/6)+1&IF(INT((MONTH(A50)-1)/6)+1=1,\"ER SEMESTRE \",\"EME SEMESTRE \")&YEAR(A50)&\"'\"&\"!$B$9:$B$43\"),0,MATCH($A50,INDIRECT(\"'\"&INT((MONTH(A50)-1)/6)+1&IF(INT((MONTH(A50)-1)/6)+1=1,\"ER SEMESTRE \",\"EME SEMESTRE \")&YEAR(A50)&\"'\"&\"!$B$7:$HA$7\"),0)-DAY(A50)-2),MIN(IF((OFFSET(INDIRECT(\"'\"&INT((MONTH(A50)-1)/6)+1&IF(INT((MONTH(A50)-1)/6)+1=1,\"ER SEMESTRE \",\"EME SEMESTRE \")&YEAR(A50)&\"'\"&\"!$B$9:$B$43\"),0,MATCH($A50,INDIRECT(\"'\"&INT((MONTH(A50)-1)/6)+1&IF(INT((MONTH(A50)-1)/6)+1=1,\"ER SEMESTRE \",\"EME SEMESTRE \")&YEAR(A50)&\"'\"&\"!$B$7:$HA$7\"),0)-DAY(A50)-1)=\"(\"&$G$9&\")\")*(INDEX(INDIRECT(\"'\"&INT((MONTH(A50)-1)/6)+1&IF(INT((MONTH(A50)-1)/6)+1=1,\"ER SEMESTRE \",\"EME SEMESTRE \")&YEAR(A50)&\"'\"&\"!$B$9:$HA$43\"),0,MATCH($A50,INDIRECT(\"'\"&INT((MONTH(A50)-1)/6)+1&IF(INT((MONTH(A50)-1)/6)+1=1,\"ER SEMESTRE \",\"EME SEMESTRE \")&YEAR(A50)&\"'\"&\"!$B$7:$HA$7\"),0))=\"R\"),ROW(INDIRECT(\"'\"&INT((MONTH(A50)-1)/6)+1&IF(INT((MONTH(A50)-1)/6)+1=1,\"ER SEMESTRE \",\"EME SEMESTRE \")&YEAR(A50)&\"'\"&\"!$D$9:$D$43\"))-8,9^9))),\"\")),\"\")","v":""},null,{"$f":"IF(OR($B50=\"M\",$B50=\"N\",$B50=\"A\"),IF(\nIFERROR(INDEX(OFFSET(INDIRECT(\"'\"&INT((MONTH(A50)-1)/6)+1&IF(INT((MONTH(A50)-1)/6)+1=1,\"ER SEMESTRE \",\"EME SEMESTRE \")&YEAR(A50)&\"'\"&\"!$B$9:$B$43\"),0,MATCH($A50,INDIRECT(\"'\"&INT((MONTH(A50)-1)/6)+1&IF(INT((MONTH(A50)-1)/6)+1=1,\"ER SEMESTRE \",\"EME SEMESTRE \")&YEAR(A50)&\"'\"&\"!$B$7:$HA$7\"),0)-DAY(A50)-2),MIN(IF((OFFSET(INDIRECT(\"'\"&INT((MONTH(A50)-1)/6)+1&IF(INT((MONTH(A50)-1)/6)+1=1,\"ER SEMESTRE \",\"EME SEMESTRE \")&YEAR(A50)&\"'\"&\"!$B$9:$B$43\"),0,MATCH($A50,INDIRECT(\"'\"&INT((MONTH(A50)-1)/6)+1&IF(INT((MONTH(A50)-1)/6)+1=1,\"ER SEMESTRE \",\"EME SEMESTRE \")&YEAR(A50)&\"'\"&\"!$B$7:$HA$7\"),0)-DAY(A50)-1)=\"(\"&$G$9&\")\")*(INDEX(INDIRECT(\"'\"&INT((MONTH(A50)-1)/6)+1&IF(INT((MONTH(A50)-1)/6)+1=1,\"ER SEMESTRE \",\"EME SEMESTRE \")&YEAR(A50)&\"'\"&\"!$B$9:$HA$43\"),0,MATCH($A50,INDIRECT(\"'\"&INT((MONTH(A50)-1)/6)+1&IF(INT((MONTH(A50)-1)/6)+1=1,\"ER SEMESTRE \",\"EME SEMESTRE \")&YEAR(A50)&\"'\"&\"!$B$7:$HA$7\"),0))=\"J\"),ROW(INDIRECT(\"'\"&INT((MONTH(A50)-1)/6)+1&IF(INT((MONTH(A50)-1)/6)+1=1,\"ER SEMESTRE \",\"EME SEMESTRE \")&YEAR(A50)&\"'\"&\"!$D$9:$D$43\"))-8,9^9))),\"\")=\"\",\n\nIFERROR(INDEX(OFFSET(INDIRECT(\"'\"&INT((MONTH(A50)-1)/6)+1&IF(INT((MONTH(A50)-1)/6)+1=1,\"ER SEMESTRE \",\"EME SEMESTRE \")&YEAR(A50)&\"'\"&\"!$B$9:$B$43\"),0,MATCH($A50,INDIRECT(\"'\"&INT((MONTH(A50)-1)/6)+1&IF(INT((MONTH(A50)-1)/6)+1=1,\"ER SEMESTRE \",\"EME SEMESTRE \")&YEAR(A50)&\"'\"&\"!$B$7:$HA$7\"),0)-DAY(A50)-2),SMALL(IF((OFFSET(INDIRECT(\"'\"&INT((MONTH(A50)-1)/6)+1&IF(INT((MONTH(A50)-1)/6)+1=1,\"ER SEMESTRE \",\"EME SEMESTRE \")&YEAR(A50)&\"'\"&\"!$B$9:$B$43\"),0,MATCH($A50,INDIRECT(\"'\"&INT((MONTH(A50)-1)/6)+1&IF(INT((MONTH(A50)-1)/6)+1=1,\"ER SEMESTRE \",\"EME SEMESTRE \")&YEAR(A50)&\"'\"&\"!$B$7:$HA$7\"),0)-DAY(A50)-1)=\"(\"&$G$9&\")\")*(INDEX(INDIRECT(\"'\"&INT((MONTH(A50)-1)/6)+1&IF(INT((MONTH(A50)-1)/6)+1=1,\"ER SEMESTRE \",\"EME SEMESTRE \")&YEAR(A50)&\"'\"&\"!$B$9:$HA$43\"),0,MATCH($A50,INDIRECT(\"'\"&INT((MONTH(A50)-1)/6)+1&IF(INT((MONTH(A50)-1)/6)+1=1,\"ER SEMESTRE \",\"EME SEMESTRE \")&YEAR(A50)&\"'\"&\"!$B$7:$HA$7\"),0))=\"R\"),ROW(INDIRECT(\"'\"&INT((MONTH(A50)-1)/6)+1&IF(INT((MONTH(A50)-1)/6)+1=1,\"ER SEMESTRE \",\"EME SEMESTRE \")&YEAR(A50)&\"'\"&\"!D$9:D$43\"))-8,9^9),2)),\"\"),\n\nIFERROR(\nINDEX(\nOFFSET(INDIRECT(\"'\"&INT((MONTH(A50)-1)/6)+1&IF(INT((MONTH(A50)-1)/6)+1=1,\"ER SEMESTRE \",\"EME SEMESTRE \")&YEAR(A50)&\"'\"&\"!$B$9:$B$43\"),0,MATCH($A50,INDIRECT(\"'\"&INT((MONTH(A50)-1)/6)+1&IF(INT((MONTH(A50)-1)/6)+1=1,\"ER SEMESTRE \",\"EME SEMESTRE \")&YEAR(A50)&\"'\"&\"!$B$7:$HA$7\"),0)-DAY(A50)-2),\n\nMIN(IF(\n(OFFSET(INDIRECT(\"'\"&INT((MONTH(A50)-1)/6)+1&IF(INT((MONTH(A50)-1)/6)+1=1,\"ER SEMESTRE \",\"EME SEMESTRE \")&YEAR(A50)&\"'\"&\"!$B$9:$B$43\"),0,MATCH($A50,INDIRECT(\"'\"&INT((MONTH(A50)-1)/6)+1&IF(INT((MONTH(A50)-1)/6)+1=1,\"ER SEMESTRE \",\"EME SEMESTRE \")&YEAR(A50)&\"'\"&\"!$B$7:$HA$7\"),0)-DAY(A50)-1)=\"(\"&$G$9&\")\")\n*\n(INDEX(INDIRECT(\"'\"&INT((MONTH(A50)-1)/6)+1&IF(INT((MONTH(A50)-1)/6)+1=1,\"ER SEMESTRE \",\"EME SEMESTRE \")&YEAR(A50)&\"'\"&\"!$B$9:$HA$43\"),0,MATCH($A50,INDIRECT(\"'\"&INT((MONTH(A50)-1)/6)+1&IF(INT((MONTH(A50)-1)/6)+1=1,\"ER SEMESTRE \",\"EME SEMESTRE \")&YEAR(A50)&\"'\"&\"!$B$7:$HA$7\"),0))=\"R\"),\n\nROW(INDIRECT(\"'\"&INT((MONTH(A50)-1)/6)+1&IF(INT((MONTH(A50)-1)/6)+1=1,\"ER SEMESTRE \",\"EME SEMESTRE \")&YEAR(A50)&\"'\"&\"!D$9:D$43\"))-8,\n\n9^9))),\"\")),\"\")","v":""},null,{"$f":"IF(OR($B50=\"M\",$B50=\"N\",$B50=\"A\"),IF(\n\nIFERROR(INDEX(OFFSET(INDIRECT(\"'\"&INT((MONTH(A50)-1)/6)+1&IF(INT((MONTH(A50)-1)/6)+1=1,\"ER SEMESTRE \",\"EME SEMESTRE \")&YEAR(A50)&\"'\"&\"!$B$9:$B$43\"),0,MATCH($A50,INDIRECT(\"'\"&INT((MONTH(A50)-1)/6)+1&IF(INT((MONTH(A50)-1)/6)+1=1,\"ER SEMESTRE \",\"EME SEMESTRE \")&YEAR(A50)&\"'\"&\"!$B$7:$HA$7\"),0)-DAY(A50)-2),MIN(IF((OFFSET(INDIRECT(\"'\"&INT((MONTH(A50)-1)/6)+1&IF(INT((MONTH(A50)-1)/6)+1=1,\"ER SEMESTRE \",\"EME SEMESTRE \")&YEAR(A50)&\"'\"&\"!$B$9:$B$43\"),0,MATCH($A50,INDIRECT(\"'\"&INT((MONTH(A50)-1)/6)+1&IF(INT((MONTH(A50)-1)/6)+1=1,\"ER SEMESTRE \",\"EME SEMESTRE \")&YEAR(A50)&\"'\"&\"!$B$7:$HA$7\"),0)-DAY(A50)-1)=\"(\"&$G$9&\")\")*(INDEX(INDIRECT(\"'\"&INT((MONTH(A50)-1)/6)+1&IF(INT((MONTH(A50)-1)/6)+1=1,\"ER SEMESTRE \",\"EME SEMESTRE \")&YEAR(A50)&\"'\"&\"!$B$9:$HA$43\"),0,MATCH($A50,INDIRECT(\"'\"&INT((MONTH(A50)-1)/6)+1&IF(INT((MONTH(A50)-1)/6)+1=1,\"ER SEMESTRE \",\"EME SEMESTRE \")&YEAR(A50)&\"'\"&\"!$B$7:$HA$7\"),0))=\"J\"),ROW(INDIRECT(\"'\"&INT((MONTH(A50)-1)/6)+1&IF(INT((MONTH(A50)-1)/6)+1=1,\"ER SEMESTRE \",\"EME SEMESTRE \")&YEAR(A50)&\"'\"&\"!$D$9:$D$43\"))-8,9^9))),\"\")=\"\",\n\nIFERROR(\nINDEX(OFFSET(INDIRECT(\"'\"&INT((MONTH(A50)-1)/6)+1&IF(INT((MONTH(A50)-1)/6)+1=1,\"ER SEMESTRE \",\"EME SEMESTRE \")&YEAR(A50)&\"'\"&\"!$B$9:$B$43\"),0,MATCH($A50,INDIRECT(\"'\"&INT((MONTH(A50)-1)/6)+1&IF(INT((MONTH(A50)-1)/6)+1=1,\"ER SEMESTRE \",\"EME SEMESTRE \")&YEAR(A50)&\"'\"&\"!$B$7:$HA$7\"),0)-DAY(A50)-2),\nSMALL(IF((OFFSET(INDIRECT(\"'\"&INT((MONTH(A50)-1)/6)+1&IF(INT((MONTH(A50)-1)/6)+1=1,\"ER SEMESTRE \",\"EME SEMESTRE \")&YEAR(A50)&\"'\"&\"!$B$9:$B$43\"),0,MATCH($A50,INDIRECT(\"'\"&INT((MONTH(A50)-1)/6)+1&IF(INT((MONTH(A50)-1)/6)+1=1,\"ER SEMESTRE \",\"EME SEMESTRE \")&YEAR(A50)&\"'\"&\"!$B$7:$HA$7\"),0)-DAY(A50)-1)=\"(\"&$G$9&\")\")*(INDEX(INDIRECT(\"'\"&INT((MONTH(A50)-1)/6)+1&IF(INT((MONTH(A50)-1)/6)+1=1,\"ER SEMESTRE \",\"EME SEMESTRE \")&YEAR(A50)&\"'\"&\"!$B$9:$HA$43\"),0,MATCH($A50,INDIRECT(\"'\"&INT((MONTH(A50)-1)/6)+1&IF(INT((MONTH(A50)-1)/6)+1=1,\"ER SEMESTRE \",\"EME SEMESTRE \")&YEAR(A50)&\"'\"&\"!$B$7:$HA$7\"),0))=\"R\"),ROW(INDIRECT(\"'\"&INT((MONTH(A50)-1)/6)+1&IF(INT((MONTH(A50)-1)/6)+1=1,\"ER SEMESTRE \",\"EME SEMESTRE \")&YEAR(A50)&\"'\"&\"!D$9:D$43\"))-8,9^9),3)),\"\"),\n\n\nIFERROR(\nINDEX(OFFSET(INDIRECT(\"'\"&INT((MONTH(A50)-1)/6)+1&IF(INT((MONTH(A50)-1)/6)+1=1,\"ER SEMESTRE \",\"EME SEMESTRE \")&YEAR(A50)&\"'\"&\"!$B$9:$B$43\"),0,MATCH($A50,INDIRECT(\"'\"&INT((MONTH(A50)-1)/6)+1&IF(INT((MONTH(A50)-1)/6)+1=1,\"ER SEMESTRE \",\"EME SEMESTRE \")&YEAR(A50)&\"'\"&\"!$B$7:$HA$7\"),0)-DAY(A50)-2),\nSMALL(IF((OFFSET(INDIRECT(\"'\"&INT((MONTH(A50)-1)/6)+1&IF(INT((MONTH(A50)-1)/6)+1=1,\"ER SEMESTRE \",\"EME SEMESTRE \")&YEAR(A50)&\"'\"&\"!$B$9:$B$43\"),0,MATCH($A50,INDIRECT(\"'\"&INT((MONTH(A50)-1)/6)+1&IF(INT((MONTH(A50)-1)/6)+1=1,\"ER SEMESTRE \",\"EME SEMESTRE \")&YEAR(A50)&\"'\"&\"!$B$7:$HA$7\"),0)-DAY(A50)-1)=\"(\"&$G$9&\")\")*(INDEX(INDIRECT(\"'\"&INT((MONTH(A50)-1)/6)+1&IF(INT((MONTH(A50)-1)/6)+1=1,\"ER SEMESTRE \",\"EME SEMESTRE \")&YEAR(A50)&\"'\"&\"!$B$9:$HA$43\"),0,MATCH($A50,INDIRECT(\"'\"&INT((MONTH(A50)-1)/6)+1&IF(INT((MONTH(A50)-1)/6)+1=1,\"ER SEMESTRE \",\"EME SEMESTRE \")&YEAR(A50)&\"'\"&\"!$B$7:$HA$7\"),0))=\"R\"),ROW(INDIRECT(\"'\"&INT((MONTH(A50)-1)/6)+1&IF(INT((MONTH(A50)-1)/6)+1=1,\"ER SEMESTRE \",\"EME SEMESTRE \")&YEAR(A50)&\"'\"&\"!D$9:D$43\"))-8,9^9),2)),\"\")\n\n),\n\n\"\")","v":""}]

{"sheet":"Accès planning","index":1,"n_rows":10,"n_cols":7,"rows_kept":10,"cut":false,"hidden":false,"merged":[[6,0,6,6],[7,0,7,6]]}
[]
[]
[]
[null,null,null,null,null,"MAJ le","2015-01-19"]
[]
[]
["PLANNING  "]
[{"$f":"+données!B4","v":"2015-01-01"}]
[]
["ACCEDER AU VISUEL DU PLANNING SERVICE CONTINU"]

{"sheet":"1ER SEMESTRE 2015","index":2,"n_rows":42,"n_cols":212,"rows_kept":42,"cut":false,"hidden":false,"merged":[[36,174,41,174],[7,174,12,174],[25,139,29,139],[36,139,41,139],[1,193,1,206],[30,139,35,139],[30,174,35,174],[25,174,29,174],[14,174,19,174],[20,174,24,174],[36,69,41,69],[7,69,12,69],[30,104,35,104],[25,104,29,104],[36,104,41,104],[20,69,24,69],[20,104,24,104],[25,69,29,69],[30,69,35,69],[25,35,29,35],[1,177,1,192],[1,107,1,122],[1,142,1,157],[1,158,1,172],[1,72,1,87],[1,123,1,136],[14,139,19,139],[30,35,35,35],[1,54,1,66],[1,88,1,102],[20,0,24,0],[14,0,19,0],[20,35,24,35],[36,35,41,35],[7,35,12,35],[30,0,35,0],[25,0,29,0],[36,0,41,0],[7,0,12,0],[1,19,1,33],[1,3,1,18],[7,139,12,139],[7,104,12,104],[20,139,24,139],[14,104,19,104],[14,35,19,35],[14,69,19,69],[1,38,1,53]]}
[null,null,null,null,null,null,null,null,null,null,null,null,null,null,null,null,null,null,null,null,null,null,null,null,null,null,null,null,null,null,null,null,null,null,null,null,null,null,null,null,null,null,null,null,null,null,null,null,null,null,null,null,null,null,null,null,null,null,null,null,null,null,null,null,null,null,null,null,null,null,null,null,null,null,null,null,null,null,null,null,null,null,null,null,null,null,null,null,null,null,null,null,null,null,null,null,null,null,null,null,null,null,null,null,null,null,null,null,null,null,null,null,null,null,null,null,null,null,null,null,null,null,null,null,null,null,null,null,null,null,null,null,null,null,null,null,null,null,null,null,null,null,null,null,null,null,null,null,null,null,null,null,null,null,null,null,null,null,null,null,null,null,null,null,null,null,null,null,null,null,null,null,null,null,null,null,null,null,null,null,null,null,null,"                                                                                                    ;"]
[null,null,null,"MOIS DE",null,null,null,null,null,null,null,null,null,null,null,null,null,null,null,{"$f":"DATE(données!$B$3,1,1)","v":"2015-01-01"},null,null,null,null,null,null,null,null,null,null,null,null,null,null,null,null,null,null,"MOIS DE",null,null,null,null,null,null,null,null,null,null,null,null,null,null,null,{"$f":"DATE(données!$B$3,2,1)","v":"2015-02-01"},null,null,null,null,null,null,null,null,null,null,null,null,null,null,null,null,null,"MOIS DE",null,null,null,null,null,null,null,null,null,null,null,null,null,null,null,{"$f":"DATE(données!$B$3,3,1)","v":"2015-03-01"},null,null,null,null,null,null,null,null,null,null,null,null,null,null,null,null,null,null,"MOIS DE",null,null,null,null,null,null,null,null,null,null,null,null,null,null,null,{"$f":"DATE(données!$B$3,4,1)","v":"2015-04-01"},null,null,null,null,null,null,null,null,null,null,null,null,null,null,null,null,null,null,"MOIS DE",null,null,null,null,null,null,null,null,null,null,null,null,null,null,null,{"$f":"DATE(données!$B$3,5,1)","v":"2015-05-01"},null,null,null,null,null,null,null,null,null,null,null,null,null,null,null,null,null,null,"MOIS DE",null,null,null,null,null,null,null,null,null,null,null,null,null,null,null,{"$f":"DATE(données!$B$3,6,1)","v":"2015-06-01"}]
[]
[null,null,"Personnel continu",null,null,null,null,null,null,null,null,null,null,null,null,null,null,null,null,null,null,null,null,"Mise à jour le :",null,null,null,null,null,null,null,null,null,null,null,null,null,"Personnel continu",null,null,null,null,null,null,null,null,null,null,null,null,null,null,null,null,null,null,null,null,"Mise à jour le :",null,null,null,null,null,null,null,null,null,null,null,null,"Personnel continu",null,null,null,null,null,null,null,null,null,null,null,null,null,null,null,null,null,null,null,null,"Mise à jour le :",null,null,null,null,null,null,null,null,null,null,null,null,null,"Personnel continu",null,null,null,null,null,null,null,null,null,null,null,null,null,null,null,null,null,null,null,null,"Mise à jour le :",null,null,null,null,null,null,null,null,null,null,null,null,null,"Personnel continu",null,null,null,null,null,null,null,null,null,null,null,null,null,null,null,null,null,null,null,null,"Mise à jour le :",null,null,null,null,null,null,null,null,null,null,null,null,null,"Personnel continu",null,null,null,null,null,null,null,null,null,null,null,null,null,null,null,null,null,null,null,null,"Mise à jour le :"]
[null,null,null,null,null,null,null,null,null,null,null,null,null,null,null,null,null,null,null,null,null,null,null,null,null,null,null,null,null,null,null,null,"RN",null,null,null,null,null,null,null,null,null,null,null,null,null,null,null,null,null,null,null,null,null,null,null,null,null,null,null,null,null,null,null,null,null,null,null,null,null,null,null,null,null,null,null,null,null,null,null,null,null,"RN",null,"D",null,null,null,null,null,null,null,null,null,"RN","RN",null,null,null,null,null,null,"RN",null,null,null,null,null,null,null,null,null,null,null,null,null,"RN",null,null,"RN",null,null,null,null,null,null,null,null,null,null,"RN",null,null,null,null,null,"RN",null,null,null,null,null,null,null,null,null,null,null,null,null,null,null,null,null,null,null,null,null,null,"RN","RN",null,null,null,null,null,null,null,null,null,null,"F",null,null,null,null,null,null,null,null,null,null,null,null,null,null,null,"RN","RN",null,null,null,null,null,null,null,null,null,"RN",null,"RN"]
[null,null,"JOUR",{"$f":"$T$2","v":"2015-01-01"},{"$f":"D6+1","v":"2015-01-02"},{"$f":"E6+1","v":"2015-01-03"},{"$f":"F6+1","v":"2015-01-04"},"2015-01-05","2015-01-06","2015-01-07","2015-01-08","2015-01-09","2015-01-10","2015-01-11","2015-01-12","2015-01-13","2015-01-14","2015-01-15","2015-01-16","2015-01-17","2015-01-18","2015-01-19","2015-01-20","2015-01-21","2015-01-22","2015-01-23","2015-01-24","2015-01-25","2015-01-26","2015-01-27","2015-01-28","2015-01-29","2015-01-30","2015-01-31"," ",null,null,"JOUR",{"$f":"$BC$2","v":"2015-02-01"},{"$f":"AM6+1","v":"2015-02-02"},"2015-02-03","2015-02-04","2015-02-05","2015-02-06","2015-02-07","2015-02-08","2015-02-09","2015-02-10","2015-02-11","2015-02-12","2015-02-13","2015-02-14","2015-02-15","2015-02-16","2015-02-17","2015-02-18","2015-02-19","2015-02-20","2015-02-21","2015-02-22","2015-02-23","2015-02-24","2015-02-25","2015-02-26","2015-02-27","2015-02-28",{"$f":"IF(BN6=EOMONTH($BC$2,0),\"\",BN6+1)","v":""},{"$f":"IF(BO6=\"\",\"\",IF(BO6=EOMONTH($BC$2,0),\"\",BO6+1))","v":""},null,null,null,"JOUR",{"$f":"$CK$2","v":"2015-03-01"},{"$f":"BU6+1","v":"2015-03-02"},"2015-03-03","2015-03-04","2015-03-05","2015-03-06","2015-03-07","2015-03-08","2015-03-09","2015-03-10","2015-03-11","2015-03-12","2015-03-13","2015-03-14","2015-03-15","2015-03-16","2015-03-17","2015-03-18","2015-03-19","2015-03-20","2015-03-21","2015-03-22","2015-03-23",{"$f":"CQ6+1","v":"2015-03-24"},"2015-03-25","2015-03-26","2015-03-27","2015-03-28","2015-03-29","2015-03-30","2015-03-31",null,null,null,"JOUR",{"$f":"$DT$2","v":"2015-04-01"},{"$f":"DD6+1","v":"2015-04-02"},{"$f":"DE6+1","v":"2015-04-03"},{"$f":"DF6+1","v":"2015-04-04"},"2015-04-05","2015-04-06",{"$f":"DI6+1","v":"2015-04-07"},{"$f":"DJ6+1","v":"2015-04-08"},"2015-04-09","2015-04-10","2015-04-11","2015-04-12","2015-04-13","2015-04-14","2015-04-15","2015-04-16","2015-04-17","2015-04-18","2015-04-19","2015-04-20","2015-04-21","2015-04-22","2015-04-23","2015-04-24","2015-04-25","2015-04-26","2015-04-27","2015-04-28","2015-04-29","2015-04-30",null,null,null,null,"JOUR",{"$f":"$FC$2","v":"2015-05-01"},{"$f":"EM6+1","v":"2015-05-02"},"2015-05-03","2015-05-04","2015-05-05",{"$f":"EQ6+1","v":"2015-05-06"},{"$f":"ER6+1","v":"2015-05-07"},"2015-05-08","2015-05-09","2015-05-10","2015-05-11","2015-05-12","2015-05-13","2015-05-14","2015-05-15","2015-05-16","2015-05-17","2015-05-18","2015-05-19","2015-05-20","2015-05-21","2015-05-22","2015-05-23","2015-05-24","2015-05-25","2015-05-26","2015-05-27","2015-05-28","2015-05-29","2015-05-30","2015-05-31",null,null,null,"JOUR",{"$f":"$GL$2","v":"2015-06-01"},{"$f":"FV6+1","v":"2015-06-02"},"2015-06-03",{"$f":"FX6+1","v":"2015-06-04"},{"$f":"FY6+1","v":"2015-06-05"},{"$f":"FZ6+1","v":"2015-06-06"},{"$f":"GA6+1","v":"2015-06-07"},"2015-06-08",{"$f":"GC6+1","v":"2015-06-09"},"2015-06-10","2015-06-11","2015-06-12","2015-06-13","2015-06-14","2015-06-15","2015-06-16","2015-06-17","2015-06-18","2015-06-19","2015-06-20","2015-06-21","2015-06-22","2015-06-23","2015-06-24","2015-06-25","2015-06-26","2015-06-27","2015-06-28","2015-06-29","2015-06-30"]
[null,"TRIG","DATE",{"$f":"$T$2","v":"2015-01-01"},{"$f":"D7+1","v":"2015-01-02"},{"$f":"E7+1","v":"2015-01-03"},{"$f":"F7+1","v":"2015-01-04"},"2015-01-05","2015-01-06","2015-01-07","2015-01-08","2015-01-09","2015-01-10","2015-01-11","2015-01-12","2015-01-13","2015-01-14","2015-01-15","2015-01-16","2015-01-17","2015-01-18","2015-01-19","2015-01-20","2015-01-21","2015-01-22","2015-01-23","2015-01-24","2015-01-25","2015-01-26","2015-01-27","2015-01-28","2015-01-29","2015-01-30","2015-01-31",null,null,"TRIG","DATE",{"$f":"$BC$2","v":"2015-02-01"},{"$f":"AM7+1","v":"2015-02-02"},"2015-02-03","2015-02-04","2015-02-05","2015-02-06","2015-02-07","2015-02-08","2015-02-09","2015-02-10","2015-02-11","2015-02-12","2015-02-13","2015-02-14","2015-02-15","2015-02-16","2015-02-17","2015-02-18","2015-02-19","2015-02-20","2015-02-21","2015-02-22","2015-02-23","2015-02-24","2015-02-25","2015-02-26",{"$f":"BL7+1","v":"2015-02-27"},{"$f":"BM7+1","v":"2015-02-28"},{"$f":"IF(BN7=EOMONTH($BC$2,0),\"\",BN7+1)","v":""},{"$f":"IF(BO7=\"\",\"\",IF(BO7=EOMONTH($BC$2,0),\"\",BO7+1))","v":""},null,null,"TRIG","DATE",{"$f":"$CK$2","v":"2015-03-01"},{"$f":"BU7+1","v":"2015-03-02"},"2015-03-03","2015-03-04","2015-03-05","2015-03-06","2015-03-07","2015-03-08","2015-03-09","2015-03-10","2015-03-11","2015-03-12","2015-03-13","2015-03-14","2015-03-15","2015-03-16","2015-03-17","2015-03-18","2015-03-19","2015-03-20","2015-03-21","1900-01-22","1900-01-23","1900-01-24","1900-01-25","1900-01-26","1900-01-27","1900-01-28","1900-01-29","1900-01-30","1900-01-31",null,null,"TRIG","DATE",{"$f":"$DT$2","v":"2015-04-01"},{"$f":"DD7+1","v":"2015-04-02"},{"$f":"DE7+1","v":"2015-04-03"},"2015-04-04","2015-04-05","2015-04-06",{"$f":"DI7+1","v":"2015-04-07"},{"$f":"DJ7+1","v":"2015-04-08"},"2015-04-09","2015-04-10","2015-04-11","2015-04-12","2015-04-13","2015-04-14","2015-04-15","2015-04-16","2015-04-17","2015-04-18","2015-04-19","2015-04-20","2015-04-21","2015-04-22","2015-04-23","2015-04-24","2015-04-25","2015-04-26","2015-04-27","2015-04-28","2015-04-29","2015-04-30",null,null,null,"TRIG","DATE","2015-05-01","2015-05-02","2015-05-03","2015-05-04","2015-05-05","2015-05-06","2015-05-07","2015-05-08","2015-05-09","2015-05-10","2015-05-11","2015-05-12","2015-05-13","2015-05-14","2015-05-15","2015-05-16","2015-05-17","2015-05-18","2015-05-19","2015-05-20","2015-05-21","2015-05-22","2015-05-23","2015-05-24","2015-05-25","2015-05-26","2015-05-27","2015-05-28","2015-05-29","2015-05-30","2015-05-31",null,null,"TRIG","DATE",{"$f":"$GL$2","v":"2015-06-01"},"2015-06-02","2015-06-03","2015-06-04","2015-06-05","2015-06-06","2015-06-07","2015-06-08","2015-06-09","2015-06-10","2015-06-11","2015-06-12","2015-06-13","2015-06-14","2015-06-15","2015-06-16","2015-06-17","2015-06-18","2015-06-19","2015-06-20","2015-06-21","2015-06-22","2015-06-23","2015-06-24","2015-06-25","2015-06-26","2015-06-27","2015-06-28","2015-06-29","2015-06-30"]
["Equipe 1\nE",{"$f":"+A8","v":"Equipe 1\nE"},null,"N","R1","R2","R","J","R","R","M","M","A","A","N","N","R1","R2","J","R","R","R","M","M","A","A","N","N","R1","R2","J","J","R","R",null,"Equipe 1\nE",{"$f":"+AJ8","v":"Equipe 1\nE"},null,"M","M","A","A","N","N","R1","R2","J","J","R","R","M","M","A","A","N","N","R1","R2","R","R","R","R","M","M","A","A",null,null,null,"Equipe 1\nE",{"$f":"+BR8","v":"Equipe 1\nE"},null,"N","N","R1","R2","J","J","R","R","M","M","A","A","N","N","R1","R2","J","J","R","R","M","M","A","A","N","N","R1","R2","R","J","R",null,"Equipe 1\nE",{"$f":"+DA8","v":"Equipe 1\nE"},null,"R","M","M","A","A","N","N","R1","R2","J","R","R","R","M","M","A","A","N","N","R1","R2","J","J","R","R","M","M","A","A","N",null,null,"Equipe 1\nE",{"$f":"+EJ8","v":"Equipe 1\nE"},null,"N","R1","R2","J","J","R","R","M","M","A","A","N","N","R1","R2","R","R","R","R","M","M","A","A","N","N","R1","R2","J","J","R","R",null,"Equipe 1\nE",{"$f":"+FS8","v":"Equipe 1\nE"},null,"M","M","A","A","N","N","R1","R2","J","J","R","R","M","M","A","A","N","N","R1","R2","R","J","R","R","M","M","A","A","N","N"]
[null,"SMT","(CDQ)",{"$f":"D8","v":"N"},{"$f":"E8","v":"R1"},"R2","Ar","Ar","R","R","M","M","CA","CA","CM","CM","R1","R2","J","R","R","R","M","M","A","A","N","N","R1","R2","J","J","R","R",null,null,"SMT","(CDQ)",{"$f":"AM8","v":"M"},"M","A","A","N","N","R1","R2","J","J","R","R","M","M","A","A","N","N","R1","R2","Mr","Mr","R","R","M","M","A","A",0,null,null,null,"SMT","(CDQ)",{"$f":"BU8","v":"N"},"N","R1","R2","J","CA","R","R","M","M","A","A","N","N","R1","R2","CA","CA","R","R","M","M","A","A","N","N","R1","R2","R","Ar","Nr",null,null,"SMT","(CDQ)",{"$f":"DD8","v":"R"},"M","M","A","RCH","N","N","R1","R2","Mr","R","R","R","M","M","A","A","N","N","R1","R2","REX","RCH","R","R","M","M","A","A","N",null,null,null,"SMT","(CDQ)","N","R1","R2","Mr","Mr","R","R","M","M","A","A","N","N","R1","R2","R","R","Ar","R","M","M","A","A","N","N","R1","R2","Ar","Ar","R","R",null,null,"SMT","(CDQ)","M","M","A","A","N","N","R1","R2","Ar","Ar","R","R","M","M","A","A","N","N","R1","R2","Mr","Ar","R","R","CA","CA","CA","CA","CA","CA"]
[null,"DNA","(TE)",{"$f":"D8","v":"N"},{"$f":"E8","v":"R1"},"R2","R","RC","R","R","M","M","A","A","N","N","R1","R2","J","Mr","R","R","M","M","A","A","N","N","R1","R2","J","Nr","R","R",null,null,"DNA","(TE)",{"$f":"AM8","v":"M"},{"$f":"AN8","v":"M"},"A","A","N","N","R1","R2","J","J","R","R","M","M","A","A","N","N","R1","R2","R","R","R","R","M","M","A","A",0,null,null,null,"DNA","(TE)","S","S",{"$f":"BW8","v":"R1"},"R2","S","J","R","R","M","M","A","A","A",{"$f":"CH8","v":"N"},{"$f":"CI8","v":"R1"},{"$f":"CJ8","v":"R2"},"CA","CA",{"$f":"CM8","v":"R"},"R","M","M","A","A","N","N","R1","R2","Mr","Mr","Ar",null,null,"DNA","(TE)",{"$f":"DD8","v":"R"},"M","M",{"$f":"DG8","v":"A"},{"$f":"DH8","v":"A"},"N","CA",{"$f":"DK8","v":"R1"},{"$f":"DL8","v":"R2"},"Mr","Mr",{"$f":"DO8","v":"R"},"R","AJ","CM","A","A","RC","RC","R1","R2","RC","RC","R","R","M","M","A","A","N",null,null,null,"DNA","(TE)","N","R1","R2","Nr","Nr","R","R","M","M","A","A","N","N","R1","R2","R","R","R","R","M","M","A","A","N","N","R1","R2","J","J","R","R",null,null,"DNA","(TE)","M","M","A","A","N","N","R1","R2","Ar","Ar","R","R","M","M","A","A","N","N","R1","R2","Ar","Ar","R","R","M","M","A","A","N","N"]
[null,"MRU","(CDB)",{"$f":"D8","v":"N"},{"$f":"E8","v":"R1"},"R2","R","RC","R","R","M","M","A","A","N","D","R1","R2","RN","R","R","R","M","M","A","RN","N","N","R1","R2","D","D","R","R",null,null,"MRU","(CDB)",{"$f":"AM8","v":"M"},"M","A","A","N","N","R1","R2","J","J",{"$f":"AW8","v":"R"},"R","M","M","A","A","N","N","R1","R2","R","R","R","R","M","M","A","A",0,null,null,null,"MRU","(CDB)",{"$f":"BU8","v":"N"},{"$f":"BV8","v":"N"},"R1","R2","J","CA","R","R","M","M","D","A","N","N","R1","R2","D","D","R","R","M","M","RN","A","N","N","R1","R2","Mr","REX","Ar",null,null,"MRU","(CDB)","Ar","M","M","M","RCH","REX","RN",{"$f":"DK8","v":"R1"},"R2","RN","Mr","Ar","R","D","M","A","A","N","N","R1","R2","CA","RCH","R","R","M","M","A","CA","RN",null,null,null,"MRU","(CDB)","N","R1","R2","CA","CA","R","R","M","M","A","A","N","N","R1","R2","R","R","RN","R","M","M","A","A","N","N","R1","R2","D","CA","R","R",null,null,"MRU","(CDB)","M","M","A","A","N","N","R1","R2","J","J","R","R","M","RN","RN","RN","RN","RN","RN","R2","R","J","R","R","M","M","A","A","N","N"]
[null,"DLO","(CIT)",{"$f":"D8","v":"N"},{"$f":"E8","v":"R1"},"R2","R","CA","R","R","M","M","A","A","N","N","R1","R2","J","R","R","R","M","M","A","A","N","N","R1","R2","J","J","R","R",null,null,"DLO","(CIT)","CA",{"$f":"AN8","v":"M"},"A","A","N","N","R1","R2","J","J","R","R","M","M","A","A","N","N","R1","R2","Nr","Nr","R","R","M","M","A","A",0,null,null,null,"DLO","(CIT)",{"$f":"BU8","v":"N"},"N","R1","R2","J","CA","R","R","M","M","A","A","N","N","R1","R2","CA","CA",{"$f":"CM8","v":"R"},{"$f":"CN8","v":"R"},"CA",{"$f":"CP8","v":"M"},"A","A","N","N","R1","R2","R","CA","R",null,null,"DLO","(CIT)","Ar",{"$f":"DE8","v":"M"},"M","A","REX","N","N","R1","R2","CA",{"$f":"DN11","v":"Mr"},"R","R","M","M","A","A","N","N","R1","R2","CA","CA","R","R","M","M","A","A","N",null,null,null,"DLO","(CIT)","N","R1","R2","CA","CA","R","R","M","M","A","A","N","N","R1","R2","Ar","Ar","R","R","M","M","A","A","N","N","R1","R2","Ar","Mr","R","R",null,null,"DLO","(CIT)","M","M","A","A","N","N","R1","R2","CA","CA","R","R","M","M","A","A","N","N","R1","R2","Nr","Nr","R","R","M","M","A","A","N","N"]
[null,"PDO","(F)",{"$f":"D8","v":"N"},{"$f":"E8","v":"R1"},"R2","R","J","R","R","M","M","A","A","RN","N","R1","R2","J","R","R","R","M","RN","RN","A","N","N","R1","R2","J","J","R","R",null,null,"PDO","(F)",{"$f":"AM8","v":"M"},{"$f":"AN8","v":"M"},"A","A","N","N","R1","R2","J","J","R","R","M","M","A","A","N","N","R1","R2","R","R","R","R","M","M","A","A",0,null,null,null,"PDO","(F)","S","S",{"$f":"BW8","v":"R1"},"R2","S","S","R","R","M","M","A","A","S",{"$f":"CH9","v":"N"},"R1","R2","J","CA","R","R","M","M","A","A","N","N","R1","R2","R","CA","R"]
["Equipe 2\nD",{"$f":"+A14","v":"Equipe 2\nD"},null,"R2","J","R","R","R","M","M","A","A","N","N","R1","R2","J","J","R","R","M","M","A","A","N","N","R1","R2","J","R","R","R","M","M",null,"Equipe 2\nD",{"$f":"+AJ14","v":"Equipe 2\nD"},null,"A","A","N","N","R1","R2","R","R","R","R","M","M","A","A","N","N","R1","R2","J","J","R","R","M","M","A","A","N","N",null,null,null,"Equipe 2\nD",{"$f":"+BR14","v":"Equipe 2\nD"},null,"R1","R2","J","J","R","R","M","M","A","A","N","N","R1","R2","R","J","R","R","M","M","A","A","N","N","R1","R2","J","R","R","R","M",null,"Equipe 2\nD",{"$f":"+DA14","v":"Equipe 2\nD"},null,"M","A","A","N","N","R1","R2","J","J","R","R","M","M","A","A","N","N","R1","R2","J","J","R","R","M","M","A","A","N","N","R1",null,null,"Equipe 2\nD",{"$f":"+EJ14","v":"Equipe 2\nD"},null,"R2","R","R","R","R","M","M","A","A","N","N","R1","R2","J","J","R","R","M","M","A","A","N","N","R1","R2","J","J","R","R","M","M",null,"Equipe 2\nD",{"$f":"+FS14","v":"Equipe 2\nD"},null,"A","A","N","N","R1","R2","R","J","R","R","M","M","A","A","N","N","R1","R2","J","R","R","R","M","M","A","A","N","N","R1","R2"]
["Equipe 2\nD","PVA","(CDQ)",{"$f":"D14","v":"R2"},"Mr","Mr",{"$f":"G14","v":"R"},"R","M","M","A","A","N","N","R1","R2","CF","Nr","R","R","M","M","A","A","N","N","R1","R2","J","J","R","R","M","M",null,"Equipe 2\nD","PVA","(CDQ)",{"$f":"AM14","v":"A"},"A","N","N","R1","R2","R","R","R","R","CA","CA","CA","CA","CA","CA","R1","R2","CA","CA","R","R","M","M","A","A","N","N",0,null,null,"Equipe 2\nD","PVA","(CDQ)",{"$f":"BU14","v":"R1"},"R2","J","J","R","R","M","M","A","A","N","N","R1","R2","R","CA","R","R","M","M","A","A","N","N","R1","R2","Nr","R","R","R","M",null,"Equipe 2\nD","PVA","(CDQ)","A",{"$f":"DE14","v":"A"},"N","N","N","R1","R2","Nr","Nr","R","R","M","M","AJ","A","N","N","R1","R2","J","J","R","R","M","M","A","A","N","N","R1",null,null,"Equipe 2\nD","PVA","(CDQ)","R2","R","R","R","R","M","M","A","A","N","N","R1","R2","R","Mr","R","R","M","M","A","A","N","N","R1","R2","Mr","Mr","R","R","M","M",null,"Equipe 2\nD","PVA","(CDQ)","A","A","N","N","R1","R2","Mr","Mr","R","R","M","M","A","A","N","N","R1","R2","Mr","Mr","R","R","M","M","A","A","N","N","R1","R2"]
[null,"DSA","(TE)",{"$f":"D14","v":"R2"},"Nr","Nr","R","R","M","M","A","A","N","N","R1","R2","CA","CA","R","R","CA","CA","CA","CA","CA","CA","R1","R2","CA","CA","R","R","M","M",null,null,"DSA","(TE)",{"$f":"AM14","v":"A"},{"$f":"AN14","v":"A"},"N","N","R1","R2","R","R","R","R","M","M","A","A","N","N","R1","R2","J","J","R","R","M","M","A","A","N","N",0,null,null,null,"DSA","(TE)",{"$f":"BU14","v":"R1"},{"$f":"BV14","v":"R2"},"J","J","R","R","M","M","A","A","N","N","R1","R2","R","J","R","R","M","M","A","A","N","N","R1","R2","RC","R","R","R","M",null,null,"DSA","(TE)",{"$f":"DD14","v":"M"},{"$f":"DE14","v":"A"},"A","N","N","R1","Nr","J","Ar","Ar","R","M","M","A","A","N","N","R1","R2","RCH","RC","R","R","M","M","A","A","N","N","R1",null,null,null,"DSA","(TE)","R2","R","R","R","R","M","M","A","A","N","N","R1","R2","R","CA","R","R","M","M","A","A","N","N","R1","R2","J","R","R","R","M","M",null,null,"DSA","(TE)","A","A","N","N","R1","R2","Mr","Mr","R","R","M","A","A","A","N","N","R1","R2","Mr","Mr","R","R","M","M","A","A","N","N","R1","R2"]
[null,"JGF","(CDB)",{"$f":"D14","v":"R2"},{"$f":"E14","v":"J"},{"$f":"F14","v":"R"},{"$f":"G14","v":"R"},{"$f":"H14","v":"R"},"CA","CA","CA","CA","CA","CA",{"$f":"O14","v":"R1"},{"$f":"P14","v":"R2"},"RC","RC",{"$f":"S14","v":"R"},"R","M","M","A","A","N","N","R1","R2","CA","CA",{"$f":"AE14","v":"R"},{"$f":"AF14","v":"R"},{"$f":"AG14","v":"M"},{"$f":"AH14","v":"M"},null,null,"JGF","(CDB)",{"$f":"AM14","v":"A"},{"$f":"AN14","v":"A"},"N","N","R1","R2","R","R","R","R","M","M","A","A","N","N","R1","R2","J","J","R","R","M","M","A","A","N","N",0,null,null,null,"JGF","(CDB)",{"$f":"BU14","v":"R1"},{"$f":"BV14","v":"R2"},"J","J","R","R","M","M","A","A","N","N","R1","R2","R","RC","R","R","M","M","A","A","N","N","R1","R2","RC","R","R","R","M",null,null,"JGF","(CDB)",{"$f":"DD14","v":"M"},"A","A","N","N","R1","R2","CA","CA",{"$f":"DM14","v":"R"},{"$f":"DN14","v":"R"},"CA","CA","CA","CA","CA","CA",{"$f":"DU14","v":"R1"},{"$f":"DV14","v":"R2"},"CA","CA",{"$f":"DY14","v":"R"},{"$f":"DZ14","v":"R"},"CA","CA","CA","CA","CA","CA",{"$f":"EG14","v":"R1"},null,null,null,"JGF","(CDB)","R2","R","R","R","R","M","M","A","A","N","N","R1","R2","R","REX","R","R","M","M","A","A","N","N","R1","R2","REX","R","R","R","M","M",null,null,"JGF","(CDB)","A","A","N","N","R1","R2","R","J","R","R","M","M","A","A","N","N","R1","R2","J","R","R","R","M","M","A","A","N","N","R1","R2"]
[null,"CDO","(CIT)",{"$f":"D14","v":"R2"},{"$f":"E14","v":"J"},"R","R","R","M","M","A","A","N","N","R1","R2","J","J","R","R","M","M","A","A","N","N","R1","R2","Nr","Nr","R","R","M","M",null,null,"CDO","(CIT)",{"$f":"AM14","v":"A"},{"$f":"AN14","v":"A"},"N","N","R1","R2","R","R","R","R","M","M","A","A","N","N","R1","R2","Ar","Ar","R","R","M","M","A","A","N","N",0,null,null,null,"CDO","(CIT)",{"$f":"BU14","v":"R1"},{"$f":"BV14","v":"R2"},"J","J","R","R","M","M","A","A","N","N","R1","R2","R","CA","R","R","M","M","A","A","N","N","R1","R2","Nr","Nr","R","R","A",null,null,"CDO","(CIT)",{"$f":"DD14","v":"M"},"A","A","N","N","R1","R2","J","Ar",{"$f":"DM14","v":"R"},{"$f":"DN14","v":"R"},{"$f":"DO14","v":"M"},{"$f":"DP14","v":"M"},"AJ",{"$f":"DR14","v":"A"},{"$f":"DS14","v":"N"},{"$f":"DT14","v":"N"},{"$f":"DU14","v":"R1"},{"$f":"DV14","v":"R2"},"CA","CA",{"$f":"DY14","v":"R"},"R","M","M","A","A","N","N","R1",null,null,null,"CDO","(CIT)","R2","R","R","R","R","M","M","A","A","N","N","R1","R2","Mr","Mr","R","R","M","M","A","A","N","N","R1","R2","Mr","Mr","R","R","M","M",null,null,"CDO","(CIT)","A","A","N","N","R1","R2","R","J","R","R","M","M","A","A","N","N","R1","R2","Ar","Ar","R","R","M","M","A","A","N","N","R1","R2"]
[null,{"$f":"+A15","v":"Equipe 2\nD"},null,"A","N","N","R1","R2","J","J","R","R","M","M","A","A","N","N","R1","R2","R","J","R","R","M","M","A","A","N","N","R1","R2","J","R",null,null,{"$f":"+AJ15","v":"Equipe 2\nD"},null,"R","R","M","M","A","A","N","N","R1","R2","J","J","R","R","M","M","A","A","N","N","R1","R2","J","J","R","R","M","M",null,null,null,null,{"$f":"+BR15","v":"Equipe 2\nD"},null,"A","A","N","N","R1","R2","R","R","R","R","M","M","A","A","N","N","R1","R2","J","J","R","R","M","M","A","A","N","N","R1","R2","J",null,null,{"$f":"+DA15","v":"Equipe 2\nD"},null,"J","R","R","M","M","A","A","N","N","R1","R2","R","J","R","R","M","M","A","A","N","N","R1","R2","J","R","R","R","M","M","A",null,null,null,{"$f":"+EJ15","v":"Equipe 2\nD"},null,"A","N","N","R1","R2","J","J","R","R","M","M","A","A","N","N","R1","R2","J","J","R","R","M","M","A","A","N","N","R1","R2","R","R",null,null,{"$f":"+FS15","v":"Equipe 2\nD"},null,"R","R","M","M","A","A","N","N","R1","R2","J","J","R","R","M","M","A","A","N","N","R","R","M","M","A","A","N","N","R1","R2"]
[null,null,null,null,null,null,null,null,null,null,null,null,null,null,null,null,null,null,null,null,null,null,null,null,null,null,null,null,null,null,null,null,null,null,null,null,null,null,null,null,null,null,null,null,null,null,null,null,null,null,null,null,null,null,null,null,null,null,null,null,null,null,null,null,null,null,null,null,null,null,null,null,null,null,null,null,null,null,null,null,null,null,null,null,null,null,null,null,null,null,null,null,null,null,null,null,null,null,null,null,null,null,null,null,null,null,null,null,null,null,null,null,null,null,null,null,null,null,null,null,null,null,null,null,null,null,null,null,null,null,null,null,null,null,null,null,null,null,null,null,"GPA","(F)","R2","R","R","R","R","M","M","A","A","N","N","R1","R2","R","CA","R","R","M","M","A","A","N","N","R1","R2","J","R","R","R","M","M",null,null,"GPA","(F)","A","A","N","N","R1","R2","R","J","R","R","M","A","A","A","N","N","R1","R2","CA","R","R","R","M","M","A","A","N","N","R1","R2",null,null,null,null,"·         Equipe 1 : 15 juillet"]
["Equipe 3                  F","PLC","(CDQ)",{"$f":"D19","v":"A"},"N","N","R1","R2","J","J","R","R","M","M","RN","A","N","N","R1","R2","R","J","R","RN","RN","M","A","A","N","N","R1","R2","RN","R",null,"Equipe 3                  F","PLC","(CDQ)",{"$f":"AM19","v":"R"},"R","M","M","A","A","N","N","R1","R2","Ar","Ar","R","R","M","M","A","A","N","N","R1","R2","J","J","R","R","M","M",0,null,null,"Equipe 3                  F","PLC","(CDQ)","S","S","S","S",{"$f":"BY19","v":"R1"},"R2","R","R","R","R","RN","M","CA","A","N","N","R1","D","CA","CA","R","R","M","M","A","A","CA","N","R1","R2","CA",null,"Equipe 3                  F","PLC","(CDQ)","Nr",{"$f":"DE19","v":"R"},"R","CA","CA","CA","CA","CA","CA","R1","R2","R","RN","R","R","M","M","A","A","N","N","R1","R2","RN","R","R","R","M","D","RN",null,null,"Equipe 3                  F","PLC","(CDQ)","A","N","N","R1","R2","CA","CA","R","R","M","M","A","A","N","N","R1","R2","RN","RN","R","R","CA","CA","CA","A","N","D","D","R2","R","F",null,"Equipe 3                  F","PLC","(CDQ)","R","R","F","F","F","F","N","N","R1","R2","RN","RN","R","RN","RN","RN","RN","RN","RN","N","R","R","Nr","Nr","R","R","M","M","A","A",null,null,null,null,"·         Equipe 2 : 13 juillet"]
[null,"BEB","(TE)","CA","CA","CA",{"$f":"G19","v":"R1"},{"$f":"H19","v":"R2"},"CA","CA",{"$f":"K19","v":"R"},{"$f":"L19","v":"R"},{"$f":"M19","v":"M"},{"$f":"N19","v":"M"},{"$f":"O19","v":"A"},"RN",{"$f":"Q19","v":"N"},{"$f":"R19","v":"N"},{"$f":"S19","v":"R1"},{"$f":"T19","v":"R2"},"Nr","REX",{"$f":"W19","v":"R"},"R","M","M","A","A","N","N","R1","R2","Nr","R",null,null,"BEB","(TE)",{"$f":"AM19","v":"R"},{"$f":"AN19","v":"R"},"M","M","A","A","N","N","R1","R2","J","J","R","R","M","M",{"$f":"BC19","v":"A"},"A","N","N","R1","R2","J","J","R","R","M","M",0,null,null,null,"BEB","(TE)","S","S","S","S",{"$f":"BY19","v":"R1"},"R2","R","Ar","R","R","M","M","D","A","N","N","R1","R2","Ar","J","R","R","M","M","A","A","N","N","R1","R2","RN",null,null,"BEB","(TE)","Ar","Nr",{"$f":"DF19","v":"R"},"M","M","A","A","CA","N","R1","R2","Ar","Ar",{"$f":"DQ19","v":"R"},"R","M","M","A","A","N","N","R1","R2","J","R","R","R","M","M","D",null,null,null,"BEB","(TE)","A","N","N","R1","R2","J","J","R","R","M","M","A","A","N","N","R1","R2","Nr","Nr","R","R","AJ","M","A","A","N","N","R1","R2","R","Nr",null,null,"BEB","(TE)","R","R","M","M","A","A","N","N","R1","R2","Nr","Nr","R","R","M","M","A","A","N","N","R","R","J","RN","R","R","M","M","A","A",null,null,null,null,"·         Equipe 3 : 17 juillet"]
[null,"FCL","(CDB)",{"$f":"D19","v":"A"},{"$f":"E19","v":"N"},"N","R1","R2","J","J","R","R","M","M","RN","A","N","N","R1","R2","R","J","R","RN","RN","M","A","A","N","N","R1","R2","RN","R",null,null,"FCL","(CDB)",{"$f":"AM19","v":"R"},{"$f":"AN19","v":"R"},"M","M","A","A","N","N","R1","R2","Nr","Nr","R","R","M","M","A","A","N","N","R1","R2","J","J","R","R","M","M",0,null,null,null,"FCL","(CDB)","S","S","S","S",{"$f":"BY19","v":"R1"},"R2","R","R","R","R","RN",{"$f":"CF19","v":"M"},"D",{"$f":"CH19","v":"A"},"N","N","R1","R2","J","Ar",{"$f":"CO19","v":"R"},"R","M","M","A","A","N","N","R1","R2","RN",null,null,"FCL","(CDB)","CA",{"$f":"DE19","v":"R"},{"$f":"DF19","v":"R"},"CA","CA","CA","CA","CA","CA",{"$f":"DM19","v":"R1"},{"$f":"DN19","v":"R2"},"R","CA",{"$f":"DQ19","v":"R"},{"$f":"DR19","v":"R"},"CA","CA","CA","CA","CA","CA",{"$f":"DY19","v":"R1"},{"$f":"DZ19","v":"R2"},"CA",{"$f":"EB21","v":"R"},{"$f":"EC19","v":"R"},{"$f":"ED19","v":"R"},"CA","CA","CA",null,null,null,"FCL","(CDB)","CF","CF","CF","R1","R2","CF","CF","R","R","CF","CF","CF","CF","CF","CF","R1","R2","CA","CA","R","R","AJ","CA","A","A","N","N","R1","R2","R","R",null,null,"FCL","(CDB)","R","R","M","M","A","A","N","N","R1","R2","RN","RN","R","R","M","M","A","A","N","N","R","R","J","RN","R","R","M","M","A","A",null,null,null,null,"·         Equipe 4 : 22 Juillet"]
[null,null,null,null,null,null,null,null,null,null,null,null,null,null,null,null,null,null,null,null,null,null,null,null,null,null,null,null,null,null,null,null,null,null,null,null,null,null,null,null,null,null,null,null,null,null,null,null,null,null,null,null,null,null,null,null,null,null,null,null,null,null,null,null,null,null,null,null,null,null,null,null,null,null,null,null,null,null,null,null,null,null,null,null,null,null,null,null,null,null,null,null,null,null,null,null,null,null,null,null,null,null,null,null,null,"PDO","(CDB)","J","R","R","A","M","A","A","N","N","R1","R2","Mr","Mr","R","R","M","M","A","A","N","N","R1","R2","Mr","Mr","R","R","CA","M","A",null,null,null,"PDO","(CDB)","A","N","N","R1","R2","RC","CA","R","R","M","M","A","A","N","N","R1","R2","RC","J","R","R","M","M","A","A","N","N","D","R2","R","R",null,null,"PDO","(CDB)","R","R","M","M","A","RC","N","N","R1","R2","RC","RC","R","R","CA","M","A","A","N","N","R","R","RC","J","R","R","M","M","A","A",null,null,null,null,"·         Equipe 5 : 20 juillet"]
[null,"MLC","(CIT)",{"$f":"D19","v":"A"},{"$f":"E19","v":"N"},"N","R1","R2","J","J","R","R","M","M","A","A","N","N","R1","R2","R","CA","R","R","CA","CA","CA","CA","CA","CA","R1","R2","CA","R",null,null,"MLC","(CIT)",{"$f":"AM19","v":"R"},{"$f":"AN19","v":"R"},"M","M","A","A","N","N","R1","R2","J","J","R","R","M","M","A","A","N","N","R1","R2","J","J","R","R","M","M",0,null,null,null,"MLC","(CIT)","S","S","S","S",{"$f":"BY19","v":"R1"},"R2","R","R","R","R","M","M","A","A","N","N","R1","R2","CA","CA","R","R","M","M","A","A","CA","CA","R1","R2","S",null,null,"MLC","(CIT)","S",{"$f":"DE19","v":"R"},"R","M",{"$f":"DH19","v":"M"},"A","A","N","N","R1","R2","R","J","R","R","M","M","A","A","N","N","R1","R2","CA","R","R","R","M","M","A",null,null,null,"MLC","(CIT)","A","N","N","R1","R2","CA","CA","R","R","M","M","A","A","N","N","R1","R2","Nr","Nr","R","R","M","M","A","A","N","N","R1","R2","Nr","Nr",null,null,"MLC","(CIT)","R","R","M","M","A","A","N","N","R1","R2","J","J","R","R","M","M","A","A","N","N","R","R","J","J","R","R","M","M","A","A",null,null,null,null,"·         Equipe 6 : 23 Juillet"]
["Equipe 4\nB",{"$f":"+A26","v":"Equipe 4\nB"},null,"R","M","M","A","A","N","N","R1","R2","R","R","R","R","M","M","A","A","N","N","R1","R2","J","J","R","R","M","M","A","A","N","N",null,"Equipe 4\nB",{"$f":"+AJ26","v":"Equipe 4\nB"},null,"R1","R2","J","J","R","R","M","M","A","A","N","N","R1","R2","R","J","R","R","M","M","A","A","N","N","R1","R2","J","R",null,null,null,"Equipe 4\nB",{"$f":"+BR26","v":"Equipe 4\nB"},null,"R","R","M","M","A","A","N","N","R1","R2","J","J","R","R","M","M","A","A","N","N","R1","R2","J","J","R","R","M","M","A","A","N",null,"Equipe 4\nB",{"$f":"+DA26","v":"Equipe 4\nB"},null,"N","R1","R2","R","R","R","R","M","M","A","A","N","N","R1","R2","J","J","R","R","M","M","A","A","N","N","R1","R2",{"$f":"EE25","v":"M"},"J","R",null,null,"Equipe 4\nB",{"$f":"+EJ26","v":"Equipe 4\nB"},null,"R","M","M","A","A","N","N","R1","R2","R","J","R","R","M","M","A","A","N","N","R1","R2","J","R","R","R","M","M","A","A","N","N",null,"Equipe 4\nB",{"$f":"+FS26","v":"Equipe 4\nB"},null,"R1","R2","J","J","R","R","M","M","A","A","N","N","R1","R2","J","J","R","R","M","M","A","A","N","N","R1","R2","R","R","R","R"]
[null,"JMS","(CDQ)",{"$f":"D26","v":"R"},"CA","CA","CA","CA","N","N","R1","R2","Ar","Ar","R","R","M","M","A","A","D","D","R1","R2","J","J","R","R","M","M","A","A","N","N",null,null,"JMS","(CDQ)",{"$f":"AM26","v":"R1"},"R2","J","J","R","R","M","M","A","A","N","N","R1","R2","R","J","R","R","M","M","A","A","CM","CM","CM","CM","CM","R",0,null,null,null,"JMS","(CDQ)",{"$f":"BU26","v":"R"},"R","CM","CM","CM","CM","N","N","R1","R2","CA","CA","R","R","M","M","A","A","N","N","R1","R2","CA","RN","R","R","M","M","A","RN","D",null,null,"JMS","(CDQ)","D",{"$f":"DE26","v":"R1"},"R2","R","R","R","R","M","M","RN","A","N","N","R1","R2","J","J","R",{"$f":"DV26","v":"R"},"M","M","A","A","RN","N","R1","R2","J","J","RN",null,null,null,"JMS","(CDQ)","R","M","M","A","A","N","N","R1","R2","R","J","R","R","M","CA","A","A","RN","N","R1","R2","Mr","Mr","CA","R","CA","CA","CA","CA","CA","CA",null,null,"JMS","(CDQ)","R1","R2","CA","CA","R","R","CA","CA","CA","CA","CA","CA","R1","R2","CA","CA","R","R","CA","CA","CA","CA","CA","CA","R1","R2","Ar","Ar","R","R"]
[null,"KSA","(TE)",{"$f":"D26","v":"R"},{"$f":"E26","v":"M"},"M","A","A","N","N","R1","R2","R","R","R","R","M","M","A","A","N","N","R1","R2","Nr","Nr","R","R","M","A","A","A","RN","N",null,null,"KSA","(TE)",{"$f":"AM26","v":"R1"},{"$f":"AN26","v":"R2"},"J","J","R","R","M","M","A","A","N","N","R1","R2","R","J","R","R","M","M","A","A","N","N","R1","R2","J","R",0,null,null,null,"KSA","(TE)",{"$f":"BU26","v":"R"},{"$f":"BV26","v":"R"},"M","M","A","A","N","N","R1","R2","RN","CA","Ar","R","M","M","A","A","N","N","R1","R2","CA","CA","R","R","M","M","A","A",{"$f":"CY26","v":"N"},null,null,"KSA","(TE)",{"$f":"DD26","v":"N"},"R1","R2","R","R","R","R","M","CM","CM","CM","CM","RN","Mr",{"$f":"DR26","v":"R2"},"J","J","R",{"$f":"DV26","v":"R"},"M","M","A","A","N","N","R1","R2","RCN","RCN",{"$f":"EG26","v":"R"},null,null,null,"KSA","(TE)","R","M","M","A","A","N","N","R1","R2","R","RCN","R","R","CM","M","A","A","REX","RN","R1","R2","RCN","R","R","R","M","M","A","A","N","CA",null,null,"KSA","(TE)","R1","R2","CA","CA","R","R","CA","CA","CA","CA","CA","CA","R1","R2","CA","CA","R","R","CA","CA","CA","CA","N","N","R1","R2","R","R","R","R"]
[null,"BDO","(CDB)",{"$f":"D26","v":"R"},{"$f":"E26","v":"M"},"M","A","A","N","N","R1","R2","Nr","Nr","R","R","M","M","A","A","N","N","R1","R2","J","J","R","R","M","M","A","A","N","N",null,null,"BDO","(CDB)",{"$f":"AM26","v":"R1"},{"$f":"AN26","v":"R2"},"J","J","R","R","CA","CA","CA","CA","CA","CA","R1","R2","R","CA","R","R","M","M","A","A","N","N","R1","R2","J","R",0,null,null,null,"BDO","(CDB)",{"$f":"BU26","v":"R"},"R","S","S","S","A","N","N","R1","R2","Ar","CA",{"$f":"CG26","v":"R"},"R","M","M","A","A","N","N","R1","R2","Ar","RC","R","R","M","M","A","A","N",null,null,"BDO","(CDB)",{"$f":"DD26","v":"N"},{"$f":"DE26","v":"R1"},{"$f":"DF26","v":"R2"},{"$f":"DG27","v":"R"},"R","Nr",{"$f":"DJ26","v":"R"},"REX",{"$f":"DL26","v":"M"},"A","A","N","N","R1","R2","Nr","Nr",{"$f":"DU26","v":"R"},"R","M","M","A","A","N","N","R1","R2","Nr","Nr",{"$f":"EG26","v":"R"},null,null,null,"BDO","(CDB)","R","M","M","A","A","N","N","R1","R2","R","Mr","R","R","M","M","A","A","N","N","R1","R2","CA","R","R","R","M","M","A","A","N","N",null,null,"BDO","(CDB)","R1","R2","RCN","RCN","R","R","M","M","A","A","N","N","R1","R2","Ar","Ar","R","R","M","M","A","A","N","N","R1","R2","R","R","R","R"]
[null,"AMZ","(CIT)",{"$f":"D26","v":"R"},{"$f":"E26","v":"M"},"M","A","A","N","N","R1","R2","Ar","Ar","R","R","M","M","A","A","N","N","R1","R2","Mr","Mr","R","R","M","M","A","A","N","N",null,null,"AMZ","(CIT)",{"$f":"AM26","v":"R1"},{"$f":"AN26","v":"R2"},"J","J","R","R","M","M","A","A","N","N","R1","R2","R","J","R","R","M","M","A","A","N","N","R1","R2","J","R",0,null,null,null,"AMZ","(CIT)",{"$f":"BU26","v":"R"},{"$f":"BV26","v":"R"},"S","S","S","A","N","N","R1","R2","CA","CA","R","R","M","M","A","A","N","N","R1","R2","CA","CA","R","R","M","M","A","A",{"$f":"CY26","v":"N"},null,null,"AMZ","(CIT)",{"$f":"DD26","v":"N"},{"$f":"DE26","v":"R1"},"R2","R","Ar","R","R","M","M","A","A","N","N","R1","R2","J","J","R","R","M","M","A","A","N","N","R1","R2","J","J","R",null,null,null,"AMZ","(CIT)","R","M","M","A","A","N","N","R1","R2","R","CA","R","R","CA","CA","CA","CA","CA","CA","R1","R2","CA","R","R","R","CA","CA","CA","CA","CA","CA",null,null,"AMZ","(CIT)","R1","R2","CA","CA","R","R","M","M","A","A","N","N","R1","R2","J","J","R","R","M","M","A","A","N","N","R1","R2","R","R","R","R"]
["Equipe 5\nA",{"$f":"+A31","v":"Equipe 5\nA"},null,"M","A","A","N","N","R1","R2","J","J","R","R","M","M","A","A","N","N","R1","R2","J","J","R","R","M","M","A","A","N","N","R1","R2",null,"Equipe 5\nA",{"$f":"+AJ31","v":"Equipe 5\nA"},null,"R","J","R","R","M","M","A","A","N","N","R1","R2","J","R","R","R","M","M","A","A","N","N","R1","R2","J","J","R","R",null,null,null,"Equipe 5\nA",{"$f":"+BR31","v":"Equipe 5\nA"},null,"M","M","A","A","N","N","R1","R2","J","J","R","R","M","M","A","A","N","N","R1","R2","R","R","R","R","M","M","A","A","N","N","R1",null,"Equipe 5\nA",{"$f":"+DA31","v":"Equipe 5\nA"},null,"R2","J","J","R","R","M","M","A","A","N","N","R1","R2","J","J","R","R","M","M","A","A","N","N","R1","R2","R","J",{"$f":"EE30","v":"J"},"R","M",null,null,"Equipe 5\nA",{"$f":"+EJ31","v":"Equipe 5\nA"},null,"M","A","A","N","N","R1","R2","J","R","R","R","M","M","A","A","N","N","R1","R2","J","J","R","R","M","M","A","A","N","N","R1","R2",null,"Equipe 5\nA",{"$f":"+FS31","v":"Equipe 5\nA"},null,"J","J","R","R","M","M","A","A","N","N","R1","R2","R","R","R","R","M","M","A","A","N","N","R1","R2","J","J","R","R","M","M"]
[null,"OAN","(CDQ)",{"$f":"D31","v":"M"},"A","A","N","N","R1","R2","J","J","R","R","M","M","A","A","N","N","R1","Ar","J","J","R","R","M","M","A","A","N","N","R1","R2",null,null,"OAN","(CDQ)",{"$f":"AM31","v":"R"},"J","R","R","M","M","A","A","N","N","R1","R2","Nr","Nr","R","R","M","M","A","A","N","N","R1","R2","J","J","R","R",0,null,null,null,"OAN","(CDQ)",{"$f":"BU31","v":"M"},"M","A","A","N","N","R1","R2","CA","CA","Mr","R","M","M","A","A","N","N","R1","R2","R","R","R","R","M","M","A","A","N","N","R1",null,null,"OAN","(CDQ)",{"$f":"DD31","v":"R2"},"RC","RC","Mr","Mr","REX","M","A","A","N","N","R1","R2","Ar","CA","R","R","M","M","A","A","N","N","R1","R2","R","RC","R","R","M",null,null,null,"OAN","(CDQ)","M","A","A","N","N","R1","R2","R","R","R","R","M","M","A","A","N","N","R1","R2","J","J","R","R","M","M","A","A","N","N","R1","R2",null,null,"OAN","(CDQ)","RC","RC","R","R","M","M","A","A","N","N","R1","R2","R","R","R","R","M","M","A","A","N","N","R1","R2","Mr","Mr","R","R","M","M"]
[null,"FFO","(TE)",{"$f":"D31","v":"M"},{"$f":"E31","v":"A"},"A","N","N","R1","R2","J","J","R","R","M","M","A","A","N","N","R1","R2","Ar","Ar","R","R","M","M","A","M","N","REX","RN","R2",null,null,"FFO","(TE)",{"$f":"AM31","v":"R"},{"$f":"AN31","v":"J"},"R","R","M","M","A","A","N","N","R1","R2","J","R","R","R","M","M","A","A","N","N","R1","R2","J","J","R","R",0,null,null,null,"FFO","(TE)",{"$f":"BU31","v":"M"},"M","A","A","N","N","R1","R2","RC","D","Mr",{"$f":"CF31","v":"R"},{"$f":"CG31","v":"M"},{"$f":"CH31","v":"M"},"CA",{"$f":"CJ31","v":"A"},{"$f":"CK31","v":"N"},{"$f":"CL31","v":"N"},{"$f":"CM31","v":"R1"},{"$f":"CN31","v":"R2"},"Nr","Nr",{"$f":"CQ31","v":"R"},"R","M","M","A","A","N","N","R1",null,null,"FFO","(TE)",{"$f":"DD31","v":"R2"},"Nr","Nr",{"$f":"DG31","v":"R"},"R",{"$f":"DI31","v":"M"},"M",{"$f":"DK31","v":"A"},"CA",{"$f":"DM31","v":"N"},{"$f":"DN31","v":"N"},{"$f":"DO31","v":"R1"},"RN","D","D",{"$f":"DS31","v":"R"},"R","M","M","A","A","N","N","R1","R2","R","J","R",{"$f":"EF31","v":"R"},{"$f":"EG31","v":"M"},null,null,null,"FFO","(TE)","D","D","CA","CA","CA","R1","R2","R","R","R","R","M","M","A","A","N","N","R1","RN","RC","RC","R","R","M","M","A","A","N","N","R1","R2",null,null,"FFO","(TE)","J","J","R","R","M","M","A","A","N","REX","RN","R2","R","R","R","R","M","M","A","A","N","N","R1","R2","CA","CA","R","R","CA","CA"]
[null,"GGL ","(CDB)",{"$f":"D31","v":"M"},"A","A","N","N","R1","R2","Ar","Ar","R","R","M","M","A","A","N","N","R1","R2","J","J","R","R","M","M","A","A","N","N","R1","R2",null,null,"GGL ","(CDB)",{"$f":"AM31","v":"R"},{"$f":"AN31","v":"J"},"R","R","M","M","A","A","N","N","R1","R2","J","R","R","R","M","M","A","A","N","N","R1","R2","J","J","R","R",0,null,null,null,"GGL ","(CDB)",{"$f":"BU31","v":"M"},"M","A","A","N","N","R1","R2","CA","CA",{"$f":"CE31","v":"R"},"R","M","M","A","A","N","N","R1","R2",{"$f":"CO32","v":"R"},{"$f":"CP32","v":"R"},{"$f":"CQ31","v":"R"},"R","M","M","A","A","N","N","R1",null,null,"GGL ","(CDB)",{"$f":"DD31","v":"R2"},"Nr","Nr",{"$f":"DG31","v":"R"},{"$f":"DH31","v":"R"},{"$f":"DI31","v":"M"},"M",{"$f":"DK31","v":"A"},{"$f":"DL31","v":"A"},"CM","CM","CM","CM","CM","CM","CM","CM","CM","CM","CM","CM","CM","CM","CM","CM","CM","Ar",{"$f":"EE33","v":"R"},{"$f":"EF31","v":"R"},"RN",null,null,null,"GGL ","(CDB)","M","A","A","N","N","R1","R2","R","R","R","R","M","M","A","A","N","REX","RN","R2","J","J","R","R","M","M","A","A","N","N","R1","R2",null,null,"GGL ","(CDB)","J","J","R","R","M","M","A","A","N","N","R1","RN","R","R","R","R","M","M","A","A","N","N","R1","R2","J","J","R","R","M","M"]
[null,"JRA","(CIT)",{"$f":"D31","v":"M"},{"$f":"E31","v":"A"},"A","N","N","R1","R2","J","J","R","R","M","M","A","A","N","N","R1","R2","J","J","R","R","M","M","A","A","N","N","R1","R2",null,null,"JRA","(CIT)",{"$f":"AM32","v":"R"},{"$f":"AN31","v":"J"},"R","R","M","M","A","A","N","N","R1","R2","CA","R","R","R","CA","CA","CA","CA","CA","CA","R1","R2","CA","CA","R","R",0,null,null,null,"JRA","(CIT)",{"$f":"BU31","v":"M"},{"$f":"BV31","v":"M"},"A","A","N","N","R1","R2","CA","CA","R","R","M","CA","A","A","N","N","R1","R2","Mr","R","R","R","M","M","A","A","N","N","R1",null,null,"JRA","(CIT)",{"$f":"DD31","v":"R2"},"Nr","Nr",{"$f":"DG31","v":"R"},"R","M","M","A","CM","CM","N","R1","R2","Ar","CA","R","R","M","M","A","A","N","N","R1","R2","R","J","R",{"$f":"EF31","v":"R"},{"$f":"EG31","v":"M"},null,null,null,"JRA","(CIT)","M","A","A","N","N","R1","R2","R","R","R","R","M","M","A","A","N","N","R1","R2","J","J","R","R","M","M","A","A","N","N","R1","R2",null,null,"JRA","(CIT)","J","J","R","R","M","M","A","A","N","N","R1","R2","R","R","R","R","CA","CA","CA","CA","CA","CA","R1","R2","CA","CA","R","R","CA","CA"]
[null,"GPA","(F)",{"$f":"D31","v":"M"},{"$f":"E31","v":"A"},"A","N","N","R1","R2","J","J","R","R","M","CA","A","CA","CA","CA","R1","R2","CA","CA","R","R","M","M","A","A","N","N","R1","R2",null,null,"GPA","(F)",{"$f":"AM31","v":"R"},{"$f":"AN31","v":"J"},"R","R","M","M","A","A","N","N","R1","R2","J","R","R","R","M","M","A","A","N","N","R1","R2","J","J","R","R",0,null,null,null,"GPA","(F)",{"$f":"BU31","v":"M"},{"$f":"BV31","v":"M"},"A","A","N","N","R1","R2","CA","CA","R","R","M","M","A","A","N","N","R1","R2","R","R","R","R","M","M","A","A","N","N","R1",null,null,"GPA","(F)",{"$f":"DD31","v":"R2"},"RC","RC",{"$f":"DG31","v":"R"},"R","M","M","A","A","N","N","R1","R2","RC","RC","R","R","CA","M","A","A","N","N","R1","R2","R","J","R","R","M"]
["Equipe 6\nC",{"$f":"+A37","v":"Equipe 6\nC"},null,"R","R","R","M","M","A","A","N","N","R1","R2","J","J","R","R","M","M","A","A","N","N","R1","R2","R","R","R","R","M","M","A","A",null,"Equipe 6\nC",{"$f":"+AJ37","v":"Equipe 6\nC"},null,"N","N","R1","R2","J","J","R","R","M","M","A","A","N","N","R1","R2","J","J","R","R","M","M","A","A","N","N","R1","R2",null,null,null,"Equipe 6\nC",{"$f":"+BR37","v":"Equipe 6\nC"},null,"R","J","R","R","M","M","A","A","N","N","R1","R2","J","R","R","R","M","M","A","A","N","N","R1","R2","J","J","R","R","M","M","A",null,"Equipe 6\nC",{"$f":"+DA37","v":"Equipe 6\nC"},null,"A","N","N","R1","R2","J","J","R","R","M","M","A","A","N","N","R1","R2","R","R","R","R","M","M","A","A","N","N",{"$f":"EE36","v":"R"},"R2","J",null,null,"Equipe 6\nC",{"$f":"+EJ37","v":"Equipe 6\nC"},null,"J","R","R","M","M","A","A","N","N","R1","R2","J","J","R","R","M","M","A","A","N","N","R1","R2","R","J","R","R","M","M","A","A",null,"Equipe 6\nC",{"$f":"+FS37","v":"Equipe 6\nC"},null,"N","N","R1","R2","J","R","R","R","M","M","A","A","N","N","R1","R2","J","J","R","R","M","M","A","A","N","N","R1","R2","J","J"]
[null,"FFL","(CDQ)",{"$f":"D37","v":"R"},"R","R","M","M","A","A","N","N","R1","R2","Nr","Nr","R","R","M","M","A","A","N",{"$f":"X37","v":"N"},"R1","R2","R","R","R","R","M","M","A","A",null,null,"FFL","(CDQ)",{"$f":"AM37","v":"N"},"N","R1","R2","J","J","R","R","M","M","CA","CA","CA","CA","R1","R2","RC","R","R","R","CA","CA","A","A","N","N","R1","R2",0,null,null,null,"FFL","(CDQ)",{"$f":"BU37","v":"R"},"S","R","R","M","M","A","CA","N","N","R1","R2","D","R","R","R","M","M","A","A","N","N","R1","R2","CA","CA","R","R","M","M","A",null,null,"FFL","(CDQ)","M","RCN","A",{"$f":"DG37","v":"R1"},"Ar","Ar","Ar",{"$f":"DK37","v":"R"},{"$f":"DL37","v":"R"},"D",{"$f":"DN37","v":"M"},"A","D","N","N","R1","R2","R","R","R","R","M","M","RN","A","N","N","R1",{"$f":"EF37","v":"R2"},"RN",null,null,null,"FFL","(CDQ)","R","R","R","D","D","A","D","N","N","R1","R2","RCH","J","R","R","M","M","RN","A","N","N","R1","R2","R","R","R","R","M","M","A","A",null,null,"FFL","(CDQ)","N","N","R1","R2","Ar","Ar","R","R","M","M","A","RN","N","N","R1","R2","Ar","Ar","R","R","A","M","A","A","N","N","R1","R2","Nr","Nr"]
[null,"PDE","(TE)","Ar",{"$f":"E37","v":"R"},"R","M","M","A","A","N","N","R1","R2","J","Ar","Nr","R","REX","RC","A","A","N","N","R1","R2","R","R","R","R","M","M","A","A",null,null,"PDE","(TE)",{"$f":"AM37","v":"N"},{"$f":"AN37","v":"N"},"R1","R2","J","J","R","R","M","M","A","A","N","N","R1","R2","J","R","R","R","M","M","A","A","N","N","R1","R2",0,null,null,null,"PDE","(TE)",{"$f":"BU37","v":"R"},"S",{"$f":"BW37","v":"R"},"R","M","M","A","A","N","N","R1",{"$f":"CF37","v":"R2"},"Nr","R","R","R","M","M","A","A","N","N","R1","R2","RC","RC","R","R","CA","CA","CA",null,null,"PDE","(TE)","CA","CA","CA",{"$f":"DG37","v":"R1"},"R2","R","CA","R","R","CA","CA","CA","CA","N","N","R1","R2","Nr","Nr","R","R","M","M","A","A","N","N","R1","R2","J",null,null,null,"PDE","(TE)","R","R","R","M","M","A","A","N","N","R1","R2","J","J","R","R","M","M","A","A","N","N","R1","R2","R","R","R","R","M","M","A","A",null,null,"PDE","(TE)","N","N","R1","R2","J","R","R","R","M","M","A","M","N","N","R1","R2","RC","RC","R","R","M","M","A","A","N","N","R1","R2","Mr","Mr"]
[null,"GBA","(CDB)",{"$f":"D37","v":"R"},"R","R","M","M","A","A","N","N","R1","R2","J","J","R","CM","CM","CM","CM","CM","CM","CM","CM","CM","CM","CM","CM","CM","CM","CM","CM","CM",null,null,"GBA","(CDB)","CM","CM","CM","CM","CM","CM","CM","CM","CM","CM","CM","CM","CM","CM","CM","CM","CM","CM","CM","CM","CM","CM","CM","CM","CM","CM","CM","CM",{"$f":"BO37","v":0},null,null,null,"GBA","(CDB)","CM","CM","CM","CM","CM","CM","CM","CM","CM","CM","CM","CM","CM","CM","CM","CM","CM","CM","CM","CM","CM","CM","CM","CM","CM","CM","CM","CM","CM","CM","CM",null,null,"GBA","(CDB)","CA","CA","CA","R1","R2","R","CA","R","R","CA","CA","CA","CA","CA","CA","R1","R2","R","R","R","R","CA","CA","CA","CA","CA","CA","R1","R2","CA",null,null,null,"GBA","(CDB)","R","R","R","CA","CA","CA","CA","CA","CA","R1","R2","CA","CA","R","R","CA","CA","CA","CA","CA","CA","R1","R2","R","CA","R","R","CA","CA","CA","CA",null,null,"GBA","(CDB)","CA","CA","R1","R2","CA","R","R","R","CA","CA","CA","CA","CA","CA","R1","R2","CA","CA","R","R","CA","CA","CA","CA","CA","CA","R1","R2","CA","CA"]
[null,"JLE","(CDB)",{"$f":"D37","v":"R"},{"$f":"E37","v":"R"},"R","M","M","A","A","N","N","R1","R2","Ar","Ar","R","R","M","M","A","A","N","N","R1","R2","R","R","R","R","M","M","A","A",null,null,"JLE","(CDB)",{"$f":"AM37","v":"N"},{"$f":"AN37","v":"N"},"R1","R2","J","J","R","R","M","M","A","A","N","N","R1","R2","J","R","R","R","M","M","A","A","N","N","R1","R2",0,null,null,null,"JLE","(CDB)",{"$f":"BU37","v":"R"},"S",{"$f":"BW37","v":"R"},"R","M","M","A","A","N","N","R1","R2","CM","CM","CM","CM","CM","CM","CM","CM","CM","CM","CM","CM","CM","CM","CM","CM","CM","CM","CM",null,null,"JLE","(CDB)","CM","CM","CM",{"$f":"DG37","v":"R1"},"R2","R","CA","R","R","CA","CA","CA","A","N","N","R1","R2","R","R","R","R","M","M","A","A","N","N","R1","R2","Nr",null,null,null,"JLE","(CDB)","R","R","R","M","M","A","A","N","N","R1","R2","J","J","R","R","M","M","A","A","N","N","R1","R2","R","R","R","R","M","M","A","A",null,null,"JLE","(CDB)","N","N","R1","R2","J","R","R","R","M","M","A","A","N","N","R1","R2","Nr","Nr","R","R","CA","M","A","A","N","N","R1","R2","J","J"]
[null,"GGB","(CIT)",{"$f":"D37","v":"R"},{"$f":"E37","v":"R"},"R","M","M","A","A","N","N","R1","R2","J","J","R","R","M","M","A","A","N","N","R1","R2","Ar","Ar","R","R","M","M","A","A",null,null,"GGB","(CIT)",{"$f":"AM37","v":"N"},{"$f":"AN37","v":"N"},"R1","R2","J","J","R","R","M","M","A","A","N","N","R1","R2","Mr","Mr","R","R","M","M","A","A","N","N","R1","R2",0,null,null,null,"GGB","(CIT)",{"$f":"BU37","v":"R"},"S",{"$f":"BW37","v":"R"},"R","M","M","A","A","N","N","R1","R2","RC","Mr","R","R","M","M","A","A","N","N","R1","R2","CA","CA","R","R","M","M","M",null,null,"GGB","(CIT)","CA","CA","CA",{"$f":"DG37","v":"R1"},"R2","R","CA","R","R","M","M","A","A","N","N","R1","R2","R","R","R","R","M","M","A","A","N","N","R1","R2","J",null,null,null,"GGB","(CIT)","R","R","R","M","M","A","A","N","N","R1","R2","J","J","R","R","M","M","A","A","N","N","R1","R2","R","R","R","R","M","A","A","A",null,null,"GGB","(CIT)","N","N","R1","R2","J","R","R","R","M","M","A","A","N","N","R1","R2","Mr","Mr","R","R","M","M","A","A","N","N","R1","R2","Mr","Mr"]

{"sheet":"2EME SEMESTRE 2015","index":3,"n_rows":41,"n_cols":209,"rows_kept":41,"cut":false,"hidden":false,"merged":[[35,175,40,175],[14,175,19,175],[8,175,12,175],[20,175,24,175],[7,35,12,35],[25,105,29,105],[35,105,40,105],[7,105,12,105],[25,140,29,140],[35,140,40,140],[7,140,12,140],[14,140,19,140],[20,140,24,140],[1,108,1,123],[1,124,1,138],[31,140,34,140],[35,0,40,0],[35,70,40,70],[25,35,29,35],[25,70,29,70],[35,35,40,35],[31,0,34,0],[31,35,34,35],[31,70,34,70],[7,0,12,0],[7,70,12,70],[1,194,1,208],[1,3,1,18],[1,19,1,33],[1,38,1,53],[1,54,1,67],[1,73,1,88],[1,143,1,158],[1,178,1,193],[1,159,1,172],[1,89,1,102],[31,175,34,175],[14,0,19,0],[20,0,24,0],[14,35,19,35],[20,35,24,35],[20,70,24,70],[20,105,24,105],[14,105,19,105],[14,70,19,70],[25,0,29,0],[31,105,34,105],[25,175,29,175]]}
[null,null,null,null,null,null,null,null,null,null,null,null,null,null,null,null,null,null,null,null,null,null,null,null,null,null,null,null,null,null,null,null,null,null,"2015-08-31"]
[null,null,null,"MOIS DE",null,null,null,null,null,null,null,null,null,null,null,null,null,null,null,{"$f":"DATE(données!$B$3,7,1)","v":"2015-07-01"},null,null,null,null,null,null,null,null,null,null,null,null,null,null,null,null,null,null,"MOIS DE",null,null,null,null,null,null,null,null,null,null,null,null,null,null,null,{"$f":"DATE(données!$B$3,8,1)","v":"2015-08-01"},null,null,null,null,null,null,null,null,null,null,null,null,null,null,null,null,null,null,"MOIS DE",null,null,null,null,null,null,null,null,null,null,null,null,null,null,null,{"$f":"DATE(données!$B$3,9,1)","v":"2015-09-01"},null,null,null,null,null,null,null,null,null,null,null,null,null,null,null,null,null,null,"MOIS DE",null,null,null,null,null,null,null,null,null,null,null,null,null,null,null,{"$f":"DATE(données!$B$3,10,1)","v":"2015-10-01"},null,null,null,null,null,null,null,null,null,null,null,null,null,null,null,null,null,null,"MOIS DE",null,null,null,null,null,null,null,null,null,null,null,null,null,null,null,{"$f":"DATE(données!$B$3,11,1)","v":"2015-11-01"},null,null,null,null,null,null,null,null,null,null,null,null,null,null,null,null,null,null,"MOIS DE",null,null,null,null,null,null,null,null,null,null,null,null,null,null,null,{"$f":"DATE(données!$B$3,12,1)","v":"2015-12-01"}]
[]
[null,null,"Personnel continu",null,null,null,null,null,null,null,null,null,null,null,null,null,null,null,null,null,null,null,null,"Mise à jour le :",null,null,null,null,null,null,null,null,null,null,null,null,null,"Personnel continu",null,null,null,null,null,null,null,null,null,null,null,null,null,null,null,null,null,null,null,null,"Mise à jour le :",null,null,null,null,null,null,null,null,null,null,null,null,null,"Personnel continu",null,null,null,null,null,null,null,null,null,null,null,null,null,null,null,null,null,null,null,null,"Mise à jour le :",null,null,null,null,null,null,null,null,null,null,null,null,null,"Personnel continu",null,null,null,null,null,null,null,null,null,null,null,null,null,null,null,null,null,null,null,null,"Mise à jour le :",null,null,null,null,null,null,null,null,null,null,null,null,null,"Personnel continu",null,null,null,null,null,null,null,null,null,null,null,null,null,null,null,null,null,null,null,null,"Mise à jour le :",null,null,null,null,null,null,null,null,null,null,null,null,null,"Personnel continu",null,null,null,null,null,null,null,null,null,null,null,null,null,null,null,null,null,null,null,null,"Mise à jour le :"]
[null,null,null,null,null,null,null,null,null,null,null,null,null,null,null,null,null,"F",null,"RN",null,null,null,null,null,"RN",null,null,null,null,null,null,"RN",null,null,null,null,null,null,null,null,null,null,null,null,null,null,"RN","RN",null,null,null,null,null,null,null,null,null,null,null,null,null,null,null,null,null,null,null,null,null,null,null,null,null,null,null,null,null,null,null,"RN",null,null,null,null,null,null,"RN",null,null,null,null,null,null,null,null,null,null,null,null,"RN",null,null,null,null,null,null,null,null,null,null,null,null,null,null,null,null,"F",null,null,null,null,"RN",null,null,null,null,null,null,null,null,null,null,null,null,null,null,null,null,null,null,null,null,null,null,null,null,null,null,null,null,null,null,null,null,null,null,null,null,null,"RN","RN","RN",null,null,null,null,null,null,null,null,null,null,null,null,null,null,null,null,null,null,null,null,null,null,"RN","RN",null,null,null,null,null,null,null,null,null,null,null,null,"RN"]
[null,null,"JOUR",{"$f":"$T$2","v":"2015-07-01"},{"$f":"D6+1","v":"2015-07-02"},{"$f":"E6+1","v":"2015-07-03"},"2015-07-04","2015-07-05","2015-07-06","2015-07-07","2015-07-08","2015-07-09","2015-07-10","2015-07-11","2015-07-12","2015-07-13","2015-07-14","2015-07-15","2015-07-16","2015-07-17","2015-07-18","2015-07-19","2015-07-20","2015-07-21","2015-07-22","2015-07-23","2015-07-24","2015-07-25","2015-07-26","2015-07-27","2015-07-28","2015-07-29","2015-07-30","2015-07-31",null,null,null,"JOUR",{"$f":"$BC$2","v":"2015-08-01"},{"$f":"AM6+1","v":"2015-08-02"},{"$f":"AN6+1","v":"2015-08-03"},"2015-08-04","2015-08-05","2015-08-06","2015-08-07","2015-08-08","2015-08-09","2015-08-10","2015-08-11","2015-08-12","2015-08-13","2015-08-14","2015-08-15","2015-08-16","2015-08-17","2015-08-18",{"$f":"BD6+1","v":"2015-08-19"},"2015-08-20","2015-08-21","2015-08-22","2015-08-23","2015-08-24","2015-08-25","2015-08-26","2015-08-27","2015-08-28",{"$f":"BN6+1","v":"2015-08-29"},"2015-08-30","2015-08-31",null,null,null,"JOUR",{"$f":"$CL$2","v":"2015-09-01"},{"$f":"BV6+1","v":"2015-09-02"},{"$f":"BW6+1","v":"2015-09-03"},"2015-09-04","2015-09-05","2015-09-06","2015-09-07","2015-09-08","2015-09-09","2015-09-10","2015-09-11","2015-09-12","2015-09-13",{"$f":"CH6+1","v":"2015-09-14"},"2015-09-15","2015-09-16","2015-09-17","2015-09-18",{"$f":"CM6+1","v":"2015-09-19"},"2015-09-20","2015-09-21","2015-09-22","2015-09-23","2015-09-24","2015-09-25","2015-09-26","2015-09-27",{"$f":"CV6+1","v":"2015-09-28"},{"$f":"CW6+1","v":"2015-09-29"},"2015-09-30",null,null,null,null,"JOUR",{"$f":"$DU$2","v":"2015-10-01"},{"$f":"DE6+1","v":"2015-10-02"},{"$f":"DF6+1","v":"2015-10-03"},"2015-10-04","2015-10-05","2015-10-06","2015-10-07","2015-10-08","2015-10-09","2015-10-10","2015-10-11","2015-10-12","2015-10-13","2015-10-14","2015-10-15","2015-10-16","2015-10-17","2015-10-18",{"$f":"DV6+1","v":"2015-10-19"},"2015-10-20","2015-10-21","2015-10-22","2015-10-23","2015-10-24","2015-10-25","2015-10-26","2015-10-27","2015-10-28","2015-10-29","2015-10-30","2015-10-31",null,null,null,"JOUR",{"$f":"$FD$2","v":"2015-11-01"},{"$f":"EN6+1","v":"2015-11-02"},{"$f":"EO6+1","v":"2015-11-03"},"2015-11-04","2015-11-05","2015-11-06","2015-11-07","2015-11-08","2015-11-09","2015-11-10","2015-11-11","2015-11-12","2015-11-13","2015-11-14","2015-11-15","2015-11-16","2015-11-17","2015-11-18",{"$f":"FE6+1","v":"2015-11-19"},"2015-11-20","2015-11-21","2015-11-22","2015-11-23","2015-11-24","2015-11-25","2015-11-26","2015-11-27","2015-11-28","2015-11-29","2015-11-30",null,null,null,null,"JOUR",{"$f":"$GM$2","v":"2015-12-01"},{"$f":"FW6+1","v":"2015-12-02"},{"$f":"FX6+1","v":"2015-12-03"},"2015-12-04","2015-12-05","2015-12-06","2015-12-07","2015-12-08","2015-12-09","2015-12-10","2015-12-11","2015-12-12","2015-12-13","2015-12-14","2015-12-15","2015-12-16","2015-12-17","2015-12-18",{"$f":"GN6+1","v":"2015-12-19"},"2015-12-20","2015-12-21","2015-12-22","2015-12-23","2015-12-24","2015-12-25","2015-12-26","2015-12-27","2015-12-28","2015-12-29","2015-12-30","2015-12-31"]
[null,"TRIG","DATE",{"$f":"$T$2","v":"2015-07-01"},{"$f":"D7+1","v":"2015-07-02"},"2015-07-03","2015-07-04","2015-07-05","2015-07-06","2015-07-07","2015-07-08","2015-07-09","2015-07-10","2015-07-11","2015-07-12","2015-07-13","2015-07-14","2015-07-15","2015-07-16","2015-07-17","2015-07-18","2015-07-19","2015-07-20","2015-07-21","2015-07-22","2015-07-23","2015-07-24","2015-07-25","2015-07-26","2015-07-27","2015-07-28","2015-07-29","2015-07-30","2015-07-31",null,null,"TRIG","DATE",{"$f":"$BC$2","v":"2015-08-01"},{"$f":"AM7+1","v":"2015-08-02"},"2015-08-03","2015-08-04","2015-08-05","2015-08-06","2015-08-07","2015-08-08","2015-08-09","2015-08-10","2015-08-11","2015-08-12","2015-08-13",{"$f":"AY7+1","v":"2015-08-14"},"2015-08-15","2015-08-16","2015-08-17","2015-08-18","2015-08-19","2015-08-20","2015-08-21","2015-08-22","2015-08-23","2015-08-24","2015-08-25","2015-08-26","2015-08-27","2015-08-28","2015-08-29","2015-08-30","2015-08-31",null,null,"TRIG","DATE",{"$f":"$CL$2","v":"2015-09-01"},{"$f":"BV7+1","v":"2015-09-02"},"2015-09-03","2015-09-04","2015-09-05","2015-09-06","2015-09-07","2015-09-08","2015-09-09","2015-09-10","2015-09-11","2015-09-12","2015-09-13","2015-09-14","2015-09-15","2015-09-16","2015-09-17","2015-09-18","2015-09-19","2015-09-20","2015-09-21","2015-09-22","2015-09-23","2015-09-24","2015-09-25","2015-09-26","2015-09-27","2015-09-28","2015-09-29","2015-09-30",null,null,null,"TRIG","DATE",{"$f":"$DU$2","v":"2015-10-01"},{"$f":"DE7+1","v":"2015-10-02"},"2015-10-03","2015-10-04","2015-10-05","2015-10-06","2015-10-07","2015-10-08","2015-10-09","2015-10-10","2015-10-11","2015-10-12","2015-10-13","2015-10-14","2015-10-15","2015-10-16","2015-10-17","2015-10-18","2015-10-19","2015-10-20","2015-10-21","2015-10-22","2015-10-23","2015-10-24","2015-10-25","2015-10-26","2015-10-27","2015-10-28","2015-10-29","2015-10-30","2015-10-31",null,null,"TRIG","DATE",{"$f":"$FD$2","v":"2015-11-01"},{"$f":"EN7+1","v":"2015-11-02"},"2015-11-03","2015-11-04","2015-11-05","2015-11-06","2015-11-07","2015-11-08","2015-11-09","2015-11-10","2015-11-11","2015-11-12","2015-11-13","2015-11-14","2015-11-15","2015-11-16","2015-11-17","2015-11-18","2015-11-19","2015-11-20","2015-11-21","2015-11-22","2015-11-23","2015-11-24","2015-11-25","2015-11-26","2015-11-27","2015-11-28","2015-11-29","2015-11-30",null,null,null,"TRIG","DATE",{"$f":"$GM$2","v":"2015-12-01"},{"$f":"FW7+1","v":"2015-12-02"},"2015-12-03","2015-12-04","2015-12-05","2015-12-06","2015-12-07","2015-12-08","2015-12-09","2015-12-10","2015-12-11","2015-12-12","2015-12-13","2015-12-14","2015-12-15","2015-12-16","2015-12-17","2015-12-18","2015-12-19","2015-12-20","2015-12-21","2015-12-22","2015-12-23","2015-12-24","2015-12-25","2015-12-26","2015-12-27","2015-12-28","2015-12-29","2015-12-30","2015-12-31"]
["Equipe 1\nE",{"$f":"+A8","v":"Equipe 1\nE"},null,"R1","R2","J","R","R","R","M","M","A","A","N","N","R1","R2","J","J","R","R","M","M","A","A","N","N","R1","R2","J","J","R","R","M",null,"Equipe 1\nE",{"$f":"+AJ8","v":"Equipe 1\nE"},null,"M","A","A","N","N","R1","R2","R","R","R","R","M","M","A","A","N","N","R1","R2","J","J","R","R","M","M","A","A","N","N","R1",null,null,"Equipe 1\nE",{"$f":"+BS8","v":"Equipe 1\nE"},null,"J","J","R","R","M","M","A","A","N","N","R1","R2","R","J","R","R","M","M","A","A","N","N","R1","R2","J","R","R","R","M","M",null,null,"Equipe 1\nE",{"$f":"+DB8","v":"Equipe 1\nE"},null,"A","A","N","N","R1","R2","J","J","R","R","M","M","A","A","N","N","R1","R2","J","J","R","R","M","M","A","A","N","N","R1","R2","R",null,"Equipe 1\nE",{"$f":"+EK8","v":"Equipe 1\nE"},null,"R","R","R","M","M","A","A","N","N","R1","R2","J","J","R","R","M","M","A","A","N","N","R1","R2","J","J","R","R","M","M","A",null,null,"Equipe 1\nE",{"$f":"+FT8","v":"Equipe 1\nE"},null,"A","N","N","R1","R2","R","J","R","R","M","M","A","A","N","N","R1","R2","J","R","R","R","M","M","A","A","N","N","R1","R2","J","J"]
[null,"SMT","(CDQ)",{"$f":"D8","v":"R1"},"R2","J","R","R","R","M","M","A","A","N","N","R1","R2","F","J","R","R","M","M","A","A","N","N","R1","R2","J","J","R","R","CA",null,null,"SMT","(CDQ)","CA","CA","CA","CA","CA",{"$f":"AR8","v":"R1"},"R2","R","R","R","R","M","M","A","A","N","N","R1","R2","J","J","R","R","M","M","A","A","N","N","R1","R2",null,null,"SMT","(CDQ)",{"$f":"BV8","v":"J"},"J","R","R","M","M","A","A","N","N","R1","R2","R","J","R","R","M","M","A","A","N","N","R1","R2","J","R","R","R","M","M",null,null,null,"SMT","(CDQ)",{"$f":"DE8","v":"A"},"A","N","N","R1","R2","J","J","R","R","M","M","A","A","N","N","R1","R2","J","J","R","R","M","M","A","A","N","N","R1","R2","R",null,null,"SMT","(CDQ)",{"$f":"EN8","v":"R"},"R","R","M","M","A","A","N","N","R1","R2","J","J","R","R","M","M","A","A","N","N","R1","R2","J","J","R","R","M","M","A",null,null,"Equipe 1\nE","SMT","(CDQ)",{"$f":"FW8","v":"A"},"N","N","R1","R2","R","J","R","R","M","M","A","A","N","N","R1","R2","J","R","R","R","M","M","A","A","N","N","R1","R2","Mr","Mr"]
[null,"DNA","(TE)",{"$f":"D8","v":"R1"},{"$f":"E8","v":"R2"},"Nr","R","R","R","M","M","A","A","N","N","R1","R2","F","RC","R","R","M","M","A","A","N","N","R1","R2","CA","CA","R","R","CA",null,null,"DNA","(TE)","CA","CA","CA","CA","CA",{"$f":"AR8","v":"R1"},"R2","R","R","R","R","CA","CA","CA","CA","CA","CA","R1","R2","CA","CA","R","R","M","M","A","A","N","N","R1","R2",null,null,"DNA","(TE)",{"$f":"BV8","v":"J"},{"$f":"BW8","v":"J"},"R","R","M","M","A","A","N","N","R1","R2","R","J","R","R","M","M","A","A","N","N","R1","R2","J","R","R","R","M","M",null,null,null,"DNA","(TE)",{"$f":"DE8","v":"A"},{"$f":"DF8","v":"A"},"N","N","R1","R2","J","J","R","R","M","M","A","A","N","N","R1","R2","J","J","R","R","M","M","A","A","N","N","R1","R2","R",null,null,"DNA","(TE)",{"$f":"EN8","v":"R"},{"$f":"EO8","v":"R"},"R","M","M","A","A","N","N","R1","R2","J","J","R","R","M","M","A","A","N","N","R1","R2","J","J","R","R","M","M","A",null,null,null,"DNA","(TE)",{"$f":"FW8","v":"A"},{"$f":"FX8","v":"N"},"N","R1","R2","R","J","R","R","M","M","A","A","N","N","R1","R2","J","R","R","R","M","M","A","A","N","N","R1","R2","J","J"]
[null,"MRU","(CDB)",{"$f":"D8","v":"R1"},{"$f":"E8","v":"R2"},"Ar","Ar",{"$f":"H8","v":"R"},"R","M","M","A","A","N","N","R1","R2","F","J","R","R","M","M","A","A","N","N","R1","R2","Mr","Mr","R","R","M",null,null,"MRU","(CDB)",{"$f":"AM8","v":"M"},{"$f":"AN8","v":"A"},"A","N","N","R1","R2","R","R","R","R","CA","CA","CA","CA","CA","CA","R1","R2","CA","CA","R","R","CA","CA","CA","CA","CA","CA","R1","R2",null,null,"MRU","(CDB)","Ar","Ar",{"$f":"BX8","v":"R"},"R","M","M","A","A","CA","CA","R1","R2","R","CA","R","R","CA","CA","CA","CA","CA","CA","R1","R2","J","R","R","R","M","M",null,null,null,"MRU","(CDB)",{"$f":"DE8","v":"A"},{"$f":"DF8","v":"A"},"N","N","R1","R2","J","J","R","R","M","M","A","A","N","N","R1","R2","J","J","R","R","M","M","A","A","N","N","R1","R2","R",null,null,"MRU","(CDB)",{"$f":"EN8","v":"R"},{"$f":"EO8","v":"R"},"R","M","M","A","A","N","N","R1","R2","J","J","R","R","M","M","A","A","N","N","R1","R2","J","J","R","R","M","M","A",null,null,null,"MRU","(CDB)",{"$f":"FW8","v":"A"},{"$f":"FX8","v":"N"},"N","R1","R2","R","J","R","R","M","M","A","A","N","N","R1","R2","J","R","R","R","M","M","A","A","N","N","R1","R2","J","J"]
[null,"DLO","(CIT)",{"$f":"D8","v":"R1"},{"$f":"E8","v":"R2"},"Nr","Nr","wwxw<wwwww<w<w<w<","R","M","M","A","A","N","N","R1","R2","CA","CA","R","R","M","M","A","A","N","N","R1","R2","J","J","R","R","M",null,null,"DLO","(CIT)",{"$f":"AM8","v":"M"},{"$f":"AN8","v":"A"},"A","N","N","R1","R2","R","R","R","R","M","M","A","A","N","N","R1","R2","J","J","R","R","M","M","A","A","N","N","R1","R2",null,null,"DLO","(CIT)",{"$f":"BV8","v":"J"},{"$f":"BW8","v":"J"},"R","R","M","M","A","A","N","N","R1","R2","R","J","R","R","M","M","A","A","N","N","R1","R2","J","R","R","R","M","M",null,null,null,"DLO","(CIT)",{"$f":"DE8","v":"A"},{"$f":"DF8","v":"A"},"N","N","R1","R2","J","J","R","R","M","M","A","A","N","N","R1","R2","J","J","R","R","M","M","A","A","N","N","R1","R2","R",null,null,"DLO","(CIT)",{"$f":"EN8","v":"R"},{"$f":"EO8","v":"R"},"R","M","M","A","A","N","N","R1","R2","J","J","R","R","M","M","CA","CA","CA","CA","R1","R2","CA","CA","R","R","M","M","A",null,null,null,"DLO","(CIT)",{"$f":"FW8","v":"A"},{"$f":"FX8","v":"N"},"N","R1","R2","R","J","R","R","M","M","A","A","N","N","R1","R2","J","R","R","R","M","M","A","A","N","N","R1","R2","J","J"]
[]
["Equipe 2\nD",{"$f":"+A14","v":"Equipe 2\nD"},null,"J","J","R","R","M","M","A","A","N","N","R1","R2","J","J","R","R","M","M","A","A","N","N","R1","R2","R","R","R","R","M","M","A",null,"Equipe 2\nD",{"$f":"+AJ14","v":"Equipe 2\nD"},null,"A","N","N","R1","R2","J","J","R","R","M","M","A","A","N","N","R1","R2","J","J","R","R","M","M","A","A","N","N","R1","R2","R",null,null,"Equipe 2\nD",{"$f":"+BS14","v":"Equipe 2\nD"},null,"R","R","M","M","A","A","N","N","R1","R2","J","R","R","R","M","M","A","A","N","N","R1","R2","J","J","R","R","M","M","A","A",null,null,"Equipe 2\nD",{"$f":"+DB14","v":"Equipe 2\nD"},null,"N","N","R1","R2","J","J","R","R","M","M","A","A","N","N","R1","R2","R","R","R","R","M","M","A","A","N","N","R1","R2","J","J","R",null,"Equipe 2\nD",{"$f":"+EK14","v":"Equipe 2\nD"},null,"R","M","M","A","A","N","N","R1","R2","J","J","R","R","M","M","A","A","N","N","R1","R2","R","J","R","R","M","M","A","A","N",null,null,"Equipe 2\nD",{"$f":"+FT14","v":"Equipe 2\nD"},null,"N","R1","R2","J","R","R","R","M","M","A","A","N","N","R1","R2","J","J","R","R","M","M","A","A","N","N","R1","R2","J","J","R","R"]
["Equipe 2\nF","PVA","(CDQ)",{"$f":"D14","v":"J"},{"$f":"E14","v":"J"},"R","R","M","M","A","A","N","N","R1","R2","F","J","R","R","M","M","A","A","N","N","R1","R2","R","R","R","R","M","M","A",null,"Equipe 2\nF","PVA","(CDQ)",{"$f":"AM14","v":"A"},{"$f":"AN14","v":"N"},"N","R1","R2","J","J","R","R","M","M","A","A","N","N","R1","R2","CA","CA","R","R","CA","CA","CA","CA","CA","CA","R1","R2","R","R",null,"Equipe 3\nF","PVA","(CDQ)",{"$f":"BV14","v":"R"},{"$f":"BW14","v":"R"},"CA","CA","CA","CA","CA","CA","R1","R2","CA","R","R","R","M","M","A","A","N","N","R1","R2","J","J","R","R","M","M","A","A",null,null,"Equipe 2\nF","PVA","(CDQ)",{"$f":"DE14","v":"N"},{"$f":"DF14","v":"N"},"R1","R2","J","J","R","R","M","M","A","A","N","N","R1","R2","R","R","R","R","M","M","A","A","N","N","R1","R2","J","J","R",null,"Equipe 3\nF","PVA","(CDQ)",{"$f":"EN14","v":"R"},{"$f":"EO14","v":"M"},"M","A","A","N","N","R1","R2","J","R","R","R","M","M","A","A","N","N","R1","R2","R","J","R","R","M","M","A","A","N",null,null,"Equipe 3\nF","PVA","(CDQ)",{"$f":"FW14","v":"N"},"R1","R2","J","R","R","R","M","M","A","A","N","N","R1","R2","J","J","R","R","M","M","A","A","N","N","R1","R2","J","J","R","R"]
[null,"DSA","(TE)","Ar","Ar",{"$f":"F14","v":"R"},"R","M","M","A","A","N","N","R1","R2","F","J","R","R","M","M","A","A","N","N","R1","R2","R","R","R","R","CA","CA","A",null,null,"DSA","(TE)",{"$f":"AM14","v":"A"},"N","N","R1","R2","J","J","R","R","M","M","A","A","N","N","R1","R2","J","J","R","R","M","M","A","A","CA","CA",{"$f":"BN14","v":"R1"},{"$f":"BO14","v":"R2"},{"$f":"BP14","v":"R"},"R",null,null,"DSA","(TE)",{"$f":"BV14","v":"R"},{"$f":"BW14","v":"R"},"CA","CA","CA","CA","CA","CA","R1","R2","CA","R","R","R","M","M","A","A","N","N","R1","R2","J","J","R","R","M","M","A","A",null,null,null,"DSA","(TE)",{"$f":"DE14","v":"N"},{"$f":"DF14","v":"N"},"R1","R2","J","J","R","R","M","M","A","A","N","N","R1","R2","R","R","R","R","M","M","A","A","N","N","R1","R2","J","J","R",null,null,"DSA","(TE)",{"$f":"EN14","v":"R"},{"$f":"EO14","v":"M"},"M","A","A","N","N","R1","R2","J","R","R","R","M","M","A","A","N","N","R1","R2","R","J","R","R","M","M","A","A","N",null,null,null,"DSA","(TE)",{"$f":"FW14","v":"N"},{"$f":"FX14","v":"R1"},"R2","CA","R","R","R","CA","CA","CA","CA","CA","CA","R1","R2","CA","CA","R","R","M","M","A","A","N","N","R1","R2","J","J","R","R"]
[null,"JGF","(CDB)","Mr","Mr",{"$f":"F14","v":"R"},"R","M","M","A","A","N","N","R1","R2","F","J","R","R","M","M","A","A","N","N","R1","R2","R","R","R","R","M","M","A",null,null,"JGF","(CDB)",{"$f":"AM14","v":"A"},{"$f":"AN14","v":"N"},"N","R1","R2","J","J","R","R","M","M","A","A","N","N","R1",{"$f":"BC15","v":"R2"},"J","J","R","R","M","M","A","A","N","N","R1","R2","Mr","Mr",null,null,"JGF","(CDB)",{"$f":"BV14","v":"R"},"R","M","M","A","A","N","N","R1","R2","Mr","Mr",{"$f":"CH14","v":"R"},"R","M","M","A","A","N","N","R1","R2","J","J","R","R","M","M","A","A",null,null,null,"JGF","(CDB)",{"$f":"DE14","v":"N"},{"$f":"DF14","v":"N"},"R1","R2","J","J","R","R","M","M","A","A","N","N","R1","R2","R","R","R","R","M","M","A","A","N","N","R1","R2","J","J","R",null,null,"JGF","(CDB)",{"$f":"EN14","v":"R"},{"$f":"EO14","v":"M"},"M","A","A","N","N","R1","R2","J","R","R","R","M","M","A","A","N","N","R1","R2","R","J","R","R","M","M","A","A","N",null,null,null,"JGF","(CDB)",{"$f":"FW14","v":"N"},{"$f":"FX14","v":"R1"},"R2","J","R","R","R","M","M","A","A","N","N","R1","R2","J","J","R","R","M","M","A","A","N","N","R1","R2","J","J","R","R"]
[null,"CDO","(CIT)","Ar","Ar",{"$f":"F14","v":"R"},"R","M","M","A","A","N","N","R1","R2","Ar","J","R","R","M","M","A","A","N","N","R1","R2","R","R","R","R","M","M","A",null,null,"CDO","(CIT)",{"$f":"AM14","v":"A"},{"$f":"AN14","v":"N"},{"$f":"AO14","v":"N"},{"$f":"AP14","v":"R1"},{"$f":"AQ14","v":"R2"},"Nr","Nr",{"$f":"AT14","v":"R"},"R","M","M","A","A","N","N","R1","R2","CA","CA",{"$f":"BF14","v":"R"},{"$f":"BG14","v":"R"},"CA","CA","CA","CA","CA","CA",{"$f":"BN14","v":"R1"},{"$f":"BO14","v":"R2"},{"$f":"BP14","v":"R"},"R",null,null,"CDO","(CIT)",{"$f":"BV14","v":"R"},{"$f":"BW14","v":"R"},"CA","CA","CA","CA","CA","CA","R1","R2","CA","R","R","R","M","M","A","A","N","N","R1","R2","J","J","R","R","M","M","A","A",null,null,null,"CDO","(CIT)",{"$f":"DE14","v":"N"},{"$f":"DF14","v":"N"},"R1","R2","J","J","R","R","M","M","A","A","N","N","R1","R2","R","R","R","R","M","M","A","A","N","N","R1","R2","J","J","R",null,null,"CDO","(CIT)",{"$f":"EN14","v":"R"},{"$f":"EO14","v":"M"},"M","A","A","N","N","R1","R2","J","R","R","R","M","M","A","A","N","N","R1","R2","R","J","R","R","M","M","A","A","N",null,null,null,"CDO","(CIT)",{"$f":"FW14","v":"N"},{"$f":"FX14","v":"R1"},"R2","J","R","R","R","M","M","A","A","N","N","R1","R2","J","J","R","R","M","M","A","A","N","N","R1","R2","J","J","R","R"]
[null,{"$f":"+A15","v":"Equipe 2\nF"},null,"N","N","R1","R2","R","J","R","R","M","M","A","A","N","N","R1","R2","J","R","R","R","M","M","A","A","N","N","R1","R2","J","J","R",null,null,{"$f":"+AJ15","v":"Equipe 2\nF"},null,"R","M","M","A","A","N","N","R1","R2","J","J","R","R","M","M","A","A","N","N","R1","R2","R","R","R","R","M","M","A","A","N",null,null,null,{"$f":"+BS15","v":"Equipe 3\nF"},null,"R1","R2","J","J","R","R","M","M","A","A","N","N","R1","R2","J","J","R","R","M","M","A","A","N","N","R1","R2","R","J","R","R",null,null,null,{"$f":"+DB15","v":"Equipe 2\nF"},null,"M","M","A","A","N","N","R1","R2","J","R","R","R","M","M","A","A","N","N","R1","R2","J","J","R","R","M","M","A","A","N","N","R1",null,null,{"$f":"+EK15","v":"Equipe 3\nF"},null,"R2","J","J","R","R","M","M","A","A","N","N","R1","R2","R","R","R","R","M","M","A","A","N","N","R1","R2","J","J","R","R","M",null,null,null,{"$f":"+FT15","v":"Equipe 3\nF"},null,"M","A","A","N","N","R1","R2","J","J","R","R","M","M","A","A","N","N","R1","R2","R","J","R","R","M","M","A","A","N","N","R1","R2"]
[null,"GPA","(F)","J","J","R","R","M","M","A","A","N","N","R1","R2","F","J","R","R","M","M","A","A","N","N","R1","R2","R","R","R","R","M","M","A",null,null,"GPA","(F)","A","N","N","R1","R2","J","J","R","R","M","M","A","A","N","N",{"$f":"BB16","v":"R1"},"R2","J",{"$f":"BE17","v":"J"},"R","R","M","M","A","A","N","N","R1","R2","R","R",null,null,"GPA","(F)","R","R","M","M","A","A","N","N","R1","R2","J","R","R","R","M","M","A","A","N","N","R1","R2","J","J","R","R","M","M","A","A",null,null,null,"GPA","(F)","N","N","R1","R2","J","J","R","R","M","M","A","A","N","N","R1","R2","R","R","R","R","M","M","A","A","N","N","R1","R2","J","J","R",null,null,"GPA","(F)","R","M","M","A","A","N","N","R1","R2","J","R","R","R","M","M","A","A","N","N","R1","R2","R","J","R","R","M","M","A","A","N",null,null,null,"GPA","(F)","N","R1","R2","J","R","R","R","M","M","CA","CA","CA","CA","R1","R2","CA","CA","R","R","CA","CA","CA","CA","CA","CA","R1","R2","CA","CA","R","R"]
["Equipe 3\nD","PLC","(CDQ)","N","N","R1","R2","R","F","R","R","M","M","A","A","N","N","R1","R2","J","R","R","R","M","M","A","A","N","N","R1","R2","J","J","R",null,"Equipe 3\nD","PLC","(CDQ)","R","M","M","A","A","N","N","R1","R2","J","J","R","R","M","M","A","A","N","N","R1","R2","Mr","Mr","R","R","M","M","A","A","N","N",null,"Equipe 3\nD","PLC","(CDQ)","R1","R2","Mr","Mr","R","R","M","M","A","A","N","N","R1","R2","J","R","R","R","M","M","A","A","N","N","R1","R2","R","J","R","R",null,null,"Equipe 3\nD","PLC","(CDQ)","M","M","A","A","N","N","R1","R2","J","R","R","R","M","M","A","A","N","N","R1","R2","J","J","R","R","M","M","A","A","N","N","R1",null,"Equipe 3\nD","PLC","(CDQ)","R2","J","J","R","R","M","M","A","A","N","N","R1","R2","R","R","R","R","M","M","A","A","N","N","R1","R2","J","J","R","R","M",null,null,"Equipe 3\nD","PLC","(CDQ)","M","A","A","N","N","R1","R2","J","J","R","R","M","M","A","A","N","N","R1","R2","Ar","Ar","R","R","M","M","A","A","N","N","R1","R2"]
[null,"BEB","(TE)","N","N","R1","R2","R","F","R","R","M","M","A","A","N","N","R1","R2","J","R","R","R","M","M","A","A","N","N","R1","R2","Mr","Mr","R",null,null,"BEB","(TE)","R","M","M","A","A","N","N","R1","R2","Ar","Ar","R","R","M","M","A","A","N","N","R1","R2","Ar","Ar","R","R","M","M","A","A","N","N",null,null,"BEB","(TE)","R1","R2","Mr","Mr","R","R","M","M","A","A","N","N","R1","R2","J","R","R","R","M","M","A","A","N","N","R1","R2","R","J","R","R",null,null,null,"BEB","(TE)","M","M","A","A","N","N","R1","R2","J","R","R","R","M","M","A","A","N","N","R1","R2","J","J","R","R","M","M","A","A","N","N","R1",null,null,"BEB","(TE)","R2","J","J","R","R","M","M","A","A","N","N","R1","R2","R","R","R","R","M","M","A","A","N","N","R1","R2","J","J","R","R","M",null,null,null,"BEB","(TE)","M","A","A","N","N","R1","R2","Mr","Mr","R","R","M","M","A","A","N","N","R1","R2","R","J","R","R","M","M","A","A","N","N","R1","R2"]
[null,"FCL","(CDB)",{"$f":"D19","v":"N"},{"$f":"E19","v":"N"},{"$f":"F19","v":"R1"},{"$f":"G19","v":"R2"},"R","F","R",{"$f":"K19","v":"R"},"M","M","A","A","N","N","R1","R2","J",{"$f":"U19","v":"R"},"R","R","M","M","A","A","N","N","R1","R2","Ar","Ar","R",null,null,"FCL","(CDB)","R","M","M","A","A","N","N","R1","R2","J","J","R","R","M","M","A","A","N","N","R1","R2","R","R","R","R","M","M","A","A","N","N",null,null,"FCL","(CDB)","R1","R2","Nr","Nr","R","R","M","M","A","A","N","N","R1","R2","J","R","R","R","M","M","A","A","N","N","R1","R2","R","J","R","R",null,null,null,"FCL","(CDB)","M","M","A","A","N","N","R1","R2","J","R","R","R","F","F","F","F","F","N","R1","R2","J","J","R","R","M","M","A","A","N","N","R1",null,null,"FCL","(CDB)","R2","J","J","R","R","M","M","A","A","N","N","R1","R2","R","R","R","R","M","M","A","A","N","N","R1","R2","J","J","R","R","M",null,null,null,"FCL","(CDB)","M","A","A","N","N","R1","R2","J","J","R","R","M","M","A","A","N","N","R1","R2","R","J","R","R","M","M","A","A","N","N","R1","R2"]
[null,"PDO","(CDB)",{"$f":"D21","v":"N"},{"$f":"E19","v":"N"},{"$f":"F21","v":"R1"},"R2","R","F","R","R","M","M","A","A","N","N","R1","R2","J","R","R","R","M","M","A","A","N","N","R1","R2","J","J","R",null,null,"PDO","(CDB)","R","M","M","A","A","N","N","R1","R2","J","J","R","R","M","M","A","A","N","N","R1","R2","Mr","Mr","R","R","M","M","A","A","N","N",null,null,"PDO","(CDB)","R1","R2","J","J","R","R","M","M","A","A","N","N","R1","R2","J","R","R","R","M","M","A","A",">","N","R1","R2","R","J","R","R",null,null,null,"PDO","(CDB)","M","M","A","A","N","N","R1","R2","J","R","R","R","M","M","A","A","N","N","R1","R2","J","J","R","R","M","M","A","A","N","N","R1",null,null,"PDO","(CDB)","R2","J","J","R","R","M","M","A","A","N","N","R1","R2","R","R","R","R","M","M","A","A","N","N","R1","R2","J","J","R","R","M",null,null,null,"FCL","(CDB)","M","A","A","N","N","R1","R2","J","J","R","R","M","M","A","A","N","N","R1","R2","R","J","R","R","M","M","A","A","N","N","R1","R2"]
[null,"MLC","(CIT)",{"$f":"D19","v":"N"},{"$f":"E19","v":"N"},{"$f":"F19","v":"R1"},{"$f":"G19","v":"R2"},{"$f":"H19","v":"R"},"F","R",{"$f":"K19","v":"R"},"M","M","A","A","N","N","R1","R2","J",{"$f":"U19","v":"R"},"R","R","M","M","A","A","N","N","R1","R2","CA","CA","R",null,null,"MLC","(CIT)","R","CA","CA","CA","CA","CA","CA","R1","R2","CA","CA","R","R","M","M","A","A","N","N","R1","R2","Mr","Mr","R","R","M","M","A","A","N","N",null,null,"MLC","(CIT)","R1","R2","Mr","Mr","R","R","M","M","A","A","N","N","R1","R2","J","R","R","R","M","M","A","A","N","N","R1","R2","R","J","R","R",null,null,null,"MLC","(CIT)","M","M","A","A","N","N","R1","R2","J","R","R","R","M","M","A","A","N","N","R1","R2","J","J","R","R","M","M","A","A","N","N","R1",null,null,"MLC","(CIT)","R2","J","J","R","R","M","M","A","A","N","N","R1","R2","R","R","R","R","M","M","A","A","N","N","R1","R2","J","J","R","R","M",null,null,null,"MLC","(CIT)","M","A","A","N","N","R1","R2","J","J","R","R","M","M","A","A","N","N","R1","R2","Mr","Mr","R","R","M","M","A","A","N","N","R1","R2"]
["Equipe 4\nB",{"$f":"+A26","v":"Equipe 4\nB"},null,"M","M","A","A","N","N","R1","R2","J","J","R","R","M","M","A","A","N","N","R1","R2","J","J","R","R","M","M","A","A","N","N","R1",null,"Equipe 4\nB",{"$f":"+AJ26","v":"Equipe 4\nB"},null,"R2","R","J","R","R","M","M","A","A","N","N","R1","R2","J","R","R","R","M","M","A","A","N","N","R1","R2","J","J","R","R","M",null,null,"Equipe 4\nB",{"$f":"+BS26","v":"Equipe 4\nB"},null,"A","A","N","N","R1","R2","J","J","R","R","M","M","A","A","N","N","R1","R2","R","R","R","R","M","M","A","A","N","N","R1","R2",null,null,"Equipe 4\nB",{"$f":"+DB26","v":"Equipe 4\nB"},null,"J","J","R","R","M","M","A","A","N","N","R1","R2","J","J","R","R","M","M","A","A","N","N","R1","R2","R","J","R","R","M","M","A",null,"Equipe 4\nB",{"$f":"+EK26","v":"Equipe 4\nB"},null,"A","N","N","R1","R2","J","R","R","R","M","M","A","A","N","N","R1","R2","J","J","R","R","M","M","A","A","N","N","R1","R2","J",null,null,"Equipe 4\nB",{"$f":"+FT26","v":"Equipe 4\nB"},null,"J","R","R","M","M","A","A","N","N","R1","R2","R","R","R","R","M","M","A","A","N","N","R1","R2","J","J","R","R","M","M","A","A"]
[null,"JMS","(CDQ)",{"$f":"D26","v":"M"},{"$f":"E26","v":"M"},"A","A","N","N","R1","R2","J","J","R","R","M","M","A","A","N","N","R1","R2","R","F","R","R","M","M","A","A","N","N","R1",null,null,"JMS","(CDQ)",{"$f":"AM26","v":"R2"},"Ar","Ar",{"$f":"AP26","v":"R"},"R","M","M","A","A","N","N","R1","R2","J","R","R","R","M","M","A","A","N","N","R1","R2","Nr","Nr","R","R","M","M",null,null,"JMS","(CDQ)",{"$f":"BV26","v":"A"},{"$f":"BW26","v":"A"},"N","N","R1","R2","J","J","R","R","M","M","A","A","N","N","R1","R2","R","R","R","R","M","M","A","A","N","N","R1","R2",null,null,null,"JMS","(CDQ)",{"$f":"DE26","v":"J"},{"$f":"DF26","v":"J"},"R","R","M","M","A","A","REX","F","R1","R2","F","F","R","R","F","M","A","A","N","N","R1","R2","R","J","R","R","M","M","A",null,null,"JMS","(CDQ)",{"$f":"EN26","v":"A"},{"$f":"EO26","v":"N"},"N","R1","R2","J","R","R","R","M","M","A","A","N","N","R1","R2","J","J","R","R","M","M","A","A","N","N","R1","R2","J",null,null,null,"JMS","(CDQ)",{"$f":"FW26","v":"J"},{"$f":"FX26","v":"R"},"R","M","M","A","A","N","N","R1","R2","R","R","R","R","M","M","A","A","N","N","R1","R2","J","R","R","R","M","M","A","A"]
[null,"KSA","(TE)",{"$f":"D26","v":"M"},{"$f":"E26","v":"M"},"A","A","N","N","R1","R2","J","J","R","R","M","M","A","A","N","N","R1","R2","R","F","R","R","M","M","A","A","N","N","R1",null,null,"KSA","(TE)",{"$f":"AM26","v":"R2"},"Ar","Ar",{"$f":"AP26","v":"R"},"R","M","M","A","A","N","N","R1","R2","J","R","R","R","M","M","A","A","N","N","R1","R2","Nr","Nr","R","R","M","M",null,null,"KSA","(TE)",{"$f":"BV26","v":"A"},{"$f":"BW26","v":"A"},"N","N","R1","R2","Nr","Nr","R","R","M","M",{"$f":"CH26","v":"A"},{"$f":"CI26","v":"A"},"N","N","R1","R2","R","R","R","R","M","M","A","A","N","N","R1","R2",null,null,null,"KSA","(TE)",{"$f":"DE26","v":"J"},{"$f":"DF26","v":"J"},"R","R","M","M","A","A","N","N","R1","R2","J","J","R","R","M","M","A","A","N","N","R1","R2","R","J","R","R","M","M","A",null,null,"KSA","(TE)",{"$f":"EN26","v":"A"},{"$f":"EO26","v":"N"},"N","R1","R2","J","R","R","R","M","M","A","A","N","N","R1","R2","J","J","R","R","M","M","A","A","N","N","R1","R2","J",null,null,null,"KSA","(TE)",{"$f":"FW26","v":"J"},{"$f":"FX26","v":"R"},"R","M","M","A","A","N","N","R1","R2","Nr","Nr","R","R","M","M","A","A","N","N","R1","R2","J","R","R","R","M","M","A","A"]
[null,"BDO","(CDB)","CA","CA","CA","CA","CA","CA",{"$f":"J26","v":"R1"},"R2","J","J","R","R",{"$f":"P26","v":"M"},"M","A","A","N","N","R1","R2","R","F","R","R","M","M",{"$f":"AD26","v":"A"},"A","N","N","R1",null,null,"BDO","(CDB)",{"$f":"AM26","v":"R2"},{"$f":"AN26","v":"R"},"J","R","R","M","M","A","A","N","N","R1","R2","Ar","Ar","R","R","M","M","A","A","N","N","R1","R2","Ar","Ar","R","R","CA","CA",null,null,"BDO","(CDB)","CA","CA","CA","CA",{"$f":"BZ26","v":"R1"},"R2","CA","CA","R","R","CA","CA","CA","CA","N","N","R1","R2","Ar","Ar","R","R","M","M","A","A","N","N","R1","R2",null,null,null,"BDO","(CDB)",{"$f":"DE26","v":"J"},{"$f":"DF26","v":"J"},"R","R","M","M","A","A","N","N","R1","R2","J","J","R","R","M","M","A","A","N","N","R1","R2","R","J","R","R","M","M","A",null,null,"BDO","(CDB)",{"$f":"EN26","v":"A"},{"$f":"EO26","v":"N"},"N","R1","R2","J","R","R","R","M","M","A","A","N","N","R1","R2","J","J","R","R","M","M","A","A","N","N","R1","R2","J",null,null,null,"BDO","(CDB)",{"$f":"FW26","v":"J"},{"$f":"FX26","v":"R"},"R","M","M","A","A","N","N","R1","R2","R","R","R","R","M","M","A","A","N","N","R1","R2","J","R","R","R","M","M","A","A"]
[null,"AMZ","(CIT)",{"$f":"D26","v":"M"},{"$f":"E26","v":"M"},"A","A","N","N","R1","R2","J","J","R","R","M","M","A","A","N","N","R1","R2","R","F","R","R","M","M","A","A","N","N","R1",null,null,"AMZ","(CIT)",{"$f":"AM26","v":"R2"},"Mr","Mr",{"$f":"AP26","v":"R"},"R","M","M","A","A","N","N","R1","R2","Ar","Ar","R","R","M","M","A","A","N","N","R1","R2","Nr","Nr","R","R","M","M",null,null,"AMZ","(CIT)",{"$f":"BV26","v":"A"},{"$f":"BW26","v":"A"},"N","N","R1","R2","Nr","Nr","R","R","M","M","A","A","N","N","R1","R2","R","R","R","R","M","M","A","A","N","N","R1","R2",null,null,null,"AMZ","(CIT)",{"$f":"DE26","v":"J"},{"$f":"DF26","v":"J"},"R","R","M","M","A","A","N","N","R1","R2","J","J","R","R","M","M","A","A","N","N","R1","R2","R","J","R","R","M","M","A",null,null,"AMZ","(CIT)",{"$f":"EN26","v":"A"},{"$f":"EO26","v":"N"},"N","R1","R2","J","R","R","R","M","M","A","A","N","N","R1","R2","Ar","Ar","R","R","M","M","A","A","N","N","R1","R2","J",null,null,null,"AMZ","(CIT)",{"$f":"FW26","v":"J"},{"$f":"FX26","v":"R"},"R","M","M","A","A","N","N","R1","R2","Nr","Nr","R","R","M","M","A","A","N","N","R1","R2","Nr","Nr","R","R","M","M","A","A"]
["Equipe 5\nA",{"$f":"+A31","v":"Equipe 5\nA"},null,"A","A","N","N","R1","R2","J","J","R","R","M","M","A","A","N","N","R1","R2","R","J","R","R","M","M","A","A","N","N","R1","R2","J",null,"Equipe 5\nA",{"$f":"+AJ31","v":"Equipe 5\nA"},null,"R","R","R","M","M","A","A","N","N","R1","R2","J","J","R","R","M","M","A","A","N","N","R1","R2","J","J","R","R","M","M","A",null,null,"Equipe 5\nA",{"$f":"+BS31","v":"Equipe 5\nA"},null,"N","N","R1","R2","R","R","R","R","M","M","A","A","N","N","R1","R2","J","J","R","R","M","M","A","A","N","N","R1","R2","J","J",null,null,"Equipe 5\nA",{"$f":"+DB31","v":"Equipe 5\nA"},null,"R","R","M","M","A","A","N","N","R1","R2","R","J","R","R","M","M","A","A","N","N","R1","R2","J","R","R","R","M","M","A","A","N",null,"Equipe 5\nA",{"$f":"+EK31","v":"Equipe 5\nA"},null,"N","R1","R2","J","J","R","R","M","M","A","A","N","N","R1","R2","J","J","R","R","M","M","A","A","N","N","R1","R2","R","R","R",null,null,"Equipe 5\nA",{"$f":"+FT31","v":"Equipe 5\nA"},null,"R","M","M","A","A","N","N","R1","R2","J","J","R","R","M","M","A","A","N","N","R1","R2","J","J","R","R","M","M","A","A","N","N"]
["Equipe 5\nA","OAN","(CDQ)",{"$f":"D31","v":"A"},"A","N","N","R1","R2","J","J","R","R","M","M","A","A","N","N","R1","R2","R","F","R","R","M","M","A","A","N","N","R1","R2","Mr",null,"Equipe 5\nA","OAN","(CDQ)","Mr",{"$f":"AN31","v":"R"},"R","M","M","A","A","N","N","R1","R2","J","J","R","R","M","M","A","A","N","N","R1","R2","Ar","Ar","R","R","M","M","A","A",null,"Equipe 5\nA","OAN","(CDQ)",{"$f":"BV31","v":"N"},"N","R1","R2","Ar","Ar","R","R","M","M","A","A","N","N","R1","R2","J","J","R","R","M","M","A","A","N","N","R1","R2","J","J",null,null,"Equipe 5\nA","OAN","(CDQ)",{"$f":"DE31","v":"R"},"R","M","M","A","A","N","N","R1","R2","R","J","R","R","M","M","A","A","N","N","R1","R2","J","R","R","R","M","M","A","A","N",null,"Equipe 5\nA","OAN","(CDQ)",{"$f":"EN31","v":"N"},"R1","R2","J","J","R","R","M","M","A","A","N","N","R1","R2","J","J","R","R","M","M","A","A","N","N","R1","R2","R","R","R",null,null,"Equipe 5\nA","OAN","(CDQ)",{"$f":"FW31","v":"R"},{"$f":"FX31","v":"M"},"M","A","A","N","N","R1","R2","J","J","R","R","M","M","A","A","N","N","R1","R2","Nr","Nr","R","R","M","M","A","A","N","N"]
[null,"FFO","(TE)","CA","CA","CA","CA",{"$f":"H31","v":"R1"},"R2","CA","CA","R","R","M","M","A","A","N","N","R1","R2","R","F","R","R","M","M","A","A","N","N","R1","R2","Mr",null,null,"FFO","(TE)","Mr",{"$f":"AN31","v":"R"},"R","M","M","A","A","N","N","R1","R2","Nr","Nr","R","R","M","M","A","A","N","N","R1","R2","Nr","Nr","R","R","M","M","A","A",null,null,"FFO","(TE)",{"$f":"BV31","v":"N"},{"$f":"BW31","v":"N"},{"$f":"BX31","v":"R1"},{"$f":"BY31","v":"R2"},"Ar","Ar",{"$f":"CB31","v":"R"},"R","M","M","A","A","N","N","R1","R2","J","J","R","R","M","M","A","A","N","N","R1","R2","J","J",null,null,null,"FFO","(TE)",{"$f":"DE31","v":"R"},{"$f":"DF31","v":"R"},"M","M","A","A","N","N","R1","R2","R","J","R","R","M","M","A","A","N","N","R1","R2","J","R","R","R","M","M","A","A","N",null,null,"FFO","(TE)",{"$f":"EN31","v":"N"},{"$f":"EO31","v":"R1"},"R2","J","J","R","R","M","M","A","A","N","N","R1","R2","J","J","R","R","M","M","A","A","N","N","R1","R2","R","R","R",null,null,null,"FFO","(TE)",{"$f":"FW31","v":"R"},{"$f":"FX31","v":"M"},"M","A","A","N","N","R1","R2","Ar","Ar","R","R","M","M","A","A",{"$f":"GN31","v":"N"},"N","R1","R2","J","J","R","R","M","M","A","A","N","N"]
[null,"GGL ","(CDB)",{"$f":"D31","v":"A"},"A","N","N","R1","R2","J","J","R","R","M","M","A","A","N","N","R1","R2","R","F","R","R","M","M","A","A","N","N","R1","R2","Nr",null,null,"GGL ","(CDB)","Nr",{"$f":"AN31","v":"R"},"R","M","M","A","A","N","N","R1","R2","Mr","Mr","R","R","M","M","A","A","N","N","R1","R2","Mr","Mr","R","R","M","M","A","A",null,null,"GGL ","(CDB)",{"$f":"BV31","v":"N"},{"$f":"BW31","v":"N"},"R1","R2","R","R","R","R","M","M","A","A","N","N","R1","R2","Mr","Mr","R","R","M","M","A","A","N","N","R1","R2",{"$f":"CX32","v":"J"},"J",null,null,null,"GGL ","(CDB)",{"$f":"DE31","v":"R"},{"$f":"DF31","v":"R"},"M","M","A","A","N","N","R1","R2","R","J","R","R","M","M","A","A","N","N","R1","R2","J","R","R","R","M","M","A","A","N",null,null,"GGL ","(CDB)",{"$f":"EN31","v":"N"},{"$f":"EO31","v":"R1"},"R2","J","J","R","R","M","M","A","A","N","N","R1","R2","J","J","R","R","M","M","A","A","N","N","R1","R2","R","R","R",null,null,null,"GGL ","(CDB)",{"$f":"FW31","v":"R"},{"$f":"FX31","v":"M"},"M","A","A",{"$f":"GB31","v":"N"},"N","R1","R2","J","J","R","R","M","M","A","A","N","N","R1","R2","J","J","R","R","M","M","A","A","N","N"]
[null,"JRA","(CIT)","CA","CA","CA","CA",{"$f":"H31","v":"R1"},"R2","CA","CA","R","R","CA","CA","CA","A","N","N","R1","R2","R","F","R","R","M","M","A","A","N","N","R1","R2","J",null,null,"JRA","(CIT)",{"$f":"AM31","v":"R"},{"$f":"AN31","v":"R"},"R","M","M","A","A","N","N","R1","R2","Mr","Mr","R","R","M","M","A","A","N","N","R1","R2","Ar","Ar","R","R","M","M","A","A",null,null,"JRA","(CIT)",{"$f":"BV31","v":"N"},{"$f":"BW31","v":"N"},"R1","R2","Ar","Ar","R","R","M","M","A","A","N","N","R1","R2","J","J","R","R","M","M","A","A","N","N","R1","R2","J","J",null,null,null,"JRA","(CIT)",{"$f":"DE31","v":"R"},{"$f":"DF31","v":"R"},"M","M","A","A","N","N","R1","R2","R","J","R","R","M","M","A","A","N","N","R1","R2","J","R","R","R","M","M","A","A","N",null,null,"JRA","(CIT)",{"$f":"EN31","v":"N"},{"$f":"EO31","v":"R1"},"R2","J","J","R","R","M","M","A","A","N","N","R1","R2","J","J","R","R","M","M","A","A","N","N","R1","R2","R","R","R",null,null,null,"JRA","(CIT)",{"$f":"FW31","v":"R"},{"$f":"FX31","v":"M"},"M","A","A","N","N","R1","R2","Ar","Ar","R","R","M","M","A","A","N","N","R1","R2","Ar","Ar","R","R","M","M","A","A","N","N"]
["Equipe 6\nC",{"$f":"+A36","v":"Equipe 6\nC"},null,"R","R","M","M","A","A","N","N","R1","R2","R","R","R","R","M","M","A","A","N","N","R1","R2","J","J","R","R","M","M","A","A","N",null,"Equipe 6\nC",{"$f":"+AJ36","v":"Equipe 6\nC"},null,"N","R1","R2","J","J","R","R","M","M","A","A","N","N","R1","R2","R","J","R","R","M","M","A","A","N","N","R1","R2","J","R","R",null,null,"Equipe 6\nC",{"$f":"+BS36","v":"Equipe 6\nC"},null,"M","M","A","A","N","N","R1","R2","J","J","R","R","M","M","A","A","N","N","R1","R2","J","J","R","R","M","M","A","A","N","N",null,null,"Equipe 6\nC",{"$f":"+DB36","v":"Equipe 6\nC"},null,"R1","R2","R","R","R","R","M","M","A","A","N","N","R1","R2","J","J","R","R","M","M","A","A","N","N","R1","R2","J","J","R","R","M",null,"Equipe 6\nC",{"$f":"+EK36","v":"Equipe 6\nC"},null,"M","A","A","N","N","R1","R2","R","J","R","R","M","M","A","A","N","N","R1","R2","J","R","R","R","M","M","A","A","N","N","R1",null,null,"Equipe 6\nC",{"$f":"+FT36","v":"Equipe 6\nC"},null,"R2","J","J","R","R","M","M","A","A","N","N","R1","R2","J","J","R","R","M","M","A","A","N","N","R1","R2","R","R","R","R","M","M"]
[null,"FFL","(CDQ)",{"$f":"D36","v":"R"},"R","M","M","A","A","N","N","R1","R2","R","R","R","R",{"$f":"R35","v":"N"},"N","R1","R2","R","N","R1","R2","J","F","R","R","M","M","A","A","N",null,null,"FFL","(CDQ)",{"$f":"AM36","v":"N"},"R1","R2","Nr","Nr","R","R","M","M","A","A","N","N","R1","R2","R","J","R","R","M","M","A","A","N","N","R1","R2","J","R","R","R",null,null,"FFL","(CDQ)",{"$f":"BV36","v":"M"},"M","A","A","N","N","R1","R2","J","J","R","R","M","M","A","A","N","N","R1","R2","J","J","R","R","M","M","A","A","N","N",null,null,null,"FFL","(CDQ)",{"$f":"DE36","v":"R1"},"R2","R","R","R","R","M","M","A","F","F","F","R1","R2","F","F","R","R","M","M","A","A","N","N","R1","R2","J","J","R","R","M",null,null,"FFL","(CDQ)",{"$f":"EN36","v":"M"},"A","A","N","N","R1","R2","R","J","R","R","M","M","A","A","N","N","R1","R2","J","R","R","R","M","M","A","A","N","N","R1",null,null,null,"FFL","(CDQ)",{"$f":"FW36","v":"R2"},"J","J","R","R","M","M","A","A","N","N","R1","R2","J","J","R","R","M","M","CA","CA","CA","CA","R1","R2","R","R","R","R","M","M"]
[null,"PDE","(TE)",{"$f":"D36","v":"R"},"R","M","M","A","A","N","N","R1","R2","R","R","R","R","M","M","A","A","N","N","R1","R2","J","F","R","R","M","M","A","A","N",null,null,"PDE","(TE)",{"$f":"AM36","v":"N"},{"$f":"AN36","v":"R1"},{"$f":"AO36","v":"R2"},"Nr","Nr",{"$f":"AR36","v":"R"},{"$f":"AS36","v":"R"},"CA","CA","CA","CA","CA","CA",{"$f":"AZ36","v":"R1"},{"$f":"BA36","v":"R2"},{"$f":"BB36","v":"R"},"CA",{"$f":"BD36","v":"R"},{"$f":"BE36","v":"R"},"CA","CA","CA","CA","CA","CA",{"$f":"BL36","v":"R1"},{"$f":"BM36","v":"R2"},"CA",{"$f":"BO36","v":"R"},{"$f":"BP36","v":"R"},"R",null,null,"PDE","(TE)",{"$f":"BV36","v":"M"},{"$f":"BW36","v":"M"},"A","A","N","N","R1","R2","J","J","R","R","M","M","A","A","N","N","R1","R2","J","J","R","R","M","M","A","A","N","N",null,null,null,"PDE","(TE)",{"$f":"DE36","v":"R1"},{"$f":"DF36","v":"R2"},"R","R","R","R","M","M","A","A","N","N","R1","R2","J","J","R","R","M","M","A","A","N","N","R1","R2","J","J","R","R","M",null,null,"PDE","(TE)",{"$f":"EN36","v":"M"},{"$f":"EO36","v":"A"},"A","N","N","R1","R2","R","J","R","R","M","M","A","A","N","N","R1","R2","J","R","R","R","M","M","A","A","N","N","R1",null,null,null,"PDE","(TE)",{"$f":"FW36","v":"R2"},{"$f":"FX36","v":"J"},"J","R","R","M","M","A","A","N","N","R1","R2","J","J","R","R","M","M","A","A","N","N","R1","R2","R","R","R","R","M","M"]
[null,"GBA","(CDB)",{"$f":"D36","v":"R"},"R","M","M","A","A","N","N","R1","R2","R","R","R","R","M","M","A","A","N","N","R1","R2","J","F",{"$f":"AB36","v":"R"},"R","M","M","A","A","N",null,null,"GBA","(CDB)",{"$f":"AM36","v":"N"},{"$f":"AN36","v":"R1"},"R2","J","J","R","R","M","M","A","A","N","N","R1","R2","R","J","R","R","M","M","A","A","N","N","R1","R2","J","R","R","R",null,null,"GBA","(CDB)",{"$f":"BV36","v":"M"},{"$f":"BW36","v":"M"},"A","A","N","N","R1","R2","J","J","R","R","M","M","A","A","N","N","R1","R2","J","J","R","R","M","M","A","A","N","N",null,null,null,"GBA","(CDB)",{"$f":"DE36","v":"R1"},{"$f":"DF36","v":"R2"},"R","R","R","R","M","M","A","A","N","N","R1","R2","J","J","R","R","M","M","A","A","N","N","R1","R2","J","J","R","R","M",null,null,"GBA","(CDB)",{"$f":"EN36","v":"M"},{"$f":"EO36","v":"A"},"A","N","N","R1","R2","R","J","R","R","M","M","A","A","N","N","R1","R2","J","R","R","R","M","M","A","A","N","N","R1",null,null,null,"GBA","(CDB)",{"$f":"FW36","v":"R2"},"J","J","R","R","M","M","A","A","N","N","R1","R2","J","J","R","R","M","M","A","A","N","N","R1","R2","R","R","R","R","M","M"]
[null,"JLE","(CDB)",{"$f":"D36","v":"R"},{"$f":"E36","v":"R"},"M","M","A","A","N","N","R1","R2","R","R","R","R","M","M","A","A","N","N","R1","R2","CA","F","R","R","CA","CA","CA","CA","CA",null,null,"JLE","(CDB)","CA",{"$f":"AN36","v":"R1"},"R2","J","J","R","R","M","M","A","A","N","N","R1","R2","Nr","Nr","R","R","M","M","A","A","N","N","R1","R2","Nr","Nr","R","R",null,null,"JLE","(CDB)",{"$f":"BV36","v":"M"},{"$f":"BW36","v":"M"},"A","A","N","N","R1","R2","Nr","Nr","R","R","M","M","A","A","N","N","R1","R2","Nr","Nr","R","R","M","M","A","A","N","N",null,null,null,"JLE","(CDB)",{"$f":"DE36","v":"R1"},{"$f":"DF36","v":"R2"},"R","R","R","R","M","M","A","A","N","N","R1","R2","J","J","R","R","M","M","A","A","N","N","R1","R2","J","J","R","R","M",null,null,"JLE","(CDB)",{"$f":"EN36","v":"M"},{"$f":"EO36","v":"A"},"A","N","N","R1","R2","R","J","R","R","M","M","A","A","N","N","R1","R2","J","R","R","R","M","M","A","A","N","N","R1",null,null,null,"JLE","(CDB)",{"$f":"FW36","v":"R2"},{"$f":"FX36","v":"J"},"J","R","R","M","M","A","A","N","N","R1","R2","J","J","R","R","M","M","A","A","N","N","R1","R2","R","R","R","R","M","M"]
[null,"GGB","(CIT)",{"$f":"D36","v":"R"},{"$f":"E36","v":"R"},"M","M","A","A","N","N","R1","R2","Mr","Mr","R","R","M","M","A","A",{"$f":"V38","v":"N"},{"$f":"W38","v":"N"},"R1","R2","J","F","R","R","M","M","A","A","N",null,null,"GGB","(CIT)",{"$f":"AM36","v":"N"},{"$f":"AN36","v":"R1"},"R2","Ar","Ar","R","R","M","M","A","A","N","N","R1","R2","R","J","R","R","M","M","A","A","N","N","R1","R2","J","R","R","R",null,null,"GGB","(CIT)",{"$f":"BV36","v":"M"},{"$f":"BW36","v":"M"},"A","A","N","N","R1","R2","J","J","R","R","M","M","A","A","N","N","R1","R2","J","J","R","R","M","M","A","A","N","N",null,null,null,"GGB","(CIT)",{"$f":"DE36","v":"R1"},{"$f":"DF36","v":"R2"},"R","R","R","R","M","M","A","A","N","N","R1","R2","J","J","R","R","M","M","A","A","N","N","R1","R2","J","J","R","R","M",null,null,"GGB","(CIT)",{"$f":"EN36","v":"M"},{"$f":"EO36","v":"A"},"A","N","N","R1","R2","R","J","R","R","M","M","A","A","N","N","R1","R2","Nr","Nr","R","R","M","M","A","A","N","N","R1",null,null,null,"GGB","(CIT)",{"$f":"FW36","v":"R2"},{"$f":"FX36","v":"J"},"J","R","R","M","M","A","A","N","N","R1","R2","J","J","R","R","M","M","A","A","N","N","R1","R2","R","R","R","R","M","M"]

{"sheet":"données","index":4,"n_rows":124,"n_cols":14,"rows_kept":124,"cut":false,"hidden":false,"merged":[[2,2,2,3],[33,2,33,3]]}
[null,null,null,null,null,0,"Pâques","Mercredi des Cendres"]
[null,null,null,null,null,2000,"2000-04-23",{"$f":"G2-46","v":"2000-03-08"}]
["Année",2015,"Jours Fériés",null,null,2001,"2001-04-15",{"$f":"G3-46","v":"2001-02-28"}]
[null,{"$f":"DATE(B3,1,1)","v":"2015-01-01"},"Jour de l'an",{"$f":"DATE($B$3,1,1)","v":"2015-01-01"},null,2002,"2002-03-31","2002-02-13"]
[null,null,"Mercredi des Cendres",{"$f":"VLOOKUP($B$3,table_Paques_Cendres,3,FALSE)","v":"2015-02-18"},null,2003,"2003-04-20","2003-03-05"]
[null,null,"Lundi de pâques",{"$f":"VLOOKUP($B$3,table_Paques_Cendres,2,0)+1","v":"2015-04-06"},null,2004,"2004-04-11","2004-02-25"]
[null,null,"Fête du travail",{"$f":"DATE($B$3,5,1)","v":"2015-05-01"},null,2005,"2005-03-27","2005-02-09"]
[null,null,"Victoire du 08 mai 1945",{"$f":"DATE($B$3,5,8)","v":"2015-05-08"},null,2006,"2006-04-16","2006-03-01"]
[null,null,"Ascension",{"$f":"D6+38","v":"2015-05-14"},null,2007,"2007-04-08","2007-02-21"]
[null,null,"Abolition de l'esclavage",{"$f":"DATE($B$3,5,27)","v":"2015-05-27"},null,2008,"2008-03-23","2008-02-06"]
[null,null,"Fête Nationale",{"$f":"DATE($B3,7,14)","v":"2015-07-14"},null,2009,"2009-04-12","2009-02-25"]
[null,null,"Fête Victor Schoelcher ",{"$f":"DATE($B3,7,21)","v":"2015-07-21"},null,2010,"2010-04-04","2010-02-17"]
[null,null,"Assomption",{"$f":"DATE($B3,8,15)","v":"2015-08-15"},null,2011,"2011-04-24","2011-03-09",null,null,"PLAGE D'APPICATION DES MEFC"]
[null,null,"Toussaint",{"$f":"DATE($B$3,11,1)","v":"2015-11-01"},null,2012,"2012-04-08","2012-02-22",null,"Code Absences & Fériés &Samedi Dimanche",null,null,null,"TOUS LES MOIS SAUF LES NOMS D'AGENTS"]
[null,null,"Armistice 1918",{"$f":"DATE($B$3,11,11)","v":"2015-11-11"},null,2013,"2013-03-31","2013-02-13",null,null,"1er t","$D$6:$AH$40;$AM$6:$BO$40;$BV$6:$CZ$40;$DE$6:$EH$40;$EN$6:$FR$40;$FW$6:$GZ$40"]
[null,null,"Nöel",{"$f":"DATE($B$3,12,25)","v":"2015-12-25"},null,2014,"2014-04-20","2014-03-05",null,null,"2eme t","$D$6:$AH$40;$AM$6:$BQ$40;$BV$6:$CY$40;$DE$6:$EI$40;$EN$6:$FQ$40;$FW$6:$HA$40"]
[null,null,"Lundi de Pentecôte",{"$f":"(D6+49)","v":"2015-05-25"},null,2015,"2015-04-05","2015-02-18"]
[null,null,null,null,null,2016,"2016-03-27","2016-02-10"]
[null,null,null,null,null,2017,"2017-04-16","2017-03-01",null,"Repos d'office (Accord)"]
[null,null,"Repos d'office (accord)",null,null,2018,"2018-04-01","2018-02-14",null,null,"1er t","$D$6:$AH$7;$AM$6:$BO$7;$BV$6:$CZ$7;$DE$6:$EH$7;$EN$6:$FR$7;$FW$6:$GZ$7"]
[null,null,null,null,null,2019,"2019-04-21","2019-03-06",null,null,"2eme t","$D$6:$AH$7;$AM$6:$BQ$7;$BV$6:$CY$7;$DE$6:$EI$7;$EN$6:$FQ$7;$FW$6:$HA$7"]
[null,null,"Mardi Gras",{"$f":"D5-1","v":"2015-02-17"},null,2020,"2020-04-12","2020-02-26"]
[null,null,"Jeudi Mi-quarème",{"$f":"D5+22","v":"2015-03-12"},null,2021,"2021-04-04","2021-02-17"]
[null,null,"IEG",{"$f":"DATE($B3,9,16)","v":"2015-09-16"},null,2022,"2022-04-17","2022-03-02"]
[null,null,"Commémoration des défunts",{"$f":"DATE($B$3,11,2)","v":"2015-11-02"},null,2023,"2023-04-09","2023-02-22"]
["journée offerte (accord)",null,"Vendredi Saint",{"$f":"$D$6-3","v":"2015-04-03"},null,2024,"2024-03-31","2024-02-14"]
[null,null,null,null,null,2025,"2025-04-20","2025-03-05"]
[null,null,null,null,null,2026,"2026-04-05","2026-02-18"]
[null,null,null,null,null,2027,"2027-03-28","2027-02-10"]
[null,null,null,null,null,2028,"2028-04-16","2028-03-01"]
[null,null,null,null,null,2029,"2029-04-01","2029-02-14"]
[null,null,null,null,null,2030,"2030-04-21","2030-03-06"]
[null,null,null,null,null,2031,"2031-04-13","2031-02-26"]
[null,null,null,null,null,2032,"2032-03-28","2032-02-11"]
[null,null,null,null,null,2033,"2033-04-17","2033-03-02"]
[null,null,null,null,null,2034,"2034-04-09","2034-02-22"]
[null,null,null,null,null,2035,"2035-03-25","2035-02-07"]
["Année + 1",{"$f":"+B3+1","v":2016},null,null,null,2036,"2036-04-13","2036-02-27"]
[null,{"$f":"DATE(B38,1,1)","v":"2016-01-01"},"1er Janvier",{"$f":"DATE($B$38,1,1)","v":"2016-01-01"},null,2037,"2037-04-05","2037-02-18"]
[null,null,null,null,null,2038,"2038-04-25","2038-03-10"]
[null,null,null,null,null,2039,"2039-04-10","2039-02-23"]
[null,null,null,null,null,2040,"2040-04-01","2040-02-15"]
[null,null,null,null,null,2041,"2041-04-21","2041-03-06"]
[null,null,null,null,null,2042,"2042-04-06","2042-02-19"]
[null,null,null,null,null,2043,"2043-03-29","2043-02-11"]
[null,null,null,null,null,2044,"2044-04-17","2044-03-02"]
[null,null,null,null,null,2045,"2045-04-09","2045-02-22"]
[null,null,null,null,null,2046,"2046-03-25","2046-02-07"]
[null,null,null,null,null,2047,"2047-04-14","2047-02-27"]
[null,null,null,null,null,2048,"2048-04-05","2048-02-19"]
[null,null,null,null,null,2049,"2049-04-18","2049-03-03"]
[null,null,null,null,null,2050,"2050-04-10","2050-02-23"]
[null,null,null,null,null,2051,"2051-04-02","2051-02-15"]
[null,null,null,null,null,2052,"2052-04-21","2052-03-06"]
[null,null,null,null,null,2053,"2053-04-06","2053-02-19"]
[null,null,null,null,null,2054,"2054-03-29","2054-02-11"]
[null,null,null,null,null,2055,"2055-04-18","2055-03-03"]
[null,null,null,null,null,2056,"2056-04-02","2056-02-16"]
[null,null,null,null,null,2057,"2057-04-22","2057-03-07"]
[null,null,null,null,null,2058,"2058-04-14","2058-02-27"]
[null,null,null,null,null,2059,"2059-03-30","2059-02-12"]
[null,null,null,null,null,2060,"2060-04-18","2060-03-03"]
[null,null,null,null,null,2061,"2061-04-10","2061-02-23"]
[null,null,null,null,null,2062,"2062-03-26","2062-02-08"]
[null,null,null,null,null,2063,"2063-04-15","2063-02-28"]
[null,null,null,null,null,2064,"2064-04-06","2064-02-20"]
[null,null,null,null,null,2065,"2065-03-29",{"$f":"G67-46","v":"2065-02-11"}]
[null,null,null,null,null,2066,"2066-04-11","2066-02-24"]
[null,null,null,null,null,2067,"2067-04-03","2067-02-16"]
[null,null,null,null,null,2068,"2068-04-22","2068-03-07"]
[null,null,null,null,null,2069,"2069-04-14","2069-02-27"]
[null,null,null,null,null,2070,"2070-03-30","2070-02-12"]
[null,null,null,null,null,2071,"2071-04-19","2071-03-04"]
[null,null,null,null,null,2072,"2072-04-10","2072-02-24"]
[null,null,null,null,null,2073,"2073-03-26","2073-02-08"]
[null,null,null,null,null,2074,"2074-04-15","2074-02-28"]
[null,null,null,null,null,2075,"2075-04-07","2075-02-20"]
[null,null,null,null,null,2076,"2076-04-19","2076-03-04"]
[null,null,null,null,null,2077,"2077-04-11","2077-02-24"]
[null,null,null,null,null,2078,"2078-04-03","2078-02-16"]
[null,null,null,null,null,2079,"2079-04-23","2079-03-08"]
[null,null,null,null,null,2080,"2080-04-07","2080-02-21"]
[null,null,null,null,null,2081,"2081-03-30","2081-02-12"]
[null,null,null,null,null,2082,"2082-04-19","2082-03-04"]
[null,null,null,null,null,2083,"2083-04-04","2083-02-17"]
[null,null,null,null,null,2084,"2084-03-26","2084-02-09"]
[null,null,null,null,null,2085,"2085-04-15","2085-02-28"]
[null,null,null,null,null,2086,"2086-03-31","2086-02-13"]
[null,null,null,null,null,2087,"2087-04-20","2087-03-05"]
[null,null,null,null,null,2088,"2088-04-11","2088-02-25"]
[null,null,null,null,null,2089,"2089-04-03","2089-02-16"]
[null,null,null,null,null,2090,"2090-04-16","2090-03-01"]
[null,null,null,null,null,2091,"2091-04-08","2091-02-21"]
[null,null,null,null,null,2092,"2092-03-30","2092-02-13"]
[null,null,null,null,null,2093,"2093-04-12","2093-02-25"]
[null,null,null,null,null,2094,"2094-04-04","2094-02-17"]
[null,null,null,null,null,2095,"2095-04-24","2095-03-09"]
[null,null,null,null,null,2096,"2096-04-15","2096-02-29"]
[null,null,null,null,null,2097,"2097-03-31","2097-02-13"]
[null,null,null,null,null,2098,"2098-04-20","2098-03-05"]
[null,null,null,null,null,2099,"2099-04-12","2099-02-25"]
[null,null,null,null,null,2100,"2100-03-28","2100-02-10"]
[null,null,null,null,null,2101,"2101-04-17","2101-03-02"]
[null,null,null,null,null,2102,"2102-04-09","2102-02-22"]
[null,null,null,null,null,2103,"2103-03-25","2103-02-07"]
[null,null,null,null,null,2104,"2104-04-13","2104-02-27"]
[null,null,null,null,null,2105,"2105-04-05","2105-02-18"]
[null,null,null,null,null,2106,"2106-04-18","2106-03-03"]
[null,null,null,null,null,2107,"2107-04-10","2107-02-23"]
[null,null,null,null,null,2108,"2108-04-01","2108-02-15"]
[null,null,null,null,null,2109,"2109-04-21","2109-03-06"]
[null,null,null,null,null,2110,"2110-04-06","2110-02-19"]
[null,null,null,null,null,2111,"2111-03-29","2111-02-11"]
[null,null,null,null,null,2112,"2112-04-17","2112-03-02"]
[null,null,null,null,null,2113,"2113-04-02","2113-02-15"]
[null,null,null,null,null,2114,"2114-04-22","2114-03-07"]
[null,null,null,null,null,2115,"2115-04-14","2115-02-27"]
[null,null,null,null,null,2116,"2116-03-29","2116-02-12"]
[null,null,null,null,null,2117,"2117-04-18","2117-03-03"]
[null,null,null,null,null,2118,"2118-04-10","2118-02-23"]
[null,null,null,null,null,2119,"2119-03-26","2119-02-08"]
[null,null,null,null,null,2120,"2120-04-14","2120-02-28"]
[null,null,null,null,null,2121,"2121-04-06","2121-02-19"]
[null,null,null,null,null,2122,"2122-03-29","2122-02-11"]