{"text_format":"1","workbook":"xlsx","n_sheets":4,"sheets":["Planning","CODETTH","Feuil4","Feuil1"],"not_rendered":{"charts":0,"images":0,"macros":1,"external_links":0,"defined_names":7,"comments":1,"pivot_tables":0},"unopened":[],"bounds":{"document_bytes":16777216,"sheet_cells":100000,"rows_first":2000,"rows_last":500,"rows_between":2000,"halvings":0,"cell_chars":16384,"cell_head_chars":4096},"cells_cut":0,"cells_raw":0,"read":"whole","date_system":"1900"}

{"sheet":"Planning","index":0,"n_rows":44,"n_cols":355,"rows_kept":44,"cut":false,"hidden":false,"merged":[[35,30,35,53],[33,30,33,53],[43,24,43,28],[29,5,29,28],[27,5,27,28],[37,5,37,28],[39,5,39,28],[41,5,41,28],[25,5,25,28],[31,5,31,28],[33,5,33,28],[35,5,35,28],[22,1,22,3],[24,1,24,4],[23,1,23,4],[34,1,34,4],[41,55,41,78],[31,80,31,103],[37,105,37,128],[39,105,39,128],[33,55,33,78],[35,80,35,103],[37,80,37,103],[39,80,39,103],[41,80,41,103],[25,1,28,4],[29,1,31,2],[35,1,38,4],[39,1,41,2],[32,1,33,4],[27,30,27,53],[29,30,29,53],[41,30,41,53],[31,30,31,53],[39,30,39,53],[37,30,37,53],[19,5,19,28],[25,55,25,78],[19,105,19,128],[19,30,19,53],[19,55,19,78],[19,80,19,103],[23,55,23,78],[25,80,25,103],[23,80,23,103],[23,105,23,128],[25,105,25,128],[21,30,21,53],[21,5,21,28],[21,55,21,78],[21,80,21,103],[21,105,21,128],[22,105,22,128],[22,30,22,53],[22,5,22,28],[23,5,23,28],[23,30,23,53],[25,30,25,53],[21,155,21,178],[22,155,22,178],[27,55,27,78],[29,55,29,78],[21,130,21,153],[23,130,23,153],[27,80,27,103],[29,80,29,103],[23,155,23,178],[25,155,25,178],[27,155,27,178],[27,105,27,128],[29,105,29,128],[25,130,25,153],[27,130,27,153],[29,130,29,153],[29,155,29,178],[31,155,31,178],[39,155,39,178],[37,155,37,178],[35,155,35,178],[33,155,33,178],[41,155,41,178],[22,55,22,78],[22,80,22,103],[31,55,31,78],[35,55,35,78],[31,105,31,128],[35,105,35,128],[33,80,33,103],[33,105,33,128],[31,130,31,153],[37,130,37,153],[39,130,39,153],[41,130,41,153],[35,130,35,153],[33,130,33,153],[41,105,41,128],[37,55,37,78],[39,55,39,78],[22,130,22,153],[21,305,21,328],[21,330,21,353],[22,180,22,203],[22,205,22,228],[22,230,22,253],[22,255,22,278],[22,280,22,303],[22,305,22,328],[22,330,22,353],[21,180,21,203],[21,205,21,228],[21,230,21,253],[21,255,21,278],[21,280,21,303],[23,305,23,328],[23,330,23,353],[25,180,25,203],[25,205,25,228],[25,230,25,253],[25,255,25,278],[25,280,25,303],[25,305,25,328],[25,330,25,353],[23,180,23,203],[23,205,23,228],[23,230,23,253],[23,255,23,278],[23,280,23,303],[27,305,27,328],[27,330,27,353],[29,180,29,203],[29,205,29,228],[29,230,29,253],[29,255,29,278],[29,280,29,303],[29,305,29,328],[29,330,29,353],[27,180,27,203],[27,205,27,228],[27,230,27,253],[27,255,27,278],[27,280,27,303],[35,230,35,253],[35,255,35,278],[35,280,35,303],[31,305,31,328],[31,330,31,353],[33,180,33,203],[33,205,33,228],[33,230,33,253],[33,255,33,278],[33,280,33,303],[33,305,33,328],[33,330,33,353],[31,180,31,203],[31,205,31,228],[31,230,31,253],[31,255,31,278],[31,280,31,303],[35,305,35,328],[35,330,35,353],[21,355,21,378],[37,205,37,228],[37,230,37,253],[37,255,37,278],[37,280,37,303],[39,305,39,328],[39,330,39,353],[41,180,41,203],[41,205,41,228],[41,230,41,253],[41,255,41,278],[41,280,41,303],[41,305,41,328],[41,330,41,353],[39,180,39,203],[39,205,39,228],[39,230,39,253],[39,255,39,278],[39,280,39,303],[37,305,37,328],[37,330,37,353],[37,180,37,203],[35,180,35,203],[35,205,35,228]]}
[]
[]
["c_noms","D_nom_","L_noms"]
["=Feuil1!$B$2:$B$159","=Feuil1!$B$2","=DECALER(d_nom;0;0;NBVAL(c_nom)-1;1)"]
["=CODETTH!$A:$A","=CODETTH!$A$3","=DECALER(d_noms;0;0;NBVAL(c_noms)-1;1)"]
["=CODETTH!$A$3:$A$30","=CODETTH!$A$3","=DECALER(d_noms;0;0;NBVAL(c_noms);1)"]
[]
[]
["=SI($F$24<>\"\";DECALER(d_noms;EQUIV($F$24&\"*\";l_noms;0)-1;;SOMMEPROD((STXT(l_noms;1;NBCAR($F$24))=TEXTE($F$24;\"0\"))*1));l_noms)"]
["=SI(f26<>\"\";DECALER(d_noms;EQUIV(f26&\"*\";l_noms;0)-1;;SOMMEPROD((STXT(l_noms;1;NBCAR(f26))=TEXTE(f26;\"0\"))*1));l_noms)"]
[]
[]
[]
[]
[]
[]
[]
[]
[]
[null,null,null,null,null,{"$f":"IF(ma_cellule=F23,\"MAINTENANCE\",\"\")","v":""},null,null,null,null,null,null,null,null,null,null,null,null,null,null,null,null,null,null,null,null,null,null,null,null,{"$f":"IF(ma_cellule=AE23,\"MAINTENANCE\",\"\")","v":""},null,null,null,null,null,null,null,null,null,null,null,null,null,null,null,null,null,null,null,null,null,null,null,null,{"$f":"IF(ma_cellule=BD23,\"MAINTENANCE\",\"\")","v":""},null,null,null,null,null,null,null,null,null,null,null,null,null,null,null,null,null,null,null,null,null,null,null,null,{"$f":"IF(ma_cellule=CC23,\"MAINTENANCE\",\"\")","v":""},null,null,null,null,null,null,null,null,null,null,null,null,null,null,null,null,null,null,null,null,null,null,null,null,{"$f":"IF(ma_cellule=DB23,\"MAINTENANCE\",\"\")","v":""}]
[]
[null,null,null,null,null,"Lundi",null,null,null,null,null,null,null,null,null,null,null,null,null,null,null,null,null,null,null,null,null,null,null,null,"Mardi",null,null,null,null,null,null,null,null,null,null,null,null,null,null,null,null,null,null,null,null,null,null,null,null,"Mercredi",null,null,null,null,null,null,null,null,null,null,null,null,null,null,null,null,null,null,null,null,null,null,null,null,"Jeudi",null,null,null,null,null,null,null,null,null,null,null,null,null,null,null,null,null,null,null,null,null,null,null,null,"Vendredi",null,null,null,null,null,null,null,null,null,null,null,null,null,null,null,null,null,null,null,null,null,null,null,null,"Samedi",null,null,null,null,null,null,null,null,null,null,null,null,null,null,null,null,null,null,null,null,null,null,null,null,"Dimanche",null,null,null,null,null,null,null,null,null,null,null,null,null,null,null,null,null,null,null,null,null,null,null,null,"Lundi",null,null,null,null,null,null,null,null,null,null,null,null,null,null,null,null,null,null,null,null,null,null,null,null,"Mardi",null,null,null,null,null,null,null,null,null,null,null,null,null,null,null,null,null,null,null,null,null,null,null,null,"Mercredi",null,null,null,null,null,null,null,null,null,null,null,null,null,null,null,null,null,null,null,null,null,null,null,null,"Jeudi",null,null,null,null,null,null,null,null,null,null,null,null,null,null,null,null,null,null,null,null,null,null,null,null,"Vendredi",null,null,null,null,null,null,null,null,null,null,null,null,null,null,null,null,null,null,null,null,null,null,null,null,"Samedi",null,null,null,null,null,null,null,null,null,null,null,null,null,null,null,null,null,null,null,null,null,null,null,null,"Dimanche"]
[null,"N.Semaine",null,null,{"$f":"INT(MOD(INT((F23-2)/7)+0.6,52+5/28))+1","v":22},"2015-05-25",null,null,null,null,null,null,null,null,null,null,null,null,null,null,null,null,null,null,null,null,null,null,null,"DUREE TOTAL",{"$f":"F23+1","v":"2015-05-26"},null,null,null,null,null,null,null,null,null,null,null,null,null,null,null,null,null,null,null,null,null,null,null,"DUREE TOTAL",{"$f":"AE23+1","v":"2015-05-27"},null,null,null,null,null,null,null,null,null,null,null,null,null,null,null,null,null,null,null,null,null,null,null,"DUREE TOTAL",{"$f":"BD23+1","v":"2015-05-28"},null,null,null,null,null,null,null,null,null,null,null,null,null,null,null,null,null,null,null,null,null,null,null,"DUREE TOTAL",{"$f":"CC23+1","v":"2015-05-29"},null,null,null,null,null,null,null,null,null,null,null,null,null,null,null,null,null,null,null,null,null,null,null,"DUREE TOTAL",{"$f":"DB23+1","v":"2015-05-30"},null,null,null,null,null,null,null,null,null,null,null,null,null,null,null,null,null,null,null,null,null,null,null,"DUREE TOTAL",{"$f":"EA23+1","v":"2015-05-31"},null,null,null,null,null,null,null,null,null,null,null,null,null,null,null,null,null,null,null,null,null,null,null,"DUREE TOTAL","2015-06-01",null,null,null,null,null,null,null,null,null,null,null,null,null,null,null,null,null,null,null,null,null,null,null,"DUREE TOTAL","2015-06-02",null,null,null,null,null,null,null,null,null,null,null,null,null,null,null,null,null,null,null,null,null,null,null,"DUREE TOTAL","2015-06-03",null,null,null,null,null,null,null,null,null,null,null,null,null,null,null,null,null,null,null,null,null,null,null,"DUREE TOTAL","2015-06-04",null,null,null,null,null,null,null,null,null,null,null,null,null,null,null,null,null,null,null,null,null,null,null,"DUREE TOTAL","2015-06-05",null,null,null,null,null,null,null,null,null,null,null,null,null,null,null,null,null,null,null,null,null,null,null,"DUREE TOTAL","2015-06-06",null,null,null,null,null,null,null,null,null,null,null,null,null,null,null,null,null,null,null,null,null,null,null,"DUREE TOTAL","2015-06-07",null,null,null,null,null,null,null,null,null,null,null,null,null,null,null,null,null,null,null,null,null,null,null,"DUREE TOTAL"]
[null,null,null,null,null,"TTH00001-02-11-2553",null,null,null,null,null,null,null,null,null,null,null,null,null,null,null,null,null,null,null,null,null,null,null,{"$f":"VLOOKUP(F24,CODETTH!A3:B30,2,FALSE)","v":12},"PAS DE PIECES",null,null,null,null,null,null,null,null,null,null,null,null,null,null,null,null,null,null,null,null,null,null,null,{"$f":"VLOOKUP(AE24,$A$7:$B$17,2)","v":0},"TTH00275-12-01-0110",null,null,null,null,null,null,null,null,null,null,null,null,null,null,null,null,null,null,null,null,null,null,null,{"$f":"VLOOKUP(BD24,$A$7:$B$17,2)","v":0},"TTH00275-12-01-0105",null,null,null,null,null,null,null,null,null,null,null,null,null,null,null,null,null,null,null,null,null,null,null,{"$f":"VLOOKUP(CC24,$A$7:$B$17,2)","v":0},"TTH00273-09-11-0061",null,null,null,null,null,null,null,null,null,null,null,null,null,null,null,null,null,null,null,null,null,null,null,{"$f":"VLOOKUP(DB24,$A$7:$B$17,2)","v":0},"TTH00273-09-11-0061",null,null,null,null,null,null,null,null,null,null,null,null,null,null,null,null,null,null,null,null,null,null,null,{"$f":"VLOOKUP(EA24,$A$7:$B$17,2)","v":0},"TTH00274-12-01-0125",null,null,null,null,null,null,null,null,null,null,null,null,null,null,null,null,null,null,null,null,null,null,null,{"$f":"VLOOKUP(EZ24,$A$7:$B$17,2)","v":0},"TTH00275-12-01-0105",null,null,null,null,null,null,null,null,null,null,null,null,null,null,null,null,null,null,null,null,null,null,null,{"$f":"VLOOKUP(FY24,A7:B17,2)","v":0},"TTH00275-09-01-5761",null,null,null,null,null,null,null,null,null,null,null,null,null,null,null,null,null,null,null,null,null,null,null,{"$f":"VLOOKUP(GX24,$A$7:$B$17,2)","v":0},"TTH00275-12-01-0110",null,null,null,null,null,null,null,null,null,null,null,null,null,null,null,null,null,null,null,null,null,null,null,{"$f":"VLOOKUP(HW24,$A$7:$B$17,2)","v":0},"TTH00275-12-01-0105",null,null,null,null,null,null,null,null,null,null,null,null,null,null,null,null,null,null,null,null,null,null,null,{"$f":"VLOOKUP(IV24,$A$7:$B$17,2)","v":0},"TTH00273-09-11-0061",null,null,null,null,null,null,null,null,null,null,null,null,null,null,null,null,null,null,null,null,null,null,null,{"$f":"VLOOKUP(JU24,$A$7:$B$17,2)","v":0},"TTH00275-09-01-5761",null,null,null,null,null,null,null,null,null,null,null,null,null,null,null,null,null,null,null,null,null,null,null,{"$f":"VLOOKUP(KT24,$A$7:$B$17,2)","v":0},"TTH00275-12-21-0105",null,null,null,null,null,null,null,null,null,null,null,null,null,null,null,null,null,null,null,null,null,null,null,{"$f":"VLOOKUP(LS24,$A$7:$B$17,2)","v":0}]
[null,"Plage horaire",null,null,null,1,2,3,4,5,6,7,8,9,10,11,12,13,14,15,16,17,18,19,20,21,22,23,24,null,1,2,3,4,5,6,7,8,9,10,11,12,13,14,15,16,17,18,19,20,21,22,23,24,null,1,2,3,4,5,6,7,8,9,10,11,12,13,14,15,16,17,18,19,20,21,22,23,24,null,1,2,3,4,5,6,7,8,9,10,11,12,13,14,15,16,17,18,19,20,21,22,23,24,null,1,2,3,4,5,6,7,8,9,10,11,12,13,14,15,16,17,18,19,20,21,22,23,24,null,1,2,3,4,5,6,7,8,9,10,11,12,13,14,15,16,17,18,19,20,21,22,23,24,null,1,2,3,4,5,6,7,8,9,10,11,12,13,14,15,16,17,18,19,20,21,22,23,24,null,1,2,3,4,5,6,7,8,9,10,11,12,13,14,15,16,17,18,19,20,21,22,23,24,null,1,2,3,4,5,6,7,8,9,10,11,12,13,14,15,16,17,18,19,20,21,22,23,24,null,1,2,3,4,5,6,7,8,9,10,11,12,13,14,15,16,17,18,19,20,21,22,23,24,null,1,2,3,4,5,6,7,8,9,10,11,12,13,14,15,16,17,18,19,20,21,22,23,24,null,1,2,3,4,5,6,7,8,9,10,11,12,13,14,15,16,17,18,19,20,21,22,23,24,null,1,2,3,4,5,6,7,8,9,10,11,12,13,14,15,16,17,18,19,20,21,22,23,24,null,1,2,3,4,5,6,7,8,9,10,11,12,13,14,15,16,17,18,19,20,21,22,23,24]
[null,null,null,null,null,"Pas de pièce",null,null,null,null,null,null,null,null,null,null,null,null,null,null,null,null,null,null,null,null,null,null,null,{"$f":"VLOOKUP(F26,CODETTH!A2:B30,2,FALSE)","v":0},"PAS DE PIECES",null,null,null,null,null,null,null,null,null,null,null,null,null,null,null,null,null,null,null,null,null,null,null,{"$f":"VLOOKUP(AE26,$A$7:$B$17,2)","v":0},"TTH00275-12-01-0105",null,null,null,null,null,null,null,null,null,null,null,null,null,null,null,null,null,null,null,null,null,null,null,{"$f":"VLOOKUP(BD26,$A$7:$B$17,2)","v":0},"TTH00273-09-11-0061",null,null,null,null,null,null,null,null,null,null,null,null,null,null,null,null,null,null,null,null,null,null,null,{"$f":"VLOOKUP(CC26,$A$7:$B$17,2)","v":0},"TTH00273-09-11-0061",null,null,null,null,null,null,null,null,null,null,null,null,null,null,null,null,null,null,null,null,null,null,null,{"$f":"VLOOKUP(DB26,$A$7:$B$17,2)","v":0},"TTH00273-09-11-0061",null,null,null,null,null,null,null,null,null,null,null,null,null,null,null,null,null,null,null,null,null,null,null,{"$f":"VLOOKUP(EA26,$A$7:$B$17,2)","v":0},"TTH00275-09-01-5761",null,null,null,null,null,null,null,null,null,null,null,null,null,null,null,null,null,null,null,null,null,null,null,{"$f":"VLOOKUP(EZ26,$A$7:$B$17,2)","v":0},"TTH00275-09-01-5761",null,null,null,null,null,null,null,null,null,null,null,null,null,null,null,null,null,null,null,null,null,null,null,{"$f":"VLOOKUP(FY26,$A$7:$B$17,2)","v":0},"TTH00273-12-01-0110",null,null,null,null,null,null,null,null,null,null,null,null,null,null,null,null,null,null,null,null,null,null,null,{"$f":"VLOOKUP(GX26,$A$7:$B$17,2)","v":0},"TTH00275-12-01-0105",null,null,null,null,null,null,null,null,null,null,null,null,null,null,null,null,null,null,null,null,null,null,null,{"$f":"VLOOKUP(HW26,$A$7:$B$17,2)","v":0},"TTH00273-09-11-0061",null,null,null,null,null,null,null,null,null,null,null,null,null,null,null,null,null,null,null,null,null,null,null,{"$f":"VLOOKUP(IV26,$A$7:$B$17,2)","v":0},"TTH00273-09-11-0061",null,null,null,null,null,null,null,null,null,null,null,null,null,null,null,null,null,null,null,null,null,null,null,{"$f":"VLOOKUP(JU26,$A$7:$B$17,2)","v":0},"TTH00273-09-11-0061",null,null,null,null,null,null,null,null,null,null,null,null,null,null,null,null,null,null,null,null,null,null,null,{"$f":"VLOOKUP(KT26,$A$7:$B$17,2)","v":0},"TTH00273-09-11-0061",null,null,null,null,null,null,null,null,null,null,null,null,null,null,null,null,null,null,null,null,null,null,null,{"$f":"VLOOKUP(LS26,$A$7:$B$17,2)","v":0}]
[null,null,null,null,null,1,2,3,4,5,6,7,8,9,10,11,12,13,14,15,16,17,18,19,20,21,22,23,24,null,1,2,3,4,5,6,7,8,9,10,11,12,13,14,15,16,17,18,19,20,21,22,23,24,null,1,2,3,4,5,6,7,8,9,10,11,12,13,14,15,16,17,18,19,20,21,22,23,24,null,1,2,3,4,5,6,7,8,9,10,11,12,13,14,15,16,17,18,19,20,21,22,23,24,null,1,2,3,4,5,6,7,8,9,10,11,12,13,14,15,16,17,18,19,20,21,22,23,24,null,1,2,3,4,5,6,7,8,9,10,11,12,13,14,15,16,17,18,19,20,21,22,23,24,null,1,2,3,4,5,6,7,8,9,10,11,12,13,14,15,16,17,18,19,20,21,22,23,24,null,1,2,3,4,5,6,7,8,9,10,11,12,13,14,15,16,17,18,19,20,21,22,23,24,null,1,2,3,4,5,6,7,8,9,10,11,12,13,14,15,16,17,18,19,20,21,22,23,24,null,1,2,3,4,5,6,7,8,9,10,11,12,13,14,15,16,17,18,19,20,21,22,23,24,null,1,2,3,4,5,6,7,8,9,10,11,12,13,14,15,16,17,18,19,20,21,22,23,24,null,1,2,3,4,5,6,7,8,9,10,11,12,13,14,15,16,17,18,19,20,21,22,23,24,null,1,2,3,4,5,6,7,8,9,10,11,12,13,14,15,16,17,18,19,20,21,22,23,24,null,1,2,3,4,5,6,7,8,9,10,11,12,13,14,15,16,17,18,19,20,21,22,23,24]
[null,null,null,null,null,"Pas de pièce",null,null,null,null,null,null,null,null,null,null,null,null,null,null,null,null,null,null,null,null,null,null,null,{"$f":"VLOOKUP(premiereCelluleApresTableau,CODETTH!A3:D30,2,FALSE)","v":0},"TTH00273-09-11-0061",null,null,null,null,null,null,null,null,null,null,null,null,null,null,null,null,null,null,null,null,null,null,null,{"$f":"VLOOKUP(AE28,$A$7:$B$17,2)","v":0},"TTH00275-09-01-5761",null,null,null,null,null,null,null,null,null,null,null,null,null,null,null,null,null,null,null,null,null,null,null,{"$f":"VLOOKUP(BD28,$A$7:$B$17,2)","v":0},"TTH00273-09-11-0061",null,null,null,null,null,null,null,null,null,null,null,null,null,null,null,null,null,null,null,null,null,null,null,{"$f":"VLOOKUP(CC28,$A$7:$B$17,2)","v":0},"TTH00273-09-11-0061",null,null,null,null,null,null,null,null,null,null,null,null,null,null,null,null,null,null,null,null,null,null,null,{"$f":"VLOOKUP(DB28,$A$7:$B$17,2)","v":0},"TTH00275-12-01-0110",null,null,null,null,null,null,null,null,null,null,null,null,null,null,null,null,null,null,null,null,null,null,null,{"$f":"VLOOKUP(EA28,$A$7:$B$17,2)","v":0},"TTH00273-09-11-0061",null,null,null,null,null,null,null,null,null,null,null,null,null,null,null,null,null,null,null,null,null,null,null,{"$f":"VLOOKUP(EZ28,$A$7:$B$17,2)","v":0},"TTH00275-09-01-5761",null,null,null,null,null,null,null,null,null,null,null,null,null,null,null,null,null,null,null,null,null,null,null,{"$f":"VLOOKUP(premiereCelluleApresTableau,$A$8:$B$17,2)","v":0},"TTH00275-09-01-5761",null,null,null,null,null,null,null,null,null,null,null,null,null,null,null,null,null,null,null,null,null,null,null,{"$f":"VLOOKUP(GX28,$A$7:$B$17,2)","v":0},"TTH00275-09-01-5761",null,null,null,null,null,null,null,null,null,null,null,null,null,null,null,null,null,null,null,null,null,null,null,{"$f":"VLOOKUP(HW28,$A$7:$B$17,2)","v":0},"TTH00273-09-11-0061",null,null,null,null,null,null,null,null,null,null,null,null,null,null,null,null,null,null,null,null,null,null,null,{"$f":"VLOOKUP(IV28,$A$7:$B$17,2)","v":0},"TTH00273-09-11-0061",null,null,null,null,null,null,null,null,null,null,null,null,null,null,null,null,null,null,null,null,null,null,null,{"$f":"VLOOKUP(JU28,$A$7:$B$17,2)","v":0},"TTH00275-12-01-0110",null,null,null,null,null,null,null,null,null,null,null,null,null,null,null,null,null,null,null,null,null,null,null,{"$f":"VLOOKUP(KT28,$A$7:$B$17,2)","v":0},"TTH00273-09-11-0061",null,null,null,null,null,null,null,null,null,null,null,null,null,null,null,null,null,null,null,null,null,null,null,{"$f":"VLOOKUP(LS28,$A$7:$B$17,2)","v":0}]
[null,null,null,null,null,1,2,3,4,5,6,7,8,9,10,11,12,13,14,15,16,17,18,19,20,21,22,23,24,"J+1",1,2,3,4,5,6,7,8,9,10,11,12,13,14,15,16,17,18,19,20,21,22,23,24,null,1,2,3,4,5,6,7,8,9,10,11,12,13,14,15,16,17,18,19,20,21,22,23,24,null,1,2,3,4,5,6,7,8,9,10,11,12,13,14,15,16,17,18,19,20,21,22,23,24,null,1,2,3,4,5,6,7,8,9,10,11,12,13,14,15,16,17,18,19,20,21,22,23,24,null,1,2,3,4,5,6,7,8,9,10,11,12,13,14,15,16,17,18,19,20,21,22,23,24,null,1,2,3,4,5,6,7,8,9,10,11,12,13,14,15,16,17,18,19,20,21,22,23,24,null,1,2,3,4,5,6,7,8,9,10,11,12,13,14,15,16,17,18,19,20,21,22,23,24,null,1,2,3,4,5,6,7,8,9,10,11,12,13,14,15,16,17,18,19,20,21,22,23,24,null,1,2,3,4,5,6,7,8,9,10,11,12,13,14,15,16,17,18,19,20,21,22,23,24,null,1,2,3,4,5,6,7,8,9,10,11,12,13,14,15,16,17,18,19,20,21,22,23,24,null,1,2,3,4,5,6,7,8,9,10,11,12,13,14,15,16,17,18,19,20,21,22,23,24,null,1,2,3,4,5,6,7,8,9,10,11,12,13,14,15,16,17,18,19,20,21,22,23,24,null,1,2,3,4,5,6,7,8,9,10,11,12,13,14,15,16,17,18,19,20,21,22,23,24]
[null,null,null,"27/05/2015",null,"Pas de pièce",null,null,null,null,null,null,null,null,null,null,null,null,null,null,null,null,null,null,null,null,null,null,null,{"$f":"VLOOKUP(F30,CODETTH!A3:D30,2,FALSE)","v":0},"TTH00273-09-11-0061",null,null,null,null,null,null,null,null,null,null,null,null,null,null,null,null,null,null,null,null,null,null,null,{"$f":"VLOOKUP(AE30,$A$7:$B$17,2)","v":0},"TTH00273-09-11-0061",null,null,null,null,null,null,null,null,null,null,null,null,null,null,null,null,null,null,null,null,null,null,null,{"$f":"VLOOKUP(BD30,$A$7:$B$17,2)","v":0},"TTH00273-09-11-0061",null,null,null,null,null,null,null,null,null,null,null,null,null,null,null,null,null,null,null,null,null,null,null,{"$f":"VLOOKUP(CC30,$A$7:$B$17,2)","v":0},"TTH00273-09-11-0061",null,null,null,null,null,null,null,null,null,null,null,null,null,null,null,null,null,null,null,null,null,null,null,{"$f":"VLOOKUP(DB30,$A$7:$B$17,2)","v":0},"TTH00273-09-11-0061",null,null,null,null,null,null,null,null,null,null,null,null,null,null,null,null,null,null,null,null,null,null,null,{"$f":"VLOOKUP(EA30,$A$7:$B$17,2)","v":0},"PAS DE PIECES",null,null,null,null,null,null,null,null,null,null,null,null,null,null,null,null,null,null,null,null,null,null,null,{"$f":"VLOOKUP(EZ30,$A$7:$B$17,2)","v":0},"TTH00273-09-11-0061",null,null,null,null,null,null,null,null,null,null,null,null,null,null,null,null,null,null,null,null,null,null,null,{"$f":"VLOOKUP(FY30,$A$7:$B$17,2)","v":0},"TTH00273-09-11-0061",null,null,null,null,null,null,null,null,null,null,null,null,null,null,null,null,null,null,null,null,null,null,null,{"$f":"VLOOKUP(GX30,$A$7:$B$17,2)","v":0},"TTH00273-09-11-0061",null,null,null,null,null,null,null,null,null,null,null,null,null,null,null,null,null,null,null,null,null,null,null,{"$f":"VLOOKUP(HW30,$A$7:$B$17,2)","v":0},"TTH00273-09-11-0061",null,null,null,null,null,null,null,null,null,null,null,null,null,null,null,null,null,null,null,null,null,null,null,{"$f":"VLOOKUP(IV30,$A$7:$B$17,2)","v":0},"TTH00273-09-11-0061",null,null,null,null,null,null,null,null,null,null,null,null,null,null,null,null,null,null,null,null,null,null,null,{"$f":"VLOOKUP(JU30,$A$7:$B$17,2)","v":0},"TTH00273-09-11-0061",null,null,null,null,null,null,null,null,null,null,null,null,null,null,null,null,null,null,null,null,null,null,null,{"$f":"VLOOKUP(KT30,$A$7:$B$17,2)","v":0},"PAS DE PIECES",null,null,null,null,null,null,null,null,null,null,null,null,null,null,null,null,null,null,null,null,null,null,null,{"$f":"VLOOKUP(LS30,$A$7:$B$17,2)","v":0}]
{"$rows_left_out":15}
{"sheet":"CODETTH","index":1,"n_rows":30,"n_cols":7,"rows_kept":30,"cut":false,"hidden":false,"merged":[]}
[]
["TTH","TPS reel","TEMPS",null,"INDICE","Matière","T°"]
["Pas de pièce",0,0]
["TTH00001-02-11-2553",{"$f":"C4+4","v":12},8,null,0,null,610]
["TTH00002-09-01-0030",{"$f":"C5+4","v":6},2,null,0,null,590]
["TTH00002-12-01-6618",5,0.3,null,0,null,970]
["TTH00003-02-01-0040",{"$f":"C7+4","v":8},4,null,0,null,610]
["TTH00114-02-11-0030",6,2,null,0,null,525]
["TTH00115-02-21-0030",6,2,null,0,null,550]
["TTH00172-02-01-0025",5,1,null,0,null,625]
["TTH00172-02-01-6025",5,1,null,0,null,625]
["TTH00172-09-01-0025",5,1,null,0,null,650]
["TTH00172-09-41-0025",5,1,null,0,null,725]
["TTH00172-12-01-5214",5,0.2,null,0,null,975]
["TTH00174-07-01-0020",5,0.45,null,0,null,875]
["TTH00174-07-01-0028",6,1.45,null,0,null,875]
["TTH00174-09-01-0027",6,1.3,null,0,null,550]
["TTH00174-09-01-0032",7,2.2999999999999998,null,0,null,550]
["TTH00174-09-41-0025",{"$f":"C19+4","v":5},1,null,0,null,670]
["TTH00176-02-01-0040",{"$f":"C20+4","v":8},4,null,0,null,550]
["TTH00200-12-01-0105",5,0.5,null,0,null,1080]
["TTH00210-09-21-0027",6,1.3,null,0,null,560]
["TTH00210-09-31-0027",6,1.3,null,0,null,760]
["TTH00210-12-11-0105",5,0.5,null,0,null,1065]
["TTH00212-02-01-0040",{"$f":"C25+4","v":8},4,null,0,null,705]
["TTH00215-02-01-0025",{"$f":"C26+4","v":5},1,null,0,null,600]
["TTH00222-12-01-0105",5,0.5,null,0,null,1160]
["TTH00225-12-11-0118",5,0.3,null,0,null,1100]
["TTH00229-01-11-0030",{"$f":"C29+4","v":6},2,null,0,null,610]
["TTH00229-02-41-0030",{"$f":"C30+4","v":6},2,null,0,null,590]
{"$rows_left_out":1}
{"sheet":"Feuil4","index":2,"n_rows":0,"n_cols":0,"rows_kept":0,"cut":false,"hidden":false,"merged":[]}

{"sheet":"Feuil1","index":3,"n_rows":0,"n_cols":0,"rows_kept":0,"cut":false,"hidden":false,"merged":[]}