{"text_format":"1","workbook":"xlsx","n_sheets":3,"sheets":["BdD","Virement","Autres"],"not_rendered":{"charts":0,"images":0,"macros":0,"external_links":0,"defined_names":2,"comments":0,"pivot_tables":0},"unopened":[],"bounds":{"document_bytes":16777216,"sheet_cells":100000,"rows_first":2000,"rows_last":500,"rows_between":2000,"halvings":0,"cell_chars":16384,"cell_head_chars":4096},"cells_cut":0,"cells_raw":0,"read":"whole","date_system":"1900"}

{"sheet":"BdD","index":0,"n_rows":1093,"n_cols":24,"rows_kept":1093,"cut":false,"hidden":false,"merged":[]}
[]
[]
[null,null,null,null,null,null,null,null,null,null,null,null,null,null,null,null,null,null,null,null,null,null,"liste évolutive nommée VIR","liste évolutive nommée AUT"]
[]
[]
[]
[null,null,null,null,null,null,null,null,null,null,null,null,null,null,null,null,null,null,null,null,null,"CODE","Liste Virement","Listes autres"]
["2015-12-03","Virement__AA66",null,null,null,null,null,null,null,null,null,null,null,null,null,null,null,null,null,null,null,{"$f":"IF(COUNTIF(B8,\"*Virement*\"),\"VIR\"&COUNTIF($V$7:V7,\"VIR*\"),IF(COUNTIF($B$8:B8,B8)=1,\"AUT\"&COUNTIF($V$7:V7,\"AUT*\"),\"\"))","v":"VIR0"},{"$f":"IFERROR(INDEX($B:$B,MATCH(\"VIR\"&ROW()-8,$V:$V,0)),\"\")","v":"Virement__AA66"},{"$f":"IFERROR(INDEX($B:$B,MATCH(\"AUT\"&ROW()-8,$V:$V,0)),\"\")","v":"Lucas"}]
["2015-12-10","Virement__AA39",null,null,null,null,null,null,null,null,null,null,null,null,null,null,null,null,null,null,null,{"$f":"IF(COUNTIF(B9,\"*Virement*\"),\"VIR\"&COUNTIF($V$7:V8,\"VIR*\"),IF(COUNTIF($B$8:B9,B9)=1,\"AUT\"&COUNTIF($V$7:V8,\"AUT*\"),\"\"))","v":"VIR1"},{"$f":"IFERROR(INDEX(B:B,MATCH(\"VIR\"&ROW()-8,V:V,0)),\"\")","v":"Virement__AA39"},{"$f":"IFERROR(INDEX($B:$B,MATCH(\"AUT\"&ROW()-8,$V:$V,0)),\"\")","v":"Pierrette"}]
["2015-08-18","Lucas",null,null,null,null,null,null,null,null,null,null,null,null,null,null,null,null,null,null,null,{"$f":"IF(COUNTIF(B10,\"*Virement*\"),\"VIR\"&COUNTIF($V$7:V9,\"VIR*\"),IF(COUNTIF($B$8:B10,B10)=1,\"AUT\"&COUNTIF($V$7:V9,\"AUT*\"),\"\"))","v":"AUT0"},"Virement__AA78","Eric"]
["2015-09-15","Pierrette",null,null,null,null,null,null,null,null,null,null,null,null,null,null,null,null,null,null,null,{"$f":"IF(COUNTIF(B11,\"*Virement*\"),\"VIR\"&COUNTIF($V$7:V10,\"VIR*\"),IF(COUNTIF($B$8:B11,B11)=1,\"AUT\"&COUNTIF($V$7:V10,\"AUT*\"),\"\"))","v":"AUT1"},"Virement__AA43","Léa"]
["2015-06-06","Virement__AA78",null,null,null,null,null,null,null,null,null,null,null,null,null,null,null,null,null,null,null,{"$f":"IF(COUNTIF(B12,\"*Virement*\"),\"VIR\"&COUNTIF($V$7:V11,\"VIR*\"),IF(COUNTIF($B$8:B12,B12)=1,\"AUT\"&COUNTIF($V$7:V11,\"AUT*\"),\"\"))","v":"VIR2"},"Virement__AA42","Monique"]
["2015-06-29","Eric",null,null,null,null,null,null,null,null,null,null,null,null,null,null,null,null,null,null,null,{"$f":"IF(COUNTIF(B13,\"*Virement*\"),\"VIR\"&COUNTIF($V$7:V12,\"VIR*\"),IF(COUNTIF($B$8:B13,B13)=1,\"AUT\"&COUNTIF($V$7:V12,\"AUT*\"),\"\"))","v":"AUT2"},"Virement__AA14","Patrick"]
["2015-12-11","Léa",null,null,null,null,null,null,null,null,null,null,null,null,null,null,null,null,null,null,null,{"$f":"IF(COUNTIF(B14,\"*Virement*\"),\"VIR\"&COUNTIF($V$7:V13,\"VIR*\"),IF(COUNTIF($B$8:B14,B14)=1,\"AUT\"&COUNTIF($V$7:V13,\"AUT*\"),\"\"))","v":"AUT3"},"Virement__AA63","Chrystel"]
["2016-01-19","Monique",null,null,null,null,null,null,null,null,null,null,null,null,null,null,null,null,null,null,null,{"$f":"IF(COUNTIF(B15,\"*Virement*\"),\"VIR\"&COUNTIF($V$7:V14,\"VIR*\"),IF(COUNTIF($B$8:B15,B15)=1,\"AUT\"&COUNTIF($V$7:V14,\"AUT*\"),\"\"))","v":"AUT4"},"Virement__AA12","Philippe"]
["2015-11-24","Patrick",null,null,null,null,null,null,null,null,null,null,null,null,null,null,null,null,null,null,null,{"$f":"IF(COUNTIF(B16,\"*Virement*\"),\"VIR\"&COUNTIF($V$7:V15,\"VIR*\"),IF(COUNTIF($B$8:B16,B16)=1,\"AUT\"&COUNTIF($V$7:V15,\"AUT*\"),\"\"))","v":"AUT5"},"Virement__AA48","Eloide"]
["2016-01-26","Pierrette",null,null,null,null,null,null,null,null,null,null,null,null,null,null,null,null,null,null,null,{"$f":"IF(COUNTIF(B17,\"*Virement*\"),\"VIR\"&COUNTIF($V$7:V16,\"VIR*\"),IF(COUNTIF($B$8:B17,B17)=1,\"AUT\"&COUNTIF($V$7:V16,\"AUT*\"),\"\"))","v":""},"Virement__AA51","Simone"]
["2015-12-31","Léa",null,null,null,null,null,null,null,null,null,null,null,null,null,null,null,null,null,null,null,{"$f":"IF(COUNTIF(B18,\"*Virement*\"),\"VIR\"&COUNTIF($V$7:V17,\"VIR*\"),IF(COUNTIF($B$8:B18,B18)=1,\"AUT\"&COUNTIF($V$7:V17,\"AUT*\"),\"\"))","v":""},"Virement__AA64","André"]
["2015-10-11","Virement__AA43",null,null,null,null,null,null,null,null,null,null,null,null,null,null,null,null,null,null,null,{"$f":"IF(COUNTIF(B19,\"*Virement*\"),\"VIR\"&COUNTIF($V$7:V18,\"VIR*\"),IF(COUNTIF($B$8:B19,B19)=1,\"AUT\"&COUNTIF($V$7:V18,\"AUT*\"),\"\"))","v":"VIR3"},"Virement__AA71","Francette"]
["2015-11-19","Eric",null,null,null,null,null,null,null,null,null,null,null,null,null,null,null,null,null,null,null,{"$f":"IF(COUNTIF(B20,\"*Virement*\"),\"VIR\"&COUNTIF($V$7:V19,\"VIR*\"),IF(COUNTIF($B$8:B20,B20)=1,\"AUT\"&COUNTIF($V$7:V19,\"AUT*\"),\"\"))","v":""},"Virement__AA19","Jean-pierre"]
["2015-07-28","Pierrette",null,null,null,null,null,null,null,null,null,null,null,null,null,null,null,null,null,null,null,{"$f":"IF(COUNTIF(B21,\"*Virement*\"),\"VIR\"&COUNTIF($V$7:V20,\"VIR*\"),IF(COUNTIF($B$8:B21,B21)=1,\"AUT\"&COUNTIF($V$7:V20,\"AUT*\"),\"\"))","v":""},"Virement__AA40","Corinne"]
["2016-01-09","Chrystel",null,null,null,null,null,null,null,null,null,null,null,null,null,null,null,null,null,null,null,{"$f":"IF(COUNTIF(B22,\"*Virement*\"),\"VIR\"&COUNTIF($V$7:V21,\"VIR*\"),IF(COUNTIF($B$8:B22,B22)=1,\"AUT\"&COUNTIF($V$7:V21,\"AUT*\"),\"\"))","v":"AUT6"},"Virement__AA61","Ewan"]
["2015-11-26","Philippe",null,null,null,null,null,null,null,null,null,null,null,null,null,null,null,null,null,null,null,{"$f":"IF(COUNTIF(B23,\"*Virement*\"),\"VIR\"&COUNTIF($V$7:V22,\"VIR*\"),IF(COUNTIF($B$8:B23,B23)=1,\"AUT\"&COUNTIF($V$7:V22,\"AUT*\"),\"\"))","v":"AUT7"},"Virement__AA45","Renè"]
["2015-09-30","Virement__AA42",null,null,null,null,null,null,null,null,null,null,null,null,null,null,null,null,null,null,null,{"$f":"IF(COUNTIF(B24,\"*Virement*\"),\"VIR\"&COUNTIF($V$7:V23,\"VIR*\"),IF(COUNTIF($B$8:B24,B24)=1,\"AUT\"&COUNTIF($V$7:V23,\"AUT*\"),\"\"))","v":"VIR4"},"Virement__AA32","Madeleine"]
["2015-12-13","Virement__AA14",null,null,null,null,null,null,null,null,null,null,null,null,null,null,null,null,null,null,null,{"$f":"IF(COUNTIF(B25,\"*Virement*\"),\"VIR\"&COUNTIF($V$7:V24,\"VIR*\"),IF(COUNTIF($B$8:B25,B25)=1,\"AUT\"&COUNTIF($V$7:V24,\"AUT*\"),\"\"))","v":"VIR5"},"Virement__AA77","Michel"]
["2015-09-03","Eloide",null,null,null,null,null,null,null,null,null,null,null,null,null,null,null,null,null,null,null,{"$f":"IF(COUNTIF(B26,\"*Virement*\"),\"VIR\"&COUNTIF($V$7:V25,\"VIR*\"),IF(COUNTIF($B$8:B26,B26)=1,\"AUT\"&COUNTIF($V$7:V25,\"AUT*\"),\"\"))","v":"AUT8"},"Virement__AA38","Jaqueline"]
["2016-01-23","Monique",null,null,null,null,null,null,null,null,null,null,null,null,null,null,null,null,null,null,null,{"$f":"IF(COUNTIF(B27,\"*Virement*\"),\"VIR\"&COUNTIF($V$7:V26,\"VIR*\"),IF(COUNTIF($B$8:B27,B27)=1,\"AUT\"&COUNTIF($V$7:V26,\"AUT*\"),\"\"))","v":""},"Virement__AA28","Carla"]
["2015-09-26","Simone",null,null,null,null,null,null,null,null,null,null,null,null,null,null,null,null,null,null,null,{"$f":"IF(COUNTIF(B28,\"*Virement*\"),\"VIR\"&COUNTIF($V$7:V27,\"VIR*\"),IF(COUNTIF($B$8:B28,B28)=1,\"AUT\"&COUNTIF($V$7:V27,\"AUT*\"),\"\"))","v":"AUT9"},"Virement__AA04","Paul"]
["2015-10-28","André",null,null,null,null,null,null,null,null,null,null,null,null,null,null,null,null,null,null,null,{"$f":"IF(COUNTIF(B29,\"*Virement*\"),\"VIR\"&COUNTIF($V$7:V28,\"VIR*\"),IF(COUNTIF($B$8:B29,B29)=1,\"AUT\"&COUNTIF($V$7:V28,\"AUT*\"),\"\"))","v":"AUT10"},"Virement__AA34","Rémi"]
["2015-09-02","Virement__AA63",null,null,null,null,null,null,null,null,null,null,null,null,null,null,null,null,null,null,null,{"$f":"IF(COUNTIF(B30,\"*Virement*\"),\"VIR\"&COUNTIF($V$7:V29,\"VIR*\"),IF(COUNTIF($B$8:B30,B30)=1,\"AUT\"&COUNTIF($V$7:V29,\"AUT*\"),\"\"))","v":"VIR6"},"Virement__AA70","Anne-Marie"]
["2015-08-22","Virement__AA12",null,null,null,null,null,null,null,null,null,null,null,null,null,null,null,null,null,null,null,{"$f":"IF(COUNTIF(B31,\"*Virement*\"),\"VIR\"&COUNTIF($V$7:V30,\"VIR*\"),IF(COUNTIF($B$8:B31,B31)=1,\"AUT\"&COUNTIF($V$7:V30,\"AUT*\"),\"\"))","v":"VIR7"},"Virement__AA24","Marcel"]
["2015-11-18","Francette",null,null,null,null,null,null,null,null,null,null,null,null,null,null,null,null,null,null,null,{"$f":"IF(COUNTIF(B32,\"*Virement*\"),\"VIR\"&COUNTIF($V$7:V31,\"VIR*\"),IF(COUNTIF($B$8:B32,B32)=1,\"AUT\"&COUNTIF($V$7:V31,\"AUT*\"),\"\"))","v":"AUT11"},"Virement__AA47",""]
["2015-07-12","Simone",null,null,null,null,null,null,null,null,null,null,null,null,null,null,null,null,null,null,null,{"$f":"IF(COUNTIF(B33,\"*Virement*\"),\"VIR\"&COUNTIF($V$7:V32,\"VIR*\"),IF(COUNTIF($B$8:B33,B33)=1,\"AUT\"&COUNTIF($V$7:V32,\"AUT*\"),\"\"))","v":""},"Virement__AA22",""]
["2016-01-29","Pierrette",null,null,null,null,null,null,null,null,null,null,null,null,null,null,null,null,null,null,null,{"$f":"IF(COUNTIF(B34,\"*Virement*\"),\"VIR\"&COUNTIF($V$7:V33,\"VIR*\"),IF(COUNTIF($B$8:B34,B34)=1,\"AUT\"&COUNTIF($V$7:V33,\"AUT*\"),\"\"))","v":""},"Virement__AA06",""]
["2015-07-05","Patrick",null,null,null,null,null,null,null,null,null,null,null,null,null,null,null,null,null,null,null,{"$f":"IF(COUNTIF(B35,\"*Virement*\"),\"VIR\"&COUNTIF($V$7:V34,\"VIR*\"),IF(COUNTIF($B$8:B35,B35)=1,\"AUT\"&COUNTIF($V$7:V34,\"AUT*\"),\"\"))","v":""},"Virement__AA16",""]
["2015-05-24","Chrystel",null,null,null,null,null,null,null,null,null,null,null,null,null,null,null,null,null,null,null,{"$f":"IF(COUNTIF(B36,\"*Virement*\"),\"VIR\"&COUNTIF($V$7:V35,\"VIR*\"),IF(COUNTIF($B$8:B36,B36)=1,\"AUT\"&COUNTIF($V$7:V35,\"AUT*\"),\"\"))","v":""},"Virement__AA52",""]
["2015-05-23","Virement__AA48",null,null,null,null,null,null,null,null,null,null,null,null,null,null,null,null,null,null,null,{"$f":"IF(COUNTIF(B37,\"*Virement*\"),\"VIR\"&COUNTIF($V$7:V36,\"VIR*\"),IF(COUNTIF($B$8:B37,B37)=1,\"AUT\"&COUNTIF($V$7:V36,\"AUT*\"),\"\"))","v":"VIR8"},"Virement__AA27",""]
["2015-09-06","Virement__AA51",null,null,null,null,null,null,null,null,null,null,null,null,null,null,null,null,null,null,null,{"$f":"IF(COUNTIF(B38,\"*Virement*\"),\"VIR\"&COUNTIF($V$7:V37,\"VIR*\"),IF(COUNTIF($B$8:B38,B38)=1,\"AUT\"&COUNTIF($V$7:V37,\"AUT*\"),\"\"))","v":"VIR9"},"Virement__AA20",""]
["2015-09-08","Chrystel",null,null,null,null,null,null,null,null,null,null,null,null,null,null,null,null,null,null,null,{"$f":"IF(COUNTIF(B39,\"*Virement*\"),\"VIR\"&COUNTIF($V$7:V38,\"VIR*\"),IF(COUNTIF($B$8:B39,B39)=1,\"AUT\"&COUNTIF($V$7:V38,\"AUT*\"),\"\"))","v":""},"Virement__AA74",""]
["2015-08-13","André",null,null,null,null,null,null,null,null,null,null,null,null,null,null,null,null,null,null,null,{"$f":"IF(COUNTIF(B40,\"*Virement*\"),\"VIR\"&COUNTIF($V$7:V39,\"VIR*\"),IF(COUNTIF($B$8:B40,B40)=1,\"AUT\"&COUNTIF($V$7:V39,\"AUT*\"),\"\"))","v":""},"Virement__AA11",""]
["2015-06-08","Jean-pierre",null,null,null,null,null,null,null,null,null,null,null,null,null,null,null,null,null,null,null,{"$f":"IF(COUNTIF(B41,\"*Virement*\"),\"VIR\"&COUNTIF($V$7:V40,\"VIR*\"),IF(COUNTIF($B$8:B41,B41)=1,\"AUT\"&COUNTIF($V$7:V40,\"AUT*\"),\"\"))","v":"AUT12"},"Virement__AA46",""]
["2015-10-12","Virement__AA64",null,null,null,null,null,null,null,null,null,null,null,null,null,null,null,null,null,null,null,{"$f":"IF(COUNTIF(B42,\"*Virement*\"),\"VIR\"&COUNTIF($V$7:V41,\"VIR*\"),IF(COUNTIF($B$8:B42,B42)=1,\"AUT\"&COUNTIF($V$7:V41,\"AUT*\"),\"\"))","v":"VIR10"},"Virement__AA68",""]
["2015-08-29","Eloide",null,null,null,null,null,null,null,null,null,null,null,null,null,null,null,null,null,null,null,{"$f":"IF(COUNTIF(B43,\"*Virement*\"),\"VIR\"&COUNTIF($V$7:V42,\"VIR*\"),IF(COUNTIF($B$8:B43,B43)=1,\"AUT\"&COUNTIF($V$7:V42,\"AUT*\"),\"\"))","v":""},"Virement__AA29",""]
["2015-05-26","Corinne",null,null,null,null,null,null,null,null,null,null,null,null,null,null,null,null,null,null,null,{"$f":"IF(COUNTIF(B44,\"*Virement*\"),\"VIR\"&COUNTIF($V$7:V43,\"VIR*\"),IF(COUNTIF($B$8:B44,B44)=1,\"AUT\"&COUNTIF($V$7:V43,\"AUT*\"),\"\"))","v":"AUT13"},"Virement__AA50",""]
["2015-07-02","Ewan",null,null,null,null,null,null,null,null,null,null,null,null,null,null,null,null,null,null,null,{"$f":"IF(COUNTIF(B45,\"*Virement*\"),\"VIR\"&COUNTIF($V$7:V44,\"VIR*\"),IF(COUNTIF($B$8:B45,B45)=1,\"AUT\"&COUNTIF($V$7:V44,\"AUT*\"),\"\"))","v":"AUT14"},"Virement__AA21",""]
["2015-11-17","Pierrette",null,null,null,null,null,null,null,null,null,null,null,null,null,null,null,null,null,null,null,{"$f":"IF(COUNTIF(B46,\"*Virement*\"),\"VIR\"&COUNTIF($V$7:V45,\"VIR*\"),IF(COUNTIF($B$8:B46,B46)=1,\"AUT\"&COUNTIF($V$7:V45,\"AUT*\"),\"\"))","v":""},"Virement__AA31",""]
["2015-08-05","Virement__AA71",null,null,null,null,null,null,null,null,null,null,null,null,null,null,null,null,null,null,null,{"$f":"IF(COUNTIF(B47,\"*Virement*\"),\"VIR\"&COUNTIF($V$7:V46,\"VIR*\"),IF(COUNTIF($B$8:B47,B47)=1,\"AUT\"&COUNTIF($V$7:V46,\"AUT*\"),\"\"))","v":"VIR11"},"Virement__AA75",""]
["2015-12-20","Chrystel",null,null,null,null,null,null,null,null,null,null,null,null,null,null,null,null,null,null,null,{"$f":"IF(COUNTIF(B48,\"*Virement*\"),\"VIR\"&COUNTIF($V$7:V47,\"VIR*\"),IF(COUNTIF($B$8:B48,B48)=1,\"AUT\"&COUNTIF($V$7:V47,\"AUT*\"),\"\"))","v":""},"Virement__AA67",""]
["2015-08-04","Virement__AA19",null,null,null,null,null,null,null,null,null,null,null,null,null,null,null,null,null,null,null,{"$f":"IF(COUNTIF(B49,\"*Virement*\"),\"VIR\"&COUNTIF($V$7:V48,\"VIR*\"),IF(COUNTIF($B$8:B49,B49)=1,\"AUT\"&COUNTIF($V$7:V48,\"AUT*\"),\"\"))","v":"VIR12"},"Virement__AA60",""]
["2015-10-29","Léa",null,null,null,null,null,null,null,null,null,null,null,null,null,null,null,null,null,null,null,{"$f":"IF(COUNTIF(B50,\"*Virement*\"),\"VIR\"&COUNTIF($V$7:V49,\"VIR*\"),IF(COUNTIF($B$8:B50,B50)=1,\"AUT\"&COUNTIF($V$7:V49,\"AUT*\"),\"\"))","v":""},"Virement__AA55",""]
["2015-06-25","Virement__AA40",null,null,null,null,null,null,null,null,null,null,null,null,null,null,null,null,null,null,null,{"$f":"IF(COUNTIF(B51,\"*Virement*\"),\"VIR\"&COUNTIF($V$7:V50,\"VIR*\"),IF(COUNTIF($B$8:B51,B51)=1,\"AUT\"&COUNTIF($V$7:V50,\"AUT*\"),\"\"))","v":"VIR13"},"Virement__AA23",""]
["2015-06-17","Virement__AA61",null,null,null,null,null,null,null,null,null,null,null,null,null,null,null,null,null,null,null,{"$f":"IF(COUNTIF(B52,\"*Virement*\"),\"VIR\"&COUNTIF($V$7:V51,\"VIR*\"),IF(COUNTIF($B$8:B52,B52)=1,\"AUT\"&COUNTIF($V$7:V51,\"AUT*\"),\"\"))","v":"VIR14"},"Virement__AA26",""]
["2015-07-16","Virement__AA45",null,null,null,null,null,null,null,null,null,null,null,null,null,null,null,null,null,null,null,{"$f":"IF(COUNTIF(B53,\"*Virement*\"),\"VIR\"&COUNTIF($V$7:V52,\"VIR*\"),IF(COUNTIF($B$8:B53,B53)=1,\"AUT\"&COUNTIF($V$7:V52,\"AUT*\"),\"\"))","v":"VIR15"},"Virement__AA69",""]
["2015-11-03","Renè",null,null,null,null,null,null,null,null,null,null,null,null,null,null,null,null,null,null,null,{"$f":"IF(COUNTIF(B54,\"*Virement*\"),\"VIR\"&COUNTIF($V$7:V53,\"VIR*\"),IF(COUNTIF($B$8:B54,B54)=1,\"AUT\"&COUNTIF($V$7:V53,\"AUT*\"),\"\"))","v":"AUT15"},"Virement__AA05",""]
["2015-06-23","Virement__AA32",null,null,null,null,null,null,null,null,null,null,null,null,null,null,null,null,null,null,null,{"$f":"IF(COUNTIF(B55,\"*Virement*\"),\"VIR\"&COUNTIF($V$7:V54,\"VIR*\"),IF(COUNTIF($B$8:B55,B55)=1,\"AUT\"&COUNTIF($V$7:V54,\"AUT*\"),\"\"))","v":"VIR16"},"Virement__AA36",""]
["2015-07-25","Virement__AA77",null,null,null,null,null,null,null,null,null,null,null,null,null,null,null,null,null,null,null,{"$f":"IF(COUNTIF(B56,\"*Virement*\"),\"VIR\"&COUNTIF($V$7:V55,\"VIR*\"),IF(COUNTIF($B$8:B56,B56)=1,\"AUT\"&COUNTIF($V$7:V55,\"AUT*\"),\"\"))","v":"VIR17"},"Virement__AA00",""]
["2015-10-26","Virement__AA38",null,null,null,null,null,null,null,null,null,null,null,null,null,null,null,null,null,null,null,{"$f":"IF(COUNTIF(B57,\"*Virement*\"),\"VIR\"&COUNTIF($V$7:V56,\"VIR*\"),IF(COUNTIF($B$8:B57,B57)=1,\"AUT\"&COUNTIF($V$7:V56,\"AUT*\"),\"\"))","v":"VIR18"},"Virement__AA54",""]
["2015-11-20","Madeleine",null,null,null,null,null,null,null,null,null,null,null,null,null,null,null,null,null,null,null,{"$f":"IF(COUNTIF(B58,\"*Virement*\"),\"VIR\"&COUNTIF($V$7:V57,\"VIR*\"),IF(COUNTIF($B$8:B58,B58)=1,\"AUT\"&COUNTIF($V$7:V57,\"AUT*\"),\"\"))","v":"AUT16"},"Virement__AA58",""]
["2015-11-25","Pierrette",null,null,null,null,null,null,null,null,null,null,null,null,null,null,null,null,null,null,null,{"$f":"IF(COUNTIF(B59,\"*Virement*\"),\"VIR\"&COUNTIF($V$7:V58,\"VIR*\"),IF(COUNTIF($B$8:B59,B59)=1,\"AUT\"&COUNTIF($V$7:V58,\"AUT*\"),\"\"))","v":""},"Virement__AA08",""]
["2015-07-22","Michel",null,null,null,null,null,null,null,null,null,null,null,null,null,null,null,null,null,null,null,{"$f":"IF(COUNTIF(B60,\"*Virement*\"),\"VIR\"&COUNTIF($V$7:V59,\"VIR*\"),IF(COUNTIF($B$8:B60,B60)=1,\"AUT\"&COUNTIF($V$7:V59,\"AUT*\"),\"\"))","v":"AUT17"},"Virement__AA73",""]
["2015-10-18","Jaqueline",null,null,null,null,null,null,null,null,null,null,null,null,null,null,null,null,null,null,null,{"$f":"IF(COUNTIF(B61,\"*Virement*\"),\"VIR\"&COUNTIF($V$7:V60,\"VIR*\"),IF(COUNTIF($B$8:B61,B61)=1,\"AUT\"&COUNTIF($V$7:V60,\"AUT*\"),\"\"))","v":"AUT18"},"Virement__AA02",""]
["2015-10-22","Philippe",null,null,null,null,null,null,null,null,null,null,null,null,null,null,null,null,null,null,null,{"$f":"IF(COUNTIF(B62,\"*Virement*\"),\"VIR\"&COUNTIF($V$7:V61,\"VIR*\"),IF(COUNTIF($B$8:B62,B62)=1,\"AUT\"&COUNTIF($V$7:V61,\"AUT*\"),\"\"))","v":""},"Virement__AA41",""]
["2016-01-18","Carla",null,null,null,null,null,null,null,null,null,null,null,null,null,null,null,null,null,null,null,{"$f":"IF(COUNTIF(B63,\"*Virement*\"),\"VIR\"&COUNTIF($V$7:V62,\"VIR*\"),IF(COUNTIF($B$8:B63,B63)=1,\"AUT\"&COUNTIF($V$7:V62,\"AUT*\"),\"\"))","v":"AUT19"},"Virement__AA76",""]
["2015-07-07","Madeleine",null,null,null,null,null,null,null,null,null,null,null,null,null,null,null,null,null,null,null,{"$f":"IF(COUNTIF(B64,\"*Virement*\"),\"VIR\"&COUNTIF($V$7:V63,\"VIR*\"),IF(COUNTIF($B$8:B64,B64)=1,\"AUT\"&COUNTIF($V$7:V63,\"AUT*\"),\"\"))","v":""},"Virement__AA17",""]
["2015-09-19","Jean-pierre",null,null,null,null,null,null,null,null,null,null,null,null,null,null,null,null,null,null,null,{"$f":"IF(COUNTIF(B65,\"*Virement*\"),\"VIR\"&COUNTIF($V$7:V64,\"VIR*\"),IF(COUNTIF($B$8:B65,B65)=1,\"AUT\"&COUNTIF($V$7:V64,\"AUT*\"),\"\"))","v":""},"Virement__AA65",""]
["2016-01-14","Jean-pierre",null,null,null,null,null,null,null,null,null,null,null,null,null,null,null,null,null,null,null,{"$f":"IF(COUNTIF(B66,\"*Virement*\"),\"VIR\"&COUNTIF($V$7:V65,\"VIR*\"),IF(COUNTIF($B$8:B66,B66)=1,\"AUT\"&COUNTIF($V$7:V65,\"AUT*\"),\"\"))","v":""},"Virement__AA53",""]
["2015-06-10","Jean-pierre",null,null,null,null,null,null,null,null,null,null,null,null,null,null,null,null,null,null,null,{"$f":"IF(COUNTIF(B67,\"*Virement*\"),\"VIR\"&COUNTIF($V$7:V66,\"VIR*\"),IF(COUNTIF($B$8:B67,B67)=1,\"AUT\"&COUNTIF($V$7:V66,\"AUT*\"),\"\"))","v":""},"Virement__AA13",""]
["2015-11-13","Virement__AA28",null,null,null,null,null,null,null,null,null,null,null,null,null,null,null,null,null,null,null,{"$f":"IF(COUNTIF(B68,\"*Virement*\"),\"VIR\"&COUNTIF($V$7:V67,\"VIR*\"),IF(COUNTIF($B$8:B68,B68)=1,\"AUT\"&COUNTIF($V$7:V67,\"AUT*\"),\"\"))","v":"VIR19"},"Virement__AA37",""]
["2015-11-07","Paul",null,null,null,null,null,null,null,null,null,null,null,null,null,null,null,null,null,null,null,{"$f":"IF(COUNTIF(B69,\"*Virement*\"),\"VIR\"&COUNTIF($V$7:V68,\"VIR*\"),IF(COUNTIF($B$8:B69,B69)=1,\"AUT\"&COUNTIF($V$7:V68,\"AUT*\"),\"\"))","v":"AUT20"},"Virement__AA59",""]
["2016-01-16","Virement__AA04",null,null,null,null,null,null,null,null,null,null,null,null,null,null,null,null,null,null,null,{"$f":"IF(COUNTIF(B70,\"*Virement*\"),\"VIR\"&COUNTIF($V$7:V69,\"VIR*\"),IF(COUNTIF($B$8:B70,B70)=1,\"AUT\"&COUNTIF($V$7:V69,\"AUT*\"),\"\"))","v":"VIR20"},"Virement__AA25",""]
["2015-06-26","Virement__AA34",null,null,null,null,null,null,null,null,null,null,null,null,null,null,null,null,null,null,null,{"$f":"IF(COUNTIF(B71,\"*Virement*\"),\"VIR\"&COUNTIF($V$7:V70,\"VIR*\"),IF(COUNTIF($B$8:B71,B71)=1,\"AUT\"&COUNTIF($V$7:V70,\"AUT*\"),\"\"))","v":"VIR21"},"Virement__AA01",""]
["2015-10-04","Chrystel",null,null,null,null,null,null,null,null,null,null,null,null,null,null,null,null,null,null,null,{"$f":"IF(COUNTIF(B72,\"*Virement*\"),\"VIR\"&COUNTIF($V$7:V71,\"VIR*\"),IF(COUNTIF($B$8:B72,B72)=1,\"AUT\"&COUNTIF($V$7:V71,\"AUT*\"),\"\"))","v":""},"Virement__AA44",""]
["2015-11-11","Virement__AA70",null,null,null,null,null,null,null,null,null,null,null,null,null,null,null,null,null,null,null,{"$f":"IF(COUNTIF(B73,\"*Virement*\"),\"VIR\"&COUNTIF($V$7:V72,\"VIR*\"),IF(COUNTIF($B$8:B73,B73)=1,\"AUT\"&COUNTIF($V$7:V72,\"AUT*\"),\"\"))","v":"VIR22"},{"$f":"IFERROR(INDEX(B:B,MATCH(\"VIR\"&ROW()-8,V:V,0)),\"\")","v":"Virement__AA72"},{"$f":"IFERROR(INDEX($B:$B,MATCH(\"AUT\"&ROW()-8,$V:$V,0)),\"\")","v":""}]
["2015-07-04","Monique",null,null,null,null,null,null,null,null,null,null,null,null,null,null,null,null,null,null,null,{"$f":"IF(COUNTIF(B74,\"*Virement*\"),\"VIR\"&COUNTIF($V$7:V73,\"VIR*\"),IF(COUNTIF($B$8:B74,B74)=1,\"AUT\"&COUNTIF($V$7:V73,\"AUT*\"),\"\"))","v":""},"Virement__AA57",""]
["2015-11-09","Virement__AA24",null,null,null,null,null,null,null,null,null,null,null,null,null,null,null,null,null,null,null,{"$f":"IF(COUNTIF(B75,\"*Virement*\"),\"VIR\"&COUNTIF($V$7:V74,\"VIR*\"),IF(COUNTIF($B$8:B75,B75)=1,\"AUT\"&COUNTIF($V$7:V74,\"AUT*\"),\"\"))","v":"VIR23"},"Virement__AA35",""]
["2015-12-05","Virement__AA47",null,null,null,null,null,null,null,null,null,null,null,null,null,null,null,null,null,null,null,{"$f":"IF(COUNTIF(B76,\"*Virement*\"),\"VIR\"&COUNTIF($V$7:V75,\"VIR*\"),IF(COUNTIF($B$8:B76,B76)=1,\"AUT\"&COUNTIF($V$7:V75,\"AUT*\"),\"\"))","v":"VIR24"},"Virement__AA30",""]
["2015-12-17","Carla",null,null,null,null,null,null,null,null,null,null,null,null,null,null,null,null,null,null,null,{"$f":"IF(COUNTIF(B77,\"*Virement*\"),\"VIR\"&COUNTIF($V$7:V76,\"VIR*\"),IF(COUNTIF($B$8:B77,B77)=1,\"AUT\"&COUNTIF($V$7:V76,\"AUT*\"),\"\"))","v":""},"Virement__AA09",""]
["2015-12-18","Corinne",null,null,null,null,null,null,null,null,null,null,null,null,null,null,null,null,null,null,null,{"$f":"IF(COUNTIF(B78,\"*Virement*\"),\"VIR\"&COUNTIF($V$7:V77,\"VIR*\"),IF(COUNTIF($B$8:B78,B78)=1,\"AUT\"&COUNTIF($V$7:V77,\"AUT*\"),\"\"))","v":""},"Virement__AA49",""]
["2015-11-05","Virement__AA22",null,null,null,null,null,null,null,null,null,null,null,null,null,null,null,null,null,null,null,{"$f":"IF(COUNTIF(B79,\"*Virement*\"),\"VIR\"&COUNTIF($V$7:V78,\"VIR*\"),IF(COUNTIF($B$8:B79,B79)=1,\"AUT\"&COUNTIF($V$7:V78,\"AUT*\"),\"\"))","v":"VIR25"},"Virement__AA18",""]
["2016-01-08","André",null,null,null,null,null,null,null,null,null,null,null,null,null,null,null,null,null,null,null,{"$f":"IF(COUNTIF(B80,\"*Virement*\"),\"VIR\"&COUNTIF($V$7:V79,\"VIR*\"),IF(COUNTIF($B$8:B80,B80)=1,\"AUT\"&COUNTIF($V$7:V79,\"AUT*\"),\"\"))","v":""},"Virement__AA33",""]
{"$rows_left_out":1014}
{"sheet":"Virement","index":1,"n_rows":10,"n_cols":2,"rows_kept":10,"cut":false,"hidden":false,"merged":[]}
[]
[]
["Validation (liste = VIR)","Date"]
["Virement__AA66",{"$f":"IFERROR(INDEX(BdD!$A:$A,MATCH(A4,BdD!$B:$B,0)),\"\")","v":"2015-12-03"}]
["Virement__AA43",{"$f":"IFERROR(INDEX(BdD!$A:$A,MATCH(A5,BdD!$B:$B,0)),\"\")","v":"2015-10-11"}]
[null,{"$f":"IFERROR(INDEX(BdD!$A:$A,MATCH(A6,BdD!$B:$B,0)),\"\")","v":""}]
[null,{"$f":"IFERROR(INDEX(BdD!$A:$A,MATCH(A7,BdD!$B:$B,0)),\"\")","v":""}]
[null,{"$f":"IFERROR(INDEX(BdD!$A:$A,MATCH(A8,BdD!$B:$B,0)),\"\")","v":""}]
[null,{"$f":"IFERROR(INDEX(BdD!$A:$A,MATCH(A9,BdD!$B:$B,0)),\"\")","v":""}]
[null,{"$f":"IFERROR(INDEX(BdD!$A:$A,MATCH(A10,BdD!$B:$B,0)),\"\")","v":""}]

{"sheet":"Autres","index":2,"n_rows":10,"n_cols":4,"rows_kept":10,"cut":false,"hidden":false,"merged":[]}
[]
[]
["Validation liste =AUT",null,null,"ATTENTION pour date maxi selon le nom"]
["Lucas",{"$f":"MAX(IF(BdD!B:B=A4,BdD!A:A))","v":"2016-01-22"},null,"en B4:B10: formule matricielle à entrer:"]
["Léa",{"$f":"MAX(IF(BdD!B:B=A5,BdD!A:A))","v":"2015-12-31"},null,"avec  la touche enter en maintenant les touches ctrl et shift enfoncées"]
["Monique",{"$f":"MAX(IF(BdD!B:B=A6,BdD!A:A))","v":"2016-01-28"},null,"(elle se retrouve automatiquement entre accolades dans la barre de formule)"]
[null,{"$f":"MAX(IF(BdD!B:B=A7,BdD!A:A))","v":"00:00:00"}]
[null,{"$f":"MAX(IF(BdD!B:B=A8,BdD!A:A))","v":"00:00:00"}]
[null,{"$f":"MAX(IF(BdD!B:B=A9,BdD!A:A))","v":"00:00:00"}]
[null,{"$f":"MAX(IF(BdD!B:B=A10,BdD!A:A))","v":"00:00:00"}]