{"text_format":"1","workbook":"xlsx","n_sheets":4,"sheets":["Planning","Planning1","References","Feuil2"],"not_rendered":{"charts":0,"images":0,"macros":1,"external_links":0,"defined_names":7,"comments":1,"pivot_tables":0},"unopened":[],"bounds":{"document_bytes":16777216,"sheet_cells":100000,"rows_first":2000,"rows_last":500,"rows_between":2000,"halvings":0,"cell_chars":16384,"cell_head_chars":4096},"cells_cut":0,"cells_raw":0,"read":"whole","date_system":"1900"}

{"sheet":"Planning","index":0,"n_rows":605,"n_cols":15,"rows_kept":605,"cut":false,"hidden":false,"merged":[[13,4,13,5],[14,4,14,5],[15,4,15,5],[0,2,1,11],[5,3,5,7],[6,4,6,5],[7,4,7,5],[8,4,8,5],[9,3,9,4],[10,4,10,5],[11,4,11,5]]}
[null,null,"Planning Resinoplast"]
[]
[]
[]
[null,null,null,null,null,null,"Emplacement","utilisateurs"]
[]
[null,null,null,30,"Validation ",null,"Validation de ligne","Michel et Ali"]
[null,null,null,20,"Attention",null,"Problemes/Attention","Michel et Ali"]
[null,null,null,10,"Problème",null,"Problemes/Attention","Michel et Ali"]
[]
[null,null,null,40,"Ticket pas encore validé",null,"Validation des tickets","Catherine"]
[null,null,null,50,"ticket Validé",null,"Validation des tickets","Catherine"]
[]
[null,null,null,0,"étoile vide=",null,"Temps de contrôle","Jordane"]
[null,null,null,12,"1/2 étoile=",null,"Temps de contrôle","Jordane"]
[null,null,null,24,"1 étoile complète = 1 Journée contrôle",null,"Temps de contrôle","Jordane"]
[]
[null,null,null,null,null,null,null,null,{"$f":"IF(ISNA(VLOOKUP(Planning!$C24,References!A:B,2,0)),\"0\",VLOOKUP(Planning!$C24,References!A:B,2,0))","v":"DSY 210/05 C4142 BB750"}]
[]
[null,null,"http://www.commentcamarche.net/forum/affich-3389274-besoin-d-aide-pour-creation-planning#p32036029"]
{"$rows_left_out":586}
{"sheet":"Planning1","index":1,"n_rows":55,"n_cols":121,"rows_kept":55,"cut":false,"hidden":false,"merged":[[15,2,18,2],[15,3,18,3],[15,4,18,4],[15,5,18,5],[15,6,18,6],[25,0,26,0],[15,45,18,45],[15,33,18,33],[15,34,18,34],[15,35,18,35],[15,36,18,36],[15,37,18,37],[15,38,18,38],[15,27,18,27],[15,28,18,28],[15,29,18,29],[15,30,18,30],[15,31,18,31],[15,18,18,18],[15,19,18,19],[15,20,18,20],[1,5,1,23],[3,5,3,14],[4,5,4,14],[15,46,18,46],[15,21,18,21],[15,22,18,22],[15,23,18,23],[15,24,18,24],[15,25,18,25],[15,26,18,26],[15,10,18,10],[15,7,18,7],[15,8,18,8],[15,15,18,15],[15,16,18,16],[15,17,18,17],[3,15,3,16],[4,15,4,16],[3,17,3,19],[4,17,4,19],[3,20,3,23],[4,20,4,23],[10,19,12,98],[15,47,18,47],[15,48,18,48],[15,39,18,39],[15,40,18,40],[15,41,18,41],[15,42,18,42],[15,32,18,32],[15,43,18,43],[15,44,18,44],[15,9,18,9],[25,73,25,96],[25,97,25,120],[19,73,20,73],[19,97,20,97],[19,25,20,25],[19,49,20,49],[25,49,25,72],[25,1,25,24],[25,25,25,48],[15,11,18,11],[15,12,18,12],[15,13,18,13],[15,14,18,14],[19,1,20,1],[13,1,18,1]]}
[]
[]
[]
[null,null,null,null,null,{"$f":"IF($W$3,\"Date de la ligne rouge:\",\"Date Of Red Line:\")","v":"Date Of Red Line:"},null,null,null,null,null,null,null,null,null,7,null,"Mai",null,null,2015]
[null,null,null,null,null,{"$f":"IF($W$3,\"1er jour du diagramme:\",\"First Date of planning:\")","v":"First Date of planning:"},null,null,null,null,null,null,null,null,null,11,null,"Mai",null,null,2015]
[]
[]
[]
[]
[]
[null,null,null,null,null,null,null,null,null,null,null,null,null,null,null,null,null,null,null,"Planning de production Resinoplast "]
[]
[]
[null,{"$f":"IF(DAY(B26)=1,B26,\"\")","v":""}]
[]
[null,null,{"$f":"IF(DAY(C26)=1,C26,\"\")","v":""},{"$f":"IF(DAY(D26)=1,D26,\"\")","v":""},{"$f":"IF(DAY(E26)=1,E26,\"\")","v":""},"","","","","","","","","","","","","","","","","","","","","","","","","","","","","","","","","","","","","","","","","","","",""]
[]
[]
[]
["Semaine",{"$f":"$A$10&INT((B26-DATE(YEAR(B26-WEEKDAY(B26-1)+4),1,3)+WEEKDAY(DATE(YEAR(B26-WEEKDAY(B26-1)+4),1,3))+5)/7)","v":"22"},{"$f":"#REF!&INT((C26-DATE(YEAR(C26-WEEKDAY(C26-1)+4),1,3)+WEEKDAY(DATE(YEAR(C26-WEEKDAY(C26-1)+4),1,3))+5)/7)","v":{"$error":"#REF!"}},{"$f":"#REF!&INT((D26-DATE(YEAR(D26-WEEKDAY(D26-1)+4),1,3)+WEEKDAY(DATE(YEAR(D26-WEEKDAY(D26-1)+4),1,3))+5)/7)","v":{"$error":"#REF!"}},{"$f":"#REF!&INT((E26-DATE(YEAR(E26-WEEKDAY(E26-1)+4),1,3)+WEEKDAY(DATE(YEAR(E26-WEEKDAY(E26-1)+4),1,3))+5)/7)","v":{"$error":"#REF!"}},{"$f":"#REF!&INT((F26-DATE(YEAR(F26-WEEKDAY(F26-1)+4),1,3)+WEEKDAY(DATE(YEAR(F26-WEEKDAY(F26-1)+4),1,3))+5)/7)","v":{"$error":"#REF!"}},{"$f":"#REF!&INT((G26-DATE(YEAR(G26-WEEKDAY(G26-1)+4),1,3)+WEEKDAY(DATE(YEAR(G26-WEEKDAY(G26-1)+4),1,3))+5)/7)","v":{"$error":"#REF!"}},{"$f":"#REF!&INT((H26-DATE(YEAR(H26-WEEKDAY(H26-1)+4),1,3)+WEEKDAY(DATE(YEAR(H26-WEEKDAY(H26-1)+4),1,3))+5)/7)","v":{"$error":"#REF!"}},{"$f":"#REF!&INT((I26-DATE(YEAR(I26-WEEKDAY(I26-1)+4),1,3)+WEEKDAY(DATE(YEAR(I26-WEEKDAY(I26-1)+4),1,3))+5)/7)","v":{"$error":"#REF!"}},{"$f":"#REF!&INT((J26-DATE(YEAR(J26-WEEKDAY(J26-1)+4),1,3)+WEEKDAY(DATE(YEAR(J26-WEEKDAY(J26-1)+4),1,3))+5)/7)","v":{"$error":"#REF!"}},{"$f":"#REF!&INT((K26-DATE(YEAR(K26-WEEKDAY(K26-1)+4),1,3)+WEEKDAY(DATE(YEAR(K26-WEEKDAY(K26-1)+4),1,3))+5)/7)","v":{"$error":"#REF!"}},{"$f":"#REF!&INT((L26-DATE(YEAR(L26-WEEKDAY(L26-1)+4),1,3)+WEEKDAY(DATE(YEAR(L26-WEEKDAY(L26-1)+4),1,3))+5)/7)","v":{"$error":"#REF!"}},{"$f":"#REF!&INT((M26-DATE(YEAR(M26-WEEKDAY(M26-1)+4),1,3)+WEEKDAY(DATE(YEAR(M26-WEEKDAY(M26-1)+4),1,3))+5)/7)","v":{"$error":"#REF!"}},{"$f":"#REF!&INT((N26-DATE(YEAR(N26-WEEKDAY(N26-1)+4),1,3)+WEEKDAY(DATE(YEAR(N26-WEEKDAY(N26-1)+4),1,3))+5)/7)","v":{"$error":"#REF!"}},{"$f":"#REF!&INT((O26-DATE(YEAR(O26-WEEKDAY(O26-1)+4),1,3)+WEEKDAY(DATE(YEAR(O26-WEEKDAY(O26-1)+4),1,3))+5)/7)","v":{"$error":"#REF!"}},{"$f":"#REF!&INT((P26-DATE(YEAR(P26-WEEKDAY(P26-1)+4),1,3)+WEEKDAY(DATE(YEAR(P26-WEEKDAY(P26-1)+4),1,3))+5)/7)","v":{"$error":"#REF!"}},{"$f":"#REF!&INT((Q26-DATE(YEAR(Q26-WEEKDAY(Q26-1)+4),1,3)+WEEKDAY(DATE(YEAR(Q26-WEEKDAY(Q26-1)+4),1,3))+5)/7)","v":{"$error":"#REF!"}},{"$f":"#REF!&INT((R26-DATE(YEAR(R26-WEEKDAY(R26-1)+4),1,3)+WEEKDAY(DATE(YEAR(R26-WEEKDAY(R26-1)+4),1,3))+5)/7)","v":{"$error":"#REF!"}},{"$f":"#REF!&INT((S26-DATE(YEAR(S26-WEEKDAY(S26-1)+4),1,3)+WEEKDAY(DATE(YEAR(S26-WEEKDAY(S26-1)+4),1,3))+5)/7)","v":{"$error":"#REF!"}},{"$f":"#REF!&INT((T26-DATE(YEAR(T26-WEEKDAY(T26-1)+4),1,3)+WEEKDAY(DATE(YEAR(T26-WEEKDAY(T26-1)+4),1,3))+5)/7)","v":{"$error":"#REF!"}},{"$f":"#REF!&INT((U26-DATE(YEAR(U26-WEEKDAY(U26-1)+4),1,3)+WEEKDAY(DATE(YEAR(U26-WEEKDAY(U26-1)+4),1,3))+5)/7)","v":{"$error":"#REF!"}},{"$f":"#REF!&INT((V26-DATE(YEAR(V26-WEEKDAY(V26-1)+4),1,3)+WEEKDAY(DATE(YEAR(V26-WEEKDAY(V26-1)+4),1,3))+5)/7)","v":{"$error":"#REF!"}},{"$f":"#REF!&INT((W26-DATE(YEAR(W26-WEEKDAY(W26-1)+4),1,3)+WEEKDAY(DATE(YEAR(W26-WEEKDAY(W26-1)+4),1,3))+5)/7)","v":{"$error":"#REF!"}},{"$f":"#REF!&INT((X26-DATE(YEAR(X26-WEEKDAY(X26-1)+4),1,3)+WEEKDAY(DATE(YEAR(X26-WEEKDAY(X26-1)+4),1,3))+5)/7)","v":{"$error":"#REF!"}},{"$f":"#REF!&INT((Y26-DATE(YEAR(Y26-WEEKDAY(Y26-1)+4),1,3)+WEEKDAY(DATE(YEAR(Y26-WEEKDAY(Y26-1)+4),1,3))+5)/7)","v":{"$error":"#REF!"}},{"$f":"$A$10&INT((Z26-DATE(YEAR(Z26-WEEKDAY(Z26-1)+4),1,3)+WEEKDAY(DATE(YEAR(Z26-WEEKDAY(Z26-1)+4),1,3))+5)/7)","v":"22"},{"$f":"#REF!&INT((AA26-DATE(YEAR(AA26-WEEKDAY(AA26-1)+4),1,3)+WEEKDAY(DATE(YEAR(AA26-WEEKDAY(AA26-1)+4),1,3))+5)/7)","v":{"$error":"#REF!"}},{"$f":"#REF!&INT((AB26-DATE(YEAR(AB26-WEEKDAY(AB26-1)+4),1,3)+WEEKDAY(DATE(YEAR(AB26-WEEKDAY(AB26-1)+4),1,3))+5)/7)","v":{"$error":"#REF!"}},{"$f":"#REF!&INT((AC26-DATE(YEAR(AC26-WEEKDAY(AC26-1)+4),1,3)+WEEKDAY(DATE(YEAR(AC26-WEEKDAY(AC26-1)+4),1,3))+5)/7)","v":{"$error":"#REF!"}},{"$f":"#REF!&INT((AD26-DATE(YEAR(AD26-WEEKDAY(AD26-1)+4),1,3)+WEEKDAY(DATE(YEAR(AD26-WEEKDAY(AD26-1)+4),1,3))+5)/7)","v":{"$error":"#REF!"}},{"$f":"#REF!&INT((AE26-DATE(YEAR(AE26-WEEKDAY(AE26-1)+4),1,3)+WEEKDAY(DATE(YEAR(AE26-WEEKDAY(AE26-1)+4),1,3))+5)/7)","v":{"$error":"#REF!"}},{"$f":"#REF!&INT((AF26-DATE(YEAR(AF26-WEEKDAY(AF26-1)+4),1,3)+WEEKDAY(DATE(YEAR(AF26-WEEKDAY(AF26-1)+4),1,3))+5)/7)","v":{"$error":"#REF!"}},{"$f":"#REF!&INT((AG26-DATE(YEAR(AG26-WEEKDAY(AG26-1)+4),1,3)+WEEKDAY(DATE(YEAR(AG26-WEEKDAY(AG26-1)+4),1,3))+5)/7)","v":{"$error":"#REF!"}},{"$f":"#REF!&INT((AH26-DATE(YEAR(AH26-WEEKDAY(AH26-1)+4),1,3)+WEEKDAY(DATE(YEAR(AH26-WEEKDAY(AH26-1)+4),1,3))+5)/7)","v":{"$error":"#REF!"}},{"$f":"#REF!&INT((AI26-DATE(YEAR(AI26-WEEKDAY(AI26-1)+4),1,3)+WEEKDAY(DATE(YEAR(AI26-WEEKDAY(AI26-1)+4),1,3))+5)/7)","v":{"$error":"#REF!"}},{"$f":"#REF!&INT((AJ26-DATE(YEAR(AJ26-WEEKDAY(AJ26-1)+4),1,3)+WEEKDAY(DATE(YEAR(AJ26-WEEKDAY(AJ26-1)+4),1,3))+5)/7)","v":{"$error":"#REF!"}},{"$f":"#REF!&INT((AK26-DATE(YEAR(AK26-WEEKDAY(AK26-1)+4),1,3)+WEEKDAY(DATE(YEAR(AK26-WEEKDAY(AK26-1)+4),1,3))+5)/7)","v":{"$error":"#REF!"}},{"$f":"#REF!&INT((AL26-DATE(YEAR(AL26-WEEKDAY(AL26-1)+4),1,3)+WEEKDAY(DATE(YEAR(AL26-WEEKDAY(AL26-1)+4),1,3))+5)/7)","v":{"$error":"#REF!"}},{"$f":"#REF!&INT((AM26-DATE(YEAR(AM26-WEEKDAY(AM26-1)+4),1,3)+WEEKDAY(DATE(YEAR(AM26-WEEKDAY(AM26-1)+4),1,3))+5)/7)","v":{"$error":"#REF!"}},{"$f":"#REF!&INT((AN26-DATE(YEAR(AN26-WEEKDAY(AN26-1)+4),1,3)+WEEKDAY(DATE(YEAR(AN26-WEEKDAY(AN26-1)+4),1,3))+5)/7)","v":{"$error":"#REF!"}},{"$f":"#REF!&INT((AO26-DATE(YEAR(AO26-WEEKDAY(AO26-1)+4),1,3)+WEEKDAY(DATE(YEAR(AO26-WEEKDAY(AO26-1)+4),1,3))+5)/7)","v":{"$error":"#REF!"}},{"$f":"#REF!&INT((AP26-DATE(YEAR(AP26-WEEKDAY(AP26-1)+4),1,3)+WEEKDAY(DATE(YEAR(AP26-WEEKDAY(AP26-1)+4),1,3))+5)/7)","v":{"$error":"#REF!"}},{"$f":"#REF!&INT((AQ26-DATE(YEAR(AQ26-WEEKDAY(AQ26-1)+4),1,3)+WEEKDAY(DATE(YEAR(AQ26-WEEKDAY(AQ26-1)+4),1,3))+5)/7)","v":{"$error":"#REF!"}},{"$f":"#REF!&INT((AR26-DATE(YEAR(AR26-WEEKDAY(AR26-1)+4),1,3)+WEEKDAY(DATE(YEAR(AR26-WEEKDAY(AR26-1)+4),1,3))+5)/7)","v":{"$error":"#REF!"}},{"$f":"#REF!&INT((AS26-DATE(YEAR(AS26-WEEKDAY(AS26-1)+4),1,3)+WEEKDAY(DATE(YEAR(AS26-WEEKDAY(AS26-1)+4),1,3))+5)/7)","v":{"$error":"#REF!"}},{"$f":"#REF!&INT((AT26-DATE(YEAR(AT26-WEEKDAY(AT26-1)+4),1,3)+WEEKDAY(DATE(YEAR(AT26-WEEKDAY(AT26-1)+4),1,3))+5)/7)","v":{"$error":"#REF!"}},{"$f":"#REF!&INT((AU26-DATE(YEAR(AU26-WEEKDAY(AU26-1)+4),1,3)+WEEKDAY(DATE(YEAR(AU26-WEEKDAY(AU26-1)+4),1,3))+5)/7)","v":{"$error":"#REF!"}},{"$f":"#REF!&INT((AV26-DATE(YEAR(AV26-WEEKDAY(AV26-1)+4),1,3)+WEEKDAY(DATE(YEAR(AV26-WEEKDAY(AV26-1)+4),1,3))+5)/7)","v":{"$error":"#REF!"}},{"$f":"#REF!&INT((AW26-DATE(YEAR(AW26-WEEKDAY(AW26-1)+4),1,3)+WEEKDAY(DATE(YEAR(AW26-WEEKDAY(AW26-1)+4),1,3))+5)/7)","v":{"$error":"#REF!"}},{"$f":"$A$10&INT((AX26-DATE(YEAR(AX26-WEEKDAY(AX26-1)+4),1,3)+WEEKDAY(DATE(YEAR(AX26-WEEKDAY(AX26-1)+4),1,3))+5)/7)","v":"22"},{"$f":"#REF!&INT((AY26-DATE(YEAR(AY26-WEEKDAY(AY26-1)+4),1,3)+WEEKDAY(DATE(YEAR(AY26-WEEKDAY(AY26-1)+4),1,3))+5)/7)","v":{"$error":"#REF!"}},{"$f":"#REF!&INT((AZ26-DATE(YEAR(AZ26-WEEKDAY(AZ26-1)+4),1,3)+WEEKDAY(DATE(YEAR(AZ26-WEEKDAY(AZ26-1)+4),1,3))+5)/7)","v":{"$error":"#REF!"}},{"$f":"#REF!&INT((BA26-DATE(YEAR(BA26-WEEKDAY(BA26-1)+4),1,3)+WEEKDAY(DATE(YEAR(BA26-WEEKDAY(BA26-1)+4),1,3))+5)/7)","v":{"$error":"#REF!"}},{"$f":"#REF!&INT((BB26-DATE(YEAR(BB26-WEEKDAY(BB26-1)+4),1,3)+WEEKDAY(DATE(YEAR(BB26-WEEKDAY(BB26-1)+4),1,3))+5)/7)","v":{"$error":"#REF!"}},{"$f":"#REF!&INT((BC26-DATE(YEAR(BC26-WEEKDAY(BC26-1)+4),1,3)+WEEKDAY(DATE(YEAR(BC26-WEEKDAY(BC26-1)+4),1,3))+5)/7)","v":{"$error":"#REF!"}},{"$f":"#REF!&INT((BD26-DATE(YEAR(BD26-WEEKDAY(BD26-1)+4),1,3)+WEEKDAY(DATE(YEAR(BD26-WEEKDAY(BD26-1)+4),1,3))+5)/7)","v":{"$error":"#REF!"}},{"$f":"#REF!&INT((BE26-DATE(YEAR(BE26-WEEKDAY(BE26-1)+4),1,3)+WEEKDAY(DATE(YEAR(BE26-WEEKDAY(BE26-1)+4),1,3))+5)/7)","v":{"$error":"#REF!"}},{"$f":"#REF!&INT((BF26-DATE(YEAR(BF26-WEEKDAY(BF26-1)+4),1,3)+WEEKDAY(DATE(YEAR(BF26-WEEKDAY(BF26-1)+4),1,3))+5)/7)","v":{"$error":"#REF!"}},{"$f":"#REF!&INT((BG26-DATE(YEAR(BG26-WEEKDAY(BG26-1)+4),1,3)+WEEKDAY(DATE(YEAR(BG26-WEEKDAY(BG26-1)+4),1,3))+5)/7)","v":{"$error":"#REF!"}},{"$f":"#REF!&INT((BH26-DATE(YEAR(BH26-WEEKDAY(BH26-1)+4),1,3)+WEEKDAY(DATE(YEAR(BH26-WEEKDAY(BH26-1)+4),1,3))+5)/7)","v":{"$error":"#REF!"}},{"$f":"#REF!&INT((BI26-DATE(YEAR(BI26-WEEKDAY(BI26-1)+4),1,3)+WEEKDAY(DATE(YEAR(BI26-WEEKDAY(BI26-1)+4),1,3))+5)/7)","v":{"$error":"#REF!"}},{"$f":"#REF!&INT((BJ26-DATE(YEAR(BJ26-WEEKDAY(BJ26-1)+4),1,3)+WEEKDAY(DATE(YEAR(BJ26-WEEKDAY(BJ26-1)+4),1,3))+5)/7)","v":{"$error":"#REF!"}},{"$f":"#REF!&INT((BK26-DATE(YEAR(BK26-WEEKDAY(BK26-1)+4),1,3)+WEEKDAY(DATE(YEAR(BK26-WEEKDAY(BK26-1)+4),1,3))+5)/7)","v":{"$error":"#REF!"}},{"$f":"#REF!&INT((BL26-DATE(YEAR(BL26-WEEKDAY(BL26-1)+4),1,3)+WEEKDAY(DATE(YEAR(BL26-WEEKDAY(BL26-1)+4),1,3))+5)/7)","v":{"$error":"#REF!"}},{"$f":"#REF!&INT((BM26-DATE(YEAR(BM26-WEEKDAY(BM26-1)+4),1,3)+WEEKDAY(DATE(YEAR(BM26-WEEKDAY(BM26-1)+4),1,3))+5)/7)","v":{"$error":"#REF!"}},{"$f":"#REF!&INT((BN26-DATE(YEAR(BN26-WEEKDAY(BN26-1)+4),1,3)+WEEKDAY(DATE(YEAR(BN26-WEEKDAY(BN26-1)+4),1,3))+5)/7)","v":{"$error":"#REF!"}},{"$f":"#REF!&INT((BO26-DATE(YEAR(BO26-WEEKDAY(BO26-1)+4),1,3)+WEEKDAY(DATE(YEAR(BO26-WEEKDAY(BO26-1)+4),1,3))+5)/7)","v":{"$error":"#REF!"}},{"$f":"#REF!&INT((BP26-DATE(YEAR(BP26-WEEKDAY(BP26-1)+4),1,3)+WEEKDAY(DATE(YEAR(BP26-WEEKDAY(BP26-1)+4),1,3))+5)/7)","v":{"$error":"#REF!"}},{"$f":"#REF!&INT((BQ26-DATE(YEAR(BQ26-WEEKDAY(BQ26-1)+4),1,3)+WEEKDAY(DATE(YEAR(BQ26-WEEKDAY(BQ26-1)+4),1,3))+5)/7)","v":{"$error":"#REF!"}},{"$f":"#REF!&INT((BR26-DATE(YEAR(BR26-WEEKDAY(BR26-1)+4),1,3)+WEEKDAY(DATE(YEAR(BR26-WEEKDAY(BR26-1)+4),1,3))+5)/7)","v":{"$error":"#REF!"}},{"$f":"#REF!&INT((BS26-DATE(YEAR(BS26-WEEKDAY(BS26-1)+4),1,3)+WEEKDAY(DATE(YEAR(BS26-WEEKDAY(BS26-1)+4),1,3))+5)/7)","v":{"$error":"#REF!"}},{"$f":"#REF!&INT((BT26-DATE(YEAR(BT26-WEEKDAY(BT26-1)+4),1,3)+WEEKDAY(DATE(YEAR(BT26-WEEKDAY(BT26-1)+4),1,3))+5)/7)","v":{"$error":"#REF!"}},{"$f":"#REF!&INT((BU26-DATE(YEAR(BU26-WEEKDAY(BU26-1)+4),1,3)+WEEKDAY(DATE(YEAR(BU26-WEEKDAY(BU26-1)+4),1,3))+5)/7)","v":{"$error":"#REF!"}},{"$f":"$A$10&INT((BV26-DATE(YEAR(BV26-WEEKDAY(BV26-1)+4),1,3)+WEEKDAY(DATE(YEAR(BV26-WEEKDAY(BV26-1)+4),1,3))+5)/7)","v":"22"},{"$f":"#REF!&INT((BW26-DATE(YEAR(BW26-WEEKDAY(BW26-1)+4),1,3)+WEEKDAY(DATE(YEAR(BW26-WEEKDAY(BW26-1)+4),1,3))+5)/7)","v":{"$error":"#REF!"}},{"$f":"#REF!&INT((BX26-DATE(YEAR(BX26-WEEKDAY(BX26-1)+4),1,3)+WEEKDAY(DATE(YEAR(BX26-WEEKDAY(BX26-1)+4),1,3))+5)/7)","v":{"$error":"#REF!"}},{"$f":"#REF!&INT((BY26-DATE(YEAR(BY26-WEEKDAY(BY26-1)+4),1,3)+WEEKDAY(DATE(YEAR(BY26-WEEKDAY(BY26-1)+4),1,3))+5)/7)","v":{"$error":"#REF!"}},{"$f":"#REF!&INT((BZ26-DATE(YEAR(BZ26-WEEKDAY(BZ26-1)+4),1,3)+WEEKDAY(DATE(YEAR(BZ26-WEEKDAY(BZ26-1)+4),1,3))+5)/7)","v":{"$error":"#REF!"}},{"$f":"#REF!&INT((CA26-DATE(YEAR(CA26-WEEKDAY(CA26-1)+4),1,3)+WEEKDAY(DATE(YEAR(CA26-WEEKDAY(CA26-1)+4),1,3))+5)/7)","v":{"$error":"#REF!"}},{"$f":"#REF!&INT((CB26-DATE(YEAR(CB26-WEEKDAY(CB26-1)+4),1,3)+WEEKDAY(DATE(YEAR(CB26-WEEKDAY(CB26-1)+4),1,3))+5)/7)","v":{"$error":"#REF!"}},{"$f":"#REF!&INT((CC26-DATE(YEAR(CC26-WEEKDAY(CC26-1)+4),1,3)+WEEKDAY(DATE(YEAR(CC26-WEEKDAY(CC26-1)+4),1,3))+5)/7)","v":{"$error":"#REF!"}},{"$f":"#REF!&INT((CD26-DATE(YEAR(CD26-WEEKDAY(CD26-1)+4),1,3)+WEEKDAY(DATE(YEAR(CD26-WEEKDAY(CD26-1)+4),1,3))+5)/7)","v":{"$error":"#REF!"}},{"$f":"#REF!&INT((CE26-DATE(YEAR(CE26-WEEKDAY(CE26-1)+4),1,3)+WEEKDAY(DATE(YEAR(CE26-WEEKDAY(CE26-1)+4),1,3))+5)/7)","v":{"$error":"#REF!"}},{"$f":"#REF!&INT((CF26-DATE(YEAR(CF26-WEEKDAY(CF26-1)+4),1,3)+WEEKDAY(DATE(YEAR(CF26-WEEKDAY(CF26-1)+4),1,3))+5)/7)","v":{"$error":"#REF!"}},{"$f":"#REF!&INT((CG26-DATE(YEAR(CG26-WEEKDAY(CG26-1)+4),1,3)+WEEKDAY(DATE(YEAR(CG26-WEEKDAY(CG26-1)+4),1,3))+5)/7)","v":{"$error":"#REF!"}},{"$f":"#REF!&INT((CH26-DATE(YEAR(CH26-WEEKDAY(CH26-1)+4),1,3)+WEEKDAY(DATE(YEAR(CH26-WEEKDAY(CH26-1)+4),1,3))+5)/7)","v":{"$error":"#REF!"}},{"$f":"#REF!&INT((CI26-DATE(YEAR(CI26-WEEKDAY(CI26-1)+4),1,3)+WEEKDAY(DATE(YEAR(CI26-WEEKDAY(CI26-1)+4),1,3))+5)/7)","v":{"$error":"#REF!"}},{"$f":"#REF!&INT((CJ26-DATE(YEAR(CJ26-WEEKDAY(CJ26-1)+4),1,3)+WEEKDAY(DATE(YEAR(CJ26-WEEKDAY(CJ26-1)+4),1,3))+5)/7)","v":{"$error":"#REF!"}},{"$f":"#REF!&INT((CK26-DATE(YEAR(CK26-WEEKDAY(CK26-1)+4),1,3)+WEEKDAY(DATE(YEAR(CK26-WEEKDAY(CK26-1)+4),1,3))+5)/7)","v":{"$error":"#REF!"}},{"$f":"#REF!&INT((CL26-DATE(YEAR(CL26-WEEKDAY(CL26-1)+4),1,3)+WEEKDAY(DATE(YEAR(CL26-WEEKDAY(CL26-1)+4),1,3))+5)/7)","v":{"$error":"#REF!"}},{"$f":"#REF!&INT((CM26-DATE(YEAR(CM26-WEEKDAY(CM26-1)+4),1,3)+WEEKDAY(DATE(YEAR(CM26-WEEKDAY(CM26-1)+4),1,3))+5)/7)","v":{"$error":"#REF!"}},{"$f":"#REF!&INT((CN26-DATE(YEAR(CN26-WEEKDAY(CN26-1)+4),1,3)+WEEKDAY(DATE(YEAR(CN26-WEEKDAY(CN26-1)+4),1,3))+5)/7)","v":{"$error":"#REF!"}},{"$f":"#REF!&INT((CO26-DATE(YEAR(CO26-WEEKDAY(CO26-1)+4),1,3)+WEEKDAY(DATE(YEAR(CO26-WEEKDAY(CO26-1)+4),1,3))+5)/7)","v":{"$error":"#REF!"}},{"$f":"#REF!&INT((CP26-DATE(YEAR(CP26-WEEKDAY(CP26-1)+4),1,3)+WEEKDAY(DATE(YEAR(CP26-WEEKDAY(CP26-1)+4),1,3))+5)/7)","v":{"$error":"#REF!"}},{"$f":"#REF!&INT((CQ26-DATE(YEAR(CQ26-WEEKDAY(CQ26-1)+4),1,3)+WEEKDAY(DATE(YEAR(CQ26-WEEKDAY(CQ26-1)+4),1,3))+5)/7)","v":{"$error":"#REF!"}},{"$f":"#REF!&INT((CR26-DATE(YEAR(CR26-WEEKDAY(CR26-1)+4),1,3)+WEEKDAY(DATE(YEAR(CR26-WEEKDAY(CR26-1)+4),1,3))+5)/7)","v":{"$error":"#REF!"}},{"$f":"#REF!&INT((CS26-DATE(YEAR(CS26-WEEKDAY(CS26-1)+4),1,3)+WEEKDAY(DATE(YEAR(CS26-WEEKDAY(CS26-1)+4),1,3))+5)/7)","v":{"$error":"#REF!"}},{"$f":"$A$10&INT((CT26-DATE(YEAR(CT26-WEEKDAY(CT26-1)+4),1,3)+WEEKDAY(DATE(YEAR(CT26-WEEKDAY(CT26-1)+4),1,3))+5)/7)","v":"22"},{"$f":"#REF!&INT((CU26-DATE(YEAR(CU26-WEEKDAY(CU26-1)+4),1,3)+WEEKDAY(DATE(YEAR(CU26-WEEKDAY(CU26-1)+4),1,3))+5)/7)","v":{"$error":"#REF!"}},{"$f":"#REF!&INT((CV26-DATE(YEAR(CV26-WEEKDAY(CV26-1)+4),1,3)+WEEKDAY(DATE(YEAR(CV26-WEEKDAY(CV26-1)+4),1,3))+5)/7)","v":{"$error":"#REF!"}},{"$f":"#REF!&INT((CW26-DATE(YEAR(CW26-WEEKDAY(CW26-1)+4),1,3)+WEEKDAY(DATE(YEAR(CW26-WEEKDAY(CW26-1)+4),1,3))+5)/7)","v":{"$error":"#REF!"}},{"$f":"#REF!&INT((CX26-DATE(YEAR(CX26-WEEKDAY(CX26-1)+4),1,3)+WEEKDAY(DATE(YEAR(CX26-WEEKDAY(CX26-1)+4),1,3))+5)/7)","v":{"$error":"#REF!"}},{"$f":"#REF!&INT((CY26-DATE(YEAR(CY26-WEEKDAY(CY26-1)+4),1,3)+WEEKDAY(DATE(YEAR(CY26-WEEKDAY(CY26-1)+4),1,3))+5)/7)","v":{"$error":"#REF!"}},{"$f":"#REF!&INT((CZ26-DATE(YEAR(CZ26-WEEKDAY(CZ26-1)+4),1,3)+WEEKDAY(DATE(YEAR(CZ26-WEEKDAY(CZ26-1)+4),1,3))+5)/7)","v":{"$error":"#REF!"}},{"$f":"#REF!&INT((DA26-DATE(YEAR(DA26-WEEKDAY(DA26-1)+4),1,3)+WEEKDAY(DATE(YEAR(DA26-WEEKDAY(DA26-1)+4),1,3))+5)/7)","v":{"$error":"#REF!"}},{"$f":"#REF!&INT((DB26-DATE(YEAR(DB26-WEEKDAY(DB26-1)+4),1,3)+WEEKDAY(DATE(YEAR(DB26-WEEKDAY(DB26-1)+4),1,3))+5)/7)","v":{"$error":"#REF!"}},{"$f":"#REF!&INT((DC26-DATE(YEAR(DC26-WEEKDAY(DC26-1)+4),1,3)+WEEKDAY(DATE(YEAR(DC26-WEEKDAY(DC26-1)+4),1,3))+5)/7)","v":{"$error":"#REF!"}},{"$f":"#REF!&INT((DD26-DATE(YEAR(DD26-WEEKDAY(DD26-1)+4),1,3)+WEEKDAY(DATE(YEAR(DD26-WEEKDAY(DD26-1)+4),1,3))+5)/7)","v":{"$error":"#REF!"}},{"$f":"#REF!&INT((DE26-DATE(YEAR(DE26-WEEKDAY(DE26-1)+4),1,3)+WEEKDAY(DATE(YEAR(DE26-WEEKDAY(DE26-1)+4),1,3))+5)/7)","v":{"$error":"#REF!"}},{"$f":"#REF!&INT((DF26-DATE(YEAR(DF26-WEEKDAY(DF26-1)+4),1,3)+WEEKDAY(DATE(YEAR(DF26-WEEKDAY(DF26-1)+4),1,3))+5)/7)","v":{"$error":"#REF!"}},{"$f":"#REF!&INT((DG26-DATE(YEAR(DG26-WEEKDAY(DG26-1)+4),1,3)+WEEKDAY(DATE(YEAR(DG26-WEEKDAY(DG26-1)+4),1,3))+5)/7)","v":{"$error":"#REF!"}},{"$f":"#REF!&INT((DH26-DATE(YEAR(DH26-WEEKDAY(DH26-1)+4),1,3)+WEEKDAY(DATE(YEAR(DH26-WEEKDAY(DH26-1)+4),1,3))+5)/7)","v":{"$error":"#REF!"}},{"$f":"#REF!&INT((DI26-DATE(YEAR(DI26-WEEKDAY(DI26-1)+4),1,3)+WEEKDAY(DATE(YEAR(DI26-WEEKDAY(DI26-1)+4),1,3))+5)/7)","v":{"$error":"#REF!"}},{"$f":"#REF!&INT((DJ26-DATE(YEAR(DJ26-WEEKDAY(DJ26-1)+4),1,3)+WEEKDAY(DATE(YEAR(DJ26-WEEKDAY(DJ26-1)+4),1,3))+5)/7)","v":{"$error":"#REF!"}},{"$f":"#REF!&INT((DK26-DATE(YEAR(DK26-WEEKDAY(DK26-1)+4),1,3)+WEEKDAY(DATE(YEAR(DK26-WEEKDAY(DK26-1)+4),1,3))+5)/7)","v":{"$error":"#REF!"}},{"$f":"#REF!&INT((DL26-DATE(YEAR(DL26-WEEKDAY(DL26-1)+4),1,3)+WEEKDAY(DATE(YEAR(DL26-WEEKDAY(DL26-1)+4),1,3))+5)/7)","v":{"$error":"#REF!"}},{"$f":"#REF!&INT((DM26-DATE(YEAR(DM26-WEEKDAY(DM26-1)+4),1,3)+WEEKDAY(DATE(YEAR(DM26-WEEKDAY(DM26-1)+4),1,3))+5)/7)","v":{"$error":"#REF!"}},{"$f":"#REF!&INT((DN26-DATE(YEAR(DN26-WEEKDAY(DN26-1)+4),1,3)+WEEKDAY(DATE(YEAR(DN26-WEEKDAY(DN26-1)+4),1,3))+5)/7)","v":{"$error":"#REF!"}},{"$f":"#REF!&INT((DO26-DATE(YEAR(DO26-WEEKDAY(DO26-1)+4),1,3)+WEEKDAY(DATE(YEAR(DO26-WEEKDAY(DO26-1)+4),1,3))+5)/7)","v":{"$error":"#REF!"}},{"$f":"#REF!&INT((DP26-DATE(YEAR(DP26-WEEKDAY(DP26-1)+4),1,3)+WEEKDAY(DATE(YEAR(DP26-WEEKDAY(DP26-1)+4),1,3))+5)/7)","v":{"$error":"#REF!"}},{"$f":"#REF!&INT((DQ26-DATE(YEAR(DQ26-WEEKDAY(DQ26-1)+4),1,3)+WEEKDAY(DATE(YEAR(DQ26-WEEKDAY(DQ26-1)+4),1,3))+5)/7)","v":{"$error":"#REF!"}}]
{"$rows_left_out":36}
{"sheet":"References","index":2,"n_rows":975,"n_cols":15,"rows_kept":975,"cut":false,"hidden":false,"merged":[]}
[58594,"A 1148 S IBC1200KG",null,58594,{"$f":"VLOOKUP(D1,A:B,2,0)","v":"A 1148 S IBC1200KG"}]
[58594,"A 1148 S IBC1200KG",null,21357,"C 3892 R K302 SP1250"]
[58594,"A 1148 S IBC1200KG",null,55964,"DGS 110 R V 6073 BB1000"]
[55986,"A0453 solvant IMP 164KG",null,null,{"$error":"#N/A"}]
[20183,"C 3023 R K407 OCT900",null,null,{"$error":"#N/A"}]
[21357,"C 3892 R K302 SP1250",null,null,{"$error":"#N/A"}]
[21357,"C 3892 R K302 SP1250",null,null,{"$error":"#N/A"}]
[50781,"CA 90 DE BK03 SP1250",null,null,{"$error":"#N/A"}]
["57963D3","DB BLANC CASSE BB1000",null,null,{"$error":"#N/A"}]
["55645D2","DGS 001 B4165 BB1000",null,null,{"$error":"#N/A"}]
[55964,"DGS 110 R V 6073 BB1000",null,null,{"$error":"#N/A"}]
[55964,"DGS 110 R V 6073 BB1000",null,null,{"$error":"#N/A"}]
["60053D4","DSE 6-09 D4270 BB750",null,null,{"$error":"#N/A"}]
["61547D5","DSE 6-17 A4508 BB750",null,null,{"$error":"#N/A"}]
[57423,"DSY 200/20 Z B78 A4329 BB750"]
[53902,"DSY 210/05 A4151 BB750"]
[53902,"DSY 210/05 A4151 BB750"]
[53290,"DSY 210/05 C4142 BB750"]
[53290,"DSY 210/05 C4142 BB750"]
[53290,"DSY 210/05 C4142 BB750"]
{"$rows_left_out":956}
{"sheet":"Feuil2","index":3,"n_rows":32,"n_cols":3,"rows_kept":32,"cut":false,"hidden":false,"merged":[]}
[]
["Janvier",1,2015]
["Février",2,2016]
["Mars",3,2017]
["Avril",4,2018]
["Mai",5,2019]
["Juin",6,2020]
["Juillet",7,2021]
["Aout",8,2022]
["Septembre",9,2023]
["Novembre",10,2024]
["Decembre",11,2025]
[null,12,2026]
[null,13,2027]
[null,14,2028]
[null,15,2029]
[null,16,2030]
[null,17,2031]
[null,18,2032]
[null,19,2033]
{"$rows_left_out":12}