{"text_format":"1","workbook":"xlsx","n_sheets":4,"sheets":["Planning","Planning1","References","Feuil2"],"not_rendered":{"charts":0,"images":0,"macros":1,"external_links":0,"defined_names":7,"comments":1,"pivot_tables":0},"unopened":[],"bounds":{"document_bytes":16777216,"sheet_cells":100000,"rows_first":2000,"rows_last":500,"rows_between":2000,"halvings":0,"cell_chars":16384,"cell_head_chars":4096},"cells_cut":0,"cells_raw":0,"read":"whole","date_system":"1900"}

{"sheet":"Planning","index":0,"n_rows":605,"n_cols":15,"rows_kept":605,"cut":false,"hidden":false,"merged":[[13,4,13,5],[14,4,14,5],[15,4,15,5],[0,2,1,11],[5,3,5,7],[6,4,6,5],[7,4,7,5],[8,4,8,5],[9,3,9,4],[10,4,10,5],[11,4,11,5]]}
[null,null,"Planning Resinoplast"]
[]
[]
[]
[null,null,null,null,null,null,"Emplacement","utilisateurs"]
[]
[null,null,null,30,"Validation ",null,"Validation de ligne","Michel et Ali"]
[null,null,null,20,"Attention",null,"Problemes/Attention","Michel et Ali"]
[null,null,null,10,"Problème",null,"Problemes/Attention","Michel et Ali"]
[]
[null,null,null,40,"Ticket pas encore validé",null,"Validation des tickets","Catherine"]
[null,null,null,50,"ticket Validé",null,"Validation des tickets","Catherine"]
[]
[null,null,null,0,"étoile vide=",null,"Temps de contrôle","Jordane"]
[null,null,null,12,"1/2 étoile=",null,"Temps de contrôle","Jordane"]
[null,null,null,24,"1 étoile complète = 1 Journée contrôle",null,"Temps de contrôle","Jordane"]
[]
[null,null,null,null,null,null,null,null,{"$f":"IF(ISNA(VLOOKUP(Planning!$C24,References!A:B,2,0)),\"0\",VLOOKUP(Planning!$C24,References!A:B,2,0))","v":"DSY 210/05 C4142 BB750"}]
[]
[null,null,"http://www.commentcamarche.net/forum/affich-3389274-besoin-d-aide-pour-creation-planning#p32036029"]
[]
[null,null,null,null,null,null,null,null,null,null,"Michel & Ali","Michel & Ali","Catherine","Jordane"]
["Nom du produit","N° OF ","Code Produit","Date de début","Date de fin","Client","Quantité","Avancement","Colonne1","Date expedition ","Validation des tickets","Attention","Validation de ligne","Contrôle","N° de ligne "]
["DSY 210/05 C4142 BB750",108555,53290,null,null,"alfaflex","12t",null,null,"",40,20,30,24,"LIGNE 1"]
[{"$f":"IF(ISNA(VLOOKUP(Planning!$C25,References!A:B,2,0)),\"\",VLOOKUP(Planning!$C25,References!A:B,2,0))","v":"DSY 210/05 C4142 BB750"},105213,53290,"15/05/2015 00:00:00","15/05/2015 04:00:00","alfaflex","15T",null,null,"28/05/2015",30,10,null,12,"LIGNE 2"]
[{"$f":"IF(ISNA(VLOOKUP(Planning!$C26,References!A:B,2,0)),\"\",VLOOKUP(Planning!$C26,References!A:B,2,0))","v":"DSY 210/05 C4142 BB750"},108524,53290,"28/05/2015 00:00:00","28/05/2015 06:00:00","alfacan","15T",null,null,"30/05/2015",null,0,null,0,"LIGNE 2"]
[{"$f":"IF(ISNA(VLOOKUP(Planning!$C27,References!A:B,2,0)),\"\",VLOOKUP(Planning!$C27,References!A:B,2,0))","v":"DSY 210/05 C4142 BB750"},109021,53290,"29/05/2015 15:00:00","29/05/2015 19:00:00","alfacan","20T",null,null,"30/05/2015",null,null,null,null,"LIGNE 3"]
[{"$f":"IF(ISNA(VLOOKUP(Planning!$C28,References!A:B,2,0)),\"\",VLOOKUP(Planning!$C28,References!A:B,2,0))","v":"DSY 210/05 C4142 BB750"},110215,53290,"30/05/2015 12:00:00","30/05/2015 19:00:00","Afaflex","20T",null,null,"30/05/2015",null,null,null,null,"LIGNE 5"]
[{"$f":"IF(ISNA(VLOOKUP(Planning!$C29,References!A:B,2,0)),\"\",VLOOKUP(Planning!$C29,References!A:B,2,0))","v":""}]
[{"$f":"IF(ISNA(VLOOKUP(Planning!$C30,References!A:B,2,0)),\"\",VLOOKUP(Planning!$C30,References!A:B,2,0))","v":""}]
[{"$f":"IF(ISNA(VLOOKUP(Planning!$C31,References!A:B,2,0)),\"\",VLOOKUP(Planning!$C31,References!A:B,2,0))","v":""}]
[{"$f":"IF(ISNA(VLOOKUP(Planning!$C32,References!A:B,2,0)),\"\",VLOOKUP(Planning!$C32,References!A:B,2,0))","v":""}]
[{"$f":"IF(ISNA(VLOOKUP(Planning!$C33,References!A:B,2,0)),\"\",VLOOKUP(Planning!$C33,References!A:B,2,0))","v":""}]
[{"$f":"IF(ISNA(VLOOKUP(Planning!$C34,References!A:B,2,0)),\"\",VLOOKUP(Planning!$C34,References!A:B,2,0))","v":""}]
[{"$f":"IF(ISNA(VLOOKUP(Planning!$C35,References!A:B,2,0)),\"\",VLOOKUP(Planning!$C35,References!A:B,2,0))","v":""}]
[{"$f":"IF(ISNA(VLOOKUP(Planning!$C36,References!A:B,2,0)),\"\",VLOOKUP(Planning!$C36,References!A:B,2,0))","v":""}]
[{"$f":"IF(ISNA(VLOOKUP(Planning!$C37,References!A:B,2,0)),\"\",VLOOKUP(Planning!$C37,References!A:B,2,0))","v":""}]
[{"$f":"IF(ISNA(VLOOKUP(Planning!$C38,References!A:B,2,0)),\"\",VLOOKUP(Planning!$C38,References!A:B,2,0))","v":""}]
[{"$f":"IF(ISNA(VLOOKUP(Planning!$C39,References!A:B,2,0)),\"\",VLOOKUP(Planning!$C39,References!A:B,2,0))","v":""}]
[{"$f":"IF(ISNA(VLOOKUP(Planning!$C40,References!A:B,2,0)),\"\",VLOOKUP(Planning!$C40,References!A:B,2,0))","v":""}]
[{"$f":"IF(ISNA(VLOOKUP(Planning!$C41,References!A:B,2,0)),\"\",VLOOKUP(Planning!$C41,References!A:B,2,0))","v":""}]
[{"$f":"IF(ISNA(VLOOKUP(Planning!$C42,References!A:B,2,0)),\"\",VLOOKUP(Planning!$C42,References!A:B,2,0))","v":""}]
[{"$f":"IF(ISNA(VLOOKUP(Planning!$C43,References!A:B,2,0)),\"\",VLOOKUP(Planning!$C43,References!A:B,2,0))","v":""}]
[{"$f":"IF(ISNA(VLOOKUP(Planning!$C44,References!A:B,2,0)),\"\",VLOOKUP(Planning!$C44,References!A:B,2,0))","v":""}]
[{"$f":"IF(ISNA(VLOOKUP(Planning!$C45,References!A:B,2,0)),\"\",VLOOKUP(Planning!$C45,References!A:B,2,0))","v":""}]
[{"$f":"IF(ISNA(VLOOKUP(Planning!$C46,References!A:B,2,0)),\"\",VLOOKUP(Planning!$C46,References!A:B,2,0))","v":""}]
[{"$f":"IF(ISNA(VLOOKUP(Planning!$C47,References!A:B,2,0)),\"\",VLOOKUP(Planning!$C47,References!A:B,2,0))","v":""}]
[{"$f":"IF(ISNA(VLOOKUP(Planning!$C48,References!A:B,2,0)),\"\",VLOOKUP(Planning!$C48,References!A:B,2,0))","v":""}]
[{"$f":"IF(ISNA(VLOOKUP(Planning!$C49,References!A:B,2,0)),\"\",VLOOKUP(Planning!$C49,References!A:B,2,0))","v":""}]
[{"$f":"IF(ISNA(VLOOKUP(Planning!$C50,References!A:B,2,0)),\"\",VLOOKUP(Planning!$C50,References!A:B,2,0))","v":""}]
[{"$f":"IF(ISNA(VLOOKUP(Planning!$C51,References!A:B,2,0)),\"\",VLOOKUP(Planning!$C51,References!A:B,2,0))","v":""}]
[{"$f":"IF(ISNA(VLOOKUP(Planning!$C52,References!A:B,2,0)),\"\",VLOOKUP(Planning!$C52,References!A:B,2,0))","v":""}]
[{"$f":"IF(ISNA(VLOOKUP(Planning!$C53,References!A:B,2,0)),\"\",VLOOKUP(Planning!$C53,References!A:B,2,0))","v":""}]
[{"$f":"IF(ISNA(VLOOKUP(Planning!$C54,References!A:B,2,0)),\"\",VLOOKUP(Planning!$C54,References!A:B,2,0))","v":""}]
[{"$f":"IF(ISNA(VLOOKUP(Planning!$C55,References!A:B,2,0)),\"\",VLOOKUP(Planning!$C55,References!A:B,2,0))","v":""}]
[{"$f":"IF(ISNA(VLOOKUP(Planning!$C56,References!A:B,2,0)),\"\",VLOOKUP(Planning!$C56,References!A:B,2,0))","v":""}]
[{"$f":"IF(ISNA(VLOOKUP(Planning!$C57,References!A:B,2,0)),\"\",VLOOKUP(Planning!$C57,References!A:B,2,0))","v":""}]
[{"$f":"IF(ISNA(VLOOKUP(Planning!$C58,References!A:B,2,0)),\"\",VLOOKUP(Planning!$C58,References!A:B,2,0))","v":""}]
[{"$f":"IF(ISNA(VLOOKUP(Planning!$C59,References!A:B,2,0)),\"\",VLOOKUP(Planning!$C59,References!A:B,2,0))","v":""}]
[{"$f":"IF(ISNA(VLOOKUP(Planning!$C60,References!A:B,2,0)),\"\",VLOOKUP(Planning!$C60,References!A:B,2,0))","v":""}]
[{"$f":"IF(ISNA(VLOOKUP(Planning!$C61,References!A:B,2,0)),\"\",VLOOKUP(Planning!$C61,References!A:B,2,0))","v":""}]
[{"$f":"IF(ISNA(VLOOKUP(Planning!$C62,References!A:B,2,0)),\"\",VLOOKUP(Planning!$C62,References!A:B,2,0))","v":""}]
[{"$f":"IF(ISNA(VLOOKUP(Planning!$C63,References!A:B,2,0)),\"\",VLOOKUP(Planning!$C63,References!A:B,2,0))","v":""}]
[{"$f":"IF(ISNA(VLOOKUP(Planning!$C64,References!A:B,2,0)),\"\",VLOOKUP(Planning!$C64,References!A:B,2,0))","v":""}]
[{"$f":"IF(ISNA(VLOOKUP(Planning!$C65,References!A:B,2,0)),\"\",VLOOKUP(Planning!$C65,References!A:B,2,0))","v":""}]
[{"$f":"IF(ISNA(VLOOKUP(Planning!$C66,References!A:B,2,0)),\"\",VLOOKUP(Planning!$C66,References!A:B,2,0))","v":""}]
[{"$f":"IF(ISNA(VLOOKUP(Planning!$C67,References!A:B,2,0)),\"\",VLOOKUP(Planning!$C67,References!A:B,2,0))","v":""}]
[{"$f":"IF(ISNA(VLOOKUP(Planning!$C68,References!A:B,2,0)),\"\",VLOOKUP(Planning!$C68,References!A:B,2,0))","v":""}]
[{"$f":"IF(ISNA(VLOOKUP(Planning!$C69,References!A:B,2,0)),\"\",VLOOKUP(Planning!$C69,References!A:B,2,0))","v":""}]
[{"$f":"IF(ISNA(VLOOKUP(Planning!$C70,References!A:B,2,0)),\"\",VLOOKUP(Planning!$C70,References!A:B,2,0))","v":""}]
[{"$f":"IF(ISNA(VLOOKUP(Planning!$C71,References!A:B,2,0)),\"\",VLOOKUP(Planning!$C71,References!A:B,2,0))","v":""}]
[{"$f":"IF(ISNA(VLOOKUP(Planning!$C72,References!A:B,2,0)),\"\",VLOOKUP(Planning!$C72,References!A:B,2,0))","v":""}]
[{"$f":"IF(ISNA(VLOOKUP(Planning!$C73,References!A:B,2,0)),\"\",VLOOKUP(Planning!$C73,References!A:B,2,0))","v":""}]
[{"$f":"IF(ISNA(VLOOKUP(Planning!$C74,References!A:B,2,0)),\"\",VLOOKUP(Planning!$C74,References!A:B,2,0))","v":""}]
[{"$f":"IF(ISNA(VLOOKUP(Planning!$C75,References!A:B,2,0)),\"\",VLOOKUP(Planning!$C75,References!A:B,2,0))","v":""}]
[{"$f":"IF(ISNA(VLOOKUP(Planning!$C76,References!A:B,2,0)),\"\",VLOOKUP(Planning!$C76,References!A:B,2,0))","v":""}]
[{"$f":"IF(ISNA(VLOOKUP(Planning!$C77,References!A:B,2,0)),\"\",VLOOKUP(Planning!$C77,References!A:B,2,0))","v":""}]
[{"$f":"IF(ISNA(VLOOKUP(Planning!$C78,References!A:B,2,0)),\"\",VLOOKUP(Planning!$C78,References!A:B,2,0))","v":""}]
[{"$f":"IF(ISNA(VLOOKUP(Planning!$C79,References!A:B,2,0)),\"\",VLOOKUP(Planning!$C79,References!A:B,2,0))","v":""}]
[{"$f":"IF(ISNA(VLOOKUP(Planning!$C80,References!A:B,2,0)),\"\",VLOOKUP(Planning!$C80,References!A:B,2,0))","v":""}]
[{"$f":"IF(ISNA(VLOOKUP(Planning!$C81,References!A:B,2,0)),\"\",VLOOKUP(Planning!$C81,References!A:B,2,0))","v":""}]
[{"$f":"IF(ISNA(VLOOKUP(Planning!$C82,References!A:B,2,0)),\"\",VLOOKUP(Planning!$C82,References!A:B,2,0))","v":""}]
[{"$f":"IF(ISNA(VLOOKUP(Planning!$C83,References!A:B,2,0)),\"\",VLOOKUP(Planning!$C83,References!A:B,2,0))","v":""}]
[{"$f":"IF(ISNA(VLOOKUP(Planning!$C84,References!A:B,2,0)),\"\",VLOOKUP(Planning!$C84,References!A:B,2,0))","v":""}]
[{"$f":"IF(ISNA(VLOOKUP(Planning!$C85,References!A:B,2,0)),\"\",VLOOKUP(Planning!$C85,References!A:B,2,0))","v":""}]
[{"$f":"IF(ISNA(VLOOKUP(Planning!$C86,References!A:B,2,0)),\"\",VLOOKUP(Planning!$C86,References!A:B,2,0))","v":""}]
[{"$f":"IF(ISNA(VLOOKUP(Planning!$C87,References!A:B,2,0)),\"\",VLOOKUP(Planning!$C87,References!A:B,2,0))","v":""}]
[{"$f":"IF(ISNA(VLOOKUP(Planning!$C88,References!A:B,2,0)),\"\",VLOOKUP(Planning!$C88,References!A:B,2,0))","v":""}]
[{"$f":"IF(ISNA(VLOOKUP(Planning!$C89,References!A:B,2,0)),\"\",VLOOKUP(Planning!$C89,References!A:B,2,0))","v":""}]
[{"$f":"IF(ISNA(VLOOKUP(Planning!$C90,References!A:B,2,0)),\"\",VLOOKUP(Planning!$C90,References!A:B,2,0))","v":""}]
[{"$f":"IF(ISNA(VLOOKUP(Planning!$C91,References!A:B,2,0)),\"\",VLOOKUP(Planning!$C91,References!A:B,2,0))","v":""}]
[{"$f":"IF(ISNA(VLOOKUP(Planning!$C92,References!A:B,2,0)),\"\",VLOOKUP(Planning!$C92,References!A:B,2,0))","v":""}]
[{"$f":"IF(ISNA(VLOOKUP(Planning!$C93,References!A:B,2,0)),\"\",VLOOKUP(Planning!$C93,References!A:B,2,0))","v":""}]
[{"$f":"IF(ISNA(VLOOKUP(Planning!$C94,References!A:B,2,0)),\"\",VLOOKUP(Planning!$C94,References!A:B,2,0))","v":""}]
[{"$f":"IF(ISNA(VLOOKUP(Planning!$C95,References!A:B,2,0)),\"\",VLOOKUP(Planning!$C95,References!A:B,2,0))","v":""}]
[{"$f":"IF(ISNA(VLOOKUP(Planning!$C96,References!A:B,2,0)),\"\",VLOOKUP(Planning!$C96,References!A:B,2,0))","v":""}]
[{"$f":"IF(ISNA(VLOOKUP(Planning!$C97,References!A:B,2,0)),\"\",VLOOKUP(Planning!$C97,References!A:B,2,0))","v":""}]
[{"$f":"IF(ISNA(VLOOKUP(Planning!$C98,References!A:B,2,0)),\"\",VLOOKUP(Planning!$C98,References!A:B,2,0))","v":""}]
[{"$f":"IF(ISNA(VLOOKUP(Planning!$C99,References!A:B,2,0)),\"\",VLOOKUP(Planning!$C99,References!A:B,2,0))","v":""}]
[{"$f":"IF(ISNA(VLOOKUP(Planning!$C100,References!A:B,2,0)),\"\",VLOOKUP(Planning!$C100,References!A:B,2,0))","v":""}]
[{"$f":"IF(ISNA(VLOOKUP(Planning!$C101,References!A:B,2,0)),\"\",VLOOKUP(Planning!$C101,References!A:B,2,0))","v":""}]
[{"$f":"IF(ISNA(VLOOKUP(Planning!$C102,References!A:B,2,0)),\"\",VLOOKUP(Planning!$C102,References!A:B,2,0))","v":""}]
[{"$f":"IF(ISNA(VLOOKUP(Planning!$C103,References!A:B,2,0)),\"\",VLOOKUP(Planning!$C103,References!A:B,2,0))","v":""}]
[{"$f":"IF(ISNA(VLOOKUP(Planning!$C104,References!A:B,2,0)),\"\",VLOOKUP(Planning!$C104,References!A:B,2,0))","v":""}]
[{"$f":"IF(ISNA(VLOOKUP(Planning!$C105,References!A:B,2,0)),\"\",VLOOKUP(Planning!$C105,References!A:B,2,0))","v":""}]
[{"$f":"IF(ISNA(VLOOKUP(Planning!$C106,References!A:B,2,0)),\"\",VLOOKUP(Planning!$C106,References!A:B,2,0))","v":""}]
[{"$f":"IF(ISNA(VLOOKUP(Planning!$C107,References!A:B,2,0)),\"\",VLOOKUP(Planning!$C107,References!A:B,2,0))","v":""}]
[{"$f":"IF(ISNA(VLOOKUP(Planning!$C108,References!A:B,2,0)),\"\",VLOOKUP(Planning!$C108,References!A:B,2,0))","v":""}]
[{"$f":"IF(ISNA(VLOOKUP(Planning!$C109,References!A:B,2,0)),\"\",VLOOKUP(Planning!$C109,References!A:B,2,0))","v":""}]
[{"$f":"IF(ISNA(VLOOKUP(Planning!$C110,References!A:B,2,0)),\"\",VLOOKUP(Planning!$C110,References!A:B,2,0))","v":""}]
[{"$f":"IF(ISNA(VLOOKUP(Planning!$C111,References!A:B,2,0)),\"\",VLOOKUP(Planning!$C111,References!A:B,2,0))","v":""}]
[{"$f":"IF(ISNA(VLOOKUP(Planning!$C112,References!A:B,2,0)),\"\",VLOOKUP(Planning!$C112,References!A:B,2,0))","v":""}]
[{"$f":"IF(ISNA(VLOOKUP(Planning!$C113,References!A:B,2,0)),\"\",VLOOKUP(Planning!$C113,References!A:B,2,0))","v":""}]
[{"$f":"IF(ISNA(VLOOKUP(Planning!$C114,References!A:B,2,0)),\"\",VLOOKUP(Planning!$C114,References!A:B,2,0))","v":""}]
[{"$f":"IF(ISNA(VLOOKUP(Planning!$C115,References!A:B,2,0)),\"\",VLOOKUP(Planning!$C115,References!A:B,2,0))","v":""}]
[{"$f":"IF(ISNA(VLOOKUP(Planning!$C116,References!A:B,2,0)),\"\",VLOOKUP(Planning!$C116,References!A:B,2,0))","v":""}]
[{"$f":"IF(ISNA(VLOOKUP(Planning!$C117,References!A:B,2,0)),\"\",VLOOKUP(Planning!$C117,References!A:B,2,0))","v":""}]
[{"$f":"IF(ISNA(VLOOKUP(Planning!$C118,References!A:B,2,0)),\"\",VLOOKUP(Planning!$C118,References!A:B,2,0))","v":""}]
[{"$f":"IF(ISNA(VLOOKUP(Planning!$C119,References!A:B,2,0)),\"\",VLOOKUP(Planning!$C119,References!A:B,2,0))","v":""}]
[{"$f":"IF(ISNA(VLOOKUP(Planning!$C120,References!A:B,2,0)),\"\",VLOOKUP(Planning!$C120,References!A:B,2,0))","v":""}]
[{"$f":"IF(ISNA(VLOOKUP(Planning!$C121,References!A:B,2,0)),\"\",VLOOKUP(Planning!$C121,References!A:B,2,0))","v":""}]
[{"$f":"IF(ISNA(VLOOKUP(Planning!$C122,References!A:B,2,0)),\"\",VLOOKUP(Planning!$C122,References!A:B,2,0))","v":""}]
[{"$f":"IF(ISNA(VLOOKUP(Planning!$C123,References!A:B,2,0)),\"\",VLOOKUP(Planning!$C123,References!A:B,2,0))","v":""}]
[{"$f":"IF(ISNA(VLOOKUP(Planning!$C124,References!A:B,2,0)),\"\",VLOOKUP(Planning!$C124,References!A:B,2,0))","v":""}]
[{"$f":"IF(ISNA(VLOOKUP(Planning!$C125,References!A:B,2,0)),\"\",VLOOKUP(Planning!$C125,References!A:B,2,0))","v":""}]
[{"$f":"IF(ISNA(VLOOKUP(Planning!$C126,References!A:B,2,0)),\"\",VLOOKUP(Planning!$C126,References!A:B,2,0))","v":""}]
[{"$f":"IF(ISNA(VLOOKUP(Planning!$C127,References!A:B,2,0)),\"\",VLOOKUP(Planning!$C127,References!A:B,2,0))","v":""}]
[{"$f":"IF(ISNA(VLOOKUP(Planning!$C128,References!A:B,2,0)),\"\",VLOOKUP(Planning!$C128,References!A:B,2,0))","v":""}]
[{"$f":"IF(ISNA(VLOOKUP(Planning!$C129,References!A:B,2,0)),\"\",VLOOKUP(Planning!$C129,References!A:B,2,0))","v":""}]
[{"$f":"IF(ISNA(VLOOKUP(Planning!$C130,References!A:B,2,0)),\"\",VLOOKUP(Planning!$C130,References!A:B,2,0))","v":""}]
[{"$f":"IF(ISNA(VLOOKUP(Planning!$C131,References!A:B,2,0)),\"\",VLOOKUP(Planning!$C131,References!A:B,2,0))","v":""}]
[{"$f":"IF(ISNA(VLOOKUP(Planning!$C132,References!A:B,2,0)),\"\",VLOOKUP(Planning!$C132,References!A:B,2,0))","v":""}]
[{"$f":"IF(ISNA(VLOOKUP(Planning!$C133,References!A:B,2,0)),\"\",VLOOKUP(Planning!$C133,References!A:B,2,0))","v":""}]
[{"$f":"IF(ISNA(VLOOKUP(Planning!$C134,References!A:B,2,0)),\"\",VLOOKUP(Planning!$C134,References!A:B,2,0))","v":""}]
[{"$f":"IF(ISNA(VLOOKUP(Planning!$C135,References!A:B,2,0)),\"\",VLOOKUP(Planning!$C135,References!A:B,2,0))","v":""}]
[{"$f":"IF(ISNA(VLOOKUP(Planning!$C136,References!A:B,2,0)),\"\",VLOOKUP(Planning!$C136,References!A:B,2,0))","v":""}]
[{"$f":"IF(ISNA(VLOOKUP(Planning!$C137,References!A:B,2,0)),\"\",VLOOKUP(Planning!$C137,References!A:B,2,0))","v":""}]
[{"$f":"IF(ISNA(VLOOKUP(Planning!$C138,References!A:B,2,0)),\"\",VLOOKUP(Planning!$C138,References!A:B,2,0))","v":""}]
[{"$f":"IF(ISNA(VLOOKUP(Planning!$C139,References!A:B,2,0)),\"\",VLOOKUP(Planning!$C139,References!A:B,2,0))","v":""}]
[{"$f":"IF(ISNA(VLOOKUP(Planning!$C140,References!A:B,2,0)),\"\",VLOOKUP(Planning!$C140,References!A:B,2,0))","v":""}]
[{"$f":"IF(ISNA(VLOOKUP(Planning!$C141,References!A:B,2,0)),\"\",VLOOKUP(Planning!$C141,References!A:B,2,0))","v":""}]
[{"$f":"IF(ISNA(VLOOKUP(Planning!$C142,References!A:B,2,0)),\"\",VLOOKUP(Planning!$C142,References!A:B,2,0))","v":""}]
[{"$f":"IF(ISNA(VLOOKUP(Planning!$C143,References!A:B,2,0)),\"\",VLOOKUP(Planning!$C143,References!A:B,2,0))","v":""}]
[{"$f":"IF(ISNA(VLOOKUP(Planning!$C144,References!A:B,2,0)),\"\",VLOOKUP(Planning!$C144,References!A:B,2,0))","v":""}]
[{"$f":"IF(ISNA(VLOOKUP(Planning!$C145,References!A:B,2,0)),\"\",VLOOKUP(Planning!$C145,References!A:B,2,0))","v":""}]
[{"$f":"IF(ISNA(VLOOKUP(Planning!$C146,References!A:B,2,0)),\"\",VLOOKUP(Planning!$C146,References!A:B,2,0))","v":""}]
[{"$f":"IF(ISNA(VLOOKUP(Planning!$C147,References!A:B,2,0)),\"\",VLOOKUP(Planning!$C147,References!A:B,2,0))","v":""}]
[{"$f":"IF(ISNA(VLOOKUP(Planning!$C148,References!A:B,2,0)),\"\",VLOOKUP(Planning!$C148,References!A:B,2,0))","v":""}]
[{"$f":"IF(ISNA(VLOOKUP(Planning!$C149,References!A:B,2,0)),\"\",VLOOKUP(Planning!$C149,References!A:B,2,0))","v":""}]
[{"$f":"IF(ISNA(VLOOKUP(Planning!$C150,References!A:B,2,0)),\"\",VLOOKUP(Planning!$C150,References!A:B,2,0))","v":""}]
[{"$f":"IF(ISNA(VLOOKUP(Planning!$C151,References!A:B,2,0)),\"\",VLOOKUP(Planning!$C151,References!A:B,2,0))","v":""}]
[{"$f":"IF(ISNA(VLOOKUP(Planning!$C152,References!A:B,2,0)),\"\",VLOOKUP(Planning!$C152,References!A:B,2,0))","v":""}]
[{"$f":"IF(ISNA(VLOOKUP(Planning!$C153,References!A:B,2,0)),\"\",VLOOKUP(Planning!$C153,References!A:B,2,0))","v":""}]
[{"$f":"IF(ISNA(VLOOKUP(Planning!$C154,References!A:B,2,0)),\"\",VLOOKUP(Planning!$C154,References!A:B,2,0))","v":""}]
[{"$f":"IF(ISNA(VLOOKUP(Planning!$C155,References!A:B,2,0)),\"\",VLOOKUP(Planning!$C155,References!A:B,2,0))","v":""}]
[{"$f":"IF(ISNA(VLOOKUP(Planning!$C156,References!A:B,2,0)),\"\",VLOOKUP(Planning!$C156,References!A:B,2,0))","v":""}]
[{"$f":"IF(ISNA(VLOOKUP(Planning!$C157,References!A:B,2,0)),\"\",VLOOKUP(Planning!$C157,References!A:B,2,0))","v":""}]
[{"$f":"IF(ISNA(VLOOKUP(Planning!$C158,References!A:B,2,0)),\"\",VLOOKUP(Planning!$C158,References!A:B,2,0))","v":""}]
[{"$f":"IF(ISNA(VLOOKUP(Planning!$C159,References!A:B,2,0)),\"\",VLOOKUP(Planning!$C159,References!A:B,2,0))","v":""}]
[{"$f":"IF(ISNA(VLOOKUP(Planning!$C160,References!A:B,2,0)),\"\",VLOOKUP(Planning!$C160,References!A:B,2,0))","v":""}]
[{"$f":"IF(ISNA(VLOOKUP(Planning!$C161,References!A:B,2,0)),\"\",VLOOKUP(Planning!$C161,References!A:B,2,0))","v":""}]
[{"$f":"IF(ISNA(VLOOKUP(Planning!$C162,References!A:B,2,0)),\"\",VLOOKUP(Planning!$C162,References!A:B,2,0))","v":""}]
[{"$f":"IF(ISNA(VLOOKUP(Planning!$C163,References!A:B,2,0)),\"\",VLOOKUP(Planning!$C163,References!A:B,2,0))","v":""}]
[{"$f":"IF(ISNA(VLOOKUP(Planning!$C164,References!A:B,2,0)),\"\",VLOOKUP(Planning!$C164,References!A:B,2,0))","v":""}]
[{"$f":"IF(ISNA(VLOOKUP(Planning!$C165,References!A:B,2,0)),\"\",VLOOKUP(Planning!$C165,References!A:B,2,0))","v":""}]
[{"$f":"IF(ISNA(VLOOKUP(Planning!$C166,References!A:B,2,0)),\"\",VLOOKUP(Planning!$C166,References!A:B,2,0))","v":""}]
[{"$f":"IF(ISNA(VLOOKUP(Planning!$C167,References!A:B,2,0)),\"\",VLOOKUP(Planning!$C167,References!A:B,2,0))","v":""}]
[{"$f":"IF(ISNA(VLOOKUP(Planning!$C168,References!A:B,2,0)),\"\",VLOOKUP(Planning!$C168,References!A:B,2,0))","v":""}]
[{"$f":"IF(ISNA(VLOOKUP(Planning!$C169,References!A:B,2,0)),\"\",VLOOKUP(Planning!$C169,References!A:B,2,0))","v":""}]
[{"$f":"IF(ISNA(VLOOKUP(Planning!$C170,References!A:B,2,0)),\"\",VLOOKUP(Planning!$C170,References!A:B,2,0))","v":""}]
[{"$f":"IF(ISNA(VLOOKUP(Planning!$C171,References!A:B,2,0)),\"\",VLOOKUP(Planning!$C171,References!A:B,2,0))","v":""}]
[{"$f":"IF(ISNA(VLOOKUP(Planning!$C172,References!A:B,2,0)),\"\",VLOOKUP(Planning!$C172,References!A:B,2,0))","v":""}]
[{"$f":"IF(ISNA(VLOOKUP(Planning!$C173,References!A:B,2,0)),\"\",VLOOKUP(Planning!$C173,References!A:B,2,0))","v":""}]
[{"$f":"IF(ISNA(VLOOKUP(Planning!$C174,References!A:B,2,0)),\"\",VLOOKUP(Planning!$C174,References!A:B,2,0))","v":""}]
[{"$f":"IF(ISNA(VLOOKUP(Planning!$C175,References!A:B,2,0)),\"\",VLOOKUP(Planning!$C175,References!A:B,2,0))","v":""}]
[{"$f":"IF(ISNA(VLOOKUP(Planning!$C176,References!A:B,2,0)),\"\",VLOOKUP(Planning!$C176,References!A:B,2,0))","v":""}]
[{"$f":"IF(ISNA(VLOOKUP(Planning!$C177,References!A:B,2,0)),\"\",VLOOKUP(Planning!$C177,References!A:B,2,0))","v":""}]
[{"$f":"IF(ISNA(VLOOKUP(Planning!$C178,References!A:B,2,0)),\"\",VLOOKUP(Planning!$C178,References!A:B,2,0))","v":""}]
[{"$f":"IF(ISNA(VLOOKUP(Planning!$C179,References!A:B,2,0)),\"\",VLOOKUP(Planning!$C179,References!A:B,2,0))","v":""}]
[{"$f":"IF(ISNA(VLOOKUP(Planning!$C180,References!A:B,2,0)),\"\",VLOOKUP(Planning!$C180,References!A:B,2,0))","v":""}]
[{"$f":"IF(ISNA(VLOOKUP(Planning!$C181,References!A:B,2,0)),\"\",VLOOKUP(Planning!$C181,References!A:B,2,0))","v":""}]
[{"$f":"IF(ISNA(VLOOKUP(Planning!$C182,References!A:B,2,0)),\"\",VLOOKUP(Planning!$C182,References!A:B,2,0))","v":""}]
[{"$f":"IF(ISNA(VLOOKUP(Planning!$C183,References!A:B,2,0)),\"\",VLOOKUP(Planning!$C183,References!A:B,2,0))","v":""}]
[{"$f":"IF(ISNA(VLOOKUP(Planning!$C184,References!A:B,2,0)),\"\",VLOOKUP(Planning!$C184,References!A:B,2,0))","v":""}]
[{"$f":"IF(ISNA(VLOOKUP(Planning!$C185,References!A:B,2,0)),\"\",VLOOKUP(Planning!$C185,References!A:B,2,0))","v":""}]
[{"$f":"IF(ISNA(VLOOKUP(Planning!$C186,References!A:B,2,0)),\"\",VLOOKUP(Planning!$C186,References!A:B,2,0))","v":""}]
[{"$f":"IF(ISNA(VLOOKUP(Planning!$C187,References!A:B,2,0)),\"\",VLOOKUP(Planning!$C187,References!A:B,2,0))","v":""}]
[{"$f":"IF(ISNA(VLOOKUP(Planning!$C188,References!A:B,2,0)),\"\",VLOOKUP(Planning!$C188,References!A:B,2,0))","v":""}]
[{"$f":"IF(ISNA(VLOOKUP(Planning!$C189,References!A:B,2,0)),\"\",VLOOKUP(Planning!$C189,References!A:B,2,0))","v":""}]
[{"$f":"IF(ISNA(VLOOKUP(Planning!$C190,References!A:B,2,0)),\"\",VLOOKUP(Planning!$C190,References!A:B,2,0))","v":""}]
[{"$f":"IF(ISNA(VLOOKUP(Planning!$C191,References!A:B,2,0)),\"\",VLOOKUP(Planning!$C191,References!A:B,2,0))","v":""}]
[{"$f":"IF(ISNA(VLOOKUP(Planning!$C192,References!A:B,2,0)),\"\",VLOOKUP(Planning!$C192,References!A:B,2,0))","v":""}]
[{"$f":"IF(ISNA(VLOOKUP(Planning!$C193,References!A:B,2,0)),\"\",VLOOKUP(Planning!$C193,References!A:B,2,0))","v":""}]
[{"$f":"IF(ISNA(VLOOKUP(Planning!$C194,References!A:B,2,0)),\"\",VLOOKUP(Planning!$C194,References!A:B,2,0))","v":""}]
[{"$f":"IF(ISNA(VLOOKUP(Planning!$C195,References!A:B,2,0)),\"\",VLOOKUP(Planning!$C195,References!A:B,2,0))","v":""}]
[{"$f":"IF(ISNA(VLOOKUP(Planning!$C196,References!A:B,2,0)),\"\",VLOOKUP(Planning!$C196,References!A:B,2,0))","v":""}]
[{"$f":"IF(ISNA(VLOOKUP(Planning!$C197,References!A:B,2,0)),\"\",VLOOKUP(Planning!$C197,References!A:B,2,0))","v":""}]
[{"$f":"IF(ISNA(VLOOKUP(Planning!$C198,References!A:B,2,0)),\"\",VLOOKUP(Planning!$C198,References!A:B,2,0))","v":""}]
[{"$f":"IF(ISNA(VLOOKUP(Planning!$C199,References!A:B,2,0)),\"\",VLOOKUP(Planning!$C199,References!A:B,2,0))","v":""}]
[{"$f":"IF(ISNA(VLOOKUP(Planning!$C200,References!A:B,2,0)),\"\",VLOOKUP(Planning!$C200,References!A:B,2,0))","v":""}]
[{"$f":"IF(ISNA(VLOOKUP(Planning!$C201,References!A:B,2,0)),\"\",VLOOKUP(Planning!$C201,References!A:B,2,0))","v":""}]
[{"$f":"IF(ISNA(VLOOKUP(Planning!$C202,References!A:B,2,0)),\"\",VLOOKUP(Planning!$C202,References!A:B,2,0))","v":""}]
[{"$f":"IF(ISNA(VLOOKUP(Planning!$C203,References!A:B,2,0)),\"\",VLOOKUP(Planning!$C203,References!A:B,2,0))","v":""}]
[{"$f":"IF(ISNA(VLOOKUP(Planning!$C204,References!A:B,2,0)),\"\",VLOOKUP(Planning!$C204,References!A:B,2,0))","v":""}]
[{"$f":"IF(ISNA(VLOOKUP(Planning!$C205,References!A:B,2,0)),\"\",VLOOKUP(Planning!$C205,References!A:B,2,0))","v":""}]
[{"$f":"IF(ISNA(VLOOKUP(Planning!$C206,References!A:B,2,0)),\"\",VLOOKUP(Planning!$C206,References!A:B,2,0))","v":""}]
[{"$f":"IF(ISNA(VLOOKUP(Planning!$C207,References!A:B,2,0)),\"\",VLOOKUP(Planning!$C207,References!A:B,2,0))","v":""}]
[{"$f":"IF(ISNA(VLOOKUP(Planning!$C208,References!A:B,2,0)),\"\",VLOOKUP(Planning!$C208,References!A:B,2,0))","v":""}]
[{"$f":"IF(ISNA(VLOOKUP(Planning!$C209,References!A:B,2,0)),\"\",VLOOKUP(Planning!$C209,References!A:B,2,0))","v":""}]
[{"$f":"IF(ISNA(VLOOKUP(Planning!$C210,References!A:B,2,0)),\"\",VLOOKUP(Planning!$C210,References!A:B,2,0))","v":""}]
[{"$f":"IF(ISNA(VLOOKUP(Planning!$C211,References!A:B,2,0)),\"\",VLOOKUP(Planning!$C211,References!A:B,2,0))","v":""}]
[{"$f":"IF(ISNA(VLOOKUP(Planning!$C212,References!A:B,2,0)),\"\",VLOOKUP(Planning!$C212,References!A:B,2,0))","v":""}]
[{"$f":"IF(ISNA(VLOOKUP(Planning!$C213,References!A:B,2,0)),\"\",VLOOKUP(Planning!$C213,References!A:B,2,0))","v":""}]
[{"$f":"IF(ISNA(VLOOKUP(Planning!$C214,References!A:B,2,0)),\"\",VLOOKUP(Planning!$C214,References!A:B,2,0))","v":""}]
[{"$f":"IF(ISNA(VLOOKUP(Planning!$C215,References!A:B,2,0)),\"\",VLOOKUP(Planning!$C215,References!A:B,2,0))","v":""}]
[{"$f":"IF(ISNA(VLOOKUP(Planning!$C216,References!A:B,2,0)),\"\",VLOOKUP(Planning!$C216,References!A:B,2,0))","v":""}]
[{"$f":"IF(ISNA(VLOOKUP(Planning!$C217,References!A:B,2,0)),\"\",VLOOKUP(Planning!$C217,References!A:B,2,0))","v":""}]
[{"$f":"IF(ISNA(VLOOKUP(Planning!$C218,References!A:B,2,0)),\"\",VLOOKUP(Planning!$C218,References!A:B,2,0))","v":""}]
[{"$f":"IF(ISNA(VLOOKUP(Planning!$C219,References!A:B,2,0)),\"\",VLOOKUP(Planning!$C219,References!A:B,2,0))","v":""}]
[{"$f":"IF(ISNA(VLOOKUP(Planning!$C220,References!A:B,2,0)),\"\",VLOOKUP(Planning!$C220,References!A:B,2,0))","v":""}]
[{"$f":"IF(ISNA(VLOOKUP(Planning!$C221,References!A:B,2,0)),\"\",VLOOKUP(Planning!$C221,References!A:B,2,0))","v":""}]
[{"$f":"IF(ISNA(VLOOKUP(Planning!$C222,References!A:B,2,0)),\"\",VLOOKUP(Planning!$C222,References!A:B,2,0))","v":""}]
[{"$f":"IF(ISNA(VLOOKUP(Planning!$C223,References!A:B,2,0)),\"\",VLOOKUP(Planning!$C223,References!A:B,2,0))","v":""}]
[{"$f":"IF(ISNA(VLOOKUP(Planning!$C224,References!A:B,2,0)),\"\",VLOOKUP(Planning!$C224,References!A:B,2,0))","v":""}]
[{"$f":"IF(ISNA(VLOOKUP(Planning!$C225,References!A:B,2,0)),\"\",VLOOKUP(Planning!$C225,References!A:B,2,0))","v":""}]
[{"$f":"IF(ISNA(VLOOKUP(Planning!$C226,References!A:B,2,0)),\"\",VLOOKUP(Planning!$C226,References!A:B,2,0))","v":""}]
[{"$f":"IF(ISNA(VLOOKUP(Planning!$C227,References!A:B,2,0)),\"\",VLOOKUP(Planning!$C227,References!A:B,2,0))","v":""}]
[{"$f":"IF(ISNA(VLOOKUP(Planning!$C228,References!A:B,2,0)),\"\",VLOOKUP(Planning!$C228,References!A:B,2,0))","v":""}]
[{"$f":"IF(ISNA(VLOOKUP(Planning!$C229,References!A:B,2,0)),\"\",VLOOKUP(Planning!$C229,References!A:B,2,0))","v":""}]
[{"$f":"IF(ISNA(VLOOKUP(Planning!$C230,References!A:B,2,0)),\"\",VLOOKUP(Planning!$C230,References!A:B,2,0))","v":""}]
[{"$f":"IF(ISNA(VLOOKUP(Planning!$C231,References!A:B,2,0)),\"\",VLOOKUP(Planning!$C231,References!A:B,2,0))","v":""}]
[{"$f":"IF(ISNA(VLOOKUP(Planning!$C232,References!A:B,2,0)),\"\",VLOOKUP(Planning!$C232,References!A:B,2,0))","v":""}]
[{"$f":"IF(ISNA(VLOOKUP(Planning!$C233,References!A:B,2,0)),\"\",VLOOKUP(Planning!$C233,References!A:B,2,0))","v":""}]
[{"$f":"IF(ISNA(VLOOKUP(Planning!$C234,References!A:B,2,0)),\"\",VLOOKUP(Planning!$C234,References!A:B,2,0))","v":""}]
[{"$f":"IF(ISNA(VLOOKUP(Planning!$C235,References!A:B,2,0)),\"\",VLOOKUP(Planning!$C235,References!A:B,2,0))","v":""}]
[{"$f":"IF(ISNA(VLOOKUP(Planning!$C236,References!A:B,2,0)),\"\",VLOOKUP(Planning!$C236,References!A:B,2,0))","v":""}]
[{"$f":"IF(ISNA(VLOOKUP(Planning!$C237,References!A:B,2,0)),\"\",VLOOKUP(Planning!$C237,References!A:B,2,0))","v":""}]
[{"$f":"IF(ISNA(VLOOKUP(Planning!$C238,References!A:B,2,0)),\"\",VLOOKUP(Planning!$C238,References!A:B,2,0))","v":""}]
[{"$f":"IF(ISNA(VLOOKUP(Planning!$C239,References!A:B,2,0)),\"\",VLOOKUP(Planning!$C239,References!A:B,2,0))","v":""}]
[{"$f":"IF(ISNA(VLOOKUP(Planning!$C240,References!A:B,2,0)),\"\",VLOOKUP(Planning!$C240,References!A:B,2,0))","v":""}]
[{"$f":"IF(ISNA(VLOOKUP(Planning!$C241,References!A:B,2,0)),\"\",VLOOKUP(Planning!$C241,References!A:B,2,0))","v":""}]
[{"$f":"IF(ISNA(VLOOKUP(Planning!$C242,References!A:B,2,0)),\"\",VLOOKUP(Planning!$C242,References!A:B,2,0))","v":""}]
[{"$f":"IF(ISNA(VLOOKUP(Planning!$C243,References!A:B,2,0)),\"\",VLOOKUP(Planning!$C243,References!A:B,2,0))","v":""}]
[{"$f":"IF(ISNA(VLOOKUP(Planning!$C244,References!A:B,2,0)),\"\",VLOOKUP(Planning!$C244,References!A:B,2,0))","v":""}]
[{"$f":"IF(ISNA(VLOOKUP(Planning!$C245,References!A:B,2,0)),\"\",VLOOKUP(Planning!$C245,References!A:B,2,0))","v":""}]
[{"$f":"IF(ISNA(VLOOKUP(Planning!$C246,References!A:B,2,0)),\"\",VLOOKUP(Planning!$C246,References!A:B,2,0))","v":""}]
[{"$f":"IF(ISNA(VLOOKUP(Planning!$C247,References!A:B,2,0)),\"\",VLOOKUP(Planning!$C247,References!A:B,2,0))","v":""}]
[{"$f":"IF(ISNA(VLOOKUP(Planning!$C248,References!A:B,2,0)),\"\",VLOOKUP(Planning!$C248,References!A:B,2,0))","v":""}]
[{"$f":"IF(ISNA(VLOOKUP(Planning!$C249,References!A:B,2,0)),\"\",VLOOKUP(Planning!$C249,References!A:B,2,0))","v":""}]
[{"$f":"IF(ISNA(VLOOKUP(Planning!$C250,References!A:B,2,0)),\"\",VLOOKUP(Planning!$C250,References!A:B,2,0))","v":""}]
[{"$f":"IF(ISNA(VLOOKUP(Planning!$C251,References!A:B,2,0)),\"\",VLOOKUP(Planning!$C251,References!A:B,2,0))","v":""}]
[{"$f":"IF(ISNA(VLOOKUP(Planning!$C252,References!A:B,2,0)),\"\",VLOOKUP(Planning!$C252,References!A:B,2,0))","v":""}]
[{"$f":"IF(ISNA(VLOOKUP(Planning!$C253,References!A:B,2,0)),\"\",VLOOKUP(Planning!$C253,References!A:B,2,0))","v":""}]
[{"$f":"IF(ISNA(VLOOKUP(Planning!$C254,References!A:B,2,0)),\"\",VLOOKUP(Planning!$C254,References!A:B,2,0))","v":""}]
[{"$f":"IF(ISNA(VLOOKUP(Planning!$C255,References!A:B,2,0)),\"\",VLOOKUP(Planning!$C255,References!A:B,2,0))","v":""}]
[{"$f":"IF(ISNA(VLOOKUP(Planning!$C256,References!A:B,2,0)),\"\",VLOOKUP(Planning!$C256,References!A:B,2,0))","v":""}]
[{"$f":"IF(ISNA(VLOOKUP(Planning!$C257,References!A:B,2,0)),\"\",VLOOKUP(Planning!$C257,References!A:B,2,0))","v":""}]
[{"$f":"IF(ISNA(VLOOKUP(Planning!$C258,References!A:B,2,0)),\"\",VLOOKUP(Planning!$C258,References!A:B,2,0))","v":""}]
[{"$f":"IF(ISNA(VLOOKUP(Planning!$C259,References!A:B,2,0)),\"\",VLOOKUP(Planning!$C259,References!A:B,2,0))","v":""}]
[{"$f":"IF(ISNA(VLOOKUP(Planning!$C260,References!A:B,2,0)),\"\",VLOOKUP(Planning!$C260,References!A:B,2,0))","v":""}]
[{"$f":"IF(ISNA(VLOOKUP(Planning!$C261,References!A:B,2,0)),\"\",VLOOKUP(Planning!$C261,References!A:B,2,0))","v":""}]
[{"$f":"IF(ISNA(VLOOKUP(Planning!$C262,References!A:B,2,0)),\"\",VLOOKUP(Planning!$C262,References!A:B,2,0))","v":""}]
[{"$f":"IF(ISNA(VLOOKUP(Planning!$C263,References!A:B,2,0)),\"\",VLOOKUP(Planning!$C263,References!A:B,2,0))","v":""}]
[{"$f":"IF(ISNA(VLOOKUP(Planning!$C264,References!A:B,2,0)),\"\",VLOOKUP(Planning!$C264,References!A:B,2,0))","v":""}]
[{"$f":"IF(ISNA(VLOOKUP(Planning!$C265,References!A:B,2,0)),\"\",VLOOKUP(Planning!$C265,References!A:B,2,0))","v":""}]
[{"$f":"IF(ISNA(VLOOKUP(Planning!$C266,References!A:B,2,0)),\"\",VLOOKUP(Planning!$C266,References!A:B,2,0))","v":""}]
[{"$f":"IF(ISNA(VLOOKUP(Planning!$C267,References!A:B,2,0)),\"\",VLOOKUP(Planning!$C267,References!A:B,2,0))","v":""}]
[{"$f":"IF(ISNA(VLOOKUP(Planning!$C268,References!A:B,2,0)),\"\",VLOOKUP(Planning!$C268,References!A:B,2,0))","v":""}]
[{"$f":"IF(ISNA(VLOOKUP(Planning!$C269,References!A:B,2,0)),\"\",VLOOKUP(Planning!$C269,References!A:B,2,0))","v":""}]
[{"$f":"IF(ISNA(VLOOKUP(Planning!$C270,References!A:B,2,0)),\"\",VLOOKUP(Planning!$C270,References!A:B,2,0))","v":""}]
[{"$f":"IF(ISNA(VLOOKUP(Planning!$C271,References!A:B,2,0)),\"\",VLOOKUP(Planning!$C271,References!A:B,2,0))","v":""}]
[{"$f":"IF(ISNA(VLOOKUP(Planning!$C272,References!A:B,2,0)),\"\",VLOOKUP(Planning!$C272,References!A:B,2,0))","v":""}]
[{"$f":"IF(ISNA(VLOOKUP(Planning!$C273,References!A:B,2,0)),\"\",VLOOKUP(Planning!$C273,References!A:B,2,0))","v":""}]
[{"$f":"IF(ISNA(VLOOKUP(Planning!$C274,References!A:B,2,0)),\"\",VLOOKUP(Planning!$C274,References!A:B,2,0))","v":""}]
[{"$f":"IF(ISNA(VLOOKUP(Planning!$C275,References!A:B,2,0)),\"\",VLOOKUP(Planning!$C275,References!A:B,2,0))","v":""}]
[{"$f":"IF(ISNA(VLOOKUP(Planning!$C276,References!A:B,2,0)),\"\",VLOOKUP(Planning!$C276,References!A:B,2,0))","v":""}]
[{"$f":"IF(ISNA(VLOOKUP(Planning!$C277,References!A:B,2,0)),\"\",VLOOKUP(Planning!$C277,References!A:B,2,0))","v":""}]
[{"$f":"IF(ISNA(VLOOKUP(Planning!$C278,References!A:B,2,0)),\"\",VLOOKUP(Planning!$C278,References!A:B,2,0))","v":""}]
[{"$f":"IF(ISNA(VLOOKUP(Planning!$C279,References!A:B,2,0)),\"\",VLOOKUP(Planning!$C279,References!A:B,2,0))","v":""}]
[{"$f":"IF(ISNA(VLOOKUP(Planning!$C280,References!A:B,2,0)),\"\",VLOOKUP(Planning!$C280,References!A:B,2,0))","v":""}]
[{"$f":"IF(ISNA(VLOOKUP(Planning!$C281,References!A:B,2,0)),\"\",VLOOKUP(Planning!$C281,References!A:B,2,0))","v":""}]
[{"$f":"IF(ISNA(VLOOKUP(Planning!$C282,References!A:B,2,0)),\"\",VLOOKUP(Planning!$C282,References!A:B,2,0))","v":""}]
[{"$f":"IF(ISNA(VLOOKUP(Planning!$C283,References!A:B,2,0)),\"\",VLOOKUP(Planning!$C283,References!A:B,2,0))","v":""}]
[{"$f":"IF(ISNA(VLOOKUP(Planning!$C284,References!A:B,2,0)),\"\",VLOOKUP(Planning!$C284,References!A:B,2,0))","v":""}]
[{"$f":"IF(ISNA(VLOOKUP(Planning!$C285,References!A:B,2,0)),\"\",VLOOKUP(Planning!$C285,References!A:B,2,0))","v":""}]
[{"$f":"IF(ISNA(VLOOKUP(Planning!$C286,References!A:B,2,0)),\"\",VLOOKUP(Planning!$C286,References!A:B,2,0))","v":""}]
[{"$f":"IF(ISNA(VLOOKUP(Planning!$C287,References!A:B,2,0)),\"\",VLOOKUP(Planning!$C287,References!A:B,2,0))","v":""}]
[{"$f":"IF(ISNA(VLOOKUP(Planning!$C288,References!A:B,2,0)),\"\",VLOOKUP(Planning!$C288,References!A:B,2,0))","v":""}]
[{"$f":"IF(ISNA(VLOOKUP(Planning!$C289,References!A:B,2,0)),\"\",VLOOKUP(Planning!$C289,References!A:B,2,0))","v":""}]
[{"$f":"IF(ISNA(VLOOKUP(Planning!$C290,References!A:B,2,0)),\"\",VLOOKUP(Planning!$C290,References!A:B,2,0))","v":""}]
[{"$f":"IF(ISNA(VLOOKUP(Planning!$C291,References!A:B,2,0)),\"\",VLOOKUP(Planning!$C291,References!A:B,2,0))","v":""}]
[{"$f":"IF(ISNA(VLOOKUP(Planning!$C292,References!A:B,2,0)),\"\",VLOOKUP(Planning!$C292,References!A:B,2,0))","v":""}]
[{"$f":"IF(ISNA(VLOOKUP(Planning!$C293,References!A:B,2,0)),\"\",VLOOKUP(Planning!$C293,References!A:B,2,0))","v":""}]
[{"$f":"IF(ISNA(VLOOKUP(Planning!$C294,References!A:B,2,0)),\"\",VLOOKUP(Planning!$C294,References!A:B,2,0))","v":""}]
[{"$f":"IF(ISNA(VLOOKUP(Planning!$C295,References!A:B,2,0)),\"\",VLOOKUP(Planning!$C295,References!A:B,2,0))","v":""}]
[{"$f":"IF(ISNA(VLOOKUP(Planning!$C296,References!A:B,2,0)),\"\",VLOOKUP(Planning!$C296,References!A:B,2,0))","v":""}]
[{"$f":"IF(ISNA(VLOOKUP(Planning!$C297,References!A:B,2,0)),\"\",VLOOKUP(Planning!$C297,References!A:B,2,0))","v":""}]
[{"$f":"IF(ISNA(VLOOKUP(Planning!$C298,References!A:B,2,0)),\"\",VLOOKUP(Planning!$C298,References!A:B,2,0))","v":""}]
[{"$f":"IF(ISNA(VLOOKUP(Planning!$C299,References!A:B,2,0)),\"\",VLOOKUP(Planning!$C299,References!A:B,2,0))","v":""}]
[{"$f":"IF(ISNA(VLOOKUP(Planning!$C300,References!A:B,2,0)),\"\",VLOOKUP(Planning!$C300,References!A:B,2,0))","v":""}]
[{"$f":"IF(ISNA(VLOOKUP(Planning!$C301,References!A:B,2,0)),\"\",VLOOKUP(Planning!$C301,References!A:B,2,0))","v":""}]
[{"$f":"IF(ISNA(VLOOKUP(Planning!$C302,References!A:B,2,0)),\"\",VLOOKUP(Planning!$C302,References!A:B,2,0))","v":""}]
[{"$f":"IF(ISNA(VLOOKUP(Planning!$C303,References!A:B,2,0)),\"\",VLOOKUP(Planning!$C303,References!A:B,2,0))","v":""}]
[{"$f":"IF(ISNA(VLOOKUP(Planning!$C304,References!A:B,2,0)),\"\",VLOOKUP(Planning!$C304,References!A:B,2,0))","v":""}]
[{"$f":"IF(ISNA(VLOOKUP(Planning!$C305,References!A:B,2,0)),\"\",VLOOKUP(Planning!$C305,References!A:B,2,0))","v":""}]
[{"$f":"IF(ISNA(VLOOKUP(Planning!$C306,References!A:B,2,0)),\"\",VLOOKUP(Planning!$C306,References!A:B,2,0))","v":""}]
[{"$f":"IF(ISNA(VLOOKUP(Planning!$C307,References!A:B,2,0)),\"\",VLOOKUP(Planning!$C307,References!A:B,2,0))","v":""}]
[{"$f":"IF(ISNA(VLOOKUP(Planning!$C308,References!A:B,2,0)),\"\",VLOOKUP(Planning!$C308,References!A:B,2,0))","v":""}]
[{"$f":"IF(ISNA(VLOOKUP(Planning!$C309,References!A:B,2,0)),\"\",VLOOKUP(Planning!$C309,References!A:B,2,0))","v":""}]
[{"$f":"IF(ISNA(VLOOKUP(Planning!$C310,References!A:B,2,0)),\"\",VLOOKUP(Planning!$C310,References!A:B,2,0))","v":""}]
[{"$f":"IF(ISNA(VLOOKUP(Planning!$C311,References!A:B,2,0)),\"\",VLOOKUP(Planning!$C311,References!A:B,2,0))","v":""}]
[{"$f":"IF(ISNA(VLOOKUP(Planning!$C312,References!A:B,2,0)),\"\",VLOOKUP(Planning!$C312,References!A:B,2,0))","v":""}]
[{"$f":"IF(ISNA(VLOOKUP(Planning!$C313,References!A:B,2,0)),\"\",VLOOKUP(Planning!$C313,References!A:B,2,0))","v":""}]
[{"$f":"IF(ISNA(VLOOKUP(Planning!$C314,References!A:B,2,0)),\"\",VLOOKUP(Planning!$C314,References!A:B,2,0))","v":""}]
[{"$f":"IF(ISNA(VLOOKUP(Planning!$C315,References!A:B,2,0)),\"\",VLOOKUP(Planning!$C315,References!A:B,2,0))","v":""}]
[{"$f":"IF(ISNA(VLOOKUP(Planning!$C316,References!A:B,2,0)),\"\",VLOOKUP(Planning!$C316,References!A:B,2,0))","v":""}]
[{"$f":"IF(ISNA(VLOOKUP(Planning!$C317,References!A:B,2,0)),\"\",VLOOKUP(Planning!$C317,References!A:B,2,0))","v":""}]
[{"$f":"IF(ISNA(VLOOKUP(Planning!$C318,References!A:B,2,0)),\"\",VLOOKUP(Planning!$C318,References!A:B,2,0))","v":""}]
[{"$f":"IF(ISNA(VLOOKUP(Planning!$C319,References!A:B,2,0)),\"\",VLOOKUP(Planning!$C319,References!A:B,2,0))","v":""}]
[{"$f":"IF(ISNA(VLOOKUP(Planning!$C320,References!A:B,2,0)),\"\",VLOOKUP(Planning!$C320,References!A:B,2,0))","v":""}]
[{"$f":"IF(ISNA(VLOOKUP(Planning!$C321,References!A:B,2,0)),\"\",VLOOKUP(Planning!$C321,References!A:B,2,0))","v":""}]
[{"$f":"IF(ISNA(VLOOKUP(Planning!$C322,References!A:B,2,0)),\"\",VLOOKUP(Planning!$C322,References!A:B,2,0))","v":""}]
[{"$f":"IF(ISNA(VLOOKUP(Planning!$C323,References!A:B,2,0)),\"\",VLOOKUP(Planning!$C323,References!A:B,2,0))","v":""}]
[{"$f":"IF(ISNA(VLOOKUP(Planning!$C324,References!A:B,2,0)),\"\",VLOOKUP(Planning!$C324,References!A:B,2,0))","v":""}]
[{"$f":"IF(ISNA(VLOOKUP(Planning!$C325,References!A:B,2,0)),\"\",VLOOKUP(Planning!$C325,References!A:B,2,0))","v":""}]
[{"$f":"IF(ISNA(VLOOKUP(Planning!$C326,References!A:B,2,0)),\"\",VLOOKUP(Planning!$C326,References!A:B,2,0))","v":""}]
[{"$f":"IF(ISNA(VLOOKUP(Planning!$C327,References!A:B,2,0)),\"\",VLOOKUP(Planning!$C327,References!A:B,2,0))","v":""}]
[{"$f":"IF(ISNA(VLOOKUP(Planning!$C328,References!A:B,2,0)),\"\",VLOOKUP(Planning!$C328,References!A:B,2,0))","v":""}]
[{"$f":"IF(ISNA(VLOOKUP(Planning!$C329,References!A:B,2,0)),\"\",VLOOKUP(Planning!$C329,References!A:B,2,0))","v":""}]
[{"$f":"IF(ISNA(VLOOKUP(Planning!$C330,References!A:B,2,0)),\"\",VLOOKUP(Planning!$C330,References!A:B,2,0))","v":""}]
[{"$f":"IF(ISNA(VLOOKUP(Planning!$C331,References!A:B,2,0)),\"\",VLOOKUP(Planning!$C331,References!A:B,2,0))","v":""}]
[{"$f":"IF(ISNA(VLOOKUP(Planning!$C332,References!A:B,2,0)),\"\",VLOOKUP(Planning!$C332,References!A:B,2,0))","v":""}]
[{"$f":"IF(ISNA(VLOOKUP(Planning!$C333,References!A:B,2,0)),\"\",VLOOKUP(Planning!$C333,References!A:B,2,0))","v":""}]
[{"$f":"IF(ISNA(VLOOKUP(Planning!$C334,References!A:B,2,0)),\"\",VLOOKUP(Planning!$C334,References!A:B,2,0))","v":""}]
[{"$f":"IF(ISNA(VLOOKUP(Planning!$C335,References!A:B,2,0)),\"\",VLOOKUP(Planning!$C335,References!A:B,2,0))","v":""}]
[{"$f":"IF(ISNA(VLOOKUP(Planning!$C336,References!A:B,2,0)),\"\",VLOOKUP(Planning!$C336,References!A:B,2,0))","v":""}]
[{"$f":"IF(ISNA(VLOOKUP(Planning!$C337,References!A:B,2,0)),\"\",VLOOKUP(Planning!$C337,References!A:B,2,0))","v":""}]
[{"$f":"IF(ISNA(VLOOKUP(Planning!$C338,References!A:B,2,0)),\"\",VLOOKUP(Planning!$C338,References!A:B,2,0))","v":""}]
[{"$f":"IF(ISNA(VLOOKUP(Planning!$C339,References!A:B,2,0)),\"\",VLOOKUP(Planning!$C339,References!A:B,2,0))","v":""}]
[{"$f":"IF(ISNA(VLOOKUP(Planning!$C340,References!A:B,2,0)),\"\",VLOOKUP(Planning!$C340,References!A:B,2,0))","v":""}]
[{"$f":"IF(ISNA(VLOOKUP(Planning!$C341,References!A:B,2,0)),\"\",VLOOKUP(Planning!$C341,References!A:B,2,0))","v":""}]
[{"$f":"IF(ISNA(VLOOKUP(Planning!$C342,References!A:B,2,0)),\"\",VLOOKUP(Planning!$C342,References!A:B,2,0))","v":""}]
[{"$f":"IF(ISNA(VLOOKUP(Planning!$C343,References!A:B,2,0)),\"\",VLOOKUP(Planning!$C343,References!A:B,2,0))","v":""}]
[{"$f":"IF(ISNA(VLOOKUP(Planning!$C344,References!A:B,2,0)),\"\",VLOOKUP(Planning!$C344,References!A:B,2,0))","v":""}]
[{"$f":"IF(ISNA(VLOOKUP(Planning!$C345,References!A:B,2,0)),\"\",VLOOKUP(Planning!$C345,References!A:B,2,0))","v":""}]
[{"$f":"IF(ISNA(VLOOKUP(Planning!$C346,References!A:B,2,0)),\"\",VLOOKUP(Planning!$C346,References!A:B,2,0))","v":""}]
[{"$f":"IF(ISNA(VLOOKUP(Planning!$C347,References!A:B,2,0)),\"\",VLOOKUP(Planning!$C347,References!A:B,2,0))","v":""}]
[{"$f":"IF(ISNA(VLOOKUP(Planning!$C348,References!A:B,2,0)),\"\",VLOOKUP(Planning!$C348,References!A:B,2,0))","v":""}]
[{"$f":"IF(ISNA(VLOOKUP(Planning!$C349,References!A:B,2,0)),\"\",VLOOKUP(Planning!$C349,References!A:B,2,0))","v":""}]
[{"$f":"IF(ISNA(VLOOKUP(Planning!$C350,References!A:B,2,0)),\"\",VLOOKUP(Planning!$C350,References!A:B,2,0))","v":""}]
[{"$f":"IF(ISNA(VLOOKUP(Planning!$C351,References!A:B,2,0)),\"\",VLOOKUP(Planning!$C351,References!A:B,2,0))","v":""}]
[{"$f":"IF(ISNA(VLOOKUP(Planning!$C352,References!A:B,2,0)),\"\",VLOOKUP(Planning!$C352,References!A:B,2,0))","v":""}]
[{"$f":"IF(ISNA(VLOOKUP(Planning!$C353,References!A:B,2,0)),\"\",VLOOKUP(Planning!$C353,References!A:B,2,0))","v":""}]
[{"$f":"IF(ISNA(VLOOKUP(Planning!$C354,References!A:B,2,0)),\"\",VLOOKUP(Planning!$C354,References!A:B,2,0))","v":""}]
[{"$f":"IF(ISNA(VLOOKUP(Planning!$C355,References!A:B,2,0)),\"\",VLOOKUP(Planning!$C355,References!A:B,2,0))","v":""}]
[{"$f":"IF(ISNA(VLOOKUP(Planning!$C356,References!A:B,2,0)),\"\",VLOOKUP(Planning!$C356,References!A:B,2,0))","v":""}]
[{"$f":"IF(ISNA(VLOOKUP(Planning!$C357,References!A:B,2,0)),\"\",VLOOKUP(Planning!$C357,References!A:B,2,0))","v":""}]
[{"$f":"IF(ISNA(VLOOKUP(Planning!$C358,References!A:B,2,0)),\"\",VLOOKUP(Planning!$C358,References!A:B,2,0))","v":""}]
[{"$f":"IF(ISNA(VLOOKUP(Planning!$C359,References!A:B,2,0)),\"\",VLOOKUP(Planning!$C359,References!A:B,2,0))","v":""}]
[{"$f":"IF(ISNA(VLOOKUP(Planning!$C360,References!A:B,2,0)),\"\",VLOOKUP(Planning!$C360,References!A:B,2,0))","v":""}]
[{"$f":"IF(ISNA(VLOOKUP(Planning!$C361,References!A:B,2,0)),\"\",VLOOKUP(Planning!$C361,References!A:B,2,0))","v":""}]
[{"$f":"IF(ISNA(VLOOKUP(Planning!$C362,References!A:B,2,0)),\"\",VLOOKUP(Planning!$C362,References!A:B,2,0))","v":""}]
[{"$f":"IF(ISNA(VLOOKUP(Planning!$C363,References!A:B,2,0)),\"\",VLOOKUP(Planning!$C363,References!A:B,2,0))","v":""}]
[{"$f":"IF(ISNA(VLOOKUP(Planning!$C364,References!A:B,2,0)),\"\",VLOOKUP(Planning!$C364,References!A:B,2,0))","v":""}]
[{"$f":"IF(ISNA(VLOOKUP(Planning!$C365,References!A:B,2,0)),\"\",VLOOKUP(Planning!$C365,References!A:B,2,0))","v":""}]
[{"$f":"IF(ISNA(VLOOKUP(Planning!$C366,References!A:B,2,0)),\"\",VLOOKUP(Planning!$C366,References!A:B,2,0))","v":""}]
[{"$f":"IF(ISNA(VLOOKUP(Planning!$C367,References!A:B,2,0)),\"\",VLOOKUP(Planning!$C367,References!A:B,2,0))","v":""}]
[{"$f":"IF(ISNA(VLOOKUP(Planning!$C368,References!A:B,2,0)),\"\",VLOOKUP(Planning!$C368,References!A:B,2,0))","v":""}]
[{"$f":"IF(ISNA(VLOOKUP(Planning!$C369,References!A:B,2,0)),\"\",VLOOKUP(Planning!$C369,References!A:B,2,0))","v":""}]
[{"$f":"IF(ISNA(VLOOKUP(Planning!$C370,References!A:B,2,0)),\"\",VLOOKUP(Planning!$C370,References!A:B,2,0))","v":""}]
[{"$f":"IF(ISNA(VLOOKUP(Planning!$C371,References!A:B,2,0)),\"\",VLOOKUP(Planning!$C371,References!A:B,2,0))","v":""}]
[{"$f":"IF(ISNA(VLOOKUP(Planning!$C372,References!A:B,2,0)),\"\",VLOOKUP(Planning!$C372,References!A:B,2,0))","v":""}]
[{"$f":"IF(ISNA(VLOOKUP(Planning!$C373,References!A:B,2,0)),\"\",VLOOKUP(Planning!$C373,References!A:B,2,0))","v":""}]
[{"$f":"IF(ISNA(VLOOKUP(Planning!$C374,References!A:B,2,0)),\"\",VLOOKUP(Planning!$C374,References!A:B,2,0))","v":""}]
[{"$f":"IF(ISNA(VLOOKUP(Planning!$C375,References!A:B,2,0)),\"\",VLOOKUP(Planning!$C375,References!A:B,2,0))","v":""}]
[{"$f":"IF(ISNA(VLOOKUP(Planning!$C376,References!A:B,2,0)),\"\",VLOOKUP(Planning!$C376,References!A:B,2,0))","v":""}]
[{"$f":"IF(ISNA(VLOOKUP(Planning!$C377,References!A:B,2,0)),\"\",VLOOKUP(Planning!$C377,References!A:B,2,0))","v":""}]
[{"$f":"IF(ISNA(VLOOKUP(Planning!$C378,References!A:B,2,0)),\"\",VLOOKUP(Planning!$C378,References!A:B,2,0))","v":""}]
[{"$f":"IF(ISNA(VLOOKUP(Planning!$C379,References!A:B,2,0)),\"\",VLOOKUP(Planning!$C379,References!A:B,2,0))","v":""}]
[{"$f":"IF(ISNA(VLOOKUP(Planning!$C380,References!A:B,2,0)),\"\",VLOOKUP(Planning!$C380,References!A:B,2,0))","v":""}]
[{"$f":"IF(ISNA(VLOOKUP(Planning!$C381,References!A:B,2,0)),\"\",VLOOKUP(Planning!$C381,References!A:B,2,0))","v":""}]
[{"$f":"IF(ISNA(VLOOKUP(Planning!$C382,References!A:B,2,0)),\"\",VLOOKUP(Planning!$C382,References!A:B,2,0))","v":""}]
[{"$f":"IF(ISNA(VLOOKUP(Planning!$C383,References!A:B,2,0)),\"\",VLOOKUP(Planning!$C383,References!A:B,2,0))","v":""}]
[{"$f":"IF(ISNA(VLOOKUP(Planning!$C384,References!A:B,2,0)),\"\",VLOOKUP(Planning!$C384,References!A:B,2,0))","v":""}]
[{"$f":"IF(ISNA(VLOOKUP(Planning!$C385,References!A:B,2,0)),\"\",VLOOKUP(Planning!$C385,References!A:B,2,0))","v":""}]
[{"$f":"IF(ISNA(VLOOKUP(Planning!$C386,References!A:B,2,0)),\"\",VLOOKUP(Planning!$C386,References!A:B,2,0))","v":""}]
[{"$f":"IF(ISNA(VLOOKUP(Planning!$C387,References!A:B,2,0)),\"\",VLOOKUP(Planning!$C387,References!A:B,2,0))","v":""}]
[{"$f":"IF(ISNA(VLOOKUP(Planning!$C388,References!A:B,2,0)),\"\",VLOOKUP(Planning!$C388,References!A:B,2,0))","v":""}]
[{"$f":"IF(ISNA(VLOOKUP(Planning!$C389,References!A:B,2,0)),\"\",VLOOKUP(Planning!$C389,References!A:B,2,0))","v":""}]
[{"$f":"IF(ISNA(VLOOKUP(Planning!$C390,References!A:B,2,0)),\"\",VLOOKUP(Planning!$C390,References!A:B,2,0))","v":""}]
[{"$f":"IF(ISNA(VLOOKUP(Planning!$C391,References!A:B,2,0)),\"\",VLOOKUP(Planning!$C391,References!A:B,2,0))","v":""}]
[{"$f":"IF(ISNA(VLOOKUP(Planning!$C392,References!A:B,2,0)),\"\",VLOOKUP(Planning!$C392,References!A:B,2,0))","v":""}]
[{"$f":"IF(ISNA(VLOOKUP(Planning!$C393,References!A:B,2,0)),\"\",VLOOKUP(Planning!$C393,References!A:B,2,0))","v":""}]
[{"$f":"IF(ISNA(VLOOKUP(Planning!$C394,References!A:B,2,0)),\"\",VLOOKUP(Planning!$C394,References!A:B,2,0))","v":""}]
[{"$f":"IF(ISNA(VLOOKUP(Planning!$C395,References!A:B,2,0)),\"\",VLOOKUP(Planning!$C395,References!A:B,2,0))","v":""}]
[{"$f":"IF(ISNA(VLOOKUP(Planning!$C396,References!A:B,2,0)),\"\",VLOOKUP(Planning!$C396,References!A:B,2,0))","v":""}]
[{"$f":"IF(ISNA(VLOOKUP(Planning!$C397,References!A:B,2,0)),\"\",VLOOKUP(Planning!$C397,References!A:B,2,0))","v":""}]
[{"$f":"IF(ISNA(VLOOKUP(Planning!$C398,References!A:B,2,0)),\"\",VLOOKUP(Planning!$C398,References!A:B,2,0))","v":""}]
[{"$f":"IF(ISNA(VLOOKUP(Planning!$C399,References!A:B,2,0)),\"\",VLOOKUP(Planning!$C399,References!A:B,2,0))","v":""}]
[{"$f":"IF(ISNA(VLOOKUP(Planning!$C400,References!A:B,2,0)),\"\",VLOOKUP(Planning!$C400,References!A:B,2,0))","v":""}]
[{"$f":"IF(ISNA(VLOOKUP(Planning!$C401,References!A:B,2,0)),\"\",VLOOKUP(Planning!$C401,References!A:B,2,0))","v":""}]
[{"$f":"IF(ISNA(VLOOKUP(Planning!$C402,References!A:B,2,0)),\"\",VLOOKUP(Planning!$C402,References!A:B,2,0))","v":""}]
[{"$f":"IF(ISNA(VLOOKUP(Planning!$C403,References!A:B,2,0)),\"\",VLOOKUP(Planning!$C403,References!A:B,2,0))","v":""}]
[{"$f":"IF(ISNA(VLOOKUP(Planning!$C404,References!A:B,2,0)),\"\",VLOOKUP(Planning!$C404,References!A:B,2,0))","v":""}]
[{"$f":"IF(ISNA(VLOOKUP(Planning!$C405,References!A:B,2,0)),\"\",VLOOKUP(Planning!$C405,References!A:B,2,0))","v":""}]
[{"$f":"IF(ISNA(VLOOKUP(Planning!$C406,References!A:B,2,0)),\"\",VLOOKUP(Planning!$C406,References!A:B,2,0))","v":""}]
[{"$f":"IF(ISNA(VLOOKUP(Planning!$C407,References!A:B,2,0)),\"\",VLOOKUP(Planning!$C407,References!A:B,2,0))","v":""}]
[{"$f":"IF(ISNA(VLOOKUP(Planning!$C408,References!A:B,2,0)),\"\",VLOOKUP(Planning!$C408,References!A:B,2,0))","v":""}]
[{"$f":"IF(ISNA(VLOOKUP(Planning!$C409,References!A:B,2,0)),\"\",VLOOKUP(Planning!$C409,References!A:B,2,0))","v":""}]
[{"$f":"IF(ISNA(VLOOKUP(Planning!$C410,References!A:B,2,0)),\"\",VLOOKUP(Planning!$C410,References!A:B,2,0))","v":""}]
[{"$f":"IF(ISNA(VLOOKUP(Planning!$C411,References!A:B,2,0)),\"\",VLOOKUP(Planning!$C411,References!A:B,2,0))","v":""}]
[{"$f":"IF(ISNA(VLOOKUP(Planning!$C412,References!A:B,2,0)),\"\",VLOOKUP(Planning!$C412,References!A:B,2,0))","v":""}]
[{"$f":"IF(ISNA(VLOOKUP(Planning!$C413,References!A:B,2,0)),\"\",VLOOKUP(Planning!$C413,References!A:B,2,0))","v":""}]
[{"$f":"IF(ISNA(VLOOKUP(Planning!$C414,References!A:B,2,0)),\"\",VLOOKUP(Planning!$C414,References!A:B,2,0))","v":""}]
[{"$f":"IF(ISNA(VLOOKUP(Planning!$C415,References!A:B,2,0)),\"\",VLOOKUP(Planning!$C415,References!A:B,2,0))","v":""}]
[{"$f":"IF(ISNA(VLOOKUP(Planning!$C416,References!A:B,2,0)),\"\",VLOOKUP(Planning!$C416,References!A:B,2,0))","v":""}]
[{"$f":"IF(ISNA(VLOOKUP(Planning!$C417,References!A:B,2,0)),\"\",VLOOKUP(Planning!$C417,References!A:B,2,0))","v":""}]
[{"$f":"IF(ISNA(VLOOKUP(Planning!$C418,References!A:B,2,0)),\"\",VLOOKUP(Planning!$C418,References!A:B,2,0))","v":""}]
[{"$f":"IF(ISNA(VLOOKUP(Planning!$C419,References!A:B,2,0)),\"\",VLOOKUP(Planning!$C419,References!A:B,2,0))","v":""}]
[{"$f":"IF(ISNA(VLOOKUP(Planning!$C420,References!A:B,2,0)),\"\",VLOOKUP(Planning!$C420,References!A:B,2,0))","v":""}]
[{"$f":"IF(ISNA(VLOOKUP(Planning!$C421,References!A:B,2,0)),\"\",VLOOKUP(Planning!$C421,References!A:B,2,0))","v":""}]
[{"$f":"IF(ISNA(VLOOKUP(Planning!$C422,References!A:B,2,0)),\"\",VLOOKUP(Planning!$C422,References!A:B,2,0))","v":""}]
[{"$f":"IF(ISNA(VLOOKUP(Planning!$C423,References!A:B,2,0)),\"\",VLOOKUP(Planning!$C423,References!A:B,2,0))","v":""}]
[{"$f":"IF(ISNA(VLOOKUP(Planning!$C424,References!A:B,2,0)),\"\",VLOOKUP(Planning!$C424,References!A:B,2,0))","v":""}]
[{"$f":"IF(ISNA(VLOOKUP(Planning!$C425,References!A:B,2,0)),\"\",VLOOKUP(Planning!$C425,References!A:B,2,0))","v":""}]
[{"$f":"IF(ISNA(VLOOKUP(Planning!$C426,References!A:B,2,0)),\"\",VLOOKUP(Planning!$C426,References!A:B,2,0))","v":""}]
[{"$f":"IF(ISNA(VLOOKUP(Planning!$C427,References!A:B,2,0)),\"\",VLOOKUP(Planning!$C427,References!A:B,2,0))","v":""}]
[{"$f":"IF(ISNA(VLOOKUP(Planning!$C428,References!A:B,2,0)),\"\",VLOOKUP(Planning!$C428,References!A:B,2,0))","v":""}]
[{"$f":"IF(ISNA(VLOOKUP(Planning!$C429,References!A:B,2,0)),\"\",VLOOKUP(Planning!$C429,References!A:B,2,0))","v":""}]
[{"$f":"IF(ISNA(VLOOKUP(Planning!$C430,References!A:B,2,0)),\"\",VLOOKUP(Planning!$C430,References!A:B,2,0))","v":""}]
[{"$f":"IF(ISNA(VLOOKUP(Planning!$C431,References!A:B,2,0)),\"\",VLOOKUP(Planning!$C431,References!A:B,2,0))","v":""}]
[{"$f":"IF(ISNA(VLOOKUP(Planning!$C432,References!A:B,2,0)),\"\",VLOOKUP(Planning!$C432,References!A:B,2,0))","v":""}]
[{"$f":"IF(ISNA(VLOOKUP(Planning!$C433,References!A:B,2,0)),\"\",VLOOKUP(Planning!$C433,References!A:B,2,0))","v":""}]
[{"$f":"IF(ISNA(VLOOKUP(Planning!$C434,References!A:B,2,0)),\"\",VLOOKUP(Planning!$C434,References!A:B,2,0))","v":""}]
[{"$f":"IF(ISNA(VLOOKUP(Planning!$C435,References!A:B,2,0)),\"\",VLOOKUP(Planning!$C435,References!A:B,2,0))","v":""}]
[{"$f":"IF(ISNA(VLOOKUP(Planning!$C436,References!A:B,2,0)),\"\",VLOOKUP(Planning!$C436,References!A:B,2,0))","v":""}]
[{"$f":"IF(ISNA(VLOOKUP(Planning!$C437,References!A:B,2,0)),\"\",VLOOKUP(Planning!$C437,References!A:B,2,0))","v":""}]
[{"$f":"IF(ISNA(VLOOKUP(Planning!$C438,References!A:B,2,0)),\"\",VLOOKUP(Planning!$C438,References!A:B,2,0))","v":""}]
[{"$f":"IF(ISNA(VLOOKUP(Planning!$C439,References!A:B,2,0)),\"\",VLOOKUP(Planning!$C439,References!A:B,2,0))","v":""}]
[{"$f":"IF(ISNA(VLOOKUP(Planning!$C440,References!A:B,2,0)),\"\",VLOOKUP(Planning!$C440,References!A:B,2,0))","v":""}]
[{"$f":"IF(ISNA(VLOOKUP(Planning!$C441,References!A:B,2,0)),\"\",VLOOKUP(Planning!$C441,References!A:B,2,0))","v":""}]
[{"$f":"IF(ISNA(VLOOKUP(Planning!$C442,References!A:B,2,0)),\"\",VLOOKUP(Planning!$C442,References!A:B,2,0))","v":""}]
[{"$f":"IF(ISNA(VLOOKUP(Planning!$C443,References!A:B,2,0)),\"\",VLOOKUP(Planning!$C443,References!A:B,2,0))","v":""}]
[{"$f":"IF(ISNA(VLOOKUP(Planning!$C444,References!A:B,2,0)),\"\",VLOOKUP(Planning!$C444,References!A:B,2,0))","v":""}]
[{"$f":"IF(ISNA(VLOOKUP(Planning!$C445,References!A:B,2,0)),\"\",VLOOKUP(Planning!$C445,References!A:B,2,0))","v":""}]
[{"$f":"IF(ISNA(VLOOKUP(Planning!$C446,References!A:B,2,0)),\"\",VLOOKUP(Planning!$C446,References!A:B,2,0))","v":""}]
[{"$f":"IF(ISNA(VLOOKUP(Planning!$C447,References!A:B,2,0)),\"\",VLOOKUP(Planning!$C447,References!A:B,2,0))","v":""}]
[{"$f":"IF(ISNA(VLOOKUP(Planning!$C448,References!A:B,2,0)),\"\",VLOOKUP(Planning!$C448,References!A:B,2,0))","v":""}]
[{"$f":"IF(ISNA(VLOOKUP(Planning!$C449,References!A:B,2,0)),\"\",VLOOKUP(Planning!$C449,References!A:B,2,0))","v":""}]
[{"$f":"IF(ISNA(VLOOKUP(Planning!$C450,References!A:B,2,0)),\"\",VLOOKUP(Planning!$C450,References!A:B,2,0))","v":""}]
[{"$f":"IF(ISNA(VLOOKUP(Planning!$C451,References!A:B,2,0)),\"\",VLOOKUP(Planning!$C451,References!A:B,2,0))","v":""}]
[{"$f":"IF(ISNA(VLOOKUP(Planning!$C452,References!A:B,2,0)),\"\",VLOOKUP(Planning!$C452,References!A:B,2,0))","v":""}]
[{"$f":"IF(ISNA(VLOOKUP(Planning!$C453,References!A:B,2,0)),\"\",VLOOKUP(Planning!$C453,References!A:B,2,0))","v":""}]
[{"$f":"IF(ISNA(VLOOKUP(Planning!$C454,References!A:B,2,0)),\"\",VLOOKUP(Planning!$C454,References!A:B,2,0))","v":""}]
[{"$f":"IF(ISNA(VLOOKUP(Planning!$C455,References!A:B,2,0)),\"\",VLOOKUP(Planning!$C455,References!A:B,2,0))","v":""}]
[{"$f":"IF(ISNA(VLOOKUP(Planning!$C456,References!A:B,2,0)),\"\",VLOOKUP(Planning!$C456,References!A:B,2,0))","v":""}]
[{"$f":"IF(ISNA(VLOOKUP(Planning!$C457,References!A:B,2,0)),\"\",VLOOKUP(Planning!$C457,References!A:B,2,0))","v":""}]
[{"$f":"IF(ISNA(VLOOKUP(Planning!$C458,References!A:B,2,0)),\"\",VLOOKUP(Planning!$C458,References!A:B,2,0))","v":""}]
[{"$f":"IF(ISNA(VLOOKUP(Planning!$C459,References!A:B,2,0)),\"\",VLOOKUP(Planning!$C459,References!A:B,2,0))","v":""}]
[{"$f":"IF(ISNA(VLOOKUP(Planning!$C460,References!A:B,2,0)),\"\",VLOOKUP(Planning!$C460,References!A:B,2,0))","v":""}]
[{"$f":"IF(ISNA(VLOOKUP(Planning!$C461,References!A:B,2,0)),\"\",VLOOKUP(Planning!$C461,References!A:B,2,0))","v":""}]
[{"$f":"IF(ISNA(VLOOKUP(Planning!$C462,References!A:B,2,0)),\"\",VLOOKUP(Planning!$C462,References!A:B,2,0))","v":""}]
[{"$f":"IF(ISNA(VLOOKUP(Planning!$C463,References!A:B,2,0)),\"\",VLOOKUP(Planning!$C463,References!A:B,2,0))","v":""}]
[{"$f":"IF(ISNA(VLOOKUP(Planning!$C464,References!A:B,2,0)),\"\",VLOOKUP(Planning!$C464,References!A:B,2,0))","v":""}]
[{"$f":"IF(ISNA(VLOOKUP(Planning!$C465,References!A:B,2,0)),\"\",VLOOKUP(Planning!$C465,References!A:B,2,0))","v":""}]
[{"$f":"IF(ISNA(VLOOKUP(Planning!$C466,References!A:B,2,0)),\"\",VLOOKUP(Planning!$C466,References!A:B,2,0))","v":""}]
[{"$f":"IF(ISNA(VLOOKUP(Planning!$C467,References!A:B,2,0)),\"\",VLOOKUP(Planning!$C467,References!A:B,2,0))","v":""}]
[{"$f":"IF(ISNA(VLOOKUP(Planning!$C468,References!A:B,2,0)),\"\",VLOOKUP(Planning!$C468,References!A:B,2,0))","v":""}]
[{"$f":"IF(ISNA(VLOOKUP(Planning!$C469,References!A:B,2,0)),\"\",VLOOKUP(Planning!$C469,References!A:B,2,0))","v":""}]
[{"$f":"IF(ISNA(VLOOKUP(Planning!$C470,References!A:B,2,0)),\"\",VLOOKUP(Planning!$C470,References!A:B,2,0))","v":""}]
[{"$f":"IF(ISNA(VLOOKUP(Planning!$C471,References!A:B,2,0)),\"\",VLOOKUP(Planning!$C471,References!A:B,2,0))","v":""}]
[{"$f":"IF(ISNA(VLOOKUP(Planning!$C472,References!A:B,2,0)),\"\",VLOOKUP(Planning!$C472,References!A:B,2,0))","v":""}]
[{"$f":"IF(ISNA(VLOOKUP(Planning!$C473,References!A:B,2,0)),\"\",VLOOKUP(Planning!$C473,References!A:B,2,0))","v":""}]
[{"$f":"IF(ISNA(VLOOKUP(Planning!$C474,References!A:B,2,0)),\"\",VLOOKUP(Planning!$C474,References!A:B,2,0))","v":""}]
[{"$f":"IF(ISNA(VLOOKUP(Planning!$C475,References!A:B,2,0)),\"\",VLOOKUP(Planning!$C475,References!A:B,2,0))","v":""}]
[{"$f":"IF(ISNA(VLOOKUP(Planning!$C476,References!A:B,2,0)),\"\",VLOOKUP(Planning!$C476,References!A:B,2,0))","v":""}]
[{"$f":"IF(ISNA(VLOOKUP(Planning!$C477,References!A:B,2,0)),\"\",VLOOKUP(Planning!$C477,References!A:B,2,0))","v":""}]
[{"$f":"IF(ISNA(VLOOKUP(Planning!$C478,References!A:B,2,0)),\"\",VLOOKUP(Planning!$C478,References!A:B,2,0))","v":""}]
[{"$f":"IF(ISNA(VLOOKUP(Planning!$C479,References!A:B,2,0)),\"\",VLOOKUP(Planning!$C479,References!A:B,2,0))","v":""}]
[{"$f":"IF(ISNA(VLOOKUP(Planning!$C480,References!A:B,2,0)),\"\",VLOOKUP(Planning!$C480,References!A:B,2,0))","v":""}]
[{"$f":"IF(ISNA(VLOOKUP(Planning!$C481,References!A:B,2,0)),\"\",VLOOKUP(Planning!$C481,References!A:B,2,0))","v":""}]
[{"$f":"IF(ISNA(VLOOKUP(Planning!$C482,References!A:B,2,0)),\"\",VLOOKUP(Planning!$C482,References!A:B,2,0))","v":""}]
[{"$f":"IF(ISNA(VLOOKUP(Planning!$C483,References!A:B,2,0)),\"\",VLOOKUP(Planning!$C483,References!A:B,2,0))","v":""}]
[{"$f":"IF(ISNA(VLOOKUP(Planning!$C484,References!A:B,2,0)),\"\",VLOOKUP(Planning!$C484,References!A:B,2,0))","v":""}]
[{"$f":"IF(ISNA(VLOOKUP(Planning!$C485,References!A:B,2,0)),\"\",VLOOKUP(Planning!$C485,References!A:B,2,0))","v":""}]
[{"$f":"IF(ISNA(VLOOKUP(Planning!$C486,References!A:B,2,0)),\"\",VLOOKUP(Planning!$C486,References!A:B,2,0))","v":""}]
[{"$f":"IF(ISNA(VLOOKUP(Planning!$C487,References!A:B,2,0)),\"\",VLOOKUP(Planning!$C487,References!A:B,2,0))","v":""}]
[{"$f":"IF(ISNA(VLOOKUP(Planning!$C488,References!A:B,2,0)),\"\",VLOOKUP(Planning!$C488,References!A:B,2,0))","v":""}]
[{"$f":"IF(ISNA(VLOOKUP(Planning!$C489,References!A:B,2,0)),\"\",VLOOKUP(Planning!$C489,References!A:B,2,0))","v":""}]
[{"$f":"IF(ISNA(VLOOKUP(Planning!$C490,References!A:B,2,0)),\"\",VLOOKUP(Planning!$C490,References!A:B,2,0))","v":""}]
[{"$f":"IF(ISNA(VLOOKUP(Planning!$C491,References!A:B,2,0)),\"\",VLOOKUP(Planning!$C491,References!A:B,2,0))","v":""}]
[{"$f":"IF(ISNA(VLOOKUP(Planning!$C492,References!A:B,2,0)),\"\",VLOOKUP(Planning!$C492,References!A:B,2,0))","v":""}]
[{"$f":"IF(ISNA(VLOOKUP(Planning!$C493,References!A:B,2,0)),\"\",VLOOKUP(Planning!$C493,References!A:B,2,0))","v":""}]
[{"$f":"IF(ISNA(VLOOKUP(Planning!$C494,References!A:B,2,0)),\"\",VLOOKUP(Planning!$C494,References!A:B,2,0))","v":""}]
[{"$f":"IF(ISNA(VLOOKUP(Planning!$C495,References!A:B,2,0)),\"\",VLOOKUP(Planning!$C495,References!A:B,2,0))","v":""}]
[{"$f":"IF(ISNA(VLOOKUP(Planning!$C496,References!A:B,2,0)),\"\",VLOOKUP(Planning!$C496,References!A:B,2,0))","v":""}]
[{"$f":"IF(ISNA(VLOOKUP(Planning!$C497,References!A:B,2,0)),\"\",VLOOKUP(Planning!$C497,References!A:B,2,0))","v":""}]
[{"$f":"IF(ISNA(VLOOKUP(Planning!$C498,References!A:B,2,0)),\"\",VLOOKUP(Planning!$C498,References!A:B,2,0))","v":""}]
[{"$f":"IF(ISNA(VLOOKUP(Planning!$C499,References!A:B,2,0)),\"\",VLOOKUP(Planning!$C499,References!A:B,2,0))","v":""}]
[{"$f":"IF(ISNA(VLOOKUP(Planning!$C500,References!A:B,2,0)),\"\",VLOOKUP(Planning!$C500,References!A:B,2,0))","v":""}]
[{"$f":"IF(ISNA(VLOOKUP(Planning!$C501,References!A:B,2,0)),\"\",VLOOKUP(Planning!$C501,References!A:B,2,0))","v":""}]
[{"$f":"IF(ISNA(VLOOKUP(Planning!$C502,References!A:B,2,0)),\"\",VLOOKUP(Planning!$C502,References!A:B,2,0))","v":""}]
[{"$f":"IF(ISNA(VLOOKUP(Planning!$C503,References!A:B,2,0)),\"\",VLOOKUP(Planning!$C503,References!A:B,2,0))","v":""}]
[{"$f":"IF(ISNA(VLOOKUP(Planning!$C504,References!A:B,2,0)),\"\",VLOOKUP(Planning!$C504,References!A:B,2,0))","v":""}]
[{"$f":"IF(ISNA(VLOOKUP(Planning!$C505,References!A:B,2,0)),\"\",VLOOKUP(Planning!$C505,References!A:B,2,0))","v":""}]
[{"$f":"IF(ISNA(VLOOKUP(Planning!$C506,References!A:B,2,0)),\"\",VLOOKUP(Planning!$C506,References!A:B,2,0))","v":""}]
[{"$f":"IF(ISNA(VLOOKUP(Planning!$C507,References!A:B,2,0)),\"\",VLOOKUP(Planning!$C507,References!A:B,2,0))","v":""}]
[{"$f":"IF(ISNA(VLOOKUP(Planning!$C508,References!A:B,2,0)),\"\",VLOOKUP(Planning!$C508,References!A:B,2,0))","v":""}]
[{"$f":"IF(ISNA(VLOOKUP(Planning!$C509,References!A:B,2,0)),\"\",VLOOKUP(Planning!$C509,References!A:B,2,0))","v":""}]
[{"$f":"IF(ISNA(VLOOKUP(Planning!$C510,References!A:B,2,0)),\"\",VLOOKUP(Planning!$C510,References!A:B,2,0))","v":""}]
[{"$f":"IF(ISNA(VLOOKUP(Planning!$C511,References!A:B,2,0)),\"\",VLOOKUP(Planning!$C511,References!A:B,2,0))","v":""}]
[{"$f":"IF(ISNA(VLOOKUP(Planning!$C512,References!A:B,2,0)),\"\",VLOOKUP(Planning!$C512,References!A:B,2,0))","v":""}]
[{"$f":"IF(ISNA(VLOOKUP(Planning!$C513,References!A:B,2,0)),\"\",VLOOKUP(Planning!$C513,References!A:B,2,0))","v":""}]
[{"$f":"IF(ISNA(VLOOKUP(Planning!$C514,References!A:B,2,0)),\"\",VLOOKUP(Planning!$C514,References!A:B,2,0))","v":""}]
[{"$f":"IF(ISNA(VLOOKUP(Planning!$C515,References!A:B,2,0)),\"\",VLOOKUP(Planning!$C515,References!A:B,2,0))","v":""}]
[{"$f":"IF(ISNA(VLOOKUP(Planning!$C516,References!A:B,2,0)),\"\",VLOOKUP(Planning!$C516,References!A:B,2,0))","v":""}]
[{"$f":"IF(ISNA(VLOOKUP(Planning!$C517,References!A:B,2,0)),\"\",VLOOKUP(Planning!$C517,References!A:B,2,0))","v":""}]
[{"$f":"IF(ISNA(VLOOKUP(Planning!$C518,References!A:B,2,0)),\"\",VLOOKUP(Planning!$C518,References!A:B,2,0))","v":""}]
[{"$f":"IF(ISNA(VLOOKUP(Planning!$C519,References!A:B,2,0)),\"\",VLOOKUP(Planning!$C519,References!A:B,2,0))","v":""}]
[{"$f":"IF(ISNA(VLOOKUP(Planning!$C520,References!A:B,2,0)),\"\",VLOOKUP(Planning!$C520,References!A:B,2,0))","v":""}]
[{"$f":"IF(ISNA(VLOOKUP(Planning!$C521,References!A:B,2,0)),\"\",VLOOKUP(Planning!$C521,References!A:B,2,0))","v":""}]
[{"$f":"IF(ISNA(VLOOKUP(Planning!$C522,References!A:B,2,0)),\"\",VLOOKUP(Planning!$C522,References!A:B,2,0))","v":""}]
[{"$f":"IF(ISNA(VLOOKUP(Planning!$C523,References!A:B,2,0)),\"\",VLOOKUP(Planning!$C523,References!A:B,2,0))","v":""}]
[{"$f":"IF(ISNA(VLOOKUP(Planning!$C524,References!A:B,2,0)),\"\",VLOOKUP(Planning!$C524,References!A:B,2,0))","v":""}]
[{"$f":"IF(ISNA(VLOOKUP(Planning!$C525,References!A:B,2,0)),\"\",VLOOKUP(Planning!$C525,References!A:B,2,0))","v":""}]
[{"$f":"IF(ISNA(VLOOKUP(Planning!$C526,References!A:B,2,0)),\"\",VLOOKUP(Planning!$C526,References!A:B,2,0))","v":""}]
[{"$f":"IF(ISNA(VLOOKUP(Planning!$C527,References!A:B,2,0)),\"\",VLOOKUP(Planning!$C527,References!A:B,2,0))","v":""}]
[{"$f":"IF(ISNA(VLOOKUP(Planning!$C528,References!A:B,2,0)),\"\",VLOOKUP(Planning!$C528,References!A:B,2,0))","v":""}]
[{"$f":"IF(ISNA(VLOOKUP(Planning!$C529,References!A:B,2,0)),\"\",VLOOKUP(Planning!$C529,References!A:B,2,0))","v":""}]
[{"$f":"IF(ISNA(VLOOKUP(Planning!$C530,References!A:B,2,0)),\"\",VLOOKUP(Planning!$C530,References!A:B,2,0))","v":""}]
[{"$f":"IF(ISNA(VLOOKUP(Planning!$C531,References!A:B,2,0)),\"\",VLOOKUP(Planning!$C531,References!A:B,2,0))","v":""}]
[{"$f":"IF(ISNA(VLOOKUP(Planning!$C532,References!A:B,2,0)),\"\",VLOOKUP(Planning!$C532,References!A:B,2,0))","v":""}]
[{"$f":"IF(ISNA(VLOOKUP(Planning!$C533,References!A:B,2,0)),\"\",VLOOKUP(Planning!$C533,References!A:B,2,0))","v":""}]
[{"$f":"IF(ISNA(VLOOKUP(Planning!$C534,References!A:B,2,0)),\"\",VLOOKUP(Planning!$C534,References!A:B,2,0))","v":""}]
[{"$f":"IF(ISNA(VLOOKUP(Planning!$C535,References!A:B,2,0)),\"\",VLOOKUP(Planning!$C535,References!A:B,2,0))","v":""}]
[{"$f":"IF(ISNA(VLOOKUP(Planning!$C536,References!A:B,2,0)),\"\",VLOOKUP(Planning!$C536,References!A:B,2,0))","v":""}]
[{"$f":"IF(ISNA(VLOOKUP(Planning!$C537,References!A:B,2,0)),\"\",VLOOKUP(Planning!$C537,References!A:B,2,0))","v":""}]
[{"$f":"IF(ISNA(VLOOKUP(Planning!$C538,References!A:B,2,0)),\"\",VLOOKUP(Planning!$C538,References!A:B,2,0))","v":""}]
[{"$f":"IF(ISNA(VLOOKUP(Planning!$C539,References!A:B,2,0)),\"\",VLOOKUP(Planning!$C539,References!A:B,2,0))","v":""}]
[{"$f":"IF(ISNA(VLOOKUP(Planning!$C540,References!A:B,2,0)),\"\",VLOOKUP(Planning!$C540,References!A:B,2,0))","v":""}]
[{"$f":"IF(ISNA(VLOOKUP(Planning!$C541,References!A:B,2,0)),\"\",VLOOKUP(Planning!$C541,References!A:B,2,0))","v":""}]
[{"$f":"IF(ISNA(VLOOKUP(Planning!$C542,References!A:B,2,0)),\"\",VLOOKUP(Planning!$C542,References!A:B,2,0))","v":""}]
[{"$f":"IF(ISNA(VLOOKUP(Planning!$C543,References!A:B,2,0)),\"\",VLOOKUP(Planning!$C543,References!A:B,2,0))","v":""}]
[{"$f":"IF(ISNA(VLOOKUP(Planning!$C544,References!A:B,2,0)),\"\",VLOOKUP(Planning!$C544,References!A:B,2,0))","v":""}]
[{"$f":"IF(ISNA(VLOOKUP(Planning!$C545,References!A:B,2,0)),\"\",VLOOKUP(Planning!$C545,References!A:B,2,0))","v":""}]
[{"$f":"IF(ISNA(VLOOKUP(Planning!$C546,References!A:B,2,0)),\"\",VLOOKUP(Planning!$C546,References!A:B,2,0))","v":""}]
[{"$f":"IF(ISNA(VLOOKUP(Planning!$C547,References!A:B,2,0)),\"\",VLOOKUP(Planning!$C547,References!A:B,2,0))","v":""}]
[{"$f":"IF(ISNA(VLOOKUP(Planning!$C548,References!A:B,2,0)),\"\",VLOOKUP(Planning!$C548,References!A:B,2,0))","v":""}]
[{"$f":"IF(ISNA(VLOOKUP(Planning!$C549,References!A:B,2,0)),\"\",VLOOKUP(Planning!$C549,References!A:B,2,0))","v":""}]
[{"$f":"IF(ISNA(VLOOKUP(Planning!$C550,References!A:B,2,0)),\"\",VLOOKUP(Planning!$C550,References!A:B,2,0))","v":""}]
[{"$f":"IF(ISNA(VLOOKUP(Planning!$C551,References!A:B,2,0)),\"\",VLOOKUP(Planning!$C551,References!A:B,2,0))","v":""}]
[{"$f":"IF(ISNA(VLOOKUP(Planning!$C552,References!A:B,2,0)),\"\",VLOOKUP(Planning!$C552,References!A:B,2,0))","v":""}]
[{"$f":"IF(ISNA(VLOOKUP(Planning!$C553,References!A:B,2,0)),\"\",VLOOKUP(Planning!$C553,References!A:B,2,0))","v":""}]
[{"$f":"IF(ISNA(VLOOKUP(Planning!$C554,References!A:B,2,0)),\"\",VLOOKUP(Planning!$C554,References!A:B,2,0))","v":""}]
[{"$f":"IF(ISNA(VLOOKUP(Planning!$C555,References!A:B,2,0)),\"\",VLOOKUP(Planning!$C555,References!A:B,2,0))","v":""}]
[{"$f":"IF(ISNA(VLOOKUP(Planning!$C556,References!A:B,2,0)),\"\",VLOOKUP(Planning!$C556,References!A:B,2,0))","v":""}]
[{"$f":"IF(ISNA(VLOOKUP(Planning!$C557,References!A:B,2,0)),\"\",VLOOKUP(Planning!$C557,References!A:B,2,0))","v":""}]
[{"$f":"IF(ISNA(VLOOKUP(Planning!$C558,References!A:B,2,0)),\"\",VLOOKUP(Planning!$C558,References!A:B,2,0))","v":""}]
[{"$f":"IF(ISNA(VLOOKUP(Planning!$C559,References!A:B,2,0)),\"\",VLOOKUP(Planning!$C559,References!A:B,2,0))","v":""}]
[{"$f":"IF(ISNA(VLOOKUP(Planning!$C560,References!A:B,2,0)),\"\",VLOOKUP(Planning!$C560,References!A:B,2,0))","v":""}]
[{"$f":"IF(ISNA(VLOOKUP(Planning!$C561,References!A:B,2,0)),\"\",VLOOKUP(Planning!$C561,References!A:B,2,0))","v":""}]
[{"$f":"IF(ISNA(VLOOKUP(Planning!$C562,References!A:B,2,0)),\"\",VLOOKUP(Planning!$C562,References!A:B,2,0))","v":""}]
[{"$f":"IF(ISNA(VLOOKUP(Planning!$C563,References!A:B,2,0)),\"\",VLOOKUP(Planning!$C563,References!A:B,2,0))","v":""}]
[{"$f":"IF(ISNA(VLOOKUP(Planning!$C564,References!A:B,2,0)),\"\",VLOOKUP(Planning!$C564,References!A:B,2,0))","v":""}]
[{"$f":"IF(ISNA(VLOOKUP(Planning!$C565,References!A:B,2,0)),\"\",VLOOKUP(Planning!$C565,References!A:B,2,0))","v":""}]
[{"$f":"IF(ISNA(VLOOKUP(Planning!$C566,References!A:B,2,0)),\"\",VLOOKUP(Planning!$C566,References!A:B,2,0))","v":""}]
[{"$f":"IF(ISNA(VLOOKUP(Planning!$C567,References!A:B,2,0)),\"\",VLOOKUP(Planning!$C567,References!A:B,2,0))","v":""}]
[{"$f":"IF(ISNA(VLOOKUP(Planning!$C568,References!A:B,2,0)),\"\",VLOOKUP(Planning!$C568,References!A:B,2,0))","v":""}]
[{"$f":"IF(ISNA(VLOOKUP(Planning!$C569,References!A:B,2,0)),\"\",VLOOKUP(Planning!$C569,References!A:B,2,0))","v":""}]
[{"$f":"IF(ISNA(VLOOKUP(Planning!$C570,References!A:B,2,0)),\"\",VLOOKUP(Planning!$C570,References!A:B,2,0))","v":""}]
[{"$f":"IF(ISNA(VLOOKUP(Planning!$C571,References!A:B,2,0)),\"\",VLOOKUP(Planning!$C571,References!A:B,2,0))","v":""}]
[{"$f":"IF(ISNA(VLOOKUP(Planning!$C572,References!A:B,2,0)),\"\",VLOOKUP(Planning!$C572,References!A:B,2,0))","v":""}]
[{"$f":"IF(ISNA(VLOOKUP(Planning!$C573,References!A:B,2,0)),\"\",VLOOKUP(Planning!$C573,References!A:B,2,0))","v":""}]
[{"$f":"IF(ISNA(VLOOKUP(Planning!$C574,References!A:B,2,0)),\"\",VLOOKUP(Planning!$C574,References!A:B,2,0))","v":""}]
[{"$f":"IF(ISNA(VLOOKUP(Planning!$C575,References!A:B,2,0)),\"\",VLOOKUP(Planning!$C575,References!A:B,2,0))","v":""}]
[{"$f":"IF(ISNA(VLOOKUP(Planning!$C576,References!A:B,2,0)),\"\",VLOOKUP(Planning!$C576,References!A:B,2,0))","v":""}]
[{"$f":"IF(ISNA(VLOOKUP(Planning!$C577,References!A:B,2,0)),\"\",VLOOKUP(Planning!$C577,References!A:B,2,0))","v":""}]
[{"$f":"IF(ISNA(VLOOKUP(Planning!$C578,References!A:B,2,0)),\"\",VLOOKUP(Planning!$C578,References!A:B,2,0))","v":""}]
[{"$f":"IF(ISNA(VLOOKUP(Planning!$C579,References!A:B,2,0)),\"\",VLOOKUP(Planning!$C579,References!A:B,2,0))","v":""}]
[{"$f":"IF(ISNA(VLOOKUP(Planning!$C580,References!A:B,2,0)),\"\",VLOOKUP(Planning!$C580,References!A:B,2,0))","v":""}]
[{"$f":"IF(ISNA(VLOOKUP(Planning!$C581,References!A:B,2,0)),\"\",VLOOKUP(Planning!$C581,References!A:B,2,0))","v":""}]
[{"$f":"IF(ISNA(VLOOKUP(Planning!$C582,References!A:B,2,0)),\"\",VLOOKUP(Planning!$C582,References!A:B,2,0))","v":""}]
[{"$f":"IF(ISNA(VLOOKUP(Planning!$C583,References!A:B,2,0)),\"\",VLOOKUP(Planning!$C583,References!A:B,2,0))","v":""}]
[{"$f":"IF(ISNA(VLOOKUP(Planning!$C584,References!A:B,2,0)),\"\",VLOOKUP(Planning!$C584,References!A:B,2,0))","v":""}]
[{"$f":"IF(ISNA(VLOOKUP(Planning!$C585,References!A:B,2,0)),\"\",VLOOKUP(Planning!$C585,References!A:B,2,0))","v":""}]
[{"$f":"IF(ISNA(VLOOKUP(Planning!$C586,References!A:B,2,0)),\"\",VLOOKUP(Planning!$C586,References!A:B,2,0))","v":""}]
[{"$f":"IF(ISNA(VLOOKUP(Planning!$C587,References!A:B,2,0)),\"\",VLOOKUP(Planning!$C587,References!A:B,2,0))","v":""}]
[{"$f":"IF(ISNA(VLOOKUP(Planning!$C588,References!A:B,2,0)),\"\",VLOOKUP(Planning!$C588,References!A:B,2,0))","v":""}]
[{"$f":"IF(ISNA(VLOOKUP(Planning!$C589,References!A:B,2,0)),\"\",VLOOKUP(Planning!$C589,References!A:B,2,0))","v":""}]
[{"$f":"IF(ISNA(VLOOKUP(Planning!$C590,References!A:B,2,0)),\"\",VLOOKUP(Planning!$C590,References!A:B,2,0))","v":""}]
[{"$f":"IF(ISNA(VLOOKUP(Planning!$C591,References!A:B,2,0)),\"\",VLOOKUP(Planning!$C591,References!A:B,2,0))","v":""}]
[{"$f":"IF(ISNA(VLOOKUP(Planning!$C592,References!A:B,2,0)),\"\",VLOOKUP(Planning!$C592,References!A:B,2,0))","v":""}]
[{"$f":"IF(ISNA(VLOOKUP(Planning!$C593,References!A:B,2,0)),\"\",VLOOKUP(Planning!$C593,References!A:B,2,0))","v":""}]
[{"$f":"IF(ISNA(VLOOKUP(Planning!$C594,References!A:B,2,0)),\"\",VLOOKUP(Planning!$C594,References!A:B,2,0))","v":""}]
[{"$f":"IF(ISNA(VLOOKUP(Planning!$C595,References!A:B,2,0)),\"\",VLOOKUP(Planning!$C595,References!A:B,2,0))","v":""}]
[{"$f":"IF(ISNA(VLOOKUP(Planning!$C596,References!A:B,2,0)),\"\",VLOOKUP(Planning!$C596,References!A:B,2,0))","v":""}]
[{"$f":"IF(ISNA(VLOOKUP(Planning!$C597,References!A:B,2,0)),\"\",VLOOKUP(Planning!$C597,References!A:B,2,0))","v":""}]
[{"$f":"IF(ISNA(VLOOKUP(Planning!$C598,References!A:B,2,0)),\"\",VLOOKUP(Planning!$C598,References!A:B,2,0))","v":""}]
[{"$f":"IF(ISNA(VLOOKUP(Planning!$C599,References!A:B,2,0)),\"\",VLOOKUP(Planning!$C599,References!A:B,2,0))","v":""}]
[{"$f":"IF(ISNA(VLOOKUP(Planning!$C600,References!A:B,2,0)),\"\",VLOOKUP(Planning!$C600,References!A:B,2,0))","v":""}]
[{"$f":"IF(ISNA(VLOOKUP(Planning!$C601,References!A:B,2,0)),\"\",VLOOKUP(Planning!$C601,References!A:B,2,0))","v":""}]
[{"$f":"IF(ISNA(VLOOKUP(Planning!$C602,References!A:B,2,0)),\"\",VLOOKUP(Planning!$C602,References!A:B,2,0))","v":""}]
[{"$f":"IF(ISNA(VLOOKUP(Planning!$C603,References!A:B,2,0)),\"\",VLOOKUP(Planning!$C603,References!A:B,2,0))","v":""}]
[{"$f":"IF(ISNA(VLOOKUP(Planning!$C604,References!A:B,2,0)),\"\",VLOOKUP(Planning!$C604,References!A:B,2,0))","v":""}]
[{"$f":"IF(ISNA(VLOOKUP(Planning!$C605,References!A:B,2,0)),\"\",VLOOKUP(Planning!$C605,References!A:B,2,0))","v":""}]

{"sheet":"Planning1","index":1,"n_rows":55,"n_cols":121,"rows_kept":55,"cut":false,"hidden":false,"merged":[[15,2,18,2],[15,3,18,3],[15,4,18,4],[15,5,18,5],[15,6,18,6],[25,0,26,0],[15,45,18,45],[15,33,18,33],[15,34,18,34],[15,35,18,35],[15,36,18,36],[15,37,18,37],[15,38,18,38],[15,27,18,27],[15,28,18,28],[15,29,18,29],[15,30,18,30],[15,31,18,31],[15,18,18,18],[15,19,18,19],[15,20,18,20],[1,5,1,23],[3,5,3,14],[4,5,4,14],[15,46,18,46],[15,21,18,21],[15,22,18,22],[15,23,18,23],[15,24,18,24],[15,25,18,25],[15,26,18,26],[15,10,18,10],[15,7,18,7],[15,8,18,8],[15,15,18,15],[15,16,18,16],[15,17,18,17],[3,15,3,16],[4,15,4,16],[3,17,3,19],[4,17,4,19],[3,20,3,23],[4,20,4,23],[10,19,12,98],[15,47,18,47],[15,48,18,48],[15,39,18,39],[15,40,18,40],[15,41,18,41],[15,42,18,42],[15,32,18,32],[15,43,18,43],[15,44,18,44],[15,9,18,9],[25,73,25,96],[25,97,25,120],[19,73,20,73],[19,97,20,97],[19,25,20,25],[19,49,20,49],[25,49,25,72],[25,1,25,24],[25,25,25,48],[15,11,18,11],[15,12,18,12],[15,13,18,13],[15,14,18,14],[19,1,20,1],[13,1,18,1]]}
[]
[]
[]
[null,null,null,null,null,{"$f":"IF($W$3,\"Date de la ligne rouge:\",\"Date Of Red Line:\")","v":"Date Of Red Line:"},null,null,null,null,null,null,null,null,null,7,null,"Mai",null,null,2015]
[null,null,null,null,null,{"$f":"IF($W$3,\"1er jour du diagramme:\",\"First Date of planning:\")","v":"First Date of planning:"},null,null,null,null,null,null,null,null,null,11,null,"Mai",null,null,2015]
[]
[]
[]
[]
[]
[null,null,null,null,null,null,null,null,null,null,null,null,null,null,null,null,null,null,null,"Planning de production Resinoplast "]
[]
[]
[null,{"$f":"IF(DAY(B26)=1,B26,\"\")","v":""}]
[]
[null,null,{"$f":"IF(DAY(C26)=1,C26,\"\")","v":""},{"$f":"IF(DAY(D26)=1,D26,\"\")","v":""},{"$f":"IF(DAY(E26)=1,E26,\"\")","v":""},"","","","","","","","","","","","","","","","","","","","","","","","","","","","","","","","","","","","","","","","","","","",""]
[]
[]
[]
["Semaine",{"$f":"$A$10&INT((B26-DATE(YEAR(B26-WEEKDAY(B26-1)+4),1,3)+WEEKDAY(DATE(YEAR(B26-WEEKDAY(B26-1)+4),1,3))+5)/7)","v":"22"},{"$f":"#REF!&INT((C26-DATE(YEAR(C26-WEEKDAY(C26-1)+4),1,3)+WEEKDAY(DATE(YEAR(C26-WEEKDAY(C26-1)+4),1,3))+5)/7)","v":{"$error":"#REF!"}},{"$f":"#REF!&INT((D26-DATE(YEAR(D26-WEEKDAY(D26-1)+4),1,3)+WEEKDAY(DATE(YEAR(D26-WEEKDAY(D26-1)+4),1,3))+5)/7)","v":{"$error":"#REF!"}},{"$f":"#REF!&INT((E26-DATE(YEAR(E26-WEEKDAY(E26-1)+4),1,3)+WEEKDAY(DATE(YEAR(E26-WEEKDAY(E26-1)+4),1,3))+5)/7)","v":{"$error":"#REF!"}},{"$f":"#REF!&INT((F26-DATE(YEAR(F26-WEEKDAY(F26-1)+4),1,3)+WEEKDAY(DATE(YEAR(F26-WEEKDAY(F26-1)+4),1,3))+5)/7)","v":{"$error":"#REF!"}},{"$f":"#REF!&INT((G26-DATE(YEAR(G26-WEEKDAY(G26-1)+4),1,3)+WEEKDAY(DATE(YEAR(G26-WEEKDAY(G26-1)+4),1,3))+5)/7)","v":{"$error":"#REF!"}},{"$f":"#REF!&INT((H26-DATE(YEAR(H26-WEEKDAY(H26-1)+4),1,3)+WEEKDAY(DATE(YEAR(H26-WEEKDAY(H26-1)+4),1,3))+5)/7)","v":{"$error":"#REF!"}},{"$f":"#REF!&INT((I26-DATE(YEAR(I26-WEEKDAY(I26-1)+4),1,3)+WEEKDAY(DATE(YEAR(I26-WEEKDAY(I26-1)+4),1,3))+5)/7)","v":{"$error":"#REF!"}},{"$f":"#REF!&INT((J26-DATE(YEAR(J26-WEEKDAY(J26-1)+4),1,3)+WEEKDAY(DATE(YEAR(J26-WEEKDAY(J26-1)+4),1,3))+5)/7)","v":{"$error":"#REF!"}},{"$f":"#REF!&INT((K26-DATE(YEAR(K26-WEEKDAY(K26-1)+4),1,3)+WEEKDAY(DATE(YEAR(K26-WEEKDAY(K26-1)+4),1,3))+5)/7)","v":{"$error":"#REF!"}},{"$f":"#REF!&INT((L26-DATE(YEAR(L26-WEEKDAY(L26-1)+4),1,3)+WEEKDAY(DATE(YEAR(L26-WEEKDAY(L26-1)+4),1,3))+5)/7)","v":{"$error":"#REF!"}},{"$f":"#REF!&INT((M26-DATE(YEAR(M26-WEEKDAY(M26-1)+4),1,3)+WEEKDAY(DATE(YEAR(M26-WEEKDAY(M26-1)+4),1,3))+5)/7)","v":{"$error":"#REF!"}},{"$f":"#REF!&INT((N26-DATE(YEAR(N26-WEEKDAY(N26-1)+4),1,3)+WEEKDAY(DATE(YEAR(N26-WEEKDAY(N26-1)+4),1,3))+5)/7)","v":{"$error":"#REF!"}},{"$f":"#REF!&INT((O26-DATE(YEAR(O26-WEEKDAY(O26-1)+4),1,3)+WEEKDAY(DATE(YEAR(O26-WEEKDAY(O26-1)+4),1,3))+5)/7)","v":{"$error":"#REF!"}},{"$f":"#REF!&INT((P26-DATE(YEAR(P26-WEEKDAY(P26-1)+4),1,3)+WEEKDAY(DATE(YEAR(P26-WEEKDAY(P26-1)+4),1,3))+5)/7)","v":{"$error":"#REF!"}},{"$f":"#REF!&INT((Q26-DATE(YEAR(Q26-WEEKDAY(Q26-1)+4),1,3)+WEEKDAY(DATE(YEAR(Q26-WEEKDAY(Q26-1)+4),1,3))+5)/7)","v":{"$error":"#REF!"}},{"$f":"#REF!&INT((R26-DATE(YEAR(R26-WEEKDAY(R26-1)+4),1,3)+WEEKDAY(DATE(YEAR(R26-WEEKDAY(R26-1)+4),1,3))+5)/7)","v":{"$error":"#REF!"}},{"$f":"#REF!&INT((S26-DATE(YEAR(S26-WEEKDAY(S26-1)+4),1,3)+WEEKDAY(DATE(YEAR(S26-WEEKDAY(S26-1)+4),1,3))+5)/7)","v":{"$error":"#REF!"}},{"$f":"#REF!&INT((T26-DATE(YEAR(T26-WEEKDAY(T26-1)+4),1,3)+WEEKDAY(DATE(YEAR(T26-WEEKDAY(T26-1)+4),1,3))+5)/7)","v":{"$error":"#REF!"}},{"$f":"#REF!&INT((U26-DATE(YEAR(U26-WEEKDAY(U26-1)+4),1,3)+WEEKDAY(DATE(YEAR(U26-WEEKDAY(U26-1)+4),1,3))+5)/7)","v":{"$error":"#REF!"}},{"$f":"#REF!&INT((V26-DATE(YEAR(V26-WEEKDAY(V26-1)+4),1,3)+WEEKDAY(DATE(YEAR(V26-WEEKDAY(V26-1)+4),1,3))+5)/7)","v":{"$error":"#REF!"}},{"$f":"#REF!&INT((W26-DATE(YEAR(W26-WEEKDAY(W26-1)+4),1,3)+WEEKDAY(DATE(YEAR(W26-WEEKDAY(W26-1)+4),1,3))+5)/7)","v":{"$error":"#REF!"}},{"$f":"#REF!&INT((X26-DATE(YEAR(X26-WEEKDAY(X26-1)+4),1,3)+WEEKDAY(DATE(YEAR(X26-WEEKDAY(X26-1)+4),1,3))+5)/7)","v":{"$error":"#REF!"}},{"$f":"#REF!&INT((Y26-DATE(YEAR(Y26-WEEKDAY(Y26-1)+4),1,3)+WEEKDAY(DATE(YEAR(Y26-WEEKDAY(Y26-1)+4),1,3))+5)/7)","v":{"$error":"#REF!"}},{"$f":"$A$10&INT((Z26-DATE(YEAR(Z26-WEEKDAY(Z26-1)+4),1,3)+WEEKDAY(DATE(YEAR(Z26-WEEKDAY(Z26-1)+4),1,3))+5)/7)","v":"22"},{"$f":"#REF!&INT((AA26-DATE(YEAR(AA26-WEEKDAY(AA26-1)+4),1,3)+WEEKDAY(DATE(YEAR(AA26-WEEKDAY(AA26-1)+4),1,3))+5)/7)","v":{"$error":"#REF!"}},{"$f":"#REF!&INT((AB26-DATE(YEAR(AB26-WEEKDAY(AB26-1)+4),1,3)+WEEKDAY(DATE(YEAR(AB26-WEEKDAY(AB26-1)+4),1,3))+5)/7)","v":{"$error":"#REF!"}},{"$f":"#REF!&INT((AC26-DATE(YEAR(AC26-WEEKDAY(AC26-1)+4),1,3)+WEEKDAY(DATE(YEAR(AC26-WEEKDAY(AC26-1)+4),1,3))+5)/7)","v":{"$error":"#REF!"}},{"$f":"#REF!&INT((AD26-DATE(YEAR(AD26-WEEKDAY(AD26-1)+4),1,3)+WEEKDAY(DATE(YEAR(AD26-WEEKDAY(AD26-1)+4),1,3))+5)/7)","v":{"$error":"#REF!"}},{"$f":"#REF!&INT((AE26-DATE(YEAR(AE26-WEEKDAY(AE26-1)+4),1,3)+WEEKDAY(DATE(YEAR(AE26-WEEKDAY(AE26-1)+4),1,3))+5)/7)","v":{"$error":"#REF!"}},{"$f":"#REF!&INT((AF26-DATE(YEAR(AF26-WEEKDAY(AF26-1)+4),1,3)+WEEKDAY(DATE(YEAR(AF26-WEEKDAY(AF26-1)+4),1,3))+5)/7)","v":{"$error":"#REF!"}},{"$f":"#REF!&INT((AG26-DATE(YEAR(AG26-WEEKDAY(AG26-1)+4),1,3)+WEEKDAY(DATE(YEAR(AG26-WEEKDAY(AG26-1)+4),1,3))+5)/7)","v":{"$error":"#REF!"}},{"$f":"#REF!&INT((AH26-DATE(YEAR(AH26-WEEKDAY(AH26-1)+4),1,3)+WEEKDAY(DATE(YEAR(AH26-WEEKDAY(AH26-1)+4),1,3))+5)/7)","v":{"$error":"#REF!"}},{"$f":"#REF!&INT((AI26-DATE(YEAR(AI26-WEEKDAY(AI26-1)+4),1,3)+WEEKDAY(DATE(YEAR(AI26-WEEKDAY(AI26-1)+4),1,3))+5)/7)","v":{"$error":"#REF!"}},{"$f":"#REF!&INT((AJ26-DATE(YEAR(AJ26-WEEKDAY(AJ26-1)+4),1,3)+WEEKDAY(DATE(YEAR(AJ26-WEEKDAY(AJ26-1)+4),1,3))+5)/7)","v":{"$error":"#REF!"}},{"$f":"#REF!&INT((AK26-DATE(YEAR(AK26-WEEKDAY(AK26-1)+4),1,3)+WEEKDAY(DATE(YEAR(AK26-WEEKDAY(AK26-1)+4),1,3))+5)/7)","v":{"$error":"#REF!"}},{"$f":"#REF!&INT((AL26-DATE(YEAR(AL26-WEEKDAY(AL26-1)+4),1,3)+WEEKDAY(DATE(YEAR(AL26-WEEKDAY(AL26-1)+4),1,3))+5)/7)","v":{"$error":"#REF!"}},{"$f":"#REF!&INT((AM26-DATE(YEAR(AM26-WEEKDAY(AM26-1)+4),1,3)+WEEKDAY(DATE(YEAR(AM26-WEEKDAY(AM26-1)+4),1,3))+5)/7)","v":{"$error":"#REF!"}},{"$f":"#REF!&INT((AN26-DATE(YEAR(AN26-WEEKDAY(AN26-1)+4),1,3)+WEEKDAY(DATE(YEAR(AN26-WEEKDAY(AN26-1)+4),1,3))+5)/7)","v":{"$error":"#REF!"}},{"$f":"#REF!&INT((AO26-DATE(YEAR(AO26-WEEKDAY(AO26-1)+4),1,3)+WEEKDAY(DATE(YEAR(AO26-WEEKDAY(AO26-1)+4),1,3))+5)/7)","v":{"$error":"#REF!"}},{"$f":"#REF!&INT((AP26-DATE(YEAR(AP26-WEEKDAY(AP26-1)+4),1,3)+WEEKDAY(DATE(YEAR(AP26-WEEKDAY(AP26-1)+4),1,3))+5)/7)","v":{"$error":"#REF!"}},{"$f":"#REF!&INT((AQ26-DATE(YEAR(AQ26-WEEKDAY(AQ26-1)+4),1,3)+WEEKDAY(DATE(YEAR(AQ26-WEEKDAY(AQ26-1)+4),1,3))+5)/7)","v":{"$error":"#REF!"}},{"$f":"#REF!&INT((AR26-DATE(YEAR(AR26-WEEKDAY(AR26-1)+4),1,3)+WEEKDAY(DATE(YEAR(AR26-WEEKDAY(AR26-1)+4),1,3))+5)/7)","v":{"$error":"#REF!"}},{"$f":"#REF!&INT((AS26-DATE(YEAR(AS26-WEEKDAY(AS26-1)+4),1,3)+WEEKDAY(DATE(YEAR(AS26-WEEKDAY(AS26-1)+4),1,3))+5)/7)","v":{"$error":"#REF!"}},{"$f":"#REF!&INT((AT26-DATE(YEAR(AT26-WEEKDAY(AT26-1)+4),1,3)+WEEKDAY(DATE(YEAR(AT26-WEEKDAY(AT26-1)+4),1,3))+5)/7)","v":{"$error":"#REF!"}},{"$f":"#REF!&INT((AU26-DATE(YEAR(AU26-WEEKDAY(AU26-1)+4),1,3)+WEEKDAY(DATE(YEAR(AU26-WEEKDAY(AU26-1)+4),1,3))+5)/7)","v":{"$error":"#REF!"}},{"$f":"#REF!&INT((AV26-DATE(YEAR(AV26-WEEKDAY(AV26-1)+4),1,3)+WEEKDAY(DATE(YEAR(AV26-WEEKDAY(AV26-1)+4),1,3))+5)/7)","v":{"$error":"#REF!"}},{"$f":"#REF!&INT((AW26-DATE(YEAR(AW26-WEEKDAY(AW26-1)+4),1,3)+WEEKDAY(DATE(YEAR(AW26-WEEKDAY(AW26-1)+4),1,3))+5)/7)","v":{"$error":"#REF!"}},{"$f":"$A$10&INT((AX26-DATE(YEAR(AX26-WEEKDAY(AX26-1)+4),1,3)+WEEKDAY(DATE(YEAR(AX26-WEEKDAY(AX26-1)+4),1,3))+5)/7)","v":"22"},{"$f":"#REF!&INT((AY26-DATE(YEAR(AY26-WEEKDAY(AY26-1)+4),1,3)+WEEKDAY(DATE(YEAR(AY26-WEEKDAY(AY26-1)+4),1,3))+5)/7)","v":{"$error":"#REF!"}},{"$f":"#REF!&INT((AZ26-DATE(YEAR(AZ26-WEEKDAY(AZ26-1)+4),1,3)+WEEKDAY(DATE(YEAR(AZ26-WEEKDAY(AZ26-1)+4),1,3))+5)/7)","v":{"$error":"#REF!"}},{"$f":"#REF!&INT((BA26-DATE(YEAR(BA26-WEEKDAY(BA26-1)+4),1,3)+WEEKDAY(DATE(YEAR(BA26-WEEKDAY(BA26-1)+4),1,3))+5)/7)","v":{"$error":"#REF!"}},{"$f":"#REF!&INT((BB26-DATE(YEAR(BB26-WEEKDAY(BB26-1)+4),1,3)+WEEKDAY(DATE(YEAR(BB26-WEEKDAY(BB26-1)+4),1,3))+5)/7)","v":{"$error":"#REF!"}},{"$f":"#REF!&INT((BC26-DATE(YEAR(BC26-WEEKDAY(BC26-1)+4),1,3)+WEEKDAY(DATE(YEAR(BC26-WEEKDAY(BC26-1)+4),1,3))+5)/7)","v":{"$error":"#REF!"}},{"$f":"#REF!&INT((BD26-DATE(YEAR(BD26-WEEKDAY(BD26-1)+4),1,3)+WEEKDAY(DATE(YEAR(BD26-WEEKDAY(BD26-1)+4),1,3))+5)/7)","v":{"$error":"#REF!"}},{"$f":"#REF!&INT((BE26-DATE(YEAR(BE26-WEEKDAY(BE26-1)+4),1,3)+WEEKDAY(DATE(YEAR(BE26-WEEKDAY(BE26-1)+4),1,3))+5)/7)","v":{"$error":"#REF!"}},{"$f":"#REF!&INT((BF26-DATE(YEAR(BF26-WEEKDAY(BF26-1)+4),1,3)+WEEKDAY(DATE(YEAR(BF26-WEEKDAY(BF26-1)+4),1,3))+5)/7)","v":{"$error":"#REF!"}},{"$f":"#REF!&INT((BG26-DATE(YEAR(BG26-WEEKDAY(BG26-1)+4),1,3)+WEEKDAY(DATE(YEAR(BG26-WEEKDAY(BG26-1)+4),1,3))+5)/7)","v":{"$error":"#REF!"}},{"$f":"#REF!&INT((BH26-DATE(YEAR(BH26-WEEKDAY(BH26-1)+4),1,3)+WEEKDAY(DATE(YEAR(BH26-WEEKDAY(BH26-1)+4),1,3))+5)/7)","v":{"$error":"#REF!"}},{"$f":"#REF!&INT((BI26-DATE(YEAR(BI26-WEEKDAY(BI26-1)+4),1,3)+WEEKDAY(DATE(YEAR(BI26-WEEKDAY(BI26-1)+4),1,3))+5)/7)","v":{"$error":"#REF!"}},{"$f":"#REF!&INT((BJ26-DATE(YEAR(BJ26-WEEKDAY(BJ26-1)+4),1,3)+WEEKDAY(DATE(YEAR(BJ26-WEEKDAY(BJ26-1)+4),1,3))+5)/7)","v":{"$error":"#REF!"}},{"$f":"#REF!&INT((BK26-DATE(YEAR(BK26-WEEKDAY(BK26-1)+4),1,3)+WEEKDAY(DATE(YEAR(BK26-WEEKDAY(BK26-1)+4),1,3))+5)/7)","v":{"$error":"#REF!"}},{"$f":"#REF!&INT((BL26-DATE(YEAR(BL26-WEEKDAY(BL26-1)+4),1,3)+WEEKDAY(DATE(YEAR(BL26-WEEKDAY(BL26-1)+4),1,3))+5)/7)","v":{"$error":"#REF!"}},{"$f":"#REF!&INT((BM26-DATE(YEAR(BM26-WEEKDAY(BM26-1)+4),1,3)+WEEKDAY(DATE(YEAR(BM26-WEEKDAY(BM26-1)+4),1,3))+5)/7)","v":{"$error":"#REF!"}},{"$f":"#REF!&INT((BN26-DATE(YEAR(BN26-WEEKDAY(BN26-1)+4),1,3)+WEEKDAY(DATE(YEAR(BN26-WEEKDAY(BN26-1)+4),1,3))+5)/7)","v":{"$error":"#REF!"}},{"$f":"#REF!&INT((BO26-DATE(YEAR(BO26-WEEKDAY(BO26-1)+4),1,3)+WEEKDAY(DATE(YEAR(BO26-WEEKDAY(BO26-1)+4),1,3))+5)/7)","v":{"$error":"#REF!"}},{"$f":"#REF!&INT((BP26-DATE(YEAR(BP26-WEEKDAY(BP26-1)+4),1,3)+WEEKDAY(DATE(YEAR(BP26-WEEKDAY(BP26-1)+4),1,3))+5)/7)","v":{"$error":"#REF!"}},{"$f":"#REF!&INT((BQ26-DATE(YEAR(BQ26-WEEKDAY(BQ26-1)+4),1,3)+WEEKDAY(DATE(YEAR(BQ26-WEEKDAY(BQ26-1)+4),1,3))+5)/7)","v":{"$error":"#REF!"}},{"$f":"#REF!&INT((BR26-DATE(YEAR(BR26-WEEKDAY(BR26-1)+4),1,3)+WEEKDAY(DATE(YEAR(BR26-WEEKDAY(BR26-1)+4),1,3))+5)/7)","v":{"$error":"#REF!"}},{"$f":"#REF!&INT((BS26-DATE(YEAR(BS26-WEEKDAY(BS26-1)+4),1,3)+WEEKDAY(DATE(YEAR(BS26-WEEKDAY(BS26-1)+4),1,3))+5)/7)","v":{"$error":"#REF!"}},{"$f":"#REF!&INT((BT26-DATE(YEAR(BT26-WEEKDAY(BT26-1)+4),1,3)+WEEKDAY(DATE(YEAR(BT26-WEEKDAY(BT26-1)+4),1,3))+5)/7)","v":{"$error":"#REF!"}},{"$f":"#REF!&INT((BU26-DATE(YEAR(BU26-WEEKDAY(BU26-1)+4),1,3)+WEEKDAY(DATE(YEAR(BU26-WEEKDAY(BU26-1)+4),1,3))+5)/7)","v":{"$error":"#REF!"}},{"$f":"$A$10&INT((BV26-DATE(YEAR(BV26-WEEKDAY(BV26-1)+4),1,3)+WEEKDAY(DATE(YEAR(BV26-WEEKDAY(BV26-1)+4),1,3))+5)/7)","v":"22"},{"$f":"#REF!&INT((BW26-DATE(YEAR(BW26-WEEKDAY(BW26-1)+4),1,3)+WEEKDAY(DATE(YEAR(BW26-WEEKDAY(BW26-1)+4),1,3))+5)/7)","v":{"$error":"#REF!"}},{"$f":"#REF!&INT((BX26-DATE(YEAR(BX26-WEEKDAY(BX26-1)+4),1,3)+WEEKDAY(DATE(YEAR(BX26-WEEKDAY(BX26-1)+4),1,3))+5)/7)","v":{"$error":"#REF!"}},{"$f":"#REF!&INT((BY26-DATE(YEAR(BY26-WEEKDAY(BY26-1)+4),1,3)+WEEKDAY(DATE(YEAR(BY26-WEEKDAY(BY26-1)+4),1,3))+5)/7)","v":{"$error":"#REF!"}},{"$f":"#REF!&INT((BZ26-DATE(YEAR(BZ26-WEEKDAY(BZ26-1)+4),1,3)+WEEKDAY(DATE(YEAR(BZ26-WEEKDAY(BZ26-1)+4),1,3))+5)/7)","v":{"$error":"#REF!"}},{"$f":"#REF!&INT((CA26-DATE(YEAR(CA26-WEEKDAY(CA26-1)+4),1,3)+WEEKDAY(DATE(YEAR(CA26-WEEKDAY(CA26-1)+4),1,3))+5)/7)","v":{"$error":"#REF!"}},{"$f":"#REF!&INT((CB26-DATE(YEAR(CB26-WEEKDAY(CB26-1)+4),1,3)+WEEKDAY(DATE(YEAR(CB26-WEEKDAY(CB26-1)+4),1,3))+5)/7)","v":{"$error":"#REF!"}},{"$f":"#REF!&INT((CC26-DATE(YEAR(CC26-WEEKDAY(CC26-1)+4),1,3)+WEEKDAY(DATE(YEAR(CC26-WEEKDAY(CC26-1)+4),1,3))+5)/7)","v":{"$error":"#REF!"}},{"$f":"#REF!&INT((CD26-DATE(YEAR(CD26-WEEKDAY(CD26-1)+4),1,3)+WEEKDAY(DATE(YEAR(CD26-WEEKDAY(CD26-1)+4),1,3))+5)/7)","v":{"$error":"#REF!"}},{"$f":"#REF!&INT((CE26-DATE(YEAR(CE26-WEEKDAY(CE26-1)+4),1,3)+WEEKDAY(DATE(YEAR(CE26-WEEKDAY(CE26-1)+4),1,3))+5)/7)","v":{"$error":"#REF!"}},{"$f":"#REF!&INT((CF26-DATE(YEAR(CF26-WEEKDAY(CF26-1)+4),1,3)+WEEKDAY(DATE(YEAR(CF26-WEEKDAY(CF26-1)+4),1,3))+5)/7)","v":{"$error":"#REF!"}},{"$f":"#REF!&INT((CG26-DATE(YEAR(CG26-WEEKDAY(CG26-1)+4),1,3)+WEEKDAY(DATE(YEAR(CG26-WEEKDAY(CG26-1)+4),1,3))+5)/7)","v":{"$error":"#REF!"}},{"$f":"#REF!&INT((CH26-DATE(YEAR(CH26-WEEKDAY(CH26-1)+4),1,3)+WEEKDAY(DATE(YEAR(CH26-WEEKDAY(CH26-1)+4),1,3))+5)/7)","v":{"$error":"#REF!"}},{"$f":"#REF!&INT((CI26-DATE(YEAR(CI26-WEEKDAY(CI26-1)+4),1,3)+WEEKDAY(DATE(YEAR(CI26-WEEKDAY(CI26-1)+4),1,3))+5)/7)","v":{"$error":"#REF!"}},{"$f":"#REF!&INT((CJ26-DATE(YEAR(CJ26-WEEKDAY(CJ26-1)+4),1,3)+WEEKDAY(DATE(YEAR(CJ26-WEEKDAY(CJ26-1)+4),1,3))+5)/7)","v":{"$error":"#REF!"}},{"$f":"#REF!&INT((CK26-DATE(YEAR(CK26-WEEKDAY(CK26-1)+4),1,3)+WEEKDAY(DATE(YEAR(CK26-WEEKDAY(CK26-1)+4),1,3))+5)/7)","v":{"$error":"#REF!"}},{"$f":"#REF!&INT((CL26-DATE(YEAR(CL26-WEEKDAY(CL26-1)+4),1,3)+WEEKDAY(DATE(YEAR(CL26-WEEKDAY(CL26-1)+4),1,3))+5)/7)","v":{"$error":"#REF!"}},{"$f":"#REF!&INT((CM26-DATE(YEAR(CM26-WEEKDAY(CM26-1)+4),1,3)+WEEKDAY(DATE(YEAR(CM26-WEEKDAY(CM26-1)+4),1,3))+5)/7)","v":{"$error":"#REF!"}},{"$f":"#REF!&INT((CN26-DATE(YEAR(CN26-WEEKDAY(CN26-1)+4),1,3)+WEEKDAY(DATE(YEAR(CN26-WEEKDAY(CN26-1)+4),1,3))+5)/7)","v":{"$error":"#REF!"}},{"$f":"#REF!&INT((CO26-DATE(YEAR(CO26-WEEKDAY(CO26-1)+4),1,3)+WEEKDAY(DATE(YEAR(CO26-WEEKDAY(CO26-1)+4),1,3))+5)/7)","v":{"$error":"#REF!"}},{"$f":"#REF!&INT((CP26-DATE(YEAR(CP26-WEEKDAY(CP26-1)+4),1,3)+WEEKDAY(DATE(YEAR(CP26-WEEKDAY(CP26-1)+4),1,3))+5)/7)","v":{"$error":"#REF!"}},{"$f":"#REF!&INT((CQ26-DATE(YEAR(CQ26-WEEKDAY(CQ26-1)+4),1,3)+WEEKDAY(DATE(YEAR(CQ26-WEEKDAY(CQ26-1)+4),1,3))+5)/7)","v":{"$error":"#REF!"}},{"$f":"#REF!&INT((CR26-DATE(YEAR(CR26-WEEKDAY(CR26-1)+4),1,3)+WEEKDAY(DATE(YEAR(CR26-WEEKDAY(CR26-1)+4),1,3))+5)/7)","v":{"$error":"#REF!"}},{"$f":"#REF!&INT((CS26-DATE(YEAR(CS26-WEEKDAY(CS26-1)+4),1,3)+WEEKDAY(DATE(YEAR(CS26-WEEKDAY(CS26-1)+4),1,3))+5)/7)","v":{"$error":"#REF!"}},{"$f":"$A$10&INT((CT26-DATE(YEAR(CT26-WEEKDAY(CT26-1)+4),1,3)+WEEKDAY(DATE(YEAR(CT26-WEEKDAY(CT26-1)+4),1,3))+5)/7)","v":"22"},{"$f":"#REF!&INT((CU26-DATE(YEAR(CU26-WEEKDAY(CU26-1)+4),1,3)+WEEKDAY(DATE(YEAR(CU26-WEEKDAY(CU26-1)+4),1,3))+5)/7)","v":{"$error":"#REF!"}},{"$f":"#REF!&INT((CV26-DATE(YEAR(CV26-WEEKDAY(CV26-1)+4),1,3)+WEEKDAY(DATE(YEAR(CV26-WEEKDAY(CV26-1)+4),1,3))+5)/7)","v":{"$error":"#REF!"}},{"$f":"#REF!&INT((CW26-DATE(YEAR(CW26-WEEKDAY(CW26-1)+4),1,3)+WEEKDAY(DATE(YEAR(CW26-WEEKDAY(CW26-1)+4),1,3))+5)/7)","v":{"$error":"#REF!"}},{"$f":"#REF!&INT((CX26-DATE(YEAR(CX26-WEEKDAY(CX26-1)+4),1,3)+WEEKDAY(DATE(YEAR(CX26-WEEKDAY(CX26-1)+4),1,3))+5)/7)","v":{"$error":"#REF!"}},{"$f":"#REF!&INT((CY26-DATE(YEAR(CY26-WEEKDAY(CY26-1)+4),1,3)+WEEKDAY(DATE(YEAR(CY26-WEEKDAY(CY26-1)+4),1,3))+5)/7)","v":{"$error":"#REF!"}},{"$f":"#REF!&INT((CZ26-DATE(YEAR(CZ26-WEEKDAY(CZ26-1)+4),1,3)+WEEKDAY(DATE(YEAR(CZ26-WEEKDAY(CZ26-1)+4),1,3))+5)/7)","v":{"$error":"#REF!"}},{"$f":"#REF!&INT((DA26-DATE(YEAR(DA26-WEEKDAY(DA26-1)+4),1,3)+WEEKDAY(DATE(YEAR(DA26-WEEKDAY(DA26-1)+4),1,3))+5)/7)","v":{"$error":"#REF!"}},{"$f":"#REF!&INT((DB26-DATE(YEAR(DB26-WEEKDAY(DB26-1)+4),1,3)+WEEKDAY(DATE(YEAR(DB26-WEEKDAY(DB26-1)+4),1,3))+5)/7)","v":{"$error":"#REF!"}},{"$f":"#REF!&INT((DC26-DATE(YEAR(DC26-WEEKDAY(DC26-1)+4),1,3)+WEEKDAY(DATE(YEAR(DC26-WEEKDAY(DC26-1)+4),1,3))+5)/7)","v":{"$error":"#REF!"}},{"$f":"#REF!&INT((DD26-DATE(YEAR(DD26-WEEKDAY(DD26-1)+4),1,3)+WEEKDAY(DATE(YEAR(DD26-WEEKDAY(DD26-1)+4),1,3))+5)/7)","v":{"$error":"#REF!"}},{"$f":"#REF!&INT((DE26-DATE(YEAR(DE26-WEEKDAY(DE26-1)+4),1,3)+WEEKDAY(DATE(YEAR(DE26-WEEKDAY(DE26-1)+4),1,3))+5)/7)","v":{"$error":"#REF!"}},{"$f":"#REF!&INT((DF26-DATE(YEAR(DF26-WEEKDAY(DF26-1)+4),1,3)+WEEKDAY(DATE(YEAR(DF26-WEEKDAY(DF26-1)+4),1,3))+5)/7)","v":{"$error":"#REF!"}},{"$f":"#REF!&INT((DG26-DATE(YEAR(DG26-WEEKDAY(DG26-1)+4),1,3)+WEEKDAY(DATE(YEAR(DG26-WEEKDAY(DG26-1)+4),1,3))+5)/7)","v":{"$error":"#REF!"}},{"$f":"#REF!&INT((DH26-DATE(YEAR(DH26-WEEKDAY(DH26-1)+4),1,3)+WEEKDAY(DATE(YEAR(DH26-WEEKDAY(DH26-1)+4),1,3))+5)/7)","v":{"$error":"#REF!"}},{"$f":"#REF!&INT((DI26-DATE(YEAR(DI26-WEEKDAY(DI26-1)+4),1,3)+WEEKDAY(DATE(YEAR(DI26-WEEKDAY(DI26-1)+4),1,3))+5)/7)","v":{"$error":"#REF!"}},{"$f":"#REF!&INT((DJ26-DATE(YEAR(DJ26-WEEKDAY(DJ26-1)+4),1,3)+WEEKDAY(DATE(YEAR(DJ26-WEEKDAY(DJ26-1)+4),1,3))+5)/7)","v":{"$error":"#REF!"}},{"$f":"#REF!&INT((DK26-DATE(YEAR(DK26-WEEKDAY(DK26-1)+4),1,3)+WEEKDAY(DATE(YEAR(DK26-WEEKDAY(DK26-1)+4),1,3))+5)/7)","v":{"$error":"#REF!"}},{"$f":"#REF!&INT((DL26-DATE(YEAR(DL26-WEEKDAY(DL26-1)+4),1,3)+WEEKDAY(DATE(YEAR(DL26-WEEKDAY(DL26-1)+4),1,3))+5)/7)","v":{"$error":"#REF!"}},{"$f":"#REF!&INT((DM26-DATE(YEAR(DM26-WEEKDAY(DM26-1)+4),1,3)+WEEKDAY(DATE(YEAR(DM26-WEEKDAY(DM26-1)+4),1,3))+5)/7)","v":{"$error":"#REF!"}},{"$f":"#REF!&INT((DN26-DATE(YEAR(DN26-WEEKDAY(DN26-1)+4),1,3)+WEEKDAY(DATE(YEAR(DN26-WEEKDAY(DN26-1)+4),1,3))+5)/7)","v":{"$error":"#REF!"}},{"$f":"#REF!&INT((DO26-DATE(YEAR(DO26-WEEKDAY(DO26-1)+4),1,3)+WEEKDAY(DATE(YEAR(DO26-WEEKDAY(DO26-1)+4),1,3))+5)/7)","v":{"$error":"#REF!"}},{"$f":"#REF!&INT((DP26-DATE(YEAR(DP26-WEEKDAY(DP26-1)+4),1,3)+WEEKDAY(DATE(YEAR(DP26-WEEKDAY(DP26-1)+4),1,3))+5)/7)","v":{"$error":"#REF!"}},{"$f":"#REF!&INT((DQ26-DATE(YEAR(DQ26-WEEKDAY(DQ26-1)+4),1,3)+WEEKDAY(DATE(YEAR(DQ26-WEEKDAY(DQ26-1)+4),1,3))+5)/7)","v":{"$error":"#REF!"}}]
[]
[null,null,null,null,null,null,null,null,null,null,null,null,null,null,null,null,null,null,null,null,null,null,null,null,null,null,null,null,null,null,null,{"$f":"IF(DAY(Z26)=2,Z26,\"\")","v":""}]
[]
[]
[null,{"$f":"$B$26","v":"2015-05-25T00:00:01"},{"$f":"$B$26","v":"2015-05-25T00:00:01"},"2015-05-25T00:00:01","2015-05-25T00:00:01","2015-05-25T00:00:01","2015-05-25T00:00:01","2015-05-25T00:00:01","2015-05-25T00:00:01","2015-05-25T00:00:01","2015-05-25T00:00:01","2015-05-25T00:00:01","2015-05-25T00:00:01","2015-05-25T00:00:01","2015-05-25T00:00:01","2015-05-25T00:00:01","2015-05-25T00:00:01","2015-05-25T00:00:01","2015-05-25T00:00:01","2015-05-25T00:00:01","2015-05-25T00:00:01","2015-05-25T00:00:01","2015-05-25T00:00:01","2015-05-25T00:00:01","2015-05-25T00:00:01"]
[null,{"$f":"TODAY()-WEEKDAY(TODAY())+2+\"00:00:01\"","v":"2015-05-25T00:00:01"},null,null,null,null,null,null,null,null,null,null,null,null,null,null,null,null,null,null,null,null,null,null,null,{"$f":"B26+1","v":"2015-05-26T00:00:01"},null,null,null,null,null,null,null,null,null,null,null,null,null,null,null,null,null,null,null,null,null,null,null,{"$f":"Z26+1","v":"2015-05-27T00:00:01"},null,null,null,null,null,null,null,null,null,null,null,null,null,null,null,null,null,null,null,null,null,null,null,{"$f":"AX26+1","v":"2015-05-28T00:00:01"},null,null,null,null,null,null,null,null,null,null,null,null,null,null,null,null,null,null,null,null,null,null,null,{"$f":"BV26+1","v":"2015-05-29T00:00:01"}]
[null,{"$f":"B26+\"04:00:00\"","v":42149.166678240741},{"$f":"B27+\"01:00:00\"","v":42149.208344907405},{"$f":"C27+\"01:00:00\"","v":42149.25001157407},{"$f":"D27+\"01:00:00\"","v":42149.291678240734},{"$f":"E27+\"01:00:00\"","v":42149.333344907398},42149.375011574062,42149.416678240726,42149.458344907391,42149.500011574055,42149.541678240719,42149.583344907383,42149.625011574048,42149.666678240712,42149.708344907376,42149.75001157404,42149.791678240705,42149.833344907369,42149.875011574033,42149.916678240697,42149.958344907362,42150.000011574026,42150.04167824069,42150.083344907354,42150.125011574019,{"$f":"Y27+\"01:00:00\"","v":42150.166678240683},42150.208344907347,42150.250011574011,42150.291678240676,42150.33334490734,42150.375011574004,42150.416678240668,42150.458344907333,42150.500011573997,42150.541678240661,42150.583344907325,42150.625011573989,42150.666678240654,42150.708344907318,42150.750011573982,42150.791678240646,42150.833344907311,42150.875011573975,42150.916678240639,42150.958344907303,42151.000011573968,42151.041678240632,42151.083344907296,42151.12501157396,42151.166678240625,42151.208344907289,42151.250011573953,42151.291678240617,42151.333344907282,42151.375011573946,42151.41667824061,42151.458344907274,42151.500011573939,42151.541678240603,42151.583344907267,42151.625011573931,42151.666678240596,42151.70834490726,42151.750011573924,42151.791678240588,42151.833344907252,42151.875011573917,42151.916678240581,42151.958344907245,{"$f":"BQ27+\"01:00:00\"","v":42152.000011573909},42152.041678240574,42152.083344907238,42152.125011573902,42152.166678240566,42152.208344907231,42152.250011573895,42152.291678240559,42152.333344907223,42152.375011573888,42152.416678240552,42152.458344907216,42152.50001157388,42152.541678240545,42152.583344907209,42152.625011573873,42152.666678240537,42152.708344907202,42152.750011573866,42152.79167824053,42152.833344907194,42152.875011573859,42152.916678240523,42152.958344907187,42153.000011573851,42153.041678240515,42153.08334490718,42153.125011573844,42153.166678240508,42153.208344907172,42153.250011573837,42153.291678240501,{"$f":"CW27+\"01:00:00\"","v":42153.333344907165},42153.375011573829,42153.416678240494,42153.458344907158,42153.500011573822,42153.541678240486,42153.583344907151,42153.625011573815,42153.666678240479,42153.708344907143,42153.750011573808,42153.791678240472,42153.833344907136,42153.8750115738,42153.916678240465,42153.958344907129,42154.000011573793,42154.041678240457,42154.083344907122,42154.125011573786]
["LIGNE  1"]
[]
["LIGNE 2"]
[]
["LIGNE 3"]
[]
["LIGNE 5"]
[]
["LIGNE 6"]
[]
["LIGNE 7"]
[]
["LIGNE8"]
[]
["LIGNE 9"]
[]
[]
[]
[]
[]
[]
[]
[]
[]
[]
[]
[]
[null,null,null,null,"SI(SOMMEPROD((Debut=R$27)*(LIGNE=$Q28*LIGNE(B27:B399)))=0;\"\";DECALER($C$1;SOMMEPROD(R$27)*(LIGNE=$Q$28)*(LIGNE(B27:B399))-1;0)&\"\"&DECALER($D$1;SOMMEPROD(debut=R$27)*(LIGNE=$Q28)*(LIGNE(B27:B399))-1;0)&\"\"&DECALER(($E$1;SOMMEPROD((debut=R$27)*(LIGNE=$Q28)*"]

{"sheet":"References","index":2,"n_rows":975,"n_cols":15,"rows_kept":975,"cut":false,"hidden":false,"merged":[]}
[58594,"A 1148 S IBC1200KG",null,58594,{"$f":"VLOOKUP(D1,A:B,2,0)","v":"A 1148 S IBC1200KG"}]
[58594,"A 1148 S IBC1200KG",null,21357,"C 3892 R K302 SP1250"]
[58594,"A 1148 S IBC1200KG",null,55964,"DGS 110 R V 6073 BB1000"]
[55986,"A0453 solvant IMP 164KG",null,null,{"$error":"#N/A"}]
[20183,"C 3023 R K407 OCT900",null,null,{"$error":"#N/A"}]
[21357,"C 3892 R K302 SP1250",null,null,{"$error":"#N/A"}]
[21357,"C 3892 R K302 SP1250",null,null,{"$error":"#N/A"}]
[50781,"CA 90 DE BK03 SP1250",null,null,{"$error":"#N/A"}]
["57963D3","DB BLANC CASSE BB1000",null,null,{"$error":"#N/A"}]
["55645D2","DGS 001 B4165 BB1000",null,null,{"$error":"#N/A"}]
[55964,"DGS 110 R V 6073 BB1000",null,null,{"$error":"#N/A"}]
[55964,"DGS 110 R V 6073 BB1000",null,null,{"$error":"#N/A"}]
["60053D4","DSE 6-09 D4270 BB750",null,null,{"$error":"#N/A"}]
["61547D5","DSE 6-17 A4508 BB750",null,null,{"$error":"#N/A"}]
[57423,"DSY 200/20 Z B78 A4329 BB750"]
[53902,"DSY 210/05 A4151 BB750"]
[53902,"DSY 210/05 A4151 BB750"]
[53290,"DSY 210/05 C4142 BB750"]
[53290,"DSY 210/05 C4142 BB750"]
[53290,"DSY 210/05 C4142 BB750"]
["53290D4","DSY 210/05 C4142 BB750"]
[41494,"DSY 258/26 3842G BB750/OCTMM C"]
[402257,"DSY 258/26 Schwarz3842G4 China"]
["402257D4","DSY 258/26 Schwarz3842G4 China"]
[46533,"DSY 258/76 A4109 BB750"]
[46533,"DSY 258/76 A4109 BB750"]
[46533,"DSY 258/76 A4109 BB750"]
["59897D4","DSY 258/76 A4109 BB750      HB"]
["59897D4","DSY 258/76 A4109 BB750      HB"]
["59897D4","DSY 258/76 A4109 BB750      HB"]
["55328D4","DSY 258/76 D4101 BB750"]
[51943,"DSY 260/02 4063C BB750/OCTMM C"]
["41036D5","DSY 260/02 A4060 BB750 W"]
[62246,"DSY 260/02 A4060 BB900"]
[62246,"DSY 260/02 A4060 BB900"]
[62246,"DSY 260/02 A4060 BB900"]
["59134D2","DSY 260/02 A4413 BB750/OCTMM"]
["59134D2","DSY 260/02 A4413 BB750/OCTMM"]
["60453D2","DSY 260/02 A4465 BB900"]
[54262,"DSY 260/02 B4060 BB750"]
["54262D4","DSY 260/02 B4060 BB750 W"]
[58168,"DSY 260/02 B4060 WOB BB750"]
[58168,"DSY 260/02 B4060 WOB BB750"]
[58168,"DSY 260/02 B4060 WOB BB750"]
[58168,"DSY 260/02 B4060 WOB BB750"]
[58168,"DSY 260/02 B4060 WOB BB750"]
[58168,"DSY 260/02 B4060 WOB BB750"]
[58168,"DSY 260/02 B4060 WOB BB750",null,null,null,null,"12 T ",null,null,"29/05/2015",null,null,null,null,"LIGNE 2 "]
[58168,"DSY 260/02 B4060 WOB BB750"]
[58168,"DSY 260/02 B4060 WOB BB750"]
[58168,"DSY 260/02 B4060 WOB BB750"]
[58168,"DSY 260/02 B4060 WOB BB750"]
["58168D3","DSY 260/02 B4060 WOB BB750"]
["58168D5","DSY 260/02 B4060 WOB BB750"]
["58168D5","DSY 260/02 B4060 WOB BB750"]
["57194D2","DSY 260/02 B4303 BB750"]
[59506,"DSY 260/02 B4413 BB750/OCTMM"]
[59506,"DSY 260/02 B4413 BB750/OCTMM"]
["60879D2","DSY 260/02 B4465 BB900"]
["61140D2","DSY 260/02 B4495 BB750/OCTMM"]
["61140D5","DSY 260/02 B4495 BB750/OCTMM"]
[50306,"DSY 260/02 C4142 BB750"]
[50306,"DSY 260/02 C4142 BB750"]
[61515,"DSY 260/02 C4465 BB900"]
[61515,"DSY 260/02 C4465 BB900"]
["61515D2","DSY 260/02 C4465 BB900"]
["61515D2","DSY 260/02 C4465 BB900"]
["61515D5","DSY 260/02 C4465 BB900"]
["61811D2","DSY 260/02 C4495 BB750/OCTMM"]
[59592,"DSY 260/02 D4303 BB750"]
[59592,"DSY 260/02 D4303 BB750"]
["59592D2","DSY 260/02 D4303 BB750"]
["59592D2","DSY 260/02 D4303 BB750"]
["59592D4","DSY 260/02 D4303 BB750"]
["59592D5","DSY 260/02 D4303 BB750"]
["59592D5","DSY 260/02 D4303 BB750"]
["62217D2","DSY 260/02 D4465 BB900"]
["62239D2","DSY 260/02 E4495 BB750/OCTMM"]
["62239D5","DSY 260/02 E4495 BB750/OCTMM"]
["62275D4","DSY 260/02 F4465 BB900"]
[62276,"DSY 260/02 F4495 BB750/OCTMM"]
["62276D2","DSY 260/02 F4495 BB750/OCTMM"]
[56772,"DSY 260/02 G3908 BB750/OCTMM"]
[56772,"DSY 260/02 G3908 BB750/OCTMM"]
[56772,"DSY 260/02 G3908 BB750/OCTMM"]
["56772D2","DSY 260/02 G3908 BB750/OCTMM"]
["56772D5","DSY 260/02 G3908 BB750/OCTMM"]
["59236D2","DSY 260/02 G4060 BB900"]
["59236D5","DSY 260/02 G4060 BB900"]
["59236D5","DSY 260/02 G4060 BB900"]
[61126,"DSY 260/02 I4060 BB900"]
[61126,"DSY 260/02 I4060 BB900"]
[61126,"DSY 260/02 I4060 BB900"]
[61126,"DSY 260/02 I4060 BB900"]
[61126,"DSY 260/02 I4060 BB900"]
[61126,"DSY 260/02 I4060 BB900"]
[61126,"DSY 260/02 I4060 BB900"]
[61126,"DSY 260/02 I4060 BB900"]
["61126D2","DSY 260/02 I4060 BB900"]
["60686D2","DSY 260/02 JFC A4479 BB750"]
[61789,"DSY 260/02 L3515 BB900/OCTMM"]
[60164,"DSY 260/02 MOD 716 F4304 BB750"]
["60164D2","DSY 260/02 MOD 716 F4304 BB750"]
["59053D2","DSY 260/02 MOD716 D4036 BB750"]
["59053D2","DSY 260/02 MOD716 D4036 BB750"]
["59053D2","DSY 260/02 MOD716 D4036 BB750"]
["59053D2","DSY 260/02 MOD716 D4036 BB750"]
[55113,"DSY 260/02 MOD716 D4077 BB750"]
["55113D2","DSY 260/02 MOD716 D4077 BB750"]
["55113D5","DSY 260/02 MOD716 D4077 BB750"]
["55113D5","DSY 260/02 MOD716 D4077 BB750"]
["55113D5","DSY 260/02 MOD716 D4077 BB750"]
["59662D4","DSY 260/02 MOD716 D4304 BB750"]
[55652,"DSY 260/02 MOD716 T4014 BB750"]
[55652,"DSY 260/02 MOD716 T4014 BB750"]
[55652,"DSY 260/02 MOD716 T4014 BB750"]
[55652,"DSY 260/02 MOD716 T4014 BB750"]
[55742,"DSY 260/02 MOD716KB M4037BB750"]
["55742D2","DSY 260/02 MOD716KB M4037BB750"]
["55742D4","DSY 260/02 MOD716KB M4037BB750"]
["55742D4","DSY 260/02 MOD716KB M4037BB750"]
["55742D5","DSY 260/02 MOD716KB M4037BB750"]
[62537,"DSY 260/02 MOD716repaint BB750"]
[61988,"DSY 260/02 Z MODLC B4448 BB750"]
["61988D2","DSY 260/02 Z MODLC B4448 BB750"]
["61988D4","DSY 260/02 Z MODLC B4448 BB750"]
["61988D4","DSY 260/02 Z MODLC B4448 BB750"]
["61988D4","DSY 260/02 Z MODLC B4448 BB750"]
["61988D4","DSY 260/02 Z MODLC B4448 BB750"]
["61988D4","DSY 260/02 Z MODLC B4448 BB750"]
["61988D5","DSY 260/02 Z MODLC B4448 BB750"]
["61988D5","DSY 260/02 Z MODLC B4448 BB750"]
[61989,"DSY 260/02 Z MODLC B4479 BB750"]
[61989,"DSY 260/02 Z MODLC B4479 BB750"]
[61989,"DSY 260/02 Z MODLC B4479 BB750"]
["61989D2","DSY 260/02 Z MODLC B4479 BB750"]
["61989D4","DSY 260/02 Z MODLC B4479 BB750"]
["61989D4","DSY 260/02 Z MODLC B4479 BB750"]
["61989D5","DSY 260/02 Z MODLC B4479 BB750"]
[62024,"DSY 260/05 A4563 BB750/OCTMM"]
["62024D1","DSY 260/05 A4563 BB750/OCTMM"]
["58374D2","DSY 300/15 E4347 BB750"]
["58374D4","DSY 300/15 E4347 BB750"]
["57579D2","DSY 300/15 MOD346 D4270 BB750"]
["57579D4","DSY 300/15 MOD346 D4270 BB750G"]
["57579D4","DSY 300/15 MOD346 D4270 BB750G"]
["57579D4","DSY 300/15 MOD346 D4270 BB750G"]
[61352,"DSY 400/02 A4265 BB750"]
[62195,"DSY 400/02 AU37x D4014 BB800 t"]
[62195,"DSY 400/02 AU37x D4014 BB800 t"]
[62195,"DSY 400/02 AU37x D4014 BB800 t"]
[62195,"DSY 400/02 AU37x D4014 BB800 t"]
[62195,"DSY 400/02 AU37x D4014 BB800 t"]
[59490,"DSY 400/02 B78 A4329 BB750"]
[60633,"DSY 400/02LE B4436 BB750"]
[60633,"DSY 400/02LE B4436 BB750"]
["60633D2","DSY 400/02LE B4436 BB750"]
[60328,"DSY 400/02LE B4437 BB750"]
["60328D4","DSY 400/02LE B4437 BB750"]
["60328D4","DSY 400/02LE B4437 BB750"]
["60328D4","DSY 400/02LE B4437 BB750"]
["60328D4","DSY 400/02LE B4437 BB750"]
["60328D5","DSY 400/02LE B4437 BB750"]
["60328D5","DSY 400/02LE B4437 BB750"]
["61047D5","DSY 400/02LE C4416 BB750"]
[61379,"DSY 400/02LE D4416 BB750"]
[61379,"DSY 400/02LE D4416 BB750"]
["61379D2","DSY 400/02LE D4416 BB750"]
[60275,"DSY 400/02LE E4374 BB750"]
["60275D4","DSY 400/02LE E4374 BB750"]
["60275D4","DSY 400/02LE E4374 BB750"]
["60275D4","DSY 400/02LE E4374 BB750"]
["60275D4","DSY 400/02LE E4374 BB750"]
["60275D5","DSY 400/02LE E4374 BB750"]
["60275D5","DSY 400/02LE E4374 BB750"]
["60275D5","DSY 400/02LE E4374 BB750"]
[60805,"DSY 400/02LE F45 B4458 BB750"]
[60805,"DSY 400/02LE F45 B4458 BB750"]
["60805D2","DSY 400/02LE F45 B4458 BB750"]
["60805D2","DSY 400/02LE F45 B4458 BB750"]
["60805D5","DSY 400/02LE F45 B4458 BB750"]
["60805D5","DSY 400/02LE F45 B4458 BB750"]
[61165,"DSY 400/02LE F45 C4456 BB750"]
[61165,"DSY 400/02LE F45 C4456 BB750"]
[61236,"DSY 400/02LE F45 J4457 BB750"]
[61236,"DSY 400/02LE F45 J4457 BB750"]
["61236D5","DSY 400/02LE F45 J4457 BB750"]
["62582D4","DSY 400/02LE F54 B4510 CA500"]
[59975,"DSY 400/02LE F56 A4415 BB750"]
[59975,"DSY 400/02LE F56 A4415 BB750"]
[59975,"DSY 400/02LE F56 A4415 BB750"]
[59975,"DSY 400/02LE F56 A4415 BB750"]
[59975,"DSY 400/02LE F56 A4415 BB750"]
[59975,"DSY 400/02LE F56 A4415 BB750"]
[59975,"DSY 400/02LE F56 A4415 BB750"]
[59975,"DSY 400/02LE F56 A4415 BB750"]
["59975D2","DSY 400/02LE F56 A4415 BB750"]
["59975D2","DSY 400/02LE F56 A4415 BB750"]
[62419,"DSY 400/02LEF45CN A4529 BB/OCT"]
[62419,"DSY 400/02LEF45CN A4529 BB/OCT"]
[62420,"DSY 400/02LEF45CN A4530 BB/OCT"]
["62420D4","DSY 400/02LEF45CN A4530 BB/OCT"]
["62420D4","DSY 400/02LEF45CN A4530 BB/OCT"]
[62421,"DSY 400/02LEF45CN A4531 BB/OCT"]
["62421D4","DSY 400/02LEF45CN A4531 BB/OCT"]
[62422,"DSY 400/02LEF45CN A4533 BB/OCT"]
["62422D4","DSY 400/02LEF45CN A4533 BB/OCT"]
["62422D4","DSY 400/02LEF45CN A4533 BB/OCT"]
[62374,"DSY 400/03 AU37x D4014 BB800 T"]
[62124,"DSY 400/05LE F56A4571 BB750"]
[62088,"E 5342/3 k99 BB1000"]
[61376,"E 5357/2 R15 BB1000"]
[61376,"E 5357/2 R15 BB1000"]
[62078,"E 5580/2 K99 BB1000"]
[62078,"E 5580/2 K99 BB1000"]
["57645D2","E 5614/6 G7037 OCT1000"]
[61213,"E 5623/2 T307 BB1000"]
[61915,"E 5623/2 T308 BB1000"]
[61557,"E 5623/2 V42 BB1000"]
[61485,"E 5793/2 Y32 BB1000"]
[62643,"E 5799 W9010"]
["62039D2","E 5862/2 G7001 BB1000"]
[57492,"EPB 31NT NOIR BB1100"]
["57492D1","EPB 31NT NOIR BB1100"]
["57492D1","EPB 31NT NOIR BB1100"]
["57492D5","EPB 31NT NOIR BB1100"]
["57492D5","EPB 31NT NOIR BB1100"]
[57899,"EPB 31NT NOIR CIT1100"]
[57899,"EPB 31NT NOIR CIT1100"]
[57899,"EPB 31NT NOIR CIT1100"]
[57899,"EPB 31NT NOIR CIT1100"]
[57899,"EPB 31NT NOIR CIT1100"]
["57899D1","EPB 31NT NOIR CIT1100"]
["57899D3","EPB 31NT NOIR CIT1100"]
["57899D3","EPB 31NT NOIR CIT1100"]
["57899D3","EPB 31NT NOIR CIT1100"]
["57899D3","EPB 31NT NOIR CIT1100"]
["57899D3","EPB 31NT NOIR CIT1100"]
["57899D5","EPB 31NT NOIR CIT1100"]
[57775,"EPB 31NT NOIR OCT1000 F"]
[57775,"EPB 31NT NOIR OCT1000 F"]
[57775,"EPB 31NT NOIR OCT1000 F"]
[57775,"EPB 31NT NOIR OCT1000 F"]
[57775,"EPB 31NT NOIR OCT1000 F"]
[57775,"EPB 31NT NOIR OCT1000 F"]
[57775,"EPB 31NT NOIR OCT1000 F"]
[57775,"EPB 31NT NOIR OCT1000 F"]
[57775,"EPB 31NT NOIR OCT1000 F"]
[57775,"EPB 31NT NOIR OCT1000 F"]
[57775,"EPB 31NT NOIR OCT1000 F"]
[57775,"EPB 31NT NOIR OCT1000 F"]
["57775D5","EPB 31NT NOIR OCT1000 F"]
[62672,"EPB 31NT NOIR OCT950"]
[62672,"EPB 31NT NOIR OCT950"]
[62672,"EPB 31NT NOIR OCT950"]
[62672,"EPB 31NT NOIR OCT950"]
[20649,"F 1454 1R K302 OCT950"]
[54740,"F 4004 1B G651 BB1000    Cougn"]
[54740,"F 4004 1B G651 BB1000    Cougn"]
[20005,"F 4004 1B G651 SS1250"]
[20195,"F 4004 1B K302 SS1250"]
[21097,"F 4004 1B M122 SS1250"]
[21097,"F 4004 1B M122 SS1250"]
[41296,"F 4004 1B M301 SS1250"]
[56742,"F 4004 1B M303 BB1000    Cougn"]
[56742,"F 4004 1B M303 BB1000    Cougn"]
[32219,"F 4004 1B W35 BB1000"]
[62577,"F 4004 1B W35 BB1000      AT1"]
[62577,"F 4004 1B W35 BB1000      AT1"]
[62577,"F 4004 1B W35 BB1000      AT1"]
["62577D2","F 4004 1B W35 BB1000      AT1"]
[54741,"F 4004 1B W35 BB1000     Cougn"]
[32126,"F 4004 1B W35 SS1250"]
[57348,"F 4004 1B Y45 SS1250"]
[57348,"F 4004 1B Y45 SS1250"]
[57348,"F 4004 1B Y45 SS1250"]
[59852,"F 4004 1C K302 BB1000"]
[59852,"F 4004 1C K302 BB1000"]
["62529D2","F 4004 3B M301 BB1000"]
[20190,"F 447 2R N302 OCT1000 F"]
[53711,"FA 65 DZ BK03 OCT900"]
[53711,"FA 65 DZ BK03 OCT900"]
["20061D2","FEG 601 R T100 SF1250"]
[59538,"FEG 801 1R T241 BB1000"]
[59538,"FEG 801 1R T241 BB1000"]
[47297,"FEH 901 R K212 SP1125 F"]
[47297,"FEH 901 R K212 SP1125 F"]
[47297,"FEH 901 R K212 SP1125 F"]
[61558,"FEJ 803 2R W55 BB1000"]
["62532D2","FES 604 4R K99 OCT1000"]
[56599,"FES 702 4R T108 BB1000"]
[61577,"FES 707 2R T108 SP1250"]
[61577,"FES 707 2R T108 SP1250"]
[60065,"FES 708 2R T100 BB1000"]
[54819,"FES 803 1R R115 BB1000"]
[53582,"FES 803 1R T100 OCT1000"]
[53582,"FES 803 1R T100 OCT1000"]
["56600D2","FES 804 R N OCT1000"]
[61939,"FES 815 1R N SP1250"]
[62268,"FES 852 10R K99 BB1000"]
[62268,"FES 852 10R K99 BB1000"]
[58760,"FES 852 3R K99 BB1000"]
[58760,"FES 852 3R K99 BB1000"]
[58760,"FES 852 3R K99 BB1000"]
[60063,"FES 875 R K99 BB1000"]
[60063,"FES 875 R K99 BB1000"]
[62628,"FES 901 1R T202 SP1250"]
["61349D1","FES 901 R T202 SP1250"]
[50205,"FES 914 1R K212 SP1125 F"]
[50205,"FES 914 1R K212 SP1125 F"]
[501075,"FFJ 807 L W132 SPE1200"]
[501118,"FFJ 809 L W100 BB1000"]
[62235,"FFS 803R G651 CA500"]
[53891,"FGS 002 1R G9090 BB1000"]
[53893,"FGS 002 1R V125 BB1000"]
[60798,"FGS 005 5R G7037 OCT1000"]
[60798,"FGS 005 5R G7037 OCT1000"]
["60798D1","FGS 005 5R G7037 OCT1000"]
["60798D1","FGS 005 5R G7037 OCT1000"]
[53029,"FGS 005 5R V73 BB1000"]
[53138,"FGS 905 1R V73 BB1000"]
["51260D3","FH 52C WO 194 CIT (1000)"]
[60436,"Filler 203A SP25"]
["38695D2","FKC 930 1R G318 OCT1200"]
["38695D2","FKC 930 1R G318 OCT1200"]
["38695D2","FKC 930 1R G318 OCT1200"]
[57592,"FKF 925 R G385 OCT1100"]
[55635,"FKH 001R N OCT950"]
[55635,"FKH 001R N OCT950"]
[55635,"FKH 001R N OCT950"]
["55635D3","FKH 001R N OCT950"]
[38942,"FKH 701 1R N BB1000"]
[55857,"FKH 805 1R K203 BB1100"]
[55857,"FKH 805 1R K203 BB1100"]
[55857,"FKH 805 1R K203 BB1100"]
[55857,"FKH 805 1R K203 BB1100"]
[39533,"FKH 825R K203 BB1100"]
[62289,"FKH 825R R2003 OCT1000"]
[62504,"FKH 880R N BB1000"]
[38856,"FKH 901 1L N BB1000"]
[38856,"FKH 901 1L N BB1000"]
[39197,"FKH 905 1R N OCT1200"]
[39197,"FKH 905 1R N OCT1200"]
[50478,"FKH 908 1R N CIT (1100)"]
[50478,"FKH 908 1R N CIT (1100)"]
[50478,"FKH 908 1R N CIT (1100)"]
[50478,"FKH 908 1R N CIT (1100)"]
[50478,"FKH 908 1R N CIT (1100)"]
[50478,"FKH 908 1R N CIT (1100)"]
[50478,"FKH 908 1R N CIT (1100)"]
[50478,"FKH 908 1R N CIT (1100)"]
[50478,"FKH 908 1R N CIT (1100)"]
[59864,"FKH 908 1R N OCT1000"]
[49267,"FKH 942 3R N BB1000"]
["28287D2","FKH 955 R N OCT1100"]
[28505,"FKH 960 R N BB1000"]
[61979,"FKH 965R N BB1100"]
[61979,"FKH 965R N BB1100"]
[61979,"FKH 965R N BB1100"]
["61979D3","FKH 965R N BB1100"]
[25501,"FKH 981 R N BB1000"]
[33122,"FKH 983 R N BB1000"]
[33122,"FKH 983 R N BB1000"]
[33122,"FKH 983 R N BB1000"]
[31996,"FKN 801 1R G10 OCT1100"]
[31996,"FKN 801 1R G10 OCT1100"]
[52320,"FKR 820 4R G7001 CIT1100"]
[52320,"FKR 820 4R G7001 CIT1100"]
[52320,"FKR 820 4R G7001 CIT1100"]
[52320,"FKR 820 4R G7001 CIT1100"]
[60864,"FKS 802 3R N BB1000"]
[60864,"FKS 802 3R N BB1000"]
[61724,"FKS 826 3R K211 OCT1000"]
[61035,"FKS 951 4R N OCT1200"]
[58915,"FLDCW818Y BB1000"]
["58915D5","FLDCW818Y BB1000"]
[62399,"FMA 642 1R T100 OCT1000"]
[43634,"FMA 703 R T100 BB1000"]
[55285,"FMS 773 1R N BB1000"]
[55285,"FMS 773 1R N BB1000"]
["39355D2","FQJ 602 R N SN1250"]
[44448,"FQJ 702 R Y56"]
[49442,"FQJ 903 R N SN1250 F"]
[62685,"FQS 617 1R N OCT1000"]
[60815,"FQS 707 R K309 BB1000"]
[41583,"FQS 903 R K211 SN1250 F"]
[61103,"FTA 503 3R G135 BB1000"]
[62501,"FTA 503 3R K212 BB1000"]
[62501,"FTA 503 3R K212 BB1000"]
[21094,"FTA 601 R V144 SF1250"]
[56640,"FTA 701 2R T108 OCT800"]
[56640,"FTA 701 2R T108 OCT800"]
[61980,"FTA 711 2R B23 BB1000"]
[61212,"FTA 711 2R G135 BB1000"]
[61212,"FTA 711 2R G135 BB1000"]
[61212,"FTA 711 2R G135 BB1000"]
[62642,"FTA 720 2R K212 BB1000"]
["62642D2","FTA 720 2R K212 BB1000"]
[55293,"FTA 812 2R T100 OCT800"]
[58957,"FTA 830 2R T202 BB1000"]
[58957,"FTA 830 2R T202 BB1000"]
[58957,"FTA 830 2R T202 BB1000"]
[58579,"FTM 801 R T17 OCT800"]
[43305,"FTR 710 R B 29 BB1000"]
[43305,"FTR 710 R B 29 BB1000"]
[62392,"FTS 502 2R K99 BB1000"]
[61472,"FTS 502 2R V130 BB1000"]
[61472,"FTS 502 2R V130 BB1000"]
[44900,"FTS 615 R K212 BB1000"]
[44899,"FTS 615 R M18 BB1000"]
[55779,"FTS 702 1R T100 BB1000"]
[59299,"FTS 702 4R T100 OCT1000"]
["61147D2","FTS 704 2R T100 OCT900"]
[61486,"FTS 713 2R Y12 BB1000"]
[61055,"FTS 719 R R18 BB1000"]
[61227,"FTS 804 2R T100"]
[61477,"FTS 806 1R V25 BB1000"]
[62278,"FTS 812R K99 BB1000"]
[59434,"FY 1139/2 W10 BB1000"]
[59434,"FY 1139/2 W10 BB1000"]
[58589,"FY 1178/2 W700 SP1250"]
[60003,"FY 1191/2 W120 SP1250"]
[60003,"FY 1191/2 W120 SP1250"]
[51257,"GAM 1 SP1000"]
[51257,"GAM 1 SP1000"]
[403628,"GFE 63A C 3 BB1000"]
[61637,"IMP 2S AU37x AC4503 (F30L)"]
[61637,"IMP 2S AU37x AC4503 (F30L)"]
[60578,"IMP 2S AU37x GF4342 FUT 30L"]
[60578,"IMP 2S AU37x GF4342 FUT 30L"]
[60576,"IMP 2S AU37x GM4362 FUT 30L"]
[60576,"IMP 2S AU37x GM4362 FUT 30L"]
[60047,"IMP 2S B78 CA4369 FUT 30L"]
[60047,"IMP 2S B78 CA4369 FUT 30L"]
[60047,"IMP 2S B78 CA4369 FUT 30L"]
[60043,"IMP 2S B78 CB4356 FUT 30L"]
[60043,"IMP 2S B78 CB4356 FUT 30L"]
[60043,"IMP 2S B78 CB4356 FUT 30L"]
["60043D5","IMP 2S B78 CB4356 FUT 30L"]
[60406,"IMP 2S B78 EA4368 FUT 30L"]
["60406D5","IMP 2S B78 EA4368 FUT 30L"]
["60406D5","IMP 2S B78 EA4368 FUT 30L"]
["60406D5","IMP 2S B78 EA4368 FUT 30L"]
["60406D5","IMP 2S B78 EA4368 FUT 30L"]
["60406D5","IMP 2S B78 EA4368 FUT 30L"]
["60406D5","IMP 2S B78 EA4368 FUT 30L"]
["60406D5","IMP 2S B78 EA4368 FUT 30L"]
[29456,"K 5063/3 G8 CIT"]
[55824,"K 5063/6 G8 BB1100"]
[55824,"K 5063/6 G8 BB1100"]
[57384,"K 5064 11N BB1100"]
[57384,"K 5064 11N BB1100"]
[27788,"K 5303 N OCT1100"]
[27788,"K 5303 N OCT1100"]
[56147,"K 5477/1 K211 BB1000"]
[60823,"K 5566/2 k212 OCT1200"]
["60821D3","K 5566/2 N OCT1200"]
["60821D3","K 5566/2 N OCT1200"]
[43708,"K 5669 N OCT1000"]
[58350,"K 5778/1 N OCT1100"]
[58350,"K 5778/1 N OCT1100"]
[62667,"K 5923 N OCT950"]
[58346,"K 5928 N OCT950"]
[58346,"K 5928 N OCT950"]
[58404,"K 5929 N OCT950"]
[58404,"K 5929 N OCT950"]
[58404,"K 5929 N OCT950"]
["58404D2","K 5929 N OCT950"]
[53508,"K5778 W N000 O1250 (RPG)"]
[45229,"KD 70 DN G38 OCT900"]
[45229,"KD 70 DN G38 OCT900"]
[60343,"KD 70 DN K302 OCT900"]
[60343,"KD 70 DN K302 OCT900"]
[60276,"KD 70 DN K303 OCT900"]
[62568,"KR 5701 N BB1000"]
[51329,"LACOVYL 103B CA325"]
[60304,"LACOVYL 201A CA325"]
[61244,"MB 11V CA200"]
["51300D5","MB 1B BB540/OCTMM"]
["51300D5","MB 1B BB540/OCTMM"]
["51300D5","MB 1B BB540/OCTMM"]
[51300,"MB 1B OCT500"]
[58821,"MB 2D OCT500"]
[55639,"MB 3C BB500/OCTPM"]
[55639,"MB 3C BB500/OCTPM"]
[55839,"MB 9B OCT500"]
[57349,"MB MOD346 OCT500"]
[57349,"MB MOD346 OCT500"]
[57349,"MB MOD346 OCT500"]
[58096,"MB2S IMP FUT"]
[58096,"MB2S IMP FUT"]
[59196,"MB2T1 IMP fut"]
[59196,"MB2T1 IMP fut"]
[59196,"MB2T1 IMP fut"]
[59196,"MB2T1 IMP fut"]
[59196,"MB2T1 IMP fut"]
[59196,"MB2T1 IMP fut"]
[59196,"MB2T1 IMP fut"]
[62475,"MM NUANCE BLANC P/TWG 494 V2"]
[59247,"MMS PEY 300C M 472 FLOWBIN"]
[59248,"MMS PEY 792 Y 220 FLOWBIN"]
[59251,"MMS PEY 795 G 343 FLOWBIN"]
[59251,"MMS PEY 795 G 343 FLOWBIN"]
[59231,"MMS PEY 795/817 Y220 FLOWBIN"]
[62025,"MMS RY 123 M 472 FLOWBIN"]
[59668,"MMS RY 783 Y 220 FLOWBIN"]
[2060,"MP  100"]
[58595,"MP 100 S IBC1200KG"]
[58595,"MP 100 S IBC1200KG"]
[58595,"MP 100 S IBC1200KG"]
[58595,"MP 100 S IBC1200KG"]
["60533D3","MPX 001 R BB500"]
["60533D3","MPX 001 R BB500"]
[60533,"MPX 001 R BB800"]
[60533,"MPX 001 R BB800"]
[60533,"MPX 001 R BB800"]
[59921,"MPX 001 R T202 CA312"]
["59921D3","MPX 001 R T202 CA312"]
["59921D5","MPX 001 R T202 CA312"]
["59921D5","MPX 001 R T202 CA312"]
["59921D5","MPX 001 R T202 CA312"]
[61191,"MPX 002 R T202 CA297"]
["61191D5","MPX 002 R T202 CA297"]
["61191D5","MPX 002 R T202 CA297"]
["61191D5","MPX 002 R T202 CA297"]
["61191D5","MPX 002 R T202 CA297"]
["61191D5","MPX 002 R T202 CA297"]
[40408,"P 32 NOIR SP1250"]
["44794D3","PA25 TRANSPARENT SP1250"]
[47720,"PA25 V 100 SP1125 F"]
[62425,"PB 31NT B450 OCT1000"]
[57493,"PB 31NT B450 SP1000"]
[57493,"PB 31NT B450 SP1000"]
[57493,"PB 31NT B450 SP1000"]
[57493,"PB 31NT B450 SP1000"]
["57493D2","PB 31NT B450 SP1000"]
["57493D2","PB 31NT B450 SP1000"]
[57750,"PB 31NT NATUREL SP1000"]
[57750,"PB 31NT NATUREL SP1000"]
[57750,"PB 31NT NATUREL SP1000"]
["57750D3","PB 31NT NATUREL SP1000"]
["57750D5","PB 31NT NATUREL SP1000"]
["57750D5","PB 31NT NATUREL SP1000"]
[62660,"PB 31NT O 300 OCT1000"]
[58394,"PB 31NT O 300 SP1000"]
[58394,"PB 31NT O 300 SP1000"]
[57607,"PB 31NT O100 SP1000"]
[57607,"PB 31NT O100 SP1000"]
[57607,"PB 31NT O100 SP1000"]
[57607,"PB 31NT O100 SP1000"]
[62429,"PB 31NT R187 OCT1000"]
[62429,"PB 31NT R187 OCT1000"]
[62429,"PB 31NT R187 OCT1000"]
[60497,"PB 31NT R187 SP1000"]
[60497,"PB 31NT R187 SP1000"]
[60497,"PB 31NT R187 SP1000"]
[60497,"PB 31NT R187 SP1000"]
[62428,"PB 31NT R400 OCT1000"]
[62428,"PB 31NT R400 OCT1000"]
[62428,"PB 31NT R400 OCT1000"]
[57495,"PB 31NT R400 SP1000"]
[57495,"PB 31NT R400 SP1000"]
[57495,"PB 31NT R400 SP1000"]
[61113,"PB 31NT V100 SP1000"]
[61113,"PB 31NT V100 SP1000"]
[62426,"PB 31NT W001 OCT1000"]
[57494,"PB 31NT W001 SP1000"]
[57494,"PB 31NT W001 SP1000"]
[57494,"PB 31NT W001 SP1000"]
[57494,"PB 31NT W001 SP1000"]
[57494,"PB 31NT W001 SP1000"]
[57494,"PB 31NT W001 SP1000"]
["57494D3","PB 31NT W001 SP1000"]
["57494D3","PB 31NT W001 SP1000"]
["57494D3","PB 31NT W001 SP1000"]
["57494D3","PB 31NT W001 SP1000"]
["57494D5","PB 31NT W001 SP1000"]
[62432,"PB 31NT Y154 OCT1000"]
[62432,"PB 31NT Y154 OCT1000"]
[57606,"PB 31NT Y154 SP1000"]
[57606,"PB 31NT Y154 SP1000"]
[62431,"PB31NT TRANSPARENT OCT1000"]
[62431,"PB31NT TRANSPARENT OCT1000"]
[62431,"PB31NT TRANSPARENT OCT1000"]
[62431,"PB31NT TRANSPARENT OCT1000"]
[57605,"PB31NT TRANSPARENT SP1000"]
[57605,"PB31NT TRANSPARENT SP1000"]
[57605,"PB31NT TRANSPARENT SP1000"]
["57605D1","PB31NT TRANSPARENT SP1000"]
["57605D1","PB31NT TRANSPARENT SP1000"]
["57605D1","PB31NT TRANSPARENT SP1000"]
["57605D1","PB31NT TRANSPARENT SP1000"]
["57605D3","PB31NT TRANSPARENT SP1000"]
["57605D3","PB31NT TRANSPARENT SP1000"]
["57605D3","PB31NT TRANSPARENT SP1000"]
["57605D3","PB31NT TRANSPARENT SP1000"]
["57605D3","PB31NT TRANSPARENT SP1000"]
["57605D3","PB31NT TRANSPARENT SP1000"]
["57605D3","PB31NT TRANSPARENT SP1000"]
["57605D3","PB31NT TRANSPARENT SP1000"]
["57605D5","PB31NT TRANSPARENT SP1000"]
["57605D5","PB31NT TRANSPARENT SP1000"]
["57605D5","PB31NT TRANSPARENT SP1000"]
["57605D5","PB31NT TRANSPARENT SP1000"]
[62430,"PB31NT V500 OCT1000"]
[62430,"PB31NT V500 OCT1000"]
[57604,"PB31NT V500 SP1000"]
[57604,"PB31NT V500 SP1000"]
[57604,"PB31NT V500 SP1000"]
[57604,"PB31NT V500 SP1000"]
["57604D5","PB31NT V500 SP1000"]
["57604D5","PB31NT V500 SP1000"]
["57604D5","PB31NT V500 SP1000"]
[50225,"PERCHLO1148*"]
["48992D2","PEY 300C M 304 BB1100"]
["48992D2","PEY 300C M 304 BB1100"]
["48992D2","PEY 300C M 304 BB1100"]
["48992D2","PEY 300C M 304 BB1100"]
["48992D2","PEY 300C M 304 BB1100"]
["48992D2","PEY 300C M 304 BB1100"]
["48992D2","PEY 300C M 304 BB1100"]
["48992D2","PEY 300C M 304 BB1100"]
["48992D5","PEY 300C M 304 BB1100"]
["48992D5","PEY 300C M 304 BB1100"]
["48992D5","PEY 300C M 304 BB1100"]
["48992D5","PEY 300C M 304 BB1100"]
["48992D5","PEY 300C M 304 BB1100"]
[57554,"PEY 300C M 304/3 BB1100"]
[57554,"PEY 300C M 304/3 BB1100"]
[57554,"PEY 300C M 304/3 BB1100"]
[57554,"PEY 300C M 304/3 BB1100"]
[57554,"PEY 300C M 304/3 BB1100"]
[57554,"PEY 300C M 304/3 BB1100"]
[57555,"PEY 300C M 304/4 BB1100"]
[42927,"PEY 300C M 472 BB1100"]
[42927,"PEY 300C M 472 BB1100"]
["42927D2","PEY 300C M 472 BB1100"]
["42927D2","PEY 300C M 472 BB1100"]
["42927D5","PEY 300C M 472 BB1100"]
[57046,"PEY 300C M 472/2 BB1000"]
[57046,"PEY 300C M 472/2 BB1000"]
[58936,"PEY 549 Y 220 BB1100"]
[61492,"PEY 758 G 266 BB1100"]
[60069,"PEY 792 Y 220 BB1100"]
["60069D2","PEY 792 Y 220 BB1100"]
["60069D3","PEY 792 Y 220 BB1100"]
["60069D5","PEY 792 Y 220 BB1100"]
["46941D2","PEY 792 Y 220 OCT1000"]
["46941D2","PEY 792 Y 220 OCT1000"]
[55361,"PEY 795 G 343/2 BB1100"]
[55361,"PEY 795 G 343/2 BB1100"]
["47618D5","PEY 795 Y 220 OCT1000"]
[46854,"PEY 795 Y 220/2 BB1100"]
["46854D2","PEY 795 Y 220/2 BB1100"]
["46854D5","PEY 795 Y 220/2 BB1100"]
["46939D2","PEY 795A Y220 OCT1000"]
["46939D2","PEY 795A Y220 OCT1000"]
[57644,"PEY 817 Y 220 BB1100"]
[57644,"PEY 817 Y 220 BB1100"]
[57644,"PEY 817 Y 220 BB1100"]
[57644,"PEY 817 Y 220 BB1100"]
["57644D5","PEY 817 Y 220 BB1100"]
[56030,"PEY 915 Y 220 OCT1000"]
[56030,"PEY 915 Y 220 OCT1000"]
[60543,"PFS 007R W70 BB500"]
[58221,"PM15NT Z CRISTAL SP1000"]
[62687,"PPZ 612 1R G986 BB1000"]
[58012,"PPZ 612R G986 BB1000"]
[58012,"PPZ 612R G986 BB1000"]
[58012,"PPZ 612R G986 BB1000"]
["58012D2","PPZ 612R G986 BB1000"]
["58012D3","PPZ 612R G986 BB1000"]
["58012D3","PPZ 612R G986 BB1000"]
["58012D3","PPZ 612R G986 BB1000"]
["58012D3","PPZ 612R G986 BB1000"]
[55719,"PY 1035 B230 BB800"]
["55719D5","PY 1035 B230 BB800"]
[51383,"Q 5836 K302 SP1250F"]
[51383,"Q 5836 K302 SP1250F"]
[51383,"Q 5836 K302 SP1250F"]
[60675,"RCV 470/038 BB500"]
[60237,"REY 002R K99 OCT1000 F"]
[61803,"REY 002R T100 SP1000"]
[61605,"REY 005R BO2935 SP1000"]
[61605,"REY 005R BO2935 SP1000"]
[61111,"REY 005R G878 SP1000"]
[61111,"REY 005R G878 SP1000"]
[61111,"REY 005R G878 SP1000"]
[61111,"REY 005R G878 SP1000"]
[61111,"REY 005R G878 SP1000"]
[61111,"REY 005R G878 SP1000"]
[61112,"REY 005R M1685 SP1000"]
[61112,"REY 005R M1685 SP1000"]
[61112,"REY 005R M1685 SP1000"]
[61112,"REY 005R M1685 SP1000"]
[62435,"REY 005R Y872 OCT1000"]
[61527,"REY 005R Y874 SP1000"]
[62427,"REY 005R Y875 OCT1000"]
[62427,"REY 005R Y875 OCT1000"]
["62427D2","REY 005R Y875 OCT1000"]
["62427D2","REY 005R Y875 OCT1000"]
[61657,"REY 005R Y875 SP1000"]
[62313,"REY 006R K99 BB1100"]
[62313,"REY 006R K99 BB1100"]
[62313,"REY 006R K99 BB1100"]
[62313,"REY 006R K99 BB1100"]
[62313,"REY 006R K99 BB1100"]
[62313,"REY 006R K99 BB1100"]
[62313,"REY 006R K99 BB1100"]
[60742,"REY 007R K99 BB1000"]
[61474,"REY 008R K99 OCT1000"]
[61630,"REY 009R K99 OCT1000"]
[61630,"REY 009R K99 OCT1000"]
[62700,"REY 030R K99 BB1100"]
[56263,"RIS 601L B150 BB1000         I"]
["52213D2","RIX 504L B 200 OCT1200"]
[58973,"RPS 603 W G935 P1375"]
[58973,"RPS 603 W G935 P1375"]
[58975,"RPS 603 W W125 P1375"]
[58975,"RPS 603 W W125 P1375"]
[58971,"RPS 612 W Z999 P1375"]
["58954D3","RPZ 620R W1251 OCT1000"]
[59714,"RPZ 620R W1251 SP1250"]
[58071,"RPZ 620R Y201 BB1000"]
[58972,"RPZ 658 W N000 P1375"]
[58972,"RPZ 658 W N000 P1375"]
["500920D3","RTS 501 L W052 SF1050"]
["60140D1","RTZ 620R K99 SP1250"]
["60140D2","RTZ 620R K99 SP1250"]
[58068,"RTZ 620R Y231 BB1000"]
[58068,"RTZ 620R Y231 BB1000"]
[58068,"RTZ 620R Y231 BB1000"]
[62485,"RTZ 625R K99 SP1250"]
["62485D1","RTZ 625R K99 SP1250"]
[47734,"RY 063 G 369 OCT1000"]
[57328,"RY 063 G 512 BB1200"]
["57328D5","RY 063 G 512 SP1375"]
[47733,"RY 123 M 472 BB1200"]
[47733,"RY 123 M 472 BB1200"]
[47733,"RY 123 M 472 BB1200"]
["47733D2","RY 123 M 472 BB1200"]
["47733D3","RY 123 M 472 BB1200"]
["47733D5","RY 123 M 472 BB1200"]
["47733D5","RY 123 M 472 BB1200"]
["47733D5","RY 123 M 472 BB1200"]
["47132D3","RY 123 Y 220 SP1250"]
["47132D5","RY 123 Y 220 SP1375"]
["47132D5","RY 123 Y 220 SP1375"]
[47132,"RY 123 Y 220 SP1400"]
["47132D2","RY 123 Y 220 SP1400"]
[59530,"RY 549 Y 220 BB1200"]
["59530D5","RY 549 Y 220 BB1200"]
["59530D5","RY 549 Y 220 BB1200"]
["59861D1","RY 758 G 266 BB1200"]
[57444,"RY 759 G 184 BB1000"]
[58690,"RY 783 G 343 BB1200"]
["58690D3","RY 783 G 343 BB1200"]
[58656,"RY 783 Y 220 BB1200"]
[58656,"RY 783 Y 220 BB1200"]
["58656D1","RY 783 Y 220 BB1200"]
["58656D5","RY 783 Y 220 BB1200"]
["58656D5","RY 783 Y 220 BB1200"]
["58656D5","RY 783 Y 220 BB1200"]
["58656D5","RY 783 Y 220 BB1200"]
[58773,"RY 783 Y 220 OCT1200 F"]
["58773D2","RY 783 Y 220 OCT1200 F"]
["58773D2","RY 783 Y 220 OCT1200 F"]
["58773D3","RY 783 Y 220 OCT1200 F"]
["58773D3","RY 783 Y 220 OCT1200 F"]
["58773D5","RY 783 Y 220 OCT1200 F"]
["58773D5","RY 783 Y 220 OCT1200 F"]
["57585D3","RY 783 Y 220 SP1400"]
[55570,"S 111 K9 OCT800"]
[41089,"S 111 K9 SS1250"]
[42727,"S 132 K302 SS1250"]
[57634,"S 153 N OCT1000 F"]
[50876,"S 153 N OCT950"]
[50876,"S 153 N OCT950"]
[50876,"S 153 N OCT950"]
[57669,"S 168 K302 BB1000"]
[59125,"S 206 K302 BB1000"]
[59125,"S 206 K302 BB1000"]
[59125,"S 206 K302 BB1000"]
[60432,"S 219 K302 OCT1000"]
[60349,"S 234 G500 SP1250"]
[62365,"S 251R K302 SP1250"]
[62365,"S 251R K302 SP1250"]
[62496,"S 252R k302 SP1250"]
[62496,"S 252R k302 SP1250"]
[62496,"S 252R k302 SP1250"]
[50846,"S158 BK03 SS1250"]
[50846,"S158 BK03 SS1250"]
[53120,"SJK 603 R K302 OCT1000  F"]
[20242,"SJK 603 R N OCT1000  F"]
[20242,"SJK 603 R N OCT1000  F"]
[52550,"SJL 609R G651 SS1250"]
[52550,"SJL 609R G651 SS1250"]
[52550,"SJL 609R G651 SS1250"]
[52626,"SJL 609R K302 SS1250"]
[52626,"SJL 609R K302 SS1250"]
[52307,"SJL 609R W35 BB1000"]
[52307,"SJL 609R W35 BB1000"]
[52307,"SJL 609R W35 BB1000"]
[58871,"SJL 610R G625 BB1000"]
[61487,"SJL 610R M250 BB1000"]
["41707D2","SKH 001R N OCT1000"]
[40487,"SQL 601R K302 BB800"]
[56618,"SQL 601R K302 OCT900"]
[56618,"SQL 601R K302 OCT900"]
[56618,"SQL 601R K302 OCT900"]
[61677,"SQL 701R K302 BB800"]
[61677,"SQL 701R K302 BB800"]
[61677,"SQL 701R K302 BB800"]
[28689,"SQS 502R K302 OCT950"]
[61664,"T 5757/2 W2 BB1000"]
[50461,"T 820 BB800"]
[50461,"T 820 BB800"]
[50461,"T 820 BB800"]
["50461D1","T 820 BB800"]
["50461D1","T 820 BB800"]
["50461D1","T 820 BB800"]
["50461D2","T 820 BB800"]
["50461D2","T 820 BB800"]
["50461D2","T 820 BB800"]
["50461D2","T 820 BB800"]
["50461D2","T 820 BB800"]
["50461D2","T 820 BB800"]
["50461D2","T 820 BB800"]
["50461D3","T 820 BB800"]
["50461D3","T 820 BB800"]
["50461D3","T 820 BB800"]
["50461D3","T 820 BB800"]
["50461D3","T 820 BB800"]
[61318,"TB4 BB500"]
[59923,"TCQ 001 CA500"]
[59710,"TEP 605R BB500"]
[59710,"TEP 605R BB500"]
["59710D5","TEP 605R BB500"]
["59710D5","TEP 605R BB500"]
[62659,"TFP 2219 SP400"]
[62361,"TFP 2803 SP400"]
[59005,"TIP 410R BB500"]
[60513,"TIP 411 BB500"]
["60609D5","TIP 411 PROD BB500"]
["60609D5","TIP 411 PROD BB500"]
["59732D3","TKG 001R BB500"]
["59732D3","TKG 001R BB500"]
["59732D5","TKG 001R BB500"]
["59732D5","TKG 001R BB500"]
["59732D5","TKG 001R BB500"]
["59734D5","TKG 005E BB500"]
["59734D5","TKG 005E BB500"]
["59734D5","TKG 005E BB500"]
["59734D5","TKG 005E BB500"]
["59734D5","TKG 005E BB500"]
[59734,"TKG 005E STANDARD BB500"]
[59734,"TKG 005E STANDARD BB500"]
[59734,"TKG 005E STANDARD BB500"]
[59734,"TKG 005E STANDARD BB500"]
[59734,"TKG 005E STANDARD BB500"]
[59734,"TKG 005E STANDARD BB500"]
[59734,"TKG 005E STANDARD BB500"]
[61925,"TKG 014 BB500PM"]
[61925,"TKG 014 BB500PM"]
[59733,"TKG 030B BB500"]
[59733,"TKG 030B BB500"]
["59733D5","TKG 030B BB500"]
["59733D5","TKG 030B BB500"]
[60696,"TKG 050R BB500"]
[60696,"TKG 050R BB500"]
[60696,"TKG 050R BB500"]
["60560D3","TKG 2001 BB500"]
[58507,"TKP 001R BB500"]
[58507,"TKP 001R BB500"]
[58507,"TKP 001R BB500"]
[58507,"TKP 001R BB500"]
[58507,"TKP 001R BB500"]
[58507,"TKP 001R BB500"]
[58507,"TKP 001R BB500"]
[58507,"TKP 001R BB500"]
["58507D5","TKP 001R BB500"]
["58507D5","TKP 001R BB500"]
[58439,"TKP 003B OCT300"]
[60504,"TKP 014 BB500"]
[58895,"TKP 030B OCT500"]
[58686,"TKP 050R BB500"]
[58686,"TKP 050R BB500"]
[58686,"TKP 050R BB500"]
["58686D3","TKP 050R BB500"]
[58896,"TKP 052B BB500"]
[58896,"TKP 052B BB500"]
[58310,"TKP 110 CA500"]
[59960,"TKP 2001 BB500"]
[59960,"TKP 2001 BB500"]
["59960D5","TKP 2001 BB500"]
[60951,"TKP 2055 BB500"]
[60951,"TKP 2055 BB500"]
[60951,"TKP 2055 BB500"]
[58899,"TMP 202 BB500"]
[62362,"TMP 2202 BB500"]
["60129D5","TQP 601 PROD BB500"]
[58687,"TQP 601R BB500"]
[58687,"TQP 601R BB500"]
[58687,"TQP 601R BB500"]
[58230,"TSP 708R CA500"]
[61845,"TSP 740 OCT500"]
[61845,"TSP 740 OCT500"]
[58508,"TSP 778R OCT600"]
[58508,"TSP 778R OCT600"]
[61611,"TTG 2414 BB500"]
[61611,"TTG 2414 BB500"]
[62405,"TTG 2414 SP525"]
[60296,"TTG 461 BB500"]
[60296,"TTG 461 BB500"]
["60296D5","TTG 461 BB500"]
["60296D5","TTG 461 BB500"]
["60296D5","TTG 461 BB500"]
[61918,"TTG 462 BB500PM"]
["61918D5","TTG 462 BB500PM"]
["61918D5","TTG 462 BB500PM"]
["61918D5","TTG 462 BB500PM"]
["61918D5","TTG 462 BB500PM"]
[61546,"TWG 2499 BB500"]
[60259,"TWG 480 BB500"]
[60259,"TWG 480 BB500"]
[60259,"TWG 480 BB500"]
["60259D5","TWG 480 BB500"]
["60259D5","TWG 480 BB500"]
["60259D5","TWG 480 BB500"]
["60259D5","TWG 480 BB500"]
["60259D5","TWG 480 BB500"]
["60259D5","TWG 480 BB500"]
[61926,"TWG 490 BB500PM"]
[61926,"TWG 490 BB500PM"]
["59735D5","TWG 492I BB500"]
["59735D5","TWG 492I BB500"]
[60059,"TWG 494 BB500"]
[60059,"TWG 494 BB500"]
[60059,"TWG 494 BB500"]
[60059,"TWG 494 BB500"]
[60059,"TWG 494 BB500"]
["60059D5","TWG 494 BB500"]
["60059D5","TWG 494 BB500"]
["60059D5","TWG 494 BB500"]
["60059D5","TWG 494 BB500"]
["60059D5","TWG 494 BB500"]
["60059D5","TWG 494 BB500"]
[60997,"TWG 495 BB500"]
[61545,"TWG 499 BB500"]
[61545,"TWG 499 BB500"]
[59328,"TWP 402I BB500"]
[59328,"TWP 402I BB500"]
[59328,"TWP 402I BB500"]
[59329,"TWP 492I BB500"]
[58894,"TWP 492I OCT500"]
[59473,"TWP 494 BB500"]
[56246,"V 100 K 302 SP1250           B"]
[42728,"V 62 K302 SP1250"]
[42728,"V 62 K302 SP1250"]
["42728D3","V 62 K302 SP1250"]
[61362,"VES 701R K10 SP1000"]
["54175D2","VQL 001R K304 OCT900"]
["54175D2","VQL 001R K304 OCT900"]
[52809,"VQL 001R K305 BB800"]
[52809,"VQL 001R K305 BB800"]
[52809,"VQL 001R K305 BB800"]
[52809,"VQL 001R K305 BB800"]
[56604,"VQL 001R K305 SP1250 F"]
[22836,"VQL 701 R K302 SF1250"]
[54081,"VQR 601 R T100 BB1000"]
["41717D2","VQS 801 R K101 OCT1200"]
["41717D2","VQS 801 R K101 OCT1200"]
[56808,"VQS 901 R K310 SF1250 F"]
[28073,"VYL 801R K302 OCT850"]
[57199,"Y 5795 K302 SP1000 F"]

{"sheet":"Feuil2","index":3,"n_rows":32,"n_cols":3,"rows_kept":32,"cut":false,"hidden":false,"merged":[]}
[]
["Janvier",1,2015]
["Février",2,2016]
["Mars",3,2017]
["Avril",4,2018]
["Mai",5,2019]
["Juin",6,2020]
["Juillet",7,2021]
["Aout",8,2022]
["Septembre",9,2023]
["Novembre",10,2024]
["Decembre",11,2025]
[null,12,2026]
[null,13,2027]
[null,14,2028]
[null,15,2029]
[null,16,2030]
[null,17,2031]
[null,18,2032]
[null,19,2033]
[null,20,2034]
[null,21,2035]
[null,22,2036]
[null,23,2037]
[null,24,2038]
[null,25,2039]
[null,26,2040]
[null,27,2041]
[null,28]
[null,29]
[null,30]
[null,31]