{"text_format":"1","workbook":"xlsx","n_sheets":2,"sheets":["2015","Mensuel"],"not_rendered":{"charts":0,"images":2,"macros":1,"external_links":0,"defined_names":0,"comments":1,"pivot_tables":0},"unopened":[],"bounds":{"document_bytes":16777216,"sheet_cells":100000,"rows_first":2000,"rows_last":500,"rows_between":2000,"halvings":0,"cell_chars":16384,"cell_head_chars":4096},"cells_cut":0,"cells_raw":0,"read":"whole","date_system":"1900"}

{"sheet":"2015","index":0,"n_rows":350,"n_cols":12,"rows_kept":350,"cut":false,"hidden":false,"merged":[[0,5,0,7],[1,5,1,6],[2,5,2,6],[3,5,3,6],[4,5,4,6],[5,5,5,6],[6,5,6,6],[0,8,1,8],[4,8,5,8]]}
[null,null,null,null,null,"Données totales cumulées",null,null,"V C A"]
[null,null,null,null,null,"Nombre de sorties :",null,{"$f":"COUNT(E10:E300)","v":6}]
[null,null,null,null,null,"Sorties club :",null,{"$f":"COUNTA(C10:C300)","v":0}]
[null,null,null,null,null,"Sorties extérieures :",null,{"$f":"COUNTA(D10:D350)","v":0}]
[null,null,null,null,null,"km :",null,{"$f":"SUM(F10:F350)","v":470},"Météociel"]
[null,null,null,null,null,"Temps :",null,{"$f":"IF(COUNT(G10:G350),SUM(G10:G350),\"\")","v":0.69387731481481474}]
[null,null,null,null,null,"Dénivelé :",null,{"$f":"SUM(I10:I350)","v":2700}]
[]
[null,null,"Club","Ext","Date sortie","Km","Temps","Moyenne","Dénivelé","A n n o t a t i o n s",null,"codage"]
[null,null,null,null,"2015-03-03",85,9.3333333333333338E-2,{"$f":"IF(G10<>0,F10/G10/24,\"\")","v":37.946428571428569},500,"Ptite baisse de régime vers le 66ème. 3ème derrière Bernard et Alain - Un peu de vent latéral sur le plateau des roches.",null,{"$f":"IF(E10=\"\",\"\",MONTH(E10)&\"_\"&SUMPRODUCT((MONTH($E$10:E10)=MONTH(E10))*1))","v":"3_1"}]
[null,null,null,null,"2015-03-04",40,6.25E-2,26.666666666666668,null,"Sortie tranquille le long de la Meuse - Beau temps",null,{"$f":"IF(E11=\"\",\"\",MONTH(E11)&\"_\"&SUMPRODUCT((MONTH($E$10:E11)=MONTH(E11))*1))","v":"3_2"}]
[null,null,null,null,"2015-03-07",50,5.9027777777777783E-2,35.294117647058819,null,"Grisou et frais",null,{"$f":"IF(E12=\"\",\"\",MONTH(E12)&\"_\"&SUMPRODUCT((MONTH($E$10:E12)=MONTH(E12))*1))","v":"3_3"}]
[null,null,null,null,"2015-04-20",60,6.9444444444444434E-2,36.000000000000007,null,"La ronde du muguet",null,{"$f":"IF(E13=\"\",\"\",MONTH(E13)&\"_\"&SUMPRODUCT((MONTH($E$10:E13)=MONTH(E13))*1))","v":"4_1"}]
[null,null,null,null,"2015-04-28",120,0.20989583333333331,23.821339950372209,1550,null,null,{"$f":"IF(E14=\"\",\"\",MONTH(E14)&\"_\"&SUMPRODUCT((MONTH($E$10:E14)=MONTH(E14))*1))","v":"4_2"}]
[null,null,null,null,"2015-05-05",115,0.1996759259259259,23.997217713888247,650,null,null,{"$f":"IF(E15=\"\",\"\",MONTH(E15)&\"_\"&SUMPRODUCT((MONTH($E$10:E15)=MONTH(E15))*1))","v":"5_1"}]
[null,null,null,null,null,null,null,"",null,null,null,{"$f":"IF(E16=\"\",\"\",MONTH(E16)&\"_\"&SUMPRODUCT((MONTH($E$10:E16)=MONTH(E16))*1))","v":""}]
[null,null,null,null,null,null,null,"",null,null,null,{"$f":"IF(E17=\"\",\"\",MONTH(E17)&\"_\"&SUMPRODUCT((MONTH($E$10:E17)=MONTH(E17))*1))","v":""}]
[null,null,null,null,null,null,null,"",null,null,null,{"$f":"IF(E18=\"\",\"\",MONTH(E18)&\"_\"&SUMPRODUCT((MONTH($E$10:E18)=MONTH(E18))*1))","v":""}]
[null,null,null,null,null,null,null,"",null,null,null,{"$f":"IF(E19=\"\",\"\",MONTH(E19)&\"_\"&SUMPRODUCT((MONTH($E$10:E19)=MONTH(E19))*1))","v":""}]
[null,null,null,null,null,null,null,"",null,null,null,{"$f":"IF(E20=\"\",\"\",MONTH(E20)&\"_\"&SUMPRODUCT((MONTH($E$10:E20)=MONTH(E20))*1))","v":""}]
[null,null,null,null,null,null,null,"",null,null,null,{"$f":"IF(E21=\"\",\"\",MONTH(E21)&\"_\"&SUMPRODUCT((MONTH($E$10:E21)=MONTH(E21))*1))","v":""}]
[null,null,null,null,null,null,null,"",null,null,null,{"$f":"IF(E22=\"\",\"\",MONTH(E22)&\"_\"&SUMPRODUCT((MONTH($E$10:E22)=MONTH(E22))*1))","v":""}]
[null,null,null,null,null,null,null,"",null,null,null,{"$f":"IF(E23=\"\",\"\",MONTH(E23)&\"_\"&SUMPRODUCT((MONTH($E$10:E23)=MONTH(E23))*1))","v":""}]
[null,null,null,null,null,null,null,"",null,null,null,{"$f":"IF(E24=\"\",\"\",MONTH(E24)&\"_\"&SUMPRODUCT((MONTH($E$10:E24)=MONTH(E24))*1))","v":""}]
[null,null,null,null,null,null,null,"",null,null,null,{"$f":"IF(E25=\"\",\"\",MONTH(E25)&\"_\"&SUMPRODUCT((MONTH($E$10:E25)=MONTH(E25))*1))","v":""}]
[null,null,null,null,null,null,null,"",null,null,null,{"$f":"IF(E26=\"\",\"\",MONTH(E26)&\"_\"&SUMPRODUCT((MONTH($E$10:E26)=MONTH(E26))*1))","v":""}]
[null,null,null,null,null,null,null,"",null,null,null,{"$f":"IF(E27=\"\",\"\",MONTH(E27)&\"_\"&SUMPRODUCT((MONTH($E$10:E27)=MONTH(E27))*1))","v":""}]
[null,null,null,null,null,null,null,"",null,null,null,{"$f":"IF(E28=\"\",\"\",MONTH(E28)&\"_\"&SUMPRODUCT((MONTH($E$10:E28)=MONTH(E28))*1))","v":""}]
[null,null,null,null,null,null,null,"",null,null,null,{"$f":"IF(E29=\"\",\"\",MONTH(E29)&\"_\"&SUMPRODUCT((MONTH($E$10:E29)=MONTH(E29))*1))","v":""}]
[null,null,null,null,null,null,null,"",null,null,null,{"$f":"IF(E30=\"\",\"\",MONTH(E30)&\"_\"&SUMPRODUCT((MONTH($E$10:E30)=MONTH(E30))*1))","v":""}]
{"$rows_left_out":321}
{"sheet":"Mensuel","index":1,"n_rows":150,"n_cols":8,"rows_kept":150,"cut":false,"hidden":false,"merged":[]}
[{"$f":"CHOOSE(B1,\"Janvier\",\"Février\",\"Mars\",\"Avril\",\"Mai\",\"Juin\",\"Juillet\",\"Aout\",\"Septembre\",\"Octobre\",\"Novembre\",\"Décembre\")","v":"Mars"},3,"entrer en B1 le numéro du mois cherché"]
[]
["Les cellules fusionnées de la feuille 2015 à partir de la colonne H ont été remplacées par une seulle colonne élargie (éviter les erreurs Excel)"]
["le système se sert du codage en colonne L de la feuille 2015 pour détecter le mois"]
["Pouer changer de :ois, entrer en B1 le N° du mois choisi"]
["il est aussi possible de créer 12 geuilles,en copiant celle-ci et en plaçant en b1 chaque numéro de mois"]
[]
[]
["Club","Ext","Date sortie","Km","Temps","Moyenne","Dénivelé","A n n o t a t i o n s"]
[{"$f":"IFERROR(INDEX('2015'!$C$10:$J$1000,MATCH($B$1&\"_\"&ROW()-9,'2015'!$L$10:$L$1000,0),1),\"\")","v":0},{"$f":"IFERROR(INDEX('2015'!$C$10:$J$1000,MATCH($B$1&\"_\"&ROW()-9,'2015'!$L$10:$L$1000,0),2),\"\")","v":0},{"$f":"IFERROR(INDEX('2015'!$C$10:$J$1000,MATCH($B$1&\"_\"&ROW()-9,'2015'!$L$10:$L$1000,0),3),\"\")","v":"2015-03-03"},{"$f":"IFERROR(INDEX('2015'!$C$10:$J$1000,MATCH($B$1&\"_\"&ROW()-9,'2015'!$L$10:$L$1000,0),4),\"\")","v":85},{"$f":"IFERROR(INDEX('2015'!$C$10:$J$1000,MATCH($B$1&\"_\"&ROW()-9,'2015'!$L$10:$L$1000,0),5),\"\")","v":9.3333333333333338E-2},{"$f":"IFERROR(ROUND(INDEX('2015'!$C$10:$J$1000,MATCH($B$1&\"_\"&ROW()-9,'2015'!$L$10:$L$1000,0),6),2),\"\")","v":37.950000000000003},{"$f":"IFERROR(INDEX('2015'!$C$10:$J$1000,MATCH($B$1&\"_\"&ROW()-9,'2015'!$L$10:$L$1000,0),7),\"\")","v":500},{"$f":"IFERROR(INDEX('2015'!$C$10:$J$1000,MATCH($B$1&\"_\"&ROW()-9,'2015'!$L$10:$L$1000,0),8),\"\")","v":"Ptite baisse de régime vers le 66ème. 3ème derrière Bernard et Alain - Un peu de vent latéral sur le plateau des roches."}]
[{"$f":"IFERROR(INDEX('2015'!$C$10:$J$1000,MATCH($B$1&\"_\"&ROW()-9,'2015'!$L$10:$L$1000,0),1),\"\")","v":0},{"$f":"IFERROR(INDEX('2015'!$C$10:$J$1000,MATCH($B$1&\"_\"&ROW()-9,'2015'!$L$10:$L$1000,0),2),\"\")","v":0},{"$f":"IFERROR(INDEX('2015'!$C$10:$J$1000,MATCH($B$1&\"_\"&ROW()-9,'2015'!$L$10:$L$1000,0),3),\"\")","v":"2015-03-04"},{"$f":"IFERROR(INDEX('2015'!$C$10:$J$1000,MATCH($B$1&\"_\"&ROW()-9,'2015'!$L$10:$L$1000,0),4),\"\")","v":40},{"$f":"IFERROR(INDEX('2015'!$C$10:$J$1000,MATCH($B$1&\"_\"&ROW()-9,'2015'!$L$10:$L$1000,0),5),\"\")","v":6.25E-2},{"$f":"IFERROR(ROUND(INDEX('2015'!$C$10:$J$1000,MATCH($B$1&\"_\"&ROW()-9,'2015'!$L$10:$L$1000,0),6),2),\"\")","v":26.67},{"$f":"IFERROR(INDEX('2015'!$C$10:$J$1000,MATCH($B$1&\"_\"&ROW()-9,'2015'!$L$10:$L$1000,0),7),\"\")","v":0},{"$f":"IFERROR(INDEX('2015'!$C$10:$J$1000,MATCH($B$1&\"_\"&ROW()-9,'2015'!$L$10:$L$1000,0),8),\"\")","v":"Sortie tranquille le long de la Meuse - Beau temps"}]
[{"$f":"IFERROR(INDEX('2015'!$C$10:$J$1000,MATCH($B$1&\"_\"&ROW()-9,'2015'!$L$10:$L$1000,0),1),\"\")","v":0},{"$f":"IFERROR(INDEX('2015'!$C$10:$J$1000,MATCH($B$1&\"_\"&ROW()-9,'2015'!$L$10:$L$1000,0),2),\"\")","v":0},{"$f":"IFERROR(INDEX('2015'!$C$10:$J$1000,MATCH($B$1&\"_\"&ROW()-9,'2015'!$L$10:$L$1000,0),3),\"\")","v":"2015-03-07"},{"$f":"IFERROR(INDEX('2015'!$C$10:$J$1000,MATCH($B$1&\"_\"&ROW()-9,'2015'!$L$10:$L$1000,0),4),\"\")","v":50},{"$f":"IFERROR(INDEX('2015'!$C$10:$J$1000,MATCH($B$1&\"_\"&ROW()-9,'2015'!$L$10:$L$1000,0),5),\"\")","v":5.9027777777777783E-2},{"$f":"IFERROR(ROUND(INDEX('2015'!$C$10:$J$1000,MATCH($B$1&\"_\"&ROW()-9,'2015'!$L$10:$L$1000,0),6),2),\"\")","v":35.29},{"$f":"IFERROR(INDEX('2015'!$C$10:$J$1000,MATCH($B$1&\"_\"&ROW()-9,'2015'!$L$10:$L$1000,0),7),\"\")","v":0},{"$f":"IFERROR(INDEX('2015'!$C$10:$J$1000,MATCH($B$1&\"_\"&ROW()-9,'2015'!$L$10:$L$1000,0),8),\"\")","v":"Grisou et frais"}]
[{"$f":"IFERROR(INDEX('2015'!$C$10:$J$1000,MATCH($B$1&\"_\"&ROW()-9,'2015'!$L$10:$L$1000,0),1),\"\")","v":""},{"$f":"IFERROR(INDEX('2015'!$C$10:$J$1000,MATCH($B$1&\"_\"&ROW()-9,'2015'!$L$10:$L$1000,0),2),\"\")","v":""},{"$f":"IFERROR(INDEX('2015'!$C$10:$J$1000,MATCH($B$1&\"_\"&ROW()-9,'2015'!$L$10:$L$1000,0),3),\"\")","v":""},{"$f":"IFERROR(INDEX('2015'!$C$10:$J$1000,MATCH($B$1&\"_\"&ROW()-9,'2015'!$L$10:$L$1000,0),4),\"\")","v":""},{"$f":"IFERROR(INDEX('2015'!$C$10:$J$1000,MATCH($B$1&\"_\"&ROW()-9,'2015'!$L$10:$L$1000,0),5),\"\")","v":""},{"$f":"IFERROR(ROUND(INDEX('2015'!$C$10:$J$1000,MATCH($B$1&\"_\"&ROW()-9,'2015'!$L$10:$L$1000,0),6),2),\"\")","v":""},{"$f":"IFERROR(INDEX('2015'!$C$10:$J$1000,MATCH($B$1&\"_\"&ROW()-9,'2015'!$L$10:$L$1000,0),7),\"\")","v":""},{"$f":"IFERROR(INDEX('2015'!$C$10:$J$1000,MATCH($B$1&\"_\"&ROW()-9,'2015'!$L$10:$L$1000,0),8),\"\")","v":""}]
[{"$f":"IFERROR(INDEX('2015'!$C$10:$J$1000,MATCH($B$1&\"_\"&ROW()-9,'2015'!$L$10:$L$1000,0),1),\"\")","v":""},{"$f":"IFERROR(INDEX('2015'!$C$10:$J$1000,MATCH($B$1&\"_\"&ROW()-9,'2015'!$L$10:$L$1000,0),2),\"\")","v":""},{"$f":"IFERROR(INDEX('2015'!$C$10:$J$1000,MATCH($B$1&\"_\"&ROW()-9,'2015'!$L$10:$L$1000,0),3),\"\")","v":""},{"$f":"IFERROR(INDEX('2015'!$C$10:$J$1000,MATCH($B$1&\"_\"&ROW()-9,'2015'!$L$10:$L$1000,0),4),\"\")","v":""},{"$f":"IFERROR(INDEX('2015'!$C$10:$J$1000,MATCH($B$1&\"_\"&ROW()-9,'2015'!$L$10:$L$1000,0),5),\"\")","v":""},{"$f":"IFERROR(ROUND(INDEX('2015'!$C$10:$J$1000,MATCH($B$1&\"_\"&ROW()-9,'2015'!$L$10:$L$1000,0),6),2),\"\")","v":""},{"$f":"IFERROR(INDEX('2015'!$C$10:$J$1000,MATCH($B$1&\"_\"&ROW()-9,'2015'!$L$10:$L$1000,0),7),\"\")","v":""},{"$f":"IFERROR(INDEX('2015'!$C$10:$J$1000,MATCH($B$1&\"_\"&ROW()-9,'2015'!$L$10:$L$1000,0),8),\"\")","v":""}]
[{"$f":"IFERROR(INDEX('2015'!$C$10:$J$1000,MATCH($B$1&\"_\"&ROW()-9,'2015'!$L$10:$L$1000,0),1),\"\")","v":""},{"$f":"IFERROR(INDEX('2015'!$C$10:$J$1000,MATCH($B$1&\"_\"&ROW()-9,'2015'!$L$10:$L$1000,0),2),\"\")","v":""},{"$f":"IFERROR(INDEX('2015'!$C$10:$J$1000,MATCH($B$1&\"_\"&ROW()-9,'2015'!$L$10:$L$1000,0),3),\"\")","v":""},{"$f":"IFERROR(INDEX('2015'!$C$10:$J$1000,MATCH($B$1&\"_\"&ROW()-9,'2015'!$L$10:$L$1000,0),4),\"\")","v":""},{"$f":"IFERROR(INDEX('2015'!$C$10:$J$1000,MATCH($B$1&\"_\"&ROW()-9,'2015'!$L$10:$L$1000,0),5),\"\")","v":""},{"$f":"IFERROR(ROUND(INDEX('2015'!$C$10:$J$1000,MATCH($B$1&\"_\"&ROW()-9,'2015'!$L$10:$L$1000,0),6),2),\"\")","v":""},{"$f":"IFERROR(INDEX('2015'!$C$10:$J$1000,MATCH($B$1&\"_\"&ROW()-9,'2015'!$L$10:$L$1000,0),7),\"\")","v":""},{"$f":"IFERROR(INDEX('2015'!$C$10:$J$1000,MATCH($B$1&\"_\"&ROW()-9,'2015'!$L$10:$L$1000,0),8),\"\")","v":""}]
[{"$f":"IFERROR(INDEX('2015'!$C$10:$J$1000,MATCH($B$1&\"_\"&ROW()-9,'2015'!$L$10:$L$1000,0),1),\"\")","v":""},{"$f":"IFERROR(INDEX('2015'!$C$10:$J$1000,MATCH($B$1&\"_\"&ROW()-9,'2015'!$L$10:$L$1000,0),2),\"\")","v":""},{"$f":"IFERROR(INDEX('2015'!$C$10:$J$1000,MATCH($B$1&\"_\"&ROW()-9,'2015'!$L$10:$L$1000,0),3),\"\")","v":""},{"$f":"IFERROR(INDEX('2015'!$C$10:$J$1000,MATCH($B$1&\"_\"&ROW()-9,'2015'!$L$10:$L$1000,0),4),\"\")","v":""},{"$f":"IFERROR(INDEX('2015'!$C$10:$J$1000,MATCH($B$1&\"_\"&ROW()-9,'2015'!$L$10:$L$1000,0),5),\"\")","v":""},{"$f":"IFERROR(ROUND(INDEX('2015'!$C$10:$J$1000,MATCH($B$1&\"_\"&ROW()-9,'2015'!$L$10:$L$1000,0),6),2),\"\")","v":""},{"$f":"IFERROR(INDEX('2015'!$C$10:$J$1000,MATCH($B$1&\"_\"&ROW()-9,'2015'!$L$10:$L$1000,0),7),\"\")","v":""},{"$f":"IFERROR(INDEX('2015'!$C$10:$J$1000,MATCH($B$1&\"_\"&ROW()-9,'2015'!$L$10:$L$1000,0),8),\"\")","v":""}]
[{"$f":"IFERROR(INDEX('2015'!$C$10:$J$1000,MATCH($B$1&\"_\"&ROW()-9,'2015'!$L$10:$L$1000,0),1),\"\")","v":""},{"$f":"IFERROR(INDEX('2015'!$C$10:$J$1000,MATCH($B$1&\"_\"&ROW()-9,'2015'!$L$10:$L$1000,0),2),\"\")","v":""},{"$f":"IFERROR(INDEX('2015'!$C$10:$J$1000,MATCH($B$1&\"_\"&ROW()-9,'2015'!$L$10:$L$1000,0),3),\"\")","v":""},{"$f":"IFERROR(INDEX('2015'!$C$10:$J$1000,MATCH($B$1&\"_\"&ROW()-9,'2015'!$L$10:$L$1000,0),4),\"\")","v":""},{"$f":"IFERROR(INDEX('2015'!$C$10:$J$1000,MATCH($B$1&\"_\"&ROW()-9,'2015'!$L$10:$L$1000,0),5),\"\")","v":""},{"$f":"IFERROR(ROUND(INDEX('2015'!$C$10:$J$1000,MATCH($B$1&\"_\"&ROW()-9,'2015'!$L$10:$L$1000,0),6),2),\"\")","v":""},{"$f":"IFERROR(INDEX('2015'!$C$10:$J$1000,MATCH($B$1&\"_\"&ROW()-9,'2015'!$L$10:$L$1000,0),7),\"\")","v":""},{"$f":"IFERROR(INDEX('2015'!$C$10:$J$1000,MATCH($B$1&\"_\"&ROW()-9,'2015'!$L$10:$L$1000,0),8),\"\")","v":""}]
[{"$f":"IFERROR(INDEX('2015'!$C$10:$J$1000,MATCH($B$1&\"_\"&ROW()-9,'2015'!$L$10:$L$1000,0),1),\"\")","v":""},{"$f":"IFERROR(INDEX('2015'!$C$10:$J$1000,MATCH($B$1&\"_\"&ROW()-9,'2015'!$L$10:$L$1000,0),2),\"\")","v":""},{"$f":"IFERROR(INDEX('2015'!$C$10:$J$1000,MATCH($B$1&\"_\"&ROW()-9,'2015'!$L$10:$L$1000,0),3),\"\")","v":""},{"$f":"IFERROR(INDEX('2015'!$C$10:$J$1000,MATCH($B$1&\"_\"&ROW()-9,'2015'!$L$10:$L$1000,0),4),\"\")","v":""},{"$f":"IFERROR(INDEX('2015'!$C$10:$J$1000,MATCH($B$1&\"_\"&ROW()-9,'2015'!$L$10:$L$1000,0),5),\"\")","v":""},{"$f":"IFERROR(ROUND(INDEX('2015'!$C$10:$J$1000,MATCH($B$1&\"_\"&ROW()-9,'2015'!$L$10:$L$1000,0),6),2),\"\")","v":""},{"$f":"IFERROR(INDEX('2015'!$C$10:$J$1000,MATCH($B$1&\"_\"&ROW()-9,'2015'!$L$10:$L$1000,0),7),\"\")","v":""},{"$f":"IFERROR(INDEX('2015'!$C$10:$J$1000,MATCH($B$1&\"_\"&ROW()-9,'2015'!$L$10:$L$1000,0),8),\"\")","v":""}]
[{"$f":"IFERROR(INDEX('2015'!$C$10:$J$1000,MATCH($B$1&\"_\"&ROW()-9,'2015'!$L$10:$L$1000,0),1),\"\")","v":""},{"$f":"IFERROR(INDEX('2015'!$C$10:$J$1000,MATCH($B$1&\"_\"&ROW()-9,'2015'!$L$10:$L$1000,0),2),\"\")","v":""},{"$f":"IFERROR(INDEX('2015'!$C$10:$J$1000,MATCH($B$1&\"_\"&ROW()-9,'2015'!$L$10:$L$1000,0),3),\"\")","v":""},{"$f":"IFERROR(INDEX('2015'!$C$10:$J$1000,MATCH($B$1&\"_\"&ROW()-9,'2015'!$L$10:$L$1000,0),4),\"\")","v":""},{"$f":"IFERROR(INDEX('2015'!$C$10:$J$1000,MATCH($B$1&\"_\"&ROW()-9,'2015'!$L$10:$L$1000,0),5),\"\")","v":""},{"$f":"IFERROR(ROUND(INDEX('2015'!$C$10:$J$1000,MATCH($B$1&\"_\"&ROW()-9,'2015'!$L$10:$L$1000,0),6),2),\"\")","v":""},{"$f":"IFERROR(INDEX('2015'!$C$10:$J$1000,MATCH($B$1&\"_\"&ROW()-9,'2015'!$L$10:$L$1000,0),7),\"\")","v":""},{"$f":"IFERROR(INDEX('2015'!$C$10:$J$1000,MATCH($B$1&\"_\"&ROW()-9,'2015'!$L$10:$L$1000,0),8),\"\")","v":""}]
[{"$f":"IFERROR(INDEX('2015'!$C$10:$J$1000,MATCH($B$1&\"_\"&ROW()-9,'2015'!$L$10:$L$1000,0),1),\"\")","v":""},{"$f":"IFERROR(INDEX('2015'!$C$10:$J$1000,MATCH($B$1&\"_\"&ROW()-9,'2015'!$L$10:$L$1000,0),2),\"\")","v":""},{"$f":"IFERROR(INDEX('2015'!$C$10:$J$1000,MATCH($B$1&\"_\"&ROW()-9,'2015'!$L$10:$L$1000,0),3),\"\")","v":""},{"$f":"IFERROR(INDEX('2015'!$C$10:$J$1000,MATCH($B$1&\"_\"&ROW()-9,'2015'!$L$10:$L$1000,0),4),\"\")","v":""},{"$f":"IFERROR(INDEX('2015'!$C$10:$J$1000,MATCH($B$1&\"_\"&ROW()-9,'2015'!$L$10:$L$1000,0),5),\"\")","v":""},{"$f":"IFERROR(ROUND(INDEX('2015'!$C$10:$J$1000,MATCH($B$1&\"_\"&ROW()-9,'2015'!$L$10:$L$1000,0),6),2),\"\")","v":""},{"$f":"IFERROR(INDEX('2015'!$C$10:$J$1000,MATCH($B$1&\"_\"&ROW()-9,'2015'!$L$10:$L$1000,0),7),\"\")","v":""},{"$f":"IFERROR(INDEX('2015'!$C$10:$J$1000,MATCH($B$1&\"_\"&ROW()-9,'2015'!$L$10:$L$1000,0),8),\"\")","v":""}]
[{"$f":"IFERROR(INDEX('2015'!$C$10:$J$1000,MATCH($B$1&\"_\"&ROW()-9,'2015'!$L$10:$L$1000,0),1),\"\")","v":""},{"$f":"IFERROR(INDEX('2015'!$C$10:$J$1000,MATCH($B$1&\"_\"&ROW()-9,'2015'!$L$10:$L$1000,0),2),\"\")","v":""},{"$f":"IFERROR(INDEX('2015'!$C$10:$J$1000,MATCH($B$1&\"_\"&ROW()-9,'2015'!$L$10:$L$1000,0),3),\"\")","v":""},{"$f":"IFERROR(INDEX('2015'!$C$10:$J$1000,MATCH($B$1&\"_\"&ROW()-9,'2015'!$L$10:$L$1000,0),4),\"\")","v":""},{"$f":"IFERROR(INDEX('2015'!$C$10:$J$1000,MATCH($B$1&\"_\"&ROW()-9,'2015'!$L$10:$L$1000,0),5),\"\")","v":""},{"$f":"IFERROR(ROUND(INDEX('2015'!$C$10:$J$1000,MATCH($B$1&\"_\"&ROW()-9,'2015'!$L$10:$L$1000,0),6),2),\"\")","v":""},{"$f":"IFERROR(INDEX('2015'!$C$10:$J$1000,MATCH($B$1&\"_\"&ROW()-9,'2015'!$L$10:$L$1000,0),7),\"\")","v":""},{"$f":"IFERROR(INDEX('2015'!$C$10:$J$1000,MATCH($B$1&\"_\"&ROW()-9,'2015'!$L$10:$L$1000,0),8),\"\")","v":""}]
[{"$f":"IFERROR(INDEX('2015'!$C$10:$J$1000,MATCH($B$1&\"_\"&ROW()-9,'2015'!$L$10:$L$1000,0),1),\"\")","v":""},{"$f":"IFERROR(INDEX('2015'!$C$10:$J$1000,MATCH($B$1&\"_\"&ROW()-9,'2015'!$L$10:$L$1000,0),2),\"\")","v":""},{"$f":"IFERROR(INDEX('2015'!$C$10:$J$1000,MATCH($B$1&\"_\"&ROW()-9,'2015'!$L$10:$L$1000,0),3),\"\")","v":""},{"$f":"IFERROR(INDEX('2015'!$C$10:$J$1000,MATCH($B$1&\"_\"&ROW()-9,'2015'!$L$10:$L$1000,0),4),\"\")","v":""},{"$f":"IFERROR(INDEX('2015'!$C$10:$J$1000,MATCH($B$1&\"_\"&ROW()-9,'2015'!$L$10:$L$1000,0),5),\"\")","v":""},{"$f":"IFERROR(ROUND(INDEX('2015'!$C$10:$J$1000,MATCH($B$1&\"_\"&ROW()-9,'2015'!$L$10:$L$1000,0),6),2),\"\")","v":""},{"$f":"IFERROR(INDEX('2015'!$C$10:$J$1000,MATCH($B$1&\"_\"&ROW()-9,'2015'!$L$10:$L$1000,0),7),\"\")","v":""},{"$f":"IFERROR(INDEX('2015'!$C$10:$J$1000,MATCH($B$1&\"_\"&ROW()-9,'2015'!$L$10:$L$1000,0),8),\"\")","v":""}]
[{"$f":"IFERROR(INDEX('2015'!$C$10:$J$1000,MATCH($B$1&\"_\"&ROW()-9,'2015'!$L$10:$L$1000,0),1),\"\")","v":""},{"$f":"IFERROR(INDEX('2015'!$C$10:$J$1000,MATCH($B$1&\"_\"&ROW()-9,'2015'!$L$10:$L$1000,0),2),\"\")","v":""},{"$f":"IFERROR(INDEX('2015'!$C$10:$J$1000,MATCH($B$1&\"_\"&ROW()-9,'2015'!$L$10:$L$1000,0),3),\"\")","v":""},{"$f":"IFERROR(INDEX('2015'!$C$10:$J$1000,MATCH($B$1&\"_\"&ROW()-9,'2015'!$L$10:$L$1000,0),4),\"\")","v":""},{"$f":"IFERROR(INDEX('2015'!$C$10:$J$1000,MATCH($B$1&\"_\"&ROW()-9,'2015'!$L$10:$L$1000,0),5),\"\")","v":""},{"$f":"IFERROR(ROUND(INDEX('2015'!$C$10:$J$1000,MATCH($B$1&\"_\"&ROW()-9,'2015'!$L$10:$L$1000,0),6),2),\"\")","v":""},{"$f":"IFERROR(INDEX('2015'!$C$10:$J$1000,MATCH($B$1&\"_\"&ROW()-9,'2015'!$L$10:$L$1000,0),7),\"\")","v":""},{"$f":"IFERROR(INDEX('2015'!$C$10:$J$1000,MATCH($B$1&\"_\"&ROW()-9,'2015'!$L$10:$L$1000,0),8),\"\")","v":""}]
[{"$f":"IFERROR(INDEX('2015'!$C$10:$J$1000,MATCH($B$1&\"_\"&ROW()-9,'2015'!$L$10:$L$1000,0),1),\"\")","v":""},{"$f":"IFERROR(INDEX('2015'!$C$10:$J$1000,MATCH($B$1&\"_\"&ROW()-9,'2015'!$L$10:$L$1000,0),2),\"\")","v":""},{"$f":"IFERROR(INDEX('2015'!$C$10:$J$1000,MATCH($B$1&\"_\"&ROW()-9,'2015'!$L$10:$L$1000,0),3),\"\")","v":""},{"$f":"IFERROR(INDEX('2015'!$C$10:$J$1000,MATCH($B$1&\"_\"&ROW()-9,'2015'!$L$10:$L$1000,0),4),\"\")","v":""},{"$f":"IFERROR(INDEX('2015'!$C$10:$J$1000,MATCH($B$1&\"_\"&ROW()-9,'2015'!$L$10:$L$1000,0),5),\"\")","v":""},{"$f":"IFERROR(ROUND(INDEX('2015'!$C$10:$J$1000,MATCH($B$1&\"_\"&ROW()-9,'2015'!$L$10:$L$1000,0),6),2),\"\")","v":""},{"$f":"IFERROR(INDEX('2015'!$C$10:$J$1000,MATCH($B$1&\"_\"&ROW()-9,'2015'!$L$10:$L$1000,0),7),\"\")","v":""},{"$f":"IFERROR(INDEX('2015'!$C$10:$J$1000,MATCH($B$1&\"_\"&ROW()-9,'2015'!$L$10:$L$1000,0),8),\"\")","v":""}]
[{"$f":"IFERROR(INDEX('2015'!$C$10:$J$1000,MATCH($B$1&\"_\"&ROW()-9,'2015'!$L$10:$L$1000,0),1),\"\")","v":""},{"$f":"IFERROR(INDEX('2015'!$C$10:$J$1000,MATCH($B$1&\"_\"&ROW()-9,'2015'!$L$10:$L$1000,0),2),\"\")","v":""},{"$f":"IFERROR(INDEX('2015'!$C$10:$J$1000,MATCH($B$1&\"_\"&ROW()-9,'2015'!$L$10:$L$1000,0),3),\"\")","v":""},{"$f":"IFERROR(INDEX('2015'!$C$10:$J$1000,MATCH($B$1&\"_\"&ROW()-9,'2015'!$L$10:$L$1000,0),4),\"\")","v":""},{"$f":"IFERROR(INDEX('2015'!$C$10:$J$1000,MATCH($B$1&\"_\"&ROW()-9,'2015'!$L$10:$L$1000,0),5),\"\")","v":""},{"$f":"IFERROR(ROUND(INDEX('2015'!$C$10:$J$1000,MATCH($B$1&\"_\"&ROW()-9,'2015'!$L$10:$L$1000,0),6),2),\"\")","v":""},{"$f":"IFERROR(INDEX('2015'!$C$10:$J$1000,MATCH($B$1&\"_\"&ROW()-9,'2015'!$L$10:$L$1000,0),7),\"\")","v":""},{"$f":"IFERROR(INDEX('2015'!$C$10:$J$1000,MATCH($B$1&\"_\"&ROW()-9,'2015'!$L$10:$L$1000,0),8),\"\")","v":""}]
[{"$f":"IFERROR(INDEX('2015'!$C$10:$J$1000,MATCH($B$1&\"_\"&ROW()-9,'2015'!$L$10:$L$1000,0),1),\"\")","v":""},{"$f":"IFERROR(INDEX('2015'!$C$10:$J$1000,MATCH($B$1&\"_\"&ROW()-9,'2015'!$L$10:$L$1000,0),2),\"\")","v":""},{"$f":"IFERROR(INDEX('2015'!$C$10:$J$1000,MATCH($B$1&\"_\"&ROW()-9,'2015'!$L$10:$L$1000,0),3),\"\")","v":""},{"$f":"IFERROR(INDEX('2015'!$C$10:$J$1000,MATCH($B$1&\"_\"&ROW()-9,'2015'!$L$10:$L$1000,0),4),\"\")","v":""},{"$f":"IFERROR(INDEX('2015'!$C$10:$J$1000,MATCH($B$1&\"_\"&ROW()-9,'2015'!$L$10:$L$1000,0),5),\"\")","v":""},{"$f":"IFERROR(ROUND(INDEX('2015'!$C$10:$J$1000,MATCH($B$1&\"_\"&ROW()-9,'2015'!$L$10:$L$1000,0),6),2),\"\")","v":""},{"$f":"IFERROR(INDEX('2015'!$C$10:$J$1000,MATCH($B$1&\"_\"&ROW()-9,'2015'!$L$10:$L$1000,0),7),\"\")","v":""},{"$f":"IFERROR(INDEX('2015'!$C$10:$J$1000,MATCH($B$1&\"_\"&ROW()-9,'2015'!$L$10:$L$1000,0),8),\"\")","v":""}]
[{"$f":"IFERROR(INDEX('2015'!$C$10:$J$1000,MATCH($B$1&\"_\"&ROW()-9,'2015'!$L$10:$L$1000,0),1),\"\")","v":""},{"$f":"IFERROR(INDEX('2015'!$C$10:$J$1000,MATCH($B$1&\"_\"&ROW()-9,'2015'!$L$10:$L$1000,0),2),\"\")","v":""},{"$f":"IFERROR(INDEX('2015'!$C$10:$J$1000,MATCH($B$1&\"_\"&ROW()-9,'2015'!$L$10:$L$1000,0),3),\"\")","v":""},{"$f":"IFERROR(INDEX('2015'!$C$10:$J$1000,MATCH($B$1&\"_\"&ROW()-9,'2015'!$L$10:$L$1000,0),4),\"\")","v":""},{"$f":"IFERROR(INDEX('2015'!$C$10:$J$1000,MATCH($B$1&\"_\"&ROW()-9,'2015'!$L$10:$L$1000,0),5),\"\")","v":""},{"$f":"IFERROR(ROUND(INDEX('2015'!$C$10:$J$1000,MATCH($B$1&\"_\"&ROW()-9,'2015'!$L$10:$L$1000,0),6),2),\"\")","v":""},{"$f":"IFERROR(INDEX('2015'!$C$10:$J$1000,MATCH($B$1&\"_\"&ROW()-9,'2015'!$L$10:$L$1000,0),7),\"\")","v":""},{"$f":"IFERROR(INDEX('2015'!$C$10:$J$1000,MATCH($B$1&\"_\"&ROW()-9,'2015'!$L$10:$L$1000,0),8),\"\")","v":""}]
[{"$f":"IFERROR(INDEX('2015'!$C$10:$J$1000,MATCH($B$1&\"_\"&ROW()-9,'2015'!$L$10:$L$1000,0),1),\"\")","v":""},{"$f":"IFERROR(INDEX('2015'!$C$10:$J$1000,MATCH($B$1&\"_\"&ROW()-9,'2015'!$L$10:$L$1000,0),2),\"\")","v":""},{"$f":"IFERROR(INDEX('2015'!$C$10:$J$1000,MATCH($B$1&\"_\"&ROW()-9,'2015'!$L$10:$L$1000,0),3),\"\")","v":""},{"$f":"IFERROR(INDEX('2015'!$C$10:$J$1000,MATCH($B$1&\"_\"&ROW()-9,'2015'!$L$10:$L$1000,0),4),\"\")","v":""},{"$f":"IFERROR(INDEX('2015'!$C$10:$J$1000,MATCH($B$1&\"_\"&ROW()-9,'2015'!$L$10:$L$1000,0),5),\"\")","v":""},{"$f":"IFERROR(ROUND(INDEX('2015'!$C$10:$J$1000,MATCH($B$1&\"_\"&ROW()-9,'2015'!$L$10:$L$1000,0),6),2),\"\")","v":""},{"$f":"IFERROR(INDEX('2015'!$C$10:$J$1000,MATCH($B$1&\"_\"&ROW()-9,'2015'!$L$10:$L$1000,0),7),\"\")","v":""},{"$f":"IFERROR(INDEX('2015'!$C$10:$J$1000,MATCH($B$1&\"_\"&ROW()-9,'2015'!$L$10:$L$1000,0),8),\"\")","v":""}]
[{"$f":"IFERROR(INDEX('2015'!$C$10:$J$1000,MATCH($B$1&\"_\"&ROW()-9,'2015'!$L$10:$L$1000,0),1),\"\")","v":""},{"$f":"IFERROR(INDEX('2015'!$C$10:$J$1000,MATCH($B$1&\"_\"&ROW()-9,'2015'!$L$10:$L$1000,0),2),\"\")","v":""},{"$f":"IFERROR(INDEX('2015'!$C$10:$J$1000,MATCH($B$1&\"_\"&ROW()-9,'2015'!$L$10:$L$1000,0),3),\"\")","v":""},{"$f":"IFERROR(INDEX('2015'!$C$10:$J$1000,MATCH($B$1&\"_\"&ROW()-9,'2015'!$L$10:$L$1000,0),4),\"\")","v":""},{"$f":"IFERROR(INDEX('2015'!$C$10:$J$1000,MATCH($B$1&\"_\"&ROW()-9,'2015'!$L$10:$L$1000,0),5),\"\")","v":""},{"$f":"IFERROR(ROUND(INDEX('2015'!$C$10:$J$1000,MATCH($B$1&\"_\"&ROW()-9,'2015'!$L$10:$L$1000,0),6),2),\"\")","v":""},{"$f":"IFERROR(INDEX('2015'!$C$10:$J$1000,MATCH($B$1&\"_\"&ROW()-9,'2015'!$L$10:$L$1000,0),7),\"\")","v":""},{"$f":"IFERROR(INDEX('2015'!$C$10:$J$1000,MATCH($B$1&\"_\"&ROW()-9,'2015'!$L$10:$L$1000,0),8),\"\")","v":""}]
[{"$f":"IFERROR(INDEX('2015'!$C$10:$J$1000,MATCH($B$1&\"_\"&ROW()-9,'2015'!$L$10:$L$1000,0),1),\"\")","v":""},{"$f":"IFERROR(INDEX('2015'!$C$10:$J$1000,MATCH($B$1&\"_\"&ROW()-9,'2015'!$L$10:$L$1000,0),2),\"\")","v":""},{"$f":"IFERROR(INDEX('2015'!$C$10:$J$1000,MATCH($B$1&\"_\"&ROW()-9,'2015'!$L$10:$L$1000,0),3),\"\")","v":""},{"$f":"IFERROR(INDEX('2015'!$C$10:$J$1000,MATCH($B$1&\"_\"&ROW()-9,'2015'!$L$10:$L$1000,0),4),\"\")","v":""},{"$f":"IFERROR(INDEX('2015'!$C$10:$J$1000,MATCH($B$1&\"_\"&ROW()-9,'2015'!$L$10:$L$1000,0),5),\"\")","v":""},{"$f":"IFERROR(ROUND(INDEX('2015'!$C$10:$J$1000,MATCH($B$1&\"_\"&ROW()-9,'2015'!$L$10:$L$1000,0),6),2),\"\")","v":""},{"$f":"IFERROR(INDEX('2015'!$C$10:$J$1000,MATCH($B$1&\"_\"&ROW()-9,'2015'!$L$10:$L$1000,0),7),\"\")","v":""},{"$f":"IFERROR(INDEX('2015'!$C$10:$J$1000,MATCH($B$1&\"_\"&ROW()-9,'2015'!$L$10:$L$1000,0),8),\"\")","v":""}]
{"$rows_left_out":120}