{"text_format":"1","workbook":"xlsx","n_sheets":6,"sheets":["SDPvierge","PrixMTX","xData","LISTE","Feuil2","Feuil3"],"not_rendered":{"charts":0,"images":0,"macros":1,"external_links":1,"defined_names":65,"comments":0,"pivot_tables":0},"unopened":[],"bounds":{"document_bytes":16777216,"sheet_cells":100000,"rows_first":2000,"rows_last":500,"rows_between":2000,"halvings":0,"cell_chars":16384,"cell_head_chars":4096},"cells_cut":0,"cells_raw":0,"read":"whole","date_system":"1900"}

{"sheet":"SDPvierge","index":0,"n_rows":52,"n_cols":28,"rows_kept":52,"cut":false,"hidden":false,"merged":[[25,16,25,18],[2,5,2,9],[3,5,3,9],[5,5,5,9],[7,5,7,9],[24,16,24,18],[27,16,27,17],[38,16,38,17],[44,16,44,17],[50,5,50,6],[57,4,57,15]]}
[null,null,null,null,null,null,null,null,null,null,null,null,null,null,null,null,null,null,null,"î\nCommandes"]
[]
[]
[]
[]
[]
[]
[]
[]
[]
[]
[]
[]
[]
[]
[]
[]
[]
["La formule en colonne J est simplifié (le code >SIERREUR évite de répéter la formule et existe depuis Excel 2007 et sert pour tous types de formules qui peut renvoyer une erreur"]
["La ligne 29 est dans ce cas utilisable"]
["Si la colonne E affiche A sélectionner en C"]
["sélectionner le libellé en C (cellule en bleu automatiquement)"]
["De la ligne 29 à la ligne 50 (voir code onglet)",null,null,null,{"$f":"\"BASE \"&L4","v":"BASE "}]
["L'entrée d'une valeur en B efface C"]
[null,null,null,null,"SOUS DETAIL DE PRIX POUR :",null,null,null,null,null,null,"Rendement :",1]
[null,null,null,"CODE","Désignation","Coef.","Densité /","Quantité","Unité","Déboursé","Déboursé","Déboursé","Déboursé","Contrôle"]
[null,null,null,null,null,"Pertes","Rendement",null,null,"unitaire","matériaux","matériel","main d'œuvre","Date MAJ"]
[null,null,null,null,"Matériaux",null,null,null,null,null,{"$f":"IF(D28=\"MTX\",H28*J28,\"\")","v":""},{"$f":"IF(D28=\"MTL\",#REF!*J28,\"\")","v":""},{"$f":"IF(D28=\"MO\",#REF!*J28,\"\")","v":""},{"$f":"IF(OR($D28=\"\",$E28=\"\"),\"\",IF(ISERROR(VLOOKUP($E28,PrixMTX,[1]PrixMTX!R$2,FALSE)),\"N/A\",VLOOKUP($E28,PrixMTX,[1]PrixMTX!R$2,FALSE)))","v":""}]
["BETON","Non_Livré",null,null,{"$f":"IF(OR(A29=\"\",B29=\"\"),\"\",IF(C29<>\"\",C29,IF(COUNTIFS(TCDcategorie,A29,TCDsousCat,B29)>1,\"à sélectionner en C\",INDEX(DesignationMTX,MATCH(A29&B29,TCDcategorie&TCDsousCat,0)))))","v":"à sélectionner en C"},null,null,null,null,{"$f":"IFERROR(VLOOKUP($E29,PrixMTX,PrixMTX!N$3,FALSE),\"0\")","v":"0"},"",null,{"$f":"IF(D29=\"MO\",I28*#REF!,\"\")","v":""},{"$f":"IF(OR($D29=\"\",$E29=\"\"),\"\",IF(ISERROR(VLOOKUP($E29,PrixMTX,[1]PrixMTX!R$2,FALSE)),\"N/A\",VLOOKUP($E29,PrixMTX,[1]PrixMTX!R$2,FALSE)))","v":""},null,null,null,null,null,null,null,null,null,null,null,null,{"$f":"IF(OR(A29=\"\",B29=\"\"),\"\",HLOOKUP(A29&B29,LISTE!$A$5:$Z$6,2,0))","v":"Cat2_"}]
["BETON","Livré","Béton+ PUMI complet (6 m3)","MTX",{"$f":"IF(OR(A30=\"\",B30=\"\"),\"\",IF(C30<>\"\",C30,IF(COUNTIFS(TCDcategorie,A30,TCDsousCat,B30)>1,\"à sélectionner en C\",INDEX(DesignationMTX,MATCH(A30&B30,TCDcategorie&TCDsousCat,0)))))","v":"Béton+ PUMI complet (6 m3)"},1,null,null,"m3",{"$f":"IFERROR(VLOOKUP($E30,PrixMTX,PrixMTX!N$3,FALSE),\"0\")","v":6},0,null,{"$f":"IF(D30=\"MO\",I29*#REF!,\"\")","v":""},{"$f":"IF(OR($D30=\"\",$E30=\"\"),\"\",IF(ISERROR(VLOOKUP($E30,PrixMTX,[1]PrixMTX!R$2,FALSE)),\"N/A\",VLOOKUP($E30,PrixMTX,[1]PrixMTX!R$2,FALSE)))","v":"2014-11-01"},null,null,null,null,null,null,null,null,null,null,null,null,{"$f":"IF(OR(A30=\"\",B30=\"\"),\"\",HLOOKUP(A30&B30,LISTE!$A$5:$Z$6,2,0))","v":"Cat1_"},{"$f":"IF(OR(A30=\"\",B30=\"\"),\"\",IF(COUNTIFS(TCDcategorie,A30,TCDsousCat,B30)>1,\"à sélectionner\",INDEX(DesignationMTX,MATCH(A30&B30,TCDcategorie&TCDsousCat,0))))","v":"à sélectionner"}]
{"$rows_left_out":23}
{"sheet":"PrixMTX","index":1,"n_rows":143,"n_cols":18,"rows_kept":143,"cut":false,"hidden":false,"merged":[[3,17,4,17],[0,0,0,2],[3,0,3,1],[3,2,3,10],[3,11,3,12],[3,13,3,14],[3,15,4,15],[3,16,4,16]]}
["MTX"]
[null,null,"PrixMTX"]
[null,null,1,2,3,4,5,6,7,8,9,10,11,12,13,14,15,16]
["Familles MTX",null,"Produits / Articles",null,null,null,null,null,null,null,null,"Conditionnement",null,"Unité de Base",null,"Fournisseurs","Commentaires","Date\nMAJ "]
["Catégorie MTX","Sous Cat. \nMTX","Désignation Matériaux","Détails","Longueur\n(cm)","largeur/\nDiam.\n(cm)","Haut./ép.\n(cm)","Poids\n(Kg)","Densité / \nRendmt","Unité","Autres","Prix HT","Unité Cdt","Prix HT Qté Base","Unité Base"]
["BETON","Livré","Béton+ PUMI complet (6 m3)",null,null,null,null,null,null,null,null,null,6,6,"/ m3","fournisseur 1",null,"2014-11-01"]
["BETON","Livré","Béton+ PUMI moitié (3 m3)",null,null,null,null,null,null,null,null,null,3,7,"/ m3","fournisseur 1",null,"2014-11-01"]
["BETON","Livré","Béton+TOUPIE complète (6 m3)",null,null,null,null,null,null,null,null,null,6,8,"/ m3","fournisseur 1",null,"2014-11-01"]
["BETON","Livré","Béton+TOUPIE moitié (3 m3)",null,null,null,null,null,null,null,null,null,3,9,"/ m3","fournisseur 1",null,"2014-11-01"]
["BETON","Non_Livré","Béton (à livrer toupie/pumi)",null,null,null,null,null,null,null,null,null,null,11,"/ m3","fournisseur 1",null,"2014-11-01"]
["BETON","Non_Livré","Béton (direct centrale) ",null,null,null,null,null,null,null,null,null,"/ 0,25 m3",12,"/ m3","fournisseur 1",null,"2014-11-01"]
["BETON","Non_Livré","Mortier",null,null,null,null,null,null,null,null,null,null,10,"/ m3","fournisseur 1",null,"2014-11-01"]
["BOIS","Structure","Grandes planches coffrage"]
["BOIS","Structure","Petites planches coffrage"]
["BOIS","Traverses","Traverses chêne 12x20x260 traité CL4",null,260,20,12,1000,1,"T/m3","/",null,"/ Unité",17,"/ Unité","fournisseur 2",null,"2014-11-01"]
["CLOTURES","Panneaux","Panneaux soudés 2,5x1,23m (anthracite)",null,250,null,123,null,null,null,null,null,null,28,"/ Unité","fournisseur 7",null,"dec-14"]
["CLOTURES","Panneaux","Poteau 1,3m (anthracite)",null,null,null,130,null,null,null,null,null,null,29,"/ Unité","fournisseur 7",null,"dec-14"]
["CLOTURES","Panneaux","support platine poteaux (anthracite)",null,null,null,null,null,null,null,null,null,null,30,"/ Unité","fournisseur 7",null,"dec-14"]
["ENGRAIS","Engrais Gazon","Engrais gazon",null,null,null,null,25,40,"g/m²",null,null,null,34,"/ Kg","prix moyen Fourn.",null,"2014-10-01"]
["GRAINES","Gazon","Graines gazon rustique",null,null,null,null,15,40,"g/m²",null,null,null,33,"/ Kg","prix moyen Fourn.",null,"2014-10-01"]
["METAL","Béton","Rond béton HA10",null,600,1,"/","/",7.85,"T/m3","/",null,"/ Unité",18,"/ ml","fournisseur 1",null,"2014-10-01"]
["METAL","Béton","Rond béton HA8",null,600,0.8,"/",{"$f":"(E22/100)*(PI()*((F22/100)*(F22/100))/4)*I22*1000","v":2.3675042237452679},7.85,"T/m3","/",null,"/ Unité",19,"/ ml","fournisseur 1",null,"2014-10-01"]
["PAVES","format1","Pavés Marlux Multiformats",null,null,null,null,null,null,null,null,null,null,21,"/ m²","fournisseur 3",null,"2014-11-01"]
["PAVES","format2","Pavés 15x15",null,15,15,"/","/","/","/","/",null,null,20,null,"fournisseur 3",null,"2014-11-01"]
["PIERRES","Galets","Galets blanc"]
["QUINCAILLERIE","Clous","Clous têtes plates (gros)",null,null,null,null,null,null,null,null,null,"/ Bte 100",27,"/ Unité"]
["RESEAUX","PVC","Tuyau PVC D100mm",null,"/",10,"/","/","/","/","/",null,null,24,null,null,null,"2014-11-01"]
["TOILES","Geotextile","Bidim geotextile PP 120 g/m²",null,"/","/","/","/",120,"g/m²","/",null,null,22,"/ m²","fournisseur 1",null,"2014-11-01"]
["TOILES","Hors_Sol","Toile Hors sol verte 130g/m²",null,"/","/","/","/",130,"g/m²","/",null,null,23,"/ m²","fournisseur 4",null,"2014-11-01"]
["TRANSPORT","Autres","Transport Participation forfaitaire",null,null,null,null,null,null,null,null,null,null,35,"/ Tour","prix moyen Fourn.",null,{"$f":"TODAY()","v":"2015-01-23"}]
{"$rows_left_out":114}
{"sheet":"xData","index":2,"n_rows":200,"n_cols":28,"rows_kept":200,"cut":false,"hidden":false,"merged":[]}
[]
[]
[null,null,null,null,null,null,null,null,null,null,null,null,null,null,null,null,null,null,null,null,null,null,null,null,null,null,"AA6:AA200 nommé Cod1","AA6:AA200 nommé Cod2"]
[]
[null,null,null,null,null,null,null,null,null,null,null,null,null,null,null,null,null,null,null,null,null,null,null,null,null,null,"codage désignation PrixMTX","Codage Titre Prix MTX"]
[null,null,null,null,null,null,null,null,null,null,null,null,null,null,null,null,null,null,null,null,null,null,null,null,null,null,{"$f":"IF(PrixMTX!A6=\"\",\"\",PrixMTX!A6&PrixMTX!B6&COUNTIFS(PrixMTX!$A$6:A6,PrixMTX!A6,PrixMTX!$B$6:B6,PrixMTX!B6))","v":"BETONLivré1"},{"$f":"IF(COUNTIFS(PrixMTX!$A$6:$A$200,PrixMTX!A6,PrixMTX!$B$6:$B$200,PrixMTX!B6)<2,\"\",IF(COUNTIFS(PrixMTX!$A7:$A$200,PrixMTX!$A6,PrixMTX!$B7:$B$200,PrixMTX!B6)>0,\"\",MAX($AB$5:AB5)+1))","v":""}]
[null,null,null,null,null,null,null,null,null,null,null,null,null,null,null,null,null,null,null,null,null,null,null,null,null,null,{"$f":"IF(PrixMTX!A7=\"\",\"\",PrixMTX!A7&PrixMTX!B7&COUNTIFS(PrixMTX!$A$6:A7,PrixMTX!A7,PrixMTX!$B$6:B7,PrixMTX!B7))","v":"BETONLivré2"},{"$f":"IF(COUNTIFS(PrixMTX!$A$6:$A$200,PrixMTX!A7,PrixMTX!$B$6:$B$200,PrixMTX!B7)<2,\"\",IF(COUNTIFS(PrixMTX!$A8:$A$200,PrixMTX!$A7,PrixMTX!$B8:$B$200,PrixMTX!B7)>0,\"\",MAX($AB$5:AB6)+1))","v":""}]
[null,null,null,null,null,null,null,null,null,null,null,null,null,null,null,null,null,null,null,null,null,null,null,null,null,null,{"$f":"IF(PrixMTX!A8=\"\",\"\",PrixMTX!A8&PrixMTX!B8&COUNTIFS(PrixMTX!$A$6:A8,PrixMTX!A8,PrixMTX!$B$6:B8,PrixMTX!B8))","v":"BETONLivré3"},{"$f":"IF(COUNTIFS(PrixMTX!$A$6:$A$200,PrixMTX!A8,PrixMTX!$B$6:$B$200,PrixMTX!B8)<2,\"\",IF(COUNTIFS(PrixMTX!$A9:$A$200,PrixMTX!$A8,PrixMTX!$B9:$B$200,PrixMTX!B8)>0,\"\",MAX($AB$5:AB7)+1))","v":""}]
[null,null,null,null,null,null,null,null,null,null,null,null,null,null,null,null,null,null,null,null,null,null,null,null,null,null,{"$f":"IF(PrixMTX!A9=\"\",\"\",PrixMTX!A9&PrixMTX!B9&COUNTIFS(PrixMTX!$A$6:A9,PrixMTX!A9,PrixMTX!$B$6:B9,PrixMTX!B9))","v":"BETONLivré4"},{"$f":"IF(COUNTIFS(PrixMTX!$A$6:$A$200,PrixMTX!A9,PrixMTX!$B$6:$B$200,PrixMTX!B9)<2,\"\",IF(COUNTIFS(PrixMTX!$A10:$A$200,PrixMTX!$A9,PrixMTX!$B10:$B$200,PrixMTX!B9)>0,\"\",MAX($AB$5:AB8)+1))","v":1}]
[null,null,null,null,null,null,null,null,null,null,null,null,null,null,null,null,null,null,null,null,null,null,null,null,null,null,{"$f":"IF(PrixMTX!A10=\"\",\"\",PrixMTX!A10&PrixMTX!B10&COUNTIFS(PrixMTX!$A$6:A10,PrixMTX!A10,PrixMTX!$B$6:B10,PrixMTX!B10))","v":"BETONNon_Livré1"},{"$f":"IF(COUNTIFS(PrixMTX!$A$6:$A$200,PrixMTX!A10,PrixMTX!$B$6:$B$200,PrixMTX!B10)<2,\"\",IF(COUNTIFS(PrixMTX!$A11:$A$200,PrixMTX!$A10,PrixMTX!$B11:$B$200,PrixMTX!B10)>0,\"\",MAX($AB$5:AB9)+1))","v":""}]
[null,null,null,null,"Nommer les nouveaux champs du nom de l'entrée en colonne G",null,null,null,null,null,null,null,null,null,null,null,null,null,null,null,null,null,null,null,null,null,{"$f":"IF(PrixMTX!A11=\"\",\"\",PrixMTX!A11&PrixMTX!B11&COUNTIFS(PrixMTX!$A$6:A11,PrixMTX!A11,PrixMTX!$B$6:B11,PrixMTX!B11))","v":"BETONNon_Livré2"},{"$f":"IF(COUNTIFS(PrixMTX!$A$6:$A$200,PrixMTX!A11,PrixMTX!$B$6:$B$200,PrixMTX!B11)<2,\"\",IF(COUNTIFS(PrixMTX!$A12:$A$200,PrixMTX!$A11,PrixMTX!$B12:$B$200,PrixMTX!B11)>0,\"\",MAX($AB$5:AB10)+1))","v":""}]
[null,null,null,null,"pour nommer:sélectionner la ligne incluant la cellule G et Ruban formule  Créer un nom colonne de gauhe",null,null,null,null,null,null,null,null,null,null,null,null,null,null,null,null,null,null,null,null,null,{"$f":"IF(PrixMTX!A12=\"\",\"\",PrixMTX!A12&PrixMTX!B12&COUNTIFS(PrixMTX!$A$6:A12,PrixMTX!A12,PrixMTX!$B$6:B12,PrixMTX!B12))","v":"BETONNon_Livré3"},{"$f":"IF(COUNTIFS(PrixMTX!$A$6:$A$200,PrixMTX!A12,PrixMTX!$B$6:$B$200,PrixMTX!B12)<2,\"\",IF(COUNTIFS(PrixMTX!$A13:$A$200,PrixMTX!$A12,PrixMTX!$B13:$B$200,PrixMTX!B12)>0,\"\",MAX($AB$5:AB11)+1))","v":2}]
[null,null,null,null,"valable sur plusieurs champs simultanément",null,null,null,null,null,null,null,null,null,null,null,null,null,null,null,null,null,null,null,null,null,{"$f":"IF(PrixMTX!A13=\"\",\"\",PrixMTX!A13&PrixMTX!B13&COUNTIFS(PrixMTX!$A$6:A13,PrixMTX!A13,PrixMTX!$B$6:B13,PrixMTX!B13))","v":"BOISStructure1"},{"$f":"IF(COUNTIFS(PrixMTX!$A$6:$A$200,PrixMTX!A13,PrixMTX!$B$6:$B$200,PrixMTX!B13)<2,\"\",IF(COUNTIFS(PrixMTX!$A14:$A$200,PrixMTX!$A13,PrixMTX!$B14:$B$200,PrixMTX!B13)>0,\"\",MAX($AB$5:AB12)+1))","v":""}]
[null,null,null,null,"laisser la colonne F vide pour que le menu déroulant s'affiche dans les cellules en début de liste",null,null,null,null,null,null,null,null,null,null,null,null,null,null,null,null,null,null,null,null,null,{"$f":"IF(PrixMTX!A14=\"\",\"\",PrixMTX!A14&PrixMTX!B14&COUNTIFS(PrixMTX!$A$6:A14,PrixMTX!A14,PrixMTX!$B$6:B14,PrixMTX!B14))","v":"BOISStructure2"},{"$f":"IF(COUNTIFS(PrixMTX!$A$6:$A$200,PrixMTX!A14,PrixMTX!$B$6:$B$200,PrixMTX!B14)<2,\"\",IF(COUNTIFS(PrixMTX!$A15:$A$200,PrixMTX!$A14,PrixMTX!$B15:$B$200,PrixMTX!B14)>0,\"\",MAX($AB$5:AB13)+1))","v":3}]
[null,null,null,null,"FOURNISSEURS",null,"Cat.MATERIAUX","N° Cat","Ss-Cat.MTX","Ss-Cat.mtx  2","Ss-Cat.mtx  3","Ss-Cat.mtx  4","Ss-Cat.mtx  5","Ss-Cat.mtx  6","Ss-Cat.mtx  7","Ss-Cat.mtx  8","Ss-Cat.mtx  9","Ss-Cat.mtx  10",null,null,null,null,null,null,null,null,{"$f":"IF(PrixMTX!A15=\"\",\"\",PrixMTX!A15&PrixMTX!B15&COUNTIFS(PrixMTX!$A$6:A15,PrixMTX!A15,PrixMTX!$B$6:B15,PrixMTX!B15))","v":"BOISTraverses1"},{"$f":"IF(COUNTIFS(PrixMTX!$A$6:$A$200,PrixMTX!A15,PrixMTX!$B$6:$B$200,PrixMTX!B15)<2,\"\",IF(COUNTIFS(PrixMTX!$A16:$A$200,PrixMTX!$A15,PrixMTX!$B16:$B$200,PrixMTX!B15)>0,\"\",MAX($AB$5:AB14)+1))","v":""}]
[null,null,null,null,"fournisseur 1",null,"BETON",null,"Livré","Non_Livré",null,null,null,null,null,null,null,null,null,null,null,null,null,null,null,null,{"$f":"IF(PrixMTX!A16=\"\",\"\",PrixMTX!A16&PrixMTX!B16&COUNTIFS(PrixMTX!$A$6:A16,PrixMTX!A16,PrixMTX!$B$6:B16,PrixMTX!B16))","v":"CLOTURESPanneaux1"},{"$f":"IF(COUNTIFS(PrixMTX!$A$6:$A$200,PrixMTX!A16,PrixMTX!$B$6:$B$200,PrixMTX!B16)<2,\"\",IF(COUNTIFS(PrixMTX!$A17:$A$200,PrixMTX!$A16,PrixMTX!$B17:$B$200,PrixMTX!B16)>0,\"\",MAX($AB$5:AB15)+1))","v":""}]
[null,null,null,null,"fournisseur 2",null,"BOIS",null,"Coffrage","Exotique","Structure","Traverses",null,null,null,null,null,null,null,null,null,null,null,null,null,null,{"$f":"IF(PrixMTX!A17=\"\",\"\",PrixMTX!A17&PrixMTX!B17&COUNTIFS(PrixMTX!$A$6:A17,PrixMTX!A17,PrixMTX!$B$6:B17,PrixMTX!B17))","v":"CLOTURESPanneaux2"},{"$f":"IF(COUNTIFS(PrixMTX!$A$6:$A$200,PrixMTX!A17,PrixMTX!$B$6:$B$200,PrixMTX!B17)<2,\"\",IF(COUNTIFS(PrixMTX!$A18:$A$200,PrixMTX!$A17,PrixMTX!$B18:$B$200,PrixMTX!B17)>0,\"\",MAX($AB$5:AB16)+1))","v":""}]
[null,null,null,null,"fournisseur 3",null,"CARRIERES",null,"Concassé","Sable","Gravette","Gore",null,null,null,null,null,null,null,null,null,null,null,null,null,null,{"$f":"IF(PrixMTX!A18=\"\",\"\",PrixMTX!A18&PrixMTX!B18&COUNTIFS(PrixMTX!$A$6:A18,PrixMTX!A18,PrixMTX!$B$6:B18,PrixMTX!B18))","v":"CLOTURESPanneaux3"},{"$f":"IF(COUNTIFS(PrixMTX!$A$6:$A$200,PrixMTX!A18,PrixMTX!$B$6:$B$200,PrixMTX!B18)<2,\"\",IF(COUNTIFS(PrixMTX!$A19:$A$200,PrixMTX!$A18,PrixMTX!$B19:$B$200,PrixMTX!B18)>0,\"\",MAX($AB$5:AB17)+1))","v":4}]
[null,null,null,null,"fournisseur 4",null,"CLOTURES",null,"Panneaux","Grillage",null,null,null,null,null,null,null,null,null,null,null,null,null,null,null,null,{"$f":"IF(PrixMTX!A19=\"\",\"\",PrixMTX!A19&PrixMTX!B19&COUNTIFS(PrixMTX!$A$6:A19,PrixMTX!A19,PrixMTX!$B$6:B19,PrixMTX!B19))","v":"ENGRAISEngrais Gazon1"},{"$f":"IF(COUNTIFS(PrixMTX!$A$6:$A$200,PrixMTX!A19,PrixMTX!$B$6:$B$200,PrixMTX!B19)<2,\"\",IF(COUNTIFS(PrixMTX!$A20:$A$200,PrixMTX!$A19,PrixMTX!$B20:$B$200,PrixMTX!B19)>0,\"\",MAX($AB$5:AB18)+1))","v":""}]
[null,null,null,null,"fournisseur 5",null,"COMPOSITE",null,"gamme 1","gamme 2",null,null,null,null,null,null,null,null,null,null,null,null,null,null,null,null,{"$f":"IF(PrixMTX!A20=\"\",\"\",PrixMTX!A20&PrixMTX!B20&COUNTIFS(PrixMTX!$A$6:A20,PrixMTX!A20,PrixMTX!$B$6:B20,PrixMTX!B20))","v":"GRAINESGazon1"},{"$f":"IF(COUNTIFS(PrixMTX!$A$6:$A$200,PrixMTX!A20,PrixMTX!$B$6:$B$200,PrixMTX!B20)<2,\"\",IF(COUNTIFS(PrixMTX!$A21:$A$200,PrixMTX!$A20,PrixMTX!$B21:$B$200,PrixMTX!B20)>0,\"\",MAX($AB$5:AB19)+1))","v":""}]
[null,null,null,null,"fournisseur 6",null,"DECHARGE",null,"Terre","Non_recyclable",null,null,null,null,null,null,null,null,null,null,null,null,null,null,null,null,{"$f":"IF(PrixMTX!A21=\"\",\"\",PrixMTX!A21&PrixMTX!B21&COUNTIFS(PrixMTX!$A$6:A21,PrixMTX!A21,PrixMTX!$B$6:B21,PrixMTX!B21))","v":"METALBéton1"},{"$f":"IF(COUNTIFS(PrixMTX!$A$6:$A$200,PrixMTX!A21,PrixMTX!$B$6:$B$200,PrixMTX!B21)<2,\"\",IF(COUNTIFS(PrixMTX!$A22:$A$200,PrixMTX!$A21,PrixMTX!$B22:$B$200,PrixMTX!B21)>0,\"\",MAX($AB$5:AB20)+1))","v":""}]
[null,null,null,null,"fournisseur 7",null,"ENGRAIS",null,"Engrais Gazon","Amendement",null,null,null,null,null,null,null,null,null,null,null,null,null,null,null,null,{"$f":"IF(PrixMTX!A22=\"\",\"\",PrixMTX!A22&PrixMTX!B22&COUNTIFS(PrixMTX!$A$6:A22,PrixMTX!A22,PrixMTX!$B$6:B22,PrixMTX!B22))","v":"METALBéton2"},{"$f":"IF(COUNTIFS(PrixMTX!$A$6:$A$200,PrixMTX!A22,PrixMTX!$B$6:$B$200,PrixMTX!B22)<2,\"\",IF(COUNTIFS(PrixMTX!$A23:$A$200,PrixMTX!$A22,PrixMTX!$B23:$B$200,PrixMTX!B22)>0,\"\",MAX($AB$5:AB21)+1))","v":5}]
[null,null,null,null,"fournisseur 8",null,"QUINCAILLERIE",null,"Clous","Equerres","Vis","Vis_inox",null,null,null,null,null,null,null,null,null,null,null,null,null,null,{"$f":"IF(PrixMTX!A23=\"\",\"\",PrixMTX!A23&PrixMTX!B23&COUNTIFS(PrixMTX!$A$6:A23,PrixMTX!A23,PrixMTX!$B$6:B23,PrixMTX!B23))","v":"PAVESformat11"},{"$f":"IF(COUNTIFS(PrixMTX!$A$6:$A$200,PrixMTX!A23,PrixMTX!$B$6:$B$200,PrixMTX!B23)<2,\"\",IF(COUNTIFS(PrixMTX!$A24:$A$200,PrixMTX!$A23,PrixMTX!$B24:$B$200,PrixMTX!B23)>0,\"\",MAX($AB$5:AB22)+1))","v":""}]
[null,null,null,null,"fournisseur 9",null,"GRAINES",null,"Gazon","Prairie_Fleurie",null,null,null,null,null,null,null,null,null,null,null,null,null,null,null,null,{"$f":"IF(PrixMTX!A24=\"\",\"\",PrixMTX!A24&PrixMTX!B24&COUNTIFS(PrixMTX!$A$6:A24,PrixMTX!A24,PrixMTX!$B$6:B24,PrixMTX!B24))","v":"PAVESformat21"},{"$f":"IF(COUNTIFS(PrixMTX!$A$6:$A$200,PrixMTX!A24,PrixMTX!$B$6:$B$200,PrixMTX!B24)<2,\"\",IF(COUNTIFS(PrixMTX!$A25:$A$200,PrixMTX!$A24,PrixMTX!$B25:$B$200,PrixMTX!B24)>0,\"\",MAX($AB$5:AB23)+1))","v":""}]
[null,null,null,null,"fournisseur 10",null,"METAL",null,"Béton","Finition","Structure",null,null,null,null,null,null,null,null,null,null,null,null,null,null,null,{"$f":"IF(PrixMTX!A25=\"\",\"\",PrixMTX!A25&PrixMTX!B25&COUNTIFS(PrixMTX!$A$6:A25,PrixMTX!A25,PrixMTX!$B$6:B25,PrixMTX!B25))","v":"PIERRESGalets1"},{"$f":"IF(COUNTIFS(PrixMTX!$A$6:$A$200,PrixMTX!A25,PrixMTX!$B$6:$B$200,PrixMTX!B25)<2,\"\",IF(COUNTIFS(PrixMTX!$A26:$A$200,PrixMTX!$A25,PrixMTX!$B26:$B$200,PrixMTX!B25)>0,\"\",MAX($AB$5:AB24)+1))","v":""}]
[null,null,null,null,"fournisseur 11",null,"PAVES",null,"format1","format2",null,null,null,null,null,null,null,null,null,null,null,null,null,null,null,null,{"$f":"IF(PrixMTX!A26=\"\",\"\",PrixMTX!A26&PrixMTX!B26&COUNTIFS(PrixMTX!$A$6:A26,PrixMTX!A26,PrixMTX!$B$6:B26,PrixMTX!B26))","v":"QUINCAILLERIEClous1"},{"$f":"IF(COUNTIFS(PrixMTX!$A$6:$A$200,PrixMTX!A26,PrixMTX!$B$6:$B$200,PrixMTX!B26)<2,\"\",IF(COUNTIFS(PrixMTX!$A27:$A$200,PrixMTX!$A26,PrixMTX!$B27:$B$200,PrixMTX!B26)>0,\"\",MAX($AB$5:AB25)+1))","v":""}]
[null,null,null,null,"fournisseur 12",null,"PIERRES",null,"Autres","Gneiss","Galets","Granit",null,null,null,null,null,null,null,null,null,null,null,null,null,null,{"$f":"IF(PrixMTX!A27=\"\",\"\",PrixMTX!A27&PrixMTX!B27&COUNTIFS(PrixMTX!$A$6:A27,PrixMTX!A27,PrixMTX!$B$6:B27,PrixMTX!B27))","v":"RESEAUXPVC1"},{"$f":"IF(COUNTIFS(PrixMTX!$A$6:$A$200,PrixMTX!A27,PrixMTX!$B$6:$B$200,PrixMTX!B27)<2,\"\",IF(COUNTIFS(PrixMTX!$A28:$A$200,PrixMTX!$A27,PrixMTX!$B28:$B$200,PrixMTX!B27)>0,\"\",MAX($AB$5:AB26)+1))","v":""}]
[null,null,null,null,"fournisseur 13",null,"RESEAUX",null,"Caniveaux","Gaines","PVC","PVC_Raccords",null,null,null,null,null,null,null,null,null,null,null,null,null,null,{"$f":"IF(PrixMTX!A28=\"\",\"\",PrixMTX!A28&PrixMTX!B28&COUNTIFS(PrixMTX!$A$6:A28,PrixMTX!A28,PrixMTX!$B$6:B28,PrixMTX!B28))","v":"TOILESGeotextile1"},{"$f":"IF(COUNTIFS(PrixMTX!$A$6:$A$200,PrixMTX!A28,PrixMTX!$B$6:$B$200,PrixMTX!B28)<2,\"\",IF(COUNTIFS(PrixMTX!$A29:$A$200,PrixMTX!$A28,PrixMTX!$B29:$B$200,PrixMTX!B28)>0,\"\",MAX($AB$5:AB27)+1))","v":""}]
[null,null,null,null,"fournisseur 14",null,"TOILES",null,"Geotextile","Hors_Sol",null,null,null,null,null,null,null,null,null,null,null,null,null,null,null,null,{"$f":"IF(PrixMTX!A29=\"\",\"\",PrixMTX!A29&PrixMTX!B29&COUNTIFS(PrixMTX!$A$6:A29,PrixMTX!A29,PrixMTX!$B$6:B29,PrixMTX!B29))","v":"TOILESHors_Sol1"},{"$f":"IF(COUNTIFS(PrixMTX!$A$6:$A$200,PrixMTX!A29,PrixMTX!$B$6:$B$200,PrixMTX!B29)<2,\"\",IF(COUNTIFS(PrixMTX!$A30:$A$200,PrixMTX!$A29,PrixMTX!$B30:$B$200,PrixMTX!B29)>0,\"\",MAX($AB$5:AB28)+1))","v":""}]
[null,null,null,null,"fournisseur 15",null,"TRANSPORT",null,"Autres","Béton","Fournisseurs","SANS",null,null,null,null,null,null,null,null,null,null,null,null,null,null,{"$f":"IF(PrixMTX!A30=\"\",\"\",PrixMTX!A30&PrixMTX!B30&COUNTIFS(PrixMTX!$A$6:A30,PrixMTX!A30,PrixMTX!$B$6:B30,PrixMTX!B30))","v":"TRANSPORTAutres1"},{"$f":"IF(COUNTIFS(PrixMTX!$A$6:$A$200,PrixMTX!A30,PrixMTX!$B$6:$B$200,PrixMTX!B30)<2,\"\",IF(COUNTIFS(PrixMTX!$A31:$A$200,PrixMTX!$A30,PrixMTX!$B31:$B$200,PrixMTX!B30)>0,\"\",MAX($AB$5:AB29)+1))","v":""}]
{"$rows_left_out":171}
{"sheet":"LISTE","index":3,"n_rows":145,"n_cols":26,"rows_kept":145,"cut":false,"hidden":false,"merged":[]}
["ce tableau se remplit automatiquement à partir des entrées dans la feuille Prix MTX selon le codage des colonnes AA et AB de DATA (Valable de 6 à200) uniquement lorsque la composition A&B existe au moins deux fois dans la base"]
["Il n'est pas utile que les listes en A et B de prix MTX soient classées"]
["le tableau est fonctionnel de A6 à Z16"]
["De nouvelles appelations combinées en colonne A et B de PrixMTX créent automatiquement un titre en ligne 5, mais le champ devra être nommé de ce nom. Pour ça sélectionner l a colonnede 5 à16 inclus, Ruban/ Onglet formule/Créer un nom et cocher \"ligne du haut\""]
[{"$f":"IF(MAX(CodB)>=COLUMN(),INDEX(TCDcategorie,MATCH(COLUMN(),CodB,0))&INDEX(ssCat.Articles,MATCH(COLUMN(),CodB,0)),\"\")","v":"BETONLivré"},"BETONNon_Livré","BOISStructure","CLOTURESPanneaux","METALBéton","TRANSPORTBéton","TRANSPORTFournisseurs","","","","","","","","","","","","","","","","","","",""]
["Cat1_","Cat2_","Cat3_","Cat4_","Cat5_","Cat6_","Cat7_","Cat8_","Cat9_","Cat10_","Cat11_","Cat12_","Cat13_","Cat14_","Cat15_","Cat16_","Cat17_","Cat18_","Cat19_","Cat20_","Cat21_","Cat22_","Cat23_","Cat24_","Cat25_","Cat26_"]
[]
[{"$f":"IF(A5=\"\",\"\",IF(COUNTIF(CodA,\"*\"&A$5&\"*\")>=ROW($A1),INDEX(DesignationMTX,MATCH(A$5&ROW($A1),CodA,0)),\"\"))","v":"Béton+ PUMI complet (6 m3)"},"Béton (à livrer toupie/pumi)","Grandes planches coffrage","Panneaux soudés 2,5x1,23m (anthracite)","Rond béton HA10","Livraison AP camion","Fourn. 6 Camion 8x4 (15T?)","","","","","","","","","","","","","","","","","","",""]
[{"$f":"IF(A8=\"\",\"\",IF(COUNTIF(CodA,\"*\"&A$5&\"*\")>=ROW($A2),INDEX(DesignationMTX,MATCH(A$5&ROW($A2),CodA,0)),\"\"))","v":"Béton+ PUMI moitié (3 m3)"},"Béton (direct centrale) ","Petites planches coffrage","Poteau 1,3m (anthracite)","Rond béton HA8","Livraison PUMI (6 m3 max) (en plus transport Toupie)","Fourn.5 Camion 8x4 (15T?)","","","",{"$f":"IF(K8=\"\",\"\",IF(COUNTIF(CodA,\"*\"&K$5&\"*\")>=ROW($A2),INDEX(DesignationMTX,MATCH(K$5&ROW($A2),CodA,0)),\"\"))","v":""},"","","","","","","","","",{"$f":"IF(U8=\"\",\"\",IF(COUNTIF(CodA,\"*\"&U$5&\"*\")>=ROW($A2),INDEX(DesignationMTX,MATCH(U$5&ROW($A2),CodA,0)),\"\"))","v":""},"","","","",""]
["Béton+TOUPIE complète (6 m3)","Mortier","","support platine poteaux (anthracite)","","Livraison PUMI m3 pompé","Transporteur Camion 6x4 Ampiroll (13T)","","","","","","","","","","","","","","","","","","",""]
["Béton+TOUPIE moitié (3 m3)","","","","","Livraison TOUPIE (6 m3 max)","","","","","","","","","","","","","","","","","","","",""]
["","","","","","","","","","","","","","","","","","","","","","","","","",""]
[{"$f":"IF(A12=\"\",\"\",IF(COUNTIF(CodA,\"*\"&A$5&\"*\")>=ROW($A8),INDEX(DesignationMTX,MATCH(A$5&ROW($A8),CodA,0)),\"\"))","v":""},"","","","","","","","","",{"$f":"IF(K12=\"\",\"\",IF(COUNTIF(CodA,\"*\"&K$5&\"*\")>=ROW($A8),INDEX(DesignationMTX,MATCH(K$5&ROW($A8),CodA,0)),\"\"))","v":""},"","","","","","","","","",{"$f":"IF(U12=\"\",\"\",IF(COUNTIF(CodA,\"*\"&U$5&\"*\")>=ROW($A8),INDEX(DesignationMTX,MATCH(U$5&ROW($A8),CodA,0)),\"\"))","v":""},"","","","",""]
["","","","","","","","","","","","","","","","","","","","","","","","","",""]
["","","","","","","","","","","","","","","","","","","","","","","","","",""]
["","","","","","","","","","","","","","","","","","","","","","","","","",""]
["","","","","","","","","","","","","","","","","","","","","","","","","",""]
["","","","","","","","","","","","","","","","","","","","","","","","","",""]
[]
[]
[]
[]
[]
[]
[]
[]
[]
[]
[]
[]
{"$rows_left_out":116}
{"sheet":"Feuil2","index":4,"n_rows":0,"n_cols":0,"rows_kept":0,"cut":false,"hidden":false,"merged":[]}

{"sheet":"Feuil3","index":5,"n_rows":0,"n_cols":0,"rows_kept":0,"cut":false,"hidden":false,"merged":[]}