{"text_format":"1","workbook":"xlsx","n_sheets":15,"sheets":["Calendrier","JAN","FEV","MAR","AVR","MAI","JUN","JUL","AOU","SEP","OCT","NOV","DEC","Module1","Fériés"],"not_rendered":{"charts":0,"images":0,"macros":1,"external_links":1,"defined_names":78,"comments":0,"pivot_tables":0},"unopened":[{"sheet":"Module1","index":13,"reason":"part_missing"}],"bounds":{"document_bytes":16777216,"sheet_cells":100000,"rows_first":2000,"rows_last":500,"rows_between":2000,"halvings":0,"cell_chars":16384,"cell_head_chars":4096},"cells_cut":0,"cells_raw":0,"read":"whole","date_system":"1900"}

{"sheet":"Calendrier","index":0,"n_rows":59,"n_cols":46,"rows_kept":59,"cut":false,"hidden":false,"merged":[[0,13,0,14],[0,20,0,21],[1,11,1,12],[1,13,1,14],[2,11,2,12],[2,13,2,14],[3,11,3,12],[3,13,3,14],[4,11,4,12],[4,13,4,14],[5,11,5,12],[5,13,5,14],[6,11,6,12],[6,13,6,14],[7,1,7,5],[7,9,7,10],[7,11,7,12],[7,13,7,14],[8,9,8,10],[8,11,8,12],[8,13,8,14],[9,0,9,1],[9,8,9,9],[9,10,9,11]]}
[2016,null,null,null,"N° ident.","N123456",null,null,null,null,null,"année",null,{"$f":"IF(AD19<>\"\",366,365)","v":366},null,"jours",null,null,"contrôle",null,366,null,null,null,null,null,null,null,null,null,null,null,null,null,null,null,null,null,null,null,null,null,null,null,"Sa","Samedi"]
[null,null,null,null,"nom","MARTIN",null,null,null,null,null,"F",null,{"$f":"COUNTIF($B$12:$AF$59,L2)/2","v":12},null,"férié",null,null,null,null,null,null,null,null,null,null,null,null,null,null,null,null,null,null,null,null,null,null,null,null,null,null,null,null,"Di","Dimanche"]
[null,null,null,null,"prénom","PATRICK",null,null,null,null,null,"Di",null,{"$f":"AJ11","v":47},null,"dimanche",null,null,null,null,null,null,null,null,null,null,null,null,null,null,null,null,null,null,null,null,null,null,null,null,null,null,null,null,"F","Férié"]
[null,null,null,null,"service","COMPTABILITE",null,null,null,null,null,"Sa",null,{"$f":"AI11","v":53},null,"samedi",null,null,null,null,"MT",null,null,null,null,null,null,null,null,null,null,null,null,null,null,null,null,null,null,null,null,null,null,null,"CA","Congés annuel"]
[null,null,null,null,null,null,null,null,null,null,null,"CA",null,{"$f":"COUNTIF($B$12:$AF$59,L5)-COUNTIF(copie_cal_aou,\"ca\")","v":25},null,{"$f":"IF($AL$11>$N$5,\"nombre de CA dépassé\",\"reste \"&+$N$5-$AL$11)","v":"reste 0"},null,null,null,null,null,null,null,null,null,null,null,null,null,null,null,null,null,null,null,null,null,null,null,null,null,null,null,null,"CP","Chômage partiel"]
[null,null,null,null,null,null,null,null,null,null,null,"CP",null,{"$f":"AM11","v":0},null,null,null,null,null,null,null,null,null,null,null,null,null,null,null,null,null,null,null,null,null,null,null,null,null,null,null,null,null,null,"RTT","Recupération temps travail"]
[null,null,null,null,null,null,null,null,null,null,null,"T",null,{"$f":"213-(AM11+AP11+AO11)","v":213},null,{"$f":"IF(SUM($AH$15:$AH$59)>$N$7,\"trop de jour travaillés\",IF((SUM($AH$15:$AH$59)+AM11)=$N$7,\"Nb jour travailler bon\",\"reste à travailler\"))","v":"Nb jour travailler bon"},null,null,null,null,null,0,null,null,null,null,null,null,null,null,null,null,null,null,null,null,null,null,null,null,null,null,null,null,"MT","Maladie"]
[null,"HORAIRE 2 X 4",null,null,null,null,null,null,null,"1/2RTT",null,"RTT",null,{"$f":"N1-(N2+N3+N4+N5+AM11+N7+N9+V4)","v":16},null,{"$f":"IF($AN$11>$N$8,\"Nb de JDR dépassé\",\"reste \"&+$N$8-$AN$11)","v":"reste 0"},null,null,null,null,null,null,null,null,null,null,null,null,null,null,null,null,null,366,null,null,null,{"$f":"INDIRECT(OFFSET($A$11,4*MONTH(TODAY()),0)&\"!\"&\"k8\")","v":25},null,{"$f":"INDIRECT(OFFSET($A$11,4*MONTH(TODAY()),0)&\"!\"&\"k9\")","v":14},null,null,null,null,"CS","Congés suplémentaire"]
[null,null,null,null,null,null,null,null,null,"1/2CS",null,"CS",null,0,null,{"$f":"IF($AP$11>$N$9,\"Nb CS dépassé\",\"reste \"&+$N$9-$AP$11&\" CS \")","v":"reste 0 CS "},null,null,null,null,null,null,null,null,null,null,null,null,null,null,null,null,null,"1/2T",null,null,null,null,null,"1/2RTT",null,"1/2CS",null,null,7.8,"horaire journalier"]
[213,null,"JOUR DE TRAVAIL",null,null,null,"DE","7h80","centième",null,"=1584+7",null,"Heures",null,"avec le lundi de pentcôte",null,null,null,null,null,null,null,null,null,null,null,null,null,null,null,null,null,null,"T","Sa","Di","F","CA","CP","RTT","MT","CS"]
[null,1,2,3,4,5,6,7,8,9,10,11,12,13,14,15,16,17,18,19,20,21,22,23,24,25,26,27,28,29,30,31,null,{"$f":"SUM(AH15:AH59)","v":213},{"$f":"SUM(AI15:AI59)","v":53},47,12,25,0,{"$f":"SUM(AN15:AN59)","v":16},{"$f":"SUM(AO15:AO59)","v":0},0]
[null,"Ve","Sa","Di","Lu","Ma","Me","Je","Ve","Sa","Di","Lu","Ma","Me","Je","Ve","Sa","Di","Lu","Ma","Me","Je","Ve","Sa","Di","Lu","Ma","Me","Je","Ve","Sa","Di"]
[null,{"$f":"VALUE(\"01/01/\"&A1)","v":42370},{"$f":"B13+1","v":42371},{"$f":"C13+1","v":42372},42373,42374,42375,42376,42377,42378,42379,42380,42381,42382,42383,42384,42385,42386,42387,42388,42389,42390,42391,42392,42393,42394,42395,42396,42397,42398,42399,42400]
[null,{"$f":"IF(AND(ISERROR(VLOOKUP(B13,liste_fériés,1,FALSE)),OR(B12=\"Sa\",B12=\"Di\")),B12,IF(ISERROR(VLOOKUP(B13,liste_fériés,1,FALSE)),\"T\",\"F\"))","v":"F"},"Sa","Di","T","T","T","T","T","Sa","Di","T","T","T","T","T","Sa","Di","T","T","T","T","T","Sa","Di","T","T","T","T","T","Sa","Di"]
["JAN","F","Sa","Di","T","T","T","T","T","Sa","Di","T","T","T","T","RTT","Sa","Di","T","T","T","T","T","Sa","Di","T","T","T","T","RTT","Sa","Di",null,{"$f":"COUNTIF($B15:$AF15,AH$10)","v":18},{"$f":"COUNTIF($B15:$AF15,AI$10)","v":5},5,1,0,0,2,0,0]
[null,"Lu","Ma","Me","Je","Ve","Sa","Di","Lu","Ma","Me","Je","Ve","Sa","Di","Lu","Ma","Me","Je","Ve","Sa","Di","Lu","Ma","Me","Je","Ve","Sa","Di","Lu"]
[null,{"$f":"VALUE(\"01/02/\"&$A$1)","v":42401},{"$f":"B17+1","v":42402},{"$f":"C17+1","v":42403},42404,42405,42406,42407,42408,42409,42410,42411,42412,42413,42414,42415,42416,42417,42418,42419,42420,42421,42422,42423,42424,42425,42426,42427,42428,{"$f":"IF(AC17+1=VALUE(\"29/02/\"&A1),AC17+1,0)","v":42429}]
[null,{"$f":"IF(AND(ISERROR(VLOOKUP(B17,liste_fériés,1,FALSE)),OR(B16=\"Sa\",B16=\"Di\")),B16,IF(ISERROR(VLOOKUP(B17,liste_fériés,1,FALSE)),\"T\",\"F\"))","v":"T"},"T","T","T","T","Sa","Di","T","T","T","T","T","Sa","Di","T","T","T","T","T","Sa","Di","T","T","T","T","T","Sa","Di","T"]
["FEV","T","T","T","T","T","Sa","Di","T","T","T","T","T","Sa","Di","RTT","T","T","T","T","Sa","Di","T","T","T","T","RTT","Sa","Di","T",null,null,null,{"$f":"COUNTIF($B19:$AF19,AH$10)","v":19},{"$f":"COUNTIF($B19:$AF19,AI$10)","v":4},4,0,0,0,2,0,0]
[null,"Ma","Me","Je","Ve","Sa","Di","Lu","Ma","Me","Je","Ve","Sa","Di","Lu","Ma","Me","Je","Ve","Sa","Di","Lu","Ma","Me","Je","Ve","Sa","Di","Lu","Ma","Me","Je"]
[null,{"$f":"VALUE(\"01/03/\"&$A$1)","v":42430},{"$f":"B21+1","v":42431},{"$f":"C21+1","v":42432},42433,42434,42435,42436,42437,42438,42439,42440,42441,42442,42443,42444,42445,42446,42447,42448,42449,42450,42451,42452,42453,42454,42455,42456,42457,42458,42459,42460]
[null,{"$f":"IF(AND(ISERROR(VLOOKUP(B21,liste_fériés,1,FALSE)),OR(B20=\"Sa\",B20=\"Di\")),B20,IF(ISERROR(VLOOKUP(B21,liste_fériés,1,FALSE)),\"T\",\"F\"))","v":"T"},"T","T","T","Sa","Di","T","T","T","T","T","Sa","Di","T","T","T","T","T","Sa","Di","T","T","T","T","T","Sa","F","F","T","T","T"]
["MAR","T","T","T","T","Sa","Di","T","T","T","T","T","Sa","Di","RTT","T","T","T","T","Sa","Di","T","T","T","T","RTT","Sa","F","F","T","T","T",null,{"$f":"COUNTIF($B23:$AF23,AH$10)","v":20},{"$f":"COUNTIF($B23:$AF23,AI$10)","v":4},3,2,0,0,2,0,0]
[null,"Ve","Sa","Di","Lu","Ma","Me","Je","Ve","Sa","Di","Lu","Ma","Me","Je","Ve","Sa","Di","Lu","Ma","Me","Je","Ve","Sa","Di","Lu","Ma","Me","Je","Ve","Sa"]
[null,{"$f":"VALUE(\"01/04/\"&$A$1)","v":42461},{"$f":"B25+1","v":42462},{"$f":"C25+1","v":42463},42464,42465,42466,42467,42468,42469,42470,42471,42472,42473,42474,42475,42476,42477,42478,42479,42480,42481,42482,42483,42484,42485,42486,42487,42488,42489,42490]
[null,{"$f":"IF(AND(ISERROR(VLOOKUP(B25,liste_fériés,1,FALSE)),OR(B24=\"Sa\",B24=\"Di\")),B24,IF(ISERROR(VLOOKUP(B25,liste_fériés,1,FALSE)),\"T\",\"F\"))","v":"T"},"Sa","Di","T","T","T","T","T","Sa","Di","T","T","T","T","T","Sa","Di","T","T","T","T","T","Sa","Di","T","T","T","T","T","Sa"]
["AVR","T","Sa","Di","T","T","T","T","T","Sa","Di","T","T","T","T","RTT","Sa","Di","T","T","T","T","T","Sa","Di","RTT","T","T","T","T","Sa",null,null,{"$f":"COUNTIF($B27:$AF27,AH$10)","v":19},{"$f":"COUNTIF($B27:$AF27,AI$10)","v":5},4,0,0,0,2,0,0]
[null,"Di","Lu","Ma","Me","Je","Ve","Sa","Di","Lu","Ma","Me","Je","Ve","Sa","Di","Lu","Ma","Me","Je","Ve","Sa","Di","Lu","Ma","Me","Je","Ve","Sa","Di","Lu","Ma"]
[null,{"$f":"VALUE(\"01/05/\"&$A$1)","v":42491},{"$f":"B29+1","v":42492},{"$f":"C29+1","v":42493},42494,42495,42496,42497,42498,42499,42500,42501,42502,42503,42504,42505,42506,42507,42508,42509,42510,42511,42512,42513,42514,42515,42516,42517,42518,42519,42520,42521]
[null,{"$f":"IF(AND(ISERROR(VLOOKUP(B29,liste_fériés,1,FALSE)),OR(B28=\"Sa\",B28=\"Di\")),B28,IF(ISERROR(VLOOKUP(B29,liste_fériés,1,FALSE)),\"T\",\"F\"))","v":"F"},"T","T","T","F","T","Sa","F","T","T","T","T","T","Sa","F","T","T","T","T","T","Sa","Di","T","T","T","T","T","Sa","Di","T","T"]
["MAI","F","T","T","T","F","RTT","Sa","F","T","T","T","T","T","Sa","F","T","T","T","T","T","Sa","Di","T","T","T","T","T","Sa","Di","T","T",null,{"$f":"COUNTIF($B31:$AF31,AH$10)","v":20},{"$f":"COUNTIF($B31:$AF31,AI$10)","v":4},2,4,0,0,1,0,0]
[null,"Me","Je","Ve","Sa","Di","Lu","Ma","Me","Je","Ve","Sa","Di","Lu","Ma","Me","Je","Ve","Sa","Di","Lu","Ma","Me","Je","Ve","Sa","Di","Lu","Ma","Me","Je"]
[null,{"$f":"VALUE(\"01/06/\"&$A$1)","v":42522},{"$f":"B33+1","v":42523},{"$f":"C33+1","v":42524},42525,42526,42527,42528,42529,42530,42531,42532,42533,42534,42535,42536,42537,42538,42539,42540,42541,42542,42543,42544,42545,42546,42547,42548,42549,42550,42551]
[null,{"$f":"IF(AND(ISERROR(VLOOKUP(B33,liste_fériés,1,FALSE)),OR(B32=\"Sa\",B32=\"Di\")),B32,IF(ISERROR(VLOOKUP(B33,liste_fériés,1,FALSE)),\"T\",\"F\"))","v":"T"},"T","T","Sa","Di","T","T","T","T","T","Sa","Di","T","T","T","T","T","Sa","Di","T","T","T","T","T","Sa","Di","T","T","T","T"]
["JUN","T","T","T","Sa","Di","T","T","T","T","RTT","Sa","Di","T","T","T","T","RTT","Sa","Di","T","T","T","T","T","Sa","Di","T","T","T","T",null,null,{"$f":"COUNTIF($B35:$AF35,AH$10)","v":20},{"$f":"COUNTIF($B35:$AF35,AI$10)","v":4},4,0,0,0,2,0,0]
[null,"Ve","Sa","Di","Lu","Ma","Me","Je","Ve","Sa","Di","Lu","Ma","Me","Je","Ve","Sa","Di","Lu","Ma","Me","Je","Ve","Sa","Di","Lu","Ma","Me","Je","Ve","Sa","Di"]
[null,{"$f":"VALUE(\"01/07/\"&$A$1)","v":42552},42553,42554,42555,42556,42557,42558,42559,42560,42561,42562,42563,42564,42565,42566,42567,42568,42569,42570,42571,42572,42573,42574,42575,42576,42577,42578,42579,42580,42581,42582]
[null,{"$f":"IF(AND(ISERROR(VLOOKUP(B37,liste_fériés,1,FALSE)),OR(B36=\"Sa\",B36=\"Di\")),B36,IF(ISERROR(VLOOKUP(B37,liste_fériés,1,FALSE)),\"T\",\"F\"))","v":"T"},"Sa","Di","T","T","T","T","T","Sa","Di","T","T","T","F","T","Sa","Di","T","T","T","T","T","Sa","Di","T","T","T","T","T","Sa","Di"]
["JUL","T","Sa","Di","T","T","T","T","T","Sa","Di","T","T","T","F","CA","Sa","Di","T","T","T","T","T","Sa","Di","RTT","T","T","T","T","Sa","Di",null,{"$f":"COUNTIF($B39:$AF39,AH$10)","v":18},{"$f":"COUNTIF($B39:$AF39,AI$10)","v":5},5,1,1,0,1,0,0]
[null,"Lu","Ma","Me","Je","Ve","Sa","Di","Lu","Ma","Me","Je","Ve","Sa","Di","Lu","Ma","Me","Je","Ve","Sa","Di","Lu","Ma","Me","Je","Ve","Sa","Di","Lu","Ma","Me"]
[null,{"$f":"VALUE(\"01/08/\"&$A$1)","v":42583},{"$f":"B41+1","v":42584},{"$f":"C41+1","v":42585},42586,42587,42588,42589,42590,42591,42592,42593,42594,42595,42596,42597,42598,42599,42600,42601,42602,42603,42604,42605,42606,42607,42608,42609,42610,42611,42612,42613]
[null,{"$f":"IF(AND(ISERROR(VLOOKUP(B41,liste_fériés,1,FALSE)),OR(B40=\"Sa\",B40=\"Di\")),B40,IF(ISERROR(VLOOKUP(B41,liste_fériés,1,FALSE)),\"CA\",\"F\"))","v":"CA"},"CA","CA","CA","CA","Sa","Di","CA","CA","CA","CA","CA","Sa","Di","F","CA","CA","CA","CA","Sa","Di","CA","CA","CA","CA","CA","Sa","Di","CA","CA","CA"]
["AOU","CA","CA","CA","CA","CA","Sa","Di","CA","CA","CA","CA","CA","Sa","Di","F","CA","CA","CA","CA","Sa","Di","CA","CA","CA","CA","CA","Sa","Di","T","T","T",null,{"$f":"COUNTIF($B43:$AF43,AH$10)","v":3},{"$f":"COUNTIF($B43:$AF43,AI$10)","v":4},4,1,19,0,0,0,0]
[null,"Je","Ve","Sa","Di","Lu","Ma","Me","Je","Ve","Sa","Di","Lu","Ma","Me","Je","Ve","Sa","Di","Lu","Ma","Me","Je","Ve","Sa","Di","Lu","Ma","Me","Je","Ve"]
[null,{"$f":"VALUE(\"01/09/\"&A1)","v":42614},{"$f":"B45+1","v":42615},{"$f":"C45+1","v":42616},42617,42618,42619,42620,42621,42622,42623,42624,42625,42626,42627,42628,42629,42630,42631,42632,42633,42634,42635,42636,42637,42638,42639,42640,42641,42642,42643]
[null,{"$f":"IF(AND(ISERROR(VLOOKUP(B45,liste_fériés,1,FALSE)),OR(B44=\"Sa\",B44=\"Di\")),B44,IF(ISERROR(VLOOKUP(B45,liste_fériés,1,FALSE)),\"T\",\"F\"))","v":"T"},"T","Sa","Di","T","T","T","T","T","Sa","Di","T","T","T","T","T","Sa","Di","T","T","T","T","T","Sa","Di","T","T","T","T","T"]
["SEP","T","T","Sa","Di","T","T","T","T","T","Sa","Di","T","T","T","T","RTT","Sa","Di","T","T","T","T","T","Sa","Di","T","T","T","T","T",null,null,{"$f":"COUNTIF($B47:$AF47,AH$10)","v":21},{"$f":"COUNTIF($B47:$AF47,AI$10)","v":4},4,0,0,0,1,0,0]
[null,"Sa","Di","Lu","Ma","Me","Je","Ve","Sa","Di","Lu","Ma","Me","Je","Ve","Sa","Di","Lu","Ma","Me","Je","Ve","Sa","Di","Lu","Ma","Me","Je","Ve","Sa","Di","Lu"]
[null,{"$f":"VALUE(\"01/10/\"&$A$1)","v":42644},42645,42646,42647,42648,42649,42650,42651,42652,42653,42654,42655,42656,42657,42658,42659,42660,42661,42662,42663,42664,42665,42666,42667,42668,42669,42670,42671,42672,42673,42674]
[null,{"$f":"IF(AND(ISERROR(VLOOKUP(B49,liste_fériés,1,FALSE)),OR(B48=\"Sa\",B48=\"Di\")),B48,IF(ISERROR(VLOOKUP(B49,liste_fériés,1,FALSE)),\"T\",\"F\"))","v":"Sa"},"Di","T","T","T","T","T","Sa","Di","T","T","T","T","T","Sa","Di","T","T","T","T","T","Sa","Di","T","T","T","T","T","Sa","Di","T"]
["OCT","Sa","Di","T","T","T","T","T","Sa","Di","T","T","T","T","RTT","Sa","Di","T","T","T","T","T","Sa","Di","T","T","T","T","T","Sa","Di","T",null,{"$f":"COUNTIF($B51:$AF51,AH$10)","v":20},{"$f":"COUNTIF($B51:$AF51,AI$10)","v":5},5,0,0,0,1,0,0]
[null,"Ma","Me","Je","Ve","Sa","Di","Lu","Ma","Me","Je","Ve","Sa","Di","Lu","Ma","Me","Je","Ve","Sa","Di","Lu","Ma","Me","Je","Ve","Sa","Di","Lu","Ma","Me"]
[null,{"$f":"VALUE(\"01/11/\"&$A$1)","v":42675},{"$f":"B53+1","v":42676},{"$f":"C53+1","v":42677},42678,42679,42680,42681,42682,42683,42684,42685,42686,42687,42688,42689,42690,42691,42692,42693,42694,42695,42696,42697,42698,42699,42700,42701,42702,42703,42704]
[null,{"$f":"IF(AND(ISERROR(VLOOKUP(B53,liste_fériés,1,FALSE)),OR(B52=\"Sa\",B52=\"Di\")),B52,IF(ISERROR(VLOOKUP(B53,liste_fériés,1,FALSE)),\"T\",\"F\"))","v":"F"},"T","T","T","Sa","Di","T","T","T","T","F","Sa","Di","T","T","T","T","T","Sa","Di","T","T","T","T","T","Sa","Di","T","T","T"]
["NOV","F","T","T","T","Sa","Di","T","T","T","T","F","Sa","Di","T","T","T","T","RTT","Sa","Di","T","T","T","T","T","Sa","Di","T","T","T",null,null,{"$f":"COUNTIF($B55:$AF55,AH$10)","v":19},{"$f":"COUNTIF($B55:$AF55,AI$10)","v":4},4,2,0,0,1,0,0]
[null,"Je","Ve","Sa","Di","Lu","Ma","Me","Je","Ve","Sa","Di","Lu","Ma","Me","Je","Ve","Sa","Di","Lu","Ma","Me","Je","Ve","Sa","Di","Lu","Ma","Me","Je","Ve","Sa"]
[null,{"$f":"VALUE(\"01/12/\"&$A$1)","v":42705},{"$f":"B57+1","v":42706},{"$f":"C57+1","v":42707},42708,42709,42710,42711,42712,42713,42714,42715,42716,42717,42718,42719,42720,42721,42722,42723,42724,42725,42726,42727,42728,42729,42730,42731,42732,42733,42734,42735]
[null,{"$f":"IF(AND(ISERROR(VLOOKUP(B57,liste_fériés,1,FALSE)),OR(B56=\"Sa\",B56=\"Di\")),B56,IF(ISERROR(VLOOKUP(B57,liste_fériés,1,FALSE)),\"T\",\"F\"))","v":"T"},"T","Sa","Di","T","T","T","T","T","Sa","Di","T","T","T","T","T","Sa","Di","T","T","T","T","T","Sa","F","T","T","T","T","T","Sa"]
["DEC","T","T","Sa","Di","T","T","T","T","T","Sa","Di","RTT","T","T","T","T","Sa","Di","T","T","T","T","T","Sa","F","CA","CA","CA","CA","CA","Sa",null,{"$f":"COUNTIF($B59:$AF59,AH$10)","v":16},{"$f":"COUNTIF($B59:$AF59,AI$10)","v":5},3,1,5,0,1,0,0]

{"sheet":"JAN","index":1,"n_rows":50,"n_cols":18,"rows_kept":50,"cut":false,"hidden":false,"merged":[]}
[null,{"$f":"RIGHT(CELL(\"nomfichier\",$A$1),3)","v":"JAN"},"FICHE DE SUIVI HORAIRE"]
[]
[null,"mois :","JANVIER",null,null,"année ",{"$f":"Calendrier!A1","v":2016},null,"service",{"$f":"Calendrier!F4","v":"COMPTABILITE"}]
[]
[null,"nom :",{"$f":"Calendrier!F2","v":"MARTIN"},null,null," prénom ",{"$f":"Calendrier!F3","v":"PATRICK"},null,"N° Ident.",{"$f":"Calendrier!F1","v":"N123456"}]
[null,null,null,null,null,null,null,"à réaliser","cumul","en cours","reste",null,"n/cumul"]
[null,null,null,"Nb J/T",{"$f":"Calendrier!$A$10","v":213},{"$f":"$H$10","v":0},{"$f":"$H$12","v":213},{"$f":"Calendrier!$N$1","v":366},null,{"$f":"SUM(J8:J15)","v":13},{"$f":"H7-(I7+J7)","v":353},null,{"$f":"SUM(M8:M15)","v":13}]
[null,null,null,null,null,null,"CA",{"$f":"Calendrier!N5","v":25},null,{"$f":"IF(G8=\"\",0,COUNTIF($J$19:$J$49,G8))+IF(F8=\"\",0,COUNTIF($J$19:$J$49,F8)/2)","v":0},{"$f":"+H8-(I8+J8)","v":25},"J",{"$f":"+I8+J8","v":0}]
[null,null,null,null,null,"1/2RTT","RTT",{"$f":"Calendrier!N8","v":16},null,{"$f":"IF(G9=\"\",0,COUNTIF($J$19:$J$49,G9))+IF(F9=\"\",0,COUNTIF($J$19:$J$49,F9)/2)","v":2},{"$f":"+H9-(I9+J9)","v":14},"J",2]
[null,null,null,null,null,"1/2CS","CS",{"$f":"Calendrier!N9","v":0},null,{"$f":"IF(G10=\"\",0,COUNTIF($J$19:$J$49,G10))+IF(F10=\"\",0,COUNTIF($J$19:$J$49,F10)/2)","v":0},{"$f":"H10-(I10+J10)","v":0},"J",0]
[null,null,null,null,null,null,"CP",{"$f":"Calendrier!N6","v":0},null,0,{"$f":"H11-(I11+J11)","v":0},"J",0]
[null,null,null,null,null,"1/2T","T",{"$f":"Calendrier!N7","v":213},null,0,{"$f":"H12-(I12+J12)","v":213},"J",0]
[null,null,null,null,null,null,"Sa",{"$f":"Calendrier!N4","v":53},null,5,{"$f":"+H13-(I13+J13)","v":48},"J",5]
[null,null,null,null,null,null,"Di",{"$f":"Calendrier!N3","v":47},null,5,{"$f":"+H14-(I14+J14)","v":42},"J",5]
[null,null,null,null,null,null,"F",{"$f":"Calendrier!N2","v":12},null,1,{"$f":"+H15-(I15+J15)","v":11},"J",{"$f":"+I15+J15","v":1}]
[null,null,null,null,null,null,"heure/avance fin mois",null,null,null,null,null,{"$f":"I50","v":0}]
[null,"Prévu","Entrée","Sortie","Entrée","Sortie","total J","variation","cumul","Type","nb J/T",null,"Bon E/S","Sortie","Retour"]
[null,null,null,null,null,null,null,null,null,null,null,null,null,"avec bon"]
[1,{"$f":"INDIRECT(ADDRESS(MATCH($B$1,Calendrier!$A$15:$A$59,0)+14,ROW()-17,3,1,\"Calendrier\"),1)","v":"F"},null,null,null,null,{"$f":"IF(COUNTA(C19:F19)=4,(D19-C19)+(F19-E19)-M19,IF(COUNTA(C19:D19)<2,(F19-E19)-M19,(D19-C19)-M19))","v":0},{"$f":"IF(AND(K19=0.5,COUNTA(C19:F19)=4),\"erreur\",IF(AND(D19-C19>0,F19-E19=0),G19-Calendrier!$AS$9/2-M19,IF(AND(F19-E19>0,D19-C19=0),(F19-E19)-Calendrier!$AS$9/2-M19,IF(COUNTA(C19:F19)=4,(D19-C19)+(F19-E19)-M19-Calendrier!$AS$9,0))))","v":0},{"$f":"+I18+H19","v":0},{"$f":"IF(AND(COUNTA(C19:F19)=0,B19<>\"T\"),B19,IF(AND(OR(B19=$F$9,B19=$F$10),COUNTA(C19:F19=2)),\"T\",IF(G19>=6,\"T\",\"\")))","v":"F"},{"$f":"IF(OR(B19=$F$9,B19=$F$10),0.5,IF(G19>=6,1,0))","v":0},null,{"$f":"+O19-N19","v":0}]
[2,{"$f":"INDIRECT(ADDRESS(MATCH($B$1,Calendrier!$A$15:$A$59,0)+14,ROW()-17,3,1,\"Calendrier\"),1)","v":"Sa"},null,null,null,null,0,{"$f":"IF(AND(K20=0.5,COUNTA(C20:F20)=4),\"erreur\",IF(AND(D20-C20>0,F20-E20=0),G20-Calendrier!$AS$9/2-M20,IF(AND(F20-E20>0,D20-C20=0),(F20-E20)-Calendrier!$AS$9/2-M20,IF(COUNTA(C20:F20)=4,(D20-C20)+(F20-E20)-M20-Calendrier!$AS$9,0))))","v":0},{"$f":"+I19+H20","v":0},"Sa",0,null,{"$f":"+O20-N20","v":0}]
[3,{"$f":"INDIRECT(ADDRESS(MATCH($B$1,Calendrier!$A$15:$A$59,0)+14,ROW()-17,3,1,\"Calendrier\"),1)","v":"Di"},null,null,null,null,0,{"$f":"IF(AND(K21=0.5,COUNTA(C21:F21)=4),\"erreur\",IF(AND(D21-C21>0,F21-E21=0),G21-Calendrier!$AS$9/2-M21,IF(AND(F21-E21>0,D21-C21=0),(F21-E21)-Calendrier!$AS$9/2-M21,IF(COUNTA(C21:F21)=4,(D21-C21)+(F21-E21)-M21-Calendrier!$AS$9,0))))","v":0},0,"Di",0,null,0]
[4,{"$f":"INDIRECT(ADDRESS(MATCH($B$1,Calendrier!$A$15:$A$59,0)+14,ROW()-17,3,1,\"Calendrier\"),1)","v":"T"},null,null,null,null,0,{"$f":"IF(AND(K22=0.5,COUNTA(C22:F22)=4),\"erreur\",IF(AND(D22-C22>0,F22-E22=0),G22-Calendrier!$AS$9/2-M22,IF(AND(F22-E22>0,D22-C22=0),(F22-E22)-Calendrier!$AS$9/2-M22,IF(COUNTA(C22:F22)=4,(D22-C22)+(F22-E22)-M22-Calendrier!$AS$9,0))))","v":0},0,"",0,null,0]
[5,{"$f":"INDIRECT(ADDRESS(MATCH($B$1,Calendrier!$A$15:$A$59,0)+14,ROW()-17,3,1,\"Calendrier\"),1)","v":"T"},null,null,null,null,0,{"$f":"IF(AND(K23=0.5,COUNTA(C23:F23)=4),\"erreur\",IF(AND(D23-C23>0,F23-E23=0),G23-Calendrier!$AS$9/2-M23,IF(AND(F23-E23>0,D23-C23=0),(F23-E23)-Calendrier!$AS$9/2-M23,IF(COUNTA(C23:F23)=4,(D23-C23)+(F23-E23)-M23-Calendrier!$AS$9,0))))","v":0},{"$f":"I22+H23","v":0},"",{"$f":"IF(OR(B23=$F$9,B23=$F$10),0.5,IF(G23>=6,1,0))","v":0},null,0]
[6,{"$f":"INDIRECT(ADDRESS(MATCH($B$1,Calendrier!$A$15:$A$59,0)+14,ROW()-17,3,1,\"Calendrier\"),1)","v":"T"},null,null,null,null,0,{"$f":"IF(AND(K24=0.5,COUNTA(C24:F24)=4),\"erreur\",IF(AND(D24-C24>0,F24-E24=0),G24-Calendrier!$AS$9/2-M24,IF(AND(F24-E24>0,D24-C24=0),(F24-E24)-Calendrier!$AS$9/2-M24,IF(COUNTA(C24:F24)=4,(D24-C24)+(F24-E24)-M24-Calendrier!$AS$9,0))))","v":0},{"$f":"I23+H24","v":0},"",0,null,0]
[7,{"$f":"INDIRECT(ADDRESS(MATCH($B$1,Calendrier!$A$15:$A$59,0)+14,ROW()-17,3,1,\"Calendrier\"),1)","v":"T"},null,null,null,null,{"$f":"IF(COUNTA(C25:F25)=4,(D25-C25)+(F25-E25)-M25,IF(COUNTA(C25:D25)<2,(F25-E25)-M25,(D25-C25)-M25))","v":0},{"$f":"IF(AND(K25=0.5,COUNTA(C25:F25)=4),\"erreur\",IF(AND(D25-C25>0,F25-E25=0),G25-Calendrier!$AS$9/2-M25,IF(AND(F25-E25>0,D25-C25=0),(F25-E25)-Calendrier!$AS$9/2-M25,IF(COUNTA(C25:F25)=4,(D25-C25)+(F25-E25)-M25-Calendrier!$AS$9,0))))","v":0},0,"",0,null,0]
[8,{"$f":"INDIRECT(ADDRESS(MATCH($B$1,Calendrier!$A$15:$A$59,0)+14,ROW()-17,3,1,\"Calendrier\"),1)","v":"T"},null,null,null,null,0,{"$f":"IF(AND(K26=0.5,COUNTA(C26:F26)=4),\"erreur\",IF(AND(D26-C26>0,F26-E26=0),G26-Calendrier!$AS$9/2-M26,IF(AND(F26-E26>0,D26-C26=0),(F26-E26)-Calendrier!$AS$9/2-M26,IF(COUNTA(C26:F26)=4,(D26-C26)+(F26-E26)-M26-Calendrier!$AS$9,0))))","v":0},0,"",0,null,0,null,null,null,null,"2014-07-01"]
[9,{"$f":"INDIRECT(ADDRESS(MATCH($B$1,Calendrier!$A$15:$A$59,0)+14,ROW()-17,3,1,\"Calendrier\"),1)","v":"Sa"},null,null,null,null,0,{"$f":"IF(AND(K27=0.5,COUNTA(C27:F27)=4),\"erreur\",IF(AND(D27-C27>0,F27-E27=0),G27-Calendrier!$AS$9/2-M27,IF(AND(F27-E27>0,D27-C27=0),(F27-E27)-Calendrier!$AS$9/2-M27,IF(COUNTA(C27:F27)=4,(D27-C27)+(F27-E27)-M27-Calendrier!$AS$9,0))))","v":0},0,"Sa",0,null,0]
[10,{"$f":"INDIRECT(ADDRESS(MATCH($B$1,Calendrier!$A$15:$A$59,0)+14,ROW()-17,3,1,\"Calendrier\"),1)","v":"Di"},null,null,null,null,0,{"$f":"IF(AND(K28=0.5,COUNTA(C28:F28)=4),\"erreur\",IF(AND(D28-C28>0,F28-E28=0),G28-Calendrier!$AS$9/2-M28,IF(AND(F28-E28>0,D28-C28=0),(F28-E28)-Calendrier!$AS$9/2-M28,IF(COUNTA(C28:F28)=4,(D28-C28)+(F28-E28)-M28-Calendrier!$AS$9,0))))","v":0},0,"Di",0,null,0]
[11,{"$f":"INDIRECT(ADDRESS(MATCH($B$1,Calendrier!$A$15:$A$59,0)+14,ROW()-17,3,1,\"Calendrier\"),1)","v":"T"},null,null,null,null,0,{"$f":"IF(AND(K29=0.5,COUNTA(C29:F29)=4),\"erreur\",IF(AND(D29-C29>0,F29-E29=0),G29-Calendrier!$AS$9/2-M29,IF(AND(F29-E29>0,D29-C29=0),(F29-E29)-Calendrier!$AS$9/2-M29,IF(COUNTA(C29:F29)=4,(D29-C29)+(F29-E29)-M29-Calendrier!$AS$9,0))))","v":0},0,"",0,null,0,null,null,null,null,{"$f":"INDIRECT(OFFSET(Calendrier!A11,0,4*MONTH(TODAY()))&\"!\"&\"K9\")","v":{"$error":"#REF!"}}]
[12,{"$f":"INDIRECT(ADDRESS(MATCH($B$1,Calendrier!$A$15:$A$59,0)+14,ROW()-17,3,1,\"Calendrier\"),1)","v":"T"},null,null,null,null,0,{"$f":"IF(AND(K30=0.5,COUNTA(C30:F30)=4),\"erreur\",IF(AND(D30-C30>0,F30-E30=0),G30-Calendrier!$AS$9/2-M30,IF(AND(F30-E30>0,D30-C30=0),(F30-E30)-Calendrier!$AS$9/2-M30,IF(COUNTA(C30:F30)=4,(D30-C30)+(F30-E30)-M30-Calendrier!$AS$9,0))))","v":0},0,"",0,null,0]
[13,{"$f":"INDIRECT(ADDRESS(MATCH($B$1,Calendrier!$A$15:$A$59,0)+14,ROW()-17,3,1,\"Calendrier\"),1)","v":"T"},null,null,null,null,0,{"$f":"IF(AND(K31=0.5,COUNTA(C31:F31)=4),\"erreur\",IF(AND(D31-C31>0,F31-E31=0),G31-Calendrier!$AS$9/2-M31,IF(AND(F31-E31>0,D31-C31=0),(F31-E31)-Calendrier!$AS$9/2-M31,IF(COUNTA(C31:F31)=4,(D31-C31)+(F31-E31)-M31-Calendrier!$AS$9,0))))","v":0},0,"",0,null,0]
[14,null,null,null,null,null,{"$f":"IF(COUNTA(C32:F32)=4,(D32-C32)+(F32-E32)-M32,IF(COUNTA(C32:D32)<2,(F32-E32)-M32,(D32-C32)-M32))","v":0},{"$f":"IF(AND(K32=0.5,COUNTA(C32:F32)=4),\"erreur\",IF(AND(D32-C32>0,F32-E32=0),G32-Calendrier!$AS$9/2-M32,IF(AND(F32-E32>0,D32-C32=0),(F32-E32)-Calendrier!$AS$9/2-M32,IF(COUNTA(C32:F32)=4,(D32-C32)+(F32-E32)-M32-Calendrier!$AS$9,0))))","v":0},0,0,0,null,0,null,null,null,null,{"$f":"TEXT(R26,\"mmm\")","v":"juil"}]
[15,{"$f":"INDIRECT(ADDRESS(MATCH($B$1,Calendrier!$A$15:$A$59,0)+14,ROW()-17,3,1,\"Calendrier\"),1)","v":"RTT"},null,null,null,null,0,{"$f":"IF(AND(K33=0.5,COUNTA(C33:F33)=4),\"erreur\",IF(AND(D33-C33>0,F33-E33=0),G33-Calendrier!$AS$9/2-M33,IF(AND(F33-E33>0,D33-C33=0),(F33-E33)-Calendrier!$AS$9/2-M33,IF(COUNTA(C33:F33)=4,(D33-C33)+(F33-E33)-M33-Calendrier!$AS$9,0))))","v":0},0,{"$f":"IF(AND(COUNTA(C33:F33)=0,B33<>\"T\"),B33,IF(AND(OR(B33=$F$9,B33=$F$10),COUNTA(C33:F33=2)),\"T\",IF(G33>=6,\"T\",\"\")))","v":"RTT"},0,null,0]
[16,{"$f":"INDIRECT(ADDRESS(MATCH($B$1,Calendrier!$A$15:$A$59,0)+14,ROW()-17,3,1,\"Calendrier\"),1)","v":"Sa"},null,null,null,null,0,{"$f":"IF(AND(K34=0.5,COUNTA(C34:F34)=4),\"erreur\",IF(AND(D34-C34>0,F34-E34=0),G34-Calendrier!$AS$9/2-M34,IF(AND(F34-E34>0,D34-C34=0),(F34-E34)-Calendrier!$AS$9/2-M34,IF(COUNTA(C34:F34)=4,(D34-C34)+(F34-E34)-M34-Calendrier!$AS$9,0))))","v":0},0,"Sa",0,null,0]
[17,{"$f":"INDIRECT(ADDRESS(MATCH($B$1,Calendrier!$A$15:$A$59,0)+14,ROW()-17,3,1,\"Calendrier\"),1)","v":"Di"},null,null,null,null,0,{"$f":"IF(AND(K35=0.5,COUNTA(C35:F35)=4),\"erreur\",IF(AND(D35-C35>0,F35-E35=0),G35-Calendrier!$AS$9/2-M35,IF(AND(F35-E35>0,D35-C35=0),(F35-E35)-Calendrier!$AS$9/2-M35,IF(COUNTA(C35:F35)=4,(D35-C35)+(F35-E35)-M35-Calendrier!$AS$9,0))))","v":0},0,"Di",0,null,0]
[18,{"$f":"INDIRECT(ADDRESS(MATCH($B$1,Calendrier!$A$15:$A$59,0)+14,ROW()-17,3,1,\"Calendrier\"),1)","v":"T"},null,null,null,null,0,{"$f":"IF(AND(K36=0.5,COUNTA(C36:F36)=4),\"erreur\",IF(AND(D36-C36>0,F36-E36=0),G36-Calendrier!$AS$9/2-M36,IF(AND(F36-E36>0,D36-C36=0),(F36-E36)-Calendrier!$AS$9/2-M36,IF(COUNTA(C36:F36)=4,(D36-C36)+(F36-E36)-M36-Calendrier!$AS$9,0))))","v":0},0,"",0,null,0]
[19,{"$f":"INDIRECT(ADDRESS(MATCH($B$1,Calendrier!$A$15:$A$59,0)+14,ROW()-17,3,1,\"Calendrier\"),1)","v":"T"},null,null,null,null,0,{"$f":"IF(AND(K37=0.5,COUNTA(C37:F37)=4),\"erreur\",IF(AND(D37-C37>0,F37-E37=0),G37-Calendrier!$AS$9/2-M37,IF(AND(F37-E37>0,D37-C37=0),(F37-E37)-Calendrier!$AS$9/2-M37,IF(COUNTA(C37:F37)=4,(D37-C37)+(F37-E37)-M37-Calendrier!$AS$9,0))))","v":0},0,"",0,null,0]
[20,{"$f":"INDIRECT(ADDRESS(MATCH($B$1,Calendrier!$A$15:$A$59,0)+14,ROW()-17,3,1,\"Calendrier\"),1)","v":"T"},null,null,null,null,0,{"$f":"IF(AND(K38=0.5,COUNTA(C38:F38)=4),\"erreur\",IF(AND(D38-C38>0,F38-E38=0),G38-Calendrier!$AS$9/2-M38,IF(AND(F38-E38>0,D38-C38=0),(F38-E38)-Calendrier!$AS$9/2-M38,IF(COUNTA(C38:F38)=4,(D38-C38)+(F38-E38)-M38-Calendrier!$AS$9,0))))","v":0},0,"",0,null,0]
[21,{"$f":"INDIRECT(ADDRESS(MATCH($B$1,Calendrier!$A$15:$A$59,0)+14,ROW()-17,3,1,\"Calendrier\"),1)","v":"T"},null,null,null,null,0,{"$f":"IF(AND(K39=0.5,COUNTA(C39:F39)=4),\"erreur\",IF(AND(D39-C39>0,F39-E39=0),G39-Calendrier!$AS$9/2-M39,IF(AND(F39-E39>0,D39-C39=0),(F39-E39)-Calendrier!$AS$9/2-M39,IF(COUNTA(C39:F39)=4,(D39-C39)+(F39-E39)-M39-Calendrier!$AS$9,0))))","v":0},0,"",0,null,0]
[22,{"$f":"INDIRECT(ADDRESS(MATCH($B$1,Calendrier!$A$15:$A$59,0)+14,ROW()-17,3,1,\"Calendrier\"),1)","v":"T"},null,null,null,null,0,{"$f":"IF(AND(K40=0.5,COUNTA(C40:F40)=4),\"erreur\",IF(AND(D40-C40>0,F40-E40=0),G40-Calendrier!$AS$9/2-M40,IF(AND(F40-E40>0,D40-C40=0),(F40-E40)-Calendrier!$AS$9/2-M40,IF(COUNTA(C40:F40)=4,(D40-C40)+(F40-E40)-M40-Calendrier!$AS$9,0))))","v":0},0,"",0,null,0]
[23,{"$f":"INDIRECT(ADDRESS(MATCH($B$1,Calendrier!$A$15:$A$59,0)+14,ROW()-17,3,1,\"Calendrier\"),1)","v":"Sa"},null,null,null,null,0,{"$f":"IF(AND(K41=0.5,COUNTA(C41:F41)=4),\"erreur\",IF(AND(D41-C41>0,F41-E41=0),G41-Calendrier!$AS$9/2-M41,IF(AND(F41-E41>0,D41-C41=0),(F41-E41)-Calendrier!$AS$9/2-M41,IF(COUNTA(C41:F41)=4,(D41-C41)+(F41-E41)-M41-Calendrier!$AS$9,0))))","v":0},0,"Sa",0,null,0]
[24,{"$f":"INDIRECT(ADDRESS(MATCH($B$1,Calendrier!$A$15:$A$59,0)+14,ROW()-17,3,1,\"Calendrier\"),1)","v":"Di"},null,null,null,null,0,{"$f":"IF(AND(K42=0.5,COUNTA(C42:F42)=4),\"erreur\",IF(AND(D42-C42>0,F42-E42=0),G42-Calendrier!$AS$9/2-M42,IF(AND(F42-E42>0,D42-C42=0),(F42-E42)-Calendrier!$AS$9/2-M42,IF(COUNTA(C42:F42)=4,(D42-C42)+(F42-E42)-M42-Calendrier!$AS$9,0))))","v":0},0,"Di",0,null,0]
[25,{"$f":"INDIRECT(ADDRESS(MATCH($B$1,Calendrier!$A$15:$A$59,0)+14,ROW()-17,3,1,\"Calendrier\"),1)","v":"T"},null,null,null,null,0,{"$f":"IF(AND(K43=0.5,COUNTA(C43:F43)=4),\"erreur\",IF(AND(D43-C43>0,F43-E43=0),G43-Calendrier!$AS$9/2-M43,IF(AND(F43-E43>0,D43-C43=0),(F43-E43)-Calendrier!$AS$9/2-M43,IF(COUNTA(C43:F43)=4,(D43-C43)+(F43-E43)-M43-Calendrier!$AS$9,0))))","v":0},0,"",0,null,0]
[26,{"$f":"INDIRECT(ADDRESS(MATCH($B$1,Calendrier!$A$15:$A$59,0)+14,ROW()-17,3,1,\"Calendrier\"),1)","v":"T"},null,null,null,null,0,{"$f":"IF(AND(K44=0.5,COUNTA(C44:F44)=4),\"erreur\",IF(AND(D44-C44>0,F44-E44=0),G44-Calendrier!$AS$9/2-M44,IF(AND(F44-E44>0,D44-C44=0),(F44-E44)-Calendrier!$AS$9/2-M44,IF(COUNTA(C44:F44)=4,(D44-C44)+(F44-E44)-M44-Calendrier!$AS$9,0))))","v":0},0,"",0,null,0]
[27,{"$f":"INDIRECT(ADDRESS(MATCH($B$1,Calendrier!$A$15:$A$59,0)+14,ROW()-17,3,1,\"Calendrier\"),1)","v":"T"},null,null,null,null,0,{"$f":"IF(AND(K45=0.5,COUNTA(C45:F45)=4),\"erreur\",IF(AND(D45-C45>0,F45-E45=0),G45-Calendrier!$AS$9/2-M45,IF(AND(F45-E45>0,D45-C45=0),(F45-E45)-Calendrier!$AS$9/2-M45,IF(COUNTA(C45:F45)=4,(D45-C45)+(F45-E45)-M45-Calendrier!$AS$9,0))))","v":0},0,"",0,null,0]
[28,{"$f":"INDIRECT(ADDRESS(MATCH($B$1,Calendrier!$A$15:$A$59,0)+14,ROW()-17,3,1,\"Calendrier\"),1)","v":"T"},null,null,null,null,0,{"$f":"IF(AND(K46=0.5,COUNTA(C46:F46)=4),\"erreur\",IF(AND(D46-C46>0,F46-E46=0),G46-Calendrier!$AS$9/2-M46,IF(AND(F46-E46>0,D46-C46=0),(F46-E46)-Calendrier!$AS$9/2-M46,IF(COUNTA(C46:F46)=4,(D46-C46)+(F46-E46)-M46-Calendrier!$AS$9,0))))","v":0},0,"",0,null,0]
[29,{"$f":"INDIRECT(ADDRESS(MATCH($B$1,Calendrier!$A$15:$A$59,0)+14,ROW()-17,3,1,\"Calendrier\"),1)","v":"RTT"},null,null,null,null,0,{"$f":"IF(AND(K47=0.5,COUNTA(C47:F47)=4),\"erreur\",IF(AND(D47-C47>0,F47-E47=0),G47-Calendrier!$AS$9/2-M47,IF(AND(F47-E47>0,D47-C47=0),(F47-E47)-Calendrier!$AS$9/2-M47,IF(COUNTA(C47:F47)=4,(D47-C47)+(F47-E47)-M47-Calendrier!$AS$9,0))))","v":0},0,"RTT",0,null,0]
[30,{"$f":"INDIRECT(ADDRESS(MATCH($B$1,Calendrier!$A$15:$A$59,0)+14,ROW()-17,3,1,\"Calendrier\"),1)","v":"Sa"},null,null,null,null,0,{"$f":"IF(AND(K48=0.5,COUNTA(C48:F48)=4),\"erreur\",IF(AND(D48-C48>0,F48-E48=0),G48-Calendrier!$AS$9/2-M48,IF(AND(F48-E48>0,D48-C48=0),(F48-E48)-Calendrier!$AS$9/2-M48,IF(COUNTA(C48:F48)=4,(D48-C48)+(F48-E48)-M48-Calendrier!$AS$9,0))))","v":0},0,"Sa",0,null,0]
[31,{"$f":"INDIRECT(ADDRESS(MATCH($B$1,Calendrier!$A$15:$A$59,0)+14,ROW()-17,3,1,\"Calendrier\"),1)","v":"Di"},null,null,null,null,0,{"$f":"IF(AND(K49=0.5,COUNTA(C49:F49)=4),\"erreur\",IF(AND(D49-C49>0,F49-E49=0),G49-Calendrier!$AS$9/2-M49,IF(AND(F49-E49>0,D49-C49=0),(F49-E49)-Calendrier!$AS$9/2-M49,IF(COUNTA(C49:F49)=4,(D49-C49)+(F49-E49)-M49-Calendrier!$AS$9,0))))","v":0},0,"Di",0,null,0]
[null,null,null,null,null,null,null,"solde des variations",{"$f":"I49","v":0}]

{"sheet":"FEV","index":2,"n_rows":50,"n_cols":15,"rows_kept":50,"cut":false,"hidden":false,"merged":[]}
[null,{"$f":"RIGHT(CELL(\"nomfichier\",$A$1),3)","v":"FEV"},"FICHE DE SUIVI HORAIRE"]
[]
[null,"mois :","FEVRIER",null,null,"année ",{"$f":"Calendrier!A1","v":2016},null,"service",{"$f":"Calendrier!F4","v":"COMPTABILITE"}]
[]
[null,"nom :",{"$f":"Calendrier!F2","v":"MARTIN"},null,null," prénom ",{"$f":"Calendrier!F3","v":"PATRICK"},null,"N° Ident.",{"$f":"Calendrier!F1","v":"N123456"}]
[null,null,null,null,null,null,null,"à réaliser","cumul","en cours","reste",null,"n/cumul"]
[null,null,null,"Nb J/T",{"$f":"Calendrier!$A$10","v":213},{"$f":"+$H$10","v":0},{"$f":"$H$12","v":213},{"$f":"Calendrier!$N$1","v":366},{"$f":"JAN!M7","v":13},{"$f":"SUM(J8:J15)","v":10},{"$f":"H7-(I7+J7)","v":343},null,{"$f":"SUM(M8:M15)","v":23}]
[null,null,null,null,null,null,"CA",{"$f":"Calendrier!N5","v":25},{"$f":"JAN!M8","v":0},{"$f":"IF(G8=\"\",0,COUNTIF($J$19:$J$49,G8))+IF(F8=\"\",0,COUNTIF($J$19:$J$49,F8)/2)","v":0},{"$f":"+H8-(I8+J8)","v":25},"J",{"$f":"+I8+J8","v":0}]
[null,null,null,null,null,"1/2RTT","RTT",{"$f":"Calendrier!N8","v":16},{"$f":"JAN!M9","v":2},{"$f":"IF(G9=\"\",0,COUNTIF($J$19:$J$49,G9))+IF(F9=\"\",0,COUNTIF($J$19:$J$49,F9)/2)","v":2},{"$f":"+H9-(I9+J9)","v":12},"J",4]
[null,null,null,null,null,"1/2CS","CS",{"$f":"Calendrier!N9","v":0},{"$f":"JAN!M10","v":0},{"$f":"IF(G10=\"\",0,COUNTIF($J$19:$J$49,G10))+IF(F10=\"\",0,COUNTIF($J$19:$J$49,F10)/2)","v":0},{"$f":"H10-(I10+J10)","v":0},"J",0]
[null,null,null,null,null,null,"CP",{"$f":"Calendrier!N6","v":0},{"$f":"JAN!M11","v":0},0,{"$f":"H11-(I11+J11)","v":0},"J",0]
[null,null,null,null,null,"1/2T","T",{"$f":"Calendrier!N7","v":213},{"$f":"JAN!M12","v":0},0,{"$f":"H12-(I12+J12)","v":213},"J",0]
[null,null,null,null,null,null,"Sa",{"$f":"Calendrier!N4","v":53},{"$f":"JAN!M13","v":5},4,{"$f":"+H13-(I13+J13)","v":44},"J",9]
[null,null,null,null,null,null,"Di",{"$f":"Calendrier!N3","v":47},{"$f":"JAN!M14","v":5},4,{"$f":"+H14-(I14+J14)","v":38},"J",9]
[null,null,null,null,null,null,"F",{"$f":"Calendrier!N2","v":12},{"$f":"JAN!M15","v":1},0,{"$f":"+H15-(I15+J15)","v":11},"J",{"$f":"+I15+J15","v":1}]
[null,null,null,null,null,null,"heure/avance fin mois",null,{"$f":"JAN!I50","v":0},null,null,null,{"$f":"I50","v":0}]
[null,"Prévu","Entrée","Sortie","Entrée","Sortie","total J","variation","cumul","Type","nb J/T",null,"Bon E/S","Sortie","Retour"]
[null,null,null,null,null,null,null,null,null,null,null,null,null,"avec bon"]
[1,{"$f":"INDIRECT(ADDRESS(MATCH($B$1,Calendrier!$A$15:$A$59,0)+14,ROW()-17,3,1,\"Calendrier\"),1)","v":"T"},null,null,null,null,{"$f":"IF(COUNTA(C19:F19)=4,(D19-C19)+(F19-E19)-M19,IF(COUNTA(C19:D19)<2,(F19-E19)-M19,(D19-C19)-M19))","v":0},{"$f":"IF(AND(K19=0.5,COUNTA(C19:F19)=4),\"erreur\",IF(AND(D19-C19>0,F19-E19=0),G19-Calendrier!$AS$9/2-M19,IF(AND(F19-E19>0,D19-C19=0),(F19-E19)-Calendrier!$AS$9/2-M19,IF(COUNTA(C19:F19)=4,(D19-C19)+(F19-E19)-M19-Calendrier!$AS$9,0))))","v":0},{"$f":"+I18+I16","v":0},{"$f":"IF(AND(COUNTA(C19:F19)=0,B19<>\"T\"),B19,IF(AND(OR(B19=$F$9,B19=$F$10),COUNTA(C19:F19=2)),\"T\",IF(G19>=6,\"T\",\"\")))","v":""},{"$f":"IF(OR(B19=$F$9,B19=$F$10),0.5,IF(G19>=6,1,0))","v":0},null,{"$f":"+O19-N19","v":0}]
[2,{"$f":"INDIRECT(ADDRESS(MATCH($B$1,Calendrier!$A$15:$A$59,0)+14,ROW()-17,3,1,\"Calendrier\"),1)","v":"T"},null,null,null,null,0,{"$f":"IF(AND(K20=0.5,COUNTA(C20:F20)=4),\"erreur\",IF(AND(D20-C20>0,F20-E20=0),G20-Calendrier!$AS$9/2-M20,IF(AND(F20-E20>0,D20-C20=0),(F20-E20)-Calendrier!$AS$9/2-M20,IF(COUNTA(C20:F20)=4,(D20-C20)+(F20-E20)-M20-Calendrier!$AS$9,0))))","v":0},{"$f":"+I19+H20","v":0},"",0,null,{"$f":"+O20-N20","v":0}]
[3,{"$f":"INDIRECT(ADDRESS(MATCH($B$1,Calendrier!$A$15:$A$59,0)+14,ROW()-17,3,1,\"Calendrier\"),1)","v":"T"},null,null,null,null,0,{"$f":"IF(AND(K21=0.5,COUNTA(C21:F21)=4),\"erreur\",IF(AND(D21-C21>0,F21-E21=0),G21-Calendrier!$AS$9/2-M21,IF(AND(F21-E21>0,D21-C21=0),(F21-E21)-Calendrier!$AS$9/2-M21,IF(COUNTA(C21:F21)=4,(D21-C21)+(F21-E21)-M21-Calendrier!$AS$9,0))))","v":0},0,"",0,null,0]
[4,{"$f":"INDIRECT(ADDRESS(MATCH($B$1,Calendrier!$A$15:$A$59,0)+14,ROW()-17,3,1,\"Calendrier\"),1)","v":"T"},null,null,null,null,0,{"$f":"IF(AND(K22=0.5,COUNTA(C22:F22)=4),\"erreur\",IF(AND(D22-C22>0,F22-E22=0),G22-Calendrier!$AS$9/2-M22,IF(AND(F22-E22>0,D22-C22=0),(F22-E22)-Calendrier!$AS$9/2-M22,IF(COUNTA(C22:F22)=4,(D22-C22)+(F22-E22)-M22-Calendrier!$AS$9,0))))","v":0},0,"",0,null,0]
[5,{"$f":"INDIRECT(ADDRESS(MATCH($B$1,Calendrier!$A$15:$A$59,0)+14,ROW()-17,3,1,\"Calendrier\"),1)","v":"T"},null,null,null,null,0,{"$f":"IF(AND(K23=0.5,COUNTA(C23:F23)=4),\"erreur\",IF(AND(D23-C23>0,F23-E23=0),G23-Calendrier!$AS$9/2-M23,IF(AND(F23-E23>0,D23-C23=0),(F23-E23)-Calendrier!$AS$9/2-M23,IF(COUNTA(C23:F23)=4,(D23-C23)+(F23-E23)-M23-Calendrier!$AS$9,0))))","v":0},0,"",{"$f":"IF(OR(B23=$F$9,B23=$F$10),0.5,IF(G23>=6,1,0))","v":0},null,0]
[6,{"$f":"INDIRECT(ADDRESS(MATCH($B$1,Calendrier!$A$15:$A$59,0)+14,ROW()-17,3,1,\"Calendrier\"),1)","v":"Sa"},null,null,null,null,0,{"$f":"IF(AND(K24=0.5,COUNTA(C24:F24)=4),\"erreur\",IF(AND(D24-C24>0,F24-E24=0),G24-Calendrier!$AS$9/2-M24,IF(AND(F24-E24>0,D24-C24=0),(F24-E24)-Calendrier!$AS$9/2-M24,IF(COUNTA(C24:F24)=4,(D24-C24)+(F24-E24)-M24-Calendrier!$AS$9,0))))","v":0},0,"Sa",0,null,0]
[7,{"$f":"INDIRECT(ADDRESS(MATCH($B$1,Calendrier!$A$15:$A$59,0)+14,ROW()-17,3,1,\"Calendrier\"),1)","v":"Di"},null,null,null,null,0,{"$f":"IF(AND(K25=0.5,COUNTA(C25:F25)=4),\"erreur\",IF(AND(D25-C25>0,F25-E25=0),G25-Calendrier!$AS$9/2-M25,IF(AND(F25-E25>0,D25-C25=0),(F25-E25)-Calendrier!$AS$9/2-M25,IF(COUNTA(C25:F25)=4,(D25-C25)+(F25-E25)-M25-Calendrier!$AS$9,0))))","v":0},0,"Di",0,null,0]
[8,{"$f":"INDIRECT(ADDRESS(MATCH($B$1,Calendrier!$A$15:$A$59,0)+14,ROW()-17,3,1,\"Calendrier\"),1)","v":"T"},null,null,null,null,0,{"$f":"IF(AND(K26=0.5,COUNTA(C26:F26)=4),\"erreur\",IF(AND(D26-C26>0,F26-E26=0),G26-Calendrier!$AS$9/2-M26,IF(AND(F26-E26>0,D26-C26=0),(F26-E26)-Calendrier!$AS$9/2-M26,IF(COUNTA(C26:F26)=4,(D26-C26)+(F26-E26)-M26-Calendrier!$AS$9,0))))","v":0},0,"",0,null,0]
[9,{"$f":"INDIRECT(ADDRESS(MATCH($B$1,Calendrier!$A$15:$A$59,0)+14,ROW()-17,3,1,\"Calendrier\"),1)","v":"T"},null,null,null,null,0,{"$f":"IF(AND(K27=0.5,COUNTA(C27:F27)=4),\"erreur\",IF(AND(D27-C27>0,F27-E27=0),G27-Calendrier!$AS$9/2-M27,IF(AND(F27-E27>0,D27-C27=0),(F27-E27)-Calendrier!$AS$9/2-M27,IF(COUNTA(C27:F27)=4,(D27-C27)+(F27-E27)-M27-Calendrier!$AS$9,0))))","v":0},0,"",0,null,0]
[10,{"$f":"INDIRECT(ADDRESS(MATCH($B$1,Calendrier!$A$15:$A$59,0)+14,ROW()-17,3,1,\"Calendrier\"),1)","v":"T"},null,null,null,null,0,{"$f":"IF(AND(K28=0.5,COUNTA(C28:F28)=4),\"erreur\",IF(AND(D28-C28>0,F28-E28=0),G28-Calendrier!$AS$9/2-M28,IF(AND(F28-E28>0,D28-C28=0),(F28-E28)-Calendrier!$AS$9/2-M28,IF(COUNTA(C28:F28)=4,(D28-C28)+(F28-E28)-M28-Calendrier!$AS$9,0))))","v":0},0,"",0,null,0]
[11,{"$f":"INDIRECT(ADDRESS(MATCH($B$1,Calendrier!$A$15:$A$59,0)+14,ROW()-17,3,1,\"Calendrier\"),1)","v":"T"},null,null,null,null,0,{"$f":"IF(AND(K29=0.5,COUNTA(C29:F29)=4),\"erreur\",IF(AND(D29-C29>0,F29-E29=0),G29-Calendrier!$AS$9/2-M29,IF(AND(F29-E29>0,D29-C29=0),(F29-E29)-Calendrier!$AS$9/2-M29,IF(COUNTA(C29:F29)=4,(D29-C29)+(F29-E29)-M29-Calendrier!$AS$9,0))))","v":0},0,"",0,null,0]
[12,{"$f":"INDIRECT(ADDRESS(MATCH($B$1,Calendrier!$A$15:$A$59,0)+14,ROW()-17,3,1,\"Calendrier\"),1)","v":"T"},null,null,null,null,0,{"$f":"IF(AND(K30=0.5,COUNTA(C30:F30)=4),\"erreur\",IF(AND(D30-C30>0,F30-E30=0),G30-Calendrier!$AS$9/2-M30,IF(AND(F30-E30>0,D30-C30=0),(F30-E30)-Calendrier!$AS$9/2-M30,IF(COUNTA(C30:F30)=4,(D30-C30)+(F30-E30)-M30-Calendrier!$AS$9,0))))","v":0},0,"",0,null,0]
[13,{"$f":"INDIRECT(ADDRESS(MATCH($B$1,Calendrier!$A$15:$A$59,0)+14,ROW()-17,3,1,\"Calendrier\"),1)","v":"Sa"},null,null,null,null,0,{"$f":"IF(AND(K31=0.5,COUNTA(C31:F31)=4),\"erreur\",IF(AND(D31-C31>0,F31-E31=0),G31-Calendrier!$AS$9/2-M31,IF(AND(F31-E31>0,D31-C31=0),(F31-E31)-Calendrier!$AS$9/2-M31,IF(COUNTA(C31:F31)=4,(D31-C31)+(F31-E31)-M31-Calendrier!$AS$9,0))))","v":0},0,"Sa",0,null,0]
[14,{"$f":"INDIRECT(ADDRESS(MATCH($B$1,Calendrier!$A$15:$A$59,0)+14,ROW()-17,3,1,\"Calendrier\"),1)","v":"Di"},null,null,null,null,0,{"$f":"IF(AND(K32=0.5,COUNTA(C32:F32)=4),\"erreur\",IF(AND(D32-C32>0,F32-E32=0),G32-Calendrier!$AS$9/2-M32,IF(AND(F32-E32>0,D32-C32=0),(F32-E32)-Calendrier!$AS$9/2-M32,IF(COUNTA(C32:F32)=4,(D32-C32)+(F32-E32)-M32-Calendrier!$AS$9,0))))","v":0},0,"Di",0,null,0]
[15,{"$f":"INDIRECT(ADDRESS(MATCH($B$1,Calendrier!$A$15:$A$59,0)+14,ROW()-17,3,1,\"Calendrier\"),1)","v":"RTT"},null,null,null,null,0,{"$f":"IF(AND(K33=0.5,COUNTA(C33:F33)=4),\"erreur\",IF(AND(D33-C33>0,F33-E33=0),G33-Calendrier!$AS$9/2-M33,IF(AND(F33-E33>0,D33-C33=0),(F33-E33)-Calendrier!$AS$9/2-M33,IF(COUNTA(C33:F33)=4,(D33-C33)+(F33-E33)-M33-Calendrier!$AS$9,0))))","v":0},0,{"$f":"IF(AND(COUNTA(C33:F33)=0,B33<>\"T\"),B33,IF(AND(OR(B33=$F$9,B33=$F$10),COUNTA(C33:F33=2)),\"T\",IF(G33>=6,\"T\",\"\")))","v":"RTT"},0,null,0]
[16,{"$f":"INDIRECT(ADDRESS(MATCH($B$1,Calendrier!$A$15:$A$59,0)+14,ROW()-17,3,1,\"Calendrier\"),1)","v":"T"},null,null,null,null,0,{"$f":"IF(AND(K34=0.5,COUNTA(C34:F34)=4),\"erreur\",IF(AND(D34-C34>0,F34-E34=0),G34-Calendrier!$AS$9/2-M34,IF(AND(F34-E34>0,D34-C34=0),(F34-E34)-Calendrier!$AS$9/2-M34,IF(COUNTA(C34:F34)=4,(D34-C34)+(F34-E34)-M34-Calendrier!$AS$9,0))))","v":0},0,"",0,null,0]
[17,{"$f":"INDIRECT(ADDRESS(MATCH($B$1,Calendrier!$A$15:$A$59,0)+14,ROW()-17,3,1,\"Calendrier\"),1)","v":"T"},null,null,null,null,0,{"$f":"IF(AND(K35=0.5,COUNTA(C35:F35)=4),\"erreur\",IF(AND(D35-C35>0,F35-E35=0),G35-Calendrier!$AS$9/2-M35,IF(AND(F35-E35>0,D35-C35=0),(F35-E35)-Calendrier!$AS$9/2-M35,IF(COUNTA(C35:F35)=4,(D35-C35)+(F35-E35)-M35-Calendrier!$AS$9,0))))","v":0},0,"",0,null,0]
[18,{"$f":"INDIRECT(ADDRESS(MATCH($B$1,Calendrier!$A$15:$A$59,0)+14,ROW()-17,3,1,\"Calendrier\"),1)","v":"T"},null,null,null,null,0,{"$f":"IF(AND(K36=0.5,COUNTA(C36:F36)=4),\"erreur\",IF(AND(D36-C36>0,F36-E36=0),G36-Calendrier!$AS$9/2-M36,IF(AND(F36-E36>0,D36-C36=0),(F36-E36)-Calendrier!$AS$9/2-M36,IF(COUNTA(C36:F36)=4,(D36-C36)+(F36-E36)-M36-Calendrier!$AS$9,0))))","v":0},0,"",0,null,0]
[19,{"$f":"INDIRECT(ADDRESS(MATCH($B$1,Calendrier!$A$15:$A$59,0)+14,ROW()-17,3,1,\"Calendrier\"),1)","v":"T"},null,null,null,null,0,{"$f":"IF(AND(K37=0.5,COUNTA(C37:F37)=4),\"erreur\",IF(AND(D37-C37>0,F37-E37=0),G37-Calendrier!$AS$9/2-M37,IF(AND(F37-E37>0,D37-C37=0),(F37-E37)-Calendrier!$AS$9/2-M37,IF(COUNTA(C37:F37)=4,(D37-C37)+(F37-E37)-M37-Calendrier!$AS$9,0))))","v":0},0,"",0,null,0]
[20,{"$f":"INDIRECT(ADDRESS(MATCH($B$1,Calendrier!$A$15:$A$59,0)+14,ROW()-17,3,1,\"Calendrier\"),1)","v":"Sa"},null,null,null,null,0,{"$f":"IF(AND(K38=0.5,COUNTA(C38:F38)=4),\"erreur\",IF(AND(D38-C38>0,F38-E38=0),G38-Calendrier!$AS$9/2-M38,IF(AND(F38-E38>0,D38-C38=0),(F38-E38)-Calendrier!$AS$9/2-M38,IF(COUNTA(C38:F38)=4,(D38-C38)+(F38-E38)-M38-Calendrier!$AS$9,0))))","v":0},0,"Sa",0,null,0]
[21,{"$f":"INDIRECT(ADDRESS(MATCH($B$1,Calendrier!$A$15:$A$59,0)+14,ROW()-17,3,1,\"Calendrier\"),1)","v":"Di"},null,null,null,null,0,{"$f":"IF(AND(K39=0.5,COUNTA(C39:F39)=4),\"erreur\",IF(AND(D39-C39>0,F39-E39=0),G39-Calendrier!$AS$9/2-M39,IF(AND(F39-E39>0,D39-C39=0),(F39-E39)-Calendrier!$AS$9/2-M39,IF(COUNTA(C39:F39)=4,(D39-C39)+(F39-E39)-M39-Calendrier!$AS$9,0))))","v":0},0,"Di",0,null,0]
[22,{"$f":"INDIRECT(ADDRESS(MATCH($B$1,Calendrier!$A$15:$A$59,0)+14,ROW()-17,3,1,\"Calendrier\"),1)","v":"T"},null,null,null,null,0,{"$f":"IF(AND(K40=0.5,COUNTA(C40:F40)=4),\"erreur\",IF(AND(D40-C40>0,F40-E40=0),G40-Calendrier!$AS$9/2-M40,IF(AND(F40-E40>0,D40-C40=0),(F40-E40)-Calendrier!$AS$9/2-M40,IF(COUNTA(C40:F40)=4,(D40-C40)+(F40-E40)-M40-Calendrier!$AS$9,0))))","v":0},0,"",0,null,0]
[23,{"$f":"INDIRECT(ADDRESS(MATCH($B$1,Calendrier!$A$15:$A$59,0)+14,ROW()-17,3,1,\"Calendrier\"),1)","v":"T"},null,null,null,null,0,{"$f":"IF(AND(K41=0.5,COUNTA(C41:F41)=4),\"erreur\",IF(AND(D41-C41>0,F41-E41=0),G41-Calendrier!$AS$9/2-M41,IF(AND(F41-E41>0,D41-C41=0),(F41-E41)-Calendrier!$AS$9/2-M41,IF(COUNTA(C41:F41)=4,(D41-C41)+(F41-E41)-M41-Calendrier!$AS$9,0))))","v":0},0,"",0,null,0]
[24,{"$f":"INDIRECT(ADDRESS(MATCH($B$1,Calendrier!$A$15:$A$59,0)+14,ROW()-17,3,1,\"Calendrier\"),1)","v":"T"},null,null,null,null,0,{"$f":"IF(AND(K42=0.5,COUNTA(C42:F42)=4),\"erreur\",IF(AND(D42-C42>0,F42-E42=0),G42-Calendrier!$AS$9/2-M42,IF(AND(F42-E42>0,D42-C42=0),(F42-E42)-Calendrier!$AS$9/2-M42,IF(COUNTA(C42:F42)=4,(D42-C42)+(F42-E42)-M42-Calendrier!$AS$9,0))))","v":0},0,"",0,null,0]
[25,{"$f":"INDIRECT(ADDRESS(MATCH($B$1,Calendrier!$A$15:$A$59,0)+14,ROW()-17,3,1,\"Calendrier\"),1)","v":"T"},null,null,null,null,0,{"$f":"IF(AND(K43=0.5,COUNTA(C43:F43)=4),\"erreur\",IF(AND(D43-C43>0,F43-E43=0),G43-Calendrier!$AS$9/2-M43,IF(AND(F43-E43>0,D43-C43=0),(F43-E43)-Calendrier!$AS$9/2-M43,IF(COUNTA(C43:F43)=4,(D43-C43)+(F43-E43)-M43-Calendrier!$AS$9,0))))","v":0},0,"",0,null,0]
[26,{"$f":"INDIRECT(ADDRESS(MATCH($B$1,Calendrier!$A$15:$A$59,0)+14,ROW()-17,3,1,\"Calendrier\"),1)","v":"RTT"},null,null,null,null,0,{"$f":"IF(AND(K44=0.5,COUNTA(C44:F44)=4),\"erreur\",IF(AND(D44-C44>0,F44-E44=0),G44-Calendrier!$AS$9/2-M44,IF(AND(F44-E44>0,D44-C44=0),(F44-E44)-Calendrier!$AS$9/2-M44,IF(COUNTA(C44:F44)=4,(D44-C44)+(F44-E44)-M44-Calendrier!$AS$9,0))))","v":0},0,"RTT",0,null,0]
[27,{"$f":"INDIRECT(ADDRESS(MATCH($B$1,Calendrier!$A$15:$A$59,0)+14,ROW()-17,3,1,\"Calendrier\"),1)","v":"Sa"},null,null,null,null,0,{"$f":"IF(AND(K45=0.5,COUNTA(C45:F45)=4),\"erreur\",IF(AND(D45-C45>0,F45-E45=0),G45-Calendrier!$AS$9/2-M45,IF(AND(F45-E45>0,D45-C45=0),(F45-E45)-Calendrier!$AS$9/2-M45,IF(COUNTA(C45:F45)=4,(D45-C45)+(F45-E45)-M45-Calendrier!$AS$9,0))))","v":0},0,"Sa",0,null,0]
[28,{"$f":"INDIRECT(ADDRESS(MATCH($B$1,Calendrier!$A$15:$A$59,0)+14,ROW()-17,3,1,\"Calendrier\"),1)","v":"Di"},null,null,null,null,0,{"$f":"IF(AND(K46=0.5,COUNTA(C46:F46)=4),\"erreur\",IF(AND(D46-C46>0,F46-E46=0),G46-Calendrier!$AS$9/2-M46,IF(AND(F46-E46>0,D46-C46=0),(F46-E46)-Calendrier!$AS$9/2-M46,IF(COUNTA(C46:F46)=4,(D46-C46)+(F46-E46)-M46-Calendrier!$AS$9,0))))","v":0},0,"Di",0,null,0]
[{"$f":"IF(Calendrier!AD17<>\"\",29,\"\")","v":29},{"$f":"INDIRECT(ADDRESS(MATCH($B$1,Calendrier!$A$15:$A$59,0)+14,ROW()-17,3,1,\"Calendrier\"),1)","v":"T"},null,null,null,null,0,{"$f":"IF(AND(K47=0.5,COUNTA(C47:F47)=4),\"erreur\",IF(AND(D47-C47>0,F47-E47=0),G47-Calendrier!$AS$9/2-M47,IF(AND(F47-E47>0,D47-C47=0),(F47-E47)-Calendrier!$AS$9/2-M47,IF(COUNTA(C47:F47)=4,(D47-C47)+(F47-E47)-M47-Calendrier!$AS$9,0))))","v":0},0,"",0,null,0]
[null,null,null,null,null,null,null,null,0,null,null,null,0]
[null,null,null,null,null,null,null,null,0,null,null,null,0]
[null,null,null,null,null,null,null,"solde des variations",{"$f":"I49","v":0}]

{"sheet":"MAR","index":3,"n_rows":50,"n_cols":15,"rows_kept":50,"cut":false,"hidden":false,"merged":[]}
[null,{"$f":"RIGHT(CELL(\"nomfichier\",$A$1),3)","v":"MAR"},"FICHE DE SUIVI HORAIRE"]
[]
[null,"mois :","MARS",null,null,"année ",{"$f":"Calendrier!A1","v":2016},null,"service",{"$f":"Calendrier!F4","v":"COMPTABILITE"}]
[]
[null,"nom :",{"$f":"Calendrier!F2","v":"MARTIN"},null,null," prénom ",{"$f":"Calendrier!F3","v":"PATRICK"},null,"N° Ident.",{"$f":"Calendrier!F1","v":"N123456"}]
[null,null,null,null,null,null,null,"à réaliser","cumul","en cours","reste",null,"n/cumul"]
[null,null,null,"Nb J/T",{"$f":"Calendrier!$A$10","v":213},{"$f":"+$H$10","v":0},{"$f":"$H$12","v":213},{"$f":"Calendrier!$N$1","v":366},{"$f":"FEV!M7","v":23},{"$f":"SUM(J8:J15)","v":11},{"$f":"H7-(I7+J7)","v":332},null,{"$f":"SUM(M8:M15)","v":34}]
[null,null,null,null,null,null,"CA",{"$f":"Calendrier!N5","v":25},{"$f":"FEV!M8","v":0},{"$f":"IF(G8=\"\",0,COUNTIF($J$19:$J$49,G8))+IF(F8=\"\",0,COUNTIF($J$19:$J$49,F8)/2)","v":0},{"$f":"+H8-(I8+J8)","v":25},"J",{"$f":"+I8+J8","v":0}]
[null,null,null,null,null,"1/2RTT","RTT",{"$f":"Calendrier!N8","v":16},{"$f":"FEV!M9","v":4},{"$f":"IF(G9=\"\",0,COUNTIF($J$19:$J$49,G9))+IF(F9=\"\",0,COUNTIF($J$19:$J$49,F9)/2)","v":2},{"$f":"+H9-(I9+J9)","v":10},"J",6]
[null,null,null,null,null,"1/2CS","CS",{"$f":"Calendrier!N9","v":0},{"$f":"FEV!M10","v":0},{"$f":"IF(G10=\"\",0,COUNTIF($J$19:$J$49,G10))+IF(F10=\"\",0,COUNTIF($J$19:$J$49,F10)/2)","v":0},{"$f":"H10-(I10+J10)","v":0},"J",0]
[null,null,null,null,null,null,"CP",{"$f":"Calendrier!N6","v":0},{"$f":"FEV!M11","v":0},0,{"$f":"H11-(I11+J11)","v":0},"J",0]
[null,null,null,null,null,"1/2T","T",{"$f":"Calendrier!N7","v":213},{"$f":"FEV!M12","v":0},0,{"$f":"+H12-(I12+J12)","v":213},"J",0]
[null,null,null,null,null,null,"Sa",{"$f":"Calendrier!N4","v":53},{"$f":"FEV!M13","v":9},4,{"$f":"+H13-(I13+J13)","v":40},"J",13]
[null,null,null,null,null,null,"Di",{"$f":"Calendrier!N3","v":47},{"$f":"FEV!M14","v":9},3,{"$f":"+H14-(I14+J14)","v":35},"J",12]
[null,null,null,null,null,null,"F",{"$f":"Calendrier!N2","v":12},{"$f":"FEV!M15","v":1},2,{"$f":"+H15-(I15+J15)","v":9},"J",{"$f":"+I15+J15","v":3}]
[null,null,null,null,null,null,"heure/avance fin mois",null,{"$f":"FEV!I50","v":0},null,null,null,{"$f":"I50","v":0}]
[null,"Prévu","Entrée","Sortie","Entrée","Sortie","total J","variation","cumul","Type","nb J/T",null,"Bon E/S","Sortie","Retour"]
[null,null,null,null,null,null,null,null,null,null,null,null,null,"avec bon"]
[1,{"$f":"INDIRECT(ADDRESS(MATCH($B$1,Calendrier!$A$15:$A$59,0)+14,ROW()-17,3,1,\"Calendrier\"),1)","v":"T"},null,null,null,null,{"$f":"IF(COUNTA(C19:F19)=4,(D19-C19)+(F19-E19)-M19,IF(COUNTA(C19:D19)<2,(F19-E19)-M19,(D19-C19)-M19))","v":0},{"$f":"IF(AND(K19=0.5,COUNTA(C19:F19)=4),\"erreur\",IF(AND(D19-C19>0,F19-E19=0),G19-Calendrier!$AS$9/2-M19,IF(AND(F19-E19>0,D19-C19=0),(F19-E19)-Calendrier!$AS$9/2-M19,IF(COUNTA(C19:F19)=4,(D19-C19)+(F19-E19)-M19-Calendrier!$AS$9,0))))","v":0},{"$f":"+I16+H19","v":0},{"$f":"IF(AND(COUNTA(C19:F19)=0,B19<>\"T\"),B19,IF(AND(OR(B19=$F$9,B19=$F$10),COUNTA(C19:F19=2)),\"T\",IF(G19>=6,\"T\",\"\")))","v":""},{"$f":"IF(OR(B19=$F$9,B19=$F$10),0.5,IF(G19>=6,1,0))","v":0},null,{"$f":"+O19-N19","v":0}]
[2,{"$f":"INDIRECT(ADDRESS(MATCH($B$1,Calendrier!$A$15:$A$59,0)+14,ROW()-17,3,1,\"Calendrier\"),1)","v":"T"},null,null,null,null,0,{"$f":"IF(AND(K20=0.5,COUNTA(C20:F20)=4),\"erreur\",IF(AND(D20-C20>0,F20-E20=0),G20-Calendrier!$AS$9/2-M20,IF(AND(F20-E20>0,D20-C20=0),(F20-E20)-Calendrier!$AS$9/2-M20,IF(COUNTA(C20:F20)=4,(D20-C20)+(F20-E20)-M20-Calendrier!$AS$9,0))))","v":0},{"$f":"+I19+H20","v":0},"",0,null,{"$f":"+O20-N20","v":0}]
[3,{"$f":"INDIRECT(ADDRESS(MATCH($B$1,Calendrier!$A$15:$A$59,0)+14,ROW()-17,3,1,\"Calendrier\"),1)","v":"T"},null,null,null,null,0,{"$f":"IF(AND(K21=0.5,COUNTA(C21:F21)=4),\"erreur\",IF(AND(D21-C21>0,F21-E21=0),G21-Calendrier!$AS$9/2-M21,IF(AND(F21-E21>0,D21-C21=0),(F21-E21)-Calendrier!$AS$9/2-M21,IF(COUNTA(C21:F21)=4,(D21-C21)+(F21-E21)-M21-Calendrier!$AS$9,0))))","v":0},{"$f":"+I20+H21","v":0},"",0,null,0]
[4,{"$f":"INDIRECT(ADDRESS(MATCH($B$1,Calendrier!$A$15:$A$59,0)+14,ROW()-17,3,1,\"Calendrier\"),1)","v":"T"},null,null,null,null,0,{"$f":"IF(AND(K22=0.5,COUNTA(C22:F22)=4),\"erreur\",IF(AND(D22-C22>0,F22-E22=0),G22-Calendrier!$AS$9/2-M22,IF(AND(F22-E22>0,D22-C22=0),(F22-E22)-Calendrier!$AS$9/2-M22,IF(COUNTA(C22:F22)=4,(D22-C22)+(F22-E22)-M22-Calendrier!$AS$9,0))))","v":0},0,"",0,null,0]
[5,{"$f":"INDIRECT(ADDRESS(MATCH($B$1,Calendrier!$A$15:$A$59,0)+14,ROW()-17,3,1,\"Calendrier\"),1)","v":"Sa"},null,null,null,null,0,{"$f":"IF(AND(K23=0.5,COUNTA(C23:F23)=4),\"erreur\",IF(AND(D23-C23>0,F23-E23=0),G23-Calendrier!$AS$9/2-M23,IF(AND(F23-E23>0,D23-C23=0),(F23-E23)-Calendrier!$AS$9/2-M23,IF(COUNTA(C23:F23)=4,(D23-C23)+(F23-E23)-M23-Calendrier!$AS$9,0))))","v":0},0,"Sa",{"$f":"IF(OR(B23=$F$9,B23=$F$10),0.5,IF(G23>=6,1,0))","v":0},null,0]
[6,{"$f":"INDIRECT(ADDRESS(MATCH($B$1,Calendrier!$A$15:$A$59,0)+14,ROW()-17,3,1,\"Calendrier\"),1)","v":"Di"},null,null,null,null,0,{"$f":"IF(AND(K24=0.5,COUNTA(C24:F24)=4),\"erreur\",IF(AND(D24-C24>0,F24-E24=0),G24-Calendrier!$AS$9/2-M24,IF(AND(F24-E24>0,D24-C24=0),(F24-E24)-Calendrier!$AS$9/2-M24,IF(COUNTA(C24:F24)=4,(D24-C24)+(F24-E24)-M24-Calendrier!$AS$9,0))))","v":0},0,"Di",0,null,0]
[7,{"$f":"INDIRECT(ADDRESS(MATCH($B$1,Calendrier!$A$15:$A$59,0)+14,ROW()-17,3,1,\"Calendrier\"),1)","v":"T"},null,null,null,null,0,{"$f":"IF(AND(K25=0.5,COUNTA(C25:F25)=4),\"erreur\",IF(AND(D25-C25>0,F25-E25=0),G25-Calendrier!$AS$9/2-M25,IF(AND(F25-E25>0,D25-C25=0),(F25-E25)-Calendrier!$AS$9/2-M25,IF(COUNTA(C25:F25)=4,(D25-C25)+(F25-E25)-M25-Calendrier!$AS$9,0))))","v":0},0,"",0,null,0]
[8,{"$f":"INDIRECT(ADDRESS(MATCH($B$1,Calendrier!$A$15:$A$59,0)+14,ROW()-17,3,1,\"Calendrier\"),1)","v":"T"},null,null,null,null,0,{"$f":"IF(AND(K26=0.5,COUNTA(C26:F26)=4),\"erreur\",IF(AND(D26-C26>0,F26-E26=0),G26-Calendrier!$AS$9/2-M26,IF(AND(F26-E26>0,D26-C26=0),(F26-E26)-Calendrier!$AS$9/2-M26,IF(COUNTA(C26:F26)=4,(D26-C26)+(F26-E26)-M26-Calendrier!$AS$9,0))))","v":0},0,"",0,null,0]
[9,{"$f":"INDIRECT(ADDRESS(MATCH($B$1,Calendrier!$A$15:$A$59,0)+14,ROW()-17,3,1,\"Calendrier\"),1)","v":"T"},null,null,null,null,0,{"$f":"IF(AND(K27=0.5,COUNTA(C27:F27)=4),\"erreur\",IF(AND(D27-C27>0,F27-E27=0),G27-Calendrier!$AS$9/2-M27,IF(AND(F27-E27>0,D27-C27=0),(F27-E27)-Calendrier!$AS$9/2-M27,IF(COUNTA(C27:F27)=4,(D27-C27)+(F27-E27)-M27-Calendrier!$AS$9,0))))","v":0},0,"",0,null,0]
[10,{"$f":"INDIRECT(ADDRESS(MATCH($B$1,Calendrier!$A$15:$A$59,0)+14,ROW()-17,3,1,\"Calendrier\"),1)","v":"T"},null,null,null,null,0,{"$f":"IF(AND(K28=0.5,COUNTA(C28:F28)=4),\"erreur\",IF(AND(D28-C28>0,F28-E28=0),G28-Calendrier!$AS$9/2-M28,IF(AND(F28-E28>0,D28-C28=0),(F28-E28)-Calendrier!$AS$9/2-M28,IF(COUNTA(C28:F28)=4,(D28-C28)+(F28-E28)-M28-Calendrier!$AS$9,0))))","v":0},0,"",0,null,0]
[11,{"$f":"INDIRECT(ADDRESS(MATCH($B$1,Calendrier!$A$15:$A$59,0)+14,ROW()-17,3,1,\"Calendrier\"),1)","v":"T"},null,null,null,null,0,{"$f":"IF(AND(K29=0.5,COUNTA(C29:F29)=4),\"erreur\",IF(AND(D29-C29>0,F29-E29=0),G29-Calendrier!$AS$9/2-M29,IF(AND(F29-E29>0,D29-C29=0),(F29-E29)-Calendrier!$AS$9/2-M29,IF(COUNTA(C29:F29)=4,(D29-C29)+(F29-E29)-M29-Calendrier!$AS$9,0))))","v":0},0,"",0,null,0]
[12,{"$f":"INDIRECT(ADDRESS(MATCH($B$1,Calendrier!$A$15:$A$59,0)+14,ROW()-17,3,1,\"Calendrier\"),1)","v":"Sa"},null,null,null,null,0,{"$f":"IF(AND(K30=0.5,COUNTA(C30:F30)=4),\"erreur\",IF(AND(D30-C30>0,F30-E30=0),G30-Calendrier!$AS$9/2-M30,IF(AND(F30-E30>0,D30-C30=0),(F30-E30)-Calendrier!$AS$9/2-M30,IF(COUNTA(C30:F30)=4,(D30-C30)+(F30-E30)-M30-Calendrier!$AS$9,0))))","v":0},0,"Sa",0,null,0]
[13,{"$f":"INDIRECT(ADDRESS(MATCH($B$1,Calendrier!$A$15:$A$59,0)+14,ROW()-17,3,1,\"Calendrier\"),1)","v":"Di"},null,null,null,null,0,{"$f":"IF(AND(K31=0.5,COUNTA(C31:F31)=4),\"erreur\",IF(AND(D31-C31>0,F31-E31=0),G31-Calendrier!$AS$9/2-M31,IF(AND(F31-E31>0,D31-C31=0),(F31-E31)-Calendrier!$AS$9/2-M31,IF(COUNTA(C31:F31)=4,(D31-C31)+(F31-E31)-M31-Calendrier!$AS$9,0))))","v":0},0,"Di",0,null,0]
[14,{"$f":"INDIRECT(ADDRESS(MATCH($B$1,Calendrier!$A$15:$A$59,0)+14,ROW()-17,3,1,\"Calendrier\"),1)","v":"RTT"},null,null,null,null,0,{"$f":"IF(AND(K32=0.5,COUNTA(C32:F32)=4),\"erreur\",IF(AND(D32-C32>0,F32-E32=0),G32-Calendrier!$AS$9/2-M32,IF(AND(F32-E32>0,D32-C32=0),(F32-E32)-Calendrier!$AS$9/2-M32,IF(COUNTA(C32:F32)=4,(D32-C32)+(F32-E32)-M32-Calendrier!$AS$9,0))))","v":0},0,"RTT",0,null,0]
[15,{"$f":"INDIRECT(ADDRESS(MATCH($B$1,Calendrier!$A$15:$A$59,0)+14,ROW()-17,3,1,\"Calendrier\"),1)","v":"T"},null,null,null,null,0,{"$f":"IF(AND(K33=0.5,COUNTA(C33:F33)=4),\"erreur\",IF(AND(D33-C33>0,F33-E33=0),G33-Calendrier!$AS$9/2-M33,IF(AND(F33-E33>0,D33-C33=0),(F33-E33)-Calendrier!$AS$9/2-M33,IF(COUNTA(C33:F33)=4,(D33-C33)+(F33-E33)-M33-Calendrier!$AS$9,0))))","v":0},0,{"$f":"IF(AND(COUNTA(C33:F33)=0,B33<>\"T\"),B33,IF(AND(OR(B33=$F$9,B33=$F$10),COUNTA(C33:F33=2)),\"T\",IF(G33>=6,\"T\",\"\")))","v":""},0,null,0]
[16,{"$f":"INDIRECT(ADDRESS(MATCH($B$1,Calendrier!$A$15:$A$59,0)+14,ROW()-17,3,1,\"Calendrier\"),1)","v":"T"},null,null,null,null,0,{"$f":"IF(AND(K34=0.5,COUNTA(C34:F34)=4),\"erreur\",IF(AND(D34-C34>0,F34-E34=0),G34-Calendrier!$AS$9/2-M34,IF(AND(F34-E34>0,D34-C34=0),(F34-E34)-Calendrier!$AS$9/2-M34,IF(COUNTA(C34:F34)=4,(D34-C34)+(F34-E34)-M34-Calendrier!$AS$9,0))))","v":0},0,"",0,null,0]
[17,{"$f":"INDIRECT(ADDRESS(MATCH($B$1,Calendrier!$A$15:$A$59,0)+14,ROW()-17,3,1,\"Calendrier\"),1)","v":"T"},null,null,null,null,0,{"$f":"IF(AND(K35=0.5,COUNTA(C35:F35)=4),\"erreur\",IF(AND(D35-C35>0,F35-E35=0),G35-Calendrier!$AS$9/2-M35,IF(AND(F35-E35>0,D35-C35=0),(F35-E35)-Calendrier!$AS$9/2-M35,IF(COUNTA(C35:F35)=4,(D35-C35)+(F35-E35)-M35-Calendrier!$AS$9,0))))","v":0},0,"",0,null,0]
[18,{"$f":"INDIRECT(ADDRESS(MATCH($B$1,Calendrier!$A$15:$A$59,0)+14,ROW()-17,3,1,\"Calendrier\"),1)","v":"T"},null,null,null,null,0,{"$f":"IF(AND(K36=0.5,COUNTA(C36:F36)=4),\"erreur\",IF(AND(D36-C36>0,F36-E36=0),G36-Calendrier!$AS$9/2-M36,IF(AND(F36-E36>0,D36-C36=0),(F36-E36)-Calendrier!$AS$9/2-M36,IF(COUNTA(C36:F36)=4,(D36-C36)+(F36-E36)-M36-Calendrier!$AS$9,0))))","v":0},0,"",0,null,0]
[19,{"$f":"INDIRECT(ADDRESS(MATCH($B$1,Calendrier!$A$15:$A$59,0)+14,ROW()-17,3,1,\"Calendrier\"),1)","v":"Sa"},null,null,null,null,0,{"$f":"IF(AND(K37=0.5,COUNTA(C37:F37)=4),\"erreur\",IF(AND(D37-C37>0,F37-E37=0),G37-Calendrier!$AS$9/2-M37,IF(AND(F37-E37>0,D37-C37=0),(F37-E37)-Calendrier!$AS$9/2-M37,IF(COUNTA(C37:F37)=4,(D37-C37)+(F37-E37)-M37-Calendrier!$AS$9,0))))","v":0},0,"Sa",0,null,0]
[20,{"$f":"INDIRECT(ADDRESS(MATCH($B$1,Calendrier!$A$15:$A$59,0)+14,ROW()-17,3,1,\"Calendrier\"),1)","v":"Di"},null,null,null,null,0,{"$f":"IF(AND(K38=0.5,COUNTA(C38:F38)=4),\"erreur\",IF(AND(D38-C38>0,F38-E38=0),G38-Calendrier!$AS$9/2-M38,IF(AND(F38-E38>0,D38-C38=0),(F38-E38)-Calendrier!$AS$9/2-M38,IF(COUNTA(C38:F38)=4,(D38-C38)+(F38-E38)-M38-Calendrier!$AS$9,0))))","v":0},0,"Di",0,null,0]
[21,{"$f":"INDIRECT(ADDRESS(MATCH($B$1,Calendrier!$A$15:$A$59,0)+14,ROW()-17,3,1,\"Calendrier\"),1)","v":"T"},null,null,null,null,0,{"$f":"IF(AND(K39=0.5,COUNTA(C39:F39)=4),\"erreur\",IF(AND(D39-C39>0,F39-E39=0),G39-Calendrier!$AS$9/2-M39,IF(AND(F39-E39>0,D39-C39=0),(F39-E39)-Calendrier!$AS$9/2-M39,IF(COUNTA(C39:F39)=4,(D39-C39)+(F39-E39)-M39-Calendrier!$AS$9,0))))","v":0},0,"",0,null,0]
[22,{"$f":"INDIRECT(ADDRESS(MATCH($B$1,Calendrier!$A$15:$A$59,0)+14,ROW()-17,3,1,\"Calendrier\"),1)","v":"T"},null,null,null,null,0,{"$f":"IF(AND(K40=0.5,COUNTA(C40:F40)=4),\"erreur\",IF(AND(D40-C40>0,F40-E40=0),G40-Calendrier!$AS$9/2-M40,IF(AND(F40-E40>0,D40-C40=0),(F40-E40)-Calendrier!$AS$9/2-M40,IF(COUNTA(C40:F40)=4,(D40-C40)+(F40-E40)-M40-Calendrier!$AS$9,0))))","v":0},0,"",0,null,0]
[23,{"$f":"INDIRECT(ADDRESS(MATCH($B$1,Calendrier!$A$15:$A$59,0)+14,ROW()-17,3,1,\"Calendrier\"),1)","v":"T"},null,null,null,null,0,{"$f":"IF(AND(K41=0.5,COUNTA(C41:F41)=4),\"erreur\",IF(AND(D41-C41>0,F41-E41=0),G41-Calendrier!$AS$9/2-M41,IF(AND(F41-E41>0,D41-C41=0),(F41-E41)-Calendrier!$AS$9/2-M41,IF(COUNTA(C41:F41)=4,(D41-C41)+(F41-E41)-M41-Calendrier!$AS$9,0))))","v":0},0,"",0,null,0]
[24,{"$f":"INDIRECT(ADDRESS(MATCH($B$1,Calendrier!$A$15:$A$59,0)+14,ROW()-17,3,1,\"Calendrier\"),1)","v":"T"},null,null,null,null,0,{"$f":"IF(AND(K42=0.5,COUNTA(C42:F42)=4),\"erreur\",IF(AND(D42-C42>0,F42-E42=0),G42-Calendrier!$AS$9/2-M42,IF(AND(F42-E42>0,D42-C42=0),(F42-E42)-Calendrier!$AS$9/2-M42,IF(COUNTA(C42:F42)=4,(D42-C42)+(F42-E42)-M42-Calendrier!$AS$9,0))))","v":0},0,"",0,null,0]
[25,{"$f":"INDIRECT(ADDRESS(MATCH($B$1,Calendrier!$A$15:$A$59,0)+14,ROW()-17,3,1,\"Calendrier\"),1)","v":"RTT"},null,null,null,null,0,{"$f":"IF(AND(K43=0.5,COUNTA(C43:F43)=4),\"erreur\",IF(AND(D43-C43>0,F43-E43=0),G43-Calendrier!$AS$9/2-M43,IF(AND(F43-E43>0,D43-C43=0),(F43-E43)-Calendrier!$AS$9/2-M43,IF(COUNTA(C43:F43)=4,(D43-C43)+(F43-E43)-M43-Calendrier!$AS$9,0))))","v":0},0,"RTT",0,null,0]
[26,{"$f":"INDIRECT(ADDRESS(MATCH($B$1,Calendrier!$A$15:$A$59,0)+14,ROW()-17,3,1,\"Calendrier\"),1)","v":"Sa"},null,null,null,null,0,{"$f":"IF(AND(K44=0.5,COUNTA(C44:F44)=4),\"erreur\",IF(AND(D44-C44>0,F44-E44=0),G44-Calendrier!$AS$9/2-M44,IF(AND(F44-E44>0,D44-C44=0),(F44-E44)-Calendrier!$AS$9/2-M44,IF(COUNTA(C44:F44)=4,(D44-C44)+(F44-E44)-M44-Calendrier!$AS$9,0))))","v":0},0,"Sa",0,null,0]
[27,{"$f":"INDIRECT(ADDRESS(MATCH($B$1,Calendrier!$A$15:$A$59,0)+14,ROW()-17,3,1,\"Calendrier\"),1)","v":"F"},null,null,null,null,0,{"$f":"IF(AND(K45=0.5,COUNTA(C45:F45)=4),\"erreur\",IF(AND(D45-C45>0,F45-E45=0),G45-Calendrier!$AS$9/2-M45,IF(AND(F45-E45>0,D45-C45=0),(F45-E45)-Calendrier!$AS$9/2-M45,IF(COUNTA(C45:F45)=4,(D45-C45)+(F45-E45)-M45-Calendrier!$AS$9,0))))","v":0},0,"F",0,null,0]
[28,{"$f":"INDIRECT(ADDRESS(MATCH($B$1,Calendrier!$A$15:$A$59,0)+14,ROW()-17,3,1,\"Calendrier\"),1)","v":"F"},null,null,null,null,0,{"$f":"IF(AND(K46=0.5,COUNTA(C46:F46)=4),\"erreur\",IF(AND(D46-C46>0,F46-E46=0),G46-Calendrier!$AS$9/2-M46,IF(AND(F46-E46>0,D46-C46=0),(F46-E46)-Calendrier!$AS$9/2-M46,IF(COUNTA(C46:F46)=4,(D46-C46)+(F46-E46)-M46-Calendrier!$AS$9,0))))","v":0},0,"F",0,null,0]
[29,{"$f":"INDIRECT(ADDRESS(MATCH($B$1,Calendrier!$A$15:$A$59,0)+14,ROW()-17,3,1,\"Calendrier\"),1)","v":"T"},null,null,null,null,0,{"$f":"IF(AND(K47=0.5,COUNTA(C47:F47)=4),\"erreur\",IF(AND(D47-C47>0,F47-E47=0),G47-Calendrier!$AS$9/2-M47,IF(AND(F47-E47>0,D47-C47=0),(F47-E47)-Calendrier!$AS$9/2-M47,IF(COUNTA(C47:F47)=4,(D47-C47)+(F47-E47)-M47-Calendrier!$AS$9,0))))","v":0},0,"",0,null,0]
[30,{"$f":"INDIRECT(ADDRESS(MATCH($B$1,Calendrier!$A$15:$A$59,0)+14,ROW()-17,3,1,\"Calendrier\"),1)","v":"T"},null,null,null,null,0,{"$f":"IF(AND(K48=0.5,COUNTA(C48:F48)=4),\"erreur\",IF(AND(D48-C48>0,F48-E48=0),G48-Calendrier!$AS$9/2-M48,IF(AND(F48-E48>0,D48-C48=0),(F48-E48)-Calendrier!$AS$9/2-M48,IF(COUNTA(C48:F48)=4,(D48-C48)+(F48-E48)-M48-Calendrier!$AS$9,0))))","v":0},0,"",0,null,0]
[31,{"$f":"INDIRECT(ADDRESS(MATCH($B$1,Calendrier!$A$15:$A$59,0)+14,ROW()-17,3,1,\"Calendrier\"),1)","v":"T"},null,null,null,null,0,{"$f":"IF(AND(K49=0.5,COUNTA(C49:F49)=4),\"erreur\",IF(AND(D49-C49>0,F49-E49=0),G49-Calendrier!$AS$9/2-M49,IF(AND(F49-E49>0,D49-C49=0),(F49-E49)-Calendrier!$AS$9/2-M49,IF(COUNTA(C49:F49)=4,(D49-C49)+(F49-E49)-M49-Calendrier!$AS$9,0))))","v":0},0,"",0,null,0]
[null,null,null,null,null,null,null,"solde des variations",{"$f":"I49","v":0}]

{"sheet":"AVR","index":4,"n_rows":52,"n_cols":15,"rows_kept":52,"cut":false,"hidden":false,"merged":[]}
[null,{"$f":"RIGHT(CELL(\"nomfichier\",$A$1),3)","v":"AVR"},"FICHE DE SUIVI HORAIRE"]
[]
[null,"mois :","AVRIL",null,null,"année ",{"$f":"Calendrier!A1","v":2016},null,"service",{"$f":"Calendrier!F4","v":"COMPTABILITE"}]
[]
[null,"nom :",{"$f":"Calendrier!F2","v":"MARTIN"},null,null," prénom ",{"$f":"Calendrier!F3","v":"PATRICK"},null,"N° Ident.",{"$f":"Calendrier!F1","v":"N123456"}]
[null,null,null,null,null,null,null,"à réaliser","cumul","en cours","reste",null,"n/cumul"]
[null,null,null,"Nb J/T",{"$f":"Calendrier!$A$10","v":213},{"$f":"+$H$10","v":0},{"$f":"$H$12","v":213},{"$f":"Calendrier!$N$1","v":366},{"$f":"MAR!M7","v":34},{"$f":"SUM(J8:J15)","v":11},{"$f":"H7-(I7+J7)","v":321},null,{"$f":"SUM(M8:M15)","v":45}]
[null,null,null,null,null,null,"CA",{"$f":"Calendrier!N5","v":25},{"$f":"MAR!M8","v":0},{"$f":"IF(G8=\"\",0,COUNTIF($J$19:$J$49,G8))+IF(F8=\"\",0,COUNTIF($J$19:$J$49,F8)/2)","v":0},{"$f":"+H8-(I8+J8)","v":25},"J",{"$f":"+I8+J8","v":0}]
[null,null,null,null,null,"1/2RTT","RTT",{"$f":"Calendrier!N8","v":16},{"$f":"MAR!M9","v":6},{"$f":"IF(G9=\"\",0,COUNTIF($J$19:$J$49,G9))+IF(F9=\"\",0,COUNTIF($J$19:$J$49,F9)/2)","v":2},{"$f":"+H9-(I9+J9)","v":8},"J",8]
[null,null,null,null,null,"1/2CS","CS",{"$f":"Calendrier!N9","v":0},{"$f":"MAR!M10","v":0},{"$f":"IF(G10=\"\",0,COUNTIF($J$19:$J$49,G10))+IF(F10=\"\",0,COUNTIF($J$19:$J$49,F10)/2)","v":0},{"$f":"H10-(I10+J10)","v":0},"J",0]
[null,null,null,null,null,null,"CP",{"$f":"Calendrier!N6","v":0},{"$f":"MAR!M11","v":0},0,{"$f":"H11-(I11+J11)","v":0},"J",0]
[null,null,null,null,null,"1/2T","T",{"$f":"Calendrier!N7","v":213},{"$f":"MAR!M12","v":0},0,{"$f":"+H12-(I12+J12)","v":213},"J",0]
[null,null,null,null,null,null,"Sa",{"$f":"Calendrier!N4","v":53},{"$f":"MAR!M13","v":13},5,{"$f":"+H13-(I13+J13)","v":35},"J",18]
[null,null,null,null,null,null,"Di",{"$f":"Calendrier!N3","v":47},{"$f":"MAR!M14","v":12},4,{"$f":"+H14-(I14+J14)","v":31},"J",16]
[null,null,null,null,null,null,"F",{"$f":"Calendrier!N2","v":12},{"$f":"MAR!M15","v":3},0,{"$f":"+H15-(I15+J15)","v":9},"J",{"$f":"+I15+J15","v":3}]
[null,null,null,null,null,null,"heure/avance fin mois",null,{"$f":"MAR!I50","v":0},null,null,null,{"$f":"I50","v":0}]
[null,"Prévu","Entrée","Sortie","Entrée","Sortie","total J","variation","cumul","Type","nb J/T",null,"Bon E/S","Sortie","Retour"]
[null,null,null,null,null,null,null,null,null,null,null,null,null,"avec bon"]
[1,{"$f":"INDIRECT(ADDRESS(MATCH($B$1,Calendrier!$A$15:$A$59,0)+14,ROW()-17,3,1,\"Calendrier\"),1)","v":"T"},null,null,null,null,{"$f":"IF(COUNTA(C19:F19)=4,(D19-C19)+(F19-E19)-M19,IF(COUNTA(C19:D19)<2,(F19-E19)-M19,(D19-C19)-M19))","v":0},{"$f":"IF(AND(K19=0.5,COUNTA(C19:F19)=4),\"erreur\",IF(AND(D19-C19>0,F19-E19=0),G19-Calendrier!$AS$9/2-M19,IF(AND(F19-E19>0,D19-C19=0),(F19-E19)-Calendrier!$AS$9/2-M19,IF(COUNTA(C19:F19)=4,(D19-C19)+(F19-E19)-M19-Calendrier!$AS$9,0))))","v":0},{"$f":"+I16+H19","v":0},{"$f":"IF(AND(COUNTA(C19:F19)=0,B19<>\"T\"),B19,IF(AND(OR(B19=$F$9,B19=$F$10),COUNTA(C19:F19=2)),\"T\",IF(G19>=6,\"T\",\"\")))","v":""},{"$f":"IF(OR(B19=$F$9,B19=$F$10),0.5,IF(G19>=6,1,0))","v":0},null,{"$f":"+O19-N19","v":0}]
[2,{"$f":"INDIRECT(ADDRESS(MATCH($B$1,Calendrier!$A$15:$A$59,0)+14,ROW()-17,3,1,\"Calendrier\"),1)","v":"Sa"},null,null,null,null,0,{"$f":"IF(AND(K20=0.5,COUNTA(C20:F20)=4),\"erreur\",IF(AND(D20-C20>0,F20-E20=0),G20-Calendrier!$AS$9/2-M20,IF(AND(F20-E20>0,D20-C20=0),(F20-E20)-Calendrier!$AS$9/2-M20,IF(COUNTA(C20:F20)=4,(D20-C20)+(F20-E20)-M20-Calendrier!$AS$9,0))))","v":0},{"$f":"+I19+H20","v":0},"Sa",0,null,{"$f":"+O20-N20","v":0}]
[3,{"$f":"INDIRECT(ADDRESS(MATCH($B$1,Calendrier!$A$15:$A$59,0)+14,ROW()-17,3,1,\"Calendrier\"),1)","v":"Di"},null,null,null,null,0,{"$f":"IF(AND(K21=0.5,COUNTA(C21:F21)=4),\"erreur\",IF(AND(D21-C21>0,F21-E21=0),G21-Calendrier!$AS$9/2-M21,IF(AND(F21-E21>0,D21-C21=0),(F21-E21)-Calendrier!$AS$9/2-M21,IF(COUNTA(C21:F21)=4,(D21-C21)+(F21-E21)-M21-Calendrier!$AS$9,0))))","v":0},{"$f":"+I20+H21","v":0},"Di",0,null,0]
[4,{"$f":"INDIRECT(ADDRESS(MATCH($B$1,Calendrier!$A$15:$A$59,0)+14,ROW()-17,3,1,\"Calendrier\"),1)","v":"T"},null,null,null,null,0,{"$f":"IF(AND(K22=0.5,COUNTA(C22:F22)=4),\"erreur\",IF(AND(D22-C22>0,F22-E22=0),G22-Calendrier!$AS$9/2-M22,IF(AND(F22-E22>0,D22-C22=0),(F22-E22)-Calendrier!$AS$9/2-M22,IF(COUNTA(C22:F22)=4,(D22-C22)+(F22-E22)-M22-Calendrier!$AS$9,0))))","v":0},0,"",0,null,0]
[5,{"$f":"INDIRECT(ADDRESS(MATCH($B$1,Calendrier!$A$15:$A$59,0)+14,ROW()-17,3,1,\"Calendrier\"),1)","v":"T"},null,null,null,null,0,{"$f":"IF(AND(K23=0.5,COUNTA(C23:F23)=4),\"erreur\",IF(AND(D23-C23>0,F23-E23=0),G23-Calendrier!$AS$9/2-M23,IF(AND(F23-E23>0,D23-C23=0),(F23-E23)-Calendrier!$AS$9/2-M23,IF(COUNTA(C23:F23)=4,(D23-C23)+(F23-E23)-M23-Calendrier!$AS$9,0))))","v":0},0,"",{"$f":"IF(OR(B23=$F$9,B23=$F$10),0.5,IF(G23>=6,1,0))","v":0},null,0]
[6,{"$f":"INDIRECT(ADDRESS(MATCH($B$1,Calendrier!$A$15:$A$59,0)+14,ROW()-17,3,1,\"Calendrier\"),1)","v":"T"},null,null,null,null,0,{"$f":"IF(AND(K24=0.5,COUNTA(C24:F24)=4),\"erreur\",IF(AND(D24-C24>0,F24-E24=0),G24-Calendrier!$AS$9/2-M24,IF(AND(F24-E24>0,D24-C24=0),(F24-E24)-Calendrier!$AS$9/2-M24,IF(COUNTA(C24:F24)=4,(D24-C24)+(F24-E24)-M24-Calendrier!$AS$9,0))))","v":0},0,"",0,null,0]
[7,{"$f":"INDIRECT(ADDRESS(MATCH($B$1,Calendrier!$A$15:$A$59,0)+14,ROW()-17,3,1,\"Calendrier\"),1)","v":"T"},null,null,null,null,0,{"$f":"IF(AND(K25=0.5,COUNTA(C25:F25)=4),\"erreur\",IF(AND(D25-C25>0,F25-E25=0),G25-Calendrier!$AS$9/2-M25,IF(AND(F25-E25>0,D25-C25=0),(F25-E25)-Calendrier!$AS$9/2-M25,IF(COUNTA(C25:F25)=4,(D25-C25)+(F25-E25)-M25-Calendrier!$AS$9,0))))","v":0},0,"",0,null,0]
[8,{"$f":"INDIRECT(ADDRESS(MATCH($B$1,Calendrier!$A$15:$A$59,0)+14,ROW()-17,3,1,\"Calendrier\"),1)","v":"T"},null,null,null,null,0,{"$f":"IF(AND(K26=0.5,COUNTA(C26:F26)=4),\"erreur\",IF(AND(D26-C26>0,F26-E26=0),G26-Calendrier!$AS$9/2-M26,IF(AND(F26-E26>0,D26-C26=0),(F26-E26)-Calendrier!$AS$9/2-M26,IF(COUNTA(C26:F26)=4,(D26-C26)+(F26-E26)-M26-Calendrier!$AS$9,0))))","v":0},0,"",0,null,0]
[9,{"$f":"INDIRECT(ADDRESS(MATCH($B$1,Calendrier!$A$15:$A$59,0)+14,ROW()-17,3,1,\"Calendrier\"),1)","v":"Sa"},null,null,null,null,0,{"$f":"IF(AND(K27=0.5,COUNTA(C27:F27)=4),\"erreur\",IF(AND(D27-C27>0,F27-E27=0),G27-Calendrier!$AS$9/2-M27,IF(AND(F27-E27>0,D27-C27=0),(F27-E27)-Calendrier!$AS$9/2-M27,IF(COUNTA(C27:F27)=4,(D27-C27)+(F27-E27)-M27-Calendrier!$AS$9,0))))","v":0},0,"Sa",0,null,0]
[10,{"$f":"INDIRECT(ADDRESS(MATCH($B$1,Calendrier!$A$15:$A$59,0)+14,ROW()-17,3,1,\"Calendrier\"),1)","v":"Di"},null,null,null,null,0,{"$f":"IF(AND(K28=0.5,COUNTA(C28:F28)=4),\"erreur\",IF(AND(D28-C28>0,F28-E28=0),G28-Calendrier!$AS$9/2-M28,IF(AND(F28-E28>0,D28-C28=0),(F28-E28)-Calendrier!$AS$9/2-M28,IF(COUNTA(C28:F28)=4,(D28-C28)+(F28-E28)-M28-Calendrier!$AS$9,0))))","v":0},0,"Di",0,null,0]
[11,{"$f":"INDIRECT(ADDRESS(MATCH($B$1,Calendrier!$A$15:$A$59,0)+14,ROW()-17,3,1,\"Calendrier\"),1)","v":"T"},null,null,null,null,0,{"$f":"IF(AND(K29=0.5,COUNTA(C29:F29)=4),\"erreur\",IF(AND(D29-C29>0,F29-E29=0),G29-Calendrier!$AS$9/2-M29,IF(AND(F29-E29>0,D29-C29=0),(F29-E29)-Calendrier!$AS$9/2-M29,IF(COUNTA(C29:F29)=4,(D29-C29)+(F29-E29)-M29-Calendrier!$AS$9,0))))","v":0},0,"",0,null,0]
[12,{"$f":"INDIRECT(ADDRESS(MATCH($B$1,Calendrier!$A$15:$A$59,0)+14,ROW()-17,3,1,\"Calendrier\"),1)","v":"T"},null,null,null,null,0,{"$f":"IF(AND(K30=0.5,COUNTA(C30:F30)=4),\"erreur\",IF(AND(D30-C30>0,F30-E30=0),G30-Calendrier!$AS$9/2-M30,IF(AND(F30-E30>0,D30-C30=0),(F30-E30)-Calendrier!$AS$9/2-M30,IF(COUNTA(C30:F30)=4,(D30-C30)+(F30-E30)-M30-Calendrier!$AS$9,0))))","v":0},0,"",0,null,0]
[13,{"$f":"INDIRECT(ADDRESS(MATCH($B$1,Calendrier!$A$15:$A$59,0)+14,ROW()-17,3,1,\"Calendrier\"),1)","v":"T"},null,null,null,null,0,{"$f":"IF(AND(K31=0.5,COUNTA(C31:F31)=4),\"erreur\",IF(AND(D31-C31>0,F31-E31=0),G31-Calendrier!$AS$9/2-M31,IF(AND(F31-E31>0,D31-C31=0),(F31-E31)-Calendrier!$AS$9/2-M31,IF(COUNTA(C31:F31)=4,(D31-C31)+(F31-E31)-M31-Calendrier!$AS$9,0))))","v":0},0,"",0,null,0]
[14,{"$f":"INDIRECT(ADDRESS(MATCH($B$1,Calendrier!$A$15:$A$59,0)+14,ROW()-17,3,1,\"Calendrier\"),1)","v":"T"},null,null,null,null,0,{"$f":"IF(AND(K32=0.5,COUNTA(C32:F32)=4),\"erreur\",IF(AND(D32-C32>0,F32-E32=0),G32-Calendrier!$AS$9/2-M32,IF(AND(F32-E32>0,D32-C32=0),(F32-E32)-Calendrier!$AS$9/2-M32,IF(COUNTA(C32:F32)=4,(D32-C32)+(F32-E32)-M32-Calendrier!$AS$9,0))))","v":0},0,"",0,null,0]
[15,{"$f":"INDIRECT(ADDRESS(MATCH($B$1,Calendrier!$A$15:$A$59,0)+14,ROW()-17,3,1,\"Calendrier\"),1)","v":"RTT"},null,null,null,null,0,{"$f":"IF(AND(K33=0.5,COUNTA(C33:F33)=4),\"erreur\",IF(AND(D33-C33>0,F33-E33=0),G33-Calendrier!$AS$9/2-M33,IF(AND(F33-E33>0,D33-C33=0),(F33-E33)-Calendrier!$AS$9/2-M33,IF(COUNTA(C33:F33)=4,(D33-C33)+(F33-E33)-M33-Calendrier!$AS$9,0))))","v":0},0,{"$f":"IF(AND(COUNTA(C33:F33)=0,B33<>\"T\"),B33,IF(AND(OR(B33=$F$9,B33=$F$10),COUNTA(C33:F33=2)),\"T\",IF(G33>=6,\"T\",\"\")))","v":"RTT"},0,null,0]
[16,{"$f":"INDIRECT(ADDRESS(MATCH($B$1,Calendrier!$A$15:$A$59,0)+14,ROW()-17,3,1,\"Calendrier\"),1)","v":"Sa"},null,null,null,null,0,{"$f":"IF(AND(K34=0.5,COUNTA(C34:F34)=4),\"erreur\",IF(AND(D34-C34>0,F34-E34=0),G34-Calendrier!$AS$9/2-M34,IF(AND(F34-E34>0,D34-C34=0),(F34-E34)-Calendrier!$AS$9/2-M34,IF(COUNTA(C34:F34)=4,(D34-C34)+(F34-E34)-M34-Calendrier!$AS$9,0))))","v":0},0,"Sa",0,null,0]
[17,{"$f":"INDIRECT(ADDRESS(MATCH($B$1,Calendrier!$A$15:$A$59,0)+14,ROW()-17,3,1,\"Calendrier\"),1)","v":"Di"},null,null,null,null,0,{"$f":"IF(AND(K35=0.5,COUNTA(C35:F35)=4),\"erreur\",IF(AND(D35-C35>0,F35-E35=0),G35-Calendrier!$AS$9/2-M35,IF(AND(F35-E35>0,D35-C35=0),(F35-E35)-Calendrier!$AS$9/2-M35,IF(COUNTA(C35:F35)=4,(D35-C35)+(F35-E35)-M35-Calendrier!$AS$9,0))))","v":0},0,"Di",0,null,0]
[18,{"$f":"INDIRECT(ADDRESS(MATCH($B$1,Calendrier!$A$15:$A$59,0)+14,ROW()-17,3,1,\"Calendrier\"),1)","v":"T"},null,null,null,null,0,{"$f":"IF(AND(K36=0.5,COUNTA(C36:F36)=4),\"erreur\",IF(AND(D36-C36>0,F36-E36=0),G36-Calendrier!$AS$9/2-M36,IF(AND(F36-E36>0,D36-C36=0),(F36-E36)-Calendrier!$AS$9/2-M36,IF(COUNTA(C36:F36)=4,(D36-C36)+(F36-E36)-M36-Calendrier!$AS$9,0))))","v":0},0,"",0,null,0]
[19,{"$f":"INDIRECT(ADDRESS(MATCH($B$1,Calendrier!$A$15:$A$59,0)+14,ROW()-17,3,1,\"Calendrier\"),1)","v":"T"},null,null,null,null,0,{"$f":"IF(AND(K37=0.5,COUNTA(C37:F37)=4),\"erreur\",IF(AND(D37-C37>0,F37-E37=0),G37-Calendrier!$AS$9/2-M37,IF(AND(F37-E37>0,D37-C37=0),(F37-E37)-Calendrier!$AS$9/2-M37,IF(COUNTA(C37:F37)=4,(D37-C37)+(F37-E37)-M37-Calendrier!$AS$9,0))))","v":0},0,"",0,null,0]
[20,{"$f":"INDIRECT(ADDRESS(MATCH($B$1,Calendrier!$A$15:$A$59,0)+14,ROW()-17,3,1,\"Calendrier\"),1)","v":"T"},null,null,null,null,0,{"$f":"IF(AND(K38=0.5,COUNTA(C38:F38)=4),\"erreur\",IF(AND(D38-C38>0,F38-E38=0),G38-Calendrier!$AS$9/2-M38,IF(AND(F38-E38>0,D38-C38=0),(F38-E38)-Calendrier!$AS$9/2-M38,IF(COUNTA(C38:F38)=4,(D38-C38)+(F38-E38)-M38-Calendrier!$AS$9,0))))","v":0},0,"",0,null,0]
[21,{"$f":"INDIRECT(ADDRESS(MATCH($B$1,Calendrier!$A$15:$A$59,0)+14,ROW()-17,3,1,\"Calendrier\"),1)","v":"T"},null,null,null,null,0,{"$f":"IF(AND(K39=0.5,COUNTA(C39:F39)=4),\"erreur\",IF(AND(D39-C39>0,F39-E39=0),G39-Calendrier!$AS$9/2-M39,IF(AND(F39-E39>0,D39-C39=0),(F39-E39)-Calendrier!$AS$9/2-M39,IF(COUNTA(C39:F39)=4,(D39-C39)+(F39-E39)-M39-Calendrier!$AS$9,0))))","v":0},0,"",0,null,0]
[22,{"$f":"INDIRECT(ADDRESS(MATCH($B$1,Calendrier!$A$15:$A$59,0)+14,ROW()-17,3,1,\"Calendrier\"),1)","v":"T"},null,null,null,null,0,{"$f":"IF(AND(K40=0.5,COUNTA(C40:F40)=4),\"erreur\",IF(AND(D40-C40>0,F40-E40=0),G40-Calendrier!$AS$9/2-M40,IF(AND(F40-E40>0,D40-C40=0),(F40-E40)-Calendrier!$AS$9/2-M40,IF(COUNTA(C40:F40)=4,(D40-C40)+(F40-E40)-M40-Calendrier!$AS$9,0))))","v":0},0,"",0,null,0]
[23,{"$f":"INDIRECT(ADDRESS(MATCH($B$1,Calendrier!$A$15:$A$59,0)+14,ROW()-17,3,1,\"Calendrier\"),1)","v":"Sa"},null,null,null,null,0,{"$f":"IF(AND(K41=0.5,COUNTA(C41:F41)=4),\"erreur\",IF(AND(D41-C41>0,F41-E41=0),G41-Calendrier!$AS$9/2-M41,IF(AND(F41-E41>0,D41-C41=0),(F41-E41)-Calendrier!$AS$9/2-M41,IF(COUNTA(C41:F41)=4,(D41-C41)+(F41-E41)-M41-Calendrier!$AS$9,0))))","v":0},0,"Sa",0,null,0]
[24,{"$f":"INDIRECT(ADDRESS(MATCH($B$1,Calendrier!$A$15:$A$59,0)+14,ROW()-17,3,1,\"Calendrier\"),1)","v":"Di"},null,null,null,null,0,{"$f":"IF(AND(K42=0.5,COUNTA(C42:F42)=4),\"erreur\",IF(AND(D42-C42>0,F42-E42=0),G42-Calendrier!$AS$9/2-M42,IF(AND(F42-E42>0,D42-C42=0),(F42-E42)-Calendrier!$AS$9/2-M42,IF(COUNTA(C42:F42)=4,(D42-C42)+(F42-E42)-M42-Calendrier!$AS$9,0))))","v":0},0,"Di",0,null,0]
[25,{"$f":"INDIRECT(ADDRESS(MATCH($B$1,Calendrier!$A$15:$A$59,0)+14,ROW()-17,3,1,\"Calendrier\"),1)","v":"RTT"},null,null,null,null,0,{"$f":"IF(AND(K43=0.5,COUNTA(C43:F43)=4),\"erreur\",IF(AND(D43-C43>0,F43-E43=0),G43-Calendrier!$AS$9/2-M43,IF(AND(F43-E43>0,D43-C43=0),(F43-E43)-Calendrier!$AS$9/2-M43,IF(COUNTA(C43:F43)=4,(D43-C43)+(F43-E43)-M43-Calendrier!$AS$9,0))))","v":0},0,"RTT",0,null,0]
[26,{"$f":"INDIRECT(ADDRESS(MATCH($B$1,Calendrier!$A$15:$A$59,0)+14,ROW()-17,3,1,\"Calendrier\"),1)","v":"T"},null,null,null,null,0,{"$f":"IF(AND(K44=0.5,COUNTA(C44:F44)=4),\"erreur\",IF(AND(D44-C44>0,F44-E44=0),G44-Calendrier!$AS$9/2-M44,IF(AND(F44-E44>0,D44-C44=0),(F44-E44)-Calendrier!$AS$9/2-M44,IF(COUNTA(C44:F44)=4,(D44-C44)+(F44-E44)-M44-Calendrier!$AS$9,0))))","v":0},0,"",0,null,0]
[27,{"$f":"INDIRECT(ADDRESS(MATCH($B$1,Calendrier!$A$15:$A$59,0)+14,ROW()-17,3,1,\"Calendrier\"),1)","v":"T"},null,null,null,null,0,{"$f":"IF(AND(K45=0.5,COUNTA(C45:F45)=4),\"erreur\",IF(AND(D45-C45>0,F45-E45=0),G45-Calendrier!$AS$9/2-M45,IF(AND(F45-E45>0,D45-C45=0),(F45-E45)-Calendrier!$AS$9/2-M45,IF(COUNTA(C45:F45)=4,(D45-C45)+(F45-E45)-M45-Calendrier!$AS$9,0))))","v":0},0,"",0,null,0]
[28,{"$f":"INDIRECT(ADDRESS(MATCH($B$1,Calendrier!$A$15:$A$59,0)+14,ROW()-17,3,1,\"Calendrier\"),1)","v":"T"},null,null,null,null,0,{"$f":"IF(AND(K46=0.5,COUNTA(C46:F46)=4),\"erreur\",IF(AND(D46-C46>0,F46-E46=0),G46-Calendrier!$AS$9/2-M46,IF(AND(F46-E46>0,D46-C46=0),(F46-E46)-Calendrier!$AS$9/2-M46,IF(COUNTA(C46:F46)=4,(D46-C46)+(F46-E46)-M46-Calendrier!$AS$9,0))))","v":0},0,"",0,null,0]
[29,{"$f":"INDIRECT(ADDRESS(MATCH($B$1,Calendrier!$A$15:$A$59,0)+14,ROW()-17,3,1,\"Calendrier\"),1)","v":"T"},null,null,null,null,0,{"$f":"IF(AND(K47=0.5,COUNTA(C47:F47)=4),\"erreur\",IF(AND(D47-C47>0,F47-E47=0),G47-Calendrier!$AS$9/2-M47,IF(AND(F47-E47>0,D47-C47=0),(F47-E47)-Calendrier!$AS$9/2-M47,IF(COUNTA(C47:F47)=4,(D47-C47)+(F47-E47)-M47-Calendrier!$AS$9,0))))","v":0},0,"",0,null,0]
[30,{"$f":"INDIRECT(ADDRESS(MATCH($B$1,Calendrier!$A$15:$A$59,0)+14,ROW()-17,3,1,\"Calendrier\"),1)","v":"Sa"},null,null,null,null,0,{"$f":"IF(AND(K48=0.5,COUNTA(C48:F48)=4),\"erreur\",IF(AND(D48-C48>0,F48-E48=0),G48-Calendrier!$AS$9/2-M48,IF(AND(F48-E48>0,D48-C48=0),(F48-E48)-Calendrier!$AS$9/2-M48,IF(COUNTA(C48:F48)=4,(D48-C48)+(F48-E48)-M48-Calendrier!$AS$9,0))))","v":0},0,"Sa",0,null,0]
[null,null,null,null,null,null,null,null,0,null,null,null,0]
[null,null,null,null,null,null,null,"solde des variations",{"$f":"I49","v":0}]
[]
[null,null,null,null,null,null,null,null,null,{"$f":"IF(G52>6,\"T\",\"\")","v":""}]

{"sheet":"MAI","index":5,"n_rows":50,"n_cols":15,"rows_kept":50,"cut":false,"hidden":false,"merged":[]}
[null,{"$f":"RIGHT(CELL(\"nomfichier\",$A$1),3)","v":"MAI"},"FICHE DE SUIVI HORAIRE"]
[]
[null,"mois :","MAI",null,null,"année ",{"$f":"Calendrier!A1","v":2016},null,"service",{"$f":"Calendrier!F4","v":"COMPTABILITE"}]
[]
[null,"nom :",{"$f":"Calendrier!F2","v":"MARTIN"},null,null," prénom ",{"$f":"Calendrier!F3","v":"PATRICK"},null,"N° Ident.",{"$f":"Calendrier!F1","v":"N123456"}]
[null,null,null,null,null,null,null,"à réaliser","cumul","en cours","reste",null,"n/cumul"]
[null,null,null,"Nb J/T",{"$f":"Calendrier!$A$10","v":213},{"$f":"+$H$10","v":0},{"$f":"$H$12","v":213},{"$f":"Calendrier!$N$1","v":366},{"$f":"AVR!M7","v":45},{"$f":"SUM(J8:J15)","v":11},{"$f":"H7-(I7+J7)","v":310},null,{"$f":"SUM(M8:M15)","v":56}]
[null,null,null,null,null,null,"CA",{"$f":"Calendrier!N5","v":25},{"$f":"AVR!M8","v":0},{"$f":"IF(G8=\"\",0,COUNTIF($J$19:$J$49,G8))+IF(F8=\"\",0,COUNTIF($J$19:$J$49,F8)/2)","v":0},{"$f":"+H8-(I8+J8)","v":25},"J",{"$f":"+I8+J8","v":0}]
[null,null,null,null,null,"1/2RTT","RTT",{"$f":"Calendrier!N8","v":16},{"$f":"AVR!M9","v":8},{"$f":"IF(G9=\"\",0,COUNTIF($J$19:$J$49,G9))+IF(F9=\"\",0,COUNTIF($J$19:$J$49,F9)/2)","v":1},{"$f":"+H9-(I9+J9)","v":7},"J",9]
[null,null,null,null,null,"1/2CS","CS",{"$f":"Calendrier!N9","v":0},{"$f":"AVR!M10","v":0},{"$f":"IF(G10=\"\",0,COUNTIF($J$19:$J$49,G10))+IF(F10=\"\",0,COUNTIF($J$19:$J$49,F10)/2)","v":0},{"$f":"H10-(I10+J10)","v":0},"J",0]
[null,null,null,null,null,null,"CP",{"$f":"Calendrier!N6","v":0},{"$f":"AVR!M11","v":0},0,{"$f":"H11-(I11+J11)","v":0},"J",0]
[null,null,null,null,null,"1/2T","T",{"$f":"Calendrier!N7","v":213},{"$f":"AVR!M12","v":0},0,{"$f":"+H12-(I12+J12)","v":213},"J",0]
[null,null,null,null,null,null,"Sa",{"$f":"Calendrier!N4","v":53},{"$f":"AVR!M13","v":18},4,{"$f":"+H13-(I13+J13)","v":31},"J",22]
[null,null,null,null,null,null,"Di",{"$f":"Calendrier!N3","v":47},{"$f":"AVR!M14","v":16},2,{"$f":"+H14-(I14+J14)","v":29},"J",18]
[null,null,null,null,null,null,"F",{"$f":"Calendrier!N2","v":12},{"$f":"AVR!M15","v":3},4,{"$f":"+H15-(I15+J15)","v":5},"J",{"$f":"+I15+J15","v":7}]
[null,null,null,null,null,null,"heure/avance fin mois",null,{"$f":"AVR!I50","v":0},null,null,null,{"$f":"I50","v":0}]
[null,"Prévu","Entrée","Sortie","Entrée","Sortie","total J","variation","cumul","Type","nb J/T",null,"Bon E/S","Sortie","Retour"]
[null,null,null,null,null,null,null,null,null,null,null,null,null,"avec bon"]
[1,{"$f":"INDIRECT(ADDRESS(MATCH($B$1,Calendrier!$A$15:$A$59,0)+14,ROW()-17,3,1,\"Calendrier\"),1)","v":"F"},null,null,null,null,{"$f":"IF(COUNTA(C19:F19)=4,(D19-C19)+(F19-E19)-M19,IF(COUNTA(C19:D19)<2,(F19-E19)-M19,(D19-C19)-M19))","v":0},{"$f":"IF(AND(K19=0.5,COUNTA(C19:F19)=4),\"erreur\",IF(AND(D19-C19>0,F19-E19=0),G19-Calendrier!$AS$9/2-M19,IF(AND(F19-E19>0,D19-C19=0),(F19-E19)-Calendrier!$AS$9/2-M19,IF(COUNTA(C19:F19)=4,(D19-C19)+(F19-E19)-M19-Calendrier!$AS$9,0))))","v":0},{"$f":"+I16+H19","v":0},{"$f":"IF(AND(COUNTA(C19:F19)=0,B19<>\"T\"),B19,IF(AND(OR(B19=$F$9,B19=$F$10),COUNTA(C19:F19=2)),\"T\",IF(G19>=6,\"T\",\"\")))","v":"F"},{"$f":"IF(OR(B19=$F$9,B19=$F$10),0.5,IF(G19>=6,1,0))","v":0},null,{"$f":"+O19-N19","v":0}]
[2,{"$f":"INDIRECT(ADDRESS(MATCH($B$1,Calendrier!$A$15:$A$59,0)+14,ROW()-17,3,1,\"Calendrier\"),1)","v":"T"},null,null,null,null,0,{"$f":"IF(AND(K20=0.5,COUNTA(C20:F20)=4),\"erreur\",IF(AND(D20-C20>0,F20-E20=0),G20-Calendrier!$AS$9/2-M20,IF(AND(F20-E20>0,D20-C20=0),(F20-E20)-Calendrier!$AS$9/2-M20,IF(COUNTA(C20:F20)=4,(D20-C20)+(F20-E20)-M20-Calendrier!$AS$9,0))))","v":0},{"$f":"+I19+H20","v":0},"",0,null,{"$f":"+O20-N20","v":0}]
[3,{"$f":"INDIRECT(ADDRESS(MATCH($B$1,Calendrier!$A$15:$A$59,0)+14,ROW()-17,3,1,\"Calendrier\"),1)","v":"T"},null,null,null,null,0,{"$f":"IF(AND(K21=0.5,COUNTA(C21:F21)=4),\"erreur\",IF(AND(D21-C21>0,F21-E21=0),G21-Calendrier!$AS$9/2-M21,IF(AND(F21-E21>0,D21-C21=0),(F21-E21)-Calendrier!$AS$9/2-M21,IF(COUNTA(C21:F21)=4,(D21-C21)+(F21-E21)-M21-Calendrier!$AS$9,0))))","v":0},0,"",0,null,0]
[4,{"$f":"INDIRECT(ADDRESS(MATCH($B$1,Calendrier!$A$15:$A$59,0)+14,ROW()-17,3,1,\"Calendrier\"),1)","v":"T"},null,null,null,null,0,{"$f":"IF(AND(K22=0.5,COUNTA(C22:F22)=4),\"erreur\",IF(AND(D22-C22>0,F22-E22=0),G22-Calendrier!$AS$9/2-M22,IF(AND(F22-E22>0,D22-C22=0),(F22-E22)-Calendrier!$AS$9/2-M22,IF(COUNTA(C22:F22)=4,(D22-C22)+(F22-E22)-M22-Calendrier!$AS$9,0))))","v":0},0,"",0,null,0]
[5,{"$f":"INDIRECT(ADDRESS(MATCH($B$1,Calendrier!$A$15:$A$59,0)+14,ROW()-17,3,1,\"Calendrier\"),1)","v":"F"},null,null,null,null,0,{"$f":"IF(AND(K23=0.5,COUNTA(C23:F23)=4),\"erreur\",IF(AND(D23-C23>0,F23-E23=0),G23-Calendrier!$AS$9/2-M23,IF(AND(F23-E23>0,D23-C23=0),(F23-E23)-Calendrier!$AS$9/2-M23,IF(COUNTA(C23:F23)=4,(D23-C23)+(F23-E23)-M23-Calendrier!$AS$9,0))))","v":0},0,"F",{"$f":"IF(OR(B23=$F$9,B23=$F$10),0.5,IF(G23>=6,1,0))","v":0},null,0]
[6,{"$f":"INDIRECT(ADDRESS(MATCH($B$1,Calendrier!$A$15:$A$59,0)+14,ROW()-17,3,1,\"Calendrier\"),1)","v":"RTT"},null,null,null,null,0,{"$f":"IF(AND(K24=0.5,COUNTA(C24:F24)=4),\"erreur\",IF(AND(D24-C24>0,F24-E24=0),G24-Calendrier!$AS$9/2-M24,IF(AND(F24-E24>0,D24-C24=0),(F24-E24)-Calendrier!$AS$9/2-M24,IF(COUNTA(C24:F24)=4,(D24-C24)+(F24-E24)-M24-Calendrier!$AS$9,0))))","v":0},0,"RTT",0,null,0]
[7,{"$f":"INDIRECT(ADDRESS(MATCH($B$1,Calendrier!$A$15:$A$59,0)+14,ROW()-17,3,1,\"Calendrier\"),1)","v":"Sa"},null,null,null,null,0,{"$f":"IF(AND(K25=0.5,COUNTA(C25:F25)=4),\"erreur\",IF(AND(D25-C25>0,F25-E25=0),G25-Calendrier!$AS$9/2-M25,IF(AND(F25-E25>0,D25-C25=0),(F25-E25)-Calendrier!$AS$9/2-M25,IF(COUNTA(C25:F25)=4,(D25-C25)+(F25-E25)-M25-Calendrier!$AS$9,0))))","v":0},0,"Sa",0,null,0]
[8,{"$f":"INDIRECT(ADDRESS(MATCH($B$1,Calendrier!$A$15:$A$59,0)+14,ROW()-17,3,1,\"Calendrier\"),1)","v":"F"},null,null,null,null,0,{"$f":"IF(AND(K26=0.5,COUNTA(C26:F26)=4),\"erreur\",IF(AND(D26-C26>0,F26-E26=0),G26-Calendrier!$AS$9/2-M26,IF(AND(F26-E26>0,D26-C26=0),(F26-E26)-Calendrier!$AS$9/2-M26,IF(COUNTA(C26:F26)=4,(D26-C26)+(F26-E26)-M26-Calendrier!$AS$9,0))))","v":0},0,"F",0,null,0]
[9,{"$f":"INDIRECT(ADDRESS(MATCH($B$1,Calendrier!$A$15:$A$59,0)+14,ROW()-17,3,1,\"Calendrier\"),1)","v":"T"},null,null,null,null,0,{"$f":"IF(AND(K27=0.5,COUNTA(C27:F27)=4),\"erreur\",IF(AND(D27-C27>0,F27-E27=0),G27-Calendrier!$AS$9/2-M27,IF(AND(F27-E27>0,D27-C27=0),(F27-E27)-Calendrier!$AS$9/2-M27,IF(COUNTA(C27:F27)=4,(D27-C27)+(F27-E27)-M27-Calendrier!$AS$9,0))))","v":0},0,"",0,null,0]
[10,{"$f":"INDIRECT(ADDRESS(MATCH($B$1,Calendrier!$A$15:$A$59,0)+14,ROW()-17,3,1,\"Calendrier\"),1)","v":"T"},null,null,null,null,0,{"$f":"IF(AND(K28=0.5,COUNTA(C28:F28)=4),\"erreur\",IF(AND(D28-C28>0,F28-E28=0),G28-Calendrier!$AS$9/2-M28,IF(AND(F28-E28>0,D28-C28=0),(F28-E28)-Calendrier!$AS$9/2-M28,IF(COUNTA(C28:F28)=4,(D28-C28)+(F28-E28)-M28-Calendrier!$AS$9,0))))","v":0},0,"",0,null,0]
[11,{"$f":"INDIRECT(ADDRESS(MATCH($B$1,Calendrier!$A$15:$A$59,0)+14,ROW()-17,3,1,\"Calendrier\"),1)","v":"T"},null,null,null,null,0,{"$f":"IF(AND(K29=0.5,COUNTA(C29:F29)=4),\"erreur\",IF(AND(D29-C29>0,F29-E29=0),G29-Calendrier!$AS$9/2-M29,IF(AND(F29-E29>0,D29-C29=0),(F29-E29)-Calendrier!$AS$9/2-M29,IF(COUNTA(C29:F29)=4,(D29-C29)+(F29-E29)-M29-Calendrier!$AS$9,0))))","v":0},0,"",0,null,0]
[12,{"$f":"INDIRECT(ADDRESS(MATCH($B$1,Calendrier!$A$15:$A$59,0)+14,ROW()-17,3,1,\"Calendrier\"),1)","v":"T"},null,null,null,null,0,{"$f":"IF(AND(K30=0.5,COUNTA(C30:F30)=4),\"erreur\",IF(AND(D30-C30>0,F30-E30=0),G30-Calendrier!$AS$9/2-M30,IF(AND(F30-E30>0,D30-C30=0),(F30-E30)-Calendrier!$AS$9/2-M30,IF(COUNTA(C30:F30)=4,(D30-C30)+(F30-E30)-M30-Calendrier!$AS$9,0))))","v":0},0,"",0,null,0]
[13,{"$f":"INDIRECT(ADDRESS(MATCH($B$1,Calendrier!$A$15:$A$59,0)+14,ROW()-17,3,1,\"Calendrier\"),1)","v":"T"},null,null,null,null,0,{"$f":"IF(AND(K31=0.5,COUNTA(C31:F31)=4),\"erreur\",IF(AND(D31-C31>0,F31-E31=0),G31-Calendrier!$AS$9/2-M31,IF(AND(F31-E31>0,D31-C31=0),(F31-E31)-Calendrier!$AS$9/2-M31,IF(COUNTA(C31:F31)=4,(D31-C31)+(F31-E31)-M31-Calendrier!$AS$9,0))))","v":0},0,"",0,null,0]
[14,{"$f":"INDIRECT(ADDRESS(MATCH($B$1,Calendrier!$A$15:$A$59,0)+14,ROW()-17,3,1,\"Calendrier\"),1)","v":"Sa"},null,null,null,null,0,{"$f":"IF(AND(K32=0.5,COUNTA(C32:F32)=4),\"erreur\",IF(AND(D32-C32>0,F32-E32=0),G32-Calendrier!$AS$9/2-M32,IF(AND(F32-E32>0,D32-C32=0),(F32-E32)-Calendrier!$AS$9/2-M32,IF(COUNTA(C32:F32)=4,(D32-C32)+(F32-E32)-M32-Calendrier!$AS$9,0))))","v":0},0,"Sa",0,null,0]
[15,{"$f":"INDIRECT(ADDRESS(MATCH($B$1,Calendrier!$A$15:$A$59,0)+14,ROW()-17,3,1,\"Calendrier\"),1)","v":"F"},null,null,null,null,0,{"$f":"IF(AND(K33=0.5,COUNTA(C33:F33)=4),\"erreur\",IF(AND(D33-C33>0,F33-E33=0),G33-Calendrier!$AS$9/2-M33,IF(AND(F33-E33>0,D33-C33=0),(F33-E33)-Calendrier!$AS$9/2-M33,IF(COUNTA(C33:F33)=4,(D33-C33)+(F33-E33)-M33-Calendrier!$AS$9,0))))","v":0},0,{"$f":"IF(AND(COUNTA(C33:F33)=0,B33<>\"T\"),B33,IF(AND(OR(B33=$F$9,B33=$F$10),COUNTA(C33:F33=2)),\"T\",IF(G33>=6,\"T\",\"\")))","v":"F"},0,null,0]
[16,{"$f":"INDIRECT(ADDRESS(MATCH($B$1,Calendrier!$A$15:$A$59,0)+14,ROW()-17,3,1,\"Calendrier\"),1)","v":"T"},null,null,null,null,0,{"$f":"IF(AND(K34=0.5,COUNTA(C34:F34)=4),\"erreur\",IF(AND(D34-C34>0,F34-E34=0),G34-Calendrier!$AS$9/2-M34,IF(AND(F34-E34>0,D34-C34=0),(F34-E34)-Calendrier!$AS$9/2-M34,IF(COUNTA(C34:F34)=4,(D34-C34)+(F34-E34)-M34-Calendrier!$AS$9,0))))","v":0},0,"",0,null,0]
[17,{"$f":"INDIRECT(ADDRESS(MATCH($B$1,Calendrier!$A$15:$A$59,0)+14,ROW()-17,3,1,\"Calendrier\"),1)","v":"T"},null,null,null,null,0,{"$f":"IF(AND(K35=0.5,COUNTA(C35:F35)=4),\"erreur\",IF(AND(D35-C35>0,F35-E35=0),G35-Calendrier!$AS$9/2-M35,IF(AND(F35-E35>0,D35-C35=0),(F35-E35)-Calendrier!$AS$9/2-M35,IF(COUNTA(C35:F35)=4,(D35-C35)+(F35-E35)-M35-Calendrier!$AS$9,0))))","v":0},0,"",0,null,0]
[18,{"$f":"INDIRECT(ADDRESS(MATCH($B$1,Calendrier!$A$15:$A$59,0)+14,ROW()-17,3,1,\"Calendrier\"),1)","v":"T"},null,null,null,null,0,{"$f":"IF(AND(K36=0.5,COUNTA(C36:F36)=4),\"erreur\",IF(AND(D36-C36>0,F36-E36=0),G36-Calendrier!$AS$9/2-M36,IF(AND(F36-E36>0,D36-C36=0),(F36-E36)-Calendrier!$AS$9/2-M36,IF(COUNTA(C36:F36)=4,(D36-C36)+(F36-E36)-M36-Calendrier!$AS$9,0))))","v":0},0,"",0,null,0]
[19,{"$f":"INDIRECT(ADDRESS(MATCH($B$1,Calendrier!$A$15:$A$59,0)+14,ROW()-17,3,1,\"Calendrier\"),1)","v":"T"},null,null,null,null,0,{"$f":"IF(AND(K37=0.5,COUNTA(C37:F37)=4),\"erreur\",IF(AND(D37-C37>0,F37-E37=0),G37-Calendrier!$AS$9/2-M37,IF(AND(F37-E37>0,D37-C37=0),(F37-E37)-Calendrier!$AS$9/2-M37,IF(COUNTA(C37:F37)=4,(D37-C37)+(F37-E37)-M37-Calendrier!$AS$9,0))))","v":0},0,"",0,null,0]
[20,{"$f":"INDIRECT(ADDRESS(MATCH($B$1,Calendrier!$A$15:$A$59,0)+14,ROW()-17,3,1,\"Calendrier\"),1)","v":"T"},null,null,null,null,0,{"$f":"IF(AND(K38=0.5,COUNTA(C38:F38)=4),\"erreur\",IF(AND(D38-C38>0,F38-E38=0),G38-Calendrier!$AS$9/2-M38,IF(AND(F38-E38>0,D38-C38=0),(F38-E38)-Calendrier!$AS$9/2-M38,IF(COUNTA(C38:F38)=4,(D38-C38)+(F38-E38)-M38-Calendrier!$AS$9,0))))","v":0},0,"",0,null,0]
[21,{"$f":"INDIRECT(ADDRESS(MATCH($B$1,Calendrier!$A$15:$A$59,0)+14,ROW()-17,3,1,\"Calendrier\"),1)","v":"Sa"},null,null,null,null,0,{"$f":"IF(AND(K39=0.5,COUNTA(C39:F39)=4),\"erreur\",IF(AND(D39-C39>0,F39-E39=0),G39-Calendrier!$AS$9/2-M39,IF(AND(F39-E39>0,D39-C39=0),(F39-E39)-Calendrier!$AS$9/2-M39,IF(COUNTA(C39:F39)=4,(D39-C39)+(F39-E39)-M39-Calendrier!$AS$9,0))))","v":0},0,"Sa",0,null,0]
[22,{"$f":"INDIRECT(ADDRESS(MATCH($B$1,Calendrier!$A$15:$A$59,0)+14,ROW()-17,3,1,\"Calendrier\"),1)","v":"Di"},null,null,null,null,0,{"$f":"IF(AND(K40=0.5,COUNTA(C40:F40)=4),\"erreur\",IF(AND(D40-C40>0,F40-E40=0),G40-Calendrier!$AS$9/2-M40,IF(AND(F40-E40>0,D40-C40=0),(F40-E40)-Calendrier!$AS$9/2-M40,IF(COUNTA(C40:F40)=4,(D40-C40)+(F40-E40)-M40-Calendrier!$AS$9,0))))","v":0},0,"Di",0,null,0]
[23,{"$f":"INDIRECT(ADDRESS(MATCH($B$1,Calendrier!$A$15:$A$59,0)+14,ROW()-17,3,1,\"Calendrier\"),1)","v":"T"},null,null,null,null,0,{"$f":"IF(AND(K41=0.5,COUNTA(C41:F41)=4),\"erreur\",IF(AND(D41-C41>0,F41-E41=0),G41-Calendrier!$AS$9/2-M41,IF(AND(F41-E41>0,D41-C41=0),(F41-E41)-Calendrier!$AS$9/2-M41,IF(COUNTA(C41:F41)=4,(D41-C41)+(F41-E41)-M41-Calendrier!$AS$9,0))))","v":0},0,"",0,null,0]
[24,{"$f":"INDIRECT(ADDRESS(MATCH($B$1,Calendrier!$A$15:$A$59,0)+14,ROW()-17,3,1,\"Calendrier\"),1)","v":"T"},null,null,null,null,0,{"$f":"IF(AND(K42=0.5,COUNTA(C42:F42)=4),\"erreur\",IF(AND(D42-C42>0,F42-E42=0),G42-Calendrier!$AS$9/2-M42,IF(AND(F42-E42>0,D42-C42=0),(F42-E42)-Calendrier!$AS$9/2-M42,IF(COUNTA(C42:F42)=4,(D42-C42)+(F42-E42)-M42-Calendrier!$AS$9,0))))","v":0},0,"",0,null,0]
[25,{"$f":"INDIRECT(ADDRESS(MATCH($B$1,Calendrier!$A$15:$A$59,0)+14,ROW()-17,3,1,\"Calendrier\"),1)","v":"T"},null,null,null,null,0,{"$f":"IF(AND(K43=0.5,COUNTA(C43:F43)=4),\"erreur\",IF(AND(D43-C43>0,F43-E43=0),G43-Calendrier!$AS$9/2-M43,IF(AND(F43-E43>0,D43-C43=0),(F43-E43)-Calendrier!$AS$9/2-M43,IF(COUNTA(C43:F43)=4,(D43-C43)+(F43-E43)-M43-Calendrier!$AS$9,0))))","v":0},0,"",0,null,0]
[26,{"$f":"INDIRECT(ADDRESS(MATCH($B$1,Calendrier!$A$15:$A$59,0)+14,ROW()-17,3,1,\"Calendrier\"),1)","v":"T"},null,null,null,null,0,{"$f":"IF(AND(K44=0.5,COUNTA(C44:F44)=4),\"erreur\",IF(AND(D44-C44>0,F44-E44=0),G44-Calendrier!$AS$9/2-M44,IF(AND(F44-E44>0,D44-C44=0),(F44-E44)-Calendrier!$AS$9/2-M44,IF(COUNTA(C44:F44)=4,(D44-C44)+(F44-E44)-M44-Calendrier!$AS$9,0))))","v":0},0,"",0,null,0]
[27,{"$f":"INDIRECT(ADDRESS(MATCH($B$1,Calendrier!$A$15:$A$59,0)+14,ROW()-17,3,1,\"Calendrier\"),1)","v":"T"},null,null,null,null,0,{"$f":"IF(AND(K45=0.5,COUNTA(C45:F45)=4),\"erreur\",IF(AND(D45-C45>0,F45-E45=0),G45-Calendrier!$AS$9/2-M45,IF(AND(F45-E45>0,D45-C45=0),(F45-E45)-Calendrier!$AS$9/2-M45,IF(COUNTA(C45:F45)=4,(D45-C45)+(F45-E45)-M45-Calendrier!$AS$9,0))))","v":0},0,"",0,null,0]
[28,{"$f":"INDIRECT(ADDRESS(MATCH($B$1,Calendrier!$A$15:$A$59,0)+14,ROW()-17,3,1,\"Calendrier\"),1)","v":"Sa"},null,null,null,null,0,{"$f":"IF(AND(K46=0.5,COUNTA(C46:F46)=4),\"erreur\",IF(AND(D46-C46>0,F46-E46=0),G46-Calendrier!$AS$9/2-M46,IF(AND(F46-E46>0,D46-C46=0),(F46-E46)-Calendrier!$AS$9/2-M46,IF(COUNTA(C46:F46)=4,(D46-C46)+(F46-E46)-M46-Calendrier!$AS$9,0))))","v":0},0,"Sa",0,null,0]
[29,{"$f":"INDIRECT(ADDRESS(MATCH($B$1,Calendrier!$A$15:$A$59,0)+14,ROW()-17,3,1,\"Calendrier\"),1)","v":"Di"},null,null,null,null,0,{"$f":"IF(AND(K47=0.5,COUNTA(C47:F47)=4),\"erreur\",IF(AND(D47-C47>0,F47-E47=0),G47-Calendrier!$AS$9/2-M47,IF(AND(F47-E47>0,D47-C47=0),(F47-E47)-Calendrier!$AS$9/2-M47,IF(COUNTA(C47:F47)=4,(D47-C47)+(F47-E47)-M47-Calendrier!$AS$9,0))))","v":0},0,"Di",0,null,0]
[30,{"$f":"INDIRECT(ADDRESS(MATCH($B$1,Calendrier!$A$15:$A$59,0)+14,ROW()-17,3,1,\"Calendrier\"),1)","v":"T"},null,null,null,null,0,{"$f":"IF(AND(K48=0.5,COUNTA(C48:F48)=4),\"erreur\",IF(AND(D48-C48>0,F48-E48=0),G48-Calendrier!$AS$9/2-M48,IF(AND(F48-E48>0,D48-C48=0),(F48-E48)-Calendrier!$AS$9/2-M48,IF(COUNTA(C48:F48)=4,(D48-C48)+(F48-E48)-M48-Calendrier!$AS$9,0))))","v":0},0,"",0,null,0]
[31,{"$f":"INDIRECT(ADDRESS(MATCH($B$1,Calendrier!$A$15:$A$59,0)+14,ROW()-17,3,1,\"Calendrier\"),1)","v":"T"},null,null,null,null,0,{"$f":"IF(AND(K49=0.5,COUNTA(C49:F49)=4),\"erreur\",IF(AND(D49-C49>0,F49-E49=0),G49-Calendrier!$AS$9/2-M49,IF(AND(F49-E49>0,D49-C49=0),(F49-E49)-Calendrier!$AS$9/2-M49,IF(COUNTA(C49:F49)=4,(D49-C49)+(F49-E49)-M49-Calendrier!$AS$9,0))))","v":0},0,"",0,null,0]
[null,null,null,null,null,null,null,"solde des variations",{"$f":"I49","v":0}]

{"sheet":"JUN","index":6,"n_rows":50,"n_cols":15,"rows_kept":50,"cut":false,"hidden":false,"merged":[]}
[null,{"$f":"RIGHT(CELL(\"nomfichier\",$A$1),3)","v":"JUN"},"FICHE DE SUIVI HORAIRE"]
[]
[null,"mois :","JUIN",null,null,"année ",{"$f":"Calendrier!A1","v":2016},null,"service",{"$f":"Calendrier!F4","v":"COMPTABILITE"}]
[]
[null,"nom :",{"$f":"Calendrier!F2","v":"MARTIN"},null,null," prénom ",{"$f":"Calendrier!F3","v":"PATRICK"},null,"N° Ident.",{"$f":"Calendrier!F1","v":"N123456"}]
[null,null,null,null,null,null,null,"à réaliser","cumul","en cours","reste",null,"n/cumul"]
[null,null,null,"Nb J/T",{"$f":"Calendrier!$A$10","v":213},{"$f":"+$H$10","v":0},{"$f":"$H$12","v":213},{"$f":"Calendrier!$N$1","v":366},{"$f":"MAI!M7","v":56},{"$f":"SUM(J8:J15)","v":10},{"$f":"H7-(I7+J7)","v":300},null,{"$f":"SUM(M8:M15)","v":66}]
[null,null,null,null,null,null,"CA",{"$f":"Calendrier!N5","v":25},{"$f":"MAI!M8","v":0},{"$f":"IF(G8=\"\",0,COUNTIF($J$19:$J$49,G8))+IF(F8=\"\",0,COUNTIF($J$19:$J$49,F8)/2)","v":0},{"$f":"+H8-(I8+J8)","v":25},"J",{"$f":"+I8+J8","v":0}]
[null,null,null,null,null,"1/2RTT","RTT",{"$f":"Calendrier!N8","v":16},{"$f":"MAI!M9","v":9},{"$f":"IF(G9=\"\",0,COUNTIF($J$19:$J$49,G9))+IF(F9=\"\",0,COUNTIF($J$19:$J$49,F9)/2)","v":2},{"$f":"+H9-(I9+J9)","v":5},"J",11]
[null,null,null,null,null,"1/2CS","CS",{"$f":"Calendrier!N9","v":0},{"$f":"MAI!M10","v":0},{"$f":"IF(G10=\"\",0,COUNTIF($J$19:$J$49,G10))+IF(F10=\"\",0,COUNTIF($J$19:$J$49,F10)/2)","v":0},{"$f":"H10-(I10+J10)","v":0},"J",0]
[null,null,null,null,null,null,"CP",{"$f":"Calendrier!N6","v":0},{"$f":"MAI!M11","v":0},0,{"$f":"H11-(I11+J11)","v":0},"J",0]
[null,null,null,null,null,"1/2T","T",{"$f":"Calendrier!N7","v":213},{"$f":"MAI!M12","v":0},0,{"$f":"+H12-(I12+J12)","v":213},"J",0]
[null,null,null,null,null,null,"Sa",{"$f":"Calendrier!N4","v":53},{"$f":"MAI!M13","v":22},4,{"$f":"+H13-(I13+J13)","v":27},"J",26]
[null,null,null,null,null,null,"Di",{"$f":"Calendrier!N3","v":47},{"$f":"MAI!M14","v":18},4,{"$f":"+H14-(I14+J14)","v":25},"J",22]
[null,null,null,null,null,null,"F",{"$f":"Calendrier!N2","v":12},{"$f":"MAI!M15","v":7},0,{"$f":"+H15-(I15+J15)","v":5},"J",{"$f":"+I15+J15","v":7}]
[null,null,null,null,null,null,"heure/avance fin mois",null,{"$f":"MAI!I50","v":0},null,null,null,{"$f":"I50","v":0}]
[null,"Prévu","Entrée","Sortie","Entrée","Sortie","total J","variation","cumul","Type","nb J/T",null,"Bon E/S","Sortie","Retour"]
[null,null,null,null,null,null,null,null,null,null,null,null,null,"avec bon"]
[1,{"$f":"INDIRECT(ADDRESS(MATCH($B$1,Calendrier!$A$15:$A$59,0)+14,ROW()-17,3,1,\"Calendrier\"),1)","v":"T"},null,null,null,null,{"$f":"IF(COUNTA(C19:F19)=4,(D19-C19)+(F19-E19)-M19,IF(COUNTA(C19:D19)<2,(F19-E19)-M19,(D19-C19)-M19))","v":0},{"$f":"IF(AND(K19=0.5,COUNTA(C19:F19)=4),\"erreur\",IF(AND(D19-C19>0,F19-E19=0),G19-Calendrier!$AS$9/2-M19,IF(AND(F19-E19>0,D19-C19=0),(F19-E19)-Calendrier!$AS$9/2-M19,IF(COUNTA(C19:F19)=4,(D19-C19)+(F19-E19)-M19-Calendrier!$AS$9,0))))","v":0},{"$f":"+I16+H19","v":0},{"$f":"IF(AND(COUNTA(C19:F19)=0,B19<>\"T\"),B19,IF(AND(OR(B19=$F$9,B19=$F$10),COUNTA(C19:F19=2)),\"T\",IF(G19>=6,\"T\",\"\")))","v":""},{"$f":"IF(OR(B19=$F$9,B19=$F$10),0.5,IF(G19>=6,1,0))","v":0},null,{"$f":"+O19-N19","v":0}]
[2,{"$f":"INDIRECT(ADDRESS(MATCH($B$1,Calendrier!$A$15:$A$59,0)+14,ROW()-17,3,1,\"Calendrier\"),1)","v":"T"},null,null,null,null,0,{"$f":"IF(AND(K20=0.5,COUNTA(C20:F20)=4),\"erreur\",IF(AND(D20-C20>0,F20-E20=0),G20-Calendrier!$AS$9/2-M20,IF(AND(F20-E20>0,D20-C20=0),(F20-E20)-Calendrier!$AS$9/2-M20,IF(COUNTA(C20:F20)=4,(D20-C20)+(F20-E20)-M20-Calendrier!$AS$9,0))))","v":0},{"$f":"+I19+H20","v":0},"",0,null,{"$f":"+O20-N20","v":0}]
[3,{"$f":"INDIRECT(ADDRESS(MATCH($B$1,Calendrier!$A$15:$A$59,0)+14,ROW()-17,3,1,\"Calendrier\"),1)","v":"T"},null,null,null,null,0,{"$f":"IF(AND(K21=0.5,COUNTA(C21:F21)=4),\"erreur\",IF(AND(D21-C21>0,F21-E21=0),G21-Calendrier!$AS$9/2-M21,IF(AND(F21-E21>0,D21-C21=0),(F21-E21)-Calendrier!$AS$9/2-M21,IF(COUNTA(C21:F21)=4,(D21-C21)+(F21-E21)-M21-Calendrier!$AS$9,0))))","v":0},0,"",0,null,0]
[4,{"$f":"INDIRECT(ADDRESS(MATCH($B$1,Calendrier!$A$15:$A$59,0)+14,ROW()-17,3,1,\"Calendrier\"),1)","v":"Sa"},null,null,null,null,0,{"$f":"IF(AND(K22=0.5,COUNTA(C22:F22)=4),\"erreur\",IF(AND(D22-C22>0,F22-E22=0),G22-Calendrier!$AS$9/2-M22,IF(AND(F22-E22>0,D22-C22=0),(F22-E22)-Calendrier!$AS$9/2-M22,IF(COUNTA(C22:F22)=4,(D22-C22)+(F22-E22)-M22-Calendrier!$AS$9,0))))","v":0},0,"Sa",0,null,0]
[5,{"$f":"INDIRECT(ADDRESS(MATCH($B$1,Calendrier!$A$15:$A$59,0)+14,ROW()-17,3,1,\"Calendrier\"),1)","v":"Di"},null,null,null,null,0,{"$f":"IF(AND(K23=0.5,COUNTA(C23:F23)=4),\"erreur\",IF(AND(D23-C23>0,F23-E23=0),G23-Calendrier!$AS$9/2-M23,IF(AND(F23-E23>0,D23-C23=0),(F23-E23)-Calendrier!$AS$9/2-M23,IF(COUNTA(C23:F23)=4,(D23-C23)+(F23-E23)-M23-Calendrier!$AS$9,0))))","v":0},0,"Di",{"$f":"IF(OR(B23=$F$9,B23=$F$10),0.5,IF(G23>=6,1,0))","v":0},null,0]
[6,{"$f":"INDIRECT(ADDRESS(MATCH($B$1,Calendrier!$A$15:$A$59,0)+14,ROW()-17,3,1,\"Calendrier\"),1)","v":"T"},null,null,null,null,0,{"$f":"IF(AND(K24=0.5,COUNTA(C24:F24)=4),\"erreur\",IF(AND(D24-C24>0,F24-E24=0),G24-Calendrier!$AS$9/2-M24,IF(AND(F24-E24>0,D24-C24=0),(F24-E24)-Calendrier!$AS$9/2-M24,IF(COUNTA(C24:F24)=4,(D24-C24)+(F24-E24)-M24-Calendrier!$AS$9,0))))","v":0},0,"",0,null,0]
[7,{"$f":"INDIRECT(ADDRESS(MATCH($B$1,Calendrier!$A$15:$A$59,0)+14,ROW()-17,3,1,\"Calendrier\"),1)","v":"T"},null,null,null,null,0,{"$f":"IF(AND(K25=0.5,COUNTA(C25:F25)=4),\"erreur\",IF(AND(D25-C25>0,F25-E25=0),G25-Calendrier!$AS$9/2-M25,IF(AND(F25-E25>0,D25-C25=0),(F25-E25)-Calendrier!$AS$9/2-M25,IF(COUNTA(C25:F25)=4,(D25-C25)+(F25-E25)-M25-Calendrier!$AS$9,0))))","v":0},0,"",0,null,0]
[8,{"$f":"INDIRECT(ADDRESS(MATCH($B$1,Calendrier!$A$15:$A$59,0)+14,ROW()-17,3,1,\"Calendrier\"),1)","v":"T"},null,null,null,null,0,{"$f":"IF(AND(K26=0.5,COUNTA(C26:F26)=4),\"erreur\",IF(AND(D26-C26>0,F26-E26=0),G26-Calendrier!$AS$9/2-M26,IF(AND(F26-E26>0,D26-C26=0),(F26-E26)-Calendrier!$AS$9/2-M26,IF(COUNTA(C26:F26)=4,(D26-C26)+(F26-E26)-M26-Calendrier!$AS$9,0))))","v":0},0,"",0,null,0]
[9,{"$f":"INDIRECT(ADDRESS(MATCH($B$1,Calendrier!$A$15:$A$59,0)+14,ROW()-17,3,1,\"Calendrier\"),1)","v":"T"},null,null,null,null,0,{"$f":"IF(AND(K27=0.5,COUNTA(C27:F27)=4),\"erreur\",IF(AND(D27-C27>0,F27-E27=0),G27-Calendrier!$AS$9/2-M27,IF(AND(F27-E27>0,D27-C27=0),(F27-E27)-Calendrier!$AS$9/2-M27,IF(COUNTA(C27:F27)=4,(D27-C27)+(F27-E27)-M27-Calendrier!$AS$9,0))))","v":0},0,"",0,null,0]
[10,{"$f":"INDIRECT(ADDRESS(MATCH($B$1,Calendrier!$A$15:$A$59,0)+14,ROW()-17,3,1,\"Calendrier\"),1)","v":"RTT"},null,null,null,null,0,{"$f":"IF(AND(K28=0.5,COUNTA(C28:F28)=4),\"erreur\",IF(AND(D28-C28>0,F28-E28=0),G28-Calendrier!$AS$9/2-M28,IF(AND(F28-E28>0,D28-C28=0),(F28-E28)-Calendrier!$AS$9/2-M28,IF(COUNTA(C28:F28)=4,(D28-C28)+(F28-E28)-M28-Calendrier!$AS$9,0))))","v":0},0,"RTT",0,null,0]
[11,{"$f":"INDIRECT(ADDRESS(MATCH($B$1,Calendrier!$A$15:$A$59,0)+14,ROW()-17,3,1,\"Calendrier\"),1)","v":"Sa"},null,null,null,null,0,{"$f":"IF(AND(K29=0.5,COUNTA(C29:F29)=4),\"erreur\",IF(AND(D29-C29>0,F29-E29=0),G29-Calendrier!$AS$9/2-M29,IF(AND(F29-E29>0,D29-C29=0),(F29-E29)-Calendrier!$AS$9/2-M29,IF(COUNTA(C29:F29)=4,(D29-C29)+(F29-E29)-M29-Calendrier!$AS$9,0))))","v":0},0,"Sa",0,null,0]
[12,{"$f":"INDIRECT(ADDRESS(MATCH($B$1,Calendrier!$A$15:$A$59,0)+14,ROW()-17,3,1,\"Calendrier\"),1)","v":"Di"},null,null,null,null,0,{"$f":"IF(AND(K30=0.5,COUNTA(C30:F30)=4),\"erreur\",IF(AND(D30-C30>0,F30-E30=0),G30-Calendrier!$AS$9/2-M30,IF(AND(F30-E30>0,D30-C30=0),(F30-E30)-Calendrier!$AS$9/2-M30,IF(COUNTA(C30:F30)=4,(D30-C30)+(F30-E30)-M30-Calendrier!$AS$9,0))))","v":0},0,"Di",0,null,0]
[13,{"$f":"INDIRECT(ADDRESS(MATCH($B$1,Calendrier!$A$15:$A$59,0)+14,ROW()-17,3,1,\"Calendrier\"),1)","v":"T"},null,null,null,null,0,{"$f":"IF(AND(K31=0.5,COUNTA(C31:F31)=4),\"erreur\",IF(AND(D31-C31>0,F31-E31=0),G31-Calendrier!$AS$9/2-M31,IF(AND(F31-E31>0,D31-C31=0),(F31-E31)-Calendrier!$AS$9/2-M31,IF(COUNTA(C31:F31)=4,(D31-C31)+(F31-E31)-M31-Calendrier!$AS$9,0))))","v":0},0,"",0,null,0]
[14,{"$f":"INDIRECT(ADDRESS(MATCH($B$1,Calendrier!$A$15:$A$59,0)+14,ROW()-17,3,1,\"Calendrier\"),1)","v":"T"},null,null,null,null,0,{"$f":"IF(AND(K32=0.5,COUNTA(C32:F32)=4),\"erreur\",IF(AND(D32-C32>0,F32-E32=0),G32-Calendrier!$AS$9/2-M32,IF(AND(F32-E32>0,D32-C32=0),(F32-E32)-Calendrier!$AS$9/2-M32,IF(COUNTA(C32:F32)=4,(D32-C32)+(F32-E32)-M32-Calendrier!$AS$9,0))))","v":0},0,"",0,null,0]
[15,{"$f":"INDIRECT(ADDRESS(MATCH($B$1,Calendrier!$A$15:$A$59,0)+14,ROW()-17,3,1,\"Calendrier\"),1)","v":"T"},null,null,null,null,0,{"$f":"IF(AND(K33=0.5,COUNTA(C33:F33)=4),\"erreur\",IF(AND(D33-C33>0,F33-E33=0),G33-Calendrier!$AS$9/2-M33,IF(AND(F33-E33>0,D33-C33=0),(F33-E33)-Calendrier!$AS$9/2-M33,IF(COUNTA(C33:F33)=4,(D33-C33)+(F33-E33)-M33-Calendrier!$AS$9,0))))","v":0},0,{"$f":"IF(AND(COUNTA(C33:F33)=0,B33<>\"T\"),B33,IF(AND(OR(B33=$F$9,B33=$F$10),COUNTA(C33:F33=2)),\"T\",IF(G33>=6,\"T\",\"\")))","v":""},0,null,0]
[16,{"$f":"INDIRECT(ADDRESS(MATCH($B$1,Calendrier!$A$15:$A$59,0)+14,ROW()-17,3,1,\"Calendrier\"),1)","v":"T"},null,null,null,null,0,{"$f":"IF(AND(K34=0.5,COUNTA(C34:F34)=4),\"erreur\",IF(AND(D34-C34>0,F34-E34=0),G34-Calendrier!$AS$9/2-M34,IF(AND(F34-E34>0,D34-C34=0),(F34-E34)-Calendrier!$AS$9/2-M34,IF(COUNTA(C34:F34)=4,(D34-C34)+(F34-E34)-M34-Calendrier!$AS$9,0))))","v":0},0,"",0,null,0]
[17,{"$f":"INDIRECT(ADDRESS(MATCH($B$1,Calendrier!$A$15:$A$59,0)+14,ROW()-17,3,1,\"Calendrier\"),1)","v":"RTT"},null,null,null,null,0,{"$f":"IF(AND(K35=0.5,COUNTA(C35:F35)=4),\"erreur\",IF(AND(D35-C35>0,F35-E35=0),G35-Calendrier!$AS$9/2-M35,IF(AND(F35-E35>0,D35-C35=0),(F35-E35)-Calendrier!$AS$9/2-M35,IF(COUNTA(C35:F35)=4,(D35-C35)+(F35-E35)-M35-Calendrier!$AS$9,0))))","v":0},0,"RTT",0,null,0]
[18,{"$f":"INDIRECT(ADDRESS(MATCH($B$1,Calendrier!$A$15:$A$59,0)+14,ROW()-17,3,1,\"Calendrier\"),1)","v":"Sa"},null,null,null,null,0,{"$f":"IF(AND(K36=0.5,COUNTA(C36:F36)=4),\"erreur\",IF(AND(D36-C36>0,F36-E36=0),G36-Calendrier!$AS$9/2-M36,IF(AND(F36-E36>0,D36-C36=0),(F36-E36)-Calendrier!$AS$9/2-M36,IF(COUNTA(C36:F36)=4,(D36-C36)+(F36-E36)-M36-Calendrier!$AS$9,0))))","v":0},0,"Sa",0,null,0]
[19,{"$f":"INDIRECT(ADDRESS(MATCH($B$1,Calendrier!$A$15:$A$59,0)+14,ROW()-17,3,1,\"Calendrier\"),1)","v":"Di"},null,null,null,null,0,{"$f":"IF(AND(K37=0.5,COUNTA(C37:F37)=4),\"erreur\",IF(AND(D37-C37>0,F37-E37=0),G37-Calendrier!$AS$9/2-M37,IF(AND(F37-E37>0,D37-C37=0),(F37-E37)-Calendrier!$AS$9/2-M37,IF(COUNTA(C37:F37)=4,(D37-C37)+(F37-E37)-M37-Calendrier!$AS$9,0))))","v":0},0,"Di",0,null,0]
[20,{"$f":"INDIRECT(ADDRESS(MATCH($B$1,Calendrier!$A$15:$A$59,0)+14,ROW()-17,3,1,\"Calendrier\"),1)","v":"T"},null,null,null,null,0,{"$f":"IF(AND(K38=0.5,COUNTA(C38:F38)=4),\"erreur\",IF(AND(D38-C38>0,F38-E38=0),G38-Calendrier!$AS$9/2-M38,IF(AND(F38-E38>0,D38-C38=0),(F38-E38)-Calendrier!$AS$9/2-M38,IF(COUNTA(C38:F38)=4,(D38-C38)+(F38-E38)-M38-Calendrier!$AS$9,0))))","v":0},0,"",0,null,0]
[21,{"$f":"INDIRECT(ADDRESS(MATCH($B$1,Calendrier!$A$15:$A$59,0)+14,ROW()-17,3,1,\"Calendrier\"),1)","v":"T"},null,null,null,null,0,{"$f":"IF(AND(K39=0.5,COUNTA(C39:F39)=4),\"erreur\",IF(AND(D39-C39>0,F39-E39=0),G39-Calendrier!$AS$9/2-M39,IF(AND(F39-E39>0,D39-C39=0),(F39-E39)-Calendrier!$AS$9/2-M39,IF(COUNTA(C39:F39)=4,(D39-C39)+(F39-E39)-M39-Calendrier!$AS$9,0))))","v":0},0,"",0,null,0]
[22,{"$f":"INDIRECT(ADDRESS(MATCH($B$1,Calendrier!$A$15:$A$59,0)+14,ROW()-17,3,1,\"Calendrier\"),1)","v":"T"},null,null,null,null,0,{"$f":"IF(AND(K40=0.5,COUNTA(C40:F40)=4),\"erreur\",IF(AND(D40-C40>0,F40-E40=0),G40-Calendrier!$AS$9/2-M40,IF(AND(F40-E40>0,D40-C40=0),(F40-E40)-Calendrier!$AS$9/2-M40,IF(COUNTA(C40:F40)=4,(D40-C40)+(F40-E40)-M40-Calendrier!$AS$9,0))))","v":0},0,"",0,null,0]
[23,{"$f":"INDIRECT(ADDRESS(MATCH($B$1,Calendrier!$A$15:$A$59,0)+14,ROW()-17,3,1,\"Calendrier\"),1)","v":"T"},null,null,null,null,0,{"$f":"IF(AND(K41=0.5,COUNTA(C41:F41)=4),\"erreur\",IF(AND(D41-C41>0,F41-E41=0),G41-Calendrier!$AS$9/2-M41,IF(AND(F41-E41>0,D41-C41=0),(F41-E41)-Calendrier!$AS$9/2-M41,IF(COUNTA(C41:F41)=4,(D41-C41)+(F41-E41)-M41-Calendrier!$AS$9,0))))","v":0},0,"",0,null,0]
[24,{"$f":"INDIRECT(ADDRESS(MATCH($B$1,Calendrier!$A$15:$A$59,0)+14,ROW()-17,3,1,\"Calendrier\"),1)","v":"T"},null,null,null,null,0,{"$f":"IF(AND(K42=0.5,COUNTA(C42:F42)=4),\"erreur\",IF(AND(D42-C42>0,F42-E42=0),G42-Calendrier!$AS$9/2-M42,IF(AND(F42-E42>0,D42-C42=0),(F42-E42)-Calendrier!$AS$9/2-M42,IF(COUNTA(C42:F42)=4,(D42-C42)+(F42-E42)-M42-Calendrier!$AS$9,0))))","v":0},0,"",0,null,0]
[25,{"$f":"INDIRECT(ADDRESS(MATCH($B$1,Calendrier!$A$15:$A$59,0)+14,ROW()-17,3,1,\"Calendrier\"),1)","v":"Sa"},null,null,null,null,0,{"$f":"IF(AND(K43=0.5,COUNTA(C43:F43)=4),\"erreur\",IF(AND(D43-C43>0,F43-E43=0),G43-Calendrier!$AS$9/2-M43,IF(AND(F43-E43>0,D43-C43=0),(F43-E43)-Calendrier!$AS$9/2-M43,IF(COUNTA(C43:F43)=4,(D43-C43)+(F43-E43)-M43-Calendrier!$AS$9,0))))","v":0},0,"Sa",0,null,0]
[26,{"$f":"INDIRECT(ADDRESS(MATCH($B$1,Calendrier!$A$15:$A$59,0)+14,ROW()-17,3,1,\"Calendrier\"),1)","v":"Di"},null,null,null,null,0,{"$f":"IF(AND(K44=0.5,COUNTA(C44:F44)=4),\"erreur\",IF(AND(D44-C44>0,F44-E44=0),G44-Calendrier!$AS$9/2-M44,IF(AND(F44-E44>0,D44-C44=0),(F44-E44)-Calendrier!$AS$9/2-M44,IF(COUNTA(C44:F44)=4,(D44-C44)+(F44-E44)-M44-Calendrier!$AS$9,0))))","v":0},0,"Di",0,null,0]
[27,{"$f":"INDIRECT(ADDRESS(MATCH($B$1,Calendrier!$A$15:$A$59,0)+14,ROW()-17,3,1,\"Calendrier\"),1)","v":"T"},null,null,null,null,0,{"$f":"IF(AND(K45=0.5,COUNTA(C45:F45)=4),\"erreur\",IF(AND(D45-C45>0,F45-E45=0),G45-Calendrier!$AS$9/2-M45,IF(AND(F45-E45>0,D45-C45=0),(F45-E45)-Calendrier!$AS$9/2-M45,IF(COUNTA(C45:F45)=4,(D45-C45)+(F45-E45)-M45-Calendrier!$AS$9,0))))","v":0},0,"",0,null,0]
[28,{"$f":"INDIRECT(ADDRESS(MATCH($B$1,Calendrier!$A$15:$A$59,0)+14,ROW()-17,3,1,\"Calendrier\"),1)","v":"T"},null,null,null,null,0,{"$f":"IF(AND(K46=0.5,COUNTA(C46:F46)=4),\"erreur\",IF(AND(D46-C46>0,F46-E46=0),G46-Calendrier!$AS$9/2-M46,IF(AND(F46-E46>0,D46-C46=0),(F46-E46)-Calendrier!$AS$9/2-M46,IF(COUNTA(C46:F46)=4,(D46-C46)+(F46-E46)-M46-Calendrier!$AS$9,0))))","v":0},0,"",0,null,0]
[29,{"$f":"INDIRECT(ADDRESS(MATCH($B$1,Calendrier!$A$15:$A$59,0)+14,ROW()-17,3,1,\"Calendrier\"),1)","v":"T"},null,null,null,null,0,{"$f":"IF(AND(K47=0.5,COUNTA(C47:F47)=4),\"erreur\",IF(AND(D47-C47>0,F47-E47=0),G47-Calendrier!$AS$9/2-M47,IF(AND(F47-E47>0,D47-C47=0),(F47-E47)-Calendrier!$AS$9/2-M47,IF(COUNTA(C47:F47)=4,(D47-C47)+(F47-E47)-M47-Calendrier!$AS$9,0))))","v":0},0,"",0,null,0]
[30,{"$f":"INDIRECT(ADDRESS(MATCH($B$1,Calendrier!$A$15:$A$59,0)+14,ROW()-17,3,1,\"Calendrier\"),1)","v":"T"},null,null,null,null,0,{"$f":"IF(AND(K48=0.5,COUNTA(C48:F48)=4),\"erreur\",IF(AND(D48-C48>0,F48-E48=0),G48-Calendrier!$AS$9/2-M48,IF(AND(F48-E48>0,D48-C48=0),(F48-E48)-Calendrier!$AS$9/2-M48,IF(COUNTA(C48:F48)=4,(D48-C48)+(F48-E48)-M48-Calendrier!$AS$9,0))))","v":0},0,"",0,null,0]
[null,null,null,null,null,null,null,null,0,0,0,null,0]
[null,null,null,null,null,null,null,"solde des variations",{"$f":"I49","v":0}]

{"sheet":"JUL","index":7,"n_rows":50,"n_cols":15,"rows_kept":50,"cut":false,"hidden":false,"merged":[]}
[null,{"$f":"RIGHT(CELL(\"nomfichier\",$A$1),3)","v":"JUL"},"FICHE DE SUIVI HORAIRE"]
[]
[null,"mois :","JUILLET",null,null,"année ",{"$f":"Calendrier!A1","v":2016},null,"service",{"$f":"Calendrier!F4","v":"COMPTABILITE"}]
[]
[null,"nom :",{"$f":"Calendrier!F2","v":"MARTIN"},null,null," prénom ",{"$f":"Calendrier!F3","v":"PATRICK"},null,"N° Ident.",{"$f":"Calendrier!F1","v":"N123456"}]
[null,null,null,null,null,null,null,"à réaliser","cumul","en cours","reste",null,"n/cumul"]
[null,null,null,"Nb J/T",{"$f":"Calendrier!$A$10","v":213},{"$f":"+$H$10","v":0},{"$f":"$H$12","v":213},{"$f":"Calendrier!$N$1","v":366},{"$f":"JUN!M7","v":66},{"$f":"SUM(J8:J15)","v":13},{"$f":"H7-(I7+J7)","v":287},null,{"$f":"SUM(M8:M15)","v":79}]
[null,null,null,null,null,null,"CA",{"$f":"Calendrier!N5","v":25},{"$f":"JUN!M8","v":0},{"$f":"IF(G8=\"\",0,COUNTIF($J$19:$J$49,G8))+IF(F8=\"\",0,COUNTIF($J$19:$J$49,F8)/2)","v":1},{"$f":"+H8-(I8+J8)","v":24},"J",{"$f":"+I8+J8","v":1}]
[null,null,null,null,null,"1/2RTT","RTT",{"$f":"Calendrier!N8","v":16},{"$f":"JUN!M9","v":11},{"$f":"IF(G9=\"\",0,COUNTIF($J$19:$J$49,G9))+IF(F9=\"\",0,COUNTIF($J$19:$J$49,F9)/2)","v":1},{"$f":"+H9-(I9+J9)","v":4},"J",12]
[null,null,null,null,null,"1/2CS","CS",{"$f":"Calendrier!N9","v":0},{"$f":"JUN!M10","v":0},{"$f":"IF(G10=\"\",0,COUNTIF($J$19:$J$49,G10))+IF(F10=\"\",0,COUNTIF($J$19:$J$49,F10)/2)","v":0},{"$f":"H10-(I10+J10)","v":0},"J",0]
[null,null,null,null,null,null,"CP",{"$f":"Calendrier!N6","v":0},{"$f":"JUN!M11","v":0},0,{"$f":"H11-(I11+J11)","v":0},"J",0]
[null,null,null,null,null,"1/2T","T",{"$f":"Calendrier!N7","v":213},{"$f":"JUN!M12","v":0},0,{"$f":"+H12-(I12+J12)","v":213},"J",0]
[null,null,null,null,null,null,"Sa",{"$f":"Calendrier!N4","v":53},{"$f":"JUN!M13","v":26},5,{"$f":"+H13-(I13+J13)","v":22},"J",31]
[null,null,null,null,null,null,"Di",{"$f":"Calendrier!N3","v":47},{"$f":"JUN!M14","v":22},5,{"$f":"+H14-(I14+J14)","v":20},"J",27]
[null,null,null,null,null,null,"F",{"$f":"Calendrier!N2","v":12},{"$f":"JUN!M15","v":7},1,{"$f":"+H15-(I15+J15)","v":4},"J",{"$f":"+I15+J15","v":8}]
[null,null,null,null,null,null,"heure/avance fin mois",null,{"$f":"JUN!I50","v":0},null,null,null,{"$f":"I50","v":0}]
[null,"Prévu","Entrée","Sortie","Entrée","Sortie","total J","variation","cumul","Type","nb J/T",null,"Bon E/S","Sortie","Retour"]
[null,null,null,null,null,null,null,null,null,null,null,null,null,"avec bon"]
[1,{"$f":"INDIRECT(ADDRESS(MATCH($B$1,Calendrier!$A$15:$A$59,0)+14,ROW()-17,3,1,\"Calendrier\"),1)","v":"T"},null,null,null,null,{"$f":"IF(COUNTA(C19:F19)=4,(D19-C19)+(F19-E19)-M19,IF(COUNTA(C19:D19)<2,(F19-E19)-M19,(D19-C19)-M19))","v":0},{"$f":"IF(AND(K19=0.5,COUNTA(C19:F19)=4),\"erreur\",IF(AND(D19-C19>0,F19-E19=0),G19-Calendrier!$AS$9/2-M19,IF(AND(F19-E19>0,D19-C19=0),(F19-E19)-Calendrier!$AS$9/2-M19,IF(COUNTA(C19:F19)=4,(D19-C19)+(F19-E19)-M19-Calendrier!$AS$9,0))))","v":0},{"$f":"+I16+H19","v":0},{"$f":"IF(AND(COUNTA(C19:F19)=0,B19<>\"T\"),B19,IF(AND(OR(B19=$F$9,B19=$F$10),COUNTA(C19:F19=2)),\"T\",IF(G19>=6,\"T\",\"\")))","v":""},{"$f":"IF(OR(B19=$F$9,B19=$F$10),0.5,IF(G19>=6,1,0))","v":0},null,{"$f":"+O19-N19","v":0}]
[2,{"$f":"INDIRECT(ADDRESS(MATCH($B$1,Calendrier!$A$15:$A$59,0)+14,ROW()-17,3,1,\"Calendrier\"),1)","v":"Sa"},null,null,null,null,0,{"$f":"IF(AND(K20=0.5,COUNTA(C20:F20)=4),\"erreur\",IF(AND(D20-C20>0,F20-E20=0),G20-Calendrier!$AS$9/2-M20,IF(AND(F20-E20>0,D20-C20=0),(F20-E20)-Calendrier!$AS$9/2-M20,IF(COUNTA(C20:F20)=4,(D20-C20)+(F20-E20)-M20-Calendrier!$AS$9,0))))","v":0},{"$f":"+I19+H20","v":0},"Sa",0,null,{"$f":"+O20-N20","v":0}]
[3,{"$f":"INDIRECT(ADDRESS(MATCH($B$1,Calendrier!$A$15:$A$59,0)+14,ROW()-17,3,1,\"Calendrier\"),1)","v":"Di"},null,null,null,null,0,{"$f":"IF(AND(K21=0.5,COUNTA(C21:F21)=4),\"erreur\",IF(AND(D21-C21>0,F21-E21=0),G21-Calendrier!$AS$9/2-M21,IF(AND(F21-E21>0,D21-C21=0),(F21-E21)-Calendrier!$AS$9/2-M21,IF(COUNTA(C21:F21)=4,(D21-C21)+(F21-E21)-M21-Calendrier!$AS$9,0))))","v":0},0,"Di",0,null,0]
[4,{"$f":"INDIRECT(ADDRESS(MATCH($B$1,Calendrier!$A$15:$A$59,0)+14,ROW()-17,3,1,\"Calendrier\"),1)","v":"T"},null,null,null,null,0,{"$f":"IF(AND(K22=0.5,COUNTA(C22:F22)=4),\"erreur\",IF(AND(D22-C22>0,F22-E22=0),G22-Calendrier!$AS$9/2-M22,IF(AND(F22-E22>0,D22-C22=0),(F22-E22)-Calendrier!$AS$9/2-M22,IF(COUNTA(C22:F22)=4,(D22-C22)+(F22-E22)-M22-Calendrier!$AS$9,0))))","v":0},0,"",0,null,0]
[5,{"$f":"INDIRECT(ADDRESS(MATCH($B$1,Calendrier!$A$15:$A$59,0)+14,ROW()-17,3,1,\"Calendrier\"),1)","v":"T"},null,null,null,null,0,{"$f":"IF(AND(K23=0.5,COUNTA(C23:F23)=4),\"erreur\",IF(AND(D23-C23>0,F23-E23=0),G23-Calendrier!$AS$9/2-M23,IF(AND(F23-E23>0,D23-C23=0),(F23-E23)-Calendrier!$AS$9/2-M23,IF(COUNTA(C23:F23)=4,(D23-C23)+(F23-E23)-M23-Calendrier!$AS$9,0))))","v":0},0,"",{"$f":"IF(OR(B23=$F$9,B23=$F$10),0.5,IF(G23>=6,1,0))","v":0},null,0]
[6,{"$f":"INDIRECT(ADDRESS(MATCH($B$1,Calendrier!$A$15:$A$59,0)+14,ROW()-17,3,1,\"Calendrier\"),1)","v":"T"},null,null,null,null,0,{"$f":"IF(AND(K24=0.5,COUNTA(C24:F24)=4),\"erreur\",IF(AND(D24-C24>0,F24-E24=0),G24-Calendrier!$AS$9/2-M24,IF(AND(F24-E24>0,D24-C24=0),(F24-E24)-Calendrier!$AS$9/2-M24,IF(COUNTA(C24:F24)=4,(D24-C24)+(F24-E24)-M24-Calendrier!$AS$9,0))))","v":0},0,"",0,null,0]
[7,{"$f":"INDIRECT(ADDRESS(MATCH($B$1,Calendrier!$A$15:$A$59,0)+14,ROW()-17,3,1,\"Calendrier\"),1)","v":"T"},null,null,null,null,0,{"$f":"IF(AND(K25=0.5,COUNTA(C25:F25)=4),\"erreur\",IF(AND(D25-C25>0,F25-E25=0),G25-Calendrier!$AS$9/2-M25,IF(AND(F25-E25>0,D25-C25=0),(F25-E25)-Calendrier!$AS$9/2-M25,IF(COUNTA(C25:F25)=4,(D25-C25)+(F25-E25)-M25-Calendrier!$AS$9,0))))","v":0},0,"",0,null,0]
[8,{"$f":"INDIRECT(ADDRESS(MATCH($B$1,Calendrier!$A$15:$A$59,0)+14,ROW()-17,3,1,\"Calendrier\"),1)","v":"T"},null,null,null,null,0,{"$f":"IF(AND(K26=0.5,COUNTA(C26:F26)=4),\"erreur\",IF(AND(D26-C26>0,F26-E26=0),G26-Calendrier!$AS$9/2-M26,IF(AND(F26-E26>0,D26-C26=0),(F26-E26)-Calendrier!$AS$9/2-M26,IF(COUNTA(C26:F26)=4,(D26-C26)+(F26-E26)-M26-Calendrier!$AS$9,0))))","v":0},0,"",0,null,0]
[9,{"$f":"INDIRECT(ADDRESS(MATCH($B$1,Calendrier!$A$15:$A$59,0)+14,ROW()-17,3,1,\"Calendrier\"),1)","v":"Sa"},null,null,null,null,0,{"$f":"IF(AND(K27=0.5,COUNTA(C27:F27)=4),\"erreur\",IF(AND(D27-C27>0,F27-E27=0),G27-Calendrier!$AS$9/2-M27,IF(AND(F27-E27>0,D27-C27=0),(F27-E27)-Calendrier!$AS$9/2-M27,IF(COUNTA(C27:F27)=4,(D27-C27)+(F27-E27)-M27-Calendrier!$AS$9,0))))","v":0},0,"Sa",0,null,0]
[10,{"$f":"INDIRECT(ADDRESS(MATCH($B$1,Calendrier!$A$15:$A$59,0)+14,ROW()-17,3,1,\"Calendrier\"),1)","v":"Di"},null,null,null,null,0,{"$f":"IF(AND(K28=0.5,COUNTA(C28:F28)=4),\"erreur\",IF(AND(D28-C28>0,F28-E28=0),G28-Calendrier!$AS$9/2-M28,IF(AND(F28-E28>0,D28-C28=0),(F28-E28)-Calendrier!$AS$9/2-M28,IF(COUNTA(C28:F28)=4,(D28-C28)+(F28-E28)-M28-Calendrier!$AS$9,0))))","v":0},0,"Di",0,null,0]
[11,{"$f":"INDIRECT(ADDRESS(MATCH($B$1,Calendrier!$A$15:$A$59,0)+14,ROW()-17,3,1,\"Calendrier\"),1)","v":"T"},null,null,null,null,0,{"$f":"IF(AND(K29=0.5,COUNTA(C29:F29)=4),\"erreur\",IF(AND(D29-C29>0,F29-E29=0),G29-Calendrier!$AS$9/2-M29,IF(AND(F29-E29>0,D29-C29=0),(F29-E29)-Calendrier!$AS$9/2-M29,IF(COUNTA(C29:F29)=4,(D29-C29)+(F29-E29)-M29-Calendrier!$AS$9,0))))","v":0},0,"",0,null,0]
[12,{"$f":"INDIRECT(ADDRESS(MATCH($B$1,Calendrier!$A$15:$A$59,0)+14,ROW()-17,3,1,\"Calendrier\"),1)","v":"T"},null,null,null,null,0,{"$f":"IF(AND(K30=0.5,COUNTA(C30:F30)=4),\"erreur\",IF(AND(D30-C30>0,F30-E30=0),G30-Calendrier!$AS$9/2-M30,IF(AND(F30-E30>0,D30-C30=0),(F30-E30)-Calendrier!$AS$9/2-M30,IF(COUNTA(C30:F30)=4,(D30-C30)+(F30-E30)-M30-Calendrier!$AS$9,0))))","v":0},0,"",0,null,0]
[13,{"$f":"INDIRECT(ADDRESS(MATCH($B$1,Calendrier!$A$15:$A$59,0)+14,ROW()-17,3,1,\"Calendrier\"),1)","v":"T"},null,null,null,null,0,{"$f":"IF(AND(K31=0.5,COUNTA(C31:F31)=4),\"erreur\",IF(AND(D31-C31>0,F31-E31=0),G31-Calendrier!$AS$9/2-M31,IF(AND(F31-E31>0,D31-C31=0),(F31-E31)-Calendrier!$AS$9/2-M31,IF(COUNTA(C31:F31)=4,(D31-C31)+(F31-E31)-M31-Calendrier!$AS$9,0))))","v":0},0,"",0,null,0]
[14,{"$f":"INDIRECT(ADDRESS(MATCH($B$1,Calendrier!$A$15:$A$59,0)+14,ROW()-17,3,1,\"Calendrier\"),1)","v":"F"},null,null,null,null,0,{"$f":"IF(AND(K32=0.5,COUNTA(C32:F32)=4),\"erreur\",IF(AND(D32-C32>0,F32-E32=0),G32-Calendrier!$AS$9/2-M32,IF(AND(F32-E32>0,D32-C32=0),(F32-E32)-Calendrier!$AS$9/2-M32,IF(COUNTA(C32:F32)=4,(D32-C32)+(F32-E32)-M32-Calendrier!$AS$9,0))))","v":0},0,"F",0,null,0]
[15,{"$f":"INDIRECT(ADDRESS(MATCH($B$1,Calendrier!$A$15:$A$59,0)+14,ROW()-17,3,1,\"Calendrier\"),1)","v":"CA"},null,null,null,null,0,{"$f":"IF(AND(K33=0.5,COUNTA(C33:F33)=4),\"erreur\",IF(AND(D33-C33>0,F33-E33=0),G33-Calendrier!$AS$9/2-M33,IF(AND(F33-E33>0,D33-C33=0),(F33-E33)-Calendrier!$AS$9/2-M33,IF(COUNTA(C33:F33)=4,(D33-C33)+(F33-E33)-M33-Calendrier!$AS$9,0))))","v":0},0,{"$f":"IF(AND(COUNTA(C33:F33)=0,B33<>\"T\"),B33,IF(AND(OR(B33=$F$9,B33=$F$10),COUNTA(C33:F33=2)),\"T\",IF(G33>=6,\"T\",\"\")))","v":"CA"},0,null,0]
[16,{"$f":"INDIRECT(ADDRESS(MATCH($B$1,Calendrier!$A$15:$A$59,0)+14,ROW()-17,3,1,\"Calendrier\"),1)","v":"Sa"},null,null,null,null,0,{"$f":"IF(AND(K34=0.5,COUNTA(C34:F34)=4),\"erreur\",IF(AND(D34-C34>0,F34-E34=0),G34-Calendrier!$AS$9/2-M34,IF(AND(F34-E34>0,D34-C34=0),(F34-E34)-Calendrier!$AS$9/2-M34,IF(COUNTA(C34:F34)=4,(D34-C34)+(F34-E34)-M34-Calendrier!$AS$9,0))))","v":0},0,"Sa",0,null,0]
[17,{"$f":"INDIRECT(ADDRESS(MATCH($B$1,Calendrier!$A$15:$A$59,0)+14,ROW()-17,3,1,\"Calendrier\"),1)","v":"Di"},null,null,null,null,0,{"$f":"IF(AND(K35=0.5,COUNTA(C35:F35)=4),\"erreur\",IF(AND(D35-C35>0,F35-E35=0),G35-Calendrier!$AS$9/2-M35,IF(AND(F35-E35>0,D35-C35=0),(F35-E35)-Calendrier!$AS$9/2-M35,IF(COUNTA(C35:F35)=4,(D35-C35)+(F35-E35)-M35-Calendrier!$AS$9,0))))","v":0},0,"Di",0,null,0]
[18,{"$f":"INDIRECT(ADDRESS(MATCH($B$1,Calendrier!$A$15:$A$59,0)+14,ROW()-17,3,1,\"Calendrier\"),1)","v":"T"},null,null,null,null,0,{"$f":"IF(AND(K36=0.5,COUNTA(C36:F36)=4),\"erreur\",IF(AND(D36-C36>0,F36-E36=0),G36-Calendrier!$AS$9/2-M36,IF(AND(F36-E36>0,D36-C36=0),(F36-E36)-Calendrier!$AS$9/2-M36,IF(COUNTA(C36:F36)=4,(D36-C36)+(F36-E36)-M36-Calendrier!$AS$9,0))))","v":0},0,"",0,null,0]
[19,{"$f":"INDIRECT(ADDRESS(MATCH($B$1,Calendrier!$A$15:$A$59,0)+14,ROW()-17,3,1,\"Calendrier\"),1)","v":"T"},null,null,null,null,0,{"$f":"IF(AND(K37=0.5,COUNTA(C37:F37)=4),\"erreur\",IF(AND(D37-C37>0,F37-E37=0),G37-Calendrier!$AS$9/2-M37,IF(AND(F37-E37>0,D37-C37=0),(F37-E37)-Calendrier!$AS$9/2-M37,IF(COUNTA(C37:F37)=4,(D37-C37)+(F37-E37)-M37-Calendrier!$AS$9,0))))","v":0},0,"",0,null,0]
[20,{"$f":"INDIRECT(ADDRESS(MATCH($B$1,Calendrier!$A$15:$A$59,0)+14,ROW()-17,3,1,\"Calendrier\"),1)","v":"T"},null,null,null,null,0,{"$f":"IF(AND(K38=0.5,COUNTA(C38:F38)=4),\"erreur\",IF(AND(D38-C38>0,F38-E38=0),G38-Calendrier!$AS$9/2-M38,IF(AND(F38-E38>0,D38-C38=0),(F38-E38)-Calendrier!$AS$9/2-M38,IF(COUNTA(C38:F38)=4,(D38-C38)+(F38-E38)-M38-Calendrier!$AS$9,0))))","v":0},0,"",0,null,0]
[21,{"$f":"INDIRECT(ADDRESS(MATCH($B$1,Calendrier!$A$15:$A$59,0)+14,ROW()-17,3,1,\"Calendrier\"),1)","v":"T"},null,null,null,null,0,{"$f":"IF(AND(K39=0.5,COUNTA(C39:F39)=4),\"erreur\",IF(AND(D39-C39>0,F39-E39=0),G39-Calendrier!$AS$9/2-M39,IF(AND(F39-E39>0,D39-C39=0),(F39-E39)-Calendrier!$AS$9/2-M39,IF(COUNTA(C39:F39)=4,(D39-C39)+(F39-E39)-M39-Calendrier!$AS$9,0))))","v":0},0,"",0,null,0]
[22,{"$f":"INDIRECT(ADDRESS(MATCH($B$1,Calendrier!$A$15:$A$59,0)+14,ROW()-17,3,1,\"Calendrier\"),1)","v":"T"},null,null,null,null,0,{"$f":"IF(AND(K40=0.5,COUNTA(C40:F40)=4),\"erreur\",IF(AND(D40-C40>0,F40-E40=0),G40-Calendrier!$AS$9/2-M40,IF(AND(F40-E40>0,D40-C40=0),(F40-E40)-Calendrier!$AS$9/2-M40,IF(COUNTA(C40:F40)=4,(D40-C40)+(F40-E40)-M40-Calendrier!$AS$9,0))))","v":0},0,"",0,null,0]
[23,{"$f":"INDIRECT(ADDRESS(MATCH($B$1,Calendrier!$A$15:$A$59,0)+14,ROW()-17,3,1,\"Calendrier\"),1)","v":"Sa"},null,null,null,null,0,{"$f":"IF(AND(K41=0.5,COUNTA(C41:F41)=4),\"erreur\",IF(AND(D41-C41>0,F41-E41=0),G41-Calendrier!$AS$9/2-M41,IF(AND(F41-E41>0,D41-C41=0),(F41-E41)-Calendrier!$AS$9/2-M41,IF(COUNTA(C41:F41)=4,(D41-C41)+(F41-E41)-M41-Calendrier!$AS$9,0))))","v":0},0,"Sa",0,null,0]
[24,{"$f":"INDIRECT(ADDRESS(MATCH($B$1,Calendrier!$A$15:$A$59,0)+14,ROW()-17,3,1,\"Calendrier\"),1)","v":"Di"},null,null,null,null,0,{"$f":"IF(AND(K42=0.5,COUNTA(C42:F42)=4),\"erreur\",IF(AND(D42-C42>0,F42-E42=0),G42-Calendrier!$AS$9/2-M42,IF(AND(F42-E42>0,D42-C42=0),(F42-E42)-Calendrier!$AS$9/2-M42,IF(COUNTA(C42:F42)=4,(D42-C42)+(F42-E42)-M42-Calendrier!$AS$9,0))))","v":0},0,"Di",0,null,0]
[25,{"$f":"INDIRECT(ADDRESS(MATCH($B$1,Calendrier!$A$15:$A$59,0)+14,ROW()-17,3,1,\"Calendrier\"),1)","v":"RTT"},null,null,null,null,0,{"$f":"IF(AND(K43=0.5,COUNTA(C43:F43)=4),\"erreur\",IF(AND(D43-C43>0,F43-E43=0),G43-Calendrier!$AS$9/2-M43,IF(AND(F43-E43>0,D43-C43=0),(F43-E43)-Calendrier!$AS$9/2-M43,IF(COUNTA(C43:F43)=4,(D43-C43)+(F43-E43)-M43-Calendrier!$AS$9,0))))","v":0},0,"RTT",0,null,0]
[26,{"$f":"INDIRECT(ADDRESS(MATCH($B$1,Calendrier!$A$15:$A$59,0)+14,ROW()-17,3,1,\"Calendrier\"),1)","v":"T"},null,null,null,null,0,{"$f":"IF(AND(K44=0.5,COUNTA(C44:F44)=4),\"erreur\",IF(AND(D44-C44>0,F44-E44=0),G44-Calendrier!$AS$9/2-M44,IF(AND(F44-E44>0,D44-C44=0),(F44-E44)-Calendrier!$AS$9/2-M44,IF(COUNTA(C44:F44)=4,(D44-C44)+(F44-E44)-M44-Calendrier!$AS$9,0))))","v":0},0,"",0,null,0]
[27,{"$f":"INDIRECT(ADDRESS(MATCH($B$1,Calendrier!$A$15:$A$59,0)+14,ROW()-17,3,1,\"Calendrier\"),1)","v":"T"},null,null,null,null,0,{"$f":"IF(AND(K45=0.5,COUNTA(C45:F45)=4),\"erreur\",IF(AND(D45-C45>0,F45-E45=0),G45-Calendrier!$AS$9/2-M45,IF(AND(F45-E45>0,D45-C45=0),(F45-E45)-Calendrier!$AS$9/2-M45,IF(COUNTA(C45:F45)=4,(D45-C45)+(F45-E45)-M45-Calendrier!$AS$9,0))))","v":0},0,"",0,null,0]
[28,{"$f":"INDIRECT(ADDRESS(MATCH($B$1,Calendrier!$A$15:$A$59,0)+14,ROW()-17,3,1,\"Calendrier\"),1)","v":"T"},null,null,null,null,0,{"$f":"IF(AND(K46=0.5,COUNTA(C46:F46)=4),\"erreur\",IF(AND(D46-C46>0,F46-E46=0),G46-Calendrier!$AS$9/2-M46,IF(AND(F46-E46>0,D46-C46=0),(F46-E46)-Calendrier!$AS$9/2-M46,IF(COUNTA(C46:F46)=4,(D46-C46)+(F46-E46)-M46-Calendrier!$AS$9,0))))","v":0},0,"",0,null,0]
[29,{"$f":"INDIRECT(ADDRESS(MATCH($B$1,Calendrier!$A$15:$A$59,0)+14,ROW()-17,3,1,\"Calendrier\"),1)","v":"T"},null,null,null,null,0,{"$f":"IF(AND(K47=0.5,COUNTA(C47:F47)=4),\"erreur\",IF(AND(D47-C47>0,F47-E47=0),G47-Calendrier!$AS$9/2-M47,IF(AND(F47-E47>0,D47-C47=0),(F47-E47)-Calendrier!$AS$9/2-M47,IF(COUNTA(C47:F47)=4,(D47-C47)+(F47-E47)-M47-Calendrier!$AS$9,0))))","v":0},0,"",0,null,0]
[30,{"$f":"INDIRECT(ADDRESS(MATCH($B$1,Calendrier!$A$15:$A$59,0)+14,ROW()-17,3,1,\"Calendrier\"),1)","v":"Sa"},null,null,null,null,0,{"$f":"IF(AND(K48=0.5,COUNTA(C48:F48)=4),\"erreur\",IF(AND(D48-C48>0,F48-E48=0),G48-Calendrier!$AS$9/2-M48,IF(AND(F48-E48>0,D48-C48=0),(F48-E48)-Calendrier!$AS$9/2-M48,IF(COUNTA(C48:F48)=4,(D48-C48)+(F48-E48)-M48-Calendrier!$AS$9,0))))","v":0},0,"Sa",0,null,0]
[31,{"$f":"INDIRECT(ADDRESS(MATCH($B$1,Calendrier!$A$15:$A$59,0)+14,ROW()-17,3,1,\"Calendrier\"),1)","v":"Di"},null,null,null,null,0,{"$f":"IF(AND(K49=0.5,COUNTA(C49:F49)=4),\"erreur\",IF(AND(D49-C49>0,F49-E49=0),G49-Calendrier!$AS$9/2-M49,IF(AND(F49-E49>0,D49-C49=0),(F49-E49)-Calendrier!$AS$9/2-M49,IF(COUNTA(C49:F49)=4,(D49-C49)+(F49-E49)-M49-Calendrier!$AS$9,0))))","v":0},0,"Di",0,null,0]
[null,null,null,null,null,null,null,"solde des variations",{"$f":"I49","v":0}]

{"sheet":"AOU","index":8,"n_rows":50,"n_cols":15,"rows_kept":50,"cut":false,"hidden":false,"merged":[]}
[null,{"$f":"RIGHT(CELL(\"nomfichier\",$A$1),3)","v":"AOU"},"FICHE DE SUIVI HORAIRE"]
[]
[null,"mois :","AOUT",null,null,"année ",{"$f":"Calendrier!A1","v":2016},null,"service",{"$f":"Calendrier!F4","v":"COMPTABILITE"}]
[]
[null,"nom :",{"$f":"Calendrier!F2","v":"MARTIN"},null,null," prénom ",{"$f":"Calendrier!F3","v":"PATRICK"},null,"N° Ident.",{"$f":"Calendrier!F1","v":"N123456"}]
[null,null,null,null,null,null,null,"à réaliser","cumul","en cours","reste",null,"n/cumul"]
[null,null,null,"Nb J/T",{"$f":"Calendrier!$A$10","v":213},{"$f":"+$H$10","v":0},{"$f":"$H$12","v":213},{"$f":"Calendrier!$N$1","v":366},{"$f":"JUL!M7","v":79},{"$f":"SUM(J8:J15)","v":28},{"$f":"H7-(I7+J7)","v":259},null,{"$f":"SUM(M8:M15)","v":107}]
[null,null,null,null,null,null,"CA",{"$f":"Calendrier!N5","v":25},{"$f":"JUL!M8","v":1},{"$f":"IF(G8=\"\",0,COUNTIF($J$19:$J$49,G8))+IF(F8=\"\",0,COUNTIF($J$19:$J$49,F8)/2)","v":19},{"$f":"+H8-(I8+J8)","v":5},"J",{"$f":"+I8+J8","v":20}]
[null,null,null,null,null,"1/2RTT","RTT",{"$f":"Calendrier!N8","v":16},{"$f":"JUL!M9","v":12},{"$f":"IF(G9=\"\",0,COUNTIF($J$19:$J$49,G9))+IF(F9=\"\",0,COUNTIF($J$19:$J$49,F9)/2)","v":0},{"$f":"+H9-(I9+J9)","v":4},"J",12]
[null,null,null,null,null,"1/2CS","CS",{"$f":"Calendrier!N9","v":0},{"$f":"JUL!M10","v":0},{"$f":"IF(G10=\"\",0,COUNTIF($J$19:$J$49,G10))+IF(F10=\"\",0,COUNTIF($J$19:$J$49,F10)/2)","v":0},{"$f":"H10-(I10+J10)","v":0},"J",0]
[null,null,null,null,null,null,"CP",{"$f":"Calendrier!N6","v":0},{"$f":"JUL!M11","v":0},0,{"$f":"H11-(I11+J11)","v":0},"J",0]
[null,null,null,null,null,"1/2T","T",{"$f":"Calendrier!N7","v":213},{"$f":"JUL!M12","v":0},0,{"$f":"+H12-(I12+J12)","v":213},"J",0]
[null,null,null,null,null,null,"Sa",{"$f":"Calendrier!N4","v":53},{"$f":"JUL!M13","v":31},4,{"$f":"+H13-(I13+J13)","v":18},"J",35]
[null,null,null,null,null,null,"Di",{"$f":"Calendrier!N3","v":47},{"$f":"JUL!M14","v":27},4,{"$f":"+H14-(I14+J14)","v":16},"J",31]
[null,null,null,null,null,null,"F",{"$f":"Calendrier!N2","v":12},{"$f":"JUL!M15","v":8},1,{"$f":"+H15-(I15+J15)","v":3},"J",{"$f":"+I15+J15","v":9}]
[null,null,null,null,null,null,"heure/avance fin mois",null,{"$f":"JUL!I50","v":0},null,null,null,{"$f":"I50","v":0}]
[null,"Prévu","Entrée","Sortie","Entrée","Sortie","total J","variation","cumul","Type","nb J/T",null,"Bon E/S","Sortie","Retour"]
[null,null,null,null,null,null,null,null,null,null,null,null,null,"avec bon"]
[1,{"$f":"INDIRECT(ADDRESS(MATCH($B$1,Calendrier!$A$15:$A$59,0)+14,ROW()-17,3,1,\"Calendrier\"),1)","v":"CA"},null,null,null,null,{"$f":"IF(COUNTA(C19:F19)=4,(D19-C19)+(F19-E19)-M19,IF(COUNTA(C19:D19)<2,(F19-E19)-M19,(D19-C19)-M19))","v":0},{"$f":"IF(AND(K19=0.5,COUNTA(C19:F19)=4),\"erreur\",IF(AND(D19-C19>0,F19-E19=0),G19-Calendrier!$AS$9/2-M19,IF(AND(F19-E19>0,D19-C19=0),(F19-E19)-Calendrier!$AS$9/2-M19,IF(COUNTA(C19:F19)=4,(D19-C19)+(F19-E19)-M19-Calendrier!$AS$9,0))))","v":0},{"$f":"+I16+H19","v":0},{"$f":"IF(AND(COUNTA(C19:F19)=0,B19<>\"T\"),B19,IF(AND(OR(B19=$F$9,B19=$F$10),COUNTA(C19:F19=2)),\"T\",IF(G19>=6,\"T\",\"\")))","v":"CA"},{"$f":"IF(OR(B19=$F$9,B19=$F$10),0.5,IF(G19>=6,1,0))","v":0},null,{"$f":"+O19-N19","v":0}]
[2,{"$f":"INDIRECT(ADDRESS(MATCH($B$1,Calendrier!$A$15:$A$59,0)+14,ROW()-17,3,1,\"Calendrier\"),1)","v":"CA"},null,null,null,null,0,{"$f":"IF(AND(K20=0.5,COUNTA(C20:F20)=4),\"erreur\",IF(AND(D20-C20>0,F20-E20=0),G20-Calendrier!$AS$9/2-M20,IF(AND(F20-E20>0,D20-C20=0),(F20-E20)-Calendrier!$AS$9/2-M20,IF(COUNTA(C20:F20)=4,(D20-C20)+(F20-E20)-M20-Calendrier!$AS$9,0))))","v":0},{"$f":"+I19+H20","v":0},"CA",0,null,{"$f":"+O20-N20","v":0}]
[3,{"$f":"INDIRECT(ADDRESS(MATCH($B$1,Calendrier!$A$15:$A$59,0)+14,ROW()-17,3,1,\"Calendrier\"),1)","v":"CA"},null,null,null,null,0,{"$f":"IF(AND(K21=0.5,COUNTA(C21:F21)=4),\"erreur\",IF(AND(D21-C21>0,F21-E21=0),G21-Calendrier!$AS$9/2-M21,IF(AND(F21-E21>0,D21-C21=0),(F21-E21)-Calendrier!$AS$9/2-M21,IF(COUNTA(C21:F21)=4,(D21-C21)+(F21-E21)-M21-Calendrier!$AS$9,0))))","v":0},0,"CA",0,null,0]
[4,{"$f":"INDIRECT(ADDRESS(MATCH($B$1,Calendrier!$A$15:$A$59,0)+14,ROW()-17,3,1,\"Calendrier\"),1)","v":"CA"},null,null,null,null,0,{"$f":"IF(AND(K22=0.5,COUNTA(C22:F22)=4),\"erreur\",IF(AND(D22-C22>0,F22-E22=0),G22-Calendrier!$AS$9/2-M22,IF(AND(F22-E22>0,D22-C22=0),(F22-E22)-Calendrier!$AS$9/2-M22,IF(COUNTA(C22:F22)=4,(D22-C22)+(F22-E22)-M22-Calendrier!$AS$9,0))))","v":0},0,"CA",0,null,0]
[5,{"$f":"INDIRECT(ADDRESS(MATCH($B$1,Calendrier!$A$15:$A$59,0)+14,ROW()-17,3,1,\"Calendrier\"),1)","v":"CA"},null,null,null,null,0,{"$f":"IF(AND(K23=0.5,COUNTA(C23:F23)=4),\"erreur\",IF(AND(D23-C23>0,F23-E23=0),G23-Calendrier!$AS$9/2-M23,IF(AND(F23-E23>0,D23-C23=0),(F23-E23)-Calendrier!$AS$9/2-M23,IF(COUNTA(C23:F23)=4,(D23-C23)+(F23-E23)-M23-Calendrier!$AS$9,0))))","v":0},0,"CA",{"$f":"IF(OR(B23=$F$9,B23=$F$10),0.5,IF(G23>=6,1,0))","v":0},null,0]
[6,{"$f":"INDIRECT(ADDRESS(MATCH($B$1,Calendrier!$A$15:$A$59,0)+14,ROW()-17,3,1,\"Calendrier\"),1)","v":"Sa"},null,null,null,null,0,{"$f":"IF(AND(K24=0.5,COUNTA(C24:F24)=4),\"erreur\",IF(AND(D24-C24>0,F24-E24=0),G24-Calendrier!$AS$9/2-M24,IF(AND(F24-E24>0,D24-C24=0),(F24-E24)-Calendrier!$AS$9/2-M24,IF(COUNTA(C24:F24)=4,(D24-C24)+(F24-E24)-M24-Calendrier!$AS$9,0))))","v":0},0,"Sa",0,null,0]
[7,{"$f":"INDIRECT(ADDRESS(MATCH($B$1,Calendrier!$A$15:$A$59,0)+14,ROW()-17,3,1,\"Calendrier\"),1)","v":"Di"},null,null,null,null,0,{"$f":"IF(AND(K25=0.5,COUNTA(C25:F25)=4),\"erreur\",IF(AND(D25-C25>0,F25-E25=0),G25-Calendrier!$AS$9/2-M25,IF(AND(F25-E25>0,D25-C25=0),(F25-E25)-Calendrier!$AS$9/2-M25,IF(COUNTA(C25:F25)=4,(D25-C25)+(F25-E25)-M25-Calendrier!$AS$9,0))))","v":0},0,"Di",0,null,0]
[8,{"$f":"INDIRECT(ADDRESS(MATCH($B$1,Calendrier!$A$15:$A$59,0)+14,ROW()-17,3,1,\"Calendrier\"),1)","v":"CA"},null,null,null,null,0,{"$f":"IF(AND(K26=0.5,COUNTA(C26:F26)=4),\"erreur\",IF(AND(D26-C26>0,F26-E26=0),G26-Calendrier!$AS$9/2-M26,IF(AND(F26-E26>0,D26-C26=0),(F26-E26)-Calendrier!$AS$9/2-M26,IF(COUNTA(C26:F26)=4,(D26-C26)+(F26-E26)-M26-Calendrier!$AS$9,0))))","v":0},0,"CA",0,null,0]
[9,{"$f":"INDIRECT(ADDRESS(MATCH($B$1,Calendrier!$A$15:$A$59,0)+14,ROW()-17,3,1,\"Calendrier\"),1)","v":"CA"},null,null,null,null,0,{"$f":"IF(AND(K27=0.5,COUNTA(C27:F27)=4),\"erreur\",IF(AND(D27-C27>0,F27-E27=0),G27-Calendrier!$AS$9/2-M27,IF(AND(F27-E27>0,D27-C27=0),(F27-E27)-Calendrier!$AS$9/2-M27,IF(COUNTA(C27:F27)=4,(D27-C27)+(F27-E27)-M27-Calendrier!$AS$9,0))))","v":0},0,"CA",0,null,0]
[10,{"$f":"INDIRECT(ADDRESS(MATCH($B$1,Calendrier!$A$15:$A$59,0)+14,ROW()-17,3,1,\"Calendrier\"),1)","v":"CA"},null,null,null,null,0,{"$f":"IF(AND(K28=0.5,COUNTA(C28:F28)=4),\"erreur\",IF(AND(D28-C28>0,F28-E28=0),G28-Calendrier!$AS$9/2-M28,IF(AND(F28-E28>0,D28-C28=0),(F28-E28)-Calendrier!$AS$9/2-M28,IF(COUNTA(C28:F28)=4,(D28-C28)+(F28-E28)-M28-Calendrier!$AS$9,0))))","v":0},0,"CA",0,null,0]
[11,{"$f":"INDIRECT(ADDRESS(MATCH($B$1,Calendrier!$A$15:$A$59,0)+14,ROW()-17,3,1,\"Calendrier\"),1)","v":"CA"},null,null,null,null,0,{"$f":"IF(AND(K29=0.5,COUNTA(C29:F29)=4),\"erreur\",IF(AND(D29-C29>0,F29-E29=0),G29-Calendrier!$AS$9/2-M29,IF(AND(F29-E29>0,D29-C29=0),(F29-E29)-Calendrier!$AS$9/2-M29,IF(COUNTA(C29:F29)=4,(D29-C29)+(F29-E29)-M29-Calendrier!$AS$9,0))))","v":0},0,"CA",0,null,0]
[12,{"$f":"INDIRECT(ADDRESS(MATCH($B$1,Calendrier!$A$15:$A$59,0)+14,ROW()-17,3,1,\"Calendrier\"),1)","v":"CA"},null,null,null,null,0,{"$f":"IF(AND(K30=0.5,COUNTA(C30:F30)=4),\"erreur\",IF(AND(D30-C30>0,F30-E30=0),G30-Calendrier!$AS$9/2-M30,IF(AND(F30-E30>0,D30-C30=0),(F30-E30)-Calendrier!$AS$9/2-M30,IF(COUNTA(C30:F30)=4,(D30-C30)+(F30-E30)-M30-Calendrier!$AS$9,0))))","v":0},0,"CA",0,null,0]
[13,{"$f":"INDIRECT(ADDRESS(MATCH($B$1,Calendrier!$A$15:$A$59,0)+14,ROW()-17,3,1,\"Calendrier\"),1)","v":"Sa"},null,null,null,null,0,{"$f":"IF(AND(K31=0.5,COUNTA(C31:F31)=4),\"erreur\",IF(AND(D31-C31>0,F31-E31=0),G31-Calendrier!$AS$9/2-M31,IF(AND(F31-E31>0,D31-C31=0),(F31-E31)-Calendrier!$AS$9/2-M31,IF(COUNTA(C31:F31)=4,(D31-C31)+(F31-E31)-M31-Calendrier!$AS$9,0))))","v":0},0,"Sa",0,null,0]
[14,{"$f":"INDIRECT(ADDRESS(MATCH($B$1,Calendrier!$A$15:$A$59,0)+14,ROW()-17,3,1,\"Calendrier\"),1)","v":"Di"},null,null,null,null,0,{"$f":"IF(AND(K32=0.5,COUNTA(C32:F32)=4),\"erreur\",IF(AND(D32-C32>0,F32-E32=0),G32-Calendrier!$AS$9/2-M32,IF(AND(F32-E32>0,D32-C32=0),(F32-E32)-Calendrier!$AS$9/2-M32,IF(COUNTA(C32:F32)=4,(D32-C32)+(F32-E32)-M32-Calendrier!$AS$9,0))))","v":0},0,"Di",0,null,0]
[15,{"$f":"INDIRECT(ADDRESS(MATCH($B$1,Calendrier!$A$15:$A$59,0)+14,ROW()-17,3,1,\"Calendrier\"),1)","v":"F"},null,null,null,null,0,{"$f":"IF(AND(K33=0.5,COUNTA(C33:F33)=4),\"erreur\",IF(AND(D33-C33>0,F33-E33=0),G33-Calendrier!$AS$9/2-M33,IF(AND(F33-E33>0,D33-C33=0),(F33-E33)-Calendrier!$AS$9/2-M33,IF(COUNTA(C33:F33)=4,(D33-C33)+(F33-E33)-M33-Calendrier!$AS$9,0))))","v":0},0,{"$f":"IF(AND(COUNTA(C33:F33)=0,B33<>\"T\"),B33,IF(AND(OR(B33=$F$9,B33=$F$10),COUNTA(C33:F33=2)),\"T\",IF(G33>=6,\"T\",\"\")))","v":"F"},0,null,0]
[16,{"$f":"INDIRECT(ADDRESS(MATCH($B$1,Calendrier!$A$15:$A$59,0)+14,ROW()-17,3,1,\"Calendrier\"),1)","v":"CA"},null,null,null,null,0,{"$f":"IF(AND(K34=0.5,COUNTA(C34:F34)=4),\"erreur\",IF(AND(D34-C34>0,F34-E34=0),G34-Calendrier!$AS$9/2-M34,IF(AND(F34-E34>0,D34-C34=0),(F34-E34)-Calendrier!$AS$9/2-M34,IF(COUNTA(C34:F34)=4,(D34-C34)+(F34-E34)-M34-Calendrier!$AS$9,0))))","v":0},0,"CA",0,null,0]
[17,{"$f":"INDIRECT(ADDRESS(MATCH($B$1,Calendrier!$A$15:$A$59,0)+14,ROW()-17,3,1,\"Calendrier\"),1)","v":"CA"},null,null,null,null,0,{"$f":"IF(AND(K35=0.5,COUNTA(C35:F35)=4),\"erreur\",IF(AND(D35-C35>0,F35-E35=0),G35-Calendrier!$AS$9/2-M35,IF(AND(F35-E35>0,D35-C35=0),(F35-E35)-Calendrier!$AS$9/2-M35,IF(COUNTA(C35:F35)=4,(D35-C35)+(F35-E35)-M35-Calendrier!$AS$9,0))))","v":0},0,"CA",0,null,0]
[18,{"$f":"INDIRECT(ADDRESS(MATCH($B$1,Calendrier!$A$15:$A$59,0)+14,ROW()-17,3,1,\"Calendrier\"),1)","v":"CA"},null,null,null,null,0,{"$f":"IF(AND(K36=0.5,COUNTA(C36:F36)=4),\"erreur\",IF(AND(D36-C36>0,F36-E36=0),G36-Calendrier!$AS$9/2-M36,IF(AND(F36-E36>0,D36-C36=0),(F36-E36)-Calendrier!$AS$9/2-M36,IF(COUNTA(C36:F36)=4,(D36-C36)+(F36-E36)-M36-Calendrier!$AS$9,0))))","v":0},0,"CA",0,null,0]
[19,{"$f":"INDIRECT(ADDRESS(MATCH($B$1,Calendrier!$A$15:$A$59,0)+14,ROW()-17,3,1,\"Calendrier\"),1)","v":"CA"},null,null,null,null,0,{"$f":"IF(AND(K37=0.5,COUNTA(C37:F37)=4),\"erreur\",IF(AND(D37-C37>0,F37-E37=0),G37-Calendrier!$AS$9/2-M37,IF(AND(F37-E37>0,D37-C37=0),(F37-E37)-Calendrier!$AS$9/2-M37,IF(COUNTA(C37:F37)=4,(D37-C37)+(F37-E37)-M37-Calendrier!$AS$9,0))))","v":0},0,"CA",0,null,0]
[20,{"$f":"INDIRECT(ADDRESS(MATCH($B$1,Calendrier!$A$15:$A$59,0)+14,ROW()-17,3,1,\"Calendrier\"),1)","v":"Sa"},null,null,null,null,0,{"$f":"IF(AND(K38=0.5,COUNTA(C38:F38)=4),\"erreur\",IF(AND(D38-C38>0,F38-E38=0),G38-Calendrier!$AS$9/2-M38,IF(AND(F38-E38>0,D38-C38=0),(F38-E38)-Calendrier!$AS$9/2-M38,IF(COUNTA(C38:F38)=4,(D38-C38)+(F38-E38)-M38-Calendrier!$AS$9,0))))","v":0},0,"Sa",0,null,0]
[21,{"$f":"INDIRECT(ADDRESS(MATCH($B$1,Calendrier!$A$15:$A$59,0)+14,ROW()-17,3,1,\"Calendrier\"),1)","v":"Di"},null,null,null,null,0,{"$f":"IF(AND(K39=0.5,COUNTA(C39:F39)=4),\"erreur\",IF(AND(D39-C39>0,F39-E39=0),G39-Calendrier!$AS$9/2-M39,IF(AND(F39-E39>0,D39-C39=0),(F39-E39)-Calendrier!$AS$9/2-M39,IF(COUNTA(C39:F39)=4,(D39-C39)+(F39-E39)-M39-Calendrier!$AS$9,0))))","v":0},0,"Di",0,null,0]
[22,{"$f":"INDIRECT(ADDRESS(MATCH($B$1,Calendrier!$A$15:$A$59,0)+14,ROW()-17,3,1,\"Calendrier\"),1)","v":"CA"},null,null,null,null,0,{"$f":"IF(AND(K40=0.5,COUNTA(C40:F40)=4),\"erreur\",IF(AND(D40-C40>0,F40-E40=0),G40-Calendrier!$AS$9/2-M40,IF(AND(F40-E40>0,D40-C40=0),(F40-E40)-Calendrier!$AS$9/2-M40,IF(COUNTA(C40:F40)=4,(D40-C40)+(F40-E40)-M40-Calendrier!$AS$9,0))))","v":0},0,"CA",0,null,0]
[23,{"$f":"INDIRECT(ADDRESS(MATCH($B$1,Calendrier!$A$15:$A$59,0)+14,ROW()-17,3,1,\"Calendrier\"),1)","v":"CA"},null,null,null,null,0,{"$f":"IF(AND(K41=0.5,COUNTA(C41:F41)=4),\"erreur\",IF(AND(D41-C41>0,F41-E41=0),G41-Calendrier!$AS$9/2-M41,IF(AND(F41-E41>0,D41-C41=0),(F41-E41)-Calendrier!$AS$9/2-M41,IF(COUNTA(C41:F41)=4,(D41-C41)+(F41-E41)-M41-Calendrier!$AS$9,0))))","v":0},0,"CA",0,null,0]
[24,{"$f":"INDIRECT(ADDRESS(MATCH($B$1,Calendrier!$A$15:$A$59,0)+14,ROW()-17,3,1,\"Calendrier\"),1)","v":"CA"},null,null,null,null,0,{"$f":"IF(AND(K42=0.5,COUNTA(C42:F42)=4),\"erreur\",IF(AND(D42-C42>0,F42-E42=0),G42-Calendrier!$AS$9/2-M42,IF(AND(F42-E42>0,D42-C42=0),(F42-E42)-Calendrier!$AS$9/2-M42,IF(COUNTA(C42:F42)=4,(D42-C42)+(F42-E42)-M42-Calendrier!$AS$9,0))))","v":0},0,"CA",0,null,0]
[25,{"$f":"INDIRECT(ADDRESS(MATCH($B$1,Calendrier!$A$15:$A$59,0)+14,ROW()-17,3,1,\"Calendrier\"),1)","v":"CA"},null,null,null,null,0,{"$f":"IF(AND(K43=0.5,COUNTA(C43:F43)=4),\"erreur\",IF(AND(D43-C43>0,F43-E43=0),G43-Calendrier!$AS$9/2-M43,IF(AND(F43-E43>0,D43-C43=0),(F43-E43)-Calendrier!$AS$9/2-M43,IF(COUNTA(C43:F43)=4,(D43-C43)+(F43-E43)-M43-Calendrier!$AS$9,0))))","v":0},0,"CA",0,null,0]
[26,{"$f":"INDIRECT(ADDRESS(MATCH($B$1,Calendrier!$A$15:$A$59,0)+14,ROW()-17,3,1,\"Calendrier\"),1)","v":"CA"},null,null,null,null,0,{"$f":"IF(AND(K44=0.5,COUNTA(C44:F44)=4),\"erreur\",IF(AND(D44-C44>0,F44-E44=0),G44-Calendrier!$AS$9/2-M44,IF(AND(F44-E44>0,D44-C44=0),(F44-E44)-Calendrier!$AS$9/2-M44,IF(COUNTA(C44:F44)=4,(D44-C44)+(F44-E44)-M44-Calendrier!$AS$9,0))))","v":0},0,"CA",0,null,0]
[27,{"$f":"INDIRECT(ADDRESS(MATCH($B$1,Calendrier!$A$15:$A$59,0)+14,ROW()-17,3,1,\"Calendrier\"),1)","v":"Sa"},null,null,null,null,0,{"$f":"IF(AND(K45=0.5,COUNTA(C45:F45)=4),\"erreur\",IF(AND(D45-C45>0,F45-E45=0),G45-Calendrier!$AS$9/2-M45,IF(AND(F45-E45>0,D45-C45=0),(F45-E45)-Calendrier!$AS$9/2-M45,IF(COUNTA(C45:F45)=4,(D45-C45)+(F45-E45)-M45-Calendrier!$AS$9,0))))","v":0},0,"Sa",0,null,0]
[28,{"$f":"INDIRECT(ADDRESS(MATCH($B$1,Calendrier!$A$15:$A$59,0)+14,ROW()-17,3,1,\"Calendrier\"),1)","v":"Di"},null,null,null,null,0,{"$f":"IF(AND(K46=0.5,COUNTA(C46:F46)=4),\"erreur\",IF(AND(D46-C46>0,F46-E46=0),G46-Calendrier!$AS$9/2-M46,IF(AND(F46-E46>0,D46-C46=0),(F46-E46)-Calendrier!$AS$9/2-M46,IF(COUNTA(C46:F46)=4,(D46-C46)+(F46-E46)-M46-Calendrier!$AS$9,0))))","v":0},0,"Di",0,null,0]
[29,{"$f":"INDIRECT(ADDRESS(MATCH($B$1,Calendrier!$A$15:$A$59,0)+14,ROW()-17,3,1,\"Calendrier\"),1)","v":"T"},null,null,null,null,0,{"$f":"IF(AND(K47=0.5,COUNTA(C47:F47)=4),\"erreur\",IF(AND(D47-C47>0,F47-E47=0),G47-Calendrier!$AS$9/2-M47,IF(AND(F47-E47>0,D47-C47=0),(F47-E47)-Calendrier!$AS$9/2-M47,IF(COUNTA(C47:F47)=4,(D47-C47)+(F47-E47)-M47-Calendrier!$AS$9,0))))","v":0},0,"",0,null,0]
[30,{"$f":"INDIRECT(ADDRESS(MATCH($B$1,Calendrier!$A$15:$A$59,0)+14,ROW()-17,3,1,\"Calendrier\"),1)","v":"T"},null,null,null,null,0,{"$f":"IF(AND(K48=0.5,COUNTA(C48:F48)=4),\"erreur\",IF(AND(D48-C48>0,F48-E48=0),G48-Calendrier!$AS$9/2-M48,IF(AND(F48-E48>0,D48-C48=0),(F48-E48)-Calendrier!$AS$9/2-M48,IF(COUNTA(C48:F48)=4,(D48-C48)+(F48-E48)-M48-Calendrier!$AS$9,0))))","v":0},0,"",0,null,0]
[31,{"$f":"INDIRECT(ADDRESS(MATCH($B$1,Calendrier!$A$15:$A$59,0)+14,ROW()-17,3,1,\"Calendrier\"),1)","v":"T"},null,null,null,null,0,{"$f":"IF(AND(K49=0.5,COUNTA(C49:F49)=4),\"erreur\",IF(AND(D49-C49>0,F49-E49=0),G49-Calendrier!$AS$9/2-M49,IF(AND(F49-E49>0,D49-C49=0),(F49-E49)-Calendrier!$AS$9/2-M49,IF(COUNTA(C49:F49)=4,(D49-C49)+(F49-E49)-M49-Calendrier!$AS$9,0))))","v":0},0,"",0,null,0]
[null,null,null,null,null,null,null,"solde des variations",{"$f":"I49","v":0}]

{"sheet":"SEP","index":9,"n_rows":50,"n_cols":15,"rows_kept":50,"cut":false,"hidden":false,"merged":[]}
[null,{"$f":"RIGHT(CELL(\"nomfichier\",$A$1),3)","v":"SEP"},"FICHE DE SUIVI HORAIRE"]
[]
[null,"mois :","SEPTEMBRE",null,null,"année ",{"$f":"Calendrier!A1","v":2016},null,"service",{"$f":"Calendrier!F4","v":"COMPTABILITE"}]
[]
[null,"nom :",{"$f":"Calendrier!F2","v":"MARTIN"},null,null," prénom ",{"$f":"Calendrier!F3","v":"PATRICK"},null,"N° Ident.",{"$f":"Calendrier!F1","v":"N123456"}]
[null,null,null,null,null,null,null,"à réaliser","cumul","en cours","reste",null,"n/cumul"]
[null,null,null,"Nb J/T",{"$f":"Calendrier!$A$10","v":213},{"$f":"+$H$10","v":0},{"$f":"$H$12","v":213},{"$f":"Calendrier!$N$1","v":366},{"$f":"AOU!M7","v":107},{"$f":"SUM(J8:J15)","v":9},{"$f":"H7-(I7+J7)","v":250},null,{"$f":"SUM(M8:M15)","v":116}]
[null,null,null,null,null,null,"CA",{"$f":"Calendrier!N5","v":25},{"$f":"AOU!M8","v":20},{"$f":"IF(G8=\"\",0,COUNTIF($J$19:$J$49,G8))+IF(F8=\"\",0,COUNTIF($J$19:$J$49,F8)/2)","v":0},{"$f":"+H8-(I8+J8)","v":5},"J",{"$f":"+I8+J8","v":20}]
[null,null,null,null,null,"1/2RTT","RTT",{"$f":"Calendrier!N8","v":16},{"$f":"AOU!M9","v":12},{"$f":"IF(G9=\"\",0,COUNTIF($J$19:$J$49,G9))+IF(F9=\"\",0,COUNTIF($J$19:$J$49,F9)/2)","v":1},{"$f":"+H9-(I9+J9)","v":3},"J",13]
[null,null,null,null,null,"1/2CS","CS",{"$f":"Calendrier!N9","v":0},{"$f":"AOU!M10","v":0},{"$f":"IF(G10=\"\",0,COUNTIF($J$19:$J$49,G10))+IF(F10=\"\",0,COUNTIF($J$19:$J$49,F10)/2)","v":0},{"$f":"H10-(I10+J10)","v":0},"J",0]
[null,null,null,null,null,null,"CP",{"$f":"Calendrier!N6","v":0},{"$f":"AOU!M11","v":0},0,{"$f":"H11-(I11+J11)","v":0},"J",0]
[null,null,null,null,null,"1/2T","T",{"$f":"Calendrier!N7","v":213},{"$f":"AOU!M12","v":0},0,{"$f":"+H12-(I12+J12)","v":213},"J",0]
[null,null,null,null,null,null,"Sa",{"$f":"Calendrier!N4","v":53},{"$f":"AOU!M13","v":35},4,{"$f":"+H13-(I13+J13)","v":14},"J",39]
[null,null,null,null,null,null,"Di",{"$f":"Calendrier!N3","v":47},{"$f":"AOU!M14","v":31},4,{"$f":"+H14-(I14+J14)","v":12},"J",35]
[null,null,null,null,null,null,"F",{"$f":"Calendrier!N2","v":12},{"$f":"AOU!M15","v":9},0,{"$f":"+H15-(I15+J15)","v":3},"J",{"$f":"+I15+J15","v":9}]
[null,null,null,null,null,null,"heure/avance fin mois",null,{"$f":"AOU!I50","v":0},null,null,null,{"$f":"I50","v":0}]
[null,"Prévu","Entrée","Sortie","Entrée","Sortie","total J","variation","cumul","Type","nb J/T",null,"Bon E/S","Sortie","Retour"]
[null,null,null,null,null,null,null,null,null,null,null,null,null,"avec bon"]
[1,{"$f":"INDIRECT(ADDRESS(MATCH($B$1,Calendrier!$A$15:$A$59,0)+14,ROW()-17,3,1,\"Calendrier\"),1)","v":"T"},null,null,null,null,{"$f":"IF(COUNTA(C19:F19)=4,(D19-C19)+(F19-E19)-M19,IF(COUNTA(C19:D19)<2,(F19-E19)-M19,(D19-C19)-M19))","v":0},{"$f":"IF(AND(K19=0.5,COUNTA(C19:F19)=4),\"erreur\",IF(AND(D19-C19>0,F19-E19=0),G19-Calendrier!$AS$9/2-M19,IF(AND(F19-E19>0,D19-C19=0),(F19-E19)-Calendrier!$AS$9/2-M19,IF(COUNTA(C19:F19)=4,(D19-C19)+(F19-E19)-M19-Calendrier!$AS$9,0))))","v":0},{"$f":"+I16+H19","v":0},{"$f":"IF(AND(COUNTA(C19:F19)=0,B19<>\"T\"),B19,IF(AND(OR(B19=$F$9,B19=$F$10),COUNTA(C19:F19=2)),\"T\",IF(G19>=6,\"T\",\"\")))","v":""},{"$f":"IF(OR(B19=$F$9,B19=$F$10),0.5,IF(G19>=6,1,0))","v":0},null,{"$f":"+O19-N19","v":0}]
[2,{"$f":"INDIRECT(ADDRESS(MATCH($B$1,Calendrier!$A$15:$A$59,0)+14,ROW()-17,3,1,\"Calendrier\"),1)","v":"T"},null,null,null,null,0,{"$f":"IF(AND(K20=0.5,COUNTA(C20:F20)=4),\"erreur\",IF(AND(D20-C20>0,F20-E20=0),G20-Calendrier!$AS$9/2-M20,IF(AND(F20-E20>0,D20-C20=0),(F20-E20)-Calendrier!$AS$9/2-M20,IF(COUNTA(C20:F20)=4,(D20-C20)+(F20-E20)-M20-Calendrier!$AS$9,0))))","v":0},{"$f":"+I19+H20","v":0},"",0,null,{"$f":"+O20-N20","v":0}]
[3,{"$f":"INDIRECT(ADDRESS(MATCH($B$1,Calendrier!$A$15:$A$59,0)+14,ROW()-17,3,1,\"Calendrier\"),1)","v":"Sa"},null,null,null,null,0,{"$f":"IF(AND(K21=0.5,COUNTA(C21:F21)=4),\"erreur\",IF(AND(D21-C21>0,F21-E21=0),G21-Calendrier!$AS$9/2-M21,IF(AND(F21-E21>0,D21-C21=0),(F21-E21)-Calendrier!$AS$9/2-M21,IF(COUNTA(C21:F21)=4,(D21-C21)+(F21-E21)-M21-Calendrier!$AS$9,0))))","v":0},0,"Sa",0,null,0]
[4,{"$f":"INDIRECT(ADDRESS(MATCH($B$1,Calendrier!$A$15:$A$59,0)+14,ROW()-17,3,1,\"Calendrier\"),1)","v":"Di"},null,null,null,null,0,{"$f":"IF(AND(K22=0.5,COUNTA(C22:F22)=4),\"erreur\",IF(AND(D22-C22>0,F22-E22=0),G22-Calendrier!$AS$9/2-M22,IF(AND(F22-E22>0,D22-C22=0),(F22-E22)-Calendrier!$AS$9/2-M22,IF(COUNTA(C22:F22)=4,(D22-C22)+(F22-E22)-M22-Calendrier!$AS$9,0))))","v":0},0,"Di",0,null,0]
[5,{"$f":"INDIRECT(ADDRESS(MATCH($B$1,Calendrier!$A$15:$A$59,0)+14,ROW()-17,3,1,\"Calendrier\"),1)","v":"T"},null,null,null,null,0,{"$f":"IF(AND(K23=0.5,COUNTA(C23:F23)=4),\"erreur\",IF(AND(D23-C23>0,F23-E23=0),G23-Calendrier!$AS$9/2-M23,IF(AND(F23-E23>0,D23-C23=0),(F23-E23)-Calendrier!$AS$9/2-M23,IF(COUNTA(C23:F23)=4,(D23-C23)+(F23-E23)-M23-Calendrier!$AS$9,0))))","v":0},0,"",{"$f":"IF(OR(B23=$F$9,B23=$F$10),0.5,IF(G23>=6,1,0))","v":0},null,0]
[6,{"$f":"INDIRECT(ADDRESS(MATCH($B$1,Calendrier!$A$15:$A$59,0)+14,ROW()-17,3,1,\"Calendrier\"),1)","v":"T"},null,null,null,null,0,{"$f":"IF(AND(K24=0.5,COUNTA(C24:F24)=4),\"erreur\",IF(AND(D24-C24>0,F24-E24=0),G24-Calendrier!$AS$9/2-M24,IF(AND(F24-E24>0,D24-C24=0),(F24-E24)-Calendrier!$AS$9/2-M24,IF(COUNTA(C24:F24)=4,(D24-C24)+(F24-E24)-M24-Calendrier!$AS$9,0))))","v":0},0,"",0,null,0]
[7,{"$f":"INDIRECT(ADDRESS(MATCH($B$1,Calendrier!$A$15:$A$59,0)+14,ROW()-17,3,1,\"Calendrier\"),1)","v":"T"},null,null,null,null,0,{"$f":"IF(AND(K25=0.5,COUNTA(C25:F25)=4),\"erreur\",IF(AND(D25-C25>0,F25-E25=0),G25-Calendrier!$AS$9/2-M25,IF(AND(F25-E25>0,D25-C25=0),(F25-E25)-Calendrier!$AS$9/2-M25,IF(COUNTA(C25:F25)=4,(D25-C25)+(F25-E25)-M25-Calendrier!$AS$9,0))))","v":0},0,"",0,null,0]
[8,{"$f":"INDIRECT(ADDRESS(MATCH($B$1,Calendrier!$A$15:$A$59,0)+14,ROW()-17,3,1,\"Calendrier\"),1)","v":"T"},null,null,null,null,0,{"$f":"IF(AND(K26=0.5,COUNTA(C26:F26)=4),\"erreur\",IF(AND(D26-C26>0,F26-E26=0),G26-Calendrier!$AS$9/2-M26,IF(AND(F26-E26>0,D26-C26=0),(F26-E26)-Calendrier!$AS$9/2-M26,IF(COUNTA(C26:F26)=4,(D26-C26)+(F26-E26)-M26-Calendrier!$AS$9,0))))","v":0},0,"",0,null,0]
[9,{"$f":"INDIRECT(ADDRESS(MATCH($B$1,Calendrier!$A$15:$A$59,0)+14,ROW()-17,3,1,\"Calendrier\"),1)","v":"T"},null,null,null,null,0,{"$f":"IF(AND(K27=0.5,COUNTA(C27:F27)=4),\"erreur\",IF(AND(D27-C27>0,F27-E27=0),G27-Calendrier!$AS$9/2-M27,IF(AND(F27-E27>0,D27-C27=0),(F27-E27)-Calendrier!$AS$9/2-M27,IF(COUNTA(C27:F27)=4,(D27-C27)+(F27-E27)-M27-Calendrier!$AS$9,0))))","v":0},0,"",0,null,0]
[10,{"$f":"INDIRECT(ADDRESS(MATCH($B$1,Calendrier!$A$15:$A$59,0)+14,ROW()-17,3,1,\"Calendrier\"),1)","v":"Sa"},null,null,null,null,0,{"$f":"IF(AND(K28=0.5,COUNTA(C28:F28)=4),\"erreur\",IF(AND(D28-C28>0,F28-E28=0),G28-Calendrier!$AS$9/2-M28,IF(AND(F28-E28>0,D28-C28=0),(F28-E28)-Calendrier!$AS$9/2-M28,IF(COUNTA(C28:F28)=4,(D28-C28)+(F28-E28)-M28-Calendrier!$AS$9,0))))","v":0},0,"Sa",0,null,0]
[11,{"$f":"INDIRECT(ADDRESS(MATCH($B$1,Calendrier!$A$15:$A$59,0)+14,ROW()-17,3,1,\"Calendrier\"),1)","v":"Di"},null,null,null,null,0,{"$f":"IF(AND(K29=0.5,COUNTA(C29:F29)=4),\"erreur\",IF(AND(D29-C29>0,F29-E29=0),G29-Calendrier!$AS$9/2-M29,IF(AND(F29-E29>0,D29-C29=0),(F29-E29)-Calendrier!$AS$9/2-M29,IF(COUNTA(C29:F29)=4,(D29-C29)+(F29-E29)-M29-Calendrier!$AS$9,0))))","v":0},0,"Di",0,null,0]
[12,{"$f":"INDIRECT(ADDRESS(MATCH($B$1,Calendrier!$A$15:$A$59,0)+14,ROW()-17,3,1,\"Calendrier\"),1)","v":"T"},null,null,null,null,0,{"$f":"IF(AND(K30=0.5,COUNTA(C30:F30)=4),\"erreur\",IF(AND(D30-C30>0,F30-E30=0),G30-Calendrier!$AS$9/2-M30,IF(AND(F30-E30>0,D30-C30=0),(F30-E30)-Calendrier!$AS$9/2-M30,IF(COUNTA(C30:F30)=4,(D30-C30)+(F30-E30)-M30-Calendrier!$AS$9,0))))","v":0},0,"",0,null,0]
[13,{"$f":"INDIRECT(ADDRESS(MATCH($B$1,Calendrier!$A$15:$A$59,0)+14,ROW()-17,3,1,\"Calendrier\"),1)","v":"T"},null,null,null,null,0,{"$f":"IF(AND(K31=0.5,COUNTA(C31:F31)=4),\"erreur\",IF(AND(D31-C31>0,F31-E31=0),G31-Calendrier!$AS$9/2-M31,IF(AND(F31-E31>0,D31-C31=0),(F31-E31)-Calendrier!$AS$9/2-M31,IF(COUNTA(C31:F31)=4,(D31-C31)+(F31-E31)-M31-Calendrier!$AS$9,0))))","v":0},0,"",0,null,0]
[14,{"$f":"INDIRECT(ADDRESS(MATCH($B$1,Calendrier!$A$15:$A$59,0)+14,ROW()-17,3,1,\"Calendrier\"),1)","v":"T"},null,null,null,null,0,{"$f":"IF(AND(K32=0.5,COUNTA(C32:F32)=4),\"erreur\",IF(AND(D32-C32>0,F32-E32=0),G32-Calendrier!$AS$9/2-M32,IF(AND(F32-E32>0,D32-C32=0),(F32-E32)-Calendrier!$AS$9/2-M32,IF(COUNTA(C32:F32)=4,(D32-C32)+(F32-E32)-M32-Calendrier!$AS$9,0))))","v":0},0,"",0,null,0]
[15,{"$f":"INDIRECT(ADDRESS(MATCH($B$1,Calendrier!$A$15:$A$59,0)+14,ROW()-17,3,1,\"Calendrier\"),1)","v":"T"},null,null,null,null,0,{"$f":"IF(AND(K33=0.5,COUNTA(C33:F33)=4),\"erreur\",IF(AND(D33-C33>0,F33-E33=0),G33-Calendrier!$AS$9/2-M33,IF(AND(F33-E33>0,D33-C33=0),(F33-E33)-Calendrier!$AS$9/2-M33,IF(COUNTA(C33:F33)=4,(D33-C33)+(F33-E33)-M33-Calendrier!$AS$9,0))))","v":0},0,{"$f":"IF(AND(COUNTA(C33:F33)=0,B33<>\"T\"),B33,IF(AND(OR(B33=$F$9,B33=$F$10),COUNTA(C33:F33=2)),\"T\",IF(G33>=6,\"T\",\"\")))","v":""},0,null,0]
[16,{"$f":"INDIRECT(ADDRESS(MATCH($B$1,Calendrier!$A$15:$A$59,0)+14,ROW()-17,3,1,\"Calendrier\"),1)","v":"RTT"},null,null,null,null,0,{"$f":"IF(AND(K34=0.5,COUNTA(C34:F34)=4),\"erreur\",IF(AND(D34-C34>0,F34-E34=0),G34-Calendrier!$AS$9/2-M34,IF(AND(F34-E34>0,D34-C34=0),(F34-E34)-Calendrier!$AS$9/2-M34,IF(COUNTA(C34:F34)=4,(D34-C34)+(F34-E34)-M34-Calendrier!$AS$9,0))))","v":0},0,"RTT",0,null,0]
[17,{"$f":"INDIRECT(ADDRESS(MATCH($B$1,Calendrier!$A$15:$A$59,0)+14,ROW()-17,3,1,\"Calendrier\"),1)","v":"Sa"},null,null,null,null,0,{"$f":"IF(AND(K35=0.5,COUNTA(C35:F35)=4),\"erreur\",IF(AND(D35-C35>0,F35-E35=0),G35-Calendrier!$AS$9/2-M35,IF(AND(F35-E35>0,D35-C35=0),(F35-E35)-Calendrier!$AS$9/2-M35,IF(COUNTA(C35:F35)=4,(D35-C35)+(F35-E35)-M35-Calendrier!$AS$9,0))))","v":0},0,"Sa",0,null,0]
[18,{"$f":"INDIRECT(ADDRESS(MATCH($B$1,Calendrier!$A$15:$A$59,0)+14,ROW()-17,3,1,\"Calendrier\"),1)","v":"Di"},null,null,null,null,0,{"$f":"IF(AND(K36=0.5,COUNTA(C36:F36)=4),\"erreur\",IF(AND(D36-C36>0,F36-E36=0),G36-Calendrier!$AS$9/2-M36,IF(AND(F36-E36>0,D36-C36=0),(F36-E36)-Calendrier!$AS$9/2-M36,IF(COUNTA(C36:F36)=4,(D36-C36)+(F36-E36)-M36-Calendrier!$AS$9,0))))","v":0},0,"Di",0,null,0]
[19,{"$f":"INDIRECT(ADDRESS(MATCH($B$1,Calendrier!$A$15:$A$59,0)+14,ROW()-17,3,1,\"Calendrier\"),1)","v":"T"},null,null,null,null,0,{"$f":"IF(AND(K37=0.5,COUNTA(C37:F37)=4),\"erreur\",IF(AND(D37-C37>0,F37-E37=0),G37-Calendrier!$AS$9/2-M37,IF(AND(F37-E37>0,D37-C37=0),(F37-E37)-Calendrier!$AS$9/2-M37,IF(COUNTA(C37:F37)=4,(D37-C37)+(F37-E37)-M37-Calendrier!$AS$9,0))))","v":0},0,"",0,null,0]
[20,{"$f":"INDIRECT(ADDRESS(MATCH($B$1,Calendrier!$A$15:$A$59,0)+14,ROW()-17,3,1,\"Calendrier\"),1)","v":"T"},null,null,null,null,0,{"$f":"IF(AND(K38=0.5,COUNTA(C38:F38)=4),\"erreur\",IF(AND(D38-C38>0,F38-E38=0),G38-Calendrier!$AS$9/2-M38,IF(AND(F38-E38>0,D38-C38=0),(F38-E38)-Calendrier!$AS$9/2-M38,IF(COUNTA(C38:F38)=4,(D38-C38)+(F38-E38)-M38-Calendrier!$AS$9,0))))","v":0},0,"",0,null,0]
[21,{"$f":"INDIRECT(ADDRESS(MATCH($B$1,Calendrier!$A$15:$A$59,0)+14,ROW()-17,3,1,\"Calendrier\"),1)","v":"T"},null,null,null,null,0,{"$f":"IF(AND(K39=0.5,COUNTA(C39:F39)=4),\"erreur\",IF(AND(D39-C39>0,F39-E39=0),G39-Calendrier!$AS$9/2-M39,IF(AND(F39-E39>0,D39-C39=0),(F39-E39)-Calendrier!$AS$9/2-M39,IF(COUNTA(C39:F39)=4,(D39-C39)+(F39-E39)-M39-Calendrier!$AS$9,0))))","v":0},0,"",0,null,0]
[22,{"$f":"INDIRECT(ADDRESS(MATCH($B$1,Calendrier!$A$15:$A$59,0)+14,ROW()-17,3,1,\"Calendrier\"),1)","v":"T"},null,null,null,null,0,{"$f":"IF(AND(K40=0.5,COUNTA(C40:F40)=4),\"erreur\",IF(AND(D40-C40>0,F40-E40=0),G40-Calendrier!$AS$9/2-M40,IF(AND(F40-E40>0,D40-C40=0),(F40-E40)-Calendrier!$AS$9/2-M40,IF(COUNTA(C40:F40)=4,(D40-C40)+(F40-E40)-M40-Calendrier!$AS$9,0))))","v":0},0,"",0,null,0]
[23,{"$f":"INDIRECT(ADDRESS(MATCH($B$1,Calendrier!$A$15:$A$59,0)+14,ROW()-17,3,1,\"Calendrier\"),1)","v":"T"},null,null,null,null,0,{"$f":"IF(AND(K41=0.5,COUNTA(C41:F41)=4),\"erreur\",IF(AND(D41-C41>0,F41-E41=0),G41-Calendrier!$AS$9/2-M41,IF(AND(F41-E41>0,D41-C41=0),(F41-E41)-Calendrier!$AS$9/2-M41,IF(COUNTA(C41:F41)=4,(D41-C41)+(F41-E41)-M41-Calendrier!$AS$9,0))))","v":0},0,"",0,null,0]
[24,{"$f":"INDIRECT(ADDRESS(MATCH($B$1,Calendrier!$A$15:$A$59,0)+14,ROW()-17,3,1,\"Calendrier\"),1)","v":"Sa"},null,null,null,null,0,{"$f":"IF(AND(K42=0.5,COUNTA(C42:F42)=4),\"erreur\",IF(AND(D42-C42>0,F42-E42=0),G42-Calendrier!$AS$9/2-M42,IF(AND(F42-E42>0,D42-C42=0),(F42-E42)-Calendrier!$AS$9/2-M42,IF(COUNTA(C42:F42)=4,(D42-C42)+(F42-E42)-M42-Calendrier!$AS$9,0))))","v":0},0,"Sa",0,null,0]
[25,{"$f":"INDIRECT(ADDRESS(MATCH($B$1,Calendrier!$A$15:$A$59,0)+14,ROW()-17,3,1,\"Calendrier\"),1)","v":"Di"},null,null,null,null,0,{"$f":"IF(AND(K43=0.5,COUNTA(C43:F43)=4),\"erreur\",IF(AND(D43-C43>0,F43-E43=0),G43-Calendrier!$AS$9/2-M43,IF(AND(F43-E43>0,D43-C43=0),(F43-E43)-Calendrier!$AS$9/2-M43,IF(COUNTA(C43:F43)=4,(D43-C43)+(F43-E43)-M43-Calendrier!$AS$9,0))))","v":0},0,"Di",0,null,0]
[26,{"$f":"INDIRECT(ADDRESS(MATCH($B$1,Calendrier!$A$15:$A$59,0)+14,ROW()-17,3,1,\"Calendrier\"),1)","v":"T"},null,null,null,null,0,{"$f":"IF(AND(K44=0.5,COUNTA(C44:F44)=4),\"erreur\",IF(AND(D44-C44>0,F44-E44=0),G44-Calendrier!$AS$9/2-M44,IF(AND(F44-E44>0,D44-C44=0),(F44-E44)-Calendrier!$AS$9/2-M44,IF(COUNTA(C44:F44)=4,(D44-C44)+(F44-E44)-M44-Calendrier!$AS$9,0))))","v":0},0,"",0,null,0]
[27,{"$f":"INDIRECT(ADDRESS(MATCH($B$1,Calendrier!$A$15:$A$59,0)+14,ROW()-17,3,1,\"Calendrier\"),1)","v":"T"},null,null,null,null,0,{"$f":"IF(AND(K45=0.5,COUNTA(C45:F45)=4),\"erreur\",IF(AND(D45-C45>0,F45-E45=0),G45-Calendrier!$AS$9/2-M45,IF(AND(F45-E45>0,D45-C45=0),(F45-E45)-Calendrier!$AS$9/2-M45,IF(COUNTA(C45:F45)=4,(D45-C45)+(F45-E45)-M45-Calendrier!$AS$9,0))))","v":0},0,"",0,null,0]
[28,{"$f":"INDIRECT(ADDRESS(MATCH($B$1,Calendrier!$A$15:$A$59,0)+14,ROW()-17,3,1,\"Calendrier\"),1)","v":"T"},null,null,null,null,0,{"$f":"IF(AND(K46=0.5,COUNTA(C46:F46)=4),\"erreur\",IF(AND(D46-C46>0,F46-E46=0),G46-Calendrier!$AS$9/2-M46,IF(AND(F46-E46>0,D46-C46=0),(F46-E46)-Calendrier!$AS$9/2-M46,IF(COUNTA(C46:F46)=4,(D46-C46)+(F46-E46)-M46-Calendrier!$AS$9,0))))","v":0},0,"",0,null,0]
[29,{"$f":"INDIRECT(ADDRESS(MATCH($B$1,Calendrier!$A$15:$A$59,0)+14,ROW()-17,3,1,\"Calendrier\"),1)","v":"T"},null,null,null,null,0,{"$f":"IF(AND(K47=0.5,COUNTA(C47:F47)=4),\"erreur\",IF(AND(D47-C47>0,F47-E47=0),G47-Calendrier!$AS$9/2-M47,IF(AND(F47-E47>0,D47-C47=0),(F47-E47)-Calendrier!$AS$9/2-M47,IF(COUNTA(C47:F47)=4,(D47-C47)+(F47-E47)-M47-Calendrier!$AS$9,0))))","v":0},0,"",0,null,0]
[30,{"$f":"INDIRECT(ADDRESS(MATCH($B$1,Calendrier!$A$15:$A$59,0)+14,ROW()-17,3,1,\"Calendrier\"),1)","v":"T"},null,null,null,null,0,{"$f":"IF(AND(K48=0.5,COUNTA(C48:F48)=4),\"erreur\",IF(AND(D48-C48>0,F48-E48=0),G48-Calendrier!$AS$9/2-M48,IF(AND(F48-E48>0,D48-C48=0),(F48-E48)-Calendrier!$AS$9/2-M48,IF(COUNTA(C48:F48)=4,(D48-C48)+(F48-E48)-M48-Calendrier!$AS$9,0))))","v":0},0,"",0,null,0]
[null,null,null,null,null,null,null,null,0,0,0,null,0]
[null,null,null,null,null,null,null,"solde des variations",{"$f":"I49","v":0}]

{"sheet":"OCT","index":10,"n_rows":50,"n_cols":15,"rows_kept":50,"cut":false,"hidden":false,"merged":[]}
[null,{"$f":"RIGHT(CELL(\"nomfichier\",$A$1),3)","v":"OCT"},"FICHE DE SUIVI HORAIRE"]
[]
[null,"mois :","OCTOBRE",null,null,"année ",{"$f":"Calendrier!A1","v":2016},null,"service",{"$f":"Calendrier!F4","v":"COMPTABILITE"}]
[]
[null,"nom :",{"$f":"Calendrier!F2","v":"MARTIN"},null,null," prénom ",{"$f":"Calendrier!F3","v":"PATRICK"},null,"N° Ident.",{"$f":"Calendrier!F1","v":"N123456"}]
[null,null,null,null,null,null,"type","à réaliser","cumul","en cours","reste",null,"n/cumul"]
[null,null,null,"Nb J/T",{"$f":"Calendrier!$A$10","v":213},{"$f":"+$H$10","v":0},{"$f":"$H$12","v":213},{"$f":"Calendrier!$N$1","v":366},{"$f":"SEP!M7","v":116},{"$f":"SUM(J8:J15)","v":11},{"$f":"H7-(I7+J7)","v":239},null,{"$f":"SUM(M8:M15)","v":127}]
[null,null,null,null,null,null,"CA",{"$f":"Calendrier!N5","v":25},{"$f":"SEP!M8","v":20},{"$f":"IF(G8=\"\",0,COUNTIF($J$19:$J$49,G8))+IF(F8=\"\",0,COUNTIF($J$19:$J$49,F8)/2)","v":0},{"$f":"+H8-(I8+J8)","v":5},"J",{"$f":"+I8+J8","v":20}]
[null,null,null,null,null,"1/2RTT","RTT",{"$f":"Calendrier!N8","v":16},{"$f":"SEP!M9","v":13},{"$f":"IF(G9=\"\",0,COUNTIF($J$19:$J$49,G9))+IF(F9=\"\",0,COUNTIF($J$19:$J$49,F9)/2)","v":1},{"$f":"+H9-(I9+J9)","v":2},"J",14]
[null,null,null,null,null,"1/2CS","CS",{"$f":"Calendrier!N9","v":0},{"$f":"SEP!M10","v":0},{"$f":"IF(G10=\"\",0,COUNTIF($J$19:$J$49,G10))+IF(F10=\"\",0,COUNTIF($J$19:$J$49,F10)/2)","v":0},{"$f":"H10-(I10+J10)","v":0},"J",0]
[null,null,null,null,null,null,"CP",{"$f":"Calendrier!N6","v":0},{"$f":"SEP!M11","v":0},0,{"$f":"H11-(I11+J11)","v":0},"J",0]
[null,null,null,null,null,"1/2T","T",{"$f":"Calendrier!N7","v":213},{"$f":"SEP!M12","v":0},0,{"$f":"+H12-(I12+J12)","v":213},"J",0]
[null,null,null,null,null,null,"Sa",{"$f":"Calendrier!N4","v":53},{"$f":"SEP!M13","v":39},5,{"$f":"+H13-(I13+J13)","v":9},"J",44]
[null,null,null,null,null,null,"Di",{"$f":"Calendrier!N3","v":47},{"$f":"SEP!M14","v":35},5,{"$f":"+H14-(I14+J14)","v":7},"J",40]
[null,null,null,null,null,null,"F",{"$f":"Calendrier!N2","v":12},{"$f":"SEP!M15","v":9},0,{"$f":"+H15-(I15+J15)","v":3},"J",{"$f":"+I15+J15","v":9}]
[null,null,null,null,null,null,"heure/avance fin mois",null,{"$f":"SEP!I50","v":0},null,null,null,{"$f":"I50","v":0}]
[null,"Prévu","Entrée","Sortie","Entrée","Sortie","total J","variation","cumul","Type","nb J/T",null,"Bon E/S","Sortie","Retour"]
[null,null,null,null,null,null,null,null,null,null,null,null,null,"avec bon"]
[1,{"$f":"INDIRECT(ADDRESS(MATCH($B$1,Calendrier!$A$15:$A$59,0)+14,ROW()-17,3,1,\"Calendrier\"),1)","v":"Sa"},null,null,null,null,{"$f":"IF(COUNTA(C19:F19)=4,(D19-C19)+(F19-E19)-M19,IF(COUNTA(C19:D19)<2,(F19-E19)-M19,(D19-C19)-M19))","v":0},{"$f":"IF(AND(K19=0.5,COUNTA(C19:F19)=4),\"erreur\",IF(AND(D19-C19>0,F19-E19=0),G19-Calendrier!$AS$9/2-M19,IF(AND(F19-E19>0,D19-C19=0),(F19-E19)-Calendrier!$AS$9/2-M19,IF(COUNTA(C19:F19)=4,(D19-C19)+(F19-E19)-M19-Calendrier!$AS$9,0))))","v":0},{"$f":"+I16+H19","v":0},{"$f":"IF(AND(COUNTA(C19:F19)=0,B19<>\"T\"),B19,IF(AND(OR(B19=$F$9,B19=$F$10),COUNTA(C19:F19=2)),\"T\",IF(G19>=6,\"T\",\"\")))","v":"Sa"},{"$f":"IF(OR(B19=$F$9,B19=$F$10),0.5,IF(G19>=6,1,0))","v":0},null,{"$f":"+O19-N19","v":0}]
[2,{"$f":"INDIRECT(ADDRESS(MATCH($B$1,Calendrier!$A$15:$A$59,0)+14,ROW()-17,3,1,\"Calendrier\"),1)","v":"Di"},null,null,null,null,0,{"$f":"IF(AND(K20=0.5,COUNTA(C20:F20)=4),\"erreur\",IF(AND(D20-C20>0,F20-E20=0),G20-Calendrier!$AS$9/2-M20,IF(AND(F20-E20>0,D20-C20=0),(F20-E20)-Calendrier!$AS$9/2-M20,IF(COUNTA(C20:F20)=4,(D20-C20)+(F20-E20)-M20-Calendrier!$AS$9,0))))","v":0},{"$f":"+I19+H20","v":0},"Di",0,null,{"$f":"+O20-N20","v":0}]
[3,{"$f":"INDIRECT(ADDRESS(MATCH($B$1,Calendrier!$A$15:$A$59,0)+14,ROW()-17,3,1,\"Calendrier\"),1)","v":"T"},null,null,null,null,0,{"$f":"IF(AND(K21=0.5,COUNTA(C21:F21)=4),\"erreur\",IF(AND(D21-C21>0,F21-E21=0),G21-Calendrier!$AS$9/2-M21,IF(AND(F21-E21>0,D21-C21=0),(F21-E21)-Calendrier!$AS$9/2-M21,IF(COUNTA(C21:F21)=4,(D21-C21)+(F21-E21)-M21-Calendrier!$AS$9,0))))","v":0},0,"",0,null,0]
[4,{"$f":"INDIRECT(ADDRESS(MATCH($B$1,Calendrier!$A$15:$A$59,0)+14,ROW()-17,3,1,\"Calendrier\"),1)","v":"T"},null,null,null,null,0,{"$f":"IF(AND(K22=0.5,COUNTA(C22:F22)=4),\"erreur\",IF(AND(D22-C22>0,F22-E22=0),G22-Calendrier!$AS$9/2-M22,IF(AND(F22-E22>0,D22-C22=0),(F22-E22)-Calendrier!$AS$9/2-M22,IF(COUNTA(C22:F22)=4,(D22-C22)+(F22-E22)-M22-Calendrier!$AS$9,0))))","v":0},0,"",0,null,0]
[5,{"$f":"INDIRECT(ADDRESS(MATCH($B$1,Calendrier!$A$15:$A$59,0)+14,ROW()-17,3,1,\"Calendrier\"),1)","v":"T"},null,null,null,null,0,{"$f":"IF(AND(K23=0.5,COUNTA(C23:F23)=4),\"erreur\",IF(AND(D23-C23>0,F23-E23=0),G23-Calendrier!$AS$9/2-M23,IF(AND(F23-E23>0,D23-C23=0),(F23-E23)-Calendrier!$AS$9/2-M23,IF(COUNTA(C23:F23)=4,(D23-C23)+(F23-E23)-M23-Calendrier!$AS$9,0))))","v":0},0,"",{"$f":"IF(OR(B23=$F$9,B23=$F$10),0.5,IF(G23>=6,1,0))","v":0},null,0]
[6,{"$f":"INDIRECT(ADDRESS(MATCH($B$1,Calendrier!$A$15:$A$59,0)+14,ROW()-17,3,1,\"Calendrier\"),1)","v":"T"},null,null,null,null,0,{"$f":"IF(AND(K24=0.5,COUNTA(C24:F24)=4),\"erreur\",IF(AND(D24-C24>0,F24-E24=0),G24-Calendrier!$AS$9/2-M24,IF(AND(F24-E24>0,D24-C24=0),(F24-E24)-Calendrier!$AS$9/2-M24,IF(COUNTA(C24:F24)=4,(D24-C24)+(F24-E24)-M24-Calendrier!$AS$9,0))))","v":0},0,"",0,null,0]
[7,{"$f":"INDIRECT(ADDRESS(MATCH($B$1,Calendrier!$A$15:$A$59,0)+14,ROW()-17,3,1,\"Calendrier\"),1)","v":"T"},null,null,null,null,0,{"$f":"IF(AND(K25=0.5,COUNTA(C25:F25)=4),\"erreur\",IF(AND(D25-C25>0,F25-E25=0),G25-Calendrier!$AS$9/2-M25,IF(AND(F25-E25>0,D25-C25=0),(F25-E25)-Calendrier!$AS$9/2-M25,IF(COUNTA(C25:F25)=4,(D25-C25)+(F25-E25)-M25-Calendrier!$AS$9,0))))","v":0},0,"",0,null,0]
[8,{"$f":"INDIRECT(ADDRESS(MATCH($B$1,Calendrier!$A$15:$A$59,0)+14,ROW()-17,3,1,\"Calendrier\"),1)","v":"Sa"},null,null,null,null,0,{"$f":"IF(AND(K26=0.5,COUNTA(C26:F26)=4),\"erreur\",IF(AND(D26-C26>0,F26-E26=0),G26-Calendrier!$AS$9/2-M26,IF(AND(F26-E26>0,D26-C26=0),(F26-E26)-Calendrier!$AS$9/2-M26,IF(COUNTA(C26:F26)=4,(D26-C26)+(F26-E26)-M26-Calendrier!$AS$9,0))))","v":0},0,"Sa",0,null,0]
[9,{"$f":"INDIRECT(ADDRESS(MATCH($B$1,Calendrier!$A$15:$A$59,0)+14,ROW()-17,3,1,\"Calendrier\"),1)","v":"Di"},null,null,null,null,0,{"$f":"IF(AND(K27=0.5,COUNTA(C27:F27)=4),\"erreur\",IF(AND(D27-C27>0,F27-E27=0),G27-Calendrier!$AS$9/2-M27,IF(AND(F27-E27>0,D27-C27=0),(F27-E27)-Calendrier!$AS$9/2-M27,IF(COUNTA(C27:F27)=4,(D27-C27)+(F27-E27)-M27-Calendrier!$AS$9,0))))","v":0},0,"Di",0,null,0]
[10,{"$f":"INDIRECT(ADDRESS(MATCH($B$1,Calendrier!$A$15:$A$59,0)+14,ROW()-17,3,1,\"Calendrier\"),1)","v":"T"},null,null,null,null,0,{"$f":"IF(AND(K28=0.5,COUNTA(C28:F28)=4),\"erreur\",IF(AND(D28-C28>0,F28-E28=0),G28-Calendrier!$AS$9/2-M28,IF(AND(F28-E28>0,D28-C28=0),(F28-E28)-Calendrier!$AS$9/2-M28,IF(COUNTA(C28:F28)=4,(D28-C28)+(F28-E28)-M28-Calendrier!$AS$9,0))))","v":0},0,"",0,null,0]
[11,{"$f":"INDIRECT(ADDRESS(MATCH($B$1,Calendrier!$A$15:$A$59,0)+14,ROW()-17,3,1,\"Calendrier\"),1)","v":"T"},null,null,null,null,0,{"$f":"IF(AND(K29=0.5,COUNTA(C29:F29)=4),\"erreur\",IF(AND(D29-C29>0,F29-E29=0),G29-Calendrier!$AS$9/2-M29,IF(AND(F29-E29>0,D29-C29=0),(F29-E29)-Calendrier!$AS$9/2-M29,IF(COUNTA(C29:F29)=4,(D29-C29)+(F29-E29)-M29-Calendrier!$AS$9,0))))","v":0},0,"",0,null,0]
[12,{"$f":"INDIRECT(ADDRESS(MATCH($B$1,Calendrier!$A$15:$A$59,0)+14,ROW()-17,3,1,\"Calendrier\"),1)","v":"T"},null,null,null,null,0,{"$f":"IF(AND(K30=0.5,COUNTA(C30:F30)=4),\"erreur\",IF(AND(D30-C30>0,F30-E30=0),G30-Calendrier!$AS$9/2-M30,IF(AND(F30-E30>0,D30-C30=0),(F30-E30)-Calendrier!$AS$9/2-M30,IF(COUNTA(C30:F30)=4,(D30-C30)+(F30-E30)-M30-Calendrier!$AS$9,0))))","v":0},0,"",0,null,0]
[13,{"$f":"INDIRECT(ADDRESS(MATCH($B$1,Calendrier!$A$15:$A$59,0)+14,ROW()-17,3,1,\"Calendrier\"),1)","v":"T"},null,null,null,null,0,{"$f":"IF(AND(K31=0.5,COUNTA(C31:F31)=4),\"erreur\",IF(AND(D31-C31>0,F31-E31=0),G31-Calendrier!$AS$9/2-M31,IF(AND(F31-E31>0,D31-C31=0),(F31-E31)-Calendrier!$AS$9/2-M31,IF(COUNTA(C31:F31)=4,(D31-C31)+(F31-E31)-M31-Calendrier!$AS$9,0))))","v":0},0,"",0,null,0]
[14,{"$f":"INDIRECT(ADDRESS(MATCH($B$1,Calendrier!$A$15:$A$59,0)+14,ROW()-17,3,1,\"Calendrier\"),1)","v":"RTT"},null,null,null,null,0,{"$f":"IF(AND(K32=0.5,COUNTA(C32:F32)=4),\"erreur\",IF(AND(D32-C32>0,F32-E32=0),G32-Calendrier!$AS$9/2-M32,IF(AND(F32-E32>0,D32-C32=0),(F32-E32)-Calendrier!$AS$9/2-M32,IF(COUNTA(C32:F32)=4,(D32-C32)+(F32-E32)-M32-Calendrier!$AS$9,0))))","v":0},0,"RTT",0,null,0]
[15,{"$f":"INDIRECT(ADDRESS(MATCH($B$1,Calendrier!$A$15:$A$59,0)+14,ROW()-17,3,1,\"Calendrier\"),1)","v":"Sa"},null,null,null,null,0,{"$f":"IF(AND(K33=0.5,COUNTA(C33:F33)=4),\"erreur\",IF(AND(D33-C33>0,F33-E33=0),G33-Calendrier!$AS$9/2-M33,IF(AND(F33-E33>0,D33-C33=0),(F33-E33)-Calendrier!$AS$9/2-M33,IF(COUNTA(C33:F33)=4,(D33-C33)+(F33-E33)-M33-Calendrier!$AS$9,0))))","v":0},0,{"$f":"IF(AND(COUNTA(C33:F33)=0,B33<>\"T\"),B33,IF(AND(OR(B33=$F$9,B33=$F$10),COUNTA(C33:F33=2)),\"T\",IF(G33>=6,\"T\",\"\")))","v":"Sa"},0,null,0]
[16,{"$f":"INDIRECT(ADDRESS(MATCH($B$1,Calendrier!$A$15:$A$59,0)+14,ROW()-17,3,1,\"Calendrier\"),1)","v":"Di"},null,null,null,null,0,{"$f":"IF(AND(K34=0.5,COUNTA(C34:F34)=4),\"erreur\",IF(AND(D34-C34>0,F34-E34=0),G34-Calendrier!$AS$9/2-M34,IF(AND(F34-E34>0,D34-C34=0),(F34-E34)-Calendrier!$AS$9/2-M34,IF(COUNTA(C34:F34)=4,(D34-C34)+(F34-E34)-M34-Calendrier!$AS$9,0))))","v":0},0,"Di",0,null,0]
[17,{"$f":"INDIRECT(ADDRESS(MATCH($B$1,Calendrier!$A$15:$A$59,0)+14,ROW()-17,3,1,\"Calendrier\"),1)","v":"T"},null,null,null,null,0,{"$f":"IF(AND(K35=0.5,COUNTA(C35:F35)=4),\"erreur\",IF(AND(D35-C35>0,F35-E35=0),G35-Calendrier!$AS$9/2-M35,IF(AND(F35-E35>0,D35-C35=0),(F35-E35)-Calendrier!$AS$9/2-M35,IF(COUNTA(C35:F35)=4,(D35-C35)+(F35-E35)-M35-Calendrier!$AS$9,0))))","v":0},0,"",0,null,0]
[18,{"$f":"INDIRECT(ADDRESS(MATCH($B$1,Calendrier!$A$15:$A$59,0)+14,ROW()-17,3,1,\"Calendrier\"),1)","v":"T"},null,null,null,null,0,{"$f":"IF(AND(K36=0.5,COUNTA(C36:F36)=4),\"erreur\",IF(AND(D36-C36>0,F36-E36=0),G36-Calendrier!$AS$9/2-M36,IF(AND(F36-E36>0,D36-C36=0),(F36-E36)-Calendrier!$AS$9/2-M36,IF(COUNTA(C36:F36)=4,(D36-C36)+(F36-E36)-M36-Calendrier!$AS$9,0))))","v":0},0,"",0,null,0]
[19,{"$f":"INDIRECT(ADDRESS(MATCH($B$1,Calendrier!$A$15:$A$59,0)+14,ROW()-17,3,1,\"Calendrier\"),1)","v":"T"},null,null,null,null,0,{"$f":"IF(AND(K37=0.5,COUNTA(C37:F37)=4),\"erreur\",IF(AND(D37-C37>0,F37-E37=0),G37-Calendrier!$AS$9/2-M37,IF(AND(F37-E37>0,D37-C37=0),(F37-E37)-Calendrier!$AS$9/2-M37,IF(COUNTA(C37:F37)=4,(D37-C37)+(F37-E37)-M37-Calendrier!$AS$9,0))))","v":0},0,"",0,null,0]
[20,{"$f":"INDIRECT(ADDRESS(MATCH($B$1,Calendrier!$A$15:$A$59,0)+14,ROW()-17,3,1,\"Calendrier\"),1)","v":"T"},null,null,null,null,0,{"$f":"IF(AND(K38=0.5,COUNTA(C38:F38)=4),\"erreur\",IF(AND(D38-C38>0,F38-E38=0),G38-Calendrier!$AS$9/2-M38,IF(AND(F38-E38>0,D38-C38=0),(F38-E38)-Calendrier!$AS$9/2-M38,IF(COUNTA(C38:F38)=4,(D38-C38)+(F38-E38)-M38-Calendrier!$AS$9,0))))","v":0},0,"",0,null,0]
[21,{"$f":"INDIRECT(ADDRESS(MATCH($B$1,Calendrier!$A$15:$A$59,0)+14,ROW()-17,3,1,\"Calendrier\"),1)","v":"T"},null,null,null,null,0,{"$f":"IF(AND(K39=0.5,COUNTA(C39:F39)=4),\"erreur\",IF(AND(D39-C39>0,F39-E39=0),G39-Calendrier!$AS$9/2-M39,IF(AND(F39-E39>0,D39-C39=0),(F39-E39)-Calendrier!$AS$9/2-M39,IF(COUNTA(C39:F39)=4,(D39-C39)+(F39-E39)-M39-Calendrier!$AS$9,0))))","v":0},0,"",0,null,0]
[22,{"$f":"INDIRECT(ADDRESS(MATCH($B$1,Calendrier!$A$15:$A$59,0)+14,ROW()-17,3,1,\"Calendrier\"),1)","v":"Sa"},null,null,null,null,0,{"$f":"IF(AND(K40=0.5,COUNTA(C40:F40)=4),\"erreur\",IF(AND(D40-C40>0,F40-E40=0),G40-Calendrier!$AS$9/2-M40,IF(AND(F40-E40>0,D40-C40=0),(F40-E40)-Calendrier!$AS$9/2-M40,IF(COUNTA(C40:F40)=4,(D40-C40)+(F40-E40)-M40-Calendrier!$AS$9,0))))","v":0},0,"Sa",0,null,0]
[23,{"$f":"INDIRECT(ADDRESS(MATCH($B$1,Calendrier!$A$15:$A$59,0)+14,ROW()-17,3,1,\"Calendrier\"),1)","v":"Di"},null,null,null,null,0,{"$f":"IF(AND(K41=0.5,COUNTA(C41:F41)=4),\"erreur\",IF(AND(D41-C41>0,F41-E41=0),G41-Calendrier!$AS$9/2-M41,IF(AND(F41-E41>0,D41-C41=0),(F41-E41)-Calendrier!$AS$9/2-M41,IF(COUNTA(C41:F41)=4,(D41-C41)+(F41-E41)-M41-Calendrier!$AS$9,0))))","v":0},0,"Di",0,null,0]
[24,{"$f":"INDIRECT(ADDRESS(MATCH($B$1,Calendrier!$A$15:$A$59,0)+14,ROW()-17,3,1,\"Calendrier\"),1)","v":"T"},null,null,null,null,0,{"$f":"IF(AND(K42=0.5,COUNTA(C42:F42)=4),\"erreur\",IF(AND(D42-C42>0,F42-E42=0),G42-Calendrier!$AS$9/2-M42,IF(AND(F42-E42>0,D42-C42=0),(F42-E42)-Calendrier!$AS$9/2-M42,IF(COUNTA(C42:F42)=4,(D42-C42)+(F42-E42)-M42-Calendrier!$AS$9,0))))","v":0},0,"",0,null,0]
[25,{"$f":"INDIRECT(ADDRESS(MATCH($B$1,Calendrier!$A$15:$A$59,0)+14,ROW()-17,3,1,\"Calendrier\"),1)","v":"T"},null,null,null,null,0,{"$f":"IF(AND(K43=0.5,COUNTA(C43:F43)=4),\"erreur\",IF(AND(D43-C43>0,F43-E43=0),G43-Calendrier!$AS$9/2-M43,IF(AND(F43-E43>0,D43-C43=0),(F43-E43)-Calendrier!$AS$9/2-M43,IF(COUNTA(C43:F43)=4,(D43-C43)+(F43-E43)-M43-Calendrier!$AS$9,0))))","v":0},0,"",0,null,0]
[26,{"$f":"INDIRECT(ADDRESS(MATCH($B$1,Calendrier!$A$15:$A$59,0)+14,ROW()-17,3,1,\"Calendrier\"),1)","v":"T"},null,null,null,null,0,{"$f":"IF(AND(K44=0.5,COUNTA(C44:F44)=4),\"erreur\",IF(AND(D44-C44>0,F44-E44=0),G44-Calendrier!$AS$9/2-M44,IF(AND(F44-E44>0,D44-C44=0),(F44-E44)-Calendrier!$AS$9/2-M44,IF(COUNTA(C44:F44)=4,(D44-C44)+(F44-E44)-M44-Calendrier!$AS$9,0))))","v":0},0,"",0,null,0]
[27,{"$f":"INDIRECT(ADDRESS(MATCH($B$1,Calendrier!$A$15:$A$59,0)+14,ROW()-17,3,1,\"Calendrier\"),1)","v":"T"},null,null,null,null,0,{"$f":"IF(AND(K45=0.5,COUNTA(C45:F45)=4),\"erreur\",IF(AND(D45-C45>0,F45-E45=0),G45-Calendrier!$AS$9/2-M45,IF(AND(F45-E45>0,D45-C45=0),(F45-E45)-Calendrier!$AS$9/2-M45,IF(COUNTA(C45:F45)=4,(D45-C45)+(F45-E45)-M45-Calendrier!$AS$9,0))))","v":0},0,"",0,null,0]
[28,{"$f":"INDIRECT(ADDRESS(MATCH($B$1,Calendrier!$A$15:$A$59,0)+14,ROW()-17,3,1,\"Calendrier\"),1)","v":"T"},null,null,null,null,0,{"$f":"IF(AND(K46=0.5,COUNTA(C46:F46)=4),\"erreur\",IF(AND(D46-C46>0,F46-E46=0),G46-Calendrier!$AS$9/2-M46,IF(AND(F46-E46>0,D46-C46=0),(F46-E46)-Calendrier!$AS$9/2-M46,IF(COUNTA(C46:F46)=4,(D46-C46)+(F46-E46)-M46-Calendrier!$AS$9,0))))","v":0},0,"",0,null,0]
[29,{"$f":"INDIRECT(ADDRESS(MATCH($B$1,Calendrier!$A$15:$A$59,0)+14,ROW()-17,3,1,\"Calendrier\"),1)","v":"Sa"},null,null,null,null,0,{"$f":"IF(AND(K47=0.5,COUNTA(C47:F47)=4),\"erreur\",IF(AND(D47-C47>0,F47-E47=0),G47-Calendrier!$AS$9/2-M47,IF(AND(F47-E47>0,D47-C47=0),(F47-E47)-Calendrier!$AS$9/2-M47,IF(COUNTA(C47:F47)=4,(D47-C47)+(F47-E47)-M47-Calendrier!$AS$9,0))))","v":0},0,"Sa",0,null,0]
[30,{"$f":"INDIRECT(ADDRESS(MATCH($B$1,Calendrier!$A$15:$A$59,0)+14,ROW()-17,3,1,\"Calendrier\"),1)","v":"Di"},null,null,null,null,0,{"$f":"IF(AND(K48=0.5,COUNTA(C48:F48)=4),\"erreur\",IF(AND(D48-C48>0,F48-E48=0),G48-Calendrier!$AS$9/2-M48,IF(AND(F48-E48>0,D48-C48=0),(F48-E48)-Calendrier!$AS$9/2-M48,IF(COUNTA(C48:F48)=4,(D48-C48)+(F48-E48)-M48-Calendrier!$AS$9,0))))","v":0},0,"Di",0,null,0]
[31,{"$f":"INDIRECT(ADDRESS(MATCH($B$1,Calendrier!$A$15:$A$59,0)+14,ROW()-17,3,1,\"Calendrier\"),1)","v":"T"},null,null,null,null,0,{"$f":"IF(AND(K49=0.5,COUNTA(C49:F49)=4),\"erreur\",IF(AND(D49-C49>0,F49-E49=0),G49-Calendrier!$AS$9/2-M49,IF(AND(F49-E49>0,D49-C49=0),(F49-E49)-Calendrier!$AS$9/2-M49,IF(COUNTA(C49:F49)=4,(D49-C49)+(F49-E49)-M49-Calendrier!$AS$9,0))))","v":0},0,"",0,null,0]
[null,null,null,null,null,null,null,"solde des variations",{"$f":"I49","v":0}]

{"sheet":"NOV","index":11,"n_rows":50,"n_cols":15,"rows_kept":50,"cut":false,"hidden":false,"merged":[]}
[null,{"$f":"RIGHT(CELL(\"nomfichier\",$A$1),3)","v":"NOV"},"FICHE DE SUIVI HORAIRE"]
[]
[null,"mois :","NOVEMBRE",null,null,"année ",{"$f":"Calendrier!A1","v":2016},null,"service",{"$f":"Calendrier!F4","v":"COMPTABILITE"}]
[]
[null,"nom :",{"$f":"Calendrier!F2","v":"MARTIN"},null,null," prénom ",{"$f":"Calendrier!F3","v":"PATRICK"},null,"N° Ident.",{"$f":"Calendrier!F1","v":"N123456"}]
[null,null,null,null,null,null,null,"à réaliser","cumul","en cours","reste",null,"n/cumul"]
[null,null,null,"Nb J/T",{"$f":"Calendrier!$A$10","v":213},{"$f":"+$H$10","v":0},{"$f":"$H$12","v":213},{"$f":"Calendrier!$N$1","v":366},{"$f":"OCT!M7","v":127},{"$f":"SUM(J8:J15)","v":11},{"$f":"H7-(I7+J7)","v":228},null,{"$f":"SUM(M8:M15)","v":138}]
[null,null,null,null,null,null,"CA",{"$f":"Calendrier!N5","v":25},{"$f":"OCT!M8","v":20},{"$f":"IF(G8=\"\",0,COUNTIF($J$19:$J$49,G8))+IF(F8=\"\",0,COUNTIF($J$19:$J$49,F8)/2)","v":0},{"$f":"+H8-(I8+J8)","v":5},"J",{"$f":"+I8+J8","v":20}]
[null,null,null,null,null,"1/2RTT","RTT",{"$f":"Calendrier!N8","v":16},{"$f":"OCT!M9","v":14},{"$f":"IF(G9=\"\",0,COUNTIF($J$19:$J$49,G9))+IF(F9=\"\",0,COUNTIF($J$19:$J$49,F9)/2)","v":1},{"$f":"+H9-(I9+J9)","v":1},"J",15]
[null,null,null,null,null,"1/2CS","CS",{"$f":"Calendrier!N9","v":0},{"$f":"OCT!M10","v":0},{"$f":"IF(G10=\"\",0,COUNTIF($J$19:$J$49,G10))+IF(F10=\"\",0,COUNTIF($J$19:$J$49,F10)/2)","v":0},{"$f":"H10-(I10+J10)","v":0},"J",0]
[null,null,null,null,null,null,"CP",{"$f":"Calendrier!N6","v":0},{"$f":"OCT!M11","v":0},0,{"$f":"H11-(I11+J11)","v":0},"J",0]
[null,null,null,null,null,"1/2T","T",{"$f":"Calendrier!N7","v":213},{"$f":"OCT!M12","v":0},0,{"$f":"+H12-(I12+J12)","v":213},"J",0]
[null,null,null,null,null,null,"Sa",{"$f":"Calendrier!N4","v":53},{"$f":"OCT!M13","v":44},4,{"$f":"+H13-(I13+J13)","v":5},"J",48]
[null,null,null,null,null,null,"Di",{"$f":"Calendrier!N3","v":47},{"$f":"OCT!M14","v":40},4,{"$f":"+H14-(I14+J14)","v":3},"J",44]
[null,null,null,null,null,null,"F",{"$f":"Calendrier!N2","v":12},{"$f":"OCT!M15","v":9},2,{"$f":"+H15-(I15+J15)","v":1},"J",{"$f":"+I15+J15","v":11}]
[null,null,null,null,null,null,"heure/avance fin mois",null,{"$f":"OCT!I50","v":0},null,null,null,{"$f":"I50","v":0}]
[null,"Prévu","Entrée","Sortie","Entrée","Sortie","total J","variation","cumul","Type","nb J/T",null,"Bon E/S","Sortie","Retour"]
[null,null,null,null,null,null,null,null,null,null,null,null,null,"avec bon"]
[1,{"$f":"INDIRECT(ADDRESS(MATCH($B$1,Calendrier!$A$15:$A$59,0)+14,ROW()-17,3,1,\"Calendrier\"),1)","v":"F"},null,null,null,null,{"$f":"IF(COUNTA(C19:F19)=4,(D19-C19)+(F19-E19)-M19,IF(COUNTA(C19:D19)<2,(F19-E19)-M19,(D19-C19)-M19))","v":0},{"$f":"IF(AND(K19=0.5,COUNTA(C19:F19)=4),\"erreur\",IF(AND(D19-C19>0,F19-E19=0),G19-Calendrier!$AS$9/2-M19,IF(AND(F19-E19>0,D19-C19=0),(F19-E19)-Calendrier!$AS$9/2-M19,IF(COUNTA(C19:F19)=4,(D19-C19)+(F19-E19)-M19-Calendrier!$AS$9,0))))","v":0},{"$f":"+I16+H19","v":0},{"$f":"IF(AND(COUNTA(C19:F19)=0,B19<>\"T\"),B19,IF(AND(OR(B19=$F$9,B19=$F$10),COUNTA(C19:F19=2)),\"T\",IF(G19>=6,\"T\",\"\")))","v":"F"},{"$f":"IF(OR(B19=$F$9,B19=$F$10),0.5,IF(G19>=6,1,0))","v":0},null,{"$f":"+O19-N19","v":0}]
[2,{"$f":"INDIRECT(ADDRESS(MATCH($B$1,Calendrier!$A$15:$A$59,0)+14,ROW()-17,3,1,\"Calendrier\"),1)","v":"T"},null,null,null,null,0,{"$f":"IF(AND(K20=0.5,COUNTA(C20:F20)=4),\"erreur\",IF(AND(D20-C20>0,F20-E20=0),G20-Calendrier!$AS$9/2-M20,IF(AND(F20-E20>0,D20-C20=0),(F20-E20)-Calendrier!$AS$9/2-M20,IF(COUNTA(C20:F20)=4,(D20-C20)+(F20-E20)-M20-Calendrier!$AS$9,0))))","v":0},{"$f":"+I19+H20","v":0},"",0,null,{"$f":"+O20-N20","v":0}]
[3,{"$f":"INDIRECT(ADDRESS(MATCH($B$1,Calendrier!$A$15:$A$59,0)+14,ROW()-17,3,1,\"Calendrier\"),1)","v":"T"},null,null,null,null,0,{"$f":"IF(AND(K21=0.5,COUNTA(C21:F21)=4),\"erreur\",IF(AND(D21-C21>0,F21-E21=0),G21-Calendrier!$AS$9/2-M21,IF(AND(F21-E21>0,D21-C21=0),(F21-E21)-Calendrier!$AS$9/2-M21,IF(COUNTA(C21:F21)=4,(D21-C21)+(F21-E21)-M21-Calendrier!$AS$9,0))))","v":0},0,"",0,null,0]
[4,{"$f":"INDIRECT(ADDRESS(MATCH($B$1,Calendrier!$A$15:$A$59,0)+14,ROW()-17,3,1,\"Calendrier\"),1)","v":"T"},null,null,null,null,0,{"$f":"IF(AND(K22=0.5,COUNTA(C22:F22)=4),\"erreur\",IF(AND(D22-C22>0,F22-E22=0),G22-Calendrier!$AS$9/2-M22,IF(AND(F22-E22>0,D22-C22=0),(F22-E22)-Calendrier!$AS$9/2-M22,IF(COUNTA(C22:F22)=4,(D22-C22)+(F22-E22)-M22-Calendrier!$AS$9,0))))","v":0},0,"",0,null,0]
[5,{"$f":"INDIRECT(ADDRESS(MATCH($B$1,Calendrier!$A$15:$A$59,0)+14,ROW()-17,3,1,\"Calendrier\"),1)","v":"Sa"},null,null,null,null,0,{"$f":"IF(AND(K23=0.5,COUNTA(C23:F23)=4),\"erreur\",IF(AND(D23-C23>0,F23-E23=0),G23-Calendrier!$AS$9/2-M23,IF(AND(F23-E23>0,D23-C23=0),(F23-E23)-Calendrier!$AS$9/2-M23,IF(COUNTA(C23:F23)=4,(D23-C23)+(F23-E23)-M23-Calendrier!$AS$9,0))))","v":0},0,"Sa",{"$f":"IF(OR(B23=$F$9,B23=$F$10),0.5,IF(G23>=6,1,0))","v":0},null,0]
[6,{"$f":"INDIRECT(ADDRESS(MATCH($B$1,Calendrier!$A$15:$A$59,0)+14,ROW()-17,3,1,\"Calendrier\"),1)","v":"Di"},null,null,null,null,0,{"$f":"IF(AND(K24=0.5,COUNTA(C24:F24)=4),\"erreur\",IF(AND(D24-C24>0,F24-E24=0),G24-Calendrier!$AS$9/2-M24,IF(AND(F24-E24>0,D24-C24=0),(F24-E24)-Calendrier!$AS$9/2-M24,IF(COUNTA(C24:F24)=4,(D24-C24)+(F24-E24)-M24-Calendrier!$AS$9,0))))","v":0},0,"Di",0,null,0]
[7,{"$f":"INDIRECT(ADDRESS(MATCH($B$1,Calendrier!$A$15:$A$59,0)+14,ROW()-17,3,1,\"Calendrier\"),1)","v":"T"},null,null,null,null,0,{"$f":"IF(AND(K25=0.5,COUNTA(C25:F25)=4),\"erreur\",IF(AND(D25-C25>0,F25-E25=0),G25-Calendrier!$AS$9/2-M25,IF(AND(F25-E25>0,D25-C25=0),(F25-E25)-Calendrier!$AS$9/2-M25,IF(COUNTA(C25:F25)=4,(D25-C25)+(F25-E25)-M25-Calendrier!$AS$9,0))))","v":0},0,"",0,null,0]
[8,{"$f":"INDIRECT(ADDRESS(MATCH($B$1,Calendrier!$A$15:$A$59,0)+14,ROW()-17,3,1,\"Calendrier\"),1)","v":"T"},null,null,null,null,0,{"$f":"IF(AND(K26=0.5,COUNTA(C26:F26)=4),\"erreur\",IF(AND(D26-C26>0,F26-E26=0),G26-Calendrier!$AS$9/2-M26,IF(AND(F26-E26>0,D26-C26=0),(F26-E26)-Calendrier!$AS$9/2-M26,IF(COUNTA(C26:F26)=4,(D26-C26)+(F26-E26)-M26-Calendrier!$AS$9,0))))","v":0},0,"",0,null,0]
[9,{"$f":"INDIRECT(ADDRESS(MATCH($B$1,Calendrier!$A$15:$A$59,0)+14,ROW()-17,3,1,\"Calendrier\"),1)","v":"T"},null,null,null,null,0,{"$f":"IF(AND(K27=0.5,COUNTA(C27:F27)=4),\"erreur\",IF(AND(D27-C27>0,F27-E27=0),G27-Calendrier!$AS$9/2-M27,IF(AND(F27-E27>0,D27-C27=0),(F27-E27)-Calendrier!$AS$9/2-M27,IF(COUNTA(C27:F27)=4,(D27-C27)+(F27-E27)-M27-Calendrier!$AS$9,0))))","v":0},0,"",0,null,0]
[10,{"$f":"INDIRECT(ADDRESS(MATCH($B$1,Calendrier!$A$15:$A$59,0)+14,ROW()-17,3,1,\"Calendrier\"),1)","v":"T"},null,null,null,null,0,{"$f":"IF(AND(K28=0.5,COUNTA(C28:F28)=4),\"erreur\",IF(AND(D28-C28>0,F28-E28=0),G28-Calendrier!$AS$9/2-M28,IF(AND(F28-E28>0,D28-C28=0),(F28-E28)-Calendrier!$AS$9/2-M28,IF(COUNTA(C28:F28)=4,(D28-C28)+(F28-E28)-M28-Calendrier!$AS$9,0))))","v":0},0,"",0,null,0]
[11,{"$f":"INDIRECT(ADDRESS(MATCH($B$1,Calendrier!$A$15:$A$59,0)+14,ROW()-17,3,1,\"Calendrier\"),1)","v":"F"},null,null,null,null,0,{"$f":"IF(AND(K29=0.5,COUNTA(C29:F29)=4),\"erreur\",IF(AND(D29-C29>0,F29-E29=0),G29-Calendrier!$AS$9/2-M29,IF(AND(F29-E29>0,D29-C29=0),(F29-E29)-Calendrier!$AS$9/2-M29,IF(COUNTA(C29:F29)=4,(D29-C29)+(F29-E29)-M29-Calendrier!$AS$9,0))))","v":0},0,"F",0,null,0]
[12,{"$f":"INDIRECT(ADDRESS(MATCH($B$1,Calendrier!$A$15:$A$59,0)+14,ROW()-17,3,1,\"Calendrier\"),1)","v":"Sa"},null,null,null,null,0,{"$f":"IF(AND(K30=0.5,COUNTA(C30:F30)=4),\"erreur\",IF(AND(D30-C30>0,F30-E30=0),G30-Calendrier!$AS$9/2-M30,IF(AND(F30-E30>0,D30-C30=0),(F30-E30)-Calendrier!$AS$9/2-M30,IF(COUNTA(C30:F30)=4,(D30-C30)+(F30-E30)-M30-Calendrier!$AS$9,0))))","v":0},0,"Sa",0,null,0]
[13,{"$f":"INDIRECT(ADDRESS(MATCH($B$1,Calendrier!$A$15:$A$59,0)+14,ROW()-17,3,1,\"Calendrier\"),1)","v":"Di"},null,null,null,null,0,{"$f":"IF(AND(K31=0.5,COUNTA(C31:F31)=4),\"erreur\",IF(AND(D31-C31>0,F31-E31=0),G31-Calendrier!$AS$9/2-M31,IF(AND(F31-E31>0,D31-C31=0),(F31-E31)-Calendrier!$AS$9/2-M31,IF(COUNTA(C31:F31)=4,(D31-C31)+(F31-E31)-M31-Calendrier!$AS$9,0))))","v":0},0,"Di",0,null,0]
[14,{"$f":"INDIRECT(ADDRESS(MATCH($B$1,Calendrier!$A$15:$A$59,0)+14,ROW()-17,3,1,\"Calendrier\"),1)","v":"T"},null,null,null,null,0,{"$f":"IF(AND(K32=0.5,COUNTA(C32:F32)=4),\"erreur\",IF(AND(D32-C32>0,F32-E32=0),G32-Calendrier!$AS$9/2-M32,IF(AND(F32-E32>0,D32-C32=0),(F32-E32)-Calendrier!$AS$9/2-M32,IF(COUNTA(C32:F32)=4,(D32-C32)+(F32-E32)-M32-Calendrier!$AS$9,0))))","v":0},0,"",0,null,0]
[15,{"$f":"INDIRECT(ADDRESS(MATCH($B$1,Calendrier!$A$15:$A$59,0)+14,ROW()-17,3,1,\"Calendrier\"),1)","v":"T"},null,null,null,null,0,{"$f":"IF(AND(K33=0.5,COUNTA(C33:F33)=4),\"erreur\",IF(AND(D33-C33>0,F33-E33=0),G33-Calendrier!$AS$9/2-M33,IF(AND(F33-E33>0,D33-C33=0),(F33-E33)-Calendrier!$AS$9/2-M33,IF(COUNTA(C33:F33)=4,(D33-C33)+(F33-E33)-M33-Calendrier!$AS$9,0))))","v":0},0,{"$f":"IF(AND(COUNTA(C33:F33)=0,B33<>\"T\"),B33,IF(AND(OR(B33=$F$9,B33=$F$10),COUNTA(C33:F33=2)),\"T\",IF(G33>=6,\"T\",\"\")))","v":""},0,null,0]
[16,{"$f":"INDIRECT(ADDRESS(MATCH($B$1,Calendrier!$A$15:$A$59,0)+14,ROW()-17,3,1,\"Calendrier\"),1)","v":"T"},null,null,null,null,0,{"$f":"IF(AND(K34=0.5,COUNTA(C34:F34)=4),\"erreur\",IF(AND(D34-C34>0,F34-E34=0),G34-Calendrier!$AS$9/2-M34,IF(AND(F34-E34>0,D34-C34=0),(F34-E34)-Calendrier!$AS$9/2-M34,IF(COUNTA(C34:F34)=4,(D34-C34)+(F34-E34)-M34-Calendrier!$AS$9,0))))","v":0},0,"",0,null,0]
[17,{"$f":"INDIRECT(ADDRESS(MATCH($B$1,Calendrier!$A$15:$A$59,0)+14,ROW()-17,3,1,\"Calendrier\"),1)","v":"T"},null,null,null,null,0,{"$f":"IF(AND(K35=0.5,COUNTA(C35:F35)=4),\"erreur\",IF(AND(D35-C35>0,F35-E35=0),G35-Calendrier!$AS$9/2-M35,IF(AND(F35-E35>0,D35-C35=0),(F35-E35)-Calendrier!$AS$9/2-M35,IF(COUNTA(C35:F35)=4,(D35-C35)+(F35-E35)-M35-Calendrier!$AS$9,0))))","v":0},0,"",0,null,0]
[18,{"$f":"INDIRECT(ADDRESS(MATCH($B$1,Calendrier!$A$15:$A$59,0)+14,ROW()-17,3,1,\"Calendrier\"),1)","v":"RTT"},null,null,null,null,0,{"$f":"IF(AND(K36=0.5,COUNTA(C36:F36)=4),\"erreur\",IF(AND(D36-C36>0,F36-E36=0),G36-Calendrier!$AS$9/2-M36,IF(AND(F36-E36>0,D36-C36=0),(F36-E36)-Calendrier!$AS$9/2-M36,IF(COUNTA(C36:F36)=4,(D36-C36)+(F36-E36)-M36-Calendrier!$AS$9,0))))","v":0},0,"RTT",0,null,0]
[19,{"$f":"INDIRECT(ADDRESS(MATCH($B$1,Calendrier!$A$15:$A$59,0)+14,ROW()-17,3,1,\"Calendrier\"),1)","v":"Sa"},null,null,null,null,0,{"$f":"IF(AND(K37=0.5,COUNTA(C37:F37)=4),\"erreur\",IF(AND(D37-C37>0,F37-E37=0),G37-Calendrier!$AS$9/2-M37,IF(AND(F37-E37>0,D37-C37=0),(F37-E37)-Calendrier!$AS$9/2-M37,IF(COUNTA(C37:F37)=4,(D37-C37)+(F37-E37)-M37-Calendrier!$AS$9,0))))","v":0},0,"Sa",0,null,0]
[20,{"$f":"INDIRECT(ADDRESS(MATCH($B$1,Calendrier!$A$15:$A$59,0)+14,ROW()-17,3,1,\"Calendrier\"),1)","v":"Di"},null,null,null,null,0,{"$f":"IF(AND(K38=0.5,COUNTA(C38:F38)=4),\"erreur\",IF(AND(D38-C38>0,F38-E38=0),G38-Calendrier!$AS$9/2-M38,IF(AND(F38-E38>0,D38-C38=0),(F38-E38)-Calendrier!$AS$9/2-M38,IF(COUNTA(C38:F38)=4,(D38-C38)+(F38-E38)-M38-Calendrier!$AS$9,0))))","v":0},0,"Di",0,null,0]
[21,{"$f":"INDIRECT(ADDRESS(MATCH($B$1,Calendrier!$A$15:$A$59,0)+14,ROW()-17,3,1,\"Calendrier\"),1)","v":"T"},null,null,null,null,0,{"$f":"IF(AND(K39=0.5,COUNTA(C39:F39)=4),\"erreur\",IF(AND(D39-C39>0,F39-E39=0),G39-Calendrier!$AS$9/2-M39,IF(AND(F39-E39>0,D39-C39=0),(F39-E39)-Calendrier!$AS$9/2-M39,IF(COUNTA(C39:F39)=4,(D39-C39)+(F39-E39)-M39-Calendrier!$AS$9,0))))","v":0},0,"",0,null,0]
[22,{"$f":"INDIRECT(ADDRESS(MATCH($B$1,Calendrier!$A$15:$A$59,0)+14,ROW()-17,3,1,\"Calendrier\"),1)","v":"T"},null,null,null,null,0,{"$f":"IF(AND(K40=0.5,COUNTA(C40:F40)=4),\"erreur\",IF(AND(D40-C40>0,F40-E40=0),G40-Calendrier!$AS$9/2-M40,IF(AND(F40-E40>0,D40-C40=0),(F40-E40)-Calendrier!$AS$9/2-M40,IF(COUNTA(C40:F40)=4,(D40-C40)+(F40-E40)-M40-Calendrier!$AS$9,0))))","v":0},0,"",0,null,0]
[23,{"$f":"INDIRECT(ADDRESS(MATCH($B$1,Calendrier!$A$15:$A$59,0)+14,ROW()-17,3,1,\"Calendrier\"),1)","v":"T"},null,null,null,null,0,{"$f":"IF(AND(K41=0.5,COUNTA(C41:F41)=4),\"erreur\",IF(AND(D41-C41>0,F41-E41=0),G41-Calendrier!$AS$9/2-M41,IF(AND(F41-E41>0,D41-C41=0),(F41-E41)-Calendrier!$AS$9/2-M41,IF(COUNTA(C41:F41)=4,(D41-C41)+(F41-E41)-M41-Calendrier!$AS$9,0))))","v":0},0,"",0,null,0]
[24,{"$f":"INDIRECT(ADDRESS(MATCH($B$1,Calendrier!$A$15:$A$59,0)+14,ROW()-17,3,1,\"Calendrier\"),1)","v":"T"},null,null,null,null,0,{"$f":"IF(AND(K42=0.5,COUNTA(C42:F42)=4),\"erreur\",IF(AND(D42-C42>0,F42-E42=0),G42-Calendrier!$AS$9/2-M42,IF(AND(F42-E42>0,D42-C42=0),(F42-E42)-Calendrier!$AS$9/2-M42,IF(COUNTA(C42:F42)=4,(D42-C42)+(F42-E42)-M42-Calendrier!$AS$9,0))))","v":0},0,"",0,null,0]
[25,{"$f":"INDIRECT(ADDRESS(MATCH($B$1,Calendrier!$A$15:$A$59,0)+14,ROW()-17,3,1,\"Calendrier\"),1)","v":"T"},null,null,null,null,0,{"$f":"IF(AND(K43=0.5,COUNTA(C43:F43)=4),\"erreur\",IF(AND(D43-C43>0,F43-E43=0),G43-Calendrier!$AS$9/2-M43,IF(AND(F43-E43>0,D43-C43=0),(F43-E43)-Calendrier!$AS$9/2-M43,IF(COUNTA(C43:F43)=4,(D43-C43)+(F43-E43)-M43-Calendrier!$AS$9,0))))","v":0},0,"",0,null,0]
[26,{"$f":"INDIRECT(ADDRESS(MATCH($B$1,Calendrier!$A$15:$A$59,0)+14,ROW()-17,3,1,\"Calendrier\"),1)","v":"Sa"},null,null,null,null,0,{"$f":"IF(AND(K44=0.5,COUNTA(C44:F44)=4),\"erreur\",IF(AND(D44-C44>0,F44-E44=0),G44-Calendrier!$AS$9/2-M44,IF(AND(F44-E44>0,D44-C44=0),(F44-E44)-Calendrier!$AS$9/2-M44,IF(COUNTA(C44:F44)=4,(D44-C44)+(F44-E44)-M44-Calendrier!$AS$9,0))))","v":0},0,"Sa",0,null,0]
[27,{"$f":"INDIRECT(ADDRESS(MATCH($B$1,Calendrier!$A$15:$A$59,0)+14,ROW()-17,3,1,\"Calendrier\"),1)","v":"Di"},null,null,null,null,0,{"$f":"IF(AND(K45=0.5,COUNTA(C45:F45)=4),\"erreur\",IF(AND(D45-C45>0,F45-E45=0),G45-Calendrier!$AS$9/2-M45,IF(AND(F45-E45>0,D45-C45=0),(F45-E45)-Calendrier!$AS$9/2-M45,IF(COUNTA(C45:F45)=4,(D45-C45)+(F45-E45)-M45-Calendrier!$AS$9,0))))","v":0},0,"Di",0,null,0]
[28,{"$f":"INDIRECT(ADDRESS(MATCH($B$1,Calendrier!$A$15:$A$59,0)+14,ROW()-17,3,1,\"Calendrier\"),1)","v":"T"},null,null,null,null,0,{"$f":"IF(AND(K46=0.5,COUNTA(C46:F46)=4),\"erreur\",IF(AND(D46-C46>0,F46-E46=0),G46-Calendrier!$AS$9/2-M46,IF(AND(F46-E46>0,D46-C46=0),(F46-E46)-Calendrier!$AS$9/2-M46,IF(COUNTA(C46:F46)=4,(D46-C46)+(F46-E46)-M46-Calendrier!$AS$9,0))))","v":0},0,"",0,null,0]
[29,{"$f":"INDIRECT(ADDRESS(MATCH($B$1,Calendrier!$A$15:$A$59,0)+14,ROW()-17,3,1,\"Calendrier\"),1)","v":"T"},null,null,null,null,0,{"$f":"IF(AND(K47=0.5,COUNTA(C47:F47)=4),\"erreur\",IF(AND(D47-C47>0,F47-E47=0),G47-Calendrier!$AS$9/2-M47,IF(AND(F47-E47>0,D47-C47=0),(F47-E47)-Calendrier!$AS$9/2-M47,IF(COUNTA(C47:F47)=4,(D47-C47)+(F47-E47)-M47-Calendrier!$AS$9,0))))","v":0},0,"",0,null,0]
[30,{"$f":"INDIRECT(ADDRESS(MATCH($B$1,Calendrier!$A$15:$A$59,0)+14,ROW()-17,3,1,\"Calendrier\"),1)","v":"T"},null,null,null,null,0,{"$f":"IF(AND(K48=0.5,COUNTA(C48:F48)=4),\"erreur\",IF(AND(D48-C48>0,F48-E48=0),G48-Calendrier!$AS$9/2-M48,IF(AND(F48-E48>0,D48-C48=0),(F48-E48)-Calendrier!$AS$9/2-M48,IF(COUNTA(C48:F48)=4,(D48-C48)+(F48-E48)-M48-Calendrier!$AS$9,0))))","v":0},0,"",0,null,0]
[null,null,null,null,null,null,null,null,0,0,0,null,0]
[null,null,null,null,null,null,null,"solde des variations",{"$f":"I49","v":0}]

{"sheet":"DEC","index":12,"n_rows":50,"n_cols":15,"rows_kept":50,"cut":false,"hidden":false,"merged":[]}
[null,{"$f":"RIGHT(CELL(\"nomfichier\",$A$1),3)","v":"DEC"},"FICHE DE SUIVI HORAIRE"]
[]
[null,"mois :","DECEMBRE",null,null,"année ",{"$f":"Calendrier!A1","v":2016},null,"service",{"$f":"Calendrier!F4","v":"COMPTABILITE"}]
[]
[null,"nom :",{"$f":"Calendrier!F2","v":"MARTIN"},null,null," prénom ",{"$f":"Calendrier!F3","v":"PATRICK"},null,"N° Ident.",{"$f":"Calendrier!F1","v":"N123456"}]
[null,null,null,null,null,null,null,"à réaliser","cumul","en cours","reste",null,"n/cumul"]
[null,null,null,"Nb J/T",{"$f":"Calendrier!$A$10","v":213},{"$f":"$H$10","v":0},{"$f":"$H$12","v":213},{"$f":"Calendrier!$N$1","v":366},{"$f":"NOV!M7","v":138},{"$f":"SUM(J8:J15)","v":15},{"$f":"H7-(I7+J7)","v":213},null,{"$f":"SUM(M8:M15)","v":153}]
[null,null,null,null,null,null,"CA",{"$f":"Calendrier!N5","v":25},{"$f":"NOV!M8","v":20},{"$f":"IF(G8=\"\",0,COUNTIF($J$19:$J$49,G8))+IF(F8=\"\",0,COUNTIF($J$19:$J$49,F8)/2)","v":5},{"$f":"+H8-(I8+J8)","v":0},"J",{"$f":"+I8+J8","v":25}]
[null,null,null,null,null,"1/2RTT","RTT",{"$f":"Calendrier!N8","v":16},{"$f":"NOV!M9","v":15},{"$f":"IF(G9=\"\",0,COUNTIF($J$19:$J$49,G9))+IF(F9=\"\",0,COUNTIF($J$19:$J$49,F9)/2)","v":1},{"$f":"+H9-(I9+J9)","v":0},"J",16]
[null,null,null,null,null,"1/2CS","CS",{"$f":"Calendrier!N9","v":0},{"$f":"NOV!M10","v":0},{"$f":"IF(G10=\"\",0,COUNTIF($J$19:$J$49,G10))+IF(F10=\"\",0,COUNTIF($J$19:$J$49,F10)/2)","v":0},{"$f":"H10-(I10+J10)","v":0},"J",0]
[null,null,null,null,null,null,"CP",{"$f":"Calendrier!N6","v":0},{"$f":"NOV!M11","v":0},0,{"$f":"H11-(I11+J11)","v":0},"J",0]
[null,null,null,null,null,"1/2T","T",{"$f":"Calendrier!N7","v":213},{"$f":"NOV!M12","v":0},0,{"$f":"+H12-(I12+J12)","v":213},"J",0]
[null,null,null,null,null,null,"Sa",{"$f":"Calendrier!N4","v":53},{"$f":"NOV!M13","v":48},5,{"$f":"+H13-(I13+J13)","v":0},"J",53]
[null,null,null,null,null,null,"Di",{"$f":"Calendrier!N3","v":47},{"$f":"NOV!M14","v":44},3,{"$f":"+H14-(I14+J14)","v":0},"J",47]
[null,null,null,null,null,null,"F",{"$f":"Calendrier!N2","v":12},{"$f":"NOV!M15","v":11},1,{"$f":"+H15-(I15+J15)","v":0},"J",{"$f":"+I15+J15","v":12}]
[null,null,null,null,null,null,"heure/avance fin mois",null,{"$f":"NOV!I50","v":0},null,null,null,{"$f":"I50","v":0}]
[null,"Prévu","Entrée","Sortie","Entrée","Sortie","total J","variation","cumul","Type","nb J/T",null,"Bon E/S","Sortie","Retour"]
[null,null,null,null,null,null,null,null,null,null,null,null,null,"avec bon"]
[1,{"$f":"INDIRECT(ADDRESS(MATCH($B$1,Calendrier!$A$15:$A$59,0)+14,ROW()-17,3,1,\"Calendrier\"),1)","v":"T"},null,null,null,null,{"$f":"IF(COUNTA(C19:F19)=4,(D19-C19)+(F19-E19)-M19,IF(COUNTA(C19:D19)<2,(F19-E19)-M19,(D19-C19)-M19))","v":0},{"$f":"IF(AND(K19=0.5,COUNTA(C19:F19)=4),\"erreur\",IF(AND(D19-C19>0,F19-E19=0),G19-Calendrier!$AS$9/2-M19,IF(AND(F19-E19>0,D19-C19=0),(F19-E19)-Calendrier!$AS$9/2-M19,IF(COUNTA(C19:F19)=4,(D19-C19)+(F19-E19)-M19-Calendrier!$AS$9,0))))","v":0},{"$f":"+I16+H19","v":0},{"$f":"IF(AND(COUNTA(C19:F19)=0,B19<>\"T\"),B19,IF(AND(OR(B19=$F$9,B19=$F$10),COUNTA(C19:F19=2)),\"T\",IF(G19>=6,\"T\",\"\")))","v":""},{"$f":"IF(OR(B19=$F$9,B19=$F$10),0.5,IF(G19>=6,1,0))","v":0},null,{"$f":"+O19-N19","v":0}]
[2,{"$f":"INDIRECT(ADDRESS(MATCH($B$1,Calendrier!$A$15:$A$59,0)+14,ROW()-17,3,1,\"Calendrier\"),1)","v":"T"},null,null,null,null,0,{"$f":"IF(AND(K20=0.5,COUNTA(C20:F20)=4),\"erreur\",IF(AND(D20-C20>0,F20-E20=0),G20-Calendrier!$AS$9/2-M20,IF(AND(F20-E20>0,D20-C20=0),(F20-E20)-Calendrier!$AS$9/2-M20,IF(COUNTA(C20:F20)=4,(D20-C20)+(F20-E20)-M20-Calendrier!$AS$9,0))))","v":0},{"$f":"+I19+H20","v":0},"",0,null,{"$f":"+O20-N20","v":0}]
[3,{"$f":"INDIRECT(ADDRESS(MATCH($B$1,Calendrier!$A$15:$A$59,0)+14,ROW()-17,3,1,\"Calendrier\"),1)","v":"Sa"},null,null,null,null,0,{"$f":"IF(AND(K21=0.5,COUNTA(C21:F21)=4),\"erreur\",IF(AND(D21-C21>0,F21-E21=0),G21-Calendrier!$AS$9/2-M21,IF(AND(F21-E21>0,D21-C21=0),(F21-E21)-Calendrier!$AS$9/2-M21,IF(COUNTA(C21:F21)=4,(D21-C21)+(F21-E21)-M21-Calendrier!$AS$9,0))))","v":0},0,"Sa",0,null,0]
[4,{"$f":"INDIRECT(ADDRESS(MATCH($B$1,Calendrier!$A$15:$A$59,0)+14,ROW()-17,3,1,\"Calendrier\"),1)","v":"Di"},null,null,null,null,0,{"$f":"IF(AND(K22=0.5,COUNTA(C22:F22)=4),\"erreur\",IF(AND(D22-C22>0,F22-E22=0),G22-Calendrier!$AS$9/2-M22,IF(AND(F22-E22>0,D22-C22=0),(F22-E22)-Calendrier!$AS$9/2-M22,IF(COUNTA(C22:F22)=4,(D22-C22)+(F22-E22)-M22-Calendrier!$AS$9,0))))","v":0},0,"Di",0,null,0]
[5,{"$f":"INDIRECT(ADDRESS(MATCH($B$1,Calendrier!$A$15:$A$59,0)+14,ROW()-17,3,1,\"Calendrier\"),1)","v":"T"},null,null,null,null,0,{"$f":"IF(AND(K23=0.5,COUNTA(C23:F23)=4),\"erreur\",IF(AND(D23-C23>0,F23-E23=0),G23-Calendrier!$AS$9/2-M23,IF(AND(F23-E23>0,D23-C23=0),(F23-E23)-Calendrier!$AS$9/2-M23,IF(COUNTA(C23:F23)=4,(D23-C23)+(F23-E23)-M23-Calendrier!$AS$9,0))))","v":0},0,"",{"$f":"IF(OR(B23=$F$9,B23=$F$10),0.5,IF(G23>=6,1,0))","v":0},null,0]
[6,{"$f":"INDIRECT(ADDRESS(MATCH($B$1,Calendrier!$A$15:$A$59,0)+14,ROW()-17,3,1,\"Calendrier\"),1)","v":"T"},null,null,null,null,0,{"$f":"IF(AND(K24=0.5,COUNTA(C24:F24)=4),\"erreur\",IF(AND(D24-C24>0,F24-E24=0),G24-Calendrier!$AS$9/2-M24,IF(AND(F24-E24>0,D24-C24=0),(F24-E24)-Calendrier!$AS$9/2-M24,IF(COUNTA(C24:F24)=4,(D24-C24)+(F24-E24)-M24-Calendrier!$AS$9,0))))","v":0},0,"",0,null,0]
[7,{"$f":"INDIRECT(ADDRESS(MATCH($B$1,Calendrier!$A$15:$A$59,0)+14,ROW()-17,3,1,\"Calendrier\"),1)","v":"T"},null,null,null,null,0,{"$f":"IF(AND(K25=0.5,COUNTA(C25:F25)=4),\"erreur\",IF(AND(D25-C25>0,F25-E25=0),G25-Calendrier!$AS$9/2-M25,IF(AND(F25-E25>0,D25-C25=0),(F25-E25)-Calendrier!$AS$9/2-M25,IF(COUNTA(C25:F25)=4,(D25-C25)+(F25-E25)-M25-Calendrier!$AS$9,0))))","v":0},0,"",0,null,0]
[8,{"$f":"INDIRECT(ADDRESS(MATCH($B$1,Calendrier!$A$15:$A$59,0)+14,ROW()-17,3,1,\"Calendrier\"),1)","v":"T"},null,null,null,null,0,{"$f":"IF(AND(K26=0.5,COUNTA(C26:F26)=4),\"erreur\",IF(AND(D26-C26>0,F26-E26=0),G26-Calendrier!$AS$9/2-M26,IF(AND(F26-E26>0,D26-C26=0),(F26-E26)-Calendrier!$AS$9/2-M26,IF(COUNTA(C26:F26)=4,(D26-C26)+(F26-E26)-M26-Calendrier!$AS$9,0))))","v":0},0,"",0,null,0]
[9,{"$f":"INDIRECT(ADDRESS(MATCH($B$1,Calendrier!$A$15:$A$59,0)+14,ROW()-17,3,1,\"Calendrier\"),1)","v":"T"},null,null,null,null,0,{"$f":"IF(AND(K27=0.5,COUNTA(C27:F27)=4),\"erreur\",IF(AND(D27-C27>0,F27-E27=0),G27-Calendrier!$AS$9/2-M27,IF(AND(F27-E27>0,D27-C27=0),(F27-E27)-Calendrier!$AS$9/2-M27,IF(COUNTA(C27:F27)=4,(D27-C27)+(F27-E27)-M27-Calendrier!$AS$9,0))))","v":0},0,"",0,null,0]
[10,{"$f":"INDIRECT(ADDRESS(MATCH($B$1,Calendrier!$A$15:$A$59,0)+14,ROW()-17,3,1,\"Calendrier\"),1)","v":"Sa"},null,null,null,null,0,{"$f":"IF(AND(K28=0.5,COUNTA(C28:F28)=4),\"erreur\",IF(AND(D28-C28>0,F28-E28=0),G28-Calendrier!$AS$9/2-M28,IF(AND(F28-E28>0,D28-C28=0),(F28-E28)-Calendrier!$AS$9/2-M28,IF(COUNTA(C28:F28)=4,(D28-C28)+(F28-E28)-M28-Calendrier!$AS$9,0))))","v":0},0,"Sa",0,null,0]
[11,{"$f":"INDIRECT(ADDRESS(MATCH($B$1,Calendrier!$A$15:$A$59,0)+14,ROW()-17,3,1,\"Calendrier\"),1)","v":"Di"},null,null,null,null,0,{"$f":"IF(AND(K29=0.5,COUNTA(C29:F29)=4),\"erreur\",IF(AND(D29-C29>0,F29-E29=0),G29-Calendrier!$AS$9/2-M29,IF(AND(F29-E29>0,D29-C29=0),(F29-E29)-Calendrier!$AS$9/2-M29,IF(COUNTA(C29:F29)=4,(D29-C29)+(F29-E29)-M29-Calendrier!$AS$9,0))))","v":0},0,"Di",0,null,0]
[12,{"$f":"INDIRECT(ADDRESS(MATCH($B$1,Calendrier!$A$15:$A$59,0)+14,ROW()-17,3,1,\"Calendrier\"),1)","v":"RTT"},null,null,null,null,0,{"$f":"IF(AND(K30=0.5,COUNTA(C30:F30)=4),\"erreur\",IF(AND(D30-C30>0,F30-E30=0),G30-Calendrier!$AS$9/2-M30,IF(AND(F30-E30>0,D30-C30=0),(F30-E30)-Calendrier!$AS$9/2-M30,IF(COUNTA(C30:F30)=4,(D30-C30)+(F30-E30)-M30-Calendrier!$AS$9,0))))","v":0},0,"RTT",0,null,0]
[13,{"$f":"INDIRECT(ADDRESS(MATCH($B$1,Calendrier!$A$15:$A$59,0)+14,ROW()-17,3,1,\"Calendrier\"),1)","v":"T"},null,null,null,null,0,{"$f":"IF(AND(K31=0.5,COUNTA(C31:F31)=4),\"erreur\",IF(AND(D31-C31>0,F31-E31=0),G31-Calendrier!$AS$9/2-M31,IF(AND(F31-E31>0,D31-C31=0),(F31-E31)-Calendrier!$AS$9/2-M31,IF(COUNTA(C31:F31)=4,(D31-C31)+(F31-E31)-M31-Calendrier!$AS$9,0))))","v":0},0,"",0,null,0]
[14,{"$f":"INDIRECT(ADDRESS(MATCH($B$1,Calendrier!$A$15:$A$59,0)+14,ROW()-17,3,1,\"Calendrier\"),1)","v":"T"},null,null,null,null,0,{"$f":"IF(AND(K32=0.5,COUNTA(C32:F32)=4),\"erreur\",IF(AND(D32-C32>0,F32-E32=0),G32-Calendrier!$AS$9/2-M32,IF(AND(F32-E32>0,D32-C32=0),(F32-E32)-Calendrier!$AS$9/2-M32,IF(COUNTA(C32:F32)=4,(D32-C32)+(F32-E32)-M32-Calendrier!$AS$9,0))))","v":0},0,"",0,null,0]
[15,{"$f":"INDIRECT(ADDRESS(MATCH($B$1,Calendrier!$A$15:$A$59,0)+14,ROW()-17,3,1,\"Calendrier\"),1)","v":"T"},null,null,null,null,0,{"$f":"IF(AND(K33=0.5,COUNTA(C33:F33)=4),\"erreur\",IF(AND(D33-C33>0,F33-E33=0),G33-Calendrier!$AS$9/2-M33,IF(AND(F33-E33>0,D33-C33=0),(F33-E33)-Calendrier!$AS$9/2-M33,IF(COUNTA(C33:F33)=4,(D33-C33)+(F33-E33)-M33-Calendrier!$AS$9,0))))","v":0},0,{"$f":"IF(AND(COUNTA(C33:F33)=0,B33<>\"T\"),B33,IF(AND(OR(B33=$F$9,B33=$F$10),COUNTA(C33:F33=2)),\"T\",IF(G33>=6,\"T\",\"\")))","v":""},0,null,0]
[16,{"$f":"INDIRECT(ADDRESS(MATCH($B$1,Calendrier!$A$15:$A$59,0)+14,ROW()-17,3,1,\"Calendrier\"),1)","v":"T"},null,null,null,null,0,{"$f":"IF(AND(K34=0.5,COUNTA(C34:F34)=4),\"erreur\",IF(AND(D34-C34>0,F34-E34=0),G34-Calendrier!$AS$9/2-M34,IF(AND(F34-E34>0,D34-C34=0),(F34-E34)-Calendrier!$AS$9/2-M34,IF(COUNTA(C34:F34)=4,(D34-C34)+(F34-E34)-M34-Calendrier!$AS$9,0))))","v":0},0,"",0,null,0]
[17,{"$f":"INDIRECT(ADDRESS(MATCH($B$1,Calendrier!$A$15:$A$59,0)+14,ROW()-17,3,1,\"Calendrier\"),1)","v":"Sa"},null,null,null,null,0,{"$f":"IF(AND(K35=0.5,COUNTA(C35:F35)=4),\"erreur\",IF(AND(D35-C35>0,F35-E35=0),G35-Calendrier!$AS$9/2-M35,IF(AND(F35-E35>0,D35-C35=0),(F35-E35)-Calendrier!$AS$9/2-M35,IF(COUNTA(C35:F35)=4,(D35-C35)+(F35-E35)-M35-Calendrier!$AS$9,0))))","v":0},0,"Sa",0,null,0]
[18,{"$f":"INDIRECT(ADDRESS(MATCH($B$1,Calendrier!$A$15:$A$59,0)+14,ROW()-17,3,1,\"Calendrier\"),1)","v":"Di"},null,null,null,null,0,{"$f":"IF(AND(K36=0.5,COUNTA(C36:F36)=4),\"erreur\",IF(AND(D36-C36>0,F36-E36=0),G36-Calendrier!$AS$9/2-M36,IF(AND(F36-E36>0,D36-C36=0),(F36-E36)-Calendrier!$AS$9/2-M36,IF(COUNTA(C36:F36)=4,(D36-C36)+(F36-E36)-M36-Calendrier!$AS$9,0))))","v":0},0,"Di",0,null,0]
[19,{"$f":"INDIRECT(ADDRESS(MATCH($B$1,Calendrier!$A$15:$A$59,0)+14,ROW()-17,3,1,\"Calendrier\"),1)","v":"T"},null,null,null,null,0,{"$f":"IF(AND(K37=0.5,COUNTA(C37:F37)=4),\"erreur\",IF(AND(D37-C37>0,F37-E37=0),G37-Calendrier!$AS$9/2-M37,IF(AND(F37-E37>0,D37-C37=0),(F37-E37)-Calendrier!$AS$9/2-M37,IF(COUNTA(C37:F37)=4,(D37-C37)+(F37-E37)-M37-Calendrier!$AS$9,0))))","v":0},0,"",0,null,0]
[20,{"$f":"INDIRECT(ADDRESS(MATCH($B$1,Calendrier!$A$15:$A$59,0)+14,ROW()-17,3,1,\"Calendrier\"),1)","v":"T"},null,null,null,null,0,{"$f":"IF(AND(K38=0.5,COUNTA(C38:F38)=4),\"erreur\",IF(AND(D38-C38>0,F38-E38=0),G38-Calendrier!$AS$9/2-M38,IF(AND(F38-E38>0,D38-C38=0),(F38-E38)-Calendrier!$AS$9/2-M38,IF(COUNTA(C38:F38)=4,(D38-C38)+(F38-E38)-M38-Calendrier!$AS$9,0))))","v":0},0,"",0,null,0]
[21,{"$f":"INDIRECT(ADDRESS(MATCH($B$1,Calendrier!$A$15:$A$59,0)+14,ROW()-17,3,1,\"Calendrier\"),1)","v":"T"},null,null,null,null,0,{"$f":"IF(AND(K39=0.5,COUNTA(C39:F39)=4),\"erreur\",IF(AND(D39-C39>0,F39-E39=0),G39-Calendrier!$AS$9/2-M39,IF(AND(F39-E39>0,D39-C39=0),(F39-E39)-Calendrier!$AS$9/2-M39,IF(COUNTA(C39:F39)=4,(D39-C39)+(F39-E39)-M39-Calendrier!$AS$9,0))))","v":0},0,"",0,null,0]
[22,{"$f":"INDIRECT(ADDRESS(MATCH($B$1,Calendrier!$A$15:$A$59,0)+14,ROW()-17,3,1,\"Calendrier\"),1)","v":"T"},null,null,null,null,0,{"$f":"IF(AND(K40=0.5,COUNTA(C40:F40)=4),\"erreur\",IF(AND(D40-C40>0,F40-E40=0),G40-Calendrier!$AS$9/2-M40,IF(AND(F40-E40>0,D40-C40=0),(F40-E40)-Calendrier!$AS$9/2-M40,IF(COUNTA(C40:F40)=4,(D40-C40)+(F40-E40)-M40-Calendrier!$AS$9,0))))","v":0},0,"",0,null,0]
[23,{"$f":"INDIRECT(ADDRESS(MATCH($B$1,Calendrier!$A$15:$A$59,0)+14,ROW()-17,3,1,\"Calendrier\"),1)","v":"T"},null,null,null,null,0,{"$f":"IF(AND(K41=0.5,COUNTA(C41:F41)=4),\"erreur\",IF(AND(D41-C41>0,F41-E41=0),G41-Calendrier!$AS$9/2-M41,IF(AND(F41-E41>0,D41-C41=0),(F41-E41)-Calendrier!$AS$9/2-M41,IF(COUNTA(C41:F41)=4,(D41-C41)+(F41-E41)-M41-Calendrier!$AS$9,0))))","v":0},0,"",0,null,0]
[24,{"$f":"INDIRECT(ADDRESS(MATCH($B$1,Calendrier!$A$15:$A$59,0)+14,ROW()-17,3,1,\"Calendrier\"),1)","v":"Sa"},null,null,null,null,0,{"$f":"IF(AND(K42=0.5,COUNTA(C42:F42)=4),\"erreur\",IF(AND(D42-C42>0,F42-E42=0),G42-Calendrier!$AS$9/2-M42,IF(AND(F42-E42>0,D42-C42=0),(F42-E42)-Calendrier!$AS$9/2-M42,IF(COUNTA(C42:F42)=4,(D42-C42)+(F42-E42)-M42-Calendrier!$AS$9,0))))","v":0},0,"Sa",0,null,0]
[25,{"$f":"INDIRECT(ADDRESS(MATCH($B$1,Calendrier!$A$15:$A$59,0)+14,ROW()-17,3,1,\"Calendrier\"),1)","v":"F"},null,null,null,null,0,{"$f":"IF(AND(K43=0.5,COUNTA(C43:F43)=4),\"erreur\",IF(AND(D43-C43>0,F43-E43=0),G43-Calendrier!$AS$9/2-M43,IF(AND(F43-E43>0,D43-C43=0),(F43-E43)-Calendrier!$AS$9/2-M43,IF(COUNTA(C43:F43)=4,(D43-C43)+(F43-E43)-M43-Calendrier!$AS$9,0))))","v":0},0,"F",0,null,0]
[26,{"$f":"INDIRECT(ADDRESS(MATCH($B$1,Calendrier!$A$15:$A$59,0)+14,ROW()-17,3,1,\"Calendrier\"),1)","v":"CA"},null,null,null,null,0,{"$f":"IF(AND(K44=0.5,COUNTA(C44:F44)=4),\"erreur\",IF(AND(D44-C44>0,F44-E44=0),G44-Calendrier!$AS$9/2-M44,IF(AND(F44-E44>0,D44-C44=0),(F44-E44)-Calendrier!$AS$9/2-M44,IF(COUNTA(C44:F44)=4,(D44-C44)+(F44-E44)-M44-Calendrier!$AS$9,0))))","v":0},0,"CA",0,null,0]
[27,{"$f":"INDIRECT(ADDRESS(MATCH($B$1,Calendrier!$A$15:$A$59,0)+14,ROW()-17,3,1,\"Calendrier\"),1)","v":"CA"},null,null,null,null,0,{"$f":"IF(AND(K45=0.5,COUNTA(C45:F45)=4),\"erreur\",IF(AND(D45-C45>0,F45-E45=0),G45-Calendrier!$AS$9/2-M45,IF(AND(F45-E45>0,D45-C45=0),(F45-E45)-Calendrier!$AS$9/2-M45,IF(COUNTA(C45:F45)=4,(D45-C45)+(F45-E45)-M45-Calendrier!$AS$9,0))))","v":0},0,"CA",0,null,0]
[28,{"$f":"INDIRECT(ADDRESS(MATCH($B$1,Calendrier!$A$15:$A$59,0)+14,ROW()-17,3,1,\"Calendrier\"),1)","v":"CA"},null,null,null,null,0,{"$f":"IF(AND(K46=0.5,COUNTA(C46:F46)=4),\"erreur\",IF(AND(D46-C46>0,F46-E46=0),G46-Calendrier!$AS$9/2-M46,IF(AND(F46-E46>0,D46-C46=0),(F46-E46)-Calendrier!$AS$9/2-M46,IF(COUNTA(C46:F46)=4,(D46-C46)+(F46-E46)-M46-Calendrier!$AS$9,0))))","v":0},0,"CA",0,null,0]
[29,{"$f":"INDIRECT(ADDRESS(MATCH($B$1,Calendrier!$A$15:$A$59,0)+14,ROW()-17,3,1,\"Calendrier\"),1)","v":"CA"},null,null,null,null,0,{"$f":"IF(AND(K47=0.5,COUNTA(C47:F47)=4),\"erreur\",IF(AND(D47-C47>0,F47-E47=0),G47-Calendrier!$AS$9/2-M47,IF(AND(F47-E47>0,D47-C47=0),(F47-E47)-Calendrier!$AS$9/2-M47,IF(COUNTA(C47:F47)=4,(D47-C47)+(F47-E47)-M47-Calendrier!$AS$9,0))))","v":0},0,"CA",0,null,0]
[30,{"$f":"INDIRECT(ADDRESS(MATCH($B$1,Calendrier!$A$15:$A$59,0)+14,ROW()-17,3,1,\"Calendrier\"),1)","v":"CA"},null,null,null,null,0,{"$f":"IF(AND(K48=0.5,COUNTA(C48:F48)=4),\"erreur\",IF(AND(D48-C48>0,F48-E48=0),G48-Calendrier!$AS$9/2-M48,IF(AND(F48-E48>0,D48-C48=0),(F48-E48)-Calendrier!$AS$9/2-M48,IF(COUNTA(C48:F48)=4,(D48-C48)+(F48-E48)-M48-Calendrier!$AS$9,0))))","v":0},0,"CA",0,null,0]
[31,{"$f":"INDIRECT(ADDRESS(MATCH($B$1,Calendrier!$A$15:$A$59,0)+14,ROW()-17,3,1,\"Calendrier\"),1)","v":"Sa"},null,null,null,null,0,{"$f":"IF(AND(K49=0.5,COUNTA(C49:F49)=4),\"erreur\",IF(AND(D49-C49>0,F49-E49=0),G49-Calendrier!$AS$9/2-M49,IF(AND(F49-E49>0,D49-C49=0),(F49-E49)-Calendrier!$AS$9/2-M49,IF(COUNTA(C49:F49)=4,(D49-C49)+(F49-E49)-M49-Calendrier!$AS$9,0))))","v":0},0,"Sa",0,null,0]
[null,null,null,null,null,null,null,"solde des variations",{"$f":"I49","v":0}]

{"sheet":"Fériés","index":14,"n_rows":22,"n_cols":2,"rows_kept":22,"cut":false,"hidden":false,"merged":[]}
[{"$f":"Calendrier!A1","v":2016}]
[]
[]
[]
[]
[]
[]
[]
[{"$f":"VALUE(\"01/01/\"&$A$1)","v":"2016-01-01"}]
[{"$f":"DATE($A$1,IF((25-MOD((11*MOD($A$1-1900,19)+4-INT((7*MOD($A$1-1900,19)+1)/19)),29)-MOD($A$1-1900+INT(($A$1-1900)/4)+31-MOD((11*MOD($A$1-1900,19)+4-INT((7*MOD($A$1-1900,19)+1)/19)),29),7))>0,4,3),IF((25-MOD((11*MOD($A$1-1900,19)+4-INT((7*MOD($A$1-1900,19)+1)/19)),29)-MOD($A$1-1900+INT(($A$1-1900)/4)+31-MOD((11*MOD($A$1-1900,19)+4-INT((7*MOD($A$1-1900,19)+1)/19)),29),7))>0,(25-MOD((11*MOD($A$1-1900,19)+4-INT((7*MOD($A$1-1900,19)+1)/19)),29)-MOD($A$1-1900+INT(($A$1-1900)/4)+31-MOD((11*MOD($A$1-1900,19)+4-INT((7*MOD($A$1-1900,19)+1)/19)),29),7)),31+(25-MOD((11*MOD($A$1-1900,19)+4-INT((7*MOD($A$1-1900,19)+1)/19)),29)-MOD($A$1-1900+INT(($A$1-1900)/4)+31-MOD((11*MOD($A$1-1900,19)+4-INT((7*MOD($A$1-1900,19)+1)/19)),29),7))))","v":"2016-03-27"},"Pâques"]
[{"$f":"A10+1","v":"2016-03-28"},"lundi Pâques"]
[{"$f":"VALUE(\"01/05/\"&$A$1)","v":"2016-05-01"}]
[{"$f":"VALUE(\"08/05/\"&$A$1)","v":"2016-05-08"}]
[{"$f":"A10+39","v":"2016-05-05"},"jeudi assencion"]
[{"$f":"A10+49","v":"2016-05-15"},"Pentecôte"]
[null,"lundi de Pentecôte"]
[{"$f":"VALUE(\"14/07/\"&$A$1)","v":"2016-07-14"}]
[{"$f":"VALUE(\"15/08/\"&$A$1)","v":"2016-08-15"}]
[{"$f":"VALUE(\"01/11/\"&$A$1)","v":"2016-11-01"}]
[{"$f":"VALUE(\"11/11/\"&$A$1)","v":"2016-11-11"}]
[{"$f":"VALUE(\"25/12/\"&$A$1)","v":"2016-12-25"}]
[{"$f":"A21+7","v":"2017-01-01"}]