{"text_format":"1","workbook":"xlsx","n_sheets":2,"sheets":["Sheet1","Entreprises"],"not_rendered":{"charts":0,"images":1,"macros":1,"external_links":2,"defined_names":1,"comments":0,"pivot_tables":0},"unopened":[],"bounds":{"document_bytes":16777216,"sheet_cells":100000,"rows_first":2000,"rows_last":500,"rows_between":2000,"halvings":0,"cell_chars":16384,"cell_head_chars":4096},"cells_cut":0,"cells_raw":0,"read":"whole","date_system":"1900"}

{"sheet":"Sheet1","index":0,"n_rows":11,"n_cols":11,"rows_kept":11,"cut":false,"hidden":false,"merged":[[2,1,5,1],[2,2,5,5],[2,6,5,9],[2,10,5,11],[6,1,6,5],[6,6,10,9],[6,10,10,11],[7,1,8,5],[9,1,9,5],[10,1,10,5]]}
[]
[]
[null,null,"Entreprises intervenantes (sous-traitants compris)",null,null,null,"Responsable des travaux sur le site\n (+ responsables des sous-traitants)",null,null,null,"Effectifs (EE intervenante et sous-traitants)"]
[]
[]
[]
[null,"ACEPA"]
[null,{"$f":"\"Adresse : \"&VLOOKUP(B7,Entreprises!$A$1:$D$194,2,FALSE)","v":"Adresse : 89 impasse de l'étang\n\n74800 La roche sur Foron"}]
[]
[null,{"$f":"\"Tel : 0\"&VLOOKUP(B7,Entreprises!$A$1:$D$19,3,FALSE)","v":"Tel : 0450259091"}]
[null,{"$f":"\"Fax : \"&VLOOKUP(B7,Entreprises!$A$1:$D$194,4,FALSE)","v":"Fax : Non renseigné"}]

{"sheet":"Entreprises","index":1,"n_rows":194,"n_cols":4,"rows_kept":194,"cut":false,"hidden":false,"merged":[]}
["Entreprises","Adresse","Tel","Fax"]
["ABYLSEN","92 cours Vitton\n\n69006 Lyon",627189082,"Non renseigné"]
["ACEPA","89 impasse de l'étang\n\n74800 La roche sur Foron",450259091,"Non renseigné"]
["ACTIWORKS","Non renseigné",450983512,"Non renseigné"]
["ACTUEL TAXI 74","Non renseigné","Non renseigné","Non renseigné"]
["ADITEC","Non renseigné","Non renseigné","Non renseigné"]
["AGGREKO","Non renseigné","Non renseigné","Non renseigné"]
["AIDA","Non renseigné","Non renseigné","Non renseigné"]
["Air Liquide","Non renseigné","Non renseigné","Non renseigné"]
["ALDIANCE","Non renseigné","Non renseigné","Non renseigné"]
["ALTIUS","Non renseigné","Non renseigné","Non renseigné"]
["ALTRAN","Non renseigné","Non renseigné","Non renseigné"]
["AMEG","Non renseigné","Non renseigné","Non renseigné"]
["AMETEK","Non renseigné","Non renseigné","Non renseigné"]
["AMETEK TAYLOR HOBSON","Non renseigné","Non renseigné","Non renseigné"]
["Annecy Sécurité au Travail","Non renseigné","Non renseigné","Non renseigné"]
["APAVE","Non renseigné","Non renseigné","Non renseigné"]
["APAVE","Non renseigné","Non renseigné","Non renseigné"]
["APC  Etanch'","Non renseigné","Non renseigné","Non renseigné"]
["ARAVIS ENROBAGE","Non renseigné","Non renseigné","Non renseigné"]
["ASCOT","Non renseigné","Non renseigné","Non renseigné"]
["AUTOBAR SUD-EST","Non renseigné","Non renseigné","Non renseigné"]
["AVENIR FORMATION","Non renseigné","Non renseigné","Non renseigné"]
["AVENTICS","Non renseigné","Non renseigné","Non renseigné"]
["BEE ENGINEERING","Non renseigné","Non renseigné","Non renseigné"]
["Bellin","Non renseigné","Non renseigné","Non renseigné"]
["BELLIN","Non renseigné","Non renseigné","Non renseigné"]
["BLACHE","Non renseigné","Non renseigné","Non renseigné"]
["BOSCH REXROTH","Non renseigné","Non renseigné","Non renseigné"]
["Bouchet Charpente","Non renseigné","Non renseigné","Non renseigné"]
["BOUCHET Charpente","Non renseigné","Non renseigné","Non renseigné"]
["BOUTIN","Non renseigné","Non renseigné","Non renseigné"]
["BOUYGUES Energies & Services","Non renseigné","Non renseigné","Non renseigné"]
["Bret","Non renseigné","Non renseigné","Non renseigné"]
["BROUX","Non renseigné","Non renseigné","Non renseigné"]
["CECCON","Non renseigné","Non renseigné","Non renseigné"]
["Charmilles","Non renseigné","Non renseigné","Non renseigné"]
["CHAUVIN ARNOUX","Non renseigné","Non renseigné","Non renseigné"]
["CLAII","Non renseigné","Non renseigné","Non renseigné"]
["Cofely","Non renseigné","Non renseigné","Non renseigné"]
["COFELY","Non renseigné","Non renseigné","Non renseigné"]
["COFELY INEO","Non renseigné","Non renseigné","Non renseigné"]
["CORETEC","Non renseigné","Non renseigné","Non renseigné"]
["COUGNAUD Yves","Non renseigné","Non renseigné","Non renseigné"]
["CPI","Non renseigné","Non renseigné","Non renseigné"]
["CPS","Non renseigné","Non renseigné","Non renseigné"]
["CSP","Non renseigné","Non renseigné","Non renseigné"]
["CTS","Non renseigné","Non renseigné","Non renseigné"]
["DCS","Non renseigné","Non renseigné","Non renseigné"]
["DECIP","Non renseigné","Non renseigné","Non renseigné"]
["Déménagement BLACHE","Non renseigné","Non renseigné","Non renseigné"]
["DESAUTEL","Non renseigné","Non renseigné","Non renseigné"]
["DEVOS","Non renseigné","Non renseigné","Non renseigné"]
["DUFOURNET","Non renseigné","Non renseigné","Non renseigné"]
["DUNAND CHEVALLAY","Non renseigné","Non renseigné","Non renseigné"]
["DYNAE","Non renseigné","Non renseigné","Non renseigné"]
["Eaton","Non renseigné","Non renseigné","Non renseigné"]
["EFD","Non renseigné","Non renseigné","Non renseigné"]
["EFD induction","Non renseigné","Non renseigné","Non renseigné"]
["ELECTRO SAVOIE","Non renseigné","Non renseigné","Non renseigné"]
["ELIOR","Non renseigné","Non renseigné","Non renseigné"]
["EPC","Non renseigné","Non renseigné","Non renseigné"]
["ERGOFRANCE","Non renseigné","Non renseigné","Non renseigné"]
["ERRIC","Non renseigné","Non renseigné","Non renseigné"]
["ETA DU GEVEVOIS","Non renseigné","Non renseigné","Non renseigné"]
["ETREM","Non renseigné","Non renseigné","Non renseigné"]
["ETS-SRA","Non renseigné","Non renseigné","Non renseigné"]
["ETTAX","Non renseigné","Non renseigné","Non renseigné"]
["Eurovia","Non renseigné","Non renseigné","Non renseigné"]
["EXCOFFIER","Non renseigné","Non renseigné","Non renseigné"]
["FAE","Non renseigné","Non renseigné","Non renseigné"]
["FEI","Non renseigné","Non renseigné","Non renseigné"]
["FLIR","Non renseigné","Non renseigné","Non renseigné"]
["FRANCE FERMETURE","Non renseigné","Non renseigné","Non renseigné"]
["FRANCE STORE","Non renseigné","Non renseigné","Non renseigné"]
["GARNIER","Non renseigné","Non renseigné","Non renseigné"]
["Gavillet","Non renseigné","Non renseigné","Non renseigné"]
["GAVILLET","Non renseigné","Non renseigné","Non renseigné"]
["GENEVE MECANET ","Non renseigné","Non renseigné","Non renseigné"]
["GERIN SAPRA","Non renseigné","Non renseigné","Non renseigné"]
["GLI SERVICES","Non renseigné","Non renseigné","Non renseigné"]
["GMF ACCUEIL","Non renseigné","Non renseigné","Non renseigné"]
["Gontier","Non renseigné","Non renseigné","Non renseigné"]
["GONZALES","Non renseigné","Non renseigné","Non renseigné"]
["GRASSO","Non renseigné","Non renseigné","Non renseigné"]
["GSF","Non renseigné","Non renseigné","Non renseigné"]
["GSF","Non renseigné","Non renseigné","Non renseigné"]
["HEUMEZ","Non renseigné","Non renseigné","Non renseigné"]
["HEXAGON","Non renseigné","Non renseigné","Non renseigné"]
["Hitachi","Non renseigné","Non renseigné","Non renseigné"]
["HOBART","Non renseigné","Non renseigné","Non renseigné"]
["HOSEL","Non renseigné","Non renseigné","Non renseigné"]
["INEO","Non renseigné","Non renseigné","Non renseigné"]
["ISO TS","Non renseigné","Non renseigné","Non renseigné"]
["KONE","Non renseigné","Non renseigné","Non renseigné"]
["KONECRANES","Non renseigné","Non renseigné","Non renseigné"]
["KÖTTERMAN","Non renseigné","Non renseigné","Non renseigné"]
["Kottermann","Non renseigné","Non renseigné","Non renseigné"]
["LANSARD","Non renseigné","Non renseigné","Non renseigné"]
["LAVERRIERE","Non renseigné","Non renseigné","Non renseigné"]
["LGB BRICAUD","Non renseigné","Non renseigné","Non renseigné"]
["MABEO","Non renseigné","Non renseigné","Non renseigné"]
["MACN","Non renseigné","Non renseigné","Non renseigné"]
["MAGELEC","Non renseigné","Non renseigné","Non renseigné"]
["MAHR","Non renseigné","Non renseigné","Non renseigné"]
["MASER","Non renseigné","Non renseigné","Non renseigné"]
["MAURO","Non renseigné","Non renseigné","Non renseigné"]
["Mavipal","Non renseigné","Non renseigné","Non renseigné"]
["MAZAK","Non renseigné","Non renseigné","Non renseigné"]
["MBE","Non renseigné","Non renseigné","Non renseigné"]
["MECAD Savoie","Non renseigné","Non renseigné","Non renseigné"]
["MECANET","Non renseigné","Non renseigné","Non renseigné"]
["MECANET","Non renseigné","Non renseigné","Non renseigné"]
["METALSCAN","Non renseigné","Non renseigné","Non renseigné"]
["METRISE","Non renseigné","Non renseigné","Non renseigné"]
["MITSUBISHI","Non renseigné","Non renseigné","Non renseigné"]
["MODLER","Non renseigné","Non renseigné","Non renseigné"]
["MSTM","Non renseigné","Non renseigné","Non renseigné"]
["MTS","Non renseigné","Non renseigné","Non renseigné"]
["NODIER","Non renseigné","Non renseigné","Non renseigné"]
["NORCAN","Non renseigné","Non renseigné","Non renseigné"]
["NOVATEC","Non renseigné","Non renseigné","Non renseigné"]
["OPTEOR","Non renseigné","Non renseigné","Non renseigné"]
["Ortec","Non renseigné","Non renseigné","Non renseigné"]
["ORTEC","Non renseigné","Non renseigné","Non renseigné"]
["Ortec","Non renseigné","Non renseigné","Non renseigné"]
["PALLADIO","Non renseigné","Non renseigné","Non renseigné"]
["Paredes","Non renseigné","Non renseigné","Non renseigné"]
["PAREDES","Non renseigné","Non renseigné","Non renseigné"]
["PELICAN ROUGE COFFEE SOLUTIONS","Non renseigné","Non renseigné","Non renseigné"]
["PERIN","Non renseigné","Non renseigné","Non renseigné"]
["Perrin Electric","Non renseigné","Non renseigné","Non renseigné"]
["PIGNARD  / PERMO","Non renseigné","Non renseigné","Non renseigné"]
["PONCET","Non renseigné","Non renseigné","Non renseigné"]
["PROGEO","Non renseigné","Non renseigné","Non renseigné"]
["PrufTechnik","Non renseigné","Non renseigné","Non renseigné"]
["RATMO","Non renseigné","Non renseigné","Non renseigné"]
["RB-EM","Non renseigné","Non renseigné","Non renseigné"]
["RESIMAT","Non renseigné","Non renseigné","Non renseigné"]
["RHA +","Rive de Saone 41 quazi Fulchiron 69005 LYON",669372727,478384508]
["RHA+","Non renseigné","Non renseigné","Non renseigné"]
["RICOH","Non renseigné","Non renseigné","Non renseigné"]
["RODRIGUES","Non renseigné","Non renseigné","Non renseigné"]
["RTE","Non renseigné","Non renseigné","Non renseigné"]
["RUBO","Non renseigné","Non renseigné","Non renseigné"]
["SAMO ","Non renseigné","Non renseigné","Non renseigné"]
["SAPRATIN","Non renseigné","Non renseigné","Non renseigné"]
["SARP","Non renseigné","Non renseigné","Non renseigné"]
["SARP - Technicuve","Non renseigné","Non renseigné","Non renseigné"]
["Satujo","Non renseigné","Non renseigné","Non renseigné"]
["SAVOIE LABO","Non renseigné","Non renseigné","Non renseigné"]
["Savoie Transmission","Non renseigné","Non renseigné","Non renseigné"]
["SCC","Non renseigné","Non renseigné","Non renseigné"]
["SCHNEIDER Electric ","Non renseigné","Non renseigné","Non renseigné"]
["SDEL","Non renseigné","Non renseigné","Non renseigné"]
["SDEL Inform","Non renseigné","Non renseigné","Non renseigné"]
["SDEL OMEXON","Non renseigné","Non renseigné","Non renseigné"]
["SEFOREST","Non renseigné","Non renseigné","Non renseigné"]
["SEGULA","Non renseigné","Non renseigné","Non renseigné"]
["SERIMA","Non renseigné","Non renseigné","Non renseigné"]
["SERIMECA","Non renseigné","Non renseigné","Non renseigné"]
["SERMA BOUYGUES","Non renseigné","Non renseigné","Non renseigné"]
["SIEMENS","Non renseigné","Non renseigné","Non renseigné"]
["SIEMENS SITRAIN","Non renseigné","Non renseigné","Non renseigné"]
["SITIA","Non renseigné","Non renseigné","Non renseigné"]
["SOCOFUMI","Non renseigné","Non renseigné","Non renseigné"]
["SOCOTEC","Non renseigné","Non renseigné","Non renseigné"]
["SOFTICA","Non renseigné","Non renseigné","Non renseigné"]
["SOLEO","Non renseigné","Non renseigné","Non renseigné"]
["SOMECO","Non renseigné","Non renseigné","Non renseigné"]
["SOTEB","Non renseigné","Non renseigné","Non renseigné"]
["SPIE COPRETEC","Non renseigné","Non renseigné","Non renseigné"]
["SSI SERVICE","Non renseigné","Non renseigné","Non renseigné"]
["STCOM","Non renseigné","Non renseigné","Non renseigné"]
["SULLY","Non renseigné","Non renseigné","Non renseigné"]
["SYSOCO","Non renseigné","Non renseigné","Non renseigné"]
["TA instruments","Non renseigné","Non renseigné","Non renseigné"]
["TECHNIMONTAGE","Non renseigné","Non renseigné","Non renseigné"]
["TECHNIVIB","Non renseigné","Non renseigné","Non renseigné"]
["TELIMA","Non renseigné","Non renseigné","Non renseigné"]
["TELINDUS","Non renseigné","Non renseigné","Non renseigné"]
["TFL","Non renseigné","Non renseigné","Non renseigné"]
["TITM","Non renseigné","Non renseigné","Non renseigné"]
["TND ","Non renseigné","Non renseigné","Non renseigné"]
["TRIGO","Non renseigné","Non renseigné","Non renseigné"]
["TYCO","Non renseigné","Non renseigné","Non renseigné"]
["VERITAS","Non renseigné","Non renseigné","Non renseigné"]
["VERITAS","Non renseigné","Non renseigné","Non renseigné"]
["VIGNIER","Non renseigné","Non renseigné","Non renseigné"]
["VIOLLET","Non renseigné","Non renseigné","Non renseigné"]
["Viollet","Non renseigné","Non renseigné","Non renseigné"]
["VIOLLET INDUSTRIES","Non renseigné","Non renseigné","Non renseigné"]
["VITRERIE SAVOYARDE","Non renseigné","Non renseigné","Non renseigné"]
["ZEISS","Non renseigné","Non renseigné","Non renseigné"]