{"text_format":"1","workbook":"xlsx","n_sheets":3,"sheets":["Donnée","Instruction","Masque Recettes"],"not_rendered":{"charts":0,"images":1,"macros":1,"external_links":0,"defined_names":2,"comments":0,"pivot_tables":0},"unopened":[],"bounds":{"document_bytes":16777216,"sheet_cells":100000,"rows_first":2000,"rows_last":500,"rows_between":2000,"halvings":0,"cell_chars":16384,"cell_head_chars":4096},"cells_cut":0,"cells_raw":0,"read":"whole","date_system":"1900"}

{"sheet":"Donnée","index":0,"n_rows":11,"n_cols":8,"rows_kept":11,"cut":false,"hidden":false,"merged":[]}
[]
[]
[]
[]
[]
[]
["N°","REFERENCE","Farine","Eau (cl)","Tps de pétrissage (min)","Cuisson °C","Tps de cuisson (min)","petrin"]
[1,"Pain",100,45,10,120,20,"A"]
[2,"Brioche",200,50,5,150,40,"A puis B"]
[3,"Pain au chocolat",150,80,12,180,50,"B"]
[4,"Eclair au chocolat",300,150,8,150,60,"B puis A"]

{"sheet":"Instruction","index":1,"n_rows":8,"n_cols":5,"rows_kept":8,"cut":false,"hidden":false,"merged":[]}
[]
[null,"Référence",4,null,{"$f":"VLOOKUP($C$2,Donnée!$A$8:$H$11,2,FALSE)","v":"Eclair au chocolat"}]
[1,"Farine",{"$f":"VLOOKUP($C$2,Donnée!$A$8:$H$11,A3+2,FALSE)","v":300}]
[2,"Eau",{"$f":"VLOOKUP($C$2,Donnée!$A$8:$H$11,A4+2,FALSE)","v":150}]
[3,"Tps de pétrissage",{"$f":"VLOOKUP($C$2,Donnée!$A$8:$H$11,A5+2,FALSE)","v":8}]
[4,"Cuisson",{"$f":"VLOOKUP($C$2,Donnée!$A$8:$H$11,A6+2,FALSE)","v":150}]
[5,"Tps de cuisson",{"$f":"VLOOKUP($C$2,Donnée!$A$8:$H$11,A7+2,FALSE)","v":60}]
[6,"Petrin",{"$f":"VLOOKUP($C$2,Donnée!$A$8:$H$11,A8+2,FALSE)","v":"B puis A"}]

{"sheet":"Masque Recettes","index":2,"n_rows":10,"n_cols":4,"rows_kept":10,"cut":false,"hidden":false,"merged":[]}
[]
[]
[]
[null,null,"Référence","Pain"]
[null,1,"Farine",100]
[null,2,"Eau (cl)",45]
[null,3,"Tps de pétrissage (min)",10]
[null,4,"Cuisson °C",120]
[null,5,"Tps de cuisson (min)",20]
[null,6,"petrin","A"]