{"text_format":"1","workbook":"xlsx","n_sheets":4,"sheets":["Général","C1","C2","C3"],"not_rendered":{"charts":0,"images":0,"macros":0,"external_links":0,"defined_names":0,"comments":0,"pivot_tables":0},"unopened":[],"bounds":{"document_bytes":16777216,"sheet_cells":100000,"rows_first":2000,"rows_last":500,"rows_between":2000,"halvings":0,"cell_chars":16384,"cell_head_chars":4096},"cells_cut":0,"cells_raw":0,"read":"whole","date_system":"1900"}

{"sheet":"Général","index":0,"n_rows":27,"n_cols":8,"rows_kept":27,"cut":false,"hidden":false,"merged":[]}
["Info 1","Info 2","Info 3","Info 4","Info 5","Info 6","cotation","codage"]
["Roger","Chêne","Paris","Rouge","Dupont","Pomme","C1",{"$f":"IF(A2=\"\",\"\",G2&\"_\"&COUNTIF($G$2:G2,G2))","v":"C1_1"}]
["Paul","Orme","Lyon","Azur","Durand","Poire","C2",{"$f":"IF(A3=\"\",\"\",G3&\"_\"&COUNTIF($G$2:G3,G3))","v":"C2_1"}]
["Marcel","Bouleau","Marseille","Bleu","Martin","Abricot","C3",{"$f":"IF(A4=\"\",\"\",G4&\"_\"&COUNTIF($G$2:G4,G4))","v":"C3_1"}]
["André","Frêne","Bordeaux","Jaune","Rodrigues","Prune","C2",{"$f":"IF(A5=\"\",\"\",G5&\"_\"&COUNTIF($G$2:G5,G5))","v":"C2_2"}]
["Kevin","Platane","Rennes","Gris","Blanco","Cerise","C1",{"$f":"IF(A6=\"\",\"\",G6&\"_\"&COUNTIF($G$2:G6,G6))","v":"C1_2"}]
["Simone","Sorbier","Nantes","Noir","Boitet","Melon","C1",{"$f":"IF(A7=\"\",\"\",G7&\"_\"&COUNTIF($G$2:G7,G7))","v":"C1_3"}]
["Léa","Pin","Calais","Marron","Born","Pêche","C2",{"$f":"IF(A8=\"\",\"\",G8&\"_\"&COUNTIF($G$2:G8,G8))","v":"C2_3"}]
{"$rows_left_out":20}
{"sheet":"C1","index":1,"n_rows":30,"n_cols":7,"rows_kept":30,"cut":false,"hidden":false,"merged":[]}
["Cotation ","C1"]
[{"$f":"IF(ROW()-1>COUNTIF(Général!$G:$G,$B$1),\"\",INDEX(Général!$A:$G,MATCH($B$1&\"_\"&ROW()-1,Général!$H:$H,0),1))","v":"Roger"},{"$f":"IF(ROW()-1>COUNTIF(Général!$G:$G,$B$1),\"\",INDEX(Général!$A:$G,MATCH($B$1&\"_\"&ROW()-1,Général!$H:$H,0),2))","v":"Chêne"},{"$f":"IF(ROW()-1>COUNTIF(Général!$G:$G,$B$1),\"\",INDEX(Général!$A:$G,MATCH($B$1&\"_\"&ROW()-1,Général!$H:$H,0),3))","v":"Paris"},{"$f":"IF(ROW()-1>COUNTIF(Général!$G:$G,$B$1),\"\",INDEX(Général!$A:$G,MATCH($B$1&\"_\"&ROW()-1,Général!$H:$H,0),4))","v":"Rouge"},{"$f":"IF(ROW()-1>COUNTIF(Général!$G:$G,$B$1),\"\",INDEX(Général!$A:$G,MATCH($B$1&\"_\"&ROW()-1,Général!$H:$H,0),5))","v":"Dupont"},{"$f":"IF(ROW()-1>COUNTIF(Général!$G:$G,$B$1),\"\",INDEX(Général!$A:$G,MATCH($B$1&\"_\"&ROW()-1,Général!$H:$H,0),6))","v":"Pomme"},{"$f":"IF(ROW()-1>COUNTIF(Général!$G:$G,$B$1),\"\",INDEX(Général!$A:$G,MATCH($B$1&\"_\"&ROW()-1,Général!$H:$H,0),7))","v":"C1"}]
[{"$f":"IF(ROW()-1>COUNTIF(Général!$G:$G,$B$1),\"\",INDEX(Général!$A:$G,MATCH($B$1&\"_\"&ROW()-1,Général!$H:$H,0),1))","v":"Kevin"},{"$f":"IF(ROW()-1>COUNTIF(Général!$G:$G,$B$1),\"\",INDEX(Général!$A:$G,MATCH($B$1&\"_\"&ROW()-1,Général!$H:$H,0),2))","v":"Platane"},{"$f":"IF(ROW()-1>COUNTIF(Général!$G:$G,$B$1),\"\",INDEX(Général!$A:$G,MATCH($B$1&\"_\"&ROW()-1,Général!$H:$H,0),3))","v":"Rennes"},{"$f":"IF(ROW()-1>COUNTIF(Général!$G:$G,$B$1),\"\",INDEX(Général!$A:$G,MATCH($B$1&\"_\"&ROW()-1,Général!$H:$H,0),4))","v":"Gris"},{"$f":"IF(ROW()-1>COUNTIF(Général!$G:$G,$B$1),\"\",INDEX(Général!$A:$G,MATCH($B$1&\"_\"&ROW()-1,Général!$H:$H,0),5))","v":"Blanco"},{"$f":"IF(ROW()-1>COUNTIF(Général!$G:$G,$B$1),\"\",INDEX(Général!$A:$G,MATCH($B$1&\"_\"&ROW()-1,Général!$H:$H,0),6))","v":"Cerise"},{"$f":"IF(ROW()-1>COUNTIF(Général!$G:$G,$B$1),\"\",INDEX(Général!$A:$G,MATCH($B$1&\"_\"&ROW()-1,Général!$H:$H,0),7))","v":"C1"}]
[{"$f":"IF(ROW()-1>COUNTIF(Général!$G:$G,$B$1),\"\",INDEX(Général!$A:$G,MATCH($B$1&\"_\"&ROW()-1,Général!$H:$H,0),1))","v":"Simone"},{"$f":"IF(ROW()-1>COUNTIF(Général!$G:$G,$B$1),\"\",INDEX(Général!$A:$G,MATCH($B$1&\"_\"&ROW()-1,Général!$H:$H,0),2))","v":"Sorbier"},{"$f":"IF(ROW()-1>COUNTIF(Général!$G:$G,$B$1),\"\",INDEX(Général!$A:$G,MATCH($B$1&\"_\"&ROW()-1,Général!$H:$H,0),3))","v":"Nantes"},{"$f":"IF(ROW()-1>COUNTIF(Général!$G:$G,$B$1),\"\",INDEX(Général!$A:$G,MATCH($B$1&\"_\"&ROW()-1,Général!$H:$H,0),4))","v":"Noir"},{"$f":"IF(ROW()-1>COUNTIF(Général!$G:$G,$B$1),\"\",INDEX(Général!$A:$G,MATCH($B$1&\"_\"&ROW()-1,Général!$H:$H,0),5))","v":"Boitet"},{"$f":"IF(ROW()-1>COUNTIF(Général!$G:$G,$B$1),\"\",INDEX(Général!$A:$G,MATCH($B$1&\"_\"&ROW()-1,Général!$H:$H,0),6))","v":"Melon"},{"$f":"IF(ROW()-1>COUNTIF(Général!$G:$G,$B$1),\"\",INDEX(Général!$A:$G,MATCH($B$1&\"_\"&ROW()-1,Général!$H:$H,0),7))","v":"C1"}]
[{"$f":"IF(ROW()-1>COUNTIF(Général!$G:$G,$B$1),\"\",INDEX(Général!$A:$G,MATCH($B$1&\"_\"&ROW()-1,Général!$H:$H,0),1))","v":"Monique"},{"$f":"IF(ROW()-1>COUNTIF(Général!$G:$G,$B$1),\"\",INDEX(Général!$A:$G,MATCH($B$1&\"_\"&ROW()-1,Général!$H:$H,0),2))","v":"Peuplier"},{"$f":"IF(ROW()-1>COUNTIF(Général!$G:$G,$B$1),\"\",INDEX(Général!$A:$G,MATCH($B$1&\"_\"&ROW()-1,Général!$H:$H,0),3))","v":"Toulouse"},{"$f":"IF(ROW()-1>COUNTIF(Général!$G:$G,$B$1),\"\",INDEX(Général!$A:$G,MATCH($B$1&\"_\"&ROW()-1,Général!$H:$H,0),4))","v":"Magenta"},{"$f":"IF(ROW()-1>COUNTIF(Général!$G:$G,$B$1),\"\",INDEX(Général!$A:$G,MATCH($B$1&\"_\"&ROW()-1,Général!$H:$H,0),5))","v":"Godet"},{"$f":"IF(ROW()-1>COUNTIF(Général!$G:$G,$B$1),\"\",INDEX(Général!$A:$G,MATCH($B$1&\"_\"&ROW()-1,Général!$H:$H,0),6))","v":"Brugnon"},{"$f":"IF(ROW()-1>COUNTIF(Général!$G:$G,$B$1),\"\",INDEX(Général!$A:$G,MATCH($B$1&\"_\"&ROW()-1,Général!$H:$H,0),7))","v":"C1"}]
[{"$f":"IF(ROW()-1>COUNTIF(Général!$G:$G,$B$1),\"\",INDEX(Général!$A:$G,MATCH($B$1&\"_\"&ROW()-1,Général!$H:$H,0),1))","v":"Claude"},{"$f":"IF(ROW()-1>COUNTIF(Général!$G:$G,$B$1),\"\",INDEX(Général!$A:$G,MATCH($B$1&\"_\"&ROW()-1,Général!$H:$H,0),2))","v":"Erable"},{"$f":"IF(ROW()-1>COUNTIF(Général!$G:$G,$B$1),\"\",INDEX(Général!$A:$G,MATCH($B$1&\"_\"&ROW()-1,Général!$H:$H,0),3))","v":"Perpignan"},{"$f":"IF(ROW()-1>COUNTIF(Général!$G:$G,$B$1),\"\",INDEX(Général!$A:$G,MATCH($B$1&\"_\"&ROW()-1,Général!$H:$H,0),4))","v":"Vermillon"},{"$f":"IF(ROW()-1>COUNTIF(Général!$G:$G,$B$1),\"\",INDEX(Général!$A:$G,MATCH($B$1&\"_\"&ROW()-1,Général!$H:$H,0),5))","v":"Nassin"},{"$f":"IF(ROW()-1>COUNTIF(Général!$G:$G,$B$1),\"\",INDEX(Général!$A:$G,MATCH($B$1&\"_\"&ROW()-1,Général!$H:$H,0),6))","v":"Nèfle"},{"$f":"IF(ROW()-1>COUNTIF(Général!$G:$G,$B$1),\"\",INDEX(Général!$A:$G,MATCH($B$1&\"_\"&ROW()-1,Général!$H:$H,0),7))","v":"C1"}]
[{"$f":"IF(ROW()-1>COUNTIF(Général!$G:$G,$B$1),\"\",INDEX(Général!$A:$G,MATCH($B$1&\"_\"&ROW()-1,Général!$H:$H,0),1))","v":"Chrystel"},{"$f":"IF(ROW()-1>COUNTIF(Général!$G:$G,$B$1),\"\",INDEX(Général!$A:$G,MATCH($B$1&\"_\"&ROW()-1,Général!$H:$H,0),2))","v":"Séquoïa"},{"$f":"IF(ROW()-1>COUNTIF(Général!$G:$G,$B$1),\"\",INDEX(Général!$A:$G,MATCH($B$1&\"_\"&ROW()-1,Général!$H:$H,0),3))","v":"Limoges"},{"$f":"IF(ROW()-1>COUNTIF(Général!$G:$G,$B$1),\"\",INDEX(Général!$A:$G,MATCH($B$1&\"_\"&ROW()-1,Général!$H:$H,0),4))","v":"Brun"},{"$f":"IF(ROW()-1>COUNTIF(Général!$G:$G,$B$1),\"\",INDEX(Général!$A:$G,MATCH($B$1&\"_\"&ROW()-1,Général!$H:$H,0),5))","v":"Corbin"},{"$f":"IF(ROW()-1>COUNTIF(Général!$G:$G,$B$1),\"\",INDEX(Général!$A:$G,MATCH($B$1&\"_\"&ROW()-1,Général!$H:$H,0),6))","v":"Orange"},{"$f":"IF(ROW()-1>COUNTIF(Général!$G:$G,$B$1),\"\",INDEX(Général!$A:$G,MATCH($B$1&\"_\"&ROW()-1,Général!$H:$H,0),7))","v":"C1"}]
[{"$f":"IF(ROW()-1>COUNTIF(Général!$G:$G,$B$1),\"\",INDEX(Général!$A:$G,MATCH($B$1&\"_\"&ROW()-1,Général!$H:$H,0),1))","v":"Corinne"},{"$f":"IF(ROW()-1>COUNTIF(Général!$G:$G,$B$1),\"\",INDEX(Général!$A:$G,MATCH($B$1&\"_\"&ROW()-1,Général!$H:$H,0),2))","v":"Saule"},{"$f":"IF(ROW()-1>COUNTIF(Général!$G:$G,$B$1),\"\",INDEX(Général!$A:$G,MATCH($B$1&\"_\"&ROW()-1,Général!$H:$H,0),3))","v":"Bézier"},{"$f":"IF(ROW()-1>COUNTIF(Général!$G:$G,$B$1),\"\",INDEX(Général!$A:$G,MATCH($B$1&\"_\"&ROW()-1,Général!$H:$H,0),4))","v":"Isabelle"},{"$f":"IF(ROW()-1>COUNTIF(Général!$G:$G,$B$1),\"\",INDEX(Général!$A:$G,MATCH($B$1&\"_\"&ROW()-1,Général!$H:$H,0),5))","v":"Fabri"},{"$f":"IF(ROW()-1>COUNTIF(Général!$G:$G,$B$1),\"\",INDEX(Général!$A:$G,MATCH($B$1&\"_\"&ROW()-1,Général!$H:$H,0),6))","v":"Clémentine"},{"$f":"IF(ROW()-1>COUNTIF(Général!$G:$G,$B$1),\"\",INDEX(Général!$A:$G,MATCH($B$1&\"_\"&ROW()-1,Général!$H:$H,0),7))","v":"C1"}]
{"$rows_left_out":23}
{"sheet":"C2","index":2,"n_rows":30,"n_cols":7,"rows_kept":30,"cut":false,"hidden":false,"merged":[]}
["Cotation ","C2"]
[{"$f":"IF(ROW()-1>COUNTIF(Général!$G:$G,$B$1),\"\",INDEX(Général!$A:$G,MATCH($B$1&\"_\"&ROW()-1,Général!$H:$H,0),1))","v":"Paul"},{"$f":"IF(ROW()-1>COUNTIF(Général!$G:$G,$B$1),\"\",INDEX(Général!$A:$G,MATCH($B$1&\"_\"&ROW()-1,Général!$H:$H,0),2))","v":"Orme"},{"$f":"IF(ROW()-1>COUNTIF(Général!$G:$G,$B$1),\"\",INDEX(Général!$A:$G,MATCH($B$1&\"_\"&ROW()-1,Général!$H:$H,0),3))","v":"Lyon"},{"$f":"IF(ROW()-1>COUNTIF(Général!$G:$G,$B$1),\"\",INDEX(Général!$A:$G,MATCH($B$1&\"_\"&ROW()-1,Général!$H:$H,0),4))","v":"Azur"},{"$f":"IF(ROW()-1>COUNTIF(Général!$G:$G,$B$1),\"\",INDEX(Général!$A:$G,MATCH($B$1&\"_\"&ROW()-1,Général!$H:$H,0),5))","v":"Durand"},{"$f":"IF(ROW()-1>COUNTIF(Général!$G:$G,$B$1),\"\",INDEX(Général!$A:$G,MATCH($B$1&\"_\"&ROW()-1,Général!$H:$H,0),6))","v":"Poire"},{"$f":"IF(ROW()-1>COUNTIF(Général!$G:$G,$B$1),\"\",INDEX(Général!$A:$G,MATCH($B$1&\"_\"&ROW()-1,Général!$H:$H,0),7))","v":"C2"}]
[{"$f":"IF(ROW()-1>COUNTIF(Général!$G:$G,$B$1),\"\",INDEX(Général!$A:$G,MATCH($B$1&\"_\"&ROW()-1,Général!$H:$H,0),1))","v":"André"},{"$f":"IF(ROW()-1>COUNTIF(Général!$G:$G,$B$1),\"\",INDEX(Général!$A:$G,MATCH($B$1&\"_\"&ROW()-1,Général!$H:$H,0),2))","v":"Frêne"},{"$f":"IF(ROW()-1>COUNTIF(Général!$G:$G,$B$1),\"\",INDEX(Général!$A:$G,MATCH($B$1&\"_\"&ROW()-1,Général!$H:$H,0),3))","v":"Bordeaux"},{"$f":"IF(ROW()-1>COUNTIF(Général!$G:$G,$B$1),\"\",INDEX(Général!$A:$G,MATCH($B$1&\"_\"&ROW()-1,Général!$H:$H,0),4))","v":"Jaune"},{"$f":"IF(ROW()-1>COUNTIF(Général!$G:$G,$B$1),\"\",INDEX(Général!$A:$G,MATCH($B$1&\"_\"&ROW()-1,Général!$H:$H,0),5))","v":"Rodrigues"},{"$f":"IF(ROW()-1>COUNTIF(Général!$G:$G,$B$1),\"\",INDEX(Général!$A:$G,MATCH($B$1&\"_\"&ROW()-1,Général!$H:$H,0),6))","v":"Prune"},{"$f":"IF(ROW()-1>COUNTIF(Général!$G:$G,$B$1),\"\",INDEX(Général!$A:$G,MATCH($B$1&\"_\"&ROW()-1,Général!$H:$H,0),7))","v":"C2"}]
[{"$f":"IF(ROW()-1>COUNTIF(Général!$G:$G,$B$1),\"\",INDEX(Général!$A:$G,MATCH($B$1&\"_\"&ROW()-1,Général!$H:$H,0),1))","v":"Léa"},{"$f":"IF(ROW()-1>COUNTIF(Général!$G:$G,$B$1),\"\",INDEX(Général!$A:$G,MATCH($B$1&\"_\"&ROW()-1,Général!$H:$H,0),2))","v":"Pin"},{"$f":"IF(ROW()-1>COUNTIF(Général!$G:$G,$B$1),\"\",INDEX(Général!$A:$G,MATCH($B$1&\"_\"&ROW()-1,Général!$H:$H,0),3))","v":"Calais"},{"$f":"IF(ROW()-1>COUNTIF(Général!$G:$G,$B$1),\"\",INDEX(Général!$A:$G,MATCH($B$1&\"_\"&ROW()-1,Général!$H:$H,0),4))","v":"Marron"},{"$f":"IF(ROW()-1>COUNTIF(Général!$G:$G,$B$1),\"\",INDEX(Général!$A:$G,MATCH($B$1&\"_\"&ROW()-1,Général!$H:$H,0),5))","v":"Born"},{"$f":"IF(ROW()-1>COUNTIF(Général!$G:$G,$B$1),\"\",INDEX(Général!$A:$G,MATCH($B$1&\"_\"&ROW()-1,Général!$H:$H,0),6))","v":"Pêche"},{"$f":"IF(ROW()-1>COUNTIF(Général!$G:$G,$B$1),\"\",INDEX(Général!$A:$G,MATCH($B$1&\"_\"&ROW()-1,Général!$H:$H,0),7))","v":"C2"}]
[{"$f":"IF(ROW()-1>COUNTIF(Général!$G:$G,$B$1),\"\",INDEX(Général!$A:$G,MATCH($B$1&\"_\"&ROW()-1,Général!$H:$H,0),1))","v":"Gilles"},{"$f":"IF(ROW()-1>COUNTIF(Général!$G:$G,$B$1),\"\",INDEX(Général!$A:$G,MATCH($B$1&\"_\"&ROW()-1,Général!$H:$H,0),2))","v":"Murier"},{"$f":"IF(ROW()-1>COUNTIF(Général!$G:$G,$B$1),\"\",INDEX(Général!$A:$G,MATCH($B$1&\"_\"&ROW()-1,Général!$H:$H,0),3))","v":"Briançon"},{"$f":"IF(ROW()-1>COUNTIF(Général!$G:$G,$B$1),\"\",INDEX(Général!$A:$G,MATCH($B$1&\"_\"&ROW()-1,Général!$H:$H,0),4))","v":"Vert"},{"$f":"IF(ROW()-1>COUNTIF(Général!$G:$G,$B$1),\"\",INDEX(Général!$A:$G,MATCH($B$1&\"_\"&ROW()-1,Général!$H:$H,0),5))","v":"Xamena"},{"$f":"IF(ROW()-1>COUNTIF(Général!$G:$G,$B$1),\"\",INDEX(Général!$A:$G,MATCH($B$1&\"_\"&ROW()-1,Général!$H:$H,0),6))","v":"Cassis"},{"$f":"IF(ROW()-1>COUNTIF(Général!$G:$G,$B$1),\"\",INDEX(Général!$A:$G,MATCH($B$1&\"_\"&ROW()-1,Général!$H:$H,0),7))","v":"C2"}]
[{"$f":"IF(ROW()-1>COUNTIF(Général!$G:$G,$B$1),\"\",INDEX(Général!$A:$G,MATCH($B$1&\"_\"&ROW()-1,Général!$H:$H,0),1))","v":"Jacqueline"},{"$f":"IF(ROW()-1>COUNTIF(Général!$G:$G,$B$1),\"\",INDEX(Général!$A:$G,MATCH($B$1&\"_\"&ROW()-1,Général!$H:$H,0),2))","v":"Olivier"},{"$f":"IF(ROW()-1>COUNTIF(Général!$G:$G,$B$1),\"\",INDEX(Général!$A:$G,MATCH($B$1&\"_\"&ROW()-1,Général!$H:$H,0),3))","v":"Nice"},{"$f":"IF(ROW()-1>COUNTIF(Général!$G:$G,$B$1),\"\",INDEX(Général!$A:$G,MATCH($B$1&\"_\"&ROW()-1,Général!$H:$H,0),4))","v":"Carmin"},{"$f":"IF(ROW()-1>COUNTIF(Général!$G:$G,$B$1),\"\",INDEX(Général!$A:$G,MATCH($B$1&\"_\"&ROW()-1,Général!$H:$H,0),5))","v":"Guiget"},{"$f":"IF(ROW()-1>COUNTIF(Général!$G:$G,$B$1),\"\",INDEX(Général!$A:$G,MATCH($B$1&\"_\"&ROW()-1,Général!$H:$H,0),6))","v":"Groseille"},{"$f":"IF(ROW()-1>COUNTIF(Général!$G:$G,$B$1),\"\",INDEX(Général!$A:$G,MATCH($B$1&\"_\"&ROW()-1,Général!$H:$H,0),7))","v":"C2"}]
[{"$f":"IF(ROW()-1>COUNTIF(Général!$G:$G,$B$1),\"\",INDEX(Général!$A:$G,MATCH($B$1&\"_\"&ROW()-1,Général!$H:$H,0),1))","v":"Michel"},{"$f":"IF(ROW()-1>COUNTIF(Général!$G:$G,$B$1),\"\",INDEX(Général!$A:$G,MATCH($B$1&\"_\"&ROW()-1,Général!$H:$H,0),2))","v":"Hêtre"},{"$f":"IF(ROW()-1>COUNTIF(Général!$G:$G,$B$1),\"\",INDEX(Général!$A:$G,MATCH($B$1&\"_\"&ROW()-1,Général!$H:$H,0),3))","v":"Pau"},{"$f":"IF(ROW()-1>COUNTIF(Général!$G:$G,$B$1),\"\",INDEX(Général!$A:$G,MATCH($B$1&\"_\"&ROW()-1,Général!$H:$H,0),4))","v":"Beige"},{"$f":"IF(ROW()-1>COUNTIF(Général!$G:$G,$B$1),\"\",INDEX(Général!$A:$G,MATCH($B$1&\"_\"&ROW()-1,Général!$H:$H,0),5))","v":"Haumal"},{"$f":"IF(ROW()-1>COUNTIF(Général!$G:$G,$B$1),\"\",INDEX(Général!$A:$G,MATCH($B$1&\"_\"&ROW()-1,Général!$H:$H,0),6))","v":"Fraise"},{"$f":"IF(ROW()-1>COUNTIF(Général!$G:$G,$B$1),\"\",INDEX(Général!$A:$G,MATCH($B$1&\"_\"&ROW()-1,Général!$H:$H,0),7))","v":"C2"}]
[{"$f":"IF(ROW()-1>COUNTIF(Général!$G:$G,$B$1),\"\",INDEX(Général!$A:$G,MATCH($B$1&\"_\"&ROW()-1,Général!$H:$H,0),1))","v":"Frédéric"},{"$f":"IF(ROW()-1>COUNTIF(Général!$G:$G,$B$1),\"\",INDEX(Général!$A:$G,MATCH($B$1&\"_\"&ROW()-1,Général!$H:$H,0),2))","v":"Baobab"},{"$f":"IF(ROW()-1>COUNTIF(Général!$G:$G,$B$1),\"\",INDEX(Général!$A:$G,MATCH($B$1&\"_\"&ROW()-1,Général!$H:$H,0),3))","v":"Clermont-Ferrand"},{"$f":"IF(ROW()-1>COUNTIF(Général!$G:$G,$B$1),\"\",INDEX(Général!$A:$G,MATCH($B$1&\"_\"&ROW()-1,Général!$H:$H,0),4))","v":"Cyan"},{"$f":"IF(ROW()-1>COUNTIF(Général!$G:$G,$B$1),\"\",INDEX(Général!$A:$G,MATCH($B$1&\"_\"&ROW()-1,Général!$H:$H,0),5))","v":"Exator"},{"$f":"IF(ROW()-1>COUNTIF(Général!$G:$G,$B$1),\"\",INDEX(Général!$A:$G,MATCH($B$1&\"_\"&ROW()-1,Général!$H:$H,0),6))","v":"Mangue"},{"$f":"IF(ROW()-1>COUNTIF(Général!$G:$G,$B$1),\"\",INDEX(Général!$A:$G,MATCH($B$1&\"_\"&ROW()-1,Général!$H:$H,0),7))","v":"C2"}]
{"$rows_left_out":23}
{"sheet":"C3","index":3,"n_rows":30,"n_cols":7,"rows_kept":30,"cut":false,"hidden":false,"merged":[]}
["Cotation ","C3"]
[{"$f":"IF(ROW()-1>COUNTIF(Général!$G:$G,$B$1),\"\",INDEX(Général!$A:$G,MATCH($B$1&\"_\"&ROW()-1,Général!$H:$H,0),1))","v":"Marcel"},{"$f":"IF(ROW()-1>COUNTIF(Général!$G:$G,$B$1),\"\",INDEX(Général!$A:$G,MATCH($B$1&\"_\"&ROW()-1,Général!$H:$H,0),2))","v":"Bouleau"},{"$f":"IF(ROW()-1>COUNTIF(Général!$G:$G,$B$1),\"\",INDEX(Général!$A:$G,MATCH($B$1&\"_\"&ROW()-1,Général!$H:$H,0),3))","v":"Marseille"},{"$f":"IF(ROW()-1>COUNTIF(Général!$G:$G,$B$1),\"\",INDEX(Général!$A:$G,MATCH($B$1&\"_\"&ROW()-1,Général!$H:$H,0),4))","v":"Bleu"},{"$f":"IF(ROW()-1>COUNTIF(Général!$G:$G,$B$1),\"\",INDEX(Général!$A:$G,MATCH($B$1&\"_\"&ROW()-1,Général!$H:$H,0),5))","v":"Martin"},{"$f":"IF(ROW()-1>COUNTIF(Général!$G:$G,$B$1),\"\",INDEX(Général!$A:$G,MATCH($B$1&\"_\"&ROW()-1,Général!$H:$H,0),6))","v":"Abricot"},{"$f":"IF(ROW()-1>COUNTIF(Général!$G:$G,$B$1),\"\",INDEX(Général!$A:$G,MATCH($B$1&\"_\"&ROW()-1,Général!$H:$H,0),7))","v":"C3"}]
[{"$f":"IF(ROW()-1>COUNTIF(Général!$G:$G,$B$1),\"\",INDEX(Général!$A:$G,MATCH($B$1&\"_\"&ROW()-1,Général!$H:$H,0),1))","v":"Lucas"},{"$f":"IF(ROW()-1>COUNTIF(Général!$G:$G,$B$1),\"\",INDEX(Général!$A:$G,MATCH($B$1&\"_\"&ROW()-1,Général!$H:$H,0),2))","v":"Mélèze"},{"$f":"IF(ROW()-1>COUNTIF(Général!$G:$G,$B$1),\"\",INDEX(Général!$A:$G,MATCH($B$1&\"_\"&ROW()-1,Général!$H:$H,0),3))","v":"Vannes"},{"$f":"IF(ROW()-1>COUNTIF(Général!$G:$G,$B$1),\"\",INDEX(Général!$A:$G,MATCH($B$1&\"_\"&ROW()-1,Général!$H:$H,0),4))","v":"Bleu Ciel"},{"$f":"IF(ROW()-1>COUNTIF(Général!$G:$G,$B$1),\"\",INDEX(Général!$A:$G,MATCH($B$1&\"_\"&ROW()-1,Général!$H:$H,0),5))","v":"Marcove"},{"$f":"IF(ROW()-1>COUNTIF(Général!$G:$G,$B$1),\"\",INDEX(Général!$A:$G,MATCH($B$1&\"_\"&ROW()-1,Général!$H:$H,0),6))","v":"Framboise"},{"$f":"IF(ROW()-1>COUNTIF(Général!$G:$G,$B$1),\"\",INDEX(Général!$A:$G,MATCH($B$1&\"_\"&ROW()-1,Général!$H:$H,0),7))","v":"C3"}]
[{"$f":"IF(ROW()-1>COUNTIF(Général!$G:$G,$B$1),\"\",INDEX(Général!$A:$G,MATCH($B$1&\"_\"&ROW()-1,Général!$H:$H,0),1))","v":"Eric"},{"$f":"IF(ROW()-1>COUNTIF(Général!$G:$G,$B$1),\"\",INDEX(Général!$A:$G,MATCH($B$1&\"_\"&ROW()-1,Général!$H:$H,0),2))","v":"Epicéa"},{"$f":"IF(ROW()-1>COUNTIF(Général!$G:$G,$B$1),\"\",INDEX(Général!$A:$G,MATCH($B$1&\"_\"&ROW()-1,Général!$H:$H,0),3))","v":"Biarritz"},{"$f":"IF(ROW()-1>COUNTIF(Général!$G:$G,$B$1),\"\",INDEX(Général!$A:$G,MATCH($B$1&\"_\"&ROW()-1,Général!$H:$H,0),4))","v":"Bleu Roi"},{"$f":"IF(ROW()-1>COUNTIF(Général!$G:$G,$B$1),\"\",INDEX(Général!$A:$G,MATCH($B$1&\"_\"&ROW()-1,Général!$H:$H,0),5))","v":"Robino"},{"$f":"IF(ROW()-1>COUNTIF(Général!$G:$G,$B$1),\"\",INDEX(Général!$A:$G,MATCH($B$1&\"_\"&ROW()-1,Général!$H:$H,0),6))","v":"Mûre"},{"$f":"IF(ROW()-1>COUNTIF(Général!$G:$G,$B$1),\"\",INDEX(Général!$A:$G,MATCH($B$1&\"_\"&ROW()-1,Général!$H:$H,0),7))","v":"C3"}]
[{"$f":"IF(ROW()-1>COUNTIF(Général!$G:$G,$B$1),\"\",INDEX(Général!$A:$G,MATCH($B$1&\"_\"&ROW()-1,Général!$H:$H,0),1))","v":"Chantal"},{"$f":"IF(ROW()-1>COUNTIF(Général!$G:$G,$B$1),\"\",INDEX(Général!$A:$G,MATCH($B$1&\"_\"&ROW()-1,Général!$H:$H,0),2))","v":"Tremble"},{"$f":"IF(ROW()-1>COUNTIF(Général!$G:$G,$B$1),\"\",INDEX(Général!$A:$G,MATCH($B$1&\"_\"&ROW()-1,Général!$H:$H,0),3))","v":"Narbonne"},{"$f":"IF(ROW()-1>COUNTIF(Général!$G:$G,$B$1),\"\",INDEX(Général!$A:$G,MATCH($B$1&\"_\"&ROW()-1,Général!$H:$H,0),4))","v":"Bistre"},{"$f":"IF(ROW()-1>COUNTIF(Général!$G:$G,$B$1),\"\",INDEX(Général!$A:$G,MATCH($B$1&\"_\"&ROW()-1,Général!$H:$H,0),5))","v":"Arunia"},{"$f":"IF(ROW()-1>COUNTIF(Général!$G:$G,$B$1),\"\",INDEX(Général!$A:$G,MATCH($B$1&\"_\"&ROW()-1,Général!$H:$H,0),6))","v":"Ananas"},{"$f":"IF(ROW()-1>COUNTIF(Général!$G:$G,$B$1),\"\",INDEX(Général!$A:$G,MATCH($B$1&\"_\"&ROW()-1,Général!$H:$H,0),7))","v":"C3"}]
[{"$f":"IF(ROW()-1>COUNTIF(Général!$G:$G,$B$1),\"\",INDEX(Général!$A:$G,MATCH($B$1&\"_\"&ROW()-1,Général!$H:$H,0),1))","v":"Pierrette"},{"$f":"IF(ROW()-1>COUNTIF(Général!$G:$G,$B$1),\"\",INDEX(Général!$A:$G,MATCH($B$1&\"_\"&ROW()-1,Général!$H:$H,0),2))","v":"Cornouiller"},{"$f":"IF(ROW()-1>COUNTIF(Général!$G:$G,$B$1),\"\",INDEX(Général!$A:$G,MATCH($B$1&\"_\"&ROW()-1,Général!$H:$H,0),3))","v":"Grasse"},{"$f":"IF(ROW()-1>COUNTIF(Général!$G:$G,$B$1),\"\",INDEX(Général!$A:$G,MATCH($B$1&\"_\"&ROW()-1,Général!$H:$H,0),4))","v":"Turquoise"},{"$f":"IF(ROW()-1>COUNTIF(Général!$G:$G,$B$1),\"\",INDEX(Général!$A:$G,MATCH($B$1&\"_\"&ROW()-1,Général!$H:$H,0),5))","v":"jaboulet"},{"$f":"IF(ROW()-1>COUNTIF(Général!$G:$G,$B$1),\"\",INDEX(Général!$A:$G,MATCH($B$1&\"_\"&ROW()-1,Général!$H:$H,0),6))","v":"Citron"},{"$f":"IF(ROW()-1>COUNTIF(Général!$G:$G,$B$1),\"\",INDEX(Général!$A:$G,MATCH($B$1&\"_\"&ROW()-1,Général!$H:$H,0),7))","v":"C3"}]
[{"$f":"IF(ROW()-1>COUNTIF(Général!$G:$G,$B$1),\"\",INDEX(Général!$A:$G,MATCH($B$1&\"_\"&ROW()-1,Général!$H:$H,0),1))","v":"Josette"},{"$f":"IF(ROW()-1>COUNTIF(Général!$G:$G,$B$1),\"\",INDEX(Général!$A:$G,MATCH($B$1&\"_\"&ROW()-1,Général!$H:$H,0),2))","v":"Charme"},{"$f":"IF(ROW()-1>COUNTIF(Général!$G:$G,$B$1),\"\",INDEX(Général!$A:$G,MATCH($B$1&\"_\"&ROW()-1,Général!$H:$H,0),3))","v":"Chaumont"},{"$f":"IF(ROW()-1>COUNTIF(Général!$G:$G,$B$1),\"\",INDEX(Général!$A:$G,MATCH($B$1&\"_\"&ROW()-1,Général!$H:$H,0),4))","v":"Marine"},{"$f":"IF(ROW()-1>COUNTIF(Général!$G:$G,$B$1),\"\",INDEX(Général!$A:$G,MATCH($B$1&\"_\"&ROW()-1,Général!$H:$H,0),5))","v":"Karovitch"},{"$f":"IF(ROW()-1>COUNTIF(Général!$G:$G,$B$1),\"\",INDEX(Général!$A:$G,MATCH($B$1&\"_\"&ROW()-1,Général!$H:$H,0),6))","v":"Pamplemousse"},{"$f":"IF(ROW()-1>COUNTIF(Général!$G:$G,$B$1),\"\",INDEX(Général!$A:$G,MATCH($B$1&\"_\"&ROW()-1,Général!$H:$H,0),7))","v":"C3"}]
[{"$f":"IF(ROW()-1>COUNTIF(Général!$G:$G,$B$1),\"\",INDEX(Général!$A:$G,MATCH($B$1&\"_\"&ROW()-1,Général!$H:$H,0),1))","v":"Annette"},{"$f":"IF(ROW()-1>COUNTIF(Général!$G:$G,$B$1),\"\",INDEX(Général!$A:$G,MATCH($B$1&\"_\"&ROW()-1,Général!$H:$H,0),2))","v":"Noyer"},{"$f":"IF(ROW()-1>COUNTIF(Général!$G:$G,$B$1),\"\",INDEX(Général!$A:$G,MATCH($B$1&\"_\"&ROW()-1,Général!$H:$H,0),3))","v":"Caen"},{"$f":"IF(ROW()-1>COUNTIF(Général!$G:$G,$B$1),\"\",INDEX(Général!$A:$G,MATCH($B$1&\"_\"&ROW()-1,Général!$H:$H,0),4))","v":"Indigo"},{"$f":"IF(ROW()-1>COUNTIF(Général!$G:$G,$B$1),\"\",INDEX(Général!$A:$G,MATCH($B$1&\"_\"&ROW()-1,Général!$H:$H,0),5))","v":"Querty"},{"$f":"IF(ROW()-1>COUNTIF(Général!$G:$G,$B$1),\"\",INDEX(Général!$A:$G,MATCH($B$1&\"_\"&ROW()-1,Général!$H:$H,0),6))","v":"kiwi"},{"$f":"IF(ROW()-1>COUNTIF(Général!$G:$G,$B$1),\"\",INDEX(Général!$A:$G,MATCH($B$1&\"_\"&ROW()-1,Général!$H:$H,0),7))","v":"C3"}]
{"$rows_left_out":22}