{"text_format":"1","workbook":"xlsx","n_sheets":4,"sheets":["Général","C1","C2","C3"],"not_rendered":{"charts":0,"images":0,"macros":0,"external_links":0,"defined_names":0,"comments":0,"pivot_tables":0},"unopened":[],"bounds":{"document_bytes":16777216,"sheet_cells":100000,"rows_first":2000,"rows_last":500,"rows_between":2000,"halvings":0,"cell_chars":16384,"cell_head_chars":4096},"cells_cut":0,"cells_raw":0,"read":"whole","date_system":"1900"}

{"sheet":"Général","index":0,"n_rows":27,"n_cols":8,"rows_kept":27,"cut":false,"hidden":false,"merged":[]}
["Info 1","Info 2","Info 3","Info 4","Info 5","Info 6","cotation","codage"]
["Roger","Chêne","Paris","Rouge","Dupont","Pomme","C1",{"$f":"IF(A2=\"\",\"\",G2&\"_\"&COUNTIF($G$2:G2,G2))","v":"C1_1"}]
["Paul","Orme","Lyon","Azur","Durand","Poire","C2",{"$f":"IF(A3=\"\",\"\",G3&\"_\"&COUNTIF($G$2:G3,G3))","v":"C2_1"}]
["Marcel","Bouleau","Marseille","Bleu","Martin","Abricot","C3",{"$f":"IF(A4=\"\",\"\",G4&\"_\"&COUNTIF($G$2:G4,G4))","v":"C3_1"}]
["André","Frêne","Bordeaux","Jaune","Rodrigues","Prune","C2",{"$f":"IF(A5=\"\",\"\",G5&\"_\"&COUNTIF($G$2:G5,G5))","v":"C2_2"}]
["Kevin","Platane","Rennes","Gris","Blanco","Cerise","C1",{"$f":"IF(A6=\"\",\"\",G6&\"_\"&COUNTIF($G$2:G6,G6))","v":"C1_2"}]
["Simone","Sorbier","Nantes","Noir","Boitet","Melon","C1",{"$f":"IF(A7=\"\",\"\",G7&\"_\"&COUNTIF($G$2:G7,G7))","v":"C1_3"}]
["Léa","Pin","Calais","Marron","Born","Pêche","C2",{"$f":"IF(A8=\"\",\"\",G8&\"_\"&COUNTIF($G$2:G8,G8))","v":"C2_3"}]
["Lucas","Mélèze","Vannes","Bleu Ciel","Marcove","Framboise","C3",{"$f":"IF(A9=\"\",\"\",G9&\"_\"&COUNTIF($G$2:G9,G9))","v":"C3_2"}]
["Eric","Epicéa","Biarritz","Bleu Roi","Robino","Mûre","C3",{"$f":"IF(A10=\"\",\"\",G10&\"_\"&COUNTIF($G$2:G10,G10))","v":"C3_3"}]
["Gilles","Murier","Briançon","Vert","Xamena","Cassis","C2",{"$f":"IF(A11=\"\",\"\",G11&\"_\"&COUNTIF($G$2:G11,G11))","v":"C2_4"}]
["Jacqueline","Olivier","Nice","Carmin","Guiget","Groseille","C2",{"$f":"IF(A12=\"\",\"\",G12&\"_\"&COUNTIF($G$2:G12,G12))","v":"C2_5"}]
["Monique","Peuplier","Toulouse","Magenta","Godet","Brugnon","C1",{"$f":"IF(A13=\"\",\"\",G13&\"_\"&COUNTIF($G$2:G13,G13))","v":"C1_4"}]
["Claude","Erable","Perpignan","Vermillon","Nassin","Nèfle","C1",{"$f":"IF(A14=\"\",\"\",G14&\"_\"&COUNTIF($G$2:G14,G14))","v":"C1_5"}]
["Michel","Hêtre","Pau","Beige","Haumal","Fraise","C2",{"$f":"IF(A15=\"\",\"\",G15&\"_\"&COUNTIF($G$2:G15,G15))","v":"C2_6"}]
["Chantal","Tremble","Narbonne","Bistre","Arunia","Ananas","C3",{"$f":"IF(A16=\"\",\"\",G16&\"_\"&COUNTIF($G$2:G16,G16))","v":"C3_4"}]
["Frédéric","Baobab","Clermont-Ferrand","Cyan","Exator","Mangue","C2",{"$f":"IF(A17=\"\",\"\",G17&\"_\"&COUNTIF($G$2:G17,G17))","v":"C2_7"}]
["Chrystel","Séquoïa","Limoges","Brun","Corbin","Orange","C1",{"$f":"IF(A18=\"\",\"\",G18&\"_\"&COUNTIF($G$2:G18,G18))","v":"C1_6"}]
["Corinne","Saule","Bézier","Isabelle","Fabri","Clémentine","C1",{"$f":"IF(A19=\"\",\"\",G19&\"_\"&COUNTIF($G$2:G19,G19))","v":"C1_7"}]
["Eugénie","Palmier","Montpellier","Blanc","Isidon","Mandarine","C2",{"$f":"IF(A20=\"\",\"\",G20&\"_\"&COUNTIF($G$2:G20,G20))","v":"C2_8"}]
["Pierrette","Cornouiller","Grasse","Turquoise","jaboulet","Citron","C3",{"$f":"IF(A21=\"\",\"\",G21&\"_\"&COUNTIF($G$2:G21,G21))","v":"C3_5"}]
["Josette","Charme","Chaumont","Marine","Karovitch","Pamplemousse","C3",{"$f":"IF(A22=\"\",\"\",G22&\"_\"&COUNTIF($G$2:G22,G22))","v":"C3_6"}]
["Jean","Cyprés","Poitier","Violet","Lugani","Mirabelle","C2",{"$f":"IF(A23=\"\",\"\",G23&\"_\"&COUNTIF($G$2:G23,G23))","v":"C2_9"}]
["Jacques","If","Soisson","Saumon","Marvel","Pastèque","C2",{"$f":"IF(A24=\"\",\"\",G24&\"_\"&COUNTIF($G$2:G24,G24))","v":"C2_10"}]
["Pierre","Sycomore","Angoulème","Argent","Obosque","Tomate","C1",{"$f":"IF(A25=\"\",\"\",G25&\"_\"&COUNTIF($G$2:G25,G25))","v":"C1_8"}]
["Annie","Tuyas","Compiègne","Chrome","Partena","Papaye","C2",{"$f":"IF(A26=\"\",\"\",G26&\"_\"&COUNTIF($G$2:G26,G26))","v":"C2_11"}]
["Annette","Noyer","Caen","Indigo","Querty","kiwi","C3",{"$f":"IF(A27=\"\",\"\",G27&\"_\"&COUNTIF($G$2:G27,G27))","v":"C3_7"}]

{"sheet":"C1","index":1,"n_rows":30,"n_cols":7,"rows_kept":30,"cut":false,"hidden":false,"merged":[]}
["Cotation ","C1"]
[{"$f":"IF(ROW()-1>COUNTIF(Général!$G:$G,$B$1),\"\",INDEX(Général!$A:$G,MATCH($B$1&\"_\"&ROW()-1,Général!$H:$H,0),1))","v":"Roger"},{"$f":"IF(ROW()-1>COUNTIF(Général!$G:$G,$B$1),\"\",INDEX(Général!$A:$G,MATCH($B$1&\"_\"&ROW()-1,Général!$H:$H,0),2))","v":"Chêne"},{"$f":"IF(ROW()-1>COUNTIF(Général!$G:$G,$B$1),\"\",INDEX(Général!$A:$G,MATCH($B$1&\"_\"&ROW()-1,Général!$H:$H,0),3))","v":"Paris"},{"$f":"IF(ROW()-1>COUNTIF(Général!$G:$G,$B$1),\"\",INDEX(Général!$A:$G,MATCH($B$1&\"_\"&ROW()-1,Général!$H:$H,0),4))","v":"Rouge"},{"$f":"IF(ROW()-1>COUNTIF(Général!$G:$G,$B$1),\"\",INDEX(Général!$A:$G,MATCH($B$1&\"_\"&ROW()-1,Général!$H:$H,0),5))","v":"Dupont"},{"$f":"IF(ROW()-1>COUNTIF(Général!$G:$G,$B$1),\"\",INDEX(Général!$A:$G,MATCH($B$1&\"_\"&ROW()-1,Général!$H:$H,0),6))","v":"Pomme"},{"$f":"IF(ROW()-1>COUNTIF(Général!$G:$G,$B$1),\"\",INDEX(Général!$A:$G,MATCH($B$1&\"_\"&ROW()-1,Général!$H:$H,0),7))","v":"C1"}]
[{"$f":"IF(ROW()-1>COUNTIF(Général!$G:$G,$B$1),\"\",INDEX(Général!$A:$G,MATCH($B$1&\"_\"&ROW()-1,Général!$H:$H,0),1))","v":"Kevin"},{"$f":"IF(ROW()-1>COUNTIF(Général!$G:$G,$B$1),\"\",INDEX(Général!$A:$G,MATCH($B$1&\"_\"&ROW()-1,Général!$H:$H,0),2))","v":"Platane"},{"$f":"IF(ROW()-1>COUNTIF(Général!$G:$G,$B$1),\"\",INDEX(Général!$A:$G,MATCH($B$1&\"_\"&ROW()-1,Général!$H:$H,0),3))","v":"Rennes"},{"$f":"IF(ROW()-1>COUNTIF(Général!$G:$G,$B$1),\"\",INDEX(Général!$A:$G,MATCH($B$1&\"_\"&ROW()-1,Général!$H:$H,0),4))","v":"Gris"},{"$f":"IF(ROW()-1>COUNTIF(Général!$G:$G,$B$1),\"\",INDEX(Général!$A:$G,MATCH($B$1&\"_\"&ROW()-1,Général!$H:$H,0),5))","v":"Blanco"},{"$f":"IF(ROW()-1>COUNTIF(Général!$G:$G,$B$1),\"\",INDEX(Général!$A:$G,MATCH($B$1&\"_\"&ROW()-1,Général!$H:$H,0),6))","v":"Cerise"},{"$f":"IF(ROW()-1>COUNTIF(Général!$G:$G,$B$1),\"\",INDEX(Général!$A:$G,MATCH($B$1&\"_\"&ROW()-1,Général!$H:$H,0),7))","v":"C1"}]
[{"$f":"IF(ROW()-1>COUNTIF(Général!$G:$G,$B$1),\"\",INDEX(Général!$A:$G,MATCH($B$1&\"_\"&ROW()-1,Général!$H:$H,0),1))","v":"Simone"},{"$f":"IF(ROW()-1>COUNTIF(Général!$G:$G,$B$1),\"\",INDEX(Général!$A:$G,MATCH($B$1&\"_\"&ROW()-1,Général!$H:$H,0),2))","v":"Sorbier"},{"$f":"IF(ROW()-1>COUNTIF(Général!$G:$G,$B$1),\"\",INDEX(Général!$A:$G,MATCH($B$1&\"_\"&ROW()-1,Général!$H:$H,0),3))","v":"Nantes"},{"$f":"IF(ROW()-1>COUNTIF(Général!$G:$G,$B$1),\"\",INDEX(Général!$A:$G,MATCH($B$1&\"_\"&ROW()-1,Général!$H:$H,0),4))","v":"Noir"},{"$f":"IF(ROW()-1>COUNTIF(Général!$G:$G,$B$1),\"\",INDEX(Général!$A:$G,MATCH($B$1&\"_\"&ROW()-1,Général!$H:$H,0),5))","v":"Boitet"},{"$f":"IF(ROW()-1>COUNTIF(Général!$G:$G,$B$1),\"\",INDEX(Général!$A:$G,MATCH($B$1&\"_\"&ROW()-1,Général!$H:$H,0),6))","v":"Melon"},{"$f":"IF(ROW()-1>COUNTIF(Général!$G:$G,$B$1),\"\",INDEX(Général!$A:$G,MATCH($B$1&\"_\"&ROW()-1,Général!$H:$H,0),7))","v":"C1"}]
[{"$f":"IF(ROW()-1>COUNTIF(Général!$G:$G,$B$1),\"\",INDEX(Général!$A:$G,MATCH($B$1&\"_\"&ROW()-1,Général!$H:$H,0),1))","v":"Monique"},{"$f":"IF(ROW()-1>COUNTIF(Général!$G:$G,$B$1),\"\",INDEX(Général!$A:$G,MATCH($B$1&\"_\"&ROW()-1,Général!$H:$H,0),2))","v":"Peuplier"},{"$f":"IF(ROW()-1>COUNTIF(Général!$G:$G,$B$1),\"\",INDEX(Général!$A:$G,MATCH($B$1&\"_\"&ROW()-1,Général!$H:$H,0),3))","v":"Toulouse"},{"$f":"IF(ROW()-1>COUNTIF(Général!$G:$G,$B$1),\"\",INDEX(Général!$A:$G,MATCH($B$1&\"_\"&ROW()-1,Général!$H:$H,0),4))","v":"Magenta"},{"$f":"IF(ROW()-1>COUNTIF(Général!$G:$G,$B$1),\"\",INDEX(Général!$A:$G,MATCH($B$1&\"_\"&ROW()-1,Général!$H:$H,0),5))","v":"Godet"},{"$f":"IF(ROW()-1>COUNTIF(Général!$G:$G,$B$1),\"\",INDEX(Général!$A:$G,MATCH($B$1&\"_\"&ROW()-1,Général!$H:$H,0),6))","v":"Brugnon"},{"$f":"IF(ROW()-1>COUNTIF(Général!$G:$G,$B$1),\"\",INDEX(Général!$A:$G,MATCH($B$1&\"_\"&ROW()-1,Général!$H:$H,0),7))","v":"C1"}]
[{"$f":"IF(ROW()-1>COUNTIF(Général!$G:$G,$B$1),\"\",INDEX(Général!$A:$G,MATCH($B$1&\"_\"&ROW()-1,Général!$H:$H,0),1))","v":"Claude"},{"$f":"IF(ROW()-1>COUNTIF(Général!$G:$G,$B$1),\"\",INDEX(Général!$A:$G,MATCH($B$1&\"_\"&ROW()-1,Général!$H:$H,0),2))","v":"Erable"},{"$f":"IF(ROW()-1>COUNTIF(Général!$G:$G,$B$1),\"\",INDEX(Général!$A:$G,MATCH($B$1&\"_\"&ROW()-1,Général!$H:$H,0),3))","v":"Perpignan"},{"$f":"IF(ROW()-1>COUNTIF(Général!$G:$G,$B$1),\"\",INDEX(Général!$A:$G,MATCH($B$1&\"_\"&ROW()-1,Général!$H:$H,0),4))","v":"Vermillon"},{"$f":"IF(ROW()-1>COUNTIF(Général!$G:$G,$B$1),\"\",INDEX(Général!$A:$G,MATCH($B$1&\"_\"&ROW()-1,Général!$H:$H,0),5))","v":"Nassin"},{"$f":"IF(ROW()-1>COUNTIF(Général!$G:$G,$B$1),\"\",INDEX(Général!$A:$G,MATCH($B$1&\"_\"&ROW()-1,Général!$H:$H,0),6))","v":"Nèfle"},{"$f":"IF(ROW()-1>COUNTIF(Général!$G:$G,$B$1),\"\",INDEX(Général!$A:$G,MATCH($B$1&\"_\"&ROW()-1,Général!$H:$H,0),7))","v":"C1"}]
[{"$f":"IF(ROW()-1>COUNTIF(Général!$G:$G,$B$1),\"\",INDEX(Général!$A:$G,MATCH($B$1&\"_\"&ROW()-1,Général!$H:$H,0),1))","v":"Chrystel"},{"$f":"IF(ROW()-1>COUNTIF(Général!$G:$G,$B$1),\"\",INDEX(Général!$A:$G,MATCH($B$1&\"_\"&ROW()-1,Général!$H:$H,0),2))","v":"Séquoïa"},{"$f":"IF(ROW()-1>COUNTIF(Général!$G:$G,$B$1),\"\",INDEX(Général!$A:$G,MATCH($B$1&\"_\"&ROW()-1,Général!$H:$H,0),3))","v":"Limoges"},{"$f":"IF(ROW()-1>COUNTIF(Général!$G:$G,$B$1),\"\",INDEX(Général!$A:$G,MATCH($B$1&\"_\"&ROW()-1,Général!$H:$H,0),4))","v":"Brun"},{"$f":"IF(ROW()-1>COUNTIF(Général!$G:$G,$B$1),\"\",INDEX(Général!$A:$G,MATCH($B$1&\"_\"&ROW()-1,Général!$H:$H,0),5))","v":"Corbin"},{"$f":"IF(ROW()-1>COUNTIF(Général!$G:$G,$B$1),\"\",INDEX(Général!$A:$G,MATCH($B$1&\"_\"&ROW()-1,Général!$H:$H,0),6))","v":"Orange"},{"$f":"IF(ROW()-1>COUNTIF(Général!$G:$G,$B$1),\"\",INDEX(Général!$A:$G,MATCH($B$1&\"_\"&ROW()-1,Général!$H:$H,0),7))","v":"C1"}]
[{"$f":"IF(ROW()-1>COUNTIF(Général!$G:$G,$B$1),\"\",INDEX(Général!$A:$G,MATCH($B$1&\"_\"&ROW()-1,Général!$H:$H,0),1))","v":"Corinne"},{"$f":"IF(ROW()-1>COUNTIF(Général!$G:$G,$B$1),\"\",INDEX(Général!$A:$G,MATCH($B$1&\"_\"&ROW()-1,Général!$H:$H,0),2))","v":"Saule"},{"$f":"IF(ROW()-1>COUNTIF(Général!$G:$G,$B$1),\"\",INDEX(Général!$A:$G,MATCH($B$1&\"_\"&ROW()-1,Général!$H:$H,0),3))","v":"Bézier"},{"$f":"IF(ROW()-1>COUNTIF(Général!$G:$G,$B$1),\"\",INDEX(Général!$A:$G,MATCH($B$1&\"_\"&ROW()-1,Général!$H:$H,0),4))","v":"Isabelle"},{"$f":"IF(ROW()-1>COUNTIF(Général!$G:$G,$B$1),\"\",INDEX(Général!$A:$G,MATCH($B$1&\"_\"&ROW()-1,Général!$H:$H,0),5))","v":"Fabri"},{"$f":"IF(ROW()-1>COUNTIF(Général!$G:$G,$B$1),\"\",INDEX(Général!$A:$G,MATCH($B$1&\"_\"&ROW()-1,Général!$H:$H,0),6))","v":"Clémentine"},{"$f":"IF(ROW()-1>COUNTIF(Général!$G:$G,$B$1),\"\",INDEX(Général!$A:$G,MATCH($B$1&\"_\"&ROW()-1,Général!$H:$H,0),7))","v":"C1"}]
[{"$f":"IF(ROW()-1>COUNTIF(Général!$G:$G,$B$1),\"\",INDEX(Général!$A:$G,MATCH($B$1&\"_\"&ROW()-1,Général!$H:$H,0),1))","v":"Pierre"},{"$f":"IF(ROW()-1>COUNTIF(Général!$G:$G,$B$1),\"\",INDEX(Général!$A:$G,MATCH($B$1&\"_\"&ROW()-1,Général!$H:$H,0),2))","v":"Sycomore"},{"$f":"IF(ROW()-1>COUNTIF(Général!$G:$G,$B$1),\"\",INDEX(Général!$A:$G,MATCH($B$1&\"_\"&ROW()-1,Général!$H:$H,0),3))","v":"Angoulème"},{"$f":"IF(ROW()-1>COUNTIF(Général!$G:$G,$B$1),\"\",INDEX(Général!$A:$G,MATCH($B$1&\"_\"&ROW()-1,Général!$H:$H,0),4))","v":"Argent"},{"$f":"IF(ROW()-1>COUNTIF(Général!$G:$G,$B$1),\"\",INDEX(Général!$A:$G,MATCH($B$1&\"_\"&ROW()-1,Général!$H:$H,0),5))","v":"Obosque"},{"$f":"IF(ROW()-1>COUNTIF(Général!$G:$G,$B$1),\"\",INDEX(Général!$A:$G,MATCH($B$1&\"_\"&ROW()-1,Général!$H:$H,0),6))","v":"Tomate"},{"$f":"IF(ROW()-1>COUNTIF(Général!$G:$G,$B$1),\"\",INDEX(Général!$A:$G,MATCH($B$1&\"_\"&ROW()-1,Général!$H:$H,0),7))","v":"C1"}]
[{"$f":"IF(ROW()-1>COUNTIF(Général!$G:$G,$B$1),\"\",INDEX(Général!$A:$G,MATCH($B$1&\"_\"&ROW()-1,Général!$H:$H,0),1))","v":""},{"$f":"IF(ROW()-1>COUNTIF(Général!$G:$G,$B$1),\"\",INDEX(Général!$A:$G,MATCH($B$1&\"_\"&ROW()-1,Général!$H:$H,0),2))","v":""},{"$f":"IF(ROW()-1>COUNTIF(Général!$G:$G,$B$1),\"\",INDEX(Général!$A:$G,MATCH($B$1&\"_\"&ROW()-1,Général!$H:$H,0),3))","v":""},{"$f":"IF(ROW()-1>COUNTIF(Général!$G:$G,$B$1),\"\",INDEX(Général!$A:$G,MATCH($B$1&\"_\"&ROW()-1,Général!$H:$H,0),4))","v":""},{"$f":"IF(ROW()-1>COUNTIF(Général!$G:$G,$B$1),\"\",INDEX(Général!$A:$G,MATCH($B$1&\"_\"&ROW()-1,Général!$H:$H,0),5))","v":""},{"$f":"IF(ROW()-1>COUNTIF(Général!$G:$G,$B$1),\"\",INDEX(Général!$A:$G,MATCH($B$1&\"_\"&ROW()-1,Général!$H:$H,0),6))","v":""},{"$f":"IF(ROW()-1>COUNTIF(Général!$G:$G,$B$1),\"\",INDEX(Général!$A:$G,MATCH($B$1&\"_\"&ROW()-1,Général!$H:$H,0),7))","v":""}]
[{"$f":"IF(ROW()-1>COUNTIF(Général!$G:$G,$B$1),\"\",INDEX(Général!$A:$G,MATCH($B$1&\"_\"&ROW()-1,Général!$H:$H,0),1))","v":""},{"$f":"IF(ROW()-1>COUNTIF(Général!$G:$G,$B$1),\"\",INDEX(Général!$A:$G,MATCH($B$1&\"_\"&ROW()-1,Général!$H:$H,0),2))","v":""},{"$f":"IF(ROW()-1>COUNTIF(Général!$G:$G,$B$1),\"\",INDEX(Général!$A:$G,MATCH($B$1&\"_\"&ROW()-1,Général!$H:$H,0),3))","v":""},{"$f":"IF(ROW()-1>COUNTIF(Général!$G:$G,$B$1),\"\",INDEX(Général!$A:$G,MATCH($B$1&\"_\"&ROW()-1,Général!$H:$H,0),4))","v":""},{"$f":"IF(ROW()-1>COUNTIF(Général!$G:$G,$B$1),\"\",INDEX(Général!$A:$G,MATCH($B$1&\"_\"&ROW()-1,Général!$H:$H,0),5))","v":""},{"$f":"IF(ROW()-1>COUNTIF(Général!$G:$G,$B$1),\"\",INDEX(Général!$A:$G,MATCH($B$1&\"_\"&ROW()-1,Général!$H:$H,0),6))","v":""},{"$f":"IF(ROW()-1>COUNTIF(Général!$G:$G,$B$1),\"\",INDEX(Général!$A:$G,MATCH($B$1&\"_\"&ROW()-1,Général!$H:$H,0),7))","v":""}]
[{"$f":"IF(ROW()-1>COUNTIF(Général!$G:$G,$B$1),\"\",INDEX(Général!$A:$G,MATCH($B$1&\"_\"&ROW()-1,Général!$H:$H,0),1))","v":""},{"$f":"IF(ROW()-1>COUNTIF(Général!$G:$G,$B$1),\"\",INDEX(Général!$A:$G,MATCH($B$1&\"_\"&ROW()-1,Général!$H:$H,0),2))","v":""},{"$f":"IF(ROW()-1>COUNTIF(Général!$G:$G,$B$1),\"\",INDEX(Général!$A:$G,MATCH($B$1&\"_\"&ROW()-1,Général!$H:$H,0),3))","v":""},{"$f":"IF(ROW()-1>COUNTIF(Général!$G:$G,$B$1),\"\",INDEX(Général!$A:$G,MATCH($B$1&\"_\"&ROW()-1,Général!$H:$H,0),4))","v":""},{"$f":"IF(ROW()-1>COUNTIF(Général!$G:$G,$B$1),\"\",INDEX(Général!$A:$G,MATCH($B$1&\"_\"&ROW()-1,Général!$H:$H,0),5))","v":""},{"$f":"IF(ROW()-1>COUNTIF(Général!$G:$G,$B$1),\"\",INDEX(Général!$A:$G,MATCH($B$1&\"_\"&ROW()-1,Général!$H:$H,0),6))","v":""},{"$f":"IF(ROW()-1>COUNTIF(Général!$G:$G,$B$1),\"\",INDEX(Général!$A:$G,MATCH($B$1&\"_\"&ROW()-1,Général!$H:$H,0),7))","v":""}]
[{"$f":"IF(ROW()-1>COUNTIF(Général!$G:$G,$B$1),\"\",INDEX(Général!$A:$G,MATCH($B$1&\"_\"&ROW()-1,Général!$H:$H,0),1))","v":""},{"$f":"IF(ROW()-1>COUNTIF(Général!$G:$G,$B$1),\"\",INDEX(Général!$A:$G,MATCH($B$1&\"_\"&ROW()-1,Général!$H:$H,0),2))","v":""},{"$f":"IF(ROW()-1>COUNTIF(Général!$G:$G,$B$1),\"\",INDEX(Général!$A:$G,MATCH($B$1&\"_\"&ROW()-1,Général!$H:$H,0),3))","v":""},{"$f":"IF(ROW()-1>COUNTIF(Général!$G:$G,$B$1),\"\",INDEX(Général!$A:$G,MATCH($B$1&\"_\"&ROW()-1,Général!$H:$H,0),4))","v":""},{"$f":"IF(ROW()-1>COUNTIF(Général!$G:$G,$B$1),\"\",INDEX(Général!$A:$G,MATCH($B$1&\"_\"&ROW()-1,Général!$H:$H,0),5))","v":""},{"$f":"IF(ROW()-1>COUNTIF(Général!$G:$G,$B$1),\"\",INDEX(Général!$A:$G,MATCH($B$1&\"_\"&ROW()-1,Général!$H:$H,0),6))","v":""},{"$f":"IF(ROW()-1>COUNTIF(Général!$G:$G,$B$1),\"\",INDEX(Général!$A:$G,MATCH($B$1&\"_\"&ROW()-1,Général!$H:$H,0),7))","v":""}]
[{"$f":"IF(ROW()-1>COUNTIF(Général!$G:$G,$B$1),\"\",INDEX(Général!$A:$G,MATCH($B$1&\"_\"&ROW()-1,Général!$H:$H,0),1))","v":""},{"$f":"IF(ROW()-1>COUNTIF(Général!$G:$G,$B$1),\"\",INDEX(Général!$A:$G,MATCH($B$1&\"_\"&ROW()-1,Général!$H:$H,0),2))","v":""},{"$f":"IF(ROW()-1>COUNTIF(Général!$G:$G,$B$1),\"\",INDEX(Général!$A:$G,MATCH($B$1&\"_\"&ROW()-1,Général!$H:$H,0),3))","v":""},{"$f":"IF(ROW()-1>COUNTIF(Général!$G:$G,$B$1),\"\",INDEX(Général!$A:$G,MATCH($B$1&\"_\"&ROW()-1,Général!$H:$H,0),4))","v":""},{"$f":"IF(ROW()-1>COUNTIF(Général!$G:$G,$B$1),\"\",INDEX(Général!$A:$G,MATCH($B$1&\"_\"&ROW()-1,Général!$H:$H,0),5))","v":""},{"$f":"IF(ROW()-1>COUNTIF(Général!$G:$G,$B$1),\"\",INDEX(Général!$A:$G,MATCH($B$1&\"_\"&ROW()-1,Général!$H:$H,0),6))","v":""},{"$f":"IF(ROW()-1>COUNTIF(Général!$G:$G,$B$1),\"\",INDEX(Général!$A:$G,MATCH($B$1&\"_\"&ROW()-1,Général!$H:$H,0),7))","v":""}]
[{"$f":"IF(ROW()-1>COUNTIF(Général!$G:$G,$B$1),\"\",INDEX(Général!$A:$G,MATCH($B$1&\"_\"&ROW()-1,Général!$H:$H,0),1))","v":""},{"$f":"IF(ROW()-1>COUNTIF(Général!$G:$G,$B$1),\"\",INDEX(Général!$A:$G,MATCH($B$1&\"_\"&ROW()-1,Général!$H:$H,0),2))","v":""},{"$f":"IF(ROW()-1>COUNTIF(Général!$G:$G,$B$1),\"\",INDEX(Général!$A:$G,MATCH($B$1&\"_\"&ROW()-1,Général!$H:$H,0),3))","v":""},{"$f":"IF(ROW()-1>COUNTIF(Général!$G:$G,$B$1),\"\",INDEX(Général!$A:$G,MATCH($B$1&\"_\"&ROW()-1,Général!$H:$H,0),4))","v":""},{"$f":"IF(ROW()-1>COUNTIF(Général!$G:$G,$B$1),\"\",INDEX(Général!$A:$G,MATCH($B$1&\"_\"&ROW()-1,Général!$H:$H,0),5))","v":""},{"$f":"IF(ROW()-1>COUNTIF(Général!$G:$G,$B$1),\"\",INDEX(Général!$A:$G,MATCH($B$1&\"_\"&ROW()-1,Général!$H:$H,0),6))","v":""},{"$f":"IF(ROW()-1>COUNTIF(Général!$G:$G,$B$1),\"\",INDEX(Général!$A:$G,MATCH($B$1&\"_\"&ROW()-1,Général!$H:$H,0),7))","v":""}]
[{"$f":"IF(ROW()-1>COUNTIF(Général!$G:$G,$B$1),\"\",INDEX(Général!$A:$G,MATCH($B$1&\"_\"&ROW()-1,Général!$H:$H,0),1))","v":""},{"$f":"IF(ROW()-1>COUNTIF(Général!$G:$G,$B$1),\"\",INDEX(Général!$A:$G,MATCH($B$1&\"_\"&ROW()-1,Général!$H:$H,0),2))","v":""},{"$f":"IF(ROW()-1>COUNTIF(Général!$G:$G,$B$1),\"\",INDEX(Général!$A:$G,MATCH($B$1&\"_\"&ROW()-1,Général!$H:$H,0),3))","v":""},{"$f":"IF(ROW()-1>COUNTIF(Général!$G:$G,$B$1),\"\",INDEX(Général!$A:$G,MATCH($B$1&\"_\"&ROW()-1,Général!$H:$H,0),4))","v":""},{"$f":"IF(ROW()-1>COUNTIF(Général!$G:$G,$B$1),\"\",INDEX(Général!$A:$G,MATCH($B$1&\"_\"&ROW()-1,Général!$H:$H,0),5))","v":""},{"$f":"IF(ROW()-1>COUNTIF(Général!$G:$G,$B$1),\"\",INDEX(Général!$A:$G,MATCH($B$1&\"_\"&ROW()-1,Général!$H:$H,0),6))","v":""},{"$f":"IF(ROW()-1>COUNTIF(Général!$G:$G,$B$1),\"\",INDEX(Général!$A:$G,MATCH($B$1&\"_\"&ROW()-1,Général!$H:$H,0),7))","v":""}]
[{"$f":"IF(ROW()-1>COUNTIF(Général!$G:$G,$B$1),\"\",INDEX(Général!$A:$G,MATCH($B$1&\"_\"&ROW()-1,Général!$H:$H,0),1))","v":""},{"$f":"IF(ROW()-1>COUNTIF(Général!$G:$G,$B$1),\"\",INDEX(Général!$A:$G,MATCH($B$1&\"_\"&ROW()-1,Général!$H:$H,0),2))","v":""},{"$f":"IF(ROW()-1>COUNTIF(Général!$G:$G,$B$1),\"\",INDEX(Général!$A:$G,MATCH($B$1&\"_\"&ROW()-1,Général!$H:$H,0),3))","v":""},{"$f":"IF(ROW()-1>COUNTIF(Général!$G:$G,$B$1),\"\",INDEX(Général!$A:$G,MATCH($B$1&\"_\"&ROW()-1,Général!$H:$H,0),4))","v":""},{"$f":"IF(ROW()-1>COUNTIF(Général!$G:$G,$B$1),\"\",INDEX(Général!$A:$G,MATCH($B$1&\"_\"&ROW()-1,Général!$H:$H,0),5))","v":""},{"$f":"IF(ROW()-1>COUNTIF(Général!$G:$G,$B$1),\"\",INDEX(Général!$A:$G,MATCH($B$1&\"_\"&ROW()-1,Général!$H:$H,0),6))","v":""},{"$f":"IF(ROW()-1>COUNTIF(Général!$G:$G,$B$1),\"\",INDEX(Général!$A:$G,MATCH($B$1&\"_\"&ROW()-1,Général!$H:$H,0),7))","v":""}]
[{"$f":"IF(ROW()-1>COUNTIF(Général!$G:$G,$B$1),\"\",INDEX(Général!$A:$G,MATCH($B$1&\"_\"&ROW()-1,Général!$H:$H,0),1))","v":""},{"$f":"IF(ROW()-1>COUNTIF(Général!$G:$G,$B$1),\"\",INDEX(Général!$A:$G,MATCH($B$1&\"_\"&ROW()-1,Général!$H:$H,0),2))","v":""},{"$f":"IF(ROW()-1>COUNTIF(Général!$G:$G,$B$1),\"\",INDEX(Général!$A:$G,MATCH($B$1&\"_\"&ROW()-1,Général!$H:$H,0),3))","v":""},{"$f":"IF(ROW()-1>COUNTIF(Général!$G:$G,$B$1),\"\",INDEX(Général!$A:$G,MATCH($B$1&\"_\"&ROW()-1,Général!$H:$H,0),4))","v":""},{"$f":"IF(ROW()-1>COUNTIF(Général!$G:$G,$B$1),\"\",INDEX(Général!$A:$G,MATCH($B$1&\"_\"&ROW()-1,Général!$H:$H,0),5))","v":""},{"$f":"IF(ROW()-1>COUNTIF(Général!$G:$G,$B$1),\"\",INDEX(Général!$A:$G,MATCH($B$1&\"_\"&ROW()-1,Général!$H:$H,0),6))","v":""},{"$f":"IF(ROW()-1>COUNTIF(Général!$G:$G,$B$1),\"\",INDEX(Général!$A:$G,MATCH($B$1&\"_\"&ROW()-1,Général!$H:$H,0),7))","v":""}]
[{"$f":"IF(ROW()-1>COUNTIF(Général!$G:$G,$B$1),\"\",INDEX(Général!$A:$G,MATCH($B$1&\"_\"&ROW()-1,Général!$H:$H,0),1))","v":""},{"$f":"IF(ROW()-1>COUNTIF(Général!$G:$G,$B$1),\"\",INDEX(Général!$A:$G,MATCH($B$1&\"_\"&ROW()-1,Général!$H:$H,0),2))","v":""},{"$f":"IF(ROW()-1>COUNTIF(Général!$G:$G,$B$1),\"\",INDEX(Général!$A:$G,MATCH($B$1&\"_\"&ROW()-1,Général!$H:$H,0),3))","v":""},{"$f":"IF(ROW()-1>COUNTIF(Général!$G:$G,$B$1),\"\",INDEX(Général!$A:$G,MATCH($B$1&\"_\"&ROW()-1,Général!$H:$H,0),4))","v":""},{"$f":"IF(ROW()-1>COUNTIF(Général!$G:$G,$B$1),\"\",INDEX(Général!$A:$G,MATCH($B$1&\"_\"&ROW()-1,Général!$H:$H,0),5))","v":""},{"$f":"IF(ROW()-1>COUNTIF(Général!$G:$G,$B$1),\"\",INDEX(Général!$A:$G,MATCH($B$1&\"_\"&ROW()-1,Général!$H:$H,0),6))","v":""},{"$f":"IF(ROW()-1>COUNTIF(Général!$G:$G,$B$1),\"\",INDEX(Général!$A:$G,MATCH($B$1&\"_\"&ROW()-1,Général!$H:$H,0),7))","v":""}]
[{"$f":"IF(ROW()-1>COUNTIF(Général!$G:$G,$B$1),\"\",INDEX(Général!$A:$G,MATCH($B$1&\"_\"&ROW()-1,Général!$H:$H,0),1))","v":""},{"$f":"IF(ROW()-1>COUNTIF(Général!$G:$G,$B$1),\"\",INDEX(Général!$A:$G,MATCH($B$1&\"_\"&ROW()-1,Général!$H:$H,0),2))","v":""},{"$f":"IF(ROW()-1>COUNTIF(Général!$G:$G,$B$1),\"\",INDEX(Général!$A:$G,MATCH($B$1&\"_\"&ROW()-1,Général!$H:$H,0),3))","v":""},{"$f":"IF(ROW()-1>COUNTIF(Général!$G:$G,$B$1),\"\",INDEX(Général!$A:$G,MATCH($B$1&\"_\"&ROW()-1,Général!$H:$H,0),4))","v":""},{"$f":"IF(ROW()-1>COUNTIF(Général!$G:$G,$B$1),\"\",INDEX(Général!$A:$G,MATCH($B$1&\"_\"&ROW()-1,Général!$H:$H,0),5))","v":""},{"$f":"IF(ROW()-1>COUNTIF(Général!$G:$G,$B$1),\"\",INDEX(Général!$A:$G,MATCH($B$1&\"_\"&ROW()-1,Général!$H:$H,0),6))","v":""},{"$f":"IF(ROW()-1>COUNTIF(Général!$G:$G,$B$1),\"\",INDEX(Général!$A:$G,MATCH($B$1&\"_\"&ROW()-1,Général!$H:$H,0),7))","v":""}]
[{"$f":"IF(ROW()-1>COUNTIF(Général!$G:$G,$B$1),\"\",INDEX(Général!$A:$G,MATCH($B$1&\"_\"&ROW()-1,Général!$H:$H,0),1))","v":""},{"$f":"IF(ROW()-1>COUNTIF(Général!$G:$G,$B$1),\"\",INDEX(Général!$A:$G,MATCH($B$1&\"_\"&ROW()-1,Général!$H:$H,0),2))","v":""},{"$f":"IF(ROW()-1>COUNTIF(Général!$G:$G,$B$1),\"\",INDEX(Général!$A:$G,MATCH($B$1&\"_\"&ROW()-1,Général!$H:$H,0),3))","v":""},{"$f":"IF(ROW()-1>COUNTIF(Général!$G:$G,$B$1),\"\",INDEX(Général!$A:$G,MATCH($B$1&\"_\"&ROW()-1,Général!$H:$H,0),4))","v":""},{"$f":"IF(ROW()-1>COUNTIF(Général!$G:$G,$B$1),\"\",INDEX(Général!$A:$G,MATCH($B$1&\"_\"&ROW()-1,Général!$H:$H,0),5))","v":""},{"$f":"IF(ROW()-1>COUNTIF(Général!$G:$G,$B$1),\"\",INDEX(Général!$A:$G,MATCH($B$1&\"_\"&ROW()-1,Général!$H:$H,0),6))","v":""},{"$f":"IF(ROW()-1>COUNTIF(Général!$G:$G,$B$1),\"\",INDEX(Général!$A:$G,MATCH($B$1&\"_\"&ROW()-1,Général!$H:$H,0),7))","v":""}]
[{"$f":"IF(ROW()-1>COUNTIF(Général!$G:$G,$B$1),\"\",INDEX(Général!$A:$G,MATCH($B$1&\"_\"&ROW()-1,Général!$H:$H,0),1))","v":""},{"$f":"IF(ROW()-1>COUNTIF(Général!$G:$G,$B$1),\"\",INDEX(Général!$A:$G,MATCH($B$1&\"_\"&ROW()-1,Général!$H:$H,0),2))","v":""},{"$f":"IF(ROW()-1>COUNTIF(Général!$G:$G,$B$1),\"\",INDEX(Général!$A:$G,MATCH($B$1&\"_\"&ROW()-1,Général!$H:$H,0),3))","v":""},{"$f":"IF(ROW()-1>COUNTIF(Général!$G:$G,$B$1),\"\",INDEX(Général!$A:$G,MATCH($B$1&\"_\"&ROW()-1,Général!$H:$H,0),4))","v":""},{"$f":"IF(ROW()-1>COUNTIF(Général!$G:$G,$B$1),\"\",INDEX(Général!$A:$G,MATCH($B$1&\"_\"&ROW()-1,Général!$H:$H,0),5))","v":""},{"$f":"IF(ROW()-1>COUNTIF(Général!$G:$G,$B$1),\"\",INDEX(Général!$A:$G,MATCH($B$1&\"_\"&ROW()-1,Général!$H:$H,0),6))","v":""},{"$f":"IF(ROW()-1>COUNTIF(Général!$G:$G,$B$1),\"\",INDEX(Général!$A:$G,MATCH($B$1&\"_\"&ROW()-1,Général!$H:$H,0),7))","v":""}]
[{"$f":"IF(ROW()-1>COUNTIF(Général!$G:$G,$B$1),\"\",INDEX(Général!$A:$G,MATCH($B$1&\"_\"&ROW()-1,Général!$H:$H,0),1))","v":""},{"$f":"IF(ROW()-1>COUNTIF(Général!$G:$G,$B$1),\"\",INDEX(Général!$A:$G,MATCH($B$1&\"_\"&ROW()-1,Général!$H:$H,0),2))","v":""},{"$f":"IF(ROW()-1>COUNTIF(Général!$G:$G,$B$1),\"\",INDEX(Général!$A:$G,MATCH($B$1&\"_\"&ROW()-1,Général!$H:$H,0),3))","v":""},{"$f":"IF(ROW()-1>COUNTIF(Général!$G:$G,$B$1),\"\",INDEX(Général!$A:$G,MATCH($B$1&\"_\"&ROW()-1,Général!$H:$H,0),4))","v":""},{"$f":"IF(ROW()-1>COUNTIF(Général!$G:$G,$B$1),\"\",INDEX(Général!$A:$G,MATCH($B$1&\"_\"&ROW()-1,Général!$H:$H,0),5))","v":""},{"$f":"IF(ROW()-1>COUNTIF(Général!$G:$G,$B$1),\"\",INDEX(Général!$A:$G,MATCH($B$1&\"_\"&ROW()-1,Général!$H:$H,0),6))","v":""},{"$f":"IF(ROW()-1>COUNTIF(Général!$G:$G,$B$1),\"\",INDEX(Général!$A:$G,MATCH($B$1&\"_\"&ROW()-1,Général!$H:$H,0),7))","v":""}]
[{"$f":"IF(ROW()-1>COUNTIF(Général!$G:$G,$B$1),\"\",INDEX(Général!$A:$G,MATCH($B$1&\"_\"&ROW()-1,Général!$H:$H,0),1))","v":""},{"$f":"IF(ROW()-1>COUNTIF(Général!$G:$G,$B$1),\"\",INDEX(Général!$A:$G,MATCH($B$1&\"_\"&ROW()-1,Général!$H:$H,0),2))","v":""},{"$f":"IF(ROW()-1>COUNTIF(Général!$G:$G,$B$1),\"\",INDEX(Général!$A:$G,MATCH($B$1&\"_\"&ROW()-1,Général!$H:$H,0),3))","v":""},{"$f":"IF(ROW()-1>COUNTIF(Général!$G:$G,$B$1),\"\",INDEX(Général!$A:$G,MATCH($B$1&\"_\"&ROW()-1,Général!$H:$H,0),4))","v":""},{"$f":"IF(ROW()-1>COUNTIF(Général!$G:$G,$B$1),\"\",INDEX(Général!$A:$G,MATCH($B$1&\"_\"&ROW()-1,Général!$H:$H,0),5))","v":""},{"$f":"IF(ROW()-1>COUNTIF(Général!$G:$G,$B$1),\"\",INDEX(Général!$A:$G,MATCH($B$1&\"_\"&ROW()-1,Général!$H:$H,0),6))","v":""},{"$f":"IF(ROW()-1>COUNTIF(Général!$G:$G,$B$1),\"\",INDEX(Général!$A:$G,MATCH($B$1&\"_\"&ROW()-1,Général!$H:$H,0),7))","v":""}]
[{"$f":"IF(ROW()-1>COUNTIF(Général!$G:$G,$B$1),\"\",INDEX(Général!$A:$G,MATCH($B$1&\"_\"&ROW()-1,Général!$H:$H,0),1))","v":""},{"$f":"IF(ROW()-1>COUNTIF(Général!$G:$G,$B$1),\"\",INDEX(Général!$A:$G,MATCH($B$1&\"_\"&ROW()-1,Général!$H:$H,0),2))","v":""},{"$f":"IF(ROW()-1>COUNTIF(Général!$G:$G,$B$1),\"\",INDEX(Général!$A:$G,MATCH($B$1&\"_\"&ROW()-1,Général!$H:$H,0),3))","v":""},{"$f":"IF(ROW()-1>COUNTIF(Général!$G:$G,$B$1),\"\",INDEX(Général!$A:$G,MATCH($B$1&\"_\"&ROW()-1,Général!$H:$H,0),4))","v":""},{"$f":"IF(ROW()-1>COUNTIF(Général!$G:$G,$B$1),\"\",INDEX(Général!$A:$G,MATCH($B$1&\"_\"&ROW()-1,Général!$H:$H,0),5))","v":""},{"$f":"IF(ROW()-1>COUNTIF(Général!$G:$G,$B$1),\"\",INDEX(Général!$A:$G,MATCH($B$1&\"_\"&ROW()-1,Général!$H:$H,0),6))","v":""},{"$f":"IF(ROW()-1>COUNTIF(Général!$G:$G,$B$1),\"\",INDEX(Général!$A:$G,MATCH($B$1&\"_\"&ROW()-1,Général!$H:$H,0),7))","v":""}]
[{"$f":"IF(ROW()-1>COUNTIF(Général!$G:$G,$B$1),\"\",INDEX(Général!$A:$G,MATCH($B$1&\"_\"&ROW()-1,Général!$H:$H,0),1))","v":""},{"$f":"IF(ROW()-1>COUNTIF(Général!$G:$G,$B$1),\"\",INDEX(Général!$A:$G,MATCH($B$1&\"_\"&ROW()-1,Général!$H:$H,0),2))","v":""},{"$f":"IF(ROW()-1>COUNTIF(Général!$G:$G,$B$1),\"\",INDEX(Général!$A:$G,MATCH($B$1&\"_\"&ROW()-1,Général!$H:$H,0),3))","v":""},{"$f":"IF(ROW()-1>COUNTIF(Général!$G:$G,$B$1),\"\",INDEX(Général!$A:$G,MATCH($B$1&\"_\"&ROW()-1,Général!$H:$H,0),4))","v":""},{"$f":"IF(ROW()-1>COUNTIF(Général!$G:$G,$B$1),\"\",INDEX(Général!$A:$G,MATCH($B$1&\"_\"&ROW()-1,Général!$H:$H,0),5))","v":""},{"$f":"IF(ROW()-1>COUNTIF(Général!$G:$G,$B$1),\"\",INDEX(Général!$A:$G,MATCH($B$1&\"_\"&ROW()-1,Général!$H:$H,0),6))","v":""},{"$f":"IF(ROW()-1>COUNTIF(Général!$G:$G,$B$1),\"\",INDEX(Général!$A:$G,MATCH($B$1&\"_\"&ROW()-1,Général!$H:$H,0),7))","v":""}]
[{"$f":"IF(ROW()-1>COUNTIF(Général!$G:$G,$B$1),\"\",INDEX(Général!$A:$G,MATCH($B$1&\"_\"&ROW()-1,Général!$H:$H,0),1))","v":""},{"$f":"IF(ROW()-1>COUNTIF(Général!$G:$G,$B$1),\"\",INDEX(Général!$A:$G,MATCH($B$1&\"_\"&ROW()-1,Général!$H:$H,0),2))","v":""},{"$f":"IF(ROW()-1>COUNTIF(Général!$G:$G,$B$1),\"\",INDEX(Général!$A:$G,MATCH($B$1&\"_\"&ROW()-1,Général!$H:$H,0),3))","v":""},{"$f":"IF(ROW()-1>COUNTIF(Général!$G:$G,$B$1),\"\",INDEX(Général!$A:$G,MATCH($B$1&\"_\"&ROW()-1,Général!$H:$H,0),4))","v":""},{"$f":"IF(ROW()-1>COUNTIF(Général!$G:$G,$B$1),\"\",INDEX(Général!$A:$G,MATCH($B$1&\"_\"&ROW()-1,Général!$H:$H,0),5))","v":""},{"$f":"IF(ROW()-1>COUNTIF(Général!$G:$G,$B$1),\"\",INDEX(Général!$A:$G,MATCH($B$1&\"_\"&ROW()-1,Général!$H:$H,0),6))","v":""},{"$f":"IF(ROW()-1>COUNTIF(Général!$G:$G,$B$1),\"\",INDEX(Général!$A:$G,MATCH($B$1&\"_\"&ROW()-1,Général!$H:$H,0),7))","v":""}]
[{"$f":"IF(ROW()-1>COUNTIF(Général!$G:$G,$B$1),\"\",INDEX(Général!$A:$G,MATCH($B$1&\"_\"&ROW()-1,Général!$H:$H,0),1))","v":""},{"$f":"IF(ROW()-1>COUNTIF(Général!$G:$G,$B$1),\"\",INDEX(Général!$A:$G,MATCH($B$1&\"_\"&ROW()-1,Général!$H:$H,0),2))","v":""},{"$f":"IF(ROW()-1>COUNTIF(Général!$G:$G,$B$1),\"\",INDEX(Général!$A:$G,MATCH($B$1&\"_\"&ROW()-1,Général!$H:$H,0),3))","v":""},{"$f":"IF(ROW()-1>COUNTIF(Général!$G:$G,$B$1),\"\",INDEX(Général!$A:$G,MATCH($B$1&\"_\"&ROW()-1,Général!$H:$H,0),4))","v":""},{"$f":"IF(ROW()-1>COUNTIF(Général!$G:$G,$B$1),\"\",INDEX(Général!$A:$G,MATCH($B$1&\"_\"&ROW()-1,Général!$H:$H,0),5))","v":""},{"$f":"IF(ROW()-1>COUNTIF(Général!$G:$G,$B$1),\"\",INDEX(Général!$A:$G,MATCH($B$1&\"_\"&ROW()-1,Général!$H:$H,0),6))","v":""},{"$f":"IF(ROW()-1>COUNTIF(Général!$G:$G,$B$1),\"\",INDEX(Général!$A:$G,MATCH($B$1&\"_\"&ROW()-1,Général!$H:$H,0),7))","v":""}]
[{"$f":"IF(ROW()-1>COUNTIF(Général!$G:$G,$B$1),\"\",INDEX(Général!$A:$G,MATCH($B$1&\"_\"&ROW()-1,Général!$H:$H,0),1))","v":""},{"$f":"IF(ROW()-1>COUNTIF(Général!$G:$G,$B$1),\"\",INDEX(Général!$A:$G,MATCH($B$1&\"_\"&ROW()-1,Général!$H:$H,0),2))","v":""},{"$f":"IF(ROW()-1>COUNTIF(Général!$G:$G,$B$1),\"\",INDEX(Général!$A:$G,MATCH($B$1&\"_\"&ROW()-1,Général!$H:$H,0),3))","v":""},{"$f":"IF(ROW()-1>COUNTIF(Général!$G:$G,$B$1),\"\",INDEX(Général!$A:$G,MATCH($B$1&\"_\"&ROW()-1,Général!$H:$H,0),4))","v":""},{"$f":"IF(ROW()-1>COUNTIF(Général!$G:$G,$B$1),\"\",INDEX(Général!$A:$G,MATCH($B$1&\"_\"&ROW()-1,Général!$H:$H,0),5))","v":""},{"$f":"IF(ROW()-1>COUNTIF(Général!$G:$G,$B$1),\"\",INDEX(Général!$A:$G,MATCH($B$1&\"_\"&ROW()-1,Général!$H:$H,0),6))","v":""},{"$f":"IF(ROW()-1>COUNTIF(Général!$G:$G,$B$1),\"\",INDEX(Général!$A:$G,MATCH($B$1&\"_\"&ROW()-1,Général!$H:$H,0),7))","v":""}]
[{"$f":"IF(ROW()-1>COUNTIF(Général!$G:$G,$B$1),\"\",INDEX(Général!$A:$G,MATCH($B$1&\"_\"&ROW()-1,Général!$H:$H,0),1))","v":""},{"$f":"IF(ROW()-1>COUNTIF(Général!$G:$G,$B$1),\"\",INDEX(Général!$A:$G,MATCH($B$1&\"_\"&ROW()-1,Général!$H:$H,0),2))","v":""},{"$f":"IF(ROW()-1>COUNTIF(Général!$G:$G,$B$1),\"\",INDEX(Général!$A:$G,MATCH($B$1&\"_\"&ROW()-1,Général!$H:$H,0),3))","v":""},{"$f":"IF(ROW()-1>COUNTIF(Général!$G:$G,$B$1),\"\",INDEX(Général!$A:$G,MATCH($B$1&\"_\"&ROW()-1,Général!$H:$H,0),4))","v":""},{"$f":"IF(ROW()-1>COUNTIF(Général!$G:$G,$B$1),\"\",INDEX(Général!$A:$G,MATCH($B$1&\"_\"&ROW()-1,Général!$H:$H,0),5))","v":""},{"$f":"IF(ROW()-1>COUNTIF(Général!$G:$G,$B$1),\"\",INDEX(Général!$A:$G,MATCH($B$1&\"_\"&ROW()-1,Général!$H:$H,0),6))","v":""},{"$f":"IF(ROW()-1>COUNTIF(Général!$G:$G,$B$1),\"\",INDEX(Général!$A:$G,MATCH($B$1&\"_\"&ROW()-1,Général!$H:$H,0),7))","v":""}]

{"sheet":"C2","index":2,"n_rows":30,"n_cols":7,"rows_kept":30,"cut":false,"hidden":false,"merged":[]}
["Cotation ","C2"]
[{"$f":"IF(ROW()-1>COUNTIF(Général!$G:$G,$B$1),\"\",INDEX(Général!$A:$G,MATCH($B$1&\"_\"&ROW()-1,Général!$H:$H,0),1))","v":"Paul"},{"$f":"IF(ROW()-1>COUNTIF(Général!$G:$G,$B$1),\"\",INDEX(Général!$A:$G,MATCH($B$1&\"_\"&ROW()-1,Général!$H:$H,0),2))","v":"Orme"},{"$f":"IF(ROW()-1>COUNTIF(Général!$G:$G,$B$1),\"\",INDEX(Général!$A:$G,MATCH($B$1&\"_\"&ROW()-1,Général!$H:$H,0),3))","v":"Lyon"},{"$f":"IF(ROW()-1>COUNTIF(Général!$G:$G,$B$1),\"\",INDEX(Général!$A:$G,MATCH($B$1&\"_\"&ROW()-1,Général!$H:$H,0),4))","v":"Azur"},{"$f":"IF(ROW()-1>COUNTIF(Général!$G:$G,$B$1),\"\",INDEX(Général!$A:$G,MATCH($B$1&\"_\"&ROW()-1,Général!$H:$H,0),5))","v":"Durand"},{"$f":"IF(ROW()-1>COUNTIF(Général!$G:$G,$B$1),\"\",INDEX(Général!$A:$G,MATCH($B$1&\"_\"&ROW()-1,Général!$H:$H,0),6))","v":"Poire"},{"$f":"IF(ROW()-1>COUNTIF(Général!$G:$G,$B$1),\"\",INDEX(Général!$A:$G,MATCH($B$1&\"_\"&ROW()-1,Général!$H:$H,0),7))","v":"C2"}]
[{"$f":"IF(ROW()-1>COUNTIF(Général!$G:$G,$B$1),\"\",INDEX(Général!$A:$G,MATCH($B$1&\"_\"&ROW()-1,Général!$H:$H,0),1))","v":"André"},{"$f":"IF(ROW()-1>COUNTIF(Général!$G:$G,$B$1),\"\",INDEX(Général!$A:$G,MATCH($B$1&\"_\"&ROW()-1,Général!$H:$H,0),2))","v":"Frêne"},{"$f":"IF(ROW()-1>COUNTIF(Général!$G:$G,$B$1),\"\",INDEX(Général!$A:$G,MATCH($B$1&\"_\"&ROW()-1,Général!$H:$H,0),3))","v":"Bordeaux"},{"$f":"IF(ROW()-1>COUNTIF(Général!$G:$G,$B$1),\"\",INDEX(Général!$A:$G,MATCH($B$1&\"_\"&ROW()-1,Général!$H:$H,0),4))","v":"Jaune"},{"$f":"IF(ROW()-1>COUNTIF(Général!$G:$G,$B$1),\"\",INDEX(Général!$A:$G,MATCH($B$1&\"_\"&ROW()-1,Général!$H:$H,0),5))","v":"Rodrigues"},{"$f":"IF(ROW()-1>COUNTIF(Général!$G:$G,$B$1),\"\",INDEX(Général!$A:$G,MATCH($B$1&\"_\"&ROW()-1,Général!$H:$H,0),6))","v":"Prune"},{"$f":"IF(ROW()-1>COUNTIF(Général!$G:$G,$B$1),\"\",INDEX(Général!$A:$G,MATCH($B$1&\"_\"&ROW()-1,Général!$H:$H,0),7))","v":"C2"}]
[{"$f":"IF(ROW()-1>COUNTIF(Général!$G:$G,$B$1),\"\",INDEX(Général!$A:$G,MATCH($B$1&\"_\"&ROW()-1,Général!$H:$H,0),1))","v":"Léa"},{"$f":"IF(ROW()-1>COUNTIF(Général!$G:$G,$B$1),\"\",INDEX(Général!$A:$G,MATCH($B$1&\"_\"&ROW()-1,Général!$H:$H,0),2))","v":"Pin"},{"$f":"IF(ROW()-1>COUNTIF(Général!$G:$G,$B$1),\"\",INDEX(Général!$A:$G,MATCH($B$1&\"_\"&ROW()-1,Général!$H:$H,0),3))","v":"Calais"},{"$f":"IF(ROW()-1>COUNTIF(Général!$G:$G,$B$1),\"\",INDEX(Général!$A:$G,MATCH($B$1&\"_\"&ROW()-1,Général!$H:$H,0),4))","v":"Marron"},{"$f":"IF(ROW()-1>COUNTIF(Général!$G:$G,$B$1),\"\",INDEX(Général!$A:$G,MATCH($B$1&\"_\"&ROW()-1,Général!$H:$H,0),5))","v":"Born"},{"$f":"IF(ROW()-1>COUNTIF(Général!$G:$G,$B$1),\"\",INDEX(Général!$A:$G,MATCH($B$1&\"_\"&ROW()-1,Général!$H:$H,0),6))","v":"Pêche"},{"$f":"IF(ROW()-1>COUNTIF(Général!$G:$G,$B$1),\"\",INDEX(Général!$A:$G,MATCH($B$1&\"_\"&ROW()-1,Général!$H:$H,0),7))","v":"C2"}]
[{"$f":"IF(ROW()-1>COUNTIF(Général!$G:$G,$B$1),\"\",INDEX(Général!$A:$G,MATCH($B$1&\"_\"&ROW()-1,Général!$H:$H,0),1))","v":"Gilles"},{"$f":"IF(ROW()-1>COUNTIF(Général!$G:$G,$B$1),\"\",INDEX(Général!$A:$G,MATCH($B$1&\"_\"&ROW()-1,Général!$H:$H,0),2))","v":"Murier"},{"$f":"IF(ROW()-1>COUNTIF(Général!$G:$G,$B$1),\"\",INDEX(Général!$A:$G,MATCH($B$1&\"_\"&ROW()-1,Général!$H:$H,0),3))","v":"Briançon"},{"$f":"IF(ROW()-1>COUNTIF(Général!$G:$G,$B$1),\"\",INDEX(Général!$A:$G,MATCH($B$1&\"_\"&ROW()-1,Général!$H:$H,0),4))","v":"Vert"},{"$f":"IF(ROW()-1>COUNTIF(Général!$G:$G,$B$1),\"\",INDEX(Général!$A:$G,MATCH($B$1&\"_\"&ROW()-1,Général!$H:$H,0),5))","v":"Xamena"},{"$f":"IF(ROW()-1>COUNTIF(Général!$G:$G,$B$1),\"\",INDEX(Général!$A:$G,MATCH($B$1&\"_\"&ROW()-1,Général!$H:$H,0),6))","v":"Cassis"},{"$f":"IF(ROW()-1>COUNTIF(Général!$G:$G,$B$1),\"\",INDEX(Général!$A:$G,MATCH($B$1&\"_\"&ROW()-1,Général!$H:$H,0),7))","v":"C2"}]
[{"$f":"IF(ROW()-1>COUNTIF(Général!$G:$G,$B$1),\"\",INDEX(Général!$A:$G,MATCH($B$1&\"_\"&ROW()-1,Général!$H:$H,0),1))","v":"Jacqueline"},{"$f":"IF(ROW()-1>COUNTIF(Général!$G:$G,$B$1),\"\",INDEX(Général!$A:$G,MATCH($B$1&\"_\"&ROW()-1,Général!$H:$H,0),2))","v":"Olivier"},{"$f":"IF(ROW()-1>COUNTIF(Général!$G:$G,$B$1),\"\",INDEX(Général!$A:$G,MATCH($B$1&\"_\"&ROW()-1,Général!$H:$H,0),3))","v":"Nice"},{"$f":"IF(ROW()-1>COUNTIF(Général!$G:$G,$B$1),\"\",INDEX(Général!$A:$G,MATCH($B$1&\"_\"&ROW()-1,Général!$H:$H,0),4))","v":"Carmin"},{"$f":"IF(ROW()-1>COUNTIF(Général!$G:$G,$B$1),\"\",INDEX(Général!$A:$G,MATCH($B$1&\"_\"&ROW()-1,Général!$H:$H,0),5))","v":"Guiget"},{"$f":"IF(ROW()-1>COUNTIF(Général!$G:$G,$B$1),\"\",INDEX(Général!$A:$G,MATCH($B$1&\"_\"&ROW()-1,Général!$H:$H,0),6))","v":"Groseille"},{"$f":"IF(ROW()-1>COUNTIF(Général!$G:$G,$B$1),\"\",INDEX(Général!$A:$G,MATCH($B$1&\"_\"&ROW()-1,Général!$H:$H,0),7))","v":"C2"}]
[{"$f":"IF(ROW()-1>COUNTIF(Général!$G:$G,$B$1),\"\",INDEX(Général!$A:$G,MATCH($B$1&\"_\"&ROW()-1,Général!$H:$H,0),1))","v":"Michel"},{"$f":"IF(ROW()-1>COUNTIF(Général!$G:$G,$B$1),\"\",INDEX(Général!$A:$G,MATCH($B$1&\"_\"&ROW()-1,Général!$H:$H,0),2))","v":"Hêtre"},{"$f":"IF(ROW()-1>COUNTIF(Général!$G:$G,$B$1),\"\",INDEX(Général!$A:$G,MATCH($B$1&\"_\"&ROW()-1,Général!$H:$H,0),3))","v":"Pau"},{"$f":"IF(ROW()-1>COUNTIF(Général!$G:$G,$B$1),\"\",INDEX(Général!$A:$G,MATCH($B$1&\"_\"&ROW()-1,Général!$H:$H,0),4))","v":"Beige"},{"$f":"IF(ROW()-1>COUNTIF(Général!$G:$G,$B$1),\"\",INDEX(Général!$A:$G,MATCH($B$1&\"_\"&ROW()-1,Général!$H:$H,0),5))","v":"Haumal"},{"$f":"IF(ROW()-1>COUNTIF(Général!$G:$G,$B$1),\"\",INDEX(Général!$A:$G,MATCH($B$1&\"_\"&ROW()-1,Général!$H:$H,0),6))","v":"Fraise"},{"$f":"IF(ROW()-1>COUNTIF(Général!$G:$G,$B$1),\"\",INDEX(Général!$A:$G,MATCH($B$1&\"_\"&ROW()-1,Général!$H:$H,0),7))","v":"C2"}]
[{"$f":"IF(ROW()-1>COUNTIF(Général!$G:$G,$B$1),\"\",INDEX(Général!$A:$G,MATCH($B$1&\"_\"&ROW()-1,Général!$H:$H,0),1))","v":"Frédéric"},{"$f":"IF(ROW()-1>COUNTIF(Général!$G:$G,$B$1),\"\",INDEX(Général!$A:$G,MATCH($B$1&\"_\"&ROW()-1,Général!$H:$H,0),2))","v":"Baobab"},{"$f":"IF(ROW()-1>COUNTIF(Général!$G:$G,$B$1),\"\",INDEX(Général!$A:$G,MATCH($B$1&\"_\"&ROW()-1,Général!$H:$H,0),3))","v":"Clermont-Ferrand"},{"$f":"IF(ROW()-1>COUNTIF(Général!$G:$G,$B$1),\"\",INDEX(Général!$A:$G,MATCH($B$1&\"_\"&ROW()-1,Général!$H:$H,0),4))","v":"Cyan"},{"$f":"IF(ROW()-1>COUNTIF(Général!$G:$G,$B$1),\"\",INDEX(Général!$A:$G,MATCH($B$1&\"_\"&ROW()-1,Général!$H:$H,0),5))","v":"Exator"},{"$f":"IF(ROW()-1>COUNTIF(Général!$G:$G,$B$1),\"\",INDEX(Général!$A:$G,MATCH($B$1&\"_\"&ROW()-1,Général!$H:$H,0),6))","v":"Mangue"},{"$f":"IF(ROW()-1>COUNTIF(Général!$G:$G,$B$1),\"\",INDEX(Général!$A:$G,MATCH($B$1&\"_\"&ROW()-1,Général!$H:$H,0),7))","v":"C2"}]
[{"$f":"IF(ROW()-1>COUNTIF(Général!$G:$G,$B$1),\"\",INDEX(Général!$A:$G,MATCH($B$1&\"_\"&ROW()-1,Général!$H:$H,0),1))","v":"Eugénie"},{"$f":"IF(ROW()-1>COUNTIF(Général!$G:$G,$B$1),\"\",INDEX(Général!$A:$G,MATCH($B$1&\"_\"&ROW()-1,Général!$H:$H,0),2))","v":"Palmier"},{"$f":"IF(ROW()-1>COUNTIF(Général!$G:$G,$B$1),\"\",INDEX(Général!$A:$G,MATCH($B$1&\"_\"&ROW()-1,Général!$H:$H,0),3))","v":"Montpellier"},{"$f":"IF(ROW()-1>COUNTIF(Général!$G:$G,$B$1),\"\",INDEX(Général!$A:$G,MATCH($B$1&\"_\"&ROW()-1,Général!$H:$H,0),4))","v":"Blanc"},{"$f":"IF(ROW()-1>COUNTIF(Général!$G:$G,$B$1),\"\",INDEX(Général!$A:$G,MATCH($B$1&\"_\"&ROW()-1,Général!$H:$H,0),5))","v":"Isidon"},{"$f":"IF(ROW()-1>COUNTIF(Général!$G:$G,$B$1),\"\",INDEX(Général!$A:$G,MATCH($B$1&\"_\"&ROW()-1,Général!$H:$H,0),6))","v":"Mandarine"},{"$f":"IF(ROW()-1>COUNTIF(Général!$G:$G,$B$1),\"\",INDEX(Général!$A:$G,MATCH($B$1&\"_\"&ROW()-1,Général!$H:$H,0),7))","v":"C2"}]
[{"$f":"IF(ROW()-1>COUNTIF(Général!$G:$G,$B$1),\"\",INDEX(Général!$A:$G,MATCH($B$1&\"_\"&ROW()-1,Général!$H:$H,0),1))","v":"Jean"},{"$f":"IF(ROW()-1>COUNTIF(Général!$G:$G,$B$1),\"\",INDEX(Général!$A:$G,MATCH($B$1&\"_\"&ROW()-1,Général!$H:$H,0),2))","v":"Cyprés"},{"$f":"IF(ROW()-1>COUNTIF(Général!$G:$G,$B$1),\"\",INDEX(Général!$A:$G,MATCH($B$1&\"_\"&ROW()-1,Général!$H:$H,0),3))","v":"Poitier"},{"$f":"IF(ROW()-1>COUNTIF(Général!$G:$G,$B$1),\"\",INDEX(Général!$A:$G,MATCH($B$1&\"_\"&ROW()-1,Général!$H:$H,0),4))","v":"Violet"},{"$f":"IF(ROW()-1>COUNTIF(Général!$G:$G,$B$1),\"\",INDEX(Général!$A:$G,MATCH($B$1&\"_\"&ROW()-1,Général!$H:$H,0),5))","v":"Lugani"},{"$f":"IF(ROW()-1>COUNTIF(Général!$G:$G,$B$1),\"\",INDEX(Général!$A:$G,MATCH($B$1&\"_\"&ROW()-1,Général!$H:$H,0),6))","v":"Mirabelle"},{"$f":"IF(ROW()-1>COUNTIF(Général!$G:$G,$B$1),\"\",INDEX(Général!$A:$G,MATCH($B$1&\"_\"&ROW()-1,Général!$H:$H,0),7))","v":"C2"}]
[{"$f":"IF(ROW()-1>COUNTIF(Général!$G:$G,$B$1),\"\",INDEX(Général!$A:$G,MATCH($B$1&\"_\"&ROW()-1,Général!$H:$H,0),1))","v":"Jacques"},{"$f":"IF(ROW()-1>COUNTIF(Général!$G:$G,$B$1),\"\",INDEX(Général!$A:$G,MATCH($B$1&\"_\"&ROW()-1,Général!$H:$H,0),2))","v":"If"},{"$f":"IF(ROW()-1>COUNTIF(Général!$G:$G,$B$1),\"\",INDEX(Général!$A:$G,MATCH($B$1&\"_\"&ROW()-1,Général!$H:$H,0),3))","v":"Soisson"},{"$f":"IF(ROW()-1>COUNTIF(Général!$G:$G,$B$1),\"\",INDEX(Général!$A:$G,MATCH($B$1&\"_\"&ROW()-1,Général!$H:$H,0),4))","v":"Saumon"},{"$f":"IF(ROW()-1>COUNTIF(Général!$G:$G,$B$1),\"\",INDEX(Général!$A:$G,MATCH($B$1&\"_\"&ROW()-1,Général!$H:$H,0),5))","v":"Marvel"},{"$f":"IF(ROW()-1>COUNTIF(Général!$G:$G,$B$1),\"\",INDEX(Général!$A:$G,MATCH($B$1&\"_\"&ROW()-1,Général!$H:$H,0),6))","v":"Pastèque"},{"$f":"IF(ROW()-1>COUNTIF(Général!$G:$G,$B$1),\"\",INDEX(Général!$A:$G,MATCH($B$1&\"_\"&ROW()-1,Général!$H:$H,0),7))","v":"C2"}]
[{"$f":"IF(ROW()-1>COUNTIF(Général!$G:$G,$B$1),\"\",INDEX(Général!$A:$G,MATCH($B$1&\"_\"&ROW()-1,Général!$H:$H,0),1))","v":"Annie"},{"$f":"IF(ROW()-1>COUNTIF(Général!$G:$G,$B$1),\"\",INDEX(Général!$A:$G,MATCH($B$1&\"_\"&ROW()-1,Général!$H:$H,0),2))","v":"Tuyas"},{"$f":"IF(ROW()-1>COUNTIF(Général!$G:$G,$B$1),\"\",INDEX(Général!$A:$G,MATCH($B$1&\"_\"&ROW()-1,Général!$H:$H,0),3))","v":"Compiègne"},{"$f":"IF(ROW()-1>COUNTIF(Général!$G:$G,$B$1),\"\",INDEX(Général!$A:$G,MATCH($B$1&\"_\"&ROW()-1,Général!$H:$H,0),4))","v":"Chrome"},{"$f":"IF(ROW()-1>COUNTIF(Général!$G:$G,$B$1),\"\",INDEX(Général!$A:$G,MATCH($B$1&\"_\"&ROW()-1,Général!$H:$H,0),5))","v":"Partena"},{"$f":"IF(ROW()-1>COUNTIF(Général!$G:$G,$B$1),\"\",INDEX(Général!$A:$G,MATCH($B$1&\"_\"&ROW()-1,Général!$H:$H,0),6))","v":"Papaye"},{"$f":"IF(ROW()-1>COUNTIF(Général!$G:$G,$B$1),\"\",INDEX(Général!$A:$G,MATCH($B$1&\"_\"&ROW()-1,Général!$H:$H,0),7))","v":"C2"}]
[{"$f":"IF(ROW()-1>COUNTIF(Général!$G:$G,$B$1),\"\",INDEX(Général!$A:$G,MATCH($B$1&\"_\"&ROW()-1,Général!$H:$H,0),1))","v":""},{"$f":"IF(ROW()-1>COUNTIF(Général!$G:$G,$B$1),\"\",INDEX(Général!$A:$G,MATCH($B$1&\"_\"&ROW()-1,Général!$H:$H,0),2))","v":""},{"$f":"IF(ROW()-1>COUNTIF(Général!$G:$G,$B$1),\"\",INDEX(Général!$A:$G,MATCH($B$1&\"_\"&ROW()-1,Général!$H:$H,0),3))","v":""},{"$f":"IF(ROW()-1>COUNTIF(Général!$G:$G,$B$1),\"\",INDEX(Général!$A:$G,MATCH($B$1&\"_\"&ROW()-1,Général!$H:$H,0),4))","v":""},{"$f":"IF(ROW()-1>COUNTIF(Général!$G:$G,$B$1),\"\",INDEX(Général!$A:$G,MATCH($B$1&\"_\"&ROW()-1,Général!$H:$H,0),5))","v":""},{"$f":"IF(ROW()-1>COUNTIF(Général!$G:$G,$B$1),\"\",INDEX(Général!$A:$G,MATCH($B$1&\"_\"&ROW()-1,Général!$H:$H,0),6))","v":""},{"$f":"IF(ROW()-1>COUNTIF(Général!$G:$G,$B$1),\"\",INDEX(Général!$A:$G,MATCH($B$1&\"_\"&ROW()-1,Général!$H:$H,0),7))","v":""}]
[{"$f":"IF(ROW()-1>COUNTIF(Général!$G:$G,$B$1),\"\",INDEX(Général!$A:$G,MATCH($B$1&\"_\"&ROW()-1,Général!$H:$H,0),1))","v":""},{"$f":"IF(ROW()-1>COUNTIF(Général!$G:$G,$B$1),\"\",INDEX(Général!$A:$G,MATCH($B$1&\"_\"&ROW()-1,Général!$H:$H,0),2))","v":""},{"$f":"IF(ROW()-1>COUNTIF(Général!$G:$G,$B$1),\"\",INDEX(Général!$A:$G,MATCH($B$1&\"_\"&ROW()-1,Général!$H:$H,0),3))","v":""},{"$f":"IF(ROW()-1>COUNTIF(Général!$G:$G,$B$1),\"\",INDEX(Général!$A:$G,MATCH($B$1&\"_\"&ROW()-1,Général!$H:$H,0),4))","v":""},{"$f":"IF(ROW()-1>COUNTIF(Général!$G:$G,$B$1),\"\",INDEX(Général!$A:$G,MATCH($B$1&\"_\"&ROW()-1,Général!$H:$H,0),5))","v":""},{"$f":"IF(ROW()-1>COUNTIF(Général!$G:$G,$B$1),\"\",INDEX(Général!$A:$G,MATCH($B$1&\"_\"&ROW()-1,Général!$H:$H,0),6))","v":""},{"$f":"IF(ROW()-1>COUNTIF(Général!$G:$G,$B$1),\"\",INDEX(Général!$A:$G,MATCH($B$1&\"_\"&ROW()-1,Général!$H:$H,0),7))","v":""}]
[{"$f":"IF(ROW()-1>COUNTIF(Général!$G:$G,$B$1),\"\",INDEX(Général!$A:$G,MATCH($B$1&\"_\"&ROW()-1,Général!$H:$H,0),1))","v":""},{"$f":"IF(ROW()-1>COUNTIF(Général!$G:$G,$B$1),\"\",INDEX(Général!$A:$G,MATCH($B$1&\"_\"&ROW()-1,Général!$H:$H,0),2))","v":""},{"$f":"IF(ROW()-1>COUNTIF(Général!$G:$G,$B$1),\"\",INDEX(Général!$A:$G,MATCH($B$1&\"_\"&ROW()-1,Général!$H:$H,0),3))","v":""},{"$f":"IF(ROW()-1>COUNTIF(Général!$G:$G,$B$1),\"\",INDEX(Général!$A:$G,MATCH($B$1&\"_\"&ROW()-1,Général!$H:$H,0),4))","v":""},{"$f":"IF(ROW()-1>COUNTIF(Général!$G:$G,$B$1),\"\",INDEX(Général!$A:$G,MATCH($B$1&\"_\"&ROW()-1,Général!$H:$H,0),5))","v":""},{"$f":"IF(ROW()-1>COUNTIF(Général!$G:$G,$B$1),\"\",INDEX(Général!$A:$G,MATCH($B$1&\"_\"&ROW()-1,Général!$H:$H,0),6))","v":""},{"$f":"IF(ROW()-1>COUNTIF(Général!$G:$G,$B$1),\"\",INDEX(Général!$A:$G,MATCH($B$1&\"_\"&ROW()-1,Général!$H:$H,0),7))","v":""}]
[{"$f":"IF(ROW()-1>COUNTIF(Général!$G:$G,$B$1),\"\",INDEX(Général!$A:$G,MATCH($B$1&\"_\"&ROW()-1,Général!$H:$H,0),1))","v":""},{"$f":"IF(ROW()-1>COUNTIF(Général!$G:$G,$B$1),\"\",INDEX(Général!$A:$G,MATCH($B$1&\"_\"&ROW()-1,Général!$H:$H,0),2))","v":""},{"$f":"IF(ROW()-1>COUNTIF(Général!$G:$G,$B$1),\"\",INDEX(Général!$A:$G,MATCH($B$1&\"_\"&ROW()-1,Général!$H:$H,0),3))","v":""},{"$f":"IF(ROW()-1>COUNTIF(Général!$G:$G,$B$1),\"\",INDEX(Général!$A:$G,MATCH($B$1&\"_\"&ROW()-1,Général!$H:$H,0),4))","v":""},{"$f":"IF(ROW()-1>COUNTIF(Général!$G:$G,$B$1),\"\",INDEX(Général!$A:$G,MATCH($B$1&\"_\"&ROW()-1,Général!$H:$H,0),5))","v":""},{"$f":"IF(ROW()-1>COUNTIF(Général!$G:$G,$B$1),\"\",INDEX(Général!$A:$G,MATCH($B$1&\"_\"&ROW()-1,Général!$H:$H,0),6))","v":""},{"$f":"IF(ROW()-1>COUNTIF(Général!$G:$G,$B$1),\"\",INDEX(Général!$A:$G,MATCH($B$1&\"_\"&ROW()-1,Général!$H:$H,0),7))","v":""}]
[{"$f":"IF(ROW()-1>COUNTIF(Général!$G:$G,$B$1),\"\",INDEX(Général!$A:$G,MATCH($B$1&\"_\"&ROW()-1,Général!$H:$H,0),1))","v":""},{"$f":"IF(ROW()-1>COUNTIF(Général!$G:$G,$B$1),\"\",INDEX(Général!$A:$G,MATCH($B$1&\"_\"&ROW()-1,Général!$H:$H,0),2))","v":""},{"$f":"IF(ROW()-1>COUNTIF(Général!$G:$G,$B$1),\"\",INDEX(Général!$A:$G,MATCH($B$1&\"_\"&ROW()-1,Général!$H:$H,0),3))","v":""},{"$f":"IF(ROW()-1>COUNTIF(Général!$G:$G,$B$1),\"\",INDEX(Général!$A:$G,MATCH($B$1&\"_\"&ROW()-1,Général!$H:$H,0),4))","v":""},{"$f":"IF(ROW()-1>COUNTIF(Général!$G:$G,$B$1),\"\",INDEX(Général!$A:$G,MATCH($B$1&\"_\"&ROW()-1,Général!$H:$H,0),5))","v":""},{"$f":"IF(ROW()-1>COUNTIF(Général!$G:$G,$B$1),\"\",INDEX(Général!$A:$G,MATCH($B$1&\"_\"&ROW()-1,Général!$H:$H,0),6))","v":""},{"$f":"IF(ROW()-1>COUNTIF(Général!$G:$G,$B$1),\"\",INDEX(Général!$A:$G,MATCH($B$1&\"_\"&ROW()-1,Général!$H:$H,0),7))","v":""}]
[{"$f":"IF(ROW()-1>COUNTIF(Général!$G:$G,$B$1),\"\",INDEX(Général!$A:$G,MATCH($B$1&\"_\"&ROW()-1,Général!$H:$H,0),1))","v":""},{"$f":"IF(ROW()-1>COUNTIF(Général!$G:$G,$B$1),\"\",INDEX(Général!$A:$G,MATCH($B$1&\"_\"&ROW()-1,Général!$H:$H,0),2))","v":""},{"$f":"IF(ROW()-1>COUNTIF(Général!$G:$G,$B$1),\"\",INDEX(Général!$A:$G,MATCH($B$1&\"_\"&ROW()-1,Général!$H:$H,0),3))","v":""},{"$f":"IF(ROW()-1>COUNTIF(Général!$G:$G,$B$1),\"\",INDEX(Général!$A:$G,MATCH($B$1&\"_\"&ROW()-1,Général!$H:$H,0),4))","v":""},{"$f":"IF(ROW()-1>COUNTIF(Général!$G:$G,$B$1),\"\",INDEX(Général!$A:$G,MATCH($B$1&\"_\"&ROW()-1,Général!$H:$H,0),5))","v":""},{"$f":"IF(ROW()-1>COUNTIF(Général!$G:$G,$B$1),\"\",INDEX(Général!$A:$G,MATCH($B$1&\"_\"&ROW()-1,Général!$H:$H,0),6))","v":""},{"$f":"IF(ROW()-1>COUNTIF(Général!$G:$G,$B$1),\"\",INDEX(Général!$A:$G,MATCH($B$1&\"_\"&ROW()-1,Général!$H:$H,0),7))","v":""}]
[{"$f":"IF(ROW()-1>COUNTIF(Général!$G:$G,$B$1),\"\",INDEX(Général!$A:$G,MATCH($B$1&\"_\"&ROW()-1,Général!$H:$H,0),1))","v":""},{"$f":"IF(ROW()-1>COUNTIF(Général!$G:$G,$B$1),\"\",INDEX(Général!$A:$G,MATCH($B$1&\"_\"&ROW()-1,Général!$H:$H,0),2))","v":""},{"$f":"IF(ROW()-1>COUNTIF(Général!$G:$G,$B$1),\"\",INDEX(Général!$A:$G,MATCH($B$1&\"_\"&ROW()-1,Général!$H:$H,0),3))","v":""},{"$f":"IF(ROW()-1>COUNTIF(Général!$G:$G,$B$1),\"\",INDEX(Général!$A:$G,MATCH($B$1&\"_\"&ROW()-1,Général!$H:$H,0),4))","v":""},{"$f":"IF(ROW()-1>COUNTIF(Général!$G:$G,$B$1),\"\",INDEX(Général!$A:$G,MATCH($B$1&\"_\"&ROW()-1,Général!$H:$H,0),5))","v":""},{"$f":"IF(ROW()-1>COUNTIF(Général!$G:$G,$B$1),\"\",INDEX(Général!$A:$G,MATCH($B$1&\"_\"&ROW()-1,Général!$H:$H,0),6))","v":""},{"$f":"IF(ROW()-1>COUNTIF(Général!$G:$G,$B$1),\"\",INDEX(Général!$A:$G,MATCH($B$1&\"_\"&ROW()-1,Général!$H:$H,0),7))","v":""}]
[{"$f":"IF(ROW()-1>COUNTIF(Général!$G:$G,$B$1),\"\",INDEX(Général!$A:$G,MATCH($B$1&\"_\"&ROW()-1,Général!$H:$H,0),1))","v":""},{"$f":"IF(ROW()-1>COUNTIF(Général!$G:$G,$B$1),\"\",INDEX(Général!$A:$G,MATCH($B$1&\"_\"&ROW()-1,Général!$H:$H,0),2))","v":""},{"$f":"IF(ROW()-1>COUNTIF(Général!$G:$G,$B$1),\"\",INDEX(Général!$A:$G,MATCH($B$1&\"_\"&ROW()-1,Général!$H:$H,0),3))","v":""},{"$f":"IF(ROW()-1>COUNTIF(Général!$G:$G,$B$1),\"\",INDEX(Général!$A:$G,MATCH($B$1&\"_\"&ROW()-1,Général!$H:$H,0),4))","v":""},{"$f":"IF(ROW()-1>COUNTIF(Général!$G:$G,$B$1),\"\",INDEX(Général!$A:$G,MATCH($B$1&\"_\"&ROW()-1,Général!$H:$H,0),5))","v":""},{"$f":"IF(ROW()-1>COUNTIF(Général!$G:$G,$B$1),\"\",INDEX(Général!$A:$G,MATCH($B$1&\"_\"&ROW()-1,Général!$H:$H,0),6))","v":""},{"$f":"IF(ROW()-1>COUNTIF(Général!$G:$G,$B$1),\"\",INDEX(Général!$A:$G,MATCH($B$1&\"_\"&ROW()-1,Général!$H:$H,0),7))","v":""}]
[{"$f":"IF(ROW()-1>COUNTIF(Général!$G:$G,$B$1),\"\",INDEX(Général!$A:$G,MATCH($B$1&\"_\"&ROW()-1,Général!$H:$H,0),1))","v":""},{"$f":"IF(ROW()-1>COUNTIF(Général!$G:$G,$B$1),\"\",INDEX(Général!$A:$G,MATCH($B$1&\"_\"&ROW()-1,Général!$H:$H,0),2))","v":""},{"$f":"IF(ROW()-1>COUNTIF(Général!$G:$G,$B$1),\"\",INDEX(Général!$A:$G,MATCH($B$1&\"_\"&ROW()-1,Général!$H:$H,0),3))","v":""},{"$f":"IF(ROW()-1>COUNTIF(Général!$G:$G,$B$1),\"\",INDEX(Général!$A:$G,MATCH($B$1&\"_\"&ROW()-1,Général!$H:$H,0),4))","v":""},{"$f":"IF(ROW()-1>COUNTIF(Général!$G:$G,$B$1),\"\",INDEX(Général!$A:$G,MATCH($B$1&\"_\"&ROW()-1,Général!$H:$H,0),5))","v":""},{"$f":"IF(ROW()-1>COUNTIF(Général!$G:$G,$B$1),\"\",INDEX(Général!$A:$G,MATCH($B$1&\"_\"&ROW()-1,Général!$H:$H,0),6))","v":""},{"$f":"IF(ROW()-1>COUNTIF(Général!$G:$G,$B$1),\"\",INDEX(Général!$A:$G,MATCH($B$1&\"_\"&ROW()-1,Général!$H:$H,0),7))","v":""}]
[{"$f":"IF(ROW()-1>COUNTIF(Général!$G:$G,$B$1),\"\",INDEX(Général!$A:$G,MATCH($B$1&\"_\"&ROW()-1,Général!$H:$H,0),1))","v":""},{"$f":"IF(ROW()-1>COUNTIF(Général!$G:$G,$B$1),\"\",INDEX(Général!$A:$G,MATCH($B$1&\"_\"&ROW()-1,Général!$H:$H,0),2))","v":""},{"$f":"IF(ROW()-1>COUNTIF(Général!$G:$G,$B$1),\"\",INDEX(Général!$A:$G,MATCH($B$1&\"_\"&ROW()-1,Général!$H:$H,0),3))","v":""},{"$f":"IF(ROW()-1>COUNTIF(Général!$G:$G,$B$1),\"\",INDEX(Général!$A:$G,MATCH($B$1&\"_\"&ROW()-1,Général!$H:$H,0),4))","v":""},{"$f":"IF(ROW()-1>COUNTIF(Général!$G:$G,$B$1),\"\",INDEX(Général!$A:$G,MATCH($B$1&\"_\"&ROW()-1,Général!$H:$H,0),5))","v":""},{"$f":"IF(ROW()-1>COUNTIF(Général!$G:$G,$B$1),\"\",INDEX(Général!$A:$G,MATCH($B$1&\"_\"&ROW()-1,Général!$H:$H,0),6))","v":""},{"$f":"IF(ROW()-1>COUNTIF(Général!$G:$G,$B$1),\"\",INDEX(Général!$A:$G,MATCH($B$1&\"_\"&ROW()-1,Général!$H:$H,0),7))","v":""}]
[{"$f":"IF(ROW()-1>COUNTIF(Général!$G:$G,$B$1),\"\",INDEX(Général!$A:$G,MATCH($B$1&\"_\"&ROW()-1,Général!$H:$H,0),1))","v":""},{"$f":"IF(ROW()-1>COUNTIF(Général!$G:$G,$B$1),\"\",INDEX(Général!$A:$G,MATCH($B$1&\"_\"&ROW()-1,Général!$H:$H,0),2))","v":""},{"$f":"IF(ROW()-1>COUNTIF(Général!$G:$G,$B$1),\"\",INDEX(Général!$A:$G,MATCH($B$1&\"_\"&ROW()-1,Général!$H:$H,0),3))","v":""},{"$f":"IF(ROW()-1>COUNTIF(Général!$G:$G,$B$1),\"\",INDEX(Général!$A:$G,MATCH($B$1&\"_\"&ROW()-1,Général!$H:$H,0),4))","v":""},{"$f":"IF(ROW()-1>COUNTIF(Général!$G:$G,$B$1),\"\",INDEX(Général!$A:$G,MATCH($B$1&\"_\"&ROW()-1,Général!$H:$H,0),5))","v":""},{"$f":"IF(ROW()-1>COUNTIF(Général!$G:$G,$B$1),\"\",INDEX(Général!$A:$G,MATCH($B$1&\"_\"&ROW()-1,Général!$H:$H,0),6))","v":""},{"$f":"IF(ROW()-1>COUNTIF(Général!$G:$G,$B$1),\"\",INDEX(Général!$A:$G,MATCH($B$1&\"_\"&ROW()-1,Général!$H:$H,0),7))","v":""}]
[{"$f":"IF(ROW()-1>COUNTIF(Général!$G:$G,$B$1),\"\",INDEX(Général!$A:$G,MATCH($B$1&\"_\"&ROW()-1,Général!$H:$H,0),1))","v":""},{"$f":"IF(ROW()-1>COUNTIF(Général!$G:$G,$B$1),\"\",INDEX(Général!$A:$G,MATCH($B$1&\"_\"&ROW()-1,Général!$H:$H,0),2))","v":""},{"$f":"IF(ROW()-1>COUNTIF(Général!$G:$G,$B$1),\"\",INDEX(Général!$A:$G,MATCH($B$1&\"_\"&ROW()-1,Général!$H:$H,0),3))","v":""},{"$f":"IF(ROW()-1>COUNTIF(Général!$G:$G,$B$1),\"\",INDEX(Général!$A:$G,MATCH($B$1&\"_\"&ROW()-1,Général!$H:$H,0),4))","v":""},{"$f":"IF(ROW()-1>COUNTIF(Général!$G:$G,$B$1),\"\",INDEX(Général!$A:$G,MATCH($B$1&\"_\"&ROW()-1,Général!$H:$H,0),5))","v":""},{"$f":"IF(ROW()-1>COUNTIF(Général!$G:$G,$B$1),\"\",INDEX(Général!$A:$G,MATCH($B$1&\"_\"&ROW()-1,Général!$H:$H,0),6))","v":""},{"$f":"IF(ROW()-1>COUNTIF(Général!$G:$G,$B$1),\"\",INDEX(Général!$A:$G,MATCH($B$1&\"_\"&ROW()-1,Général!$H:$H,0),7))","v":""}]
[{"$f":"IF(ROW()-1>COUNTIF(Général!$G:$G,$B$1),\"\",INDEX(Général!$A:$G,MATCH($B$1&\"_\"&ROW()-1,Général!$H:$H,0),1))","v":""},{"$f":"IF(ROW()-1>COUNTIF(Général!$G:$G,$B$1),\"\",INDEX(Général!$A:$G,MATCH($B$1&\"_\"&ROW()-1,Général!$H:$H,0),2))","v":""},{"$f":"IF(ROW()-1>COUNTIF(Général!$G:$G,$B$1),\"\",INDEX(Général!$A:$G,MATCH($B$1&\"_\"&ROW()-1,Général!$H:$H,0),3))","v":""},{"$f":"IF(ROW()-1>COUNTIF(Général!$G:$G,$B$1),\"\",INDEX(Général!$A:$G,MATCH($B$1&\"_\"&ROW()-1,Général!$H:$H,0),4))","v":""},{"$f":"IF(ROW()-1>COUNTIF(Général!$G:$G,$B$1),\"\",INDEX(Général!$A:$G,MATCH($B$1&\"_\"&ROW()-1,Général!$H:$H,0),5))","v":""},{"$f":"IF(ROW()-1>COUNTIF(Général!$G:$G,$B$1),\"\",INDEX(Général!$A:$G,MATCH($B$1&\"_\"&ROW()-1,Général!$H:$H,0),6))","v":""},{"$f":"IF(ROW()-1>COUNTIF(Général!$G:$G,$B$1),\"\",INDEX(Général!$A:$G,MATCH($B$1&\"_\"&ROW()-1,Général!$H:$H,0),7))","v":""}]
[{"$f":"IF(ROW()-1>COUNTIF(Général!$G:$G,$B$1),\"\",INDEX(Général!$A:$G,MATCH($B$1&\"_\"&ROW()-1,Général!$H:$H,0),1))","v":""},{"$f":"IF(ROW()-1>COUNTIF(Général!$G:$G,$B$1),\"\",INDEX(Général!$A:$G,MATCH($B$1&\"_\"&ROW()-1,Général!$H:$H,0),2))","v":""},{"$f":"IF(ROW()-1>COUNTIF(Général!$G:$G,$B$1),\"\",INDEX(Général!$A:$G,MATCH($B$1&\"_\"&ROW()-1,Général!$H:$H,0),3))","v":""},{"$f":"IF(ROW()-1>COUNTIF(Général!$G:$G,$B$1),\"\",INDEX(Général!$A:$G,MATCH($B$1&\"_\"&ROW()-1,Général!$H:$H,0),4))","v":""},{"$f":"IF(ROW()-1>COUNTIF(Général!$G:$G,$B$1),\"\",INDEX(Général!$A:$G,MATCH($B$1&\"_\"&ROW()-1,Général!$H:$H,0),5))","v":""},{"$f":"IF(ROW()-1>COUNTIF(Général!$G:$G,$B$1),\"\",INDEX(Général!$A:$G,MATCH($B$1&\"_\"&ROW()-1,Général!$H:$H,0),6))","v":""},{"$f":"IF(ROW()-1>COUNTIF(Général!$G:$G,$B$1),\"\",INDEX(Général!$A:$G,MATCH($B$1&\"_\"&ROW()-1,Général!$H:$H,0),7))","v":""}]
[{"$f":"IF(ROW()-1>COUNTIF(Général!$G:$G,$B$1),\"\",INDEX(Général!$A:$G,MATCH($B$1&\"_\"&ROW()-1,Général!$H:$H,0),1))","v":""},{"$f":"IF(ROW()-1>COUNTIF(Général!$G:$G,$B$1),\"\",INDEX(Général!$A:$G,MATCH($B$1&\"_\"&ROW()-1,Général!$H:$H,0),2))","v":""},{"$f":"IF(ROW()-1>COUNTIF(Général!$G:$G,$B$1),\"\",INDEX(Général!$A:$G,MATCH($B$1&\"_\"&ROW()-1,Général!$H:$H,0),3))","v":""},{"$f":"IF(ROW()-1>COUNTIF(Général!$G:$G,$B$1),\"\",INDEX(Général!$A:$G,MATCH($B$1&\"_\"&ROW()-1,Général!$H:$H,0),4))","v":""},{"$f":"IF(ROW()-1>COUNTIF(Général!$G:$G,$B$1),\"\",INDEX(Général!$A:$G,MATCH($B$1&\"_\"&ROW()-1,Général!$H:$H,0),5))","v":""},{"$f":"IF(ROW()-1>COUNTIF(Général!$G:$G,$B$1),\"\",INDEX(Général!$A:$G,MATCH($B$1&\"_\"&ROW()-1,Général!$H:$H,0),6))","v":""},{"$f":"IF(ROW()-1>COUNTIF(Général!$G:$G,$B$1),\"\",INDEX(Général!$A:$G,MATCH($B$1&\"_\"&ROW()-1,Général!$H:$H,0),7))","v":""}]
[{"$f":"IF(ROW()-1>COUNTIF(Général!$G:$G,$B$1),\"\",INDEX(Général!$A:$G,MATCH($B$1&\"_\"&ROW()-1,Général!$H:$H,0),1))","v":""},{"$f":"IF(ROW()-1>COUNTIF(Général!$G:$G,$B$1),\"\",INDEX(Général!$A:$G,MATCH($B$1&\"_\"&ROW()-1,Général!$H:$H,0),2))","v":""},{"$f":"IF(ROW()-1>COUNTIF(Général!$G:$G,$B$1),\"\",INDEX(Général!$A:$G,MATCH($B$1&\"_\"&ROW()-1,Général!$H:$H,0),3))","v":""},{"$f":"IF(ROW()-1>COUNTIF(Général!$G:$G,$B$1),\"\",INDEX(Général!$A:$G,MATCH($B$1&\"_\"&ROW()-1,Général!$H:$H,0),4))","v":""},{"$f":"IF(ROW()-1>COUNTIF(Général!$G:$G,$B$1),\"\",INDEX(Général!$A:$G,MATCH($B$1&\"_\"&ROW()-1,Général!$H:$H,0),5))","v":""},{"$f":"IF(ROW()-1>COUNTIF(Général!$G:$G,$B$1),\"\",INDEX(Général!$A:$G,MATCH($B$1&\"_\"&ROW()-1,Général!$H:$H,0),6))","v":""},{"$f":"IF(ROW()-1>COUNTIF(Général!$G:$G,$B$1),\"\",INDEX(Général!$A:$G,MATCH($B$1&\"_\"&ROW()-1,Général!$H:$H,0),7))","v":""}]
[{"$f":"IF(ROW()-1>COUNTIF(Général!$G:$G,$B$1),\"\",INDEX(Général!$A:$G,MATCH($B$1&\"_\"&ROW()-1,Général!$H:$H,0),1))","v":""},{"$f":"IF(ROW()-1>COUNTIF(Général!$G:$G,$B$1),\"\",INDEX(Général!$A:$G,MATCH($B$1&\"_\"&ROW()-1,Général!$H:$H,0),2))","v":""},{"$f":"IF(ROW()-1>COUNTIF(Général!$G:$G,$B$1),\"\",INDEX(Général!$A:$G,MATCH($B$1&\"_\"&ROW()-1,Général!$H:$H,0),3))","v":""},{"$f":"IF(ROW()-1>COUNTIF(Général!$G:$G,$B$1),\"\",INDEX(Général!$A:$G,MATCH($B$1&\"_\"&ROW()-1,Général!$H:$H,0),4))","v":""},{"$f":"IF(ROW()-1>COUNTIF(Général!$G:$G,$B$1),\"\",INDEX(Général!$A:$G,MATCH($B$1&\"_\"&ROW()-1,Général!$H:$H,0),5))","v":""},{"$f":"IF(ROW()-1>COUNTIF(Général!$G:$G,$B$1),\"\",INDEX(Général!$A:$G,MATCH($B$1&\"_\"&ROW()-1,Général!$H:$H,0),6))","v":""},{"$f":"IF(ROW()-1>COUNTIF(Général!$G:$G,$B$1),\"\",INDEX(Général!$A:$G,MATCH($B$1&\"_\"&ROW()-1,Général!$H:$H,0),7))","v":""}]
[{"$f":"IF(ROW()-1>COUNTIF(Général!$G:$G,$B$1),\"\",INDEX(Général!$A:$G,MATCH($B$1&\"_\"&ROW()-1,Général!$H:$H,0),1))","v":""},{"$f":"IF(ROW()-1>COUNTIF(Général!$G:$G,$B$1),\"\",INDEX(Général!$A:$G,MATCH($B$1&\"_\"&ROW()-1,Général!$H:$H,0),2))","v":""},{"$f":"IF(ROW()-1>COUNTIF(Général!$G:$G,$B$1),\"\",INDEX(Général!$A:$G,MATCH($B$1&\"_\"&ROW()-1,Général!$H:$H,0),3))","v":""},{"$f":"IF(ROW()-1>COUNTIF(Général!$G:$G,$B$1),\"\",INDEX(Général!$A:$G,MATCH($B$1&\"_\"&ROW()-1,Général!$H:$H,0),4))","v":""},{"$f":"IF(ROW()-1>COUNTIF(Général!$G:$G,$B$1),\"\",INDEX(Général!$A:$G,MATCH($B$1&\"_\"&ROW()-1,Général!$H:$H,0),5))","v":""},{"$f":"IF(ROW()-1>COUNTIF(Général!$G:$G,$B$1),\"\",INDEX(Général!$A:$G,MATCH($B$1&\"_\"&ROW()-1,Général!$H:$H,0),6))","v":""},{"$f":"IF(ROW()-1>COUNTIF(Général!$G:$G,$B$1),\"\",INDEX(Général!$A:$G,MATCH($B$1&\"_\"&ROW()-1,Général!$H:$H,0),7))","v":""}]

{"sheet":"C3","index":3,"n_rows":30,"n_cols":7,"rows_kept":30,"cut":false,"hidden":false,"merged":[]}
["Cotation ","C3"]
[{"$f":"IF(ROW()-1>COUNTIF(Général!$G:$G,$B$1),\"\",INDEX(Général!$A:$G,MATCH($B$1&\"_\"&ROW()-1,Général!$H:$H,0),1))","v":"Marcel"},{"$f":"IF(ROW()-1>COUNTIF(Général!$G:$G,$B$1),\"\",INDEX(Général!$A:$G,MATCH($B$1&\"_\"&ROW()-1,Général!$H:$H,0),2))","v":"Bouleau"},{"$f":"IF(ROW()-1>COUNTIF(Général!$G:$G,$B$1),\"\",INDEX(Général!$A:$G,MATCH($B$1&\"_\"&ROW()-1,Général!$H:$H,0),3))","v":"Marseille"},{"$f":"IF(ROW()-1>COUNTIF(Général!$G:$G,$B$1),\"\",INDEX(Général!$A:$G,MATCH($B$1&\"_\"&ROW()-1,Général!$H:$H,0),4))","v":"Bleu"},{"$f":"IF(ROW()-1>COUNTIF(Général!$G:$G,$B$1),\"\",INDEX(Général!$A:$G,MATCH($B$1&\"_\"&ROW()-1,Général!$H:$H,0),5))","v":"Martin"},{"$f":"IF(ROW()-1>COUNTIF(Général!$G:$G,$B$1),\"\",INDEX(Général!$A:$G,MATCH($B$1&\"_\"&ROW()-1,Général!$H:$H,0),6))","v":"Abricot"},{"$f":"IF(ROW()-1>COUNTIF(Général!$G:$G,$B$1),\"\",INDEX(Général!$A:$G,MATCH($B$1&\"_\"&ROW()-1,Général!$H:$H,0),7))","v":"C3"}]
[{"$f":"IF(ROW()-1>COUNTIF(Général!$G:$G,$B$1),\"\",INDEX(Général!$A:$G,MATCH($B$1&\"_\"&ROW()-1,Général!$H:$H,0),1))","v":"Lucas"},{"$f":"IF(ROW()-1>COUNTIF(Général!$G:$G,$B$1),\"\",INDEX(Général!$A:$G,MATCH($B$1&\"_\"&ROW()-1,Général!$H:$H,0),2))","v":"Mélèze"},{"$f":"IF(ROW()-1>COUNTIF(Général!$G:$G,$B$1),\"\",INDEX(Général!$A:$G,MATCH($B$1&\"_\"&ROW()-1,Général!$H:$H,0),3))","v":"Vannes"},{"$f":"IF(ROW()-1>COUNTIF(Général!$G:$G,$B$1),\"\",INDEX(Général!$A:$G,MATCH($B$1&\"_\"&ROW()-1,Général!$H:$H,0),4))","v":"Bleu Ciel"},{"$f":"IF(ROW()-1>COUNTIF(Général!$G:$G,$B$1),\"\",INDEX(Général!$A:$G,MATCH($B$1&\"_\"&ROW()-1,Général!$H:$H,0),5))","v":"Marcove"},{"$f":"IF(ROW()-1>COUNTIF(Général!$G:$G,$B$1),\"\",INDEX(Général!$A:$G,MATCH($B$1&\"_\"&ROW()-1,Général!$H:$H,0),6))","v":"Framboise"},{"$f":"IF(ROW()-1>COUNTIF(Général!$G:$G,$B$1),\"\",INDEX(Général!$A:$G,MATCH($B$1&\"_\"&ROW()-1,Général!$H:$H,0),7))","v":"C3"}]
[{"$f":"IF(ROW()-1>COUNTIF(Général!$G:$G,$B$1),\"\",INDEX(Général!$A:$G,MATCH($B$1&\"_\"&ROW()-1,Général!$H:$H,0),1))","v":"Eric"},{"$f":"IF(ROW()-1>COUNTIF(Général!$G:$G,$B$1),\"\",INDEX(Général!$A:$G,MATCH($B$1&\"_\"&ROW()-1,Général!$H:$H,0),2))","v":"Epicéa"},{"$f":"IF(ROW()-1>COUNTIF(Général!$G:$G,$B$1),\"\",INDEX(Général!$A:$G,MATCH($B$1&\"_\"&ROW()-1,Général!$H:$H,0),3))","v":"Biarritz"},{"$f":"IF(ROW()-1>COUNTIF(Général!$G:$G,$B$1),\"\",INDEX(Général!$A:$G,MATCH($B$1&\"_\"&ROW()-1,Général!$H:$H,0),4))","v":"Bleu Roi"},{"$f":"IF(ROW()-1>COUNTIF(Général!$G:$G,$B$1),\"\",INDEX(Général!$A:$G,MATCH($B$1&\"_\"&ROW()-1,Général!$H:$H,0),5))","v":"Robino"},{"$f":"IF(ROW()-1>COUNTIF(Général!$G:$G,$B$1),\"\",INDEX(Général!$A:$G,MATCH($B$1&\"_\"&ROW()-1,Général!$H:$H,0),6))","v":"Mûre"},{"$f":"IF(ROW()-1>COUNTIF(Général!$G:$G,$B$1),\"\",INDEX(Général!$A:$G,MATCH($B$1&\"_\"&ROW()-1,Général!$H:$H,0),7))","v":"C3"}]
[{"$f":"IF(ROW()-1>COUNTIF(Général!$G:$G,$B$1),\"\",INDEX(Général!$A:$G,MATCH($B$1&\"_\"&ROW()-1,Général!$H:$H,0),1))","v":"Chantal"},{"$f":"IF(ROW()-1>COUNTIF(Général!$G:$G,$B$1),\"\",INDEX(Général!$A:$G,MATCH($B$1&\"_\"&ROW()-1,Général!$H:$H,0),2))","v":"Tremble"},{"$f":"IF(ROW()-1>COUNTIF(Général!$G:$G,$B$1),\"\",INDEX(Général!$A:$G,MATCH($B$1&\"_\"&ROW()-1,Général!$H:$H,0),3))","v":"Narbonne"},{"$f":"IF(ROW()-1>COUNTIF(Général!$G:$G,$B$1),\"\",INDEX(Général!$A:$G,MATCH($B$1&\"_\"&ROW()-1,Général!$H:$H,0),4))","v":"Bistre"},{"$f":"IF(ROW()-1>COUNTIF(Général!$G:$G,$B$1),\"\",INDEX(Général!$A:$G,MATCH($B$1&\"_\"&ROW()-1,Général!$H:$H,0),5))","v":"Arunia"},{"$f":"IF(ROW()-1>COUNTIF(Général!$G:$G,$B$1),\"\",INDEX(Général!$A:$G,MATCH($B$1&\"_\"&ROW()-1,Général!$H:$H,0),6))","v":"Ananas"},{"$f":"IF(ROW()-1>COUNTIF(Général!$G:$G,$B$1),\"\",INDEX(Général!$A:$G,MATCH($B$1&\"_\"&ROW()-1,Général!$H:$H,0),7))","v":"C3"}]
[{"$f":"IF(ROW()-1>COUNTIF(Général!$G:$G,$B$1),\"\",INDEX(Général!$A:$G,MATCH($B$1&\"_\"&ROW()-1,Général!$H:$H,0),1))","v":"Pierrette"},{"$f":"IF(ROW()-1>COUNTIF(Général!$G:$G,$B$1),\"\",INDEX(Général!$A:$G,MATCH($B$1&\"_\"&ROW()-1,Général!$H:$H,0),2))","v":"Cornouiller"},{"$f":"IF(ROW()-1>COUNTIF(Général!$G:$G,$B$1),\"\",INDEX(Général!$A:$G,MATCH($B$1&\"_\"&ROW()-1,Général!$H:$H,0),3))","v":"Grasse"},{"$f":"IF(ROW()-1>COUNTIF(Général!$G:$G,$B$1),\"\",INDEX(Général!$A:$G,MATCH($B$1&\"_\"&ROW()-1,Général!$H:$H,0),4))","v":"Turquoise"},{"$f":"IF(ROW()-1>COUNTIF(Général!$G:$G,$B$1),\"\",INDEX(Général!$A:$G,MATCH($B$1&\"_\"&ROW()-1,Général!$H:$H,0),5))","v":"jaboulet"},{"$f":"IF(ROW()-1>COUNTIF(Général!$G:$G,$B$1),\"\",INDEX(Général!$A:$G,MATCH($B$1&\"_\"&ROW()-1,Général!$H:$H,0),6))","v":"Citron"},{"$f":"IF(ROW()-1>COUNTIF(Général!$G:$G,$B$1),\"\",INDEX(Général!$A:$G,MATCH($B$1&\"_\"&ROW()-1,Général!$H:$H,0),7))","v":"C3"}]
[{"$f":"IF(ROW()-1>COUNTIF(Général!$G:$G,$B$1),\"\",INDEX(Général!$A:$G,MATCH($B$1&\"_\"&ROW()-1,Général!$H:$H,0),1))","v":"Josette"},{"$f":"IF(ROW()-1>COUNTIF(Général!$G:$G,$B$1),\"\",INDEX(Général!$A:$G,MATCH($B$1&\"_\"&ROW()-1,Général!$H:$H,0),2))","v":"Charme"},{"$f":"IF(ROW()-1>COUNTIF(Général!$G:$G,$B$1),\"\",INDEX(Général!$A:$G,MATCH($B$1&\"_\"&ROW()-1,Général!$H:$H,0),3))","v":"Chaumont"},{"$f":"IF(ROW()-1>COUNTIF(Général!$G:$G,$B$1),\"\",INDEX(Général!$A:$G,MATCH($B$1&\"_\"&ROW()-1,Général!$H:$H,0),4))","v":"Marine"},{"$f":"IF(ROW()-1>COUNTIF(Général!$G:$G,$B$1),\"\",INDEX(Général!$A:$G,MATCH($B$1&\"_\"&ROW()-1,Général!$H:$H,0),5))","v":"Karovitch"},{"$f":"IF(ROW()-1>COUNTIF(Général!$G:$G,$B$1),\"\",INDEX(Général!$A:$G,MATCH($B$1&\"_\"&ROW()-1,Général!$H:$H,0),6))","v":"Pamplemousse"},{"$f":"IF(ROW()-1>COUNTIF(Général!$G:$G,$B$1),\"\",INDEX(Général!$A:$G,MATCH($B$1&\"_\"&ROW()-1,Général!$H:$H,0),7))","v":"C3"}]
[{"$f":"IF(ROW()-1>COUNTIF(Général!$G:$G,$B$1),\"\",INDEX(Général!$A:$G,MATCH($B$1&\"_\"&ROW()-1,Général!$H:$H,0),1))","v":"Annette"},{"$f":"IF(ROW()-1>COUNTIF(Général!$G:$G,$B$1),\"\",INDEX(Général!$A:$G,MATCH($B$1&\"_\"&ROW()-1,Général!$H:$H,0),2))","v":"Noyer"},{"$f":"IF(ROW()-1>COUNTIF(Général!$G:$G,$B$1),\"\",INDEX(Général!$A:$G,MATCH($B$1&\"_\"&ROW()-1,Général!$H:$H,0),3))","v":"Caen"},{"$f":"IF(ROW()-1>COUNTIF(Général!$G:$G,$B$1),\"\",INDEX(Général!$A:$G,MATCH($B$1&\"_\"&ROW()-1,Général!$H:$H,0),4))","v":"Indigo"},{"$f":"IF(ROW()-1>COUNTIF(Général!$G:$G,$B$1),\"\",INDEX(Général!$A:$G,MATCH($B$1&\"_\"&ROW()-1,Général!$H:$H,0),5))","v":"Querty"},{"$f":"IF(ROW()-1>COUNTIF(Général!$G:$G,$B$1),\"\",INDEX(Général!$A:$G,MATCH($B$1&\"_\"&ROW()-1,Général!$H:$H,0),6))","v":"kiwi"},{"$f":"IF(ROW()-1>COUNTIF(Général!$G:$G,$B$1),\"\",INDEX(Général!$A:$G,MATCH($B$1&\"_\"&ROW()-1,Général!$H:$H,0),7))","v":"C3"}]
[{"$f":"IF(ROW()-1>COUNTIF(Général!$G:$G,$B$1),\"\",INDEX(Général!$A:$G,MATCH($B$1&\"_\"&ROW()-1,Général!$H:$H,0),1))","v":""},{"$f":"IF(ROW()-1>COUNTIF(Général!$G:$G,$B$1),\"\",INDEX(Général!$A:$G,MATCH($B$1&\"_\"&ROW()-1,Général!$H:$H,0),2))","v":""},{"$f":"IF(ROW()-1>COUNTIF(Général!$G:$G,$B$1),\"\",INDEX(Général!$A:$G,MATCH($B$1&\"_\"&ROW()-1,Général!$H:$H,0),3))","v":""},{"$f":"IF(ROW()-1>COUNTIF(Général!$G:$G,$B$1),\"\",INDEX(Général!$A:$G,MATCH($B$1&\"_\"&ROW()-1,Général!$H:$H,0),4))","v":""},{"$f":"IF(ROW()-1>COUNTIF(Général!$G:$G,$B$1),\"\",INDEX(Général!$A:$G,MATCH($B$1&\"_\"&ROW()-1,Général!$H:$H,0),5))","v":""},{"$f":"IF(ROW()-1>COUNTIF(Général!$G:$G,$B$1),\"\",INDEX(Général!$A:$G,MATCH($B$1&\"_\"&ROW()-1,Général!$H:$H,0),6))","v":""},{"$f":"IF(ROW()-1>COUNTIF(Général!$G:$G,$B$1),\"\",INDEX(Général!$A:$G,MATCH($B$1&\"_\"&ROW()-1,Général!$H:$H,0),7))","v":""}]
[{"$f":"IF(ROW()-1>COUNTIF(Général!$G:$G,$B$1),\"\",INDEX(Général!$A:$G,MATCH($B$1&\"_\"&ROW()-1,Général!$H:$H,0),1))","v":""},{"$f":"IF(ROW()-1>COUNTIF(Général!$G:$G,$B$1),\"\",INDEX(Général!$A:$G,MATCH($B$1&\"_\"&ROW()-1,Général!$H:$H,0),2))","v":""},{"$f":"IF(ROW()-1>COUNTIF(Général!$G:$G,$B$1),\"\",INDEX(Général!$A:$G,MATCH($B$1&\"_\"&ROW()-1,Général!$H:$H,0),3))","v":""},{"$f":"IF(ROW()-1>COUNTIF(Général!$G:$G,$B$1),\"\",INDEX(Général!$A:$G,MATCH($B$1&\"_\"&ROW()-1,Général!$H:$H,0),4))","v":""},{"$f":"IF(ROW()-1>COUNTIF(Général!$G:$G,$B$1),\"\",INDEX(Général!$A:$G,MATCH($B$1&\"_\"&ROW()-1,Général!$H:$H,0),5))","v":""},{"$f":"IF(ROW()-1>COUNTIF(Général!$G:$G,$B$1),\"\",INDEX(Général!$A:$G,MATCH($B$1&\"_\"&ROW()-1,Général!$H:$H,0),6))","v":""},{"$f":"IF(ROW()-1>COUNTIF(Général!$G:$G,$B$1),\"\",INDEX(Général!$A:$G,MATCH($B$1&\"_\"&ROW()-1,Général!$H:$H,0),7))","v":""}]
[{"$f":"IF(ROW()-1>COUNTIF(Général!$G:$G,$B$1),\"\",INDEX(Général!$A:$G,MATCH($B$1&\"_\"&ROW()-1,Général!$H:$H,0),1))","v":""},{"$f":"IF(ROW()-1>COUNTIF(Général!$G:$G,$B$1),\"\",INDEX(Général!$A:$G,MATCH($B$1&\"_\"&ROW()-1,Général!$H:$H,0),2))","v":""},{"$f":"IF(ROW()-1>COUNTIF(Général!$G:$G,$B$1),\"\",INDEX(Général!$A:$G,MATCH($B$1&\"_\"&ROW()-1,Général!$H:$H,0),3))","v":""},{"$f":"IF(ROW()-1>COUNTIF(Général!$G:$G,$B$1),\"\",INDEX(Général!$A:$G,MATCH($B$1&\"_\"&ROW()-1,Général!$H:$H,0),4))","v":""},{"$f":"IF(ROW()-1>COUNTIF(Général!$G:$G,$B$1),\"\",INDEX(Général!$A:$G,MATCH($B$1&\"_\"&ROW()-1,Général!$H:$H,0),5))","v":""},{"$f":"IF(ROW()-1>COUNTIF(Général!$G:$G,$B$1),\"\",INDEX(Général!$A:$G,MATCH($B$1&\"_\"&ROW()-1,Général!$H:$H,0),6))","v":""},{"$f":"IF(ROW()-1>COUNTIF(Général!$G:$G,$B$1),\"\",INDEX(Général!$A:$G,MATCH($B$1&\"_\"&ROW()-1,Général!$H:$H,0),7))","v":""}]
[{"$f":"IF(ROW()-1>COUNTIF(Général!$G:$G,$B$1),\"\",INDEX(Général!$A:$G,MATCH($B$1&\"_\"&ROW()-1,Général!$H:$H,0),1))","v":""},{"$f":"IF(ROW()-1>COUNTIF(Général!$G:$G,$B$1),\"\",INDEX(Général!$A:$G,MATCH($B$1&\"_\"&ROW()-1,Général!$H:$H,0),2))","v":""},{"$f":"IF(ROW()-1>COUNTIF(Général!$G:$G,$B$1),\"\",INDEX(Général!$A:$G,MATCH($B$1&\"_\"&ROW()-1,Général!$H:$H,0),3))","v":""},{"$f":"IF(ROW()-1>COUNTIF(Général!$G:$G,$B$1),\"\",INDEX(Général!$A:$G,MATCH($B$1&\"_\"&ROW()-1,Général!$H:$H,0),4))","v":""},{"$f":"IF(ROW()-1>COUNTIF(Général!$G:$G,$B$1),\"\",INDEX(Général!$A:$G,MATCH($B$1&\"_\"&ROW()-1,Général!$H:$H,0),5))","v":""},{"$f":"IF(ROW()-1>COUNTIF(Général!$G:$G,$B$1),\"\",INDEX(Général!$A:$G,MATCH($B$1&\"_\"&ROW()-1,Général!$H:$H,0),6))","v":""},{"$f":"IF(ROW()-1>COUNTIF(Général!$G:$G,$B$1),\"\",INDEX(Général!$A:$G,MATCH($B$1&\"_\"&ROW()-1,Général!$H:$H,0),7))","v":""}]
[{"$f":"IF(ROW()-1>COUNTIF(Général!$G:$G,$B$1),\"\",INDEX(Général!$A:$G,MATCH($B$1&\"_\"&ROW()-1,Général!$H:$H,0),1))","v":""},{"$f":"IF(ROW()-1>COUNTIF(Général!$G:$G,$B$1),\"\",INDEX(Général!$A:$G,MATCH($B$1&\"_\"&ROW()-1,Général!$H:$H,0),2))","v":""},{"$f":"IF(ROW()-1>COUNTIF(Général!$G:$G,$B$1),\"\",INDEX(Général!$A:$G,MATCH($B$1&\"_\"&ROW()-1,Général!$H:$H,0),3))","v":""},{"$f":"IF(ROW()-1>COUNTIF(Général!$G:$G,$B$1),\"\",INDEX(Général!$A:$G,MATCH($B$1&\"_\"&ROW()-1,Général!$H:$H,0),4))","v":""},{"$f":"IF(ROW()-1>COUNTIF(Général!$G:$G,$B$1),\"\",INDEX(Général!$A:$G,MATCH($B$1&\"_\"&ROW()-1,Général!$H:$H,0),5))","v":""},{"$f":"IF(ROW()-1>COUNTIF(Général!$G:$G,$B$1),\"\",INDEX(Général!$A:$G,MATCH($B$1&\"_\"&ROW()-1,Général!$H:$H,0),6))","v":""},{"$f":"IF(ROW()-1>COUNTIF(Général!$G:$G,$B$1),\"\",INDEX(Général!$A:$G,MATCH($B$1&\"_\"&ROW()-1,Général!$H:$H,0),7))","v":""}]
[{"$f":"IF(ROW()-1>COUNTIF(Général!$G:$G,$B$1),\"\",INDEX(Général!$A:$G,MATCH($B$1&\"_\"&ROW()-1,Général!$H:$H,0),1))","v":""},{"$f":"IF(ROW()-1>COUNTIF(Général!$G:$G,$B$1),\"\",INDEX(Général!$A:$G,MATCH($B$1&\"_\"&ROW()-1,Général!$H:$H,0),2))","v":""},{"$f":"IF(ROW()-1>COUNTIF(Général!$G:$G,$B$1),\"\",INDEX(Général!$A:$G,MATCH($B$1&\"_\"&ROW()-1,Général!$H:$H,0),3))","v":""},{"$f":"IF(ROW()-1>COUNTIF(Général!$G:$G,$B$1),\"\",INDEX(Général!$A:$G,MATCH($B$1&\"_\"&ROW()-1,Général!$H:$H,0),4))","v":""},{"$f":"IF(ROW()-1>COUNTIF(Général!$G:$G,$B$1),\"\",INDEX(Général!$A:$G,MATCH($B$1&\"_\"&ROW()-1,Général!$H:$H,0),5))","v":""},{"$f":"IF(ROW()-1>COUNTIF(Général!$G:$G,$B$1),\"\",INDEX(Général!$A:$G,MATCH($B$1&\"_\"&ROW()-1,Général!$H:$H,0),6))","v":""},{"$f":"IF(ROW()-1>COUNTIF(Général!$G:$G,$B$1),\"\",INDEX(Général!$A:$G,MATCH($B$1&\"_\"&ROW()-1,Général!$H:$H,0),7))","v":""}]
[{"$f":"IF(ROW()-1>COUNTIF(Général!$G:$G,$B$1),\"\",INDEX(Général!$A:$G,MATCH($B$1&\"_\"&ROW()-1,Général!$H:$H,0),1))","v":""},{"$f":"IF(ROW()-1>COUNTIF(Général!$G:$G,$B$1),\"\",INDEX(Général!$A:$G,MATCH($B$1&\"_\"&ROW()-1,Général!$H:$H,0),2))","v":""},{"$f":"IF(ROW()-1>COUNTIF(Général!$G:$G,$B$1),\"\",INDEX(Général!$A:$G,MATCH($B$1&\"_\"&ROW()-1,Général!$H:$H,0),3))","v":""},{"$f":"IF(ROW()-1>COUNTIF(Général!$G:$G,$B$1),\"\",INDEX(Général!$A:$G,MATCH($B$1&\"_\"&ROW()-1,Général!$H:$H,0),4))","v":""},{"$f":"IF(ROW()-1>COUNTIF(Général!$G:$G,$B$1),\"\",INDEX(Général!$A:$G,MATCH($B$1&\"_\"&ROW()-1,Général!$H:$H,0),5))","v":""},{"$f":"IF(ROW()-1>COUNTIF(Général!$G:$G,$B$1),\"\",INDEX(Général!$A:$G,MATCH($B$1&\"_\"&ROW()-1,Général!$H:$H,0),6))","v":""},{"$f":"IF(ROW()-1>COUNTIF(Général!$G:$G,$B$1),\"\",INDEX(Général!$A:$G,MATCH($B$1&\"_\"&ROW()-1,Général!$H:$H,0),7))","v":""}]
[{"$f":"IF(ROW()-1>COUNTIF(Général!$G:$G,$B$1),\"\",INDEX(Général!$A:$G,MATCH($B$1&\"_\"&ROW()-1,Général!$H:$H,0),1))","v":""},{"$f":"IF(ROW()-1>COUNTIF(Général!$G:$G,$B$1),\"\",INDEX(Général!$A:$G,MATCH($B$1&\"_\"&ROW()-1,Général!$H:$H,0),2))","v":""},{"$f":"IF(ROW()-1>COUNTIF(Général!$G:$G,$B$1),\"\",INDEX(Général!$A:$G,MATCH($B$1&\"_\"&ROW()-1,Général!$H:$H,0),3))","v":""},{"$f":"IF(ROW()-1>COUNTIF(Général!$G:$G,$B$1),\"\",INDEX(Général!$A:$G,MATCH($B$1&\"_\"&ROW()-1,Général!$H:$H,0),4))","v":""},{"$f":"IF(ROW()-1>COUNTIF(Général!$G:$G,$B$1),\"\",INDEX(Général!$A:$G,MATCH($B$1&\"_\"&ROW()-1,Général!$H:$H,0),5))","v":""},{"$f":"IF(ROW()-1>COUNTIF(Général!$G:$G,$B$1),\"\",INDEX(Général!$A:$G,MATCH($B$1&\"_\"&ROW()-1,Général!$H:$H,0),6))","v":""},{"$f":"IF(ROW()-1>COUNTIF(Général!$G:$G,$B$1),\"\",INDEX(Général!$A:$G,MATCH($B$1&\"_\"&ROW()-1,Général!$H:$H,0),7))","v":""}]
[{"$f":"IF(ROW()-1>COUNTIF(Général!$G:$G,$B$1),\"\",INDEX(Général!$A:$G,MATCH($B$1&\"_\"&ROW()-1,Général!$H:$H,0),1))","v":""},{"$f":"IF(ROW()-1>COUNTIF(Général!$G:$G,$B$1),\"\",INDEX(Général!$A:$G,MATCH($B$1&\"_\"&ROW()-1,Général!$H:$H,0),2))","v":""},{"$f":"IF(ROW()-1>COUNTIF(Général!$G:$G,$B$1),\"\",INDEX(Général!$A:$G,MATCH($B$1&\"_\"&ROW()-1,Général!$H:$H,0),3))","v":""},{"$f":"IF(ROW()-1>COUNTIF(Général!$G:$G,$B$1),\"\",INDEX(Général!$A:$G,MATCH($B$1&\"_\"&ROW()-1,Général!$H:$H,0),4))","v":""},{"$f":"IF(ROW()-1>COUNTIF(Général!$G:$G,$B$1),\"\",INDEX(Général!$A:$G,MATCH($B$1&\"_\"&ROW()-1,Général!$H:$H,0),5))","v":""},{"$f":"IF(ROW()-1>COUNTIF(Général!$G:$G,$B$1),\"\",INDEX(Général!$A:$G,MATCH($B$1&\"_\"&ROW()-1,Général!$H:$H,0),6))","v":""},{"$f":"IF(ROW()-1>COUNTIF(Général!$G:$G,$B$1),\"\",INDEX(Général!$A:$G,MATCH($B$1&\"_\"&ROW()-1,Général!$H:$H,0),7))","v":""}]
[{"$f":"IF(ROW()-1>COUNTIF(Général!$G:$G,$B$1),\"\",INDEX(Général!$A:$G,MATCH($B$1&\"_\"&ROW()-1,Général!$H:$H,0),1))","v":""},{"$f":"IF(ROW()-1>COUNTIF(Général!$G:$G,$B$1),\"\",INDEX(Général!$A:$G,MATCH($B$1&\"_\"&ROW()-1,Général!$H:$H,0),2))","v":""},{"$f":"IF(ROW()-1>COUNTIF(Général!$G:$G,$B$1),\"\",INDEX(Général!$A:$G,MATCH($B$1&\"_\"&ROW()-1,Général!$H:$H,0),3))","v":""},{"$f":"IF(ROW()-1>COUNTIF(Général!$G:$G,$B$1),\"\",INDEX(Général!$A:$G,MATCH($B$1&\"_\"&ROW()-1,Général!$H:$H,0),4))","v":""},{"$f":"IF(ROW()-1>COUNTIF(Général!$G:$G,$B$1),\"\",INDEX(Général!$A:$G,MATCH($B$1&\"_\"&ROW()-1,Général!$H:$H,0),5))","v":""},{"$f":"IF(ROW()-1>COUNTIF(Général!$G:$G,$B$1),\"\",INDEX(Général!$A:$G,MATCH($B$1&\"_\"&ROW()-1,Général!$H:$H,0),6))","v":""},{"$f":"IF(ROW()-1>COUNTIF(Général!$G:$G,$B$1),\"\",INDEX(Général!$A:$G,MATCH($B$1&\"_\"&ROW()-1,Général!$H:$H,0),7))","v":""}]
[{"$f":"IF(ROW()-1>COUNTIF(Général!$G:$G,$B$1),\"\",INDEX(Général!$A:$G,MATCH($B$1&\"_\"&ROW()-1,Général!$H:$H,0),1))","v":""},{"$f":"IF(ROW()-1>COUNTIF(Général!$G:$G,$B$1),\"\",INDEX(Général!$A:$G,MATCH($B$1&\"_\"&ROW()-1,Général!$H:$H,0),2))","v":""},{"$f":"IF(ROW()-1>COUNTIF(Général!$G:$G,$B$1),\"\",INDEX(Général!$A:$G,MATCH($B$1&\"_\"&ROW()-1,Général!$H:$H,0),3))","v":""},{"$f":"IF(ROW()-1>COUNTIF(Général!$G:$G,$B$1),\"\",INDEX(Général!$A:$G,MATCH($B$1&\"_\"&ROW()-1,Général!$H:$H,0),4))","v":""},{"$f":"IF(ROW()-1>COUNTIF(Général!$G:$G,$B$1),\"\",INDEX(Général!$A:$G,MATCH($B$1&\"_\"&ROW()-1,Général!$H:$H,0),5))","v":""},{"$f":"IF(ROW()-1>COUNTIF(Général!$G:$G,$B$1),\"\",INDEX(Général!$A:$G,MATCH($B$1&\"_\"&ROW()-1,Général!$H:$H,0),6))","v":""},{"$f":"IF(ROW()-1>COUNTIF(Général!$G:$G,$B$1),\"\",INDEX(Général!$A:$G,MATCH($B$1&\"_\"&ROW()-1,Général!$H:$H,0),7))","v":""}]
[{"$f":"IF(ROW()-1>COUNTIF(Général!$G:$G,$B$1),\"\",INDEX(Général!$A:$G,MATCH($B$1&\"_\"&ROW()-1,Général!$H:$H,0),1))","v":""},{"$f":"IF(ROW()-1>COUNTIF(Général!$G:$G,$B$1),\"\",INDEX(Général!$A:$G,MATCH($B$1&\"_\"&ROW()-1,Général!$H:$H,0),2))","v":""},{"$f":"IF(ROW()-1>COUNTIF(Général!$G:$G,$B$1),\"\",INDEX(Général!$A:$G,MATCH($B$1&\"_\"&ROW()-1,Général!$H:$H,0),3))","v":""},{"$f":"IF(ROW()-1>COUNTIF(Général!$G:$G,$B$1),\"\",INDEX(Général!$A:$G,MATCH($B$1&\"_\"&ROW()-1,Général!$H:$H,0),4))","v":""},{"$f":"IF(ROW()-1>COUNTIF(Général!$G:$G,$B$1),\"\",INDEX(Général!$A:$G,MATCH($B$1&\"_\"&ROW()-1,Général!$H:$H,0),5))","v":""},{"$f":"IF(ROW()-1>COUNTIF(Général!$G:$G,$B$1),\"\",INDEX(Général!$A:$G,MATCH($B$1&\"_\"&ROW()-1,Général!$H:$H,0),6))","v":""},{"$f":"IF(ROW()-1>COUNTIF(Général!$G:$G,$B$1),\"\",INDEX(Général!$A:$G,MATCH($B$1&\"_\"&ROW()-1,Général!$H:$H,0),7))","v":""}]
[{"$f":"IF(ROW()-1>COUNTIF(Général!$G:$G,$B$1),\"\",INDEX(Général!$A:$G,MATCH($B$1&\"_\"&ROW()-1,Général!$H:$H,0),1))","v":""},{"$f":"IF(ROW()-1>COUNTIF(Général!$G:$G,$B$1),\"\",INDEX(Général!$A:$G,MATCH($B$1&\"_\"&ROW()-1,Général!$H:$H,0),2))","v":""},{"$f":"IF(ROW()-1>COUNTIF(Général!$G:$G,$B$1),\"\",INDEX(Général!$A:$G,MATCH($B$1&\"_\"&ROW()-1,Général!$H:$H,0),3))","v":""},{"$f":"IF(ROW()-1>COUNTIF(Général!$G:$G,$B$1),\"\",INDEX(Général!$A:$G,MATCH($B$1&\"_\"&ROW()-1,Général!$H:$H,0),4))","v":""},{"$f":"IF(ROW()-1>COUNTIF(Général!$G:$G,$B$1),\"\",INDEX(Général!$A:$G,MATCH($B$1&\"_\"&ROW()-1,Général!$H:$H,0),5))","v":""},{"$f":"IF(ROW()-1>COUNTIF(Général!$G:$G,$B$1),\"\",INDEX(Général!$A:$G,MATCH($B$1&\"_\"&ROW()-1,Général!$H:$H,0),6))","v":""},{"$f":"IF(ROW()-1>COUNTIF(Général!$G:$G,$B$1),\"\",INDEX(Général!$A:$G,MATCH($B$1&\"_\"&ROW()-1,Général!$H:$H,0),7))","v":""}]
[{"$f":"IF(ROW()-1>COUNTIF(Général!$G:$G,$B$1),\"\",INDEX(Général!$A:$G,MATCH($B$1&\"_\"&ROW()-1,Général!$H:$H,0),1))","v":""},{"$f":"IF(ROW()-1>COUNTIF(Général!$G:$G,$B$1),\"\",INDEX(Général!$A:$G,MATCH($B$1&\"_\"&ROW()-1,Général!$H:$H,0),2))","v":""},{"$f":"IF(ROW()-1>COUNTIF(Général!$G:$G,$B$1),\"\",INDEX(Général!$A:$G,MATCH($B$1&\"_\"&ROW()-1,Général!$H:$H,0),3))","v":""},{"$f":"IF(ROW()-1>COUNTIF(Général!$G:$G,$B$1),\"\",INDEX(Général!$A:$G,MATCH($B$1&\"_\"&ROW()-1,Général!$H:$H,0),4))","v":""},{"$f":"IF(ROW()-1>COUNTIF(Général!$G:$G,$B$1),\"\",INDEX(Général!$A:$G,MATCH($B$1&\"_\"&ROW()-1,Général!$H:$H,0),5))","v":""},{"$f":"IF(ROW()-1>COUNTIF(Général!$G:$G,$B$1),\"\",INDEX(Général!$A:$G,MATCH($B$1&\"_\"&ROW()-1,Général!$H:$H,0),6))","v":""},{"$f":"IF(ROW()-1>COUNTIF(Général!$G:$G,$B$1),\"\",INDEX(Général!$A:$G,MATCH($B$1&\"_\"&ROW()-1,Général!$H:$H,0),7))","v":""}]
[{"$f":"IF(ROW()-1>COUNTIF(Général!$G:$G,$B$1),\"\",INDEX(Général!$A:$G,MATCH($B$1&\"_\"&ROW()-1,Général!$H:$H,0),1))","v":""},{"$f":"IF(ROW()-1>COUNTIF(Général!$G:$G,$B$1),\"\",INDEX(Général!$A:$G,MATCH($B$1&\"_\"&ROW()-1,Général!$H:$H,0),2))","v":""},{"$f":"IF(ROW()-1>COUNTIF(Général!$G:$G,$B$1),\"\",INDEX(Général!$A:$G,MATCH($B$1&\"_\"&ROW()-1,Général!$H:$H,0),3))","v":""},{"$f":"IF(ROW()-1>COUNTIF(Général!$G:$G,$B$1),\"\",INDEX(Général!$A:$G,MATCH($B$1&\"_\"&ROW()-1,Général!$H:$H,0),4))","v":""},{"$f":"IF(ROW()-1>COUNTIF(Général!$G:$G,$B$1),\"\",INDEX(Général!$A:$G,MATCH($B$1&\"_\"&ROW()-1,Général!$H:$H,0),5))","v":""},{"$f":"IF(ROW()-1>COUNTIF(Général!$G:$G,$B$1),\"\",INDEX(Général!$A:$G,MATCH($B$1&\"_\"&ROW()-1,Général!$H:$H,0),6))","v":""},{"$f":"IF(ROW()-1>COUNTIF(Général!$G:$G,$B$1),\"\",INDEX(Général!$A:$G,MATCH($B$1&\"_\"&ROW()-1,Général!$H:$H,0),7))","v":""}]
[{"$f":"IF(ROW()-1>COUNTIF(Général!$G:$G,$B$1),\"\",INDEX(Général!$A:$G,MATCH($B$1&\"_\"&ROW()-1,Général!$H:$H,0),1))","v":""},{"$f":"IF(ROW()-1>COUNTIF(Général!$G:$G,$B$1),\"\",INDEX(Général!$A:$G,MATCH($B$1&\"_\"&ROW()-1,Général!$H:$H,0),2))","v":""},{"$f":"IF(ROW()-1>COUNTIF(Général!$G:$G,$B$1),\"\",INDEX(Général!$A:$G,MATCH($B$1&\"_\"&ROW()-1,Général!$H:$H,0),3))","v":""},{"$f":"IF(ROW()-1>COUNTIF(Général!$G:$G,$B$1),\"\",INDEX(Général!$A:$G,MATCH($B$1&\"_\"&ROW()-1,Général!$H:$H,0),4))","v":""},{"$f":"IF(ROW()-1>COUNTIF(Général!$G:$G,$B$1),\"\",INDEX(Général!$A:$G,MATCH($B$1&\"_\"&ROW()-1,Général!$H:$H,0),5))","v":""},{"$f":"IF(ROW()-1>COUNTIF(Général!$G:$G,$B$1),\"\",INDEX(Général!$A:$G,MATCH($B$1&\"_\"&ROW()-1,Général!$H:$H,0),6))","v":""},{"$f":"IF(ROW()-1>COUNTIF(Général!$G:$G,$B$1),\"\",INDEX(Général!$A:$G,MATCH($B$1&\"_\"&ROW()-1,Général!$H:$H,0),7))","v":""}]
[{"$f":"IF(ROW()-1>COUNTIF(Général!$G:$G,$B$1),\"\",INDEX(Général!$A:$G,MATCH($B$1&\"_\"&ROW()-1,Général!$H:$H,0),1))","v":""},{"$f":"IF(ROW()-1>COUNTIF(Général!$G:$G,$B$1),\"\",INDEX(Général!$A:$G,MATCH($B$1&\"_\"&ROW()-1,Général!$H:$H,0),2))","v":""},{"$f":"IF(ROW()-1>COUNTIF(Général!$G:$G,$B$1),\"\",INDEX(Général!$A:$G,MATCH($B$1&\"_\"&ROW()-1,Général!$H:$H,0),3))","v":""},{"$f":"IF(ROW()-1>COUNTIF(Général!$G:$G,$B$1),\"\",INDEX(Général!$A:$G,MATCH($B$1&\"_\"&ROW()-1,Général!$H:$H,0),4))","v":""},{"$f":"IF(ROW()-1>COUNTIF(Général!$G:$G,$B$1),\"\",INDEX(Général!$A:$G,MATCH($B$1&\"_\"&ROW()-1,Général!$H:$H,0),5))","v":""},{"$f":"IF(ROW()-1>COUNTIF(Général!$G:$G,$B$1),\"\",INDEX(Général!$A:$G,MATCH($B$1&\"_\"&ROW()-1,Général!$H:$H,0),6))","v":""},{"$f":"IF(ROW()-1>COUNTIF(Général!$G:$G,$B$1),\"\",INDEX(Général!$A:$G,MATCH($B$1&\"_\"&ROW()-1,Général!$H:$H,0),7))","v":""}]
[{"$f":"IF(ROW()-1>COUNTIF(Général!$G:$G,$B$1),\"\",INDEX(Général!$A:$G,MATCH($B$1&\"_\"&ROW()-1,Général!$H:$H,0),1))","v":""},{"$f":"IF(ROW()-1>COUNTIF(Général!$G:$G,$B$1),\"\",INDEX(Général!$A:$G,MATCH($B$1&\"_\"&ROW()-1,Général!$H:$H,0),2))","v":""},{"$f":"IF(ROW()-1>COUNTIF(Général!$G:$G,$B$1),\"\",INDEX(Général!$A:$G,MATCH($B$1&\"_\"&ROW()-1,Général!$H:$H,0),3))","v":""},{"$f":"IF(ROW()-1>COUNTIF(Général!$G:$G,$B$1),\"\",INDEX(Général!$A:$G,MATCH($B$1&\"_\"&ROW()-1,Général!$H:$H,0),4))","v":""},{"$f":"IF(ROW()-1>COUNTIF(Général!$G:$G,$B$1),\"\",INDEX(Général!$A:$G,MATCH($B$1&\"_\"&ROW()-1,Général!$H:$H,0),5))","v":""},{"$f":"IF(ROW()-1>COUNTIF(Général!$G:$G,$B$1),\"\",INDEX(Général!$A:$G,MATCH($B$1&\"_\"&ROW()-1,Général!$H:$H,0),6))","v":""},{"$f":"IF(ROW()-1>COUNTIF(Général!$G:$G,$B$1),\"\",INDEX(Général!$A:$G,MATCH($B$1&\"_\"&ROW()-1,Général!$H:$H,0),7))","v":""}]
[{"$f":"IF(ROW()-1>COUNTIF(Général!$G:$G,$B$1),\"\",INDEX(Général!$A:$G,MATCH($B$1&\"_\"&ROW()-1,Général!$H:$H,0),1))","v":""},{"$f":"IF(ROW()-1>COUNTIF(Général!$G:$G,$B$1),\"\",INDEX(Général!$A:$G,MATCH($B$1&\"_\"&ROW()-1,Général!$H:$H,0),2))","v":""},{"$f":"IF(ROW()-1>COUNTIF(Général!$G:$G,$B$1),\"\",INDEX(Général!$A:$G,MATCH($B$1&\"_\"&ROW()-1,Général!$H:$H,0),3))","v":""},{"$f":"IF(ROW()-1>COUNTIF(Général!$G:$G,$B$1),\"\",INDEX(Général!$A:$G,MATCH($B$1&\"_\"&ROW()-1,Général!$H:$H,0),4))","v":""},{"$f":"IF(ROW()-1>COUNTIF(Général!$G:$G,$B$1),\"\",INDEX(Général!$A:$G,MATCH($B$1&\"_\"&ROW()-1,Général!$H:$H,0),5))","v":""},{"$f":"IF(ROW()-1>COUNTIF(Général!$G:$G,$B$1),\"\",INDEX(Général!$A:$G,MATCH($B$1&\"_\"&ROW()-1,Général!$H:$H,0),6))","v":""},{"$f":"IF(ROW()-1>COUNTIF(Général!$G:$G,$B$1),\"\",INDEX(Général!$A:$G,MATCH($B$1&\"_\"&ROW()-1,Général!$H:$H,0),7))","v":""}]
[{"$f":"IF(ROW()-1>COUNTIF(Général!$G:$G,$B$1),\"\",INDEX(Général!$A:$G,MATCH($B$1&\"_\"&ROW()-1,Général!$H:$H,0),1))","v":""},{"$f":"IF(ROW()-1>COUNTIF(Général!$G:$G,$B$1),\"\",INDEX(Général!$A:$G,MATCH($B$1&\"_\"&ROW()-1,Général!$H:$H,0),2))","v":""},{"$f":"IF(ROW()-1>COUNTIF(Général!$G:$G,$B$1),\"\",INDEX(Général!$A:$G,MATCH($B$1&\"_\"&ROW()-1,Général!$H:$H,0),3))","v":""},{"$f":"IF(ROW()-1>COUNTIF(Général!$G:$G,$B$1),\"\",INDEX(Général!$A:$G,MATCH($B$1&\"_\"&ROW()-1,Général!$H:$H,0),4))","v":""},{"$f":"IF(ROW()-1>COUNTIF(Général!$G:$G,$B$1),\"\",INDEX(Général!$A:$G,MATCH($B$1&\"_\"&ROW()-1,Général!$H:$H,0),5))","v":""},{"$f":"IF(ROW()-1>COUNTIF(Général!$G:$G,$B$1),\"\",INDEX(Général!$A:$G,MATCH($B$1&\"_\"&ROW()-1,Général!$H:$H,0),6))","v":""},{"$f":"IF(ROW()-1>COUNTIF(Général!$G:$G,$B$1),\"\",INDEX(Général!$A:$G,MATCH($B$1&\"_\"&ROW()-1,Général!$H:$H,0),7))","v":""}]
[{"$f":"IF(ROW()-1>COUNTIF(Général!$G:$G,$B$1),\"\",INDEX(Général!$A:$G,MATCH($B$1&\"_\"&ROW()-1,Général!$H:$H,0),1))","v":""},{"$f":"IF(ROW()-1>COUNTIF(Général!$G:$G,$B$1),\"\",INDEX(Général!$A:$G,MATCH($B$1&\"_\"&ROW()-1,Général!$H:$H,0),2))","v":""},{"$f":"IF(ROW()-1>COUNTIF(Général!$G:$G,$B$1),\"\",INDEX(Général!$A:$G,MATCH($B$1&\"_\"&ROW()-1,Général!$H:$H,0),3))","v":""},{"$f":"IF(ROW()-1>COUNTIF(Général!$G:$G,$B$1),\"\",INDEX(Général!$A:$G,MATCH($B$1&\"_\"&ROW()-1,Général!$H:$H,0),4))","v":""},{"$f":"IF(ROW()-1>COUNTIF(Général!$G:$G,$B$1),\"\",INDEX(Général!$A:$G,MATCH($B$1&\"_\"&ROW()-1,Général!$H:$H,0),5))","v":""},{"$f":"IF(ROW()-1>COUNTIF(Général!$G:$G,$B$1),\"\",INDEX(Général!$A:$G,MATCH($B$1&\"_\"&ROW()-1,Général!$H:$H,0),6))","v":""},{"$f":"IF(ROW()-1>COUNTIF(Général!$G:$G,$B$1),\"\",INDEX(Général!$A:$G,MATCH($B$1&\"_\"&ROW()-1,Général!$H:$H,0),7))","v":""}]
[{"$f":"IF(ROW()-1>COUNTIF(Général!$G:$G,$B$1),\"\",INDEX(Général!$A:$G,MATCH($B$1&\"_\"&ROW()-1,Général!$H:$H,0),1))","v":""},{"$f":"IF(ROW()-1>COUNTIF(Général!$G:$G,$B$1),\"\",INDEX(Général!$A:$G,MATCH($B$1&\"_\"&ROW()-1,Général!$H:$H,0),2))","v":""},{"$f":"IF(ROW()-1>COUNTIF(Général!$G:$G,$B$1),\"\",INDEX(Général!$A:$G,MATCH($B$1&\"_\"&ROW()-1,Général!$H:$H,0),3))","v":""},{"$f":"IF(ROW()-1>COUNTIF(Général!$G:$G,$B$1),\"\",INDEX(Général!$A:$G,MATCH($B$1&\"_\"&ROW()-1,Général!$H:$H,0),4))","v":""},{"$f":"IF(ROW()-1>COUNTIF(Général!$G:$G,$B$1),\"\",INDEX(Général!$A:$G,MATCH($B$1&\"_\"&ROW()-1,Général!$H:$H,0),5))","v":""},{"$f":"IF(ROW()-1>COUNTIF(Général!$G:$G,$B$1),\"\",INDEX(Général!$A:$G,MATCH($B$1&\"_\"&ROW()-1,Général!$H:$H,0),6))","v":""},{"$f":"IF(ROW()-1>COUNTIF(Général!$G:$G,$B$1),\"\",INDEX(Général!$A:$G,MATCH($B$1&\"_\"&ROW()-1,Général!$H:$H,0),7))","v":""}]