{"text_format":"1","workbook":"xlsx","n_sheets":15,"sheets":["Notice","CS réf","Graph réf","registre","debit réf","recapitulatif etat initial","Résultats expérience","Graph CO2","bilan","Bilan GRAPH","Sources","Formules utilisées","liste déroulante","Feuil1","Feuil2"],"not_rendered":{"charts":15,"images":1,"macros":1,"external_links":1,"defined_names":109,"comments":0,"pivot_tables":0},"unopened":[{"sheet":"registre","index":3,"reason":"not_a_worksheet"},{"sheet":"Graph CO2","index":7,"reason":"not_a_worksheet"}],"bounds":{"document_bytes":16777216,"sheet_cells":100000,"rows_first":2000,"rows_last":500,"rows_between":2000,"halvings":0,"cell_chars":16384,"cell_head_chars":4096},"cells_cut":0,"cells_raw":0,"read":"whole","date_system":"1900"}

{"sheet":"Notice","index":0,"n_rows":1,"n_cols":4,"rows_kept":1,"cut":false,"hidden":false,"merged":[[0,3,0,7]]}
[null,null,null,"Notice"]

{"sheet":"CS réf","index":1,"n_rows":85,"n_cols":12,"rows_kept":85,"cut":false,"hidden":false,"merged":[[0,2,0,8],[7,7,7,9],[47,3,47,6],[77,1,78,1]]}
[null,null,"Condition de simulation"]
[]
[]
[null,"occupation ",17.7,"l/h/élev"]
[null,null,1.5,"kg/m3"]
[null,"Puissance produite",70,"W/élève"]
[null,"Production de vapeur",1.4,"l/jour",{"$f":"C7/(24*3600)","v":1.6203703703703704E-5},"l/s = kg/s"]
[null,null,null,null,null,null,null,"Air extérieur"]
[null,"Surface de la pièce",null,"m²",null,null,null,"°C","%","kge/kgas"]
[null,"Hauteur sous plafond",null,"m",null,null,null,"Température","Humidité relative","Humidité absolue"]
[null,"V pièce=",1049,"m3",null,null,null,-7,80,{"$f":"HUMSPE2(H11,I11)","v":1.7865331475741858E-3}]
[null,null,1.2,"kg/m3"]
[null,"kg air dans la pièce (constante)",{"$f":"C12*C11","v":1258.8},"kg air "]
[null,"Cp air",1006,"J/(kg.K)"]
[null,"Cp eau",4186,"J/(kg.K)"]
[]
[null,"débit à réguler"]
[]
[null,"Air neuf",5500,"m3/h "]
[null,"Taux de CO2 réglementaire ",1700,"ppm"]
[null,"taux de CO2 dans l'air neuf",500,"ppm"]
[]
[]
[null,"Scénario d'occupation"]
[]
[null,"Taux d'occupation",1,0.75,0.5,0.25,null,null,null,null,"presence des eleves","pause midi"]
[null,"nombre d'eleve",352,{"$f":"D26*$C$27","v":264},{"$f":"E26*$C$27","v":176},{"$f":"F26*$C$27","v":88},null,null,null,null,"ar","pm"]
[null,null,null,null,null,null,null,null,null,null,"dep","rm"]
[null,"Présence des élèves",null,null,null,null,null,null,"lundi","de ","08:00:00","12:00:00"]
[null,null,"de","08:00:00","à","18:00:00",null,null,null,"à","18:00:00","13:00:00"]
[null,null,null,null,null,null,null,null,"mardi","de ","12:00:00","12:00:00"]
[null,"pause midi",null,null,null,null,null,null,null,"à","14:00:00","12:00:00"]
[null,null,"de","12:00:00","à","13:30:00",null,null,"mercredi","de ","12:00:00","12:00:00"]
[null,null,null,null,null,null,null,null,null,"à","12:00:00","12:00:00"]
[null,null,null,null,null,null,null,null,"jeudi","de ","12:00:00","12:00:00"]
[null,"Scénario de ventilation",null,null,null,null,null,null,null,"à","12:00:00","12:00:00"]
[null,null,null,null,null,null,null,null,"vendredi","de ","12:00:00","12:00:00"]
[null,"planning de ventilation ",null,null,null,null,null,null,null,"à","12:00:00","12:00:00"]
[null,null,"de","00:00:00","à","23:50:00",null,null,"samedi","de ","12:00:00","12:00:00"]
[null,null,null,null,null,null,null,null,null,"à","12:00:00","12:00:00"]
[null,null,null,null,null,null,null,null,"dimanche","de ","12:00:00","12:00:00"]
[null,null,null,null,null,null,null,null,null,"à","12:00:00","12:00:00"]
[null,"Scénario de chauffage"]
[null,"inoccupation",17,"°C"]
[null,"préchauffage",30,"°C"]
[null,"occupation",20,"°C"]
[]
[null,null,"Température de soufflage","plage horaire"]
[null,"préchauffage",{"$f":"C45","v":30},"de","07:30:00","à","08:00:00"]
[null,"occupation",{"$f":"C46","v":20},"de","08:00:00","à","18:00:00"]
[null,"pause midi",{"$f":"C46","v":20},"de","12:00:00","à","13:30:00"]
[]
[]
[null,null,"entrée","sortie"]
[null,"Températures d'eau",85,65]
[]
[null,"Déperdition"]
[null,"temperature dans l'amphie ",17,null,"u*S",{"$f":"C63*C69","v":5243.0299999999988},"W/K"]
[null,"température sous comble",15,"°C","P = U*S*DT"]
[null,"landa beton",1.3,null,{"$f":"C63*C69*(C58-C59)","v":10486.059999999998},"W"]
[null,"épaisseur",0.2,null,"t "]
[null,"r = (E/lambda",{"$f":"C61/C60","v":0.15384615384615385}]
[null,"u = 1/R  ",{"$f":"1/C62","v":6.5},"W/m²/K"]
[]
[]
[null,"surface de murs",257,"m2"]
[null,"surface de plancher haut",272.8,"m2"]
[null,"surface de plancher bas",276.82,"m2"]
[null,null,{"$f":"SUM(C66:C68)","v":806.61999999999989}]
[]
[null,"deperdituin"]
[]
[]
[]
[]
[null,"equipement"]
[]
[null,"debit variable"]
[]
[]
[null,"echangeur de chaleur","oui"]
[null,"registre","oui"]
[]
[null,"tepérature de free cooling"]
[null,null,20]

{"sheet":"Graph réf","index":2,"n_rows":0,"n_cols":0,"rows_kept":0,"cut":false,"hidden":false,"merged":[]}

{"sheet":"debit réf","index":4,"n_rows":1032,"n_cols":8,"rows_kept":1032,"cut":false,"hidden":false,"merged":[]}
[]
[null,null,null,"presence des eleves","pause midi"]
[null,null,null,"ar","pm"]
[null,null,null,"dep","rm"]
[null,"lundi","de ","08:00:00","12:00:00"]
[null,null,"à","18:00:00","13:00:00",null,null,"B5:E18 nommé Champ"]
[null,"mardi","de ","12:00:00","12:00:00",null,null,"B5:B18 nommé jour"]
[null,null,"à","14:00:00","12:00:00",null,null,"reste à savoir comment on procède poiur inclure le début de la pause 12h et la fin dans le calcul"]
[null,"mercredi","de ","12:00:00","12:00:00",null,null,"soit on enlève le =dans un des items de la formule"]
[null,null,"à","12:00:00","12:00:00",null,null,"soit on écrit 11:59 dans la colonne D ou E au choix"]
[null,"jeudi","de ","12:00:00","12:00:00",null,null,"car on ne peut pas à la fois inclure ou éliminer la même valeur"]
[null,null,"à","12:00:00","12:00:00",null,null,"les lignes \"occupé\" sont en vert dans la colonne D"]
[null,"vendredi","de ","12:00:00","12:00:00",null,null,"question:"]
[null,null,"à","12:00:00","12:00:00",null,null,"si les horaires de disponibilté (ar, pm,dep,rm) sont figés, pourquoi placer des heures en colonne C en dehors de ces fourchettes????"]
[null,"samedi","de ","12:00:00","12:00:00"]
[null,null,"à","12:00:00","12:00:00",null,null,"Pour le calcul direct du taux d'occupation,il faudrait donner des infos sur les régles de calcul"]
[null,"dimanche","de ","12:00:00","12:00:00"]
[null,null,"à","12:00:00","12:00:00"]
[]
[]
[null,null,null,"Debir constant "]
[null,null,null,"occupation "]
[null,null,"5 min"]
[null,null,"Heure","occupation 100%"]
["LUNDI",1,"00:00:00",{"$f":"IF(OR(AND(C25>=INDEX(Champ,MATCH(A25,Jour,0),3),C25<=INDEX(Champ,MATCH(A25,Jour,0),4)),AND(C25>=INDEX(Champ,MATCH(A25,Jour,0)+1,4),C25<=INDEX(Champ,MATCH(A25,Jour,0)+1,3))),\"occupé\",\"\")","v":""}]
["LUNDI",1,"00:10:00",{"$f":"IF(OR(AND(C26>=INDEX(Champ,MATCH(A26,Jour,0),3),C26<=INDEX(Champ,MATCH(A26,Jour,0),4)),AND(C26>=INDEX(Champ,MATCH(A26,Jour,0)+1,4),C26<=INDEX(Champ,MATCH(A26,Jour,0)+1,3))),\"occupé\",\"\")","v":""}]
["LUNDI",1,"00:20:00",{"$f":"IF(OR(AND(C27>=INDEX(Champ,MATCH(A27,Jour,0),3),C27<=INDEX(Champ,MATCH(A27,Jour,0),4)),AND(C27>=INDEX(Champ,MATCH(A27,Jour,0)+1,4),C27<=INDEX(Champ,MATCH(A27,Jour,0)+1,3))),\"occupé\",\"\")","v":""}]
["LUNDI",1,"00:30:00",{"$f":"IF(OR(AND(C28>=INDEX(Champ,MATCH(A28,Jour,0),3),C28<=INDEX(Champ,MATCH(A28,Jour,0),4)),AND(C28>=INDEX(Champ,MATCH(A28,Jour,0)+1,4),C28<=INDEX(Champ,MATCH(A28,Jour,0)+1,3))),\"occupé\",\"\")","v":""}]
["LUNDI",1,"00:40:00",{"$f":"IF(OR(AND(C29>=INDEX(Champ,MATCH(A29,Jour,0),3),C29<=INDEX(Champ,MATCH(A29,Jour,0),4)),AND(C29>=INDEX(Champ,MATCH(A29,Jour,0)+1,4),C29<=INDEX(Champ,MATCH(A29,Jour,0)+1,3))),\"occupé\",\"\")","v":""}]
["LUNDI",1,"00:50:00",{"$f":"IF(OR(AND(C30>=INDEX(Champ,MATCH(A30,Jour,0),3),C30<=INDEX(Champ,MATCH(A30,Jour,0),4)),AND(C30>=INDEX(Champ,MATCH(A30,Jour,0)+1,4),C30<=INDEX(Champ,MATCH(A30,Jour,0)+1,3))),\"occupé\",\"\")","v":""}]
["LUNDI",2,"01:00:00",{"$f":"IF(OR(AND(C31>=INDEX(Champ,MATCH(A31,Jour,0),3),C31<=INDEX(Champ,MATCH(A31,Jour,0),4)),AND(C31>=INDEX(Champ,MATCH(A31,Jour,0)+1,4),C31<=INDEX(Champ,MATCH(A31,Jour,0)+1,3))),\"occupé\",\"\")","v":""}]
["LUNDI",2,"01:10:00",{"$f":"IF(OR(AND(C32>=INDEX(Champ,MATCH(A32,Jour,0),3),C32<=INDEX(Champ,MATCH(A32,Jour,0),4)),AND(C32>=INDEX(Champ,MATCH(A32,Jour,0)+1,4),C32<=INDEX(Champ,MATCH(A32,Jour,0)+1,3))),\"occupé\",\"\")","v":""}]
["LUNDI",2,"01:20:00",{"$f":"IF(OR(AND(C33>=INDEX(Champ,MATCH(A33,Jour,0),3),C33<=INDEX(Champ,MATCH(A33,Jour,0),4)),AND(C33>=INDEX(Champ,MATCH(A33,Jour,0)+1,4),C33<=INDEX(Champ,MATCH(A33,Jour,0)+1,3))),\"occupé\",\"\")","v":""}]
["LUNDI",2,"01:30:00",{"$f":"IF(OR(AND(C34>=INDEX(Champ,MATCH(A34,Jour,0),3),C34<=INDEX(Champ,MATCH(A34,Jour,0),4)),AND(C34>=INDEX(Champ,MATCH(A34,Jour,0)+1,4),C34<=INDEX(Champ,MATCH(A34,Jour,0)+1,3))),\"occupé\",\"\")","v":""}]
["LUNDI",2,"01:40:00",{"$f":"IF(OR(AND(C35>=INDEX(Champ,MATCH(A35,Jour,0),3),C35<=INDEX(Champ,MATCH(A35,Jour,0),4)),AND(C35>=INDEX(Champ,MATCH(A35,Jour,0)+1,4),C35<=INDEX(Champ,MATCH(A35,Jour,0)+1,3))),\"occupé\",\"\")","v":""}]
["LUNDI",2,"01:50:00",{"$f":"IF(OR(AND(C36>=INDEX(Champ,MATCH(A36,Jour,0),3),C36<=INDEX(Champ,MATCH(A36,Jour,0),4)),AND(C36>=INDEX(Champ,MATCH(A36,Jour,0)+1,4),C36<=INDEX(Champ,MATCH(A36,Jour,0)+1,3))),\"occupé\",\"\")","v":""}]
["LUNDI",3,"02:00:00",{"$f":"IF(OR(AND(C37>=INDEX(Champ,MATCH(A37,Jour,0),3),C37<=INDEX(Champ,MATCH(A37,Jour,0),4)),AND(C37>=INDEX(Champ,MATCH(A37,Jour,0)+1,4),C37<=INDEX(Champ,MATCH(A37,Jour,0)+1,3))),\"occupé\",\"\")","v":""}]
["LUNDI",3,"02:10:00",{"$f":"IF(OR(AND(C38>=INDEX(Champ,MATCH(A38,Jour,0),3),C38<=INDEX(Champ,MATCH(A38,Jour,0),4)),AND(C38>=INDEX(Champ,MATCH(A38,Jour,0)+1,4),C38<=INDEX(Champ,MATCH(A38,Jour,0)+1,3))),\"occupé\",\"\")","v":""}]
["LUNDI",3,"02:20:00",{"$f":"IF(OR(AND(C39>=INDEX(Champ,MATCH(A39,Jour,0),3),C39<=INDEX(Champ,MATCH(A39,Jour,0),4)),AND(C39>=INDEX(Champ,MATCH(A39,Jour,0)+1,4),C39<=INDEX(Champ,MATCH(A39,Jour,0)+1,3))),\"occupé\",\"\")","v":""}]
["LUNDI",3,"02:30:00",{"$f":"IF(OR(AND(C40>=INDEX(Champ,MATCH(A40,Jour,0),3),C40<=INDEX(Champ,MATCH(A40,Jour,0),4)),AND(C40>=INDEX(Champ,MATCH(A40,Jour,0)+1,4),C40<=INDEX(Champ,MATCH(A40,Jour,0)+1,3))),\"occupé\",\"\")","v":""}]
["LUNDI",3,"02:40:00",{"$f":"IF(OR(AND(C41>=INDEX(Champ,MATCH(A41,Jour,0),3),C41<=INDEX(Champ,MATCH(A41,Jour,0),4)),AND(C41>=INDEX(Champ,MATCH(A41,Jour,0)+1,4),C41<=INDEX(Champ,MATCH(A41,Jour,0)+1,3))),\"occupé\",\"\")","v":""}]
["LUNDI",3,"02:50:00",{"$f":"IF(OR(AND(C42>=INDEX(Champ,MATCH(A42,Jour,0),3),C42<=INDEX(Champ,MATCH(A42,Jour,0),4)),AND(C42>=INDEX(Champ,MATCH(A42,Jour,0)+1,4),C42<=INDEX(Champ,MATCH(A42,Jour,0)+1,3))),\"occupé\",\"\")","v":""}]
["LUNDI",4,"03:00:00",{"$f":"IF(OR(AND(C43>=INDEX(Champ,MATCH(A43,Jour,0),3),C43<=INDEX(Champ,MATCH(A43,Jour,0),4)),AND(C43>=INDEX(Champ,MATCH(A43,Jour,0)+1,4),C43<=INDEX(Champ,MATCH(A43,Jour,0)+1,3))),\"occupé\",\"\")","v":""}]
["LUNDI",4,"03:10:00",{"$f":"IF(OR(AND(C44>=INDEX(Champ,MATCH(A44,Jour,0),3),C44<=INDEX(Champ,MATCH(A44,Jour,0),4)),AND(C44>=INDEX(Champ,MATCH(A44,Jour,0)+1,4),C44<=INDEX(Champ,MATCH(A44,Jour,0)+1,3))),\"occupé\",\"\")","v":""}]
["LUNDI",4,"03:20:00",{"$f":"IF(OR(AND(C45>=INDEX(Champ,MATCH(A45,Jour,0),3),C45<=INDEX(Champ,MATCH(A45,Jour,0),4)),AND(C45>=INDEX(Champ,MATCH(A45,Jour,0)+1,4),C45<=INDEX(Champ,MATCH(A45,Jour,0)+1,3))),\"occupé\",\"\")","v":""}]
["LUNDI",4,"03:30:00",{"$f":"IF(OR(AND(C46>=INDEX(Champ,MATCH(A46,Jour,0),3),C46<=INDEX(Champ,MATCH(A46,Jour,0),4)),AND(C46>=INDEX(Champ,MATCH(A46,Jour,0)+1,4),C46<=INDEX(Champ,MATCH(A46,Jour,0)+1,3))),\"occupé\",\"\")","v":""}]
["LUNDI",4,"03:40:00",{"$f":"IF(OR(AND(C47>=INDEX(Champ,MATCH(A47,Jour,0),3),C47<=INDEX(Champ,MATCH(A47,Jour,0),4)),AND(C47>=INDEX(Champ,MATCH(A47,Jour,0)+1,4),C47<=INDEX(Champ,MATCH(A47,Jour,0)+1,3))),\"occupé\",\"\")","v":""}]
["LUNDI",4,"03:50:00",{"$f":"IF(OR(AND(C48>=INDEX(Champ,MATCH(A48,Jour,0),3),C48<=INDEX(Champ,MATCH(A48,Jour,0),4)),AND(C48>=INDEX(Champ,MATCH(A48,Jour,0)+1,4),C48<=INDEX(Champ,MATCH(A48,Jour,0)+1,3))),\"occupé\",\"\")","v":""}]
["LUNDI",5,"04:00:00",{"$f":"IF(OR(AND(C49>=INDEX(Champ,MATCH(A49,Jour,0),3),C49<=INDEX(Champ,MATCH(A49,Jour,0),4)),AND(C49>=INDEX(Champ,MATCH(A49,Jour,0)+1,4),C49<=INDEX(Champ,MATCH(A49,Jour,0)+1,3))),\"occupé\",\"\")","v":""}]
["LUNDI",5,"04:10:00",{"$f":"IF(OR(AND(C50>=INDEX(Champ,MATCH(A50,Jour,0),3),C50<=INDEX(Champ,MATCH(A50,Jour,0),4)),AND(C50>=INDEX(Champ,MATCH(A50,Jour,0)+1,4),C50<=INDEX(Champ,MATCH(A50,Jour,0)+1,3))),\"occupé\",\"\")","v":""}]
["LUNDI",5,"04:20:00",{"$f":"IF(OR(AND(C51>=INDEX(Champ,MATCH(A51,Jour,0),3),C51<=INDEX(Champ,MATCH(A51,Jour,0),4)),AND(C51>=INDEX(Champ,MATCH(A51,Jour,0)+1,4),C51<=INDEX(Champ,MATCH(A51,Jour,0)+1,3))),\"occupé\",\"\")","v":""}]
["LUNDI",5,"04:30:00",{"$f":"IF(OR(AND(C52>=INDEX(Champ,MATCH(A52,Jour,0),3),C52<=INDEX(Champ,MATCH(A52,Jour,0),4)),AND(C52>=INDEX(Champ,MATCH(A52,Jour,0)+1,4),C52<=INDEX(Champ,MATCH(A52,Jour,0)+1,3))),\"occupé\",\"\")","v":""}]
["LUNDI",5,"04:40:00",{"$f":"IF(OR(AND(C53>=INDEX(Champ,MATCH(A53,Jour,0),3),C53<=INDEX(Champ,MATCH(A53,Jour,0),4)),AND(C53>=INDEX(Champ,MATCH(A53,Jour,0)+1,4),C53<=INDEX(Champ,MATCH(A53,Jour,0)+1,3))),\"occupé\",\"\")","v":""}]
["LUNDI",5,"04:50:00",{"$f":"IF(OR(AND(C54>=INDEX(Champ,MATCH(A54,Jour,0),3),C54<=INDEX(Champ,MATCH(A54,Jour,0),4)),AND(C54>=INDEX(Champ,MATCH(A54,Jour,0)+1,4),C54<=INDEX(Champ,MATCH(A54,Jour,0)+1,3))),\"occupé\",\"\")","v":""}]
["LUNDI",6,"05:00:00",{"$f":"IF(OR(AND(C55>=INDEX(Champ,MATCH(A55,Jour,0),3),C55<=INDEX(Champ,MATCH(A55,Jour,0),4)),AND(C55>=INDEX(Champ,MATCH(A55,Jour,0)+1,4),C55<=INDEX(Champ,MATCH(A55,Jour,0)+1,3))),\"occupé\",\"\")","v":""}]
["LUNDI",6,"05:10:00",{"$f":"IF(OR(AND(C56>=INDEX(Champ,MATCH(A56,Jour,0),3),C56<=INDEX(Champ,MATCH(A56,Jour,0),4)),AND(C56>=INDEX(Champ,MATCH(A56,Jour,0)+1,4),C56<=INDEX(Champ,MATCH(A56,Jour,0)+1,3))),\"occupé\",\"\")","v":""}]
["LUNDI",6,"05:20:00",{"$f":"IF(OR(AND(C57>=INDEX(Champ,MATCH(A57,Jour,0),3),C57<=INDEX(Champ,MATCH(A57,Jour,0),4)),AND(C57>=INDEX(Champ,MATCH(A57,Jour,0)+1,4),C57<=INDEX(Champ,MATCH(A57,Jour,0)+1,3))),\"occupé\",\"\")","v":""}]
["LUNDI",6,"05:30:00",{"$f":"IF(OR(AND(C58>=INDEX(Champ,MATCH(A58,Jour,0),3),C58<=INDEX(Champ,MATCH(A58,Jour,0),4)),AND(C58>=INDEX(Champ,MATCH(A58,Jour,0)+1,4),C58<=INDEX(Champ,MATCH(A58,Jour,0)+1,3))),\"occupé\",\"\")","v":""}]
["LUNDI",6,"05:40:00",{"$f":"IF(OR(AND(C59>=INDEX(Champ,MATCH(A59,Jour,0),3),C59<=INDEX(Champ,MATCH(A59,Jour,0),4)),AND(C59>=INDEX(Champ,MATCH(A59,Jour,0)+1,4),C59<=INDEX(Champ,MATCH(A59,Jour,0)+1,3))),\"occupé\",\"\")","v":""}]
["LUNDI",6,"05:50:00",{"$f":"IF(OR(AND(C60>=INDEX(Champ,MATCH(A60,Jour,0),3),C60<=INDEX(Champ,MATCH(A60,Jour,0),4)),AND(C60>=INDEX(Champ,MATCH(A60,Jour,0)+1,4),C60<=INDEX(Champ,MATCH(A60,Jour,0)+1,3))),\"occupé\",\"\")","v":""}]
["LUNDI",7,"06:00:00",{"$f":"IF(OR(AND(C61>=INDEX(Champ,MATCH(A61,Jour,0),3),C61<=INDEX(Champ,MATCH(A61,Jour,0),4)),AND(C61>=INDEX(Champ,MATCH(A61,Jour,0)+1,4),C61<=INDEX(Champ,MATCH(A61,Jour,0)+1,3))),\"occupé\",\"\")","v":""}]
["LUNDI",7,"06:10:00",{"$f":"IF(OR(AND(C62>=INDEX(Champ,MATCH(A62,Jour,0),3),C62<=INDEX(Champ,MATCH(A62,Jour,0),4)),AND(C62>=INDEX(Champ,MATCH(A62,Jour,0)+1,4),C62<=INDEX(Champ,MATCH(A62,Jour,0)+1,3))),\"occupé\",\"\")","v":""}]
["LUNDI",7,"06:20:00",{"$f":"IF(OR(AND(C63>=INDEX(Champ,MATCH(A63,Jour,0),3),C63<=INDEX(Champ,MATCH(A63,Jour,0),4)),AND(C63>=INDEX(Champ,MATCH(A63,Jour,0)+1,4),C63<=INDEX(Champ,MATCH(A63,Jour,0)+1,3))),\"occupé\",\"\")","v":""}]
["LUNDI",7,"06:30:00",{"$f":"IF(OR(AND(C64>=INDEX(Champ,MATCH(A64,Jour,0),3),C64<=INDEX(Champ,MATCH(A64,Jour,0),4)),AND(C64>=INDEX(Champ,MATCH(A64,Jour,0)+1,4),C64<=INDEX(Champ,MATCH(A64,Jour,0)+1,3))),\"occupé\",\"\")","v":""}]
["LUNDI",7,"06:40:00",{"$f":"IF(OR(AND(C65>=INDEX(Champ,MATCH(A65,Jour,0),3),C65<=INDEX(Champ,MATCH(A65,Jour,0),4)),AND(C65>=INDEX(Champ,MATCH(A65,Jour,0)+1,4),C65<=INDEX(Champ,MATCH(A65,Jour,0)+1,3))),\"occupé\",\"\")","v":""}]
["LUNDI",7,"06:50:00",{"$f":"IF(OR(AND(C66>=INDEX(Champ,MATCH(A66,Jour,0),3),C66<=INDEX(Champ,MATCH(A66,Jour,0),4)),AND(C66>=INDEX(Champ,MATCH(A66,Jour,0)+1,4),C66<=INDEX(Champ,MATCH(A66,Jour,0)+1,3))),\"occupé\",\"\")","v":""}]
["LUNDI",8,"07:00:00",{"$f":"IF(OR(AND(C67>=INDEX(Champ,MATCH(A67,Jour,0),3),C67<=INDEX(Champ,MATCH(A67,Jour,0),4)),AND(C67>=INDEX(Champ,MATCH(A67,Jour,0)+1,4),C67<=INDEX(Champ,MATCH(A67,Jour,0)+1,3))),\"occupé\",\"\")","v":""}]
["LUNDI",8,"07:10:00",{"$f":"IF(OR(AND(C68>=INDEX(Champ,MATCH(A68,Jour,0),3),C68<=INDEX(Champ,MATCH(A68,Jour,0),4)),AND(C68>=INDEX(Champ,MATCH(A68,Jour,0)+1,4),C68<=INDEX(Champ,MATCH(A68,Jour,0)+1,3))),\"occupé\",\"\")","v":""}]
["LUNDI",8,"07:20:00",{"$f":"IF(OR(AND(C69>=INDEX(Champ,MATCH(A69,Jour,0),3),C69<=INDEX(Champ,MATCH(A69,Jour,0),4)),AND(C69>=INDEX(Champ,MATCH(A69,Jour,0)+1,4),C69<=INDEX(Champ,MATCH(A69,Jour,0)+1,3))),\"occupé\",\"\")","v":""}]
["LUNDI",8,"07:30:00",{"$f":"IF(OR(AND(C70>=INDEX(Champ,MATCH(A70,Jour,0),3),C70<=INDEX(Champ,MATCH(A70,Jour,0),4)),AND(C70>=INDEX(Champ,MATCH(A70,Jour,0)+1,4),C70<=INDEX(Champ,MATCH(A70,Jour,0)+1,3))),\"occupé\",\"\")","v":""}]
["LUNDI",8,"07:40:00",{"$f":"IF(OR(AND(C71>=INDEX(Champ,MATCH(A71,Jour,0),3),C71<=INDEX(Champ,MATCH(A71,Jour,0),4)),AND(C71>=INDEX(Champ,MATCH(A71,Jour,0)+1,4),C71<=INDEX(Champ,MATCH(A71,Jour,0)+1,3))),\"occupé\",\"\")","v":""}]
["LUNDI",8,"07:50:00",{"$f":"IF(OR(AND(C72>=INDEX(Champ,MATCH(A72,Jour,0),3),C72<=INDEX(Champ,MATCH(A72,Jour,0),4)),AND(C72>=INDEX(Champ,MATCH(A72,Jour,0)+1,4),C72<=INDEX(Champ,MATCH(A72,Jour,0)+1,3))),\"occupé\",\"\")","v":""}]
["Lundi",9,"08:00:00",{"$f":"IF(OR(AND(C73>=INDEX(Champ,MATCH(A73,Jour,0),3),C73<=INDEX(Champ,MATCH(A73,Jour,0),4)),AND(C73>=INDEX(Champ,MATCH(A73,Jour,0)+1,4),C73<=INDEX(Champ,MATCH(A73,Jour,0)+1,3))),\"occupé\",\"\")","v":"occupé"}]
["LUNDI",9,"08:10:00",{"$f":"IF(OR(AND(C74>=INDEX(Champ,MATCH(A74,Jour,0),3),C74<=INDEX(Champ,MATCH(A74,Jour,0),4)),AND(C74>=INDEX(Champ,MATCH(A74,Jour,0)+1,4),C74<=INDEX(Champ,MATCH(A74,Jour,0)+1,3))),\"occupé\",\"\")","v":"occupé"}]
["LUNDI",9,"08:20:00",{"$f":"IF(OR(AND(C75>=INDEX(Champ,MATCH(A75,Jour,0),3),C75<=INDEX(Champ,MATCH(A75,Jour,0),4)),AND(C75>=INDEX(Champ,MATCH(A75,Jour,0)+1,4),C75<=INDEX(Champ,MATCH(A75,Jour,0)+1,3))),\"occupé\",\"\")","v":"occupé"}]
["LUNDI",9,"08:30:00",{"$f":"IF(OR(AND(C76>=INDEX(Champ,MATCH(A76,Jour,0),3),C76<=INDEX(Champ,MATCH(A76,Jour,0),4)),AND(C76>=INDEX(Champ,MATCH(A76,Jour,0)+1,4),C76<=INDEX(Champ,MATCH(A76,Jour,0)+1,3))),\"occupé\",\"\")","v":"occupé"}]
["LUNDI",9,"08:40:00",{"$f":"IF(OR(AND(C77>=INDEX(Champ,MATCH(A77,Jour,0),3),C77<=INDEX(Champ,MATCH(A77,Jour,0),4)),AND(C77>=INDEX(Champ,MATCH(A77,Jour,0)+1,4),C77<=INDEX(Champ,MATCH(A77,Jour,0)+1,3))),\"occupé\",\"\")","v":"occupé"}]
["LUNDI",9,"08:50:00",{"$f":"IF(OR(AND(C78>=INDEX(Champ,MATCH(A78,Jour,0),3),C78<=INDEX(Champ,MATCH(A78,Jour,0),4)),AND(C78>=INDEX(Champ,MATCH(A78,Jour,0)+1,4),C78<=INDEX(Champ,MATCH(A78,Jour,0)+1,3))),\"occupé\",\"\")","v":"occupé"}]
["LUNDI",10,"09:00:00",{"$f":"IF(OR(AND(C79>=INDEX(Champ,MATCH(A79,Jour,0),3),C79<=INDEX(Champ,MATCH(A79,Jour,0),4)),AND(C79>=INDEX(Champ,MATCH(A79,Jour,0)+1,4),C79<=INDEX(Champ,MATCH(A79,Jour,0)+1,3))),\"occupé\",\"\")","v":"occupé"}]
["LUNDI",10,"09:10:00",{"$f":"IF(OR(AND(C80>=INDEX(Champ,MATCH(A80,Jour,0),3),C80<=INDEX(Champ,MATCH(A80,Jour,0),4)),AND(C80>=INDEX(Champ,MATCH(A80,Jour,0)+1,4),C80<=INDEX(Champ,MATCH(A80,Jour,0)+1,3))),\"occupé\",\"\")","v":"occupé"}]
["LUNDI",10,"09:20:00",{"$f":"IF(OR(AND(C81>=INDEX(Champ,MATCH(A81,Jour,0),3),C81<=INDEX(Champ,MATCH(A81,Jour,0),4)),AND(C81>=INDEX(Champ,MATCH(A81,Jour,0)+1,4),C81<=INDEX(Champ,MATCH(A81,Jour,0)+1,3))),\"occupé\",\"\")","v":"occupé"}]
["LUNDI",10,"09:30:00",{"$f":"IF(OR(AND(C82>=INDEX(Champ,MATCH(A82,Jour,0),3),C82<=INDEX(Champ,MATCH(A82,Jour,0),4)),AND(C82>=INDEX(Champ,MATCH(A82,Jour,0)+1,4),C82<=INDEX(Champ,MATCH(A82,Jour,0)+1,3))),\"occupé\",\"\")","v":"occupé"}]
["LUNDI",10,"09:40:00",{"$f":"IF(OR(AND(C83>=INDEX(Champ,MATCH(A83,Jour,0),3),C83<=INDEX(Champ,MATCH(A83,Jour,0),4)),AND(C83>=INDEX(Champ,MATCH(A83,Jour,0)+1,4),C83<=INDEX(Champ,MATCH(A83,Jour,0)+1,3))),\"occupé\",\"\")","v":"occupé"}]
["LUNDI",10,"09:50:00",{"$f":"IF(OR(AND(C84>=INDEX(Champ,MATCH(A84,Jour,0),3),C84<=INDEX(Champ,MATCH(A84,Jour,0),4)),AND(C84>=INDEX(Champ,MATCH(A84,Jour,0)+1,4),C84<=INDEX(Champ,MATCH(A84,Jour,0)+1,3))),\"occupé\",\"\")","v":"occupé"}]
["LUNDI",11,"10:00:00",{"$f":"IF(OR(AND(C85>=INDEX(Champ,MATCH(A85,Jour,0),3),C85<=INDEX(Champ,MATCH(A85,Jour,0),4)),AND(C85>=INDEX(Champ,MATCH(A85,Jour,0)+1,4),C85<=INDEX(Champ,MATCH(A85,Jour,0)+1,3))),\"occupé\",\"\")","v":"occupé"}]
["LUNDI",11,"10:10:00",{"$f":"IF(OR(AND(C86>=INDEX(Champ,MATCH(A86,Jour,0),3),C86<=INDEX(Champ,MATCH(A86,Jour,0),4)),AND(C86>=INDEX(Champ,MATCH(A86,Jour,0)+1,4),C86<=INDEX(Champ,MATCH(A86,Jour,0)+1,3))),\"occupé\",\"\")","v":"occupé"}]
["LUNDI",11,"10:20:00",{"$f":"IF(OR(AND(C87>=INDEX(Champ,MATCH(A87,Jour,0),3),C87<=INDEX(Champ,MATCH(A87,Jour,0),4)),AND(C87>=INDEX(Champ,MATCH(A87,Jour,0)+1,4),C87<=INDEX(Champ,MATCH(A87,Jour,0)+1,3))),\"occupé\",\"\")","v":"occupé"}]
["LUNDI",11,"10:30:00",{"$f":"IF(OR(AND(C88>=INDEX(Champ,MATCH(A88,Jour,0),3),C88<=INDEX(Champ,MATCH(A88,Jour,0),4)),AND(C88>=INDEX(Champ,MATCH(A88,Jour,0)+1,4),C88<=INDEX(Champ,MATCH(A88,Jour,0)+1,3))),\"occupé\",\"\")","v":"occupé"}]
["LUNDI",11,"10:40:00",{"$f":"IF(OR(AND(C89>=INDEX(Champ,MATCH(A89,Jour,0),3),C89<=INDEX(Champ,MATCH(A89,Jour,0),4)),AND(C89>=INDEX(Champ,MATCH(A89,Jour,0)+1,4),C89<=INDEX(Champ,MATCH(A89,Jour,0)+1,3))),\"occupé\",\"\")","v":"occupé"}]
["LUNDI",11,"10:50:00",{"$f":"IF(OR(AND(C90>=INDEX(Champ,MATCH(A90,Jour,0),3),C90<=INDEX(Champ,MATCH(A90,Jour,0),4)),AND(C90>=INDEX(Champ,MATCH(A90,Jour,0)+1,4),C90<=INDEX(Champ,MATCH(A90,Jour,0)+1,3))),\"occupé\",\"\")","v":"occupé"}]
["LUNDI",12,"11:00:00",{"$f":"IF(OR(AND(C91>=INDEX(Champ,MATCH(A91,Jour,0),3),C91<=INDEX(Champ,MATCH(A91,Jour,0),4)),AND(C91>=INDEX(Champ,MATCH(A91,Jour,0)+1,4),C91<=INDEX(Champ,MATCH(A91,Jour,0)+1,3))),\"occupé\",\"\")","v":"occupé"}]
["LUNDI",12,"11:10:00",{"$f":"IF(OR(AND(C92>=INDEX(Champ,MATCH(A92,Jour,0),3),C92<=INDEX(Champ,MATCH(A92,Jour,0),4)),AND(C92>=INDEX(Champ,MATCH(A92,Jour,0)+1,4),C92<=INDEX(Champ,MATCH(A92,Jour,0)+1,3))),\"occupé\",\"\")","v":"occupé"}]
["LUNDI",12,"11:20:00",{"$f":"IF(OR(AND(C93>=INDEX(Champ,MATCH(A93,Jour,0),3),C93<=INDEX(Champ,MATCH(A93,Jour,0),4)),AND(C93>=INDEX(Champ,MATCH(A93,Jour,0)+1,4),C93<=INDEX(Champ,MATCH(A93,Jour,0)+1,3))),\"occupé\",\"\")","v":"occupé"}]
["LUNDI",12,"11:30:00",{"$f":"IF(OR(AND(C94>=INDEX(Champ,MATCH(A94,Jour,0),3),C94<=INDEX(Champ,MATCH(A94,Jour,0),4)),AND(C94>=INDEX(Champ,MATCH(A94,Jour,0)+1,4),C94<=INDEX(Champ,MATCH(A94,Jour,0)+1,3))),\"occupé\",\"\")","v":"occupé"}]
["LUNDI",12,"11:40:00",{"$f":"IF(OR(AND(C95>=INDEX(Champ,MATCH(A95,Jour,0),3),C95<=INDEX(Champ,MATCH(A95,Jour,0),4)),AND(C95>=INDEX(Champ,MATCH(A95,Jour,0)+1,4),C95<=INDEX(Champ,MATCH(A95,Jour,0)+1,3))),\"occupé\",\"\")","v":"occupé"}]
["LUNDI",12,"11:50:00",{"$f":"IF(OR(AND(C96>=INDEX(Champ,MATCH(A96,Jour,0),3),C96<=INDEX(Champ,MATCH(A96,Jour,0),4)),AND(C96>=INDEX(Champ,MATCH(A96,Jour,0)+1,4),C96<=INDEX(Champ,MATCH(A96,Jour,0)+1,3))),\"occupé\",\"\")","v":"occupé"}]
["LUNDI",13,"12:00:00",{"$f":"IF(OR(AND(C97>=INDEX(Champ,MATCH(A97,Jour,0),3),C97<=INDEX(Champ,MATCH(A97,Jour,0),4)),AND(C97>=INDEX(Champ,MATCH(A97,Jour,0)+1,4),C97<=INDEX(Champ,MATCH(A97,Jour,0)+1,3))),\"occupé\",\"\")","v":"occupé"}]
["LUNDI",13,"12:10:00",{"$f":"IF(OR(AND(C98>=INDEX(Champ,MATCH(A98,Jour,0),3),C98<=INDEX(Champ,MATCH(A98,Jour,0),4)),AND(C98>=INDEX(Champ,MATCH(A98,Jour,0)+1,4),C98<=INDEX(Champ,MATCH(A98,Jour,0)+1,3))),\"occupé\",\"\")","v":""}]
["LUNDI",13,"12:20:00",{"$f":"IF(OR(AND(C99>=INDEX(Champ,MATCH(A99,Jour,0),3),C99<=INDEX(Champ,MATCH(A99,Jour,0),4)),AND(C99>=INDEX(Champ,MATCH(A99,Jour,0)+1,4),C99<=INDEX(Champ,MATCH(A99,Jour,0)+1,3))),\"occupé\",\"\")","v":""}]
["LUNDI",13,"12:30:00",{"$f":"IF(OR(AND(C100>=INDEX(Champ,MATCH(A100,Jour,0),3),C100<=INDEX(Champ,MATCH(A100,Jour,0),4)),AND(C100>=INDEX(Champ,MATCH(A100,Jour,0)+1,4),C100<=INDEX(Champ,MATCH(A100,Jour,0)+1,3))),\"occupé\",\"\")","v":""}]
["LUNDI",13,"12:40:00",{"$f":"IF(OR(AND(C101>=INDEX(Champ,MATCH(A101,Jour,0),3),C101<=INDEX(Champ,MATCH(A101,Jour,0),4)),AND(C101>=INDEX(Champ,MATCH(A101,Jour,0)+1,4),C101<=INDEX(Champ,MATCH(A101,Jour,0)+1,3))),\"occupé\",\"\")","v":""}]
["LUNDI",13,"12:50:00",{"$f":"IF(OR(AND(C102>=INDEX(Champ,MATCH(A102,Jour,0),3),C102<=INDEX(Champ,MATCH(A102,Jour,0),4)),AND(C102>=INDEX(Champ,MATCH(A102,Jour,0)+1,4),C102<=INDEX(Champ,MATCH(A102,Jour,0)+1,3))),\"occupé\",\"\")","v":""}]
["LUNDI",14,"13:00:00",{"$f":"IF(OR(AND(C103>=INDEX(Champ,MATCH(A103,Jour,0),3),C103<=INDEX(Champ,MATCH(A103,Jour,0),4)),AND(C103>=INDEX(Champ,MATCH(A103,Jour,0)+1,4),C103<=INDEX(Champ,MATCH(A103,Jour,0)+1,3))),\"occupé\",\"\")","v":"occupé"}]
["LUNDI",14,"13:10:00",{"$f":"IF(OR(AND(C104>=INDEX(Champ,MATCH(A104,Jour,0),3),C104<=INDEX(Champ,MATCH(A104,Jour,0),4)),AND(C104>=INDEX(Champ,MATCH(A104,Jour,0)+1,4),C104<=INDEX(Champ,MATCH(A104,Jour,0)+1,3))),\"occupé\",\"\")","v":"occupé"}]
["LUNDI",14,"13:20:00",{"$f":"IF(OR(AND(C105>=INDEX(Champ,MATCH(A105,Jour,0),3),C105<=INDEX(Champ,MATCH(A105,Jour,0),4)),AND(C105>=INDEX(Champ,MATCH(A105,Jour,0)+1,4),C105<=INDEX(Champ,MATCH(A105,Jour,0)+1,3))),\"occupé\",\"\")","v":"occupé"}]
["LUNDI",14,"13:30:00",{"$f":"IF(OR(AND(C106>=INDEX(Champ,MATCH(A106,Jour,0),3),C106<=INDEX(Champ,MATCH(A106,Jour,0),4)),AND(C106>=INDEX(Champ,MATCH(A106,Jour,0)+1,4),C106<=INDEX(Champ,MATCH(A106,Jour,0)+1,3))),\"occupé\",\"\")","v":"occupé"}]
["LUNDI",14,"13:40:00",{"$f":"IF(OR(AND(C107>=INDEX(Champ,MATCH(A107,Jour,0),3),C107<=INDEX(Champ,MATCH(A107,Jour,0),4)),AND(C107>=INDEX(Champ,MATCH(A107,Jour,0)+1,4),C107<=INDEX(Champ,MATCH(A107,Jour,0)+1,3))),\"occupé\",\"\")","v":"occupé"}]
["LUNDI",14,"13:50:00",{"$f":"IF(OR(AND(C108>=INDEX(Champ,MATCH(A108,Jour,0),3),C108<=INDEX(Champ,MATCH(A108,Jour,0),4)),AND(C108>=INDEX(Champ,MATCH(A108,Jour,0)+1,4),C108<=INDEX(Champ,MATCH(A108,Jour,0)+1,3))),\"occupé\",\"\")","v":"occupé"}]
["LUNDI",15,"14:00:00",{"$f":"IF(OR(AND(C109>=INDEX(Champ,MATCH(A109,Jour,0),3),C109<=INDEX(Champ,MATCH(A109,Jour,0),4)),AND(C109>=INDEX(Champ,MATCH(A109,Jour,0)+1,4),C109<=INDEX(Champ,MATCH(A109,Jour,0)+1,3))),\"occupé\",\"\")","v":"occupé"}]
["LUNDI",15,"14:10:00",{"$f":"IF(OR(AND(C110>=INDEX(Champ,MATCH(A110,Jour,0),3),C110<=INDEX(Champ,MATCH(A110,Jour,0),4)),AND(C110>=INDEX(Champ,MATCH(A110,Jour,0)+1,4),C110<=INDEX(Champ,MATCH(A110,Jour,0)+1,3))),\"occupé\",\"\")","v":"occupé"}]
["LUNDI",15,"14:20:00",{"$f":"IF(OR(AND(C111>=INDEX(Champ,MATCH(A111,Jour,0),3),C111<=INDEX(Champ,MATCH(A111,Jour,0),4)),AND(C111>=INDEX(Champ,MATCH(A111,Jour,0)+1,4),C111<=INDEX(Champ,MATCH(A111,Jour,0)+1,3))),\"occupé\",\"\")","v":"occupé"}]
["LUNDI",15,"14:30:00",{"$f":"IF(OR(AND(C112>=INDEX(Champ,MATCH(A112,Jour,0),3),C112<=INDEX(Champ,MATCH(A112,Jour,0),4)),AND(C112>=INDEX(Champ,MATCH(A112,Jour,0)+1,4),C112<=INDEX(Champ,MATCH(A112,Jour,0)+1,3))),\"occupé\",\"\")","v":"occupé"}]
["LUNDI",15,"14:40:00",{"$f":"IF(OR(AND(C113>=INDEX(Champ,MATCH(A113,Jour,0),3),C113<=INDEX(Champ,MATCH(A113,Jour,0),4)),AND(C113>=INDEX(Champ,MATCH(A113,Jour,0)+1,4),C113<=INDEX(Champ,MATCH(A113,Jour,0)+1,3))),\"occupé\",\"\")","v":"occupé"}]
["LUNDI",15,"14:50:00",{"$f":"IF(OR(AND(C114>=INDEX(Champ,MATCH(A114,Jour,0),3),C114<=INDEX(Champ,MATCH(A114,Jour,0),4)),AND(C114>=INDEX(Champ,MATCH(A114,Jour,0)+1,4),C114<=INDEX(Champ,MATCH(A114,Jour,0)+1,3))),\"occupé\",\"\")","v":"occupé"}]
["LUNDI",16,"15:00:00",{"$f":"IF(OR(AND(C115>=INDEX(Champ,MATCH(A115,Jour,0),3),C115<=INDEX(Champ,MATCH(A115,Jour,0),4)),AND(C115>=INDEX(Champ,MATCH(A115,Jour,0)+1,4),C115<=INDEX(Champ,MATCH(A115,Jour,0)+1,3))),\"occupé\",\"\")","v":"occupé"}]
["LUNDI",16,"15:10:00",{"$f":"IF(OR(AND(C116>=INDEX(Champ,MATCH(A116,Jour,0),3),C116<=INDEX(Champ,MATCH(A116,Jour,0),4)),AND(C116>=INDEX(Champ,MATCH(A116,Jour,0)+1,4),C116<=INDEX(Champ,MATCH(A116,Jour,0)+1,3))),\"occupé\",\"\")","v":"occupé"}]
["LUNDI",16,"15:20:00",{"$f":"IF(OR(AND(C117>=INDEX(Champ,MATCH(A117,Jour,0),3),C117<=INDEX(Champ,MATCH(A117,Jour,0),4)),AND(C117>=INDEX(Champ,MATCH(A117,Jour,0)+1,4),C117<=INDEX(Champ,MATCH(A117,Jour,0)+1,3))),\"occupé\",\"\")","v":"occupé"}]
["LUNDI",16,"15:30:00",{"$f":"IF(OR(AND(C118>=INDEX(Champ,MATCH(A118,Jour,0),3),C118<=INDEX(Champ,MATCH(A118,Jour,0),4)),AND(C118>=INDEX(Champ,MATCH(A118,Jour,0)+1,4),C118<=INDEX(Champ,MATCH(A118,Jour,0)+1,3))),\"occupé\",\"\")","v":"occupé"}]
["LUNDI",16,"15:40:00",{"$f":"IF(OR(AND(C119>=INDEX(Champ,MATCH(A119,Jour,0),3),C119<=INDEX(Champ,MATCH(A119,Jour,0),4)),AND(C119>=INDEX(Champ,MATCH(A119,Jour,0)+1,4),C119<=INDEX(Champ,MATCH(A119,Jour,0)+1,3))),\"occupé\",\"\")","v":"occupé"}]
["LUNDI",16,"15:50:00",{"$f":"IF(OR(AND(C120>=INDEX(Champ,MATCH(A120,Jour,0),3),C120<=INDEX(Champ,MATCH(A120,Jour,0),4)),AND(C120>=INDEX(Champ,MATCH(A120,Jour,0)+1,4),C120<=INDEX(Champ,MATCH(A120,Jour,0)+1,3))),\"occupé\",\"\")","v":"occupé"}]
["LUNDI",17,"16:00:00",{"$f":"IF(OR(AND(C121>=INDEX(Champ,MATCH(A121,Jour,0),3),C121<=INDEX(Champ,MATCH(A121,Jour,0),4)),AND(C121>=INDEX(Champ,MATCH(A121,Jour,0)+1,4),C121<=INDEX(Champ,MATCH(A121,Jour,0)+1,3))),\"occupé\",\"\")","v":"occupé"}]
["LUNDI",17,"16:10:00",{"$f":"IF(OR(AND(C122>=INDEX(Champ,MATCH(A122,Jour,0),3),C122<=INDEX(Champ,MATCH(A122,Jour,0),4)),AND(C122>=INDEX(Champ,MATCH(A122,Jour,0)+1,4),C122<=INDEX(Champ,MATCH(A122,Jour,0)+1,3))),\"occupé\",\"\")","v":"occupé"}]
["LUNDI",17,"16:20:00",{"$f":"IF(OR(AND(C123>=INDEX(Champ,MATCH(A123,Jour,0),3),C123<=INDEX(Champ,MATCH(A123,Jour,0),4)),AND(C123>=INDEX(Champ,MATCH(A123,Jour,0)+1,4),C123<=INDEX(Champ,MATCH(A123,Jour,0)+1,3))),\"occupé\",\"\")","v":"occupé"}]
["LUNDI",17,"16:30:00",{"$f":"IF(OR(AND(C124>=INDEX(Champ,MATCH(A124,Jour,0),3),C124<=INDEX(Champ,MATCH(A124,Jour,0),4)),AND(C124>=INDEX(Champ,MATCH(A124,Jour,0)+1,4),C124<=INDEX(Champ,MATCH(A124,Jour,0)+1,3))),\"occupé\",\"\")","v":"occupé"}]
["LUNDI",17,"16:40:00",{"$f":"IF(OR(AND(C125>=INDEX(Champ,MATCH(A125,Jour,0),3),C125<=INDEX(Champ,MATCH(A125,Jour,0),4)),AND(C125>=INDEX(Champ,MATCH(A125,Jour,0)+1,4),C125<=INDEX(Champ,MATCH(A125,Jour,0)+1,3))),\"occupé\",\"\")","v":"occupé"}]
["LUNDI",17,"16:50:00",{"$f":"IF(OR(AND(C126>=INDEX(Champ,MATCH(A126,Jour,0),3),C126<=INDEX(Champ,MATCH(A126,Jour,0),4)),AND(C126>=INDEX(Champ,MATCH(A126,Jour,0)+1,4),C126<=INDEX(Champ,MATCH(A126,Jour,0)+1,3))),\"occupé\",\"\")","v":"occupé"}]
["LUNDI",18,"17:00:00",{"$f":"IF(OR(AND(C127>=INDEX(Champ,MATCH(A127,Jour,0),3),C127<=INDEX(Champ,MATCH(A127,Jour,0),4)),AND(C127>=INDEX(Champ,MATCH(A127,Jour,0)+1,4),C127<=INDEX(Champ,MATCH(A127,Jour,0)+1,3))),\"occupé\",\"\")","v":"occupé"}]
["LUNDI",18,"17:10:00",{"$f":"IF(OR(AND(C128>=INDEX(Champ,MATCH(A128,Jour,0),3),C128<=INDEX(Champ,MATCH(A128,Jour,0),4)),AND(C128>=INDEX(Champ,MATCH(A128,Jour,0)+1,4),C128<=INDEX(Champ,MATCH(A128,Jour,0)+1,3))),\"occupé\",\"\")","v":"occupé"}]
["LUNDI",18,"17:20:00",{"$f":"IF(OR(AND(C129>=INDEX(Champ,MATCH(A129,Jour,0),3),C129<=INDEX(Champ,MATCH(A129,Jour,0),4)),AND(C129>=INDEX(Champ,MATCH(A129,Jour,0)+1,4),C129<=INDEX(Champ,MATCH(A129,Jour,0)+1,3))),\"occupé\",\"\")","v":"occupé"}]
["LUNDI",18,"17:30:00",{"$f":"IF(OR(AND(C130>=INDEX(Champ,MATCH(A130,Jour,0),3),C130<=INDEX(Champ,MATCH(A130,Jour,0),4)),AND(C130>=INDEX(Champ,MATCH(A130,Jour,0)+1,4),C130<=INDEX(Champ,MATCH(A130,Jour,0)+1,3))),\"occupé\",\"\")","v":"occupé"}]
["LUNDI",18,"17:40:00",{"$f":"IF(OR(AND(C131>=INDEX(Champ,MATCH(A131,Jour,0),3),C131<=INDEX(Champ,MATCH(A131,Jour,0),4)),AND(C131>=INDEX(Champ,MATCH(A131,Jour,0)+1,4),C131<=INDEX(Champ,MATCH(A131,Jour,0)+1,3))),\"occupé\",\"\")","v":"occupé"}]
["LUNDI",18,"17:50:00",{"$f":"IF(OR(AND(C132>=INDEX(Champ,MATCH(A132,Jour,0),3),C132<=INDEX(Champ,MATCH(A132,Jour,0),4)),AND(C132>=INDEX(Champ,MATCH(A132,Jour,0)+1,4),C132<=INDEX(Champ,MATCH(A132,Jour,0)+1,3))),\"occupé\",\"\")","v":"occupé"}]
["LUNDI",19,"18:00:00",{"$f":"IF(OR(AND(C133>=INDEX(Champ,MATCH(A133,Jour,0),3),C133<=INDEX(Champ,MATCH(A133,Jour,0),4)),AND(C133>=INDEX(Champ,MATCH(A133,Jour,0)+1,4),C133<=INDEX(Champ,MATCH(A133,Jour,0)+1,3))),\"occupé\",\"\")","v":"occupé"}]
["LUNDI",19,"18:10:00",{"$f":"IF(OR(AND(C134>=INDEX(Champ,MATCH(A134,Jour,0),3),C134<=INDEX(Champ,MATCH(A134,Jour,0),4)),AND(C134>=INDEX(Champ,MATCH(A134,Jour,0)+1,4),C134<=INDEX(Champ,MATCH(A134,Jour,0)+1,3))),\"occupé\",\"\")","v":""}]
["LUNDI",19,"18:20:00",{"$f":"IF(OR(AND(C135>=INDEX(Champ,MATCH(A135,Jour,0),3),C135<=INDEX(Champ,MATCH(A135,Jour,0),4)),AND(C135>=INDEX(Champ,MATCH(A135,Jour,0)+1,4),C135<=INDEX(Champ,MATCH(A135,Jour,0)+1,3))),\"occupé\",\"\")","v":""}]
["LUNDI",19,"18:30:00",{"$f":"IF(OR(AND(C136>=INDEX(Champ,MATCH(A136,Jour,0),3),C136<=INDEX(Champ,MATCH(A136,Jour,0),4)),AND(C136>=INDEX(Champ,MATCH(A136,Jour,0)+1,4),C136<=INDEX(Champ,MATCH(A136,Jour,0)+1,3))),\"occupé\",\"\")","v":""}]
["LUNDI",19,"18:40:00",{"$f":"IF(OR(AND(C137>=INDEX(Champ,MATCH(A137,Jour,0),3),C137<=INDEX(Champ,MATCH(A137,Jour,0),4)),AND(C137>=INDEX(Champ,MATCH(A137,Jour,0)+1,4),C137<=INDEX(Champ,MATCH(A137,Jour,0)+1,3))),\"occupé\",\"\")","v":""}]
["LUNDI",19,"18:50:00",{"$f":"IF(OR(AND(C138>=INDEX(Champ,MATCH(A138,Jour,0),3),C138<=INDEX(Champ,MATCH(A138,Jour,0),4)),AND(C138>=INDEX(Champ,MATCH(A138,Jour,0)+1,4),C138<=INDEX(Champ,MATCH(A138,Jour,0)+1,3))),\"occupé\",\"\")","v":""}]
["LUNDI",20,"19:00:00",{"$f":"IF(OR(AND(C139>=INDEX(Champ,MATCH(A139,Jour,0),3),C139<=INDEX(Champ,MATCH(A139,Jour,0),4)),AND(C139>=INDEX(Champ,MATCH(A139,Jour,0)+1,4),C139<=INDEX(Champ,MATCH(A139,Jour,0)+1,3))),\"occupé\",\"\")","v":""}]
["LUNDI",20,"19:10:00",{"$f":"IF(OR(AND(C140>=INDEX(Champ,MATCH(A140,Jour,0),3),C140<=INDEX(Champ,MATCH(A140,Jour,0),4)),AND(C140>=INDEX(Champ,MATCH(A140,Jour,0)+1,4),C140<=INDEX(Champ,MATCH(A140,Jour,0)+1,3))),\"occupé\",\"\")","v":""}]
["LUNDI",20,"19:20:00",{"$f":"IF(OR(AND(C141>=INDEX(Champ,MATCH(A141,Jour,0),3),C141<=INDEX(Champ,MATCH(A141,Jour,0),4)),AND(C141>=INDEX(Champ,MATCH(A141,Jour,0)+1,4),C141<=INDEX(Champ,MATCH(A141,Jour,0)+1,3))),\"occupé\",\"\")","v":""}]
["LUNDI",20,"19:30:00",{"$f":"IF(OR(AND(C142>=INDEX(Champ,MATCH(A142,Jour,0),3),C142<=INDEX(Champ,MATCH(A142,Jour,0),4)),AND(C142>=INDEX(Champ,MATCH(A142,Jour,0)+1,4),C142<=INDEX(Champ,MATCH(A142,Jour,0)+1,3))),\"occupé\",\"\")","v":""}]
["LUNDI",20,"19:40:00",{"$f":"IF(OR(AND(C143>=INDEX(Champ,MATCH(A143,Jour,0),3),C143<=INDEX(Champ,MATCH(A143,Jour,0),4)),AND(C143>=INDEX(Champ,MATCH(A143,Jour,0)+1,4),C143<=INDEX(Champ,MATCH(A143,Jour,0)+1,3))),\"occupé\",\"\")","v":""}]
["LUNDI",20,"19:50:00",{"$f":"IF(OR(AND(C144>=INDEX(Champ,MATCH(A144,Jour,0),3),C144<=INDEX(Champ,MATCH(A144,Jour,0),4)),AND(C144>=INDEX(Champ,MATCH(A144,Jour,0)+1,4),C144<=INDEX(Champ,MATCH(A144,Jour,0)+1,3))),\"occupé\",\"\")","v":""}]
["LUNDI",21,"20:00:00",{"$f":"IF(OR(AND(C145>=INDEX(Champ,MATCH(A145,Jour,0),3),C145<=INDEX(Champ,MATCH(A145,Jour,0),4)),AND(C145>=INDEX(Champ,MATCH(A145,Jour,0)+1,4),C145<=INDEX(Champ,MATCH(A145,Jour,0)+1,3))),\"occupé\",\"\")","v":""}]
["LUNDI",21,"20:10:00",{"$f":"IF(OR(AND(C146>=INDEX(Champ,MATCH(A146,Jour,0),3),C146<=INDEX(Champ,MATCH(A146,Jour,0),4)),AND(C146>=INDEX(Champ,MATCH(A146,Jour,0)+1,4),C146<=INDEX(Champ,MATCH(A146,Jour,0)+1,3))),\"occupé\",\"\")","v":""}]
["LUNDI",21,"20:20:00",{"$f":"IF(OR(AND(C147>=INDEX(Champ,MATCH(A147,Jour,0),3),C147<=INDEX(Champ,MATCH(A147,Jour,0),4)),AND(C147>=INDEX(Champ,MATCH(A147,Jour,0)+1,4),C147<=INDEX(Champ,MATCH(A147,Jour,0)+1,3))),\"occupé\",\"\")","v":""}]
["LUNDI",21,"20:30:00",{"$f":"IF(OR(AND(C148>=INDEX(Champ,MATCH(A148,Jour,0),3),C148<=INDEX(Champ,MATCH(A148,Jour,0),4)),AND(C148>=INDEX(Champ,MATCH(A148,Jour,0)+1,4),C148<=INDEX(Champ,MATCH(A148,Jour,0)+1,3))),\"occupé\",\"\")","v":""}]
["LUNDI",21,"20:40:00",{"$f":"IF(OR(AND(C149>=INDEX(Champ,MATCH(A149,Jour,0),3),C149<=INDEX(Champ,MATCH(A149,Jour,0),4)),AND(C149>=INDEX(Champ,MATCH(A149,Jour,0)+1,4),C149<=INDEX(Champ,MATCH(A149,Jour,0)+1,3))),\"occupé\",\"\")","v":""}]
["LUNDI",21,"20:50:00",{"$f":"IF(OR(AND(C150>=INDEX(Champ,MATCH(A150,Jour,0),3),C150<=INDEX(Champ,MATCH(A150,Jour,0),4)),AND(C150>=INDEX(Champ,MATCH(A150,Jour,0)+1,4),C150<=INDEX(Champ,MATCH(A150,Jour,0)+1,3))),\"occupé\",\"\")","v":""}]
["LUNDI",22,"21:00:00",{"$f":"IF(OR(AND(C151>=INDEX(Champ,MATCH(A151,Jour,0),3),C151<=INDEX(Champ,MATCH(A151,Jour,0),4)),AND(C151>=INDEX(Champ,MATCH(A151,Jour,0)+1,4),C151<=INDEX(Champ,MATCH(A151,Jour,0)+1,3))),\"occupé\",\"\")","v":""}]
["LUNDI",22,"21:10:00",{"$f":"IF(OR(AND(C152>=INDEX(Champ,MATCH(A152,Jour,0),3),C152<=INDEX(Champ,MATCH(A152,Jour,0),4)),AND(C152>=INDEX(Champ,MATCH(A152,Jour,0)+1,4),C152<=INDEX(Champ,MATCH(A152,Jour,0)+1,3))),\"occupé\",\"\")","v":""}]
["LUNDI",22,"21:20:00",{"$f":"IF(OR(AND(C153>=INDEX(Champ,MATCH(A153,Jour,0),3),C153<=INDEX(Champ,MATCH(A153,Jour,0),4)),AND(C153>=INDEX(Champ,MATCH(A153,Jour,0)+1,4),C153<=INDEX(Champ,MATCH(A153,Jour,0)+1,3))),\"occupé\",\"\")","v":""}]
["LUNDI",22,"21:30:00",{"$f":"IF(OR(AND(C154>=INDEX(Champ,MATCH(A154,Jour,0),3),C154<=INDEX(Champ,MATCH(A154,Jour,0),4)),AND(C154>=INDEX(Champ,MATCH(A154,Jour,0)+1,4),C154<=INDEX(Champ,MATCH(A154,Jour,0)+1,3))),\"occupé\",\"\")","v":""}]
["LUNDI",22,"21:40:00",{"$f":"IF(OR(AND(C155>=INDEX(Champ,MATCH(A155,Jour,0),3),C155<=INDEX(Champ,MATCH(A155,Jour,0),4)),AND(C155>=INDEX(Champ,MATCH(A155,Jour,0)+1,4),C155<=INDEX(Champ,MATCH(A155,Jour,0)+1,3))),\"occupé\",\"\")","v":""}]
["LUNDI",22,"21:50:00",{"$f":"IF(OR(AND(C156>=INDEX(Champ,MATCH(A156,Jour,0),3),C156<=INDEX(Champ,MATCH(A156,Jour,0),4)),AND(C156>=INDEX(Champ,MATCH(A156,Jour,0)+1,4),C156<=INDEX(Champ,MATCH(A156,Jour,0)+1,3))),\"occupé\",\"\")","v":""}]
["LUNDI",23,"22:00:00",{"$f":"IF(OR(AND(C157>=INDEX(Champ,MATCH(A157,Jour,0),3),C157<=INDEX(Champ,MATCH(A157,Jour,0),4)),AND(C157>=INDEX(Champ,MATCH(A157,Jour,0)+1,4),C157<=INDEX(Champ,MATCH(A157,Jour,0)+1,3))),\"occupé\",\"\")","v":""}]
["LUNDI",23,"22:10:00",{"$f":"IF(OR(AND(C158>=INDEX(Champ,MATCH(A158,Jour,0),3),C158<=INDEX(Champ,MATCH(A158,Jour,0),4)),AND(C158>=INDEX(Champ,MATCH(A158,Jour,0)+1,4),C158<=INDEX(Champ,MATCH(A158,Jour,0)+1,3))),\"occupé\",\"\")","v":""}]
["LUNDI",23,"22:20:00",{"$f":"IF(OR(AND(C159>=INDEX(Champ,MATCH(A159,Jour,0),3),C159<=INDEX(Champ,MATCH(A159,Jour,0),4)),AND(C159>=INDEX(Champ,MATCH(A159,Jour,0)+1,4),C159<=INDEX(Champ,MATCH(A159,Jour,0)+1,3))),\"occupé\",\"\")","v":""}]
["LUNDI",23,"22:30:00",{"$f":"IF(OR(AND(C160>=INDEX(Champ,MATCH(A160,Jour,0),3),C160<=INDEX(Champ,MATCH(A160,Jour,0),4)),AND(C160>=INDEX(Champ,MATCH(A160,Jour,0)+1,4),C160<=INDEX(Champ,MATCH(A160,Jour,0)+1,3))),\"occupé\",\"\")","v":""}]
["LUNDI",23,"22:40:00",{"$f":"IF(OR(AND(C161>=INDEX(Champ,MATCH(A161,Jour,0),3),C161<=INDEX(Champ,MATCH(A161,Jour,0),4)),AND(C161>=INDEX(Champ,MATCH(A161,Jour,0)+1,4),C161<=INDEX(Champ,MATCH(A161,Jour,0)+1,3))),\"occupé\",\"\")","v":""}]
["LUNDI",23,"22:50:00",{"$f":"IF(OR(AND(C162>=INDEX(Champ,MATCH(A162,Jour,0),3),C162<=INDEX(Champ,MATCH(A162,Jour,0),4)),AND(C162>=INDEX(Champ,MATCH(A162,Jour,0)+1,4),C162<=INDEX(Champ,MATCH(A162,Jour,0)+1,3))),\"occupé\",\"\")","v":""}]
["LUNDI",24,"23:00:00",{"$f":"IF(OR(AND(C163>=INDEX(Champ,MATCH(A163,Jour,0),3),C163<=INDEX(Champ,MATCH(A163,Jour,0),4)),AND(C163>=INDEX(Champ,MATCH(A163,Jour,0)+1,4),C163<=INDEX(Champ,MATCH(A163,Jour,0)+1,3))),\"occupé\",\"\")","v":""}]
["LUNDI",24,"23:10:00",{"$f":"IF(OR(AND(C164>=INDEX(Champ,MATCH(A164,Jour,0),3),C164<=INDEX(Champ,MATCH(A164,Jour,0),4)),AND(C164>=INDEX(Champ,MATCH(A164,Jour,0)+1,4),C164<=INDEX(Champ,MATCH(A164,Jour,0)+1,3))),\"occupé\",\"\")","v":""}]
["LUNDI",24,"23:20:00",{"$f":"IF(OR(AND(C165>=INDEX(Champ,MATCH(A165,Jour,0),3),C165<=INDEX(Champ,MATCH(A165,Jour,0),4)),AND(C165>=INDEX(Champ,MATCH(A165,Jour,0)+1,4),C165<=INDEX(Champ,MATCH(A165,Jour,0)+1,3))),\"occupé\",\"\")","v":""}]
["LUNDI",24,"23:30:00",{"$f":"IF(OR(AND(C166>=INDEX(Champ,MATCH(A166,Jour,0),3),C166<=INDEX(Champ,MATCH(A166,Jour,0),4)),AND(C166>=INDEX(Champ,MATCH(A166,Jour,0)+1,4),C166<=INDEX(Champ,MATCH(A166,Jour,0)+1,3))),\"occupé\",\"\")","v":""}]
["LUNDI",24,"23:40:00",{"$f":"IF(OR(AND(C167>=INDEX(Champ,MATCH(A167,Jour,0),3),C167<=INDEX(Champ,MATCH(A167,Jour,0),4)),AND(C167>=INDEX(Champ,MATCH(A167,Jour,0)+1,4),C167<=INDEX(Champ,MATCH(A167,Jour,0)+1,3))),\"occupé\",\"\")","v":""}]
["LUNDI",24,"23:50:00",{"$f":"IF(OR(AND(C168>=INDEX(Champ,MATCH(A168,Jour,0),3),C168<=INDEX(Champ,MATCH(A168,Jour,0),4)),AND(C168>=INDEX(Champ,MATCH(A168,Jour,0)+1,4),C168<=INDEX(Champ,MATCH(A168,Jour,0)+1,3))),\"occupé\",\"\")","v":""}]
["MARDI",1,"00:00:00",{"$f":"IF(OR(AND(C169>=INDEX(Champ,MATCH(A169,Jour,0),3),C169<=INDEX(Champ,MATCH(A169,Jour,0),4)),AND(C169>=INDEX(Champ,MATCH(A169,Jour,0)+1,4),C169<=INDEX(Champ,MATCH(A169,Jour,0)+1,3))),\"occupé\",\"\")","v":""}]
["MARDI",1,"00:10:00",{"$f":"IF(OR(AND(C170>=INDEX(Champ,MATCH(A170,Jour,0),3),C170<=INDEX(Champ,MATCH(A170,Jour,0),4)),AND(C170>=INDEX(Champ,MATCH(A170,Jour,0)+1,4),C170<=INDEX(Champ,MATCH(A170,Jour,0)+1,3))),\"occupé\",\"\")","v":""}]
["MARDI",1,"00:20:00",{"$f":"IF(OR(AND(C171>=INDEX(Champ,MATCH(A171,Jour,0),3),C171<=INDEX(Champ,MATCH(A171,Jour,0),4)),AND(C171>=INDEX(Champ,MATCH(A171,Jour,0)+1,4),C171<=INDEX(Champ,MATCH(A171,Jour,0)+1,3))),\"occupé\",\"\")","v":""}]
["MARDI",1,"00:30:00",{"$f":"IF(OR(AND(C172>=INDEX(Champ,MATCH(A172,Jour,0),3),C172<=INDEX(Champ,MATCH(A172,Jour,0),4)),AND(C172>=INDEX(Champ,MATCH(A172,Jour,0)+1,4),C172<=INDEX(Champ,MATCH(A172,Jour,0)+1,3))),\"occupé\",\"\")","v":""}]
["MARDI",1,"00:40:00",{"$f":"IF(OR(AND(C173>=INDEX(Champ,MATCH(A173,Jour,0),3),C173<=INDEX(Champ,MATCH(A173,Jour,0),4)),AND(C173>=INDEX(Champ,MATCH(A173,Jour,0)+1,4),C173<=INDEX(Champ,MATCH(A173,Jour,0)+1,3))),\"occupé\",\"\")","v":""}]
["MARDI",1,"00:50:00",{"$f":"IF(OR(AND(C174>=INDEX(Champ,MATCH(A174,Jour,0),3),C174<=INDEX(Champ,MATCH(A174,Jour,0),4)),AND(C174>=INDEX(Champ,MATCH(A174,Jour,0)+1,4),C174<=INDEX(Champ,MATCH(A174,Jour,0)+1,3))),\"occupé\",\"\")","v":""}]
["MARDI",2,"01:00:00",{"$f":"IF(OR(AND(C175>=INDEX(Champ,MATCH(A175,Jour,0),3),C175<=INDEX(Champ,MATCH(A175,Jour,0),4)),AND(C175>=INDEX(Champ,MATCH(A175,Jour,0)+1,4),C175<=INDEX(Champ,MATCH(A175,Jour,0)+1,3))),\"occupé\",\"\")","v":""}]
["MARDI",2,"01:10:00",{"$f":"IF(OR(AND(C176>=INDEX(Champ,MATCH(A176,Jour,0),3),C176<=INDEX(Champ,MATCH(A176,Jour,0),4)),AND(C176>=INDEX(Champ,MATCH(A176,Jour,0)+1,4),C176<=INDEX(Champ,MATCH(A176,Jour,0)+1,3))),\"occupé\",\"\")","v":""}]
["MARDI",2,"01:20:00",{"$f":"IF(OR(AND(C177>=INDEX(Champ,MATCH(A177,Jour,0),3),C177<=INDEX(Champ,MATCH(A177,Jour,0),4)),AND(C177>=INDEX(Champ,MATCH(A177,Jour,0)+1,4),C177<=INDEX(Champ,MATCH(A177,Jour,0)+1,3))),\"occupé\",\"\")","v":""}]
["MARDI",2,"01:30:00",{"$f":"IF(OR(AND(C178>=INDEX(Champ,MATCH(A178,Jour,0),3),C178<=INDEX(Champ,MATCH(A178,Jour,0),4)),AND(C178>=INDEX(Champ,MATCH(A178,Jour,0)+1,4),C178<=INDEX(Champ,MATCH(A178,Jour,0)+1,3))),\"occupé\",\"\")","v":""}]
["MARDI",2,"01:40:00",{"$f":"IF(OR(AND(C179>=INDEX(Champ,MATCH(A179,Jour,0),3),C179<=INDEX(Champ,MATCH(A179,Jour,0),4)),AND(C179>=INDEX(Champ,MATCH(A179,Jour,0)+1,4),C179<=INDEX(Champ,MATCH(A179,Jour,0)+1,3))),\"occupé\",\"\")","v":""}]
["MARDI",2,"01:50:00",{"$f":"IF(OR(AND(C180>=INDEX(Champ,MATCH(A180,Jour,0),3),C180<=INDEX(Champ,MATCH(A180,Jour,0),4)),AND(C180>=INDEX(Champ,MATCH(A180,Jour,0)+1,4),C180<=INDEX(Champ,MATCH(A180,Jour,0)+1,3))),\"occupé\",\"\")","v":""}]
["MARDI",3,"02:00:00",{"$f":"IF(OR(AND(C181>=INDEX(Champ,MATCH(A181,Jour,0),3),C181<=INDEX(Champ,MATCH(A181,Jour,0),4)),AND(C181>=INDEX(Champ,MATCH(A181,Jour,0)+1,4),C181<=INDEX(Champ,MATCH(A181,Jour,0)+1,3))),\"occupé\",\"\")","v":""}]
["MARDI",3,"02:10:00",{"$f":"IF(OR(AND(C182>=INDEX(Champ,MATCH(A182,Jour,0),3),C182<=INDEX(Champ,MATCH(A182,Jour,0),4)),AND(C182>=INDEX(Champ,MATCH(A182,Jour,0)+1,4),C182<=INDEX(Champ,MATCH(A182,Jour,0)+1,3))),\"occupé\",\"\")","v":""}]
["MARDI",3,"02:20:00",{"$f":"IF(OR(AND(C183>=INDEX(Champ,MATCH(A183,Jour,0),3),C183<=INDEX(Champ,MATCH(A183,Jour,0),4)),AND(C183>=INDEX(Champ,MATCH(A183,Jour,0)+1,4),C183<=INDEX(Champ,MATCH(A183,Jour,0)+1,3))),\"occupé\",\"\")","v":""}]
["MARDI",3,"02:30:00",{"$f":"IF(OR(AND(C184>=INDEX(Champ,MATCH(A184,Jour,0),3),C184<=INDEX(Champ,MATCH(A184,Jour,0),4)),AND(C184>=INDEX(Champ,MATCH(A184,Jour,0)+1,4),C184<=INDEX(Champ,MATCH(A184,Jour,0)+1,3))),\"occupé\",\"\")","v":""}]
["MARDI",3,"02:40:00",{"$f":"IF(OR(AND(C185>=INDEX(Champ,MATCH(A185,Jour,0),3),C185<=INDEX(Champ,MATCH(A185,Jour,0),4)),AND(C185>=INDEX(Champ,MATCH(A185,Jour,0)+1,4),C185<=INDEX(Champ,MATCH(A185,Jour,0)+1,3))),\"occupé\",\"\")","v":""}]
["MARDI",3,"02:50:00",{"$f":"IF(OR(AND(C186>=INDEX(Champ,MATCH(A186,Jour,0),3),C186<=INDEX(Champ,MATCH(A186,Jour,0),4)),AND(C186>=INDEX(Champ,MATCH(A186,Jour,0)+1,4),C186<=INDEX(Champ,MATCH(A186,Jour,0)+1,3))),\"occupé\",\"\")","v":""}]
["MARDI",4,"03:00:00",{"$f":"IF(OR(AND(C187>=INDEX(Champ,MATCH(A187,Jour,0),3),C187<=INDEX(Champ,MATCH(A187,Jour,0),4)),AND(C187>=INDEX(Champ,MATCH(A187,Jour,0)+1,4),C187<=INDEX(Champ,MATCH(A187,Jour,0)+1,3))),\"occupé\",\"\")","v":""}]
["MARDI",4,"03:10:00",{"$f":"IF(OR(AND(C188>=INDEX(Champ,MATCH(A188,Jour,0),3),C188<=INDEX(Champ,MATCH(A188,Jour,0),4)),AND(C188>=INDEX(Champ,MATCH(A188,Jour,0)+1,4),C188<=INDEX(Champ,MATCH(A188,Jour,0)+1,3))),\"occupé\",\"\")","v":""}]
["MARDI",4,"03:20:00",{"$f":"IF(OR(AND(C189>=INDEX(Champ,MATCH(A189,Jour,0),3),C189<=INDEX(Champ,MATCH(A189,Jour,0),4)),AND(C189>=INDEX(Champ,MATCH(A189,Jour,0)+1,4),C189<=INDEX(Champ,MATCH(A189,Jour,0)+1,3))),\"occupé\",\"\")","v":""}]
["MARDI",4,"03:30:00",{"$f":"IF(OR(AND(C190>=INDEX(Champ,MATCH(A190,Jour,0),3),C190<=INDEX(Champ,MATCH(A190,Jour,0),4)),AND(C190>=INDEX(Champ,MATCH(A190,Jour,0)+1,4),C190<=INDEX(Champ,MATCH(A190,Jour,0)+1,3))),\"occupé\",\"\")","v":""}]
["MARDI",4,"03:40:00",{"$f":"IF(OR(AND(C191>=INDEX(Champ,MATCH(A191,Jour,0),3),C191<=INDEX(Champ,MATCH(A191,Jour,0),4)),AND(C191>=INDEX(Champ,MATCH(A191,Jour,0)+1,4),C191<=INDEX(Champ,MATCH(A191,Jour,0)+1,3))),\"occupé\",\"\")","v":""}]
["MARDI",4,"03:50:00",{"$f":"IF(OR(AND(C192>=INDEX(Champ,MATCH(A192,Jour,0),3),C192<=INDEX(Champ,MATCH(A192,Jour,0),4)),AND(C192>=INDEX(Champ,MATCH(A192,Jour,0)+1,4),C192<=INDEX(Champ,MATCH(A192,Jour,0)+1,3))),\"occupé\",\"\")","v":""}]
["MARDI",5,"04:00:00",{"$f":"IF(OR(AND(C193>=INDEX(Champ,MATCH(A193,Jour,0),3),C193<=INDEX(Champ,MATCH(A193,Jour,0),4)),AND(C193>=INDEX(Champ,MATCH(A193,Jour,0)+1,4),C193<=INDEX(Champ,MATCH(A193,Jour,0)+1,3))),\"occupé\",\"\")","v":""}]
["MARDI",5,"04:10:00",{"$f":"IF(OR(AND(C194>=INDEX(Champ,MATCH(A194,Jour,0),3),C194<=INDEX(Champ,MATCH(A194,Jour,0),4)),AND(C194>=INDEX(Champ,MATCH(A194,Jour,0)+1,4),C194<=INDEX(Champ,MATCH(A194,Jour,0)+1,3))),\"occupé\",\"\")","v":""}]
["MARDI",5,"04:20:00",{"$f":"IF(OR(AND(C195>=INDEX(Champ,MATCH(A195,Jour,0),3),C195<=INDEX(Champ,MATCH(A195,Jour,0),4)),AND(C195>=INDEX(Champ,MATCH(A195,Jour,0)+1,4),C195<=INDEX(Champ,MATCH(A195,Jour,0)+1,3))),\"occupé\",\"\")","v":""}]
["MARDI",5,"04:30:00",{"$f":"IF(OR(AND(C196>=INDEX(Champ,MATCH(A196,Jour,0),3),C196<=INDEX(Champ,MATCH(A196,Jour,0),4)),AND(C196>=INDEX(Champ,MATCH(A196,Jour,0)+1,4),C196<=INDEX(Champ,MATCH(A196,Jour,0)+1,3))),\"occupé\",\"\")","v":""}]
["MARDI",5,"04:40:00",{"$f":"IF(OR(AND(C197>=INDEX(Champ,MATCH(A197,Jour,0),3),C197<=INDEX(Champ,MATCH(A197,Jour,0),4)),AND(C197>=INDEX(Champ,MATCH(A197,Jour,0)+1,4),C197<=INDEX(Champ,MATCH(A197,Jour,0)+1,3))),\"occupé\",\"\")","v":""}]
["MARDI",5,"04:50:00",{"$f":"IF(OR(AND(C198>=INDEX(Champ,MATCH(A198,Jour,0),3),C198<=INDEX(Champ,MATCH(A198,Jour,0),4)),AND(C198>=INDEX(Champ,MATCH(A198,Jour,0)+1,4),C198<=INDEX(Champ,MATCH(A198,Jour,0)+1,3))),\"occupé\",\"\")","v":""}]
["MARDI",6,"05:00:00",{"$f":"IF(OR(AND(C199>=INDEX(Champ,MATCH(A199,Jour,0),3),C199<=INDEX(Champ,MATCH(A199,Jour,0),4)),AND(C199>=INDEX(Champ,MATCH(A199,Jour,0)+1,4),C199<=INDEX(Champ,MATCH(A199,Jour,0)+1,3))),\"occupé\",\"\")","v":""}]
["MARDI",6,"05:10:00",{"$f":"IF(OR(AND(C200>=INDEX(Champ,MATCH(A200,Jour,0),3),C200<=INDEX(Champ,MATCH(A200,Jour,0),4)),AND(C200>=INDEX(Champ,MATCH(A200,Jour,0)+1,4),C200<=INDEX(Champ,MATCH(A200,Jour,0)+1,3))),\"occupé\",\"\")","v":""}]
["MARDI",6,"05:20:00",{"$f":"IF(OR(AND(C201>=INDEX(Champ,MATCH(A201,Jour,0),3),C201<=INDEX(Champ,MATCH(A201,Jour,0),4)),AND(C201>=INDEX(Champ,MATCH(A201,Jour,0)+1,4),C201<=INDEX(Champ,MATCH(A201,Jour,0)+1,3))),\"occupé\",\"\")","v":""}]
["MARDI",6,"05:30:00",{"$f":"IF(OR(AND(C202>=INDEX(Champ,MATCH(A202,Jour,0),3),C202<=INDEX(Champ,MATCH(A202,Jour,0),4)),AND(C202>=INDEX(Champ,MATCH(A202,Jour,0)+1,4),C202<=INDEX(Champ,MATCH(A202,Jour,0)+1,3))),\"occupé\",\"\")","v":""}]
["MARDI",6,"05:40:00",{"$f":"IF(OR(AND(C203>=INDEX(Champ,MATCH(A203,Jour,0),3),C203<=INDEX(Champ,MATCH(A203,Jour,0),4)),AND(C203>=INDEX(Champ,MATCH(A203,Jour,0)+1,4),C203<=INDEX(Champ,MATCH(A203,Jour,0)+1,3))),\"occupé\",\"\")","v":""}]
["MARDI",6,"05:50:00",{"$f":"IF(OR(AND(C204>=INDEX(Champ,MATCH(A204,Jour,0),3),C204<=INDEX(Champ,MATCH(A204,Jour,0),4)),AND(C204>=INDEX(Champ,MATCH(A204,Jour,0)+1,4),C204<=INDEX(Champ,MATCH(A204,Jour,0)+1,3))),\"occupé\",\"\")","v":""}]
["MARDI",7,"06:00:00",{"$f":"IF(OR(AND(C205>=INDEX(Champ,MATCH(A205,Jour,0),3),C205<=INDEX(Champ,MATCH(A205,Jour,0),4)),AND(C205>=INDEX(Champ,MATCH(A205,Jour,0)+1,4),C205<=INDEX(Champ,MATCH(A205,Jour,0)+1,3))),\"occupé\",\"\")","v":""}]
["MARDI",7,"06:10:00",{"$f":"IF(OR(AND(C206>=INDEX(Champ,MATCH(A206,Jour,0),3),C206<=INDEX(Champ,MATCH(A206,Jour,0),4)),AND(C206>=INDEX(Champ,MATCH(A206,Jour,0)+1,4),C206<=INDEX(Champ,MATCH(A206,Jour,0)+1,3))),\"occupé\",\"\")","v":""}]
["MARDI",7,"06:20:00",{"$f":"IF(OR(AND(C207>=INDEX(Champ,MATCH(A207,Jour,0),3),C207<=INDEX(Champ,MATCH(A207,Jour,0),4)),AND(C207>=INDEX(Champ,MATCH(A207,Jour,0)+1,4),C207<=INDEX(Champ,MATCH(A207,Jour,0)+1,3))),\"occupé\",\"\")","v":""}]
["MARDI",7,"06:30:00",{"$f":"IF(OR(AND(C208>=INDEX(Champ,MATCH(A208,Jour,0),3),C208<=INDEX(Champ,MATCH(A208,Jour,0),4)),AND(C208>=INDEX(Champ,MATCH(A208,Jour,0)+1,4),C208<=INDEX(Champ,MATCH(A208,Jour,0)+1,3))),\"occupé\",\"\")","v":""}]
["MARDI",7,"06:40:00",{"$f":"IF(OR(AND(C209>=INDEX(Champ,MATCH(A209,Jour,0),3),C209<=INDEX(Champ,MATCH(A209,Jour,0),4)),AND(C209>=INDEX(Champ,MATCH(A209,Jour,0)+1,4),C209<=INDEX(Champ,MATCH(A209,Jour,0)+1,3))),\"occupé\",\"\")","v":""}]
["MARDI",7,"06:50:00",{"$f":"IF(OR(AND(C210>=INDEX(Champ,MATCH(A210,Jour,0),3),C210<=INDEX(Champ,MATCH(A210,Jour,0),4)),AND(C210>=INDEX(Champ,MATCH(A210,Jour,0)+1,4),C210<=INDEX(Champ,MATCH(A210,Jour,0)+1,3))),\"occupé\",\"\")","v":""}]
["MARDI",8,"07:00:00",{"$f":"IF(OR(AND(C211>=INDEX(Champ,MATCH(A211,Jour,0),3),C211<=INDEX(Champ,MATCH(A211,Jour,0),4)),AND(C211>=INDEX(Champ,MATCH(A211,Jour,0)+1,4),C211<=INDEX(Champ,MATCH(A211,Jour,0)+1,3))),\"occupé\",\"\")","v":""}]
["MARDI",8,"07:10:00",{"$f":"IF(OR(AND(C212>=INDEX(Champ,MATCH(A212,Jour,0),3),C212<=INDEX(Champ,MATCH(A212,Jour,0),4)),AND(C212>=INDEX(Champ,MATCH(A212,Jour,0)+1,4),C212<=INDEX(Champ,MATCH(A212,Jour,0)+1,3))),\"occupé\",\"\")","v":""}]
["MARDI",8,"07:20:00",{"$f":"IF(OR(AND(C213>=INDEX(Champ,MATCH(A213,Jour,0),3),C213<=INDEX(Champ,MATCH(A213,Jour,0),4)),AND(C213>=INDEX(Champ,MATCH(A213,Jour,0)+1,4),C213<=INDEX(Champ,MATCH(A213,Jour,0)+1,3))),\"occupé\",\"\")","v":""}]
["MARDI",8,"07:30:00",{"$f":"IF(OR(AND(C214>=INDEX(Champ,MATCH(A214,Jour,0),3),C214<=INDEX(Champ,MATCH(A214,Jour,0),4)),AND(C214>=INDEX(Champ,MATCH(A214,Jour,0)+1,4),C214<=INDEX(Champ,MATCH(A214,Jour,0)+1,3))),\"occupé\",\"\")","v":""}]
["MARDI",8,"07:40:00",{"$f":"IF(OR(AND(C215>=INDEX(Champ,MATCH(A215,Jour,0),3),C215<=INDEX(Champ,MATCH(A215,Jour,0),4)),AND(C215>=INDEX(Champ,MATCH(A215,Jour,0)+1,4),C215<=INDEX(Champ,MATCH(A215,Jour,0)+1,3))),\"occupé\",\"\")","v":""}]
["MARDI",8,"07:50:00",{"$f":"IF(OR(AND(C216>=INDEX(Champ,MATCH(A216,Jour,0),3),C216<=INDEX(Champ,MATCH(A216,Jour,0),4)),AND(C216>=INDEX(Champ,MATCH(A216,Jour,0)+1,4),C216<=INDEX(Champ,MATCH(A216,Jour,0)+1,3))),\"occupé\",\"\")","v":""}]
["MARDI",9,"08:00:00",{"$f":"IF(OR(AND(C217>=INDEX(Champ,MATCH(A217,Jour,0),3),C217<=INDEX(Champ,MATCH(A217,Jour,0),4)),AND(C217>=INDEX(Champ,MATCH(A217,Jour,0)+1,4),C217<=INDEX(Champ,MATCH(A217,Jour,0)+1,3))),\"occupé\",\"\")","v":""}]
["MARDI",9,"08:10:00",{"$f":"IF(OR(AND(C218>=INDEX(Champ,MATCH(A218,Jour,0),3),C218<=INDEX(Champ,MATCH(A218,Jour,0),4)),AND(C218>=INDEX(Champ,MATCH(A218,Jour,0)+1,4),C218<=INDEX(Champ,MATCH(A218,Jour,0)+1,3))),\"occupé\",\"\")","v":""}]
["MARDI",9,"08:20:00",{"$f":"IF(OR(AND(C219>=INDEX(Champ,MATCH(A219,Jour,0),3),C219<=INDEX(Champ,MATCH(A219,Jour,0),4)),AND(C219>=INDEX(Champ,MATCH(A219,Jour,0)+1,4),C219<=INDEX(Champ,MATCH(A219,Jour,0)+1,3))),\"occupé\",\"\")","v":""}]
["MARDI",9,"08:30:00",{"$f":"IF(OR(AND(C220>=INDEX(Champ,MATCH(A220,Jour,0),3),C220<=INDEX(Champ,MATCH(A220,Jour,0),4)),AND(C220>=INDEX(Champ,MATCH(A220,Jour,0)+1,4),C220<=INDEX(Champ,MATCH(A220,Jour,0)+1,3))),\"occupé\",\"\")","v":""}]
["MARDI",9,"08:40:00",{"$f":"IF(OR(AND(C221>=INDEX(Champ,MATCH(A221,Jour,0),3),C221<=INDEX(Champ,MATCH(A221,Jour,0),4)),AND(C221>=INDEX(Champ,MATCH(A221,Jour,0)+1,4),C221<=INDEX(Champ,MATCH(A221,Jour,0)+1,3))),\"occupé\",\"\")","v":""}]
["MARDI",9,"08:50:00",{"$f":"IF(OR(AND(C222>=INDEX(Champ,MATCH(A222,Jour,0),3),C222<=INDEX(Champ,MATCH(A222,Jour,0),4)),AND(C222>=INDEX(Champ,MATCH(A222,Jour,0)+1,4),C222<=INDEX(Champ,MATCH(A222,Jour,0)+1,3))),\"occupé\",\"\")","v":""}]
["MARDI",10,"09:00:00",{"$f":"IF(OR(AND(C223>=INDEX(Champ,MATCH(A223,Jour,0),3),C223<=INDEX(Champ,MATCH(A223,Jour,0),4)),AND(C223>=INDEX(Champ,MATCH(A223,Jour,0)+1,4),C223<=INDEX(Champ,MATCH(A223,Jour,0)+1,3))),\"occupé\",\"\")","v":""}]
["MARDI",10,"09:10:00",{"$f":"IF(OR(AND(C224>=INDEX(Champ,MATCH(A224,Jour,0),3),C224<=INDEX(Champ,MATCH(A224,Jour,0),4)),AND(C224>=INDEX(Champ,MATCH(A224,Jour,0)+1,4),C224<=INDEX(Champ,MATCH(A224,Jour,0)+1,3))),\"occupé\",\"\")","v":""}]
["MARDI",10,"09:20:00",{"$f":"IF(OR(AND(C225>=INDEX(Champ,MATCH(A225,Jour,0),3),C225<=INDEX(Champ,MATCH(A225,Jour,0),4)),AND(C225>=INDEX(Champ,MATCH(A225,Jour,0)+1,4),C225<=INDEX(Champ,MATCH(A225,Jour,0)+1,3))),\"occupé\",\"\")","v":""}]
["MARDI",10,"09:30:00",{"$f":"IF(OR(AND(C226>=INDEX(Champ,MATCH(A226,Jour,0),3),C226<=INDEX(Champ,MATCH(A226,Jour,0),4)),AND(C226>=INDEX(Champ,MATCH(A226,Jour,0)+1,4),C226<=INDEX(Champ,MATCH(A226,Jour,0)+1,3))),\"occupé\",\"\")","v":""}]
["MARDI",10,"09:40:00",{"$f":"IF(OR(AND(C227>=INDEX(Champ,MATCH(A227,Jour,0),3),C227<=INDEX(Champ,MATCH(A227,Jour,0),4)),AND(C227>=INDEX(Champ,MATCH(A227,Jour,0)+1,4),C227<=INDEX(Champ,MATCH(A227,Jour,0)+1,3))),\"occupé\",\"\")","v":""}]
["MARDI",10,"09:50:00",{"$f":"IF(OR(AND(C228>=INDEX(Champ,MATCH(A228,Jour,0),3),C228<=INDEX(Champ,MATCH(A228,Jour,0),4)),AND(C228>=INDEX(Champ,MATCH(A228,Jour,0)+1,4),C228<=INDEX(Champ,MATCH(A228,Jour,0)+1,3))),\"occupé\",\"\")","v":""}]
["MARDI",11,"10:00:00",{"$f":"IF(OR(AND(C229>=INDEX(Champ,MATCH(A229,Jour,0),3),C229<=INDEX(Champ,MATCH(A229,Jour,0),4)),AND(C229>=INDEX(Champ,MATCH(A229,Jour,0)+1,4),C229<=INDEX(Champ,MATCH(A229,Jour,0)+1,3))),\"occupé\",\"\")","v":""}]
["MARDI",11,"10:10:00",{"$f":"IF(OR(AND(C230>=INDEX(Champ,MATCH(A230,Jour,0),3),C230<=INDEX(Champ,MATCH(A230,Jour,0),4)),AND(C230>=INDEX(Champ,MATCH(A230,Jour,0)+1,4),C230<=INDEX(Champ,MATCH(A230,Jour,0)+1,3))),\"occupé\",\"\")","v":""}]
["MARDI",11,"10:20:00",{"$f":"IF(OR(AND(C231>=INDEX(Champ,MATCH(A231,Jour,0),3),C231<=INDEX(Champ,MATCH(A231,Jour,0),4)),AND(C231>=INDEX(Champ,MATCH(A231,Jour,0)+1,4),C231<=INDEX(Champ,MATCH(A231,Jour,0)+1,3))),\"occupé\",\"\")","v":""}]
["MARDI",11,"10:30:00",{"$f":"IF(OR(AND(C232>=INDEX(Champ,MATCH(A232,Jour,0),3),C232<=INDEX(Champ,MATCH(A232,Jour,0),4)),AND(C232>=INDEX(Champ,MATCH(A232,Jour,0)+1,4),C232<=INDEX(Champ,MATCH(A232,Jour,0)+1,3))),\"occupé\",\"\")","v":""}]
["MARDI",11,"10:40:00",{"$f":"IF(OR(AND(C233>=INDEX(Champ,MATCH(A233,Jour,0),3),C233<=INDEX(Champ,MATCH(A233,Jour,0),4)),AND(C233>=INDEX(Champ,MATCH(A233,Jour,0)+1,4),C233<=INDEX(Champ,MATCH(A233,Jour,0)+1,3))),\"occupé\",\"\")","v":""}]
["MARDI",11,"10:50:00",{"$f":"IF(OR(AND(C234>=INDEX(Champ,MATCH(A234,Jour,0),3),C234<=INDEX(Champ,MATCH(A234,Jour,0),4)),AND(C234>=INDEX(Champ,MATCH(A234,Jour,0)+1,4),C234<=INDEX(Champ,MATCH(A234,Jour,0)+1,3))),\"occupé\",\"\")","v":""}]
["MARDI",12,"11:00:00",{"$f":"IF(OR(AND(C235>=INDEX(Champ,MATCH(A235,Jour,0),3),C235<=INDEX(Champ,MATCH(A235,Jour,0),4)),AND(C235>=INDEX(Champ,MATCH(A235,Jour,0)+1,4),C235<=INDEX(Champ,MATCH(A235,Jour,0)+1,3))),\"occupé\",\"\")","v":""}]
["MARDI",12,"11:10:00",{"$f":"IF(OR(AND(C236>=INDEX(Champ,MATCH(A236,Jour,0),3),C236<=INDEX(Champ,MATCH(A236,Jour,0),4)),AND(C236>=INDEX(Champ,MATCH(A236,Jour,0)+1,4),C236<=INDEX(Champ,MATCH(A236,Jour,0)+1,3))),\"occupé\",\"\")","v":""}]
["MARDI",12,"11:20:00",{"$f":"IF(OR(AND(C237>=INDEX(Champ,MATCH(A237,Jour,0),3),C237<=INDEX(Champ,MATCH(A237,Jour,0),4)),AND(C237>=INDEX(Champ,MATCH(A237,Jour,0)+1,4),C237<=INDEX(Champ,MATCH(A237,Jour,0)+1,3))),\"occupé\",\"\")","v":""}]
["MARDI",12,"11:30:00",{"$f":"IF(OR(AND(C238>=INDEX(Champ,MATCH(A238,Jour,0),3),C238<=INDEX(Champ,MATCH(A238,Jour,0),4)),AND(C238>=INDEX(Champ,MATCH(A238,Jour,0)+1,4),C238<=INDEX(Champ,MATCH(A238,Jour,0)+1,3))),\"occupé\",\"\")","v":""}]
["MARDI",12,"11:40:00",{"$f":"IF(OR(AND(C239>=INDEX(Champ,MATCH(A239,Jour,0),3),C239<=INDEX(Champ,MATCH(A239,Jour,0),4)),AND(C239>=INDEX(Champ,MATCH(A239,Jour,0)+1,4),C239<=INDEX(Champ,MATCH(A239,Jour,0)+1,3))),\"occupé\",\"\")","v":""}]
["MARDI",12,"11:50:00",{"$f":"IF(OR(AND(C240>=INDEX(Champ,MATCH(A240,Jour,0),3),C240<=INDEX(Champ,MATCH(A240,Jour,0),4)),AND(C240>=INDEX(Champ,MATCH(A240,Jour,0)+1,4),C240<=INDEX(Champ,MATCH(A240,Jour,0)+1,3))),\"occupé\",\"\")","v":""}]
["MARDI",13,"12:00:00",{"$f":"IF(OR(AND(C241>=INDEX(Champ,MATCH(A241,Jour,0),3),C241<=INDEX(Champ,MATCH(A241,Jour,0),4)),AND(C241>=INDEX(Champ,MATCH(A241,Jour,0)+1,4),C241<=INDEX(Champ,MATCH(A241,Jour,0)+1,3))),\"occupé\",\"\")","v":"occupé"}]
["MARDI",13,"12:10:00",{"$f":"IF(OR(AND(C242>=INDEX(Champ,MATCH(A242,Jour,0),3),C242<=INDEX(Champ,MATCH(A242,Jour,0),4)),AND(C242>=INDEX(Champ,MATCH(A242,Jour,0)+1,4),C242<=INDEX(Champ,MATCH(A242,Jour,0)+1,3))),\"occupé\",\"\")","v":"occupé"}]
["MARDI",13,"12:20:00",{"$f":"IF(OR(AND(C243>=INDEX(Champ,MATCH(A243,Jour,0),3),C243<=INDEX(Champ,MATCH(A243,Jour,0),4)),AND(C243>=INDEX(Champ,MATCH(A243,Jour,0)+1,4),C243<=INDEX(Champ,MATCH(A243,Jour,0)+1,3))),\"occupé\",\"\")","v":"occupé"}]
["MARDI",13,"12:30:00",{"$f":"IF(OR(AND(C244>=INDEX(Champ,MATCH(A244,Jour,0),3),C244<=INDEX(Champ,MATCH(A244,Jour,0),4)),AND(C244>=INDEX(Champ,MATCH(A244,Jour,0)+1,4),C244<=INDEX(Champ,MATCH(A244,Jour,0)+1,3))),\"occupé\",\"\")","v":"occupé"}]
["MARDI",13,"12:40:00",{"$f":"IF(OR(AND(C245>=INDEX(Champ,MATCH(A245,Jour,0),3),C245<=INDEX(Champ,MATCH(A245,Jour,0),4)),AND(C245>=INDEX(Champ,MATCH(A245,Jour,0)+1,4),C245<=INDEX(Champ,MATCH(A245,Jour,0)+1,3))),\"occupé\",\"\")","v":"occupé"}]
["MARDI",13,"12:50:00",{"$f":"IF(OR(AND(C246>=INDEX(Champ,MATCH(A246,Jour,0),3),C246<=INDEX(Champ,MATCH(A246,Jour,0),4)),AND(C246>=INDEX(Champ,MATCH(A246,Jour,0)+1,4),C246<=INDEX(Champ,MATCH(A246,Jour,0)+1,3))),\"occupé\",\"\")","v":"occupé"}]
["MARDI",14,"13:00:00",{"$f":"IF(OR(AND(C247>=INDEX(Champ,MATCH(A247,Jour,0),3),C247<=INDEX(Champ,MATCH(A247,Jour,0),4)),AND(C247>=INDEX(Champ,MATCH(A247,Jour,0)+1,4),C247<=INDEX(Champ,MATCH(A247,Jour,0)+1,3))),\"occupé\",\"\")","v":"occupé"}]
["MARDI",14,"13:10:00",{"$f":"IF(OR(AND(C248>=INDEX(Champ,MATCH(A248,Jour,0),3),C248<=INDEX(Champ,MATCH(A248,Jour,0),4)),AND(C248>=INDEX(Champ,MATCH(A248,Jour,0)+1,4),C248<=INDEX(Champ,MATCH(A248,Jour,0)+1,3))),\"occupé\",\"\")","v":"occupé"}]
["MARDI",14,"13:20:00",{"$f":"IF(OR(AND(C249>=INDEX(Champ,MATCH(A249,Jour,0),3),C249<=INDEX(Champ,MATCH(A249,Jour,0),4)),AND(C249>=INDEX(Champ,MATCH(A249,Jour,0)+1,4),C249<=INDEX(Champ,MATCH(A249,Jour,0)+1,3))),\"occupé\",\"\")","v":"occupé"}]
["MARDI",14,"13:30:00",{"$f":"IF(OR(AND(C250>=INDEX(Champ,MATCH(A250,Jour,0),3),C250<=INDEX(Champ,MATCH(A250,Jour,0),4)),AND(C250>=INDEX(Champ,MATCH(A250,Jour,0)+1,4),C250<=INDEX(Champ,MATCH(A250,Jour,0)+1,3))),\"occupé\",\"\")","v":"occupé"}]
["MARDI",14,"13:40:00",{"$f":"IF(OR(AND(C251>=INDEX(Champ,MATCH(A251,Jour,0),3),C251<=INDEX(Champ,MATCH(A251,Jour,0),4)),AND(C251>=INDEX(Champ,MATCH(A251,Jour,0)+1,4),C251<=INDEX(Champ,MATCH(A251,Jour,0)+1,3))),\"occupé\",\"\")","v":"occupé"}]
["MARDI",14,"13:50:00",{"$f":"IF(OR(AND(C252>=INDEX(Champ,MATCH(A252,Jour,0),3),C252<=INDEX(Champ,MATCH(A252,Jour,0),4)),AND(C252>=INDEX(Champ,MATCH(A252,Jour,0)+1,4),C252<=INDEX(Champ,MATCH(A252,Jour,0)+1,3))),\"occupé\",\"\")","v":"occupé"}]
["MARDI",15,"14:00:00",{"$f":"IF(OR(AND(C253>=INDEX(Champ,MATCH(A253,Jour,0),3),C253<=INDEX(Champ,MATCH(A253,Jour,0),4)),AND(C253>=INDEX(Champ,MATCH(A253,Jour,0)+1,4),C253<=INDEX(Champ,MATCH(A253,Jour,0)+1,3))),\"occupé\",\"\")","v":"occupé"}]
["MARDI",15,"14:10:00",{"$f":"IF(OR(AND(C254>=INDEX(Champ,MATCH(A254,Jour,0),3),C254<=INDEX(Champ,MATCH(A254,Jour,0),4)),AND(C254>=INDEX(Champ,MATCH(A254,Jour,0)+1,4),C254<=INDEX(Champ,MATCH(A254,Jour,0)+1,3))),\"occupé\",\"\")","v":""}]
["MARDI",15,"14:20:00",{"$f":"IF(OR(AND(C255>=INDEX(Champ,MATCH(A255,Jour,0),3),C255<=INDEX(Champ,MATCH(A255,Jour,0),4)),AND(C255>=INDEX(Champ,MATCH(A255,Jour,0)+1,4),C255<=INDEX(Champ,MATCH(A255,Jour,0)+1,3))),\"occupé\",\"\")","v":""}]
["MARDI",15,"14:30:00",{"$f":"IF(OR(AND(C256>=INDEX(Champ,MATCH(A256,Jour,0),3),C256<=INDEX(Champ,MATCH(A256,Jour,0),4)),AND(C256>=INDEX(Champ,MATCH(A256,Jour,0)+1,4),C256<=INDEX(Champ,MATCH(A256,Jour,0)+1,3))),\"occupé\",\"\")","v":""}]
["MARDI",15,"14:40:00",{"$f":"IF(OR(AND(C257>=INDEX(Champ,MATCH(A257,Jour,0),3),C257<=INDEX(Champ,MATCH(A257,Jour,0),4)),AND(C257>=INDEX(Champ,MATCH(A257,Jour,0)+1,4),C257<=INDEX(Champ,MATCH(A257,Jour,0)+1,3))),\"occupé\",\"\")","v":""}]
["MARDI",15,"14:50:00",{"$f":"IF(OR(AND(C258>=INDEX(Champ,MATCH(A258,Jour,0),3),C258<=INDEX(Champ,MATCH(A258,Jour,0),4)),AND(C258>=INDEX(Champ,MATCH(A258,Jour,0)+1,4),C258<=INDEX(Champ,MATCH(A258,Jour,0)+1,3))),\"occupé\",\"\")","v":""}]
["MARDI",16,"15:00:00",{"$f":"IF(OR(AND(C259>=INDEX(Champ,MATCH(A259,Jour,0),3),C259<=INDEX(Champ,MATCH(A259,Jour,0),4)),AND(C259>=INDEX(Champ,MATCH(A259,Jour,0)+1,4),C259<=INDEX(Champ,MATCH(A259,Jour,0)+1,3))),\"occupé\",\"\")","v":""}]
["MARDI",16,"15:10:00",{"$f":"IF(OR(AND(C260>=INDEX(Champ,MATCH(A260,Jour,0),3),C260<=INDEX(Champ,MATCH(A260,Jour,0),4)),AND(C260>=INDEX(Champ,MATCH(A260,Jour,0)+1,4),C260<=INDEX(Champ,MATCH(A260,Jour,0)+1,3))),\"occupé\",\"\")","v":""}]
["MARDI",16,"15:20:00",{"$f":"IF(OR(AND(C261>=INDEX(Champ,MATCH(A261,Jour,0),3),C261<=INDEX(Champ,MATCH(A261,Jour,0),4)),AND(C261>=INDEX(Champ,MATCH(A261,Jour,0)+1,4),C261<=INDEX(Champ,MATCH(A261,Jour,0)+1,3))),\"occupé\",\"\")","v":""}]
["MARDI",16,"15:30:00",{"$f":"IF(OR(AND(C262>=INDEX(Champ,MATCH(A262,Jour,0),3),C262<=INDEX(Champ,MATCH(A262,Jour,0),4)),AND(C262>=INDEX(Champ,MATCH(A262,Jour,0)+1,4),C262<=INDEX(Champ,MATCH(A262,Jour,0)+1,3))),\"occupé\",\"\")","v":""}]
["MARDI",16,"15:40:00",{"$f":"IF(OR(AND(C263>=INDEX(Champ,MATCH(A263,Jour,0),3),C263<=INDEX(Champ,MATCH(A263,Jour,0),4)),AND(C263>=INDEX(Champ,MATCH(A263,Jour,0)+1,4),C263<=INDEX(Champ,MATCH(A263,Jour,0)+1,3))),\"occupé\",\"\")","v":""}]
["MARDI",16,"15:50:00",{"$f":"IF(OR(AND(C264>=INDEX(Champ,MATCH(A264,Jour,0),3),C264<=INDEX(Champ,MATCH(A264,Jour,0),4)),AND(C264>=INDEX(Champ,MATCH(A264,Jour,0)+1,4),C264<=INDEX(Champ,MATCH(A264,Jour,0)+1,3))),\"occupé\",\"\")","v":""}]
["MARDI",17,"16:00:00",{"$f":"IF(OR(AND(C265>=INDEX(Champ,MATCH(A265,Jour,0),3),C265<=INDEX(Champ,MATCH(A265,Jour,0),4)),AND(C265>=INDEX(Champ,MATCH(A265,Jour,0)+1,4),C265<=INDEX(Champ,MATCH(A265,Jour,0)+1,3))),\"occupé\",\"\")","v":""}]
["MARDI",17,"16:10:00",{"$f":"IF(OR(AND(C266>=INDEX(Champ,MATCH(A266,Jour,0),3),C266<=INDEX(Champ,MATCH(A266,Jour,0),4)),AND(C266>=INDEX(Champ,MATCH(A266,Jour,0)+1,4),C266<=INDEX(Champ,MATCH(A266,Jour,0)+1,3))),\"occupé\",\"\")","v":""}]
["MARDI",17,"16:20:00",{"$f":"IF(OR(AND(C267>=INDEX(Champ,MATCH(A267,Jour,0),3),C267<=INDEX(Champ,MATCH(A267,Jour,0),4)),AND(C267>=INDEX(Champ,MATCH(A267,Jour,0)+1,4),C267<=INDEX(Champ,MATCH(A267,Jour,0)+1,3))),\"occupé\",\"\")","v":""}]
["MARDI",17,"16:30:00",{"$f":"IF(OR(AND(C268>=INDEX(Champ,MATCH(A268,Jour,0),3),C268<=INDEX(Champ,MATCH(A268,Jour,0),4)),AND(C268>=INDEX(Champ,MATCH(A268,Jour,0)+1,4),C268<=INDEX(Champ,MATCH(A268,Jour,0)+1,3))),\"occupé\",\"\")","v":""}]
["MARDI",17,"16:40:00",{"$f":"IF(OR(AND(C269>=INDEX(Champ,MATCH(A269,Jour,0),3),C269<=INDEX(Champ,MATCH(A269,Jour,0),4)),AND(C269>=INDEX(Champ,MATCH(A269,Jour,0)+1,4),C269<=INDEX(Champ,MATCH(A269,Jour,0)+1,3))),\"occupé\",\"\")","v":""}]
["MARDI",17,"16:50:00",{"$f":"IF(OR(AND(C270>=INDEX(Champ,MATCH(A270,Jour,0),3),C270<=INDEX(Champ,MATCH(A270,Jour,0),4)),AND(C270>=INDEX(Champ,MATCH(A270,Jour,0)+1,4),C270<=INDEX(Champ,MATCH(A270,Jour,0)+1,3))),\"occupé\",\"\")","v":""}]
["MARDI",18,"17:00:00",{"$f":"IF(OR(AND(C271>=INDEX(Champ,MATCH(A271,Jour,0),3),C271<=INDEX(Champ,MATCH(A271,Jour,0),4)),AND(C271>=INDEX(Champ,MATCH(A271,Jour,0)+1,4),C271<=INDEX(Champ,MATCH(A271,Jour,0)+1,3))),\"occupé\",\"\")","v":""}]
["MARDI",18,"17:10:00",{"$f":"IF(OR(AND(C272>=INDEX(Champ,MATCH(A272,Jour,0),3),C272<=INDEX(Champ,MATCH(A272,Jour,0),4)),AND(C272>=INDEX(Champ,MATCH(A272,Jour,0)+1,4),C272<=INDEX(Champ,MATCH(A272,Jour,0)+1,3))),\"occupé\",\"\")","v":""}]
["MARDI",18,"17:20:00",{"$f":"IF(OR(AND(C273>=INDEX(Champ,MATCH(A273,Jour,0),3),C273<=INDEX(Champ,MATCH(A273,Jour,0),4)),AND(C273>=INDEX(Champ,MATCH(A273,Jour,0)+1,4),C273<=INDEX(Champ,MATCH(A273,Jour,0)+1,3))),\"occupé\",\"\")","v":""}]
["MARDI",18,"17:30:00",{"$f":"IF(OR(AND(C274>=INDEX(Champ,MATCH(A274,Jour,0),3),C274<=INDEX(Champ,MATCH(A274,Jour,0),4)),AND(C274>=INDEX(Champ,MATCH(A274,Jour,0)+1,4),C274<=INDEX(Champ,MATCH(A274,Jour,0)+1,3))),\"occupé\",\"\")","v":""}]
["MARDI",18,"17:40:00",{"$f":"IF(OR(AND(C275>=INDEX(Champ,MATCH(A275,Jour,0),3),C275<=INDEX(Champ,MATCH(A275,Jour,0),4)),AND(C275>=INDEX(Champ,MATCH(A275,Jour,0)+1,4),C275<=INDEX(Champ,MATCH(A275,Jour,0)+1,3))),\"occupé\",\"\")","v":""}]
["MARDI",18,"17:50:00",{"$f":"IF(OR(AND(C276>=INDEX(Champ,MATCH(A276,Jour,0),3),C276<=INDEX(Champ,MATCH(A276,Jour,0),4)),AND(C276>=INDEX(Champ,MATCH(A276,Jour,0)+1,4),C276<=INDEX(Champ,MATCH(A276,Jour,0)+1,3))),\"occupé\",\"\")","v":""}]
["MARDI",19,"18:00:00",{"$f":"IF(OR(AND(C277>=INDEX(Champ,MATCH(A277,Jour,0),3),C277<=INDEX(Champ,MATCH(A277,Jour,0),4)),AND(C277>=INDEX(Champ,MATCH(A277,Jour,0)+1,4),C277<=INDEX(Champ,MATCH(A277,Jour,0)+1,3))),\"occupé\",\"\")","v":""}]
["MARDI",19,"18:10:00",{"$f":"IF(OR(AND(C278>=INDEX(Champ,MATCH(A278,Jour,0),3),C278<=INDEX(Champ,MATCH(A278,Jour,0),4)),AND(C278>=INDEX(Champ,MATCH(A278,Jour,0)+1,4),C278<=INDEX(Champ,MATCH(A278,Jour,0)+1,3))),\"occupé\",\"\")","v":""}]
["MARDI",19,"18:20:00",{"$f":"IF(OR(AND(C279>=INDEX(Champ,MATCH(A279,Jour,0),3),C279<=INDEX(Champ,MATCH(A279,Jour,0),4)),AND(C279>=INDEX(Champ,MATCH(A279,Jour,0)+1,4),C279<=INDEX(Champ,MATCH(A279,Jour,0)+1,3))),\"occupé\",\"\")","v":""}]
["MARDI",19,"18:30:00",{"$f":"IF(OR(AND(C280>=INDEX(Champ,MATCH(A280,Jour,0),3),C280<=INDEX(Champ,MATCH(A280,Jour,0),4)),AND(C280>=INDEX(Champ,MATCH(A280,Jour,0)+1,4),C280<=INDEX(Champ,MATCH(A280,Jour,0)+1,3))),\"occupé\",\"\")","v":""}]
["MARDI",19,"18:40:00",{"$f":"IF(OR(AND(C281>=INDEX(Champ,MATCH(A281,Jour,0),3),C281<=INDEX(Champ,MATCH(A281,Jour,0),4)),AND(C281>=INDEX(Champ,MATCH(A281,Jour,0)+1,4),C281<=INDEX(Champ,MATCH(A281,Jour,0)+1,3))),\"occupé\",\"\")","v":""}]
["MARDI",19,"18:50:00",{"$f":"IF(OR(AND(C282>=INDEX(Champ,MATCH(A282,Jour,0),3),C282<=INDEX(Champ,MATCH(A282,Jour,0),4)),AND(C282>=INDEX(Champ,MATCH(A282,Jour,0)+1,4),C282<=INDEX(Champ,MATCH(A282,Jour,0)+1,3))),\"occupé\",\"\")","v":""}]
["MARDI",20,"19:00:00",{"$f":"IF(OR(AND(C283>=INDEX(Champ,MATCH(A283,Jour,0),3),C283<=INDEX(Champ,MATCH(A283,Jour,0),4)),AND(C283>=INDEX(Champ,MATCH(A283,Jour,0)+1,4),C283<=INDEX(Champ,MATCH(A283,Jour,0)+1,3))),\"occupé\",\"\")","v":""}]
["MARDI",20,"19:10:00",{"$f":"IF(OR(AND(C284>=INDEX(Champ,MATCH(A284,Jour,0),3),C284<=INDEX(Champ,MATCH(A284,Jour,0),4)),AND(C284>=INDEX(Champ,MATCH(A284,Jour,0)+1,4),C284<=INDEX(Champ,MATCH(A284,Jour,0)+1,3))),\"occupé\",\"\")","v":""}]
["MARDI",20,"19:20:00",{"$f":"IF(OR(AND(C285>=INDEX(Champ,MATCH(A285,Jour,0),3),C285<=INDEX(Champ,MATCH(A285,Jour,0),4)),AND(C285>=INDEX(Champ,MATCH(A285,Jour,0)+1,4),C285<=INDEX(Champ,MATCH(A285,Jour,0)+1,3))),\"occupé\",\"\")","v":""}]
["MARDI",20,"19:30:00",{"$f":"IF(OR(AND(C286>=INDEX(Champ,MATCH(A286,Jour,0),3),C286<=INDEX(Champ,MATCH(A286,Jour,0),4)),AND(C286>=INDEX(Champ,MATCH(A286,Jour,0)+1,4),C286<=INDEX(Champ,MATCH(A286,Jour,0)+1,3))),\"occupé\",\"\")","v":""}]
["MARDI",20,"19:40:00",{"$f":"IF(OR(AND(C287>=INDEX(Champ,MATCH(A287,Jour,0),3),C287<=INDEX(Champ,MATCH(A287,Jour,0),4)),AND(C287>=INDEX(Champ,MATCH(A287,Jour,0)+1,4),C287<=INDEX(Champ,MATCH(A287,Jour,0)+1,3))),\"occupé\",\"\")","v":""}]
["MARDI",20,"19:50:00",{"$f":"IF(OR(AND(C288>=INDEX(Champ,MATCH(A288,Jour,0),3),C288<=INDEX(Champ,MATCH(A288,Jour,0),4)),AND(C288>=INDEX(Champ,MATCH(A288,Jour,0)+1,4),C288<=INDEX(Champ,MATCH(A288,Jour,0)+1,3))),\"occupé\",\"\")","v":""}]
["MARDI",21,"20:00:00",{"$f":"IF(OR(AND(C289>=INDEX(Champ,MATCH(A289,Jour,0),3),C289<=INDEX(Champ,MATCH(A289,Jour,0),4)),AND(C289>=INDEX(Champ,MATCH(A289,Jour,0)+1,4),C289<=INDEX(Champ,MATCH(A289,Jour,0)+1,3))),\"occupé\",\"\")","v":""}]
["MARDI",21,"20:10:00",{"$f":"IF(OR(AND(C290>=INDEX(Champ,MATCH(A290,Jour,0),3),C290<=INDEX(Champ,MATCH(A290,Jour,0),4)),AND(C290>=INDEX(Champ,MATCH(A290,Jour,0)+1,4),C290<=INDEX(Champ,MATCH(A290,Jour,0)+1,3))),\"occupé\",\"\")","v":""}]
["MARDI",21,"20:20:00",{"$f":"IF(OR(AND(C291>=INDEX(Champ,MATCH(A291,Jour,0),3),C291<=INDEX(Champ,MATCH(A291,Jour,0),4)),AND(C291>=INDEX(Champ,MATCH(A291,Jour,0)+1,4),C291<=INDEX(Champ,MATCH(A291,Jour,0)+1,3))),\"occupé\",\"\")","v":""}]
["MARDI",21,"20:30:00",{"$f":"IF(OR(AND(C292>=INDEX(Champ,MATCH(A292,Jour,0),3),C292<=INDEX(Champ,MATCH(A292,Jour,0),4)),AND(C292>=INDEX(Champ,MATCH(A292,Jour,0)+1,4),C292<=INDEX(Champ,MATCH(A292,Jour,0)+1,3))),\"occupé\",\"\")","v":""}]
["MARDI",21,"20:40:00",{"$f":"IF(OR(AND(C293>=INDEX(Champ,MATCH(A293,Jour,0),3),C293<=INDEX(Champ,MATCH(A293,Jour,0),4)),AND(C293>=INDEX(Champ,MATCH(A293,Jour,0)+1,4),C293<=INDEX(Champ,MATCH(A293,Jour,0)+1,3))),\"occupé\",\"\")","v":""}]
["MARDI",21,"20:50:00",{"$f":"IF(OR(AND(C294>=INDEX(Champ,MATCH(A294,Jour,0),3),C294<=INDEX(Champ,MATCH(A294,Jour,0),4)),AND(C294>=INDEX(Champ,MATCH(A294,Jour,0)+1,4),C294<=INDEX(Champ,MATCH(A294,Jour,0)+1,3))),\"occupé\",\"\")","v":""}]
["MARDI",22,"21:00:00",{"$f":"IF(OR(AND(C295>=INDEX(Champ,MATCH(A295,Jour,0),3),C295<=INDEX(Champ,MATCH(A295,Jour,0),4)),AND(C295>=INDEX(Champ,MATCH(A295,Jour,0)+1,4),C295<=INDEX(Champ,MATCH(A295,Jour,0)+1,3))),\"occupé\",\"\")","v":""}]
["MARDI",22,"21:10:00",{"$f":"IF(OR(AND(C296>=INDEX(Champ,MATCH(A296,Jour,0),3),C296<=INDEX(Champ,MATCH(A296,Jour,0),4)),AND(C296>=INDEX(Champ,MATCH(A296,Jour,0)+1,4),C296<=INDEX(Champ,MATCH(A296,Jour,0)+1,3))),\"occupé\",\"\")","v":""}]
["MARDI",22,"21:20:00",{"$f":"IF(OR(AND(C297>=INDEX(Champ,MATCH(A297,Jour,0),3),C297<=INDEX(Champ,MATCH(A297,Jour,0),4)),AND(C297>=INDEX(Champ,MATCH(A297,Jour,0)+1,4),C297<=INDEX(Champ,MATCH(A297,Jour,0)+1,3))),\"occupé\",\"\")","v":""}]
["MARDI",22,"21:30:00",{"$f":"IF(OR(AND(C298>=INDEX(Champ,MATCH(A298,Jour,0),3),C298<=INDEX(Champ,MATCH(A298,Jour,0),4)),AND(C298>=INDEX(Champ,MATCH(A298,Jour,0)+1,4),C298<=INDEX(Champ,MATCH(A298,Jour,0)+1,3))),\"occupé\",\"\")","v":""}]
["MARDI",22,"21:40:00",{"$f":"IF(OR(AND(C299>=INDEX(Champ,MATCH(A299,Jour,0),3),C299<=INDEX(Champ,MATCH(A299,Jour,0),4)),AND(C299>=INDEX(Champ,MATCH(A299,Jour,0)+1,4),C299<=INDEX(Champ,MATCH(A299,Jour,0)+1,3))),\"occupé\",\"\")","v":""}]
["MARDI",22,"21:50:00",{"$f":"IF(OR(AND(C300>=INDEX(Champ,MATCH(A300,Jour,0),3),C300<=INDEX(Champ,MATCH(A300,Jour,0),4)),AND(C300>=INDEX(Champ,MATCH(A300,Jour,0)+1,4),C300<=INDEX(Champ,MATCH(A300,Jour,0)+1,3))),\"occupé\",\"\")","v":""}]
["MARDI",23,"22:00:00",{"$f":"IF(OR(AND(C301>=INDEX(Champ,MATCH(A301,Jour,0),3),C301<=INDEX(Champ,MATCH(A301,Jour,0),4)),AND(C301>=INDEX(Champ,MATCH(A301,Jour,0)+1,4),C301<=INDEX(Champ,MATCH(A301,Jour,0)+1,3))),\"occupé\",\"\")","v":""}]
["MARDI",23,"22:10:00",{"$f":"IF(OR(AND(C302>=INDEX(Champ,MATCH(A302,Jour,0),3),C302<=INDEX(Champ,MATCH(A302,Jour,0),4)),AND(C302>=INDEX(Champ,MATCH(A302,Jour,0)+1,4),C302<=INDEX(Champ,MATCH(A302,Jour,0)+1,3))),\"occupé\",\"\")","v":""}]
["MARDI",23,"22:20:00",{"$f":"IF(OR(AND(C303>=INDEX(Champ,MATCH(A303,Jour,0),3),C303<=INDEX(Champ,MATCH(A303,Jour,0),4)),AND(C303>=INDEX(Champ,MATCH(A303,Jour,0)+1,4),C303<=INDEX(Champ,MATCH(A303,Jour,0)+1,3))),\"occupé\",\"\")","v":""}]
["MARDI",23,"22:30:00",{"$f":"IF(OR(AND(C304>=INDEX(Champ,MATCH(A304,Jour,0),3),C304<=INDEX(Champ,MATCH(A304,Jour,0),4)),AND(C304>=INDEX(Champ,MATCH(A304,Jour,0)+1,4),C304<=INDEX(Champ,MATCH(A304,Jour,0)+1,3))),\"occupé\",\"\")","v":""}]
["MARDI",23,"22:40:00",{"$f":"IF(OR(AND(C305>=INDEX(Champ,MATCH(A305,Jour,0),3),C305<=INDEX(Champ,MATCH(A305,Jour,0),4)),AND(C305>=INDEX(Champ,MATCH(A305,Jour,0)+1,4),C305<=INDEX(Champ,MATCH(A305,Jour,0)+1,3))),\"occupé\",\"\")","v":""}]
["MARDI",23,"22:50:00",{"$f":"IF(OR(AND(C306>=INDEX(Champ,MATCH(A306,Jour,0),3),C306<=INDEX(Champ,MATCH(A306,Jour,0),4)),AND(C306>=INDEX(Champ,MATCH(A306,Jour,0)+1,4),C306<=INDEX(Champ,MATCH(A306,Jour,0)+1,3))),\"occupé\",\"\")","v":""}]
["MARDI",24,"23:00:00",{"$f":"IF(OR(AND(C307>=INDEX(Champ,MATCH(A307,Jour,0),3),C307<=INDEX(Champ,MATCH(A307,Jour,0),4)),AND(C307>=INDEX(Champ,MATCH(A307,Jour,0)+1,4),C307<=INDEX(Champ,MATCH(A307,Jour,0)+1,3))),\"occupé\",\"\")","v":""}]
["MARDI",24,"23:10:00",{"$f":"IF(OR(AND(C308>=INDEX(Champ,MATCH(A308,Jour,0),3),C308<=INDEX(Champ,MATCH(A308,Jour,0),4)),AND(C308>=INDEX(Champ,MATCH(A308,Jour,0)+1,4),C308<=INDEX(Champ,MATCH(A308,Jour,0)+1,3))),\"occupé\",\"\")","v":""}]
["MARDI",24,"23:20:00",{"$f":"IF(OR(AND(C309>=INDEX(Champ,MATCH(A309,Jour,0),3),C309<=INDEX(Champ,MATCH(A309,Jour,0),4)),AND(C309>=INDEX(Champ,MATCH(A309,Jour,0)+1,4),C309<=INDEX(Champ,MATCH(A309,Jour,0)+1,3))),\"occupé\",\"\")","v":""}]
["MARDI",24,"23:30:00",{"$f":"IF(OR(AND(C310>=INDEX(Champ,MATCH(A310,Jour,0),3),C310<=INDEX(Champ,MATCH(A310,Jour,0),4)),AND(C310>=INDEX(Champ,MATCH(A310,Jour,0)+1,4),C310<=INDEX(Champ,MATCH(A310,Jour,0)+1,3))),\"occupé\",\"\")","v":""}]
["MARDI",24,"23:40:00",{"$f":"IF(OR(AND(C311>=INDEX(Champ,MATCH(A311,Jour,0),3),C311<=INDEX(Champ,MATCH(A311,Jour,0),4)),AND(C311>=INDEX(Champ,MATCH(A311,Jour,0)+1,4),C311<=INDEX(Champ,MATCH(A311,Jour,0)+1,3))),\"occupé\",\"\")","v":""}]
["MARDI",24,"23:50:00",{"$f":"IF(OR(AND(C312>=INDEX(Champ,MATCH(A312,Jour,0),3),C312<=INDEX(Champ,MATCH(A312,Jour,0),4)),AND(C312>=INDEX(Champ,MATCH(A312,Jour,0)+1,4),C312<=INDEX(Champ,MATCH(A312,Jour,0)+1,3))),\"occupé\",\"\")","v":""}]
["MERCREDI",1,"00:00:00",{"$f":"IF(OR(AND(C313>=INDEX(Champ,MATCH(A313,Jour,0),3),C313<=INDEX(Champ,MATCH(A313,Jour,0),4)),AND(C313>=INDEX(Champ,MATCH(A313,Jour,0)+1,4),C313<=INDEX(Champ,MATCH(A313,Jour,0)+1,3))),\"occupé\",\"\")","v":""}]
["MERCREDI",1,"00:10:00",{"$f":"IF(OR(AND(C314>=INDEX(Champ,MATCH(A314,Jour,0),3),C314<=INDEX(Champ,MATCH(A314,Jour,0),4)),AND(C314>=INDEX(Champ,MATCH(A314,Jour,0)+1,4),C314<=INDEX(Champ,MATCH(A314,Jour,0)+1,3))),\"occupé\",\"\")","v":""}]
["MERCREDI",1,"00:20:00",{"$f":"IF(OR(AND(C315>=INDEX(Champ,MATCH(A315,Jour,0),3),C315<=INDEX(Champ,MATCH(A315,Jour,0),4)),AND(C315>=INDEX(Champ,MATCH(A315,Jour,0)+1,4),C315<=INDEX(Champ,MATCH(A315,Jour,0)+1,3))),\"occupé\",\"\")","v":""}]
["MERCREDI",1,"00:30:00",{"$f":"IF(OR(AND(C316>=INDEX(Champ,MATCH(A316,Jour,0),3),C316<=INDEX(Champ,MATCH(A316,Jour,0),4)),AND(C316>=INDEX(Champ,MATCH(A316,Jour,0)+1,4),C316<=INDEX(Champ,MATCH(A316,Jour,0)+1,3))),\"occupé\",\"\")","v":""}]
["MERCREDI",1,"00:40:00",{"$f":"IF(OR(AND(C317>=INDEX(Champ,MATCH(A317,Jour,0),3),C317<=INDEX(Champ,MATCH(A317,Jour,0),4)),AND(C317>=INDEX(Champ,MATCH(A317,Jour,0)+1,4),C317<=INDEX(Champ,MATCH(A317,Jour,0)+1,3))),\"occupé\",\"\")","v":""}]
["MERCREDI",1,"00:50:00",{"$f":"IF(OR(AND(C318>=INDEX(Champ,MATCH(A318,Jour,0),3),C318<=INDEX(Champ,MATCH(A318,Jour,0),4)),AND(C318>=INDEX(Champ,MATCH(A318,Jour,0)+1,4),C318<=INDEX(Champ,MATCH(A318,Jour,0)+1,3))),\"occupé\",\"\")","v":""}]
["MERCREDI",2,"01:00:00",{"$f":"IF(OR(AND(C319>=INDEX(Champ,MATCH(A319,Jour,0),3),C319<=INDEX(Champ,MATCH(A319,Jour,0),4)),AND(C319>=INDEX(Champ,MATCH(A319,Jour,0)+1,4),C319<=INDEX(Champ,MATCH(A319,Jour,0)+1,3))),\"occupé\",\"\")","v":""}]
["MERCREDI",2,"01:10:00",{"$f":"IF(OR(AND(C320>=INDEX(Champ,MATCH(A320,Jour,0),3),C320<=INDEX(Champ,MATCH(A320,Jour,0),4)),AND(C320>=INDEX(Champ,MATCH(A320,Jour,0)+1,4),C320<=INDEX(Champ,MATCH(A320,Jour,0)+1,3))),\"occupé\",\"\")","v":""}]
["MERCREDI",2,"01:20:00",{"$f":"IF(OR(AND(C321>=INDEX(Champ,MATCH(A321,Jour,0),3),C321<=INDEX(Champ,MATCH(A321,Jour,0),4)),AND(C321>=INDEX(Champ,MATCH(A321,Jour,0)+1,4),C321<=INDEX(Champ,MATCH(A321,Jour,0)+1,3))),\"occupé\",\"\")","v":""}]
["MERCREDI",2,"01:30:00",{"$f":"IF(OR(AND(C322>=INDEX(Champ,MATCH(A322,Jour,0),3),C322<=INDEX(Champ,MATCH(A322,Jour,0),4)),AND(C322>=INDEX(Champ,MATCH(A322,Jour,0)+1,4),C322<=INDEX(Champ,MATCH(A322,Jour,0)+1,3))),\"occupé\",\"\")","v":""}]
["MERCREDI",2,"01:40:00",{"$f":"IF(OR(AND(C323>=INDEX(Champ,MATCH(A323,Jour,0),3),C323<=INDEX(Champ,MATCH(A323,Jour,0),4)),AND(C323>=INDEX(Champ,MATCH(A323,Jour,0)+1,4),C323<=INDEX(Champ,MATCH(A323,Jour,0)+1,3))),\"occupé\",\"\")","v":""}]
["MERCREDI",2,"01:50:00",{"$f":"IF(OR(AND(C324>=INDEX(Champ,MATCH(A324,Jour,0),3),C324<=INDEX(Champ,MATCH(A324,Jour,0),4)),AND(C324>=INDEX(Champ,MATCH(A324,Jour,0)+1,4),C324<=INDEX(Champ,MATCH(A324,Jour,0)+1,3))),\"occupé\",\"\")","v":""}]
["MERCREDI",3,"02:00:00",{"$f":"IF(OR(AND(C325>=INDEX(Champ,MATCH(A325,Jour,0),3),C325<=INDEX(Champ,MATCH(A325,Jour,0),4)),AND(C325>=INDEX(Champ,MATCH(A325,Jour,0)+1,4),C325<=INDEX(Champ,MATCH(A325,Jour,0)+1,3))),\"occupé\",\"\")","v":""}]
["MERCREDI",3,"02:10:00",{"$f":"IF(OR(AND(C326>=INDEX(Champ,MATCH(A326,Jour,0),3),C326<=INDEX(Champ,MATCH(A326,Jour,0),4)),AND(C326>=INDEX(Champ,MATCH(A326,Jour,0)+1,4),C326<=INDEX(Champ,MATCH(A326,Jour,0)+1,3))),\"occupé\",\"\")","v":""}]
["MERCREDI",3,"02:20:00",{"$f":"IF(OR(AND(C327>=INDEX(Champ,MATCH(A327,Jour,0),3),C327<=INDEX(Champ,MATCH(A327,Jour,0),4)),AND(C327>=INDEX(Champ,MATCH(A327,Jour,0)+1,4),C327<=INDEX(Champ,MATCH(A327,Jour,0)+1,3))),\"occupé\",\"\")","v":""}]
["MERCREDI",3,"02:30:00",{"$f":"IF(OR(AND(C328>=INDEX(Champ,MATCH(A328,Jour,0),3),C328<=INDEX(Champ,MATCH(A328,Jour,0),4)),AND(C328>=INDEX(Champ,MATCH(A328,Jour,0)+1,4),C328<=INDEX(Champ,MATCH(A328,Jour,0)+1,3))),\"occupé\",\"\")","v":""}]
["MERCREDI",3,"02:40:00",{"$f":"IF(OR(AND(C329>=INDEX(Champ,MATCH(A329,Jour,0),3),C329<=INDEX(Champ,MATCH(A329,Jour,0),4)),AND(C329>=INDEX(Champ,MATCH(A329,Jour,0)+1,4),C329<=INDEX(Champ,MATCH(A329,Jour,0)+1,3))),\"occupé\",\"\")","v":""}]
["MERCREDI",3,"02:50:00",{"$f":"IF(OR(AND(C330>=INDEX(Champ,MATCH(A330,Jour,0),3),C330<=INDEX(Champ,MATCH(A330,Jour,0),4)),AND(C330>=INDEX(Champ,MATCH(A330,Jour,0)+1,4),C330<=INDEX(Champ,MATCH(A330,Jour,0)+1,3))),\"occupé\",\"\")","v":""}]
["MERCREDI",4,"03:00:00",{"$f":"IF(OR(AND(C331>=INDEX(Champ,MATCH(A331,Jour,0),3),C331<=INDEX(Champ,MATCH(A331,Jour,0),4)),AND(C331>=INDEX(Champ,MATCH(A331,Jour,0)+1,4),C331<=INDEX(Champ,MATCH(A331,Jour,0)+1,3))),\"occupé\",\"\")","v":""}]
["MERCREDI",4,"03:10:00",{"$f":"IF(OR(AND(C332>=INDEX(Champ,MATCH(A332,Jour,0),3),C332<=INDEX(Champ,MATCH(A332,Jour,0),4)),AND(C332>=INDEX(Champ,MATCH(A332,Jour,0)+1,4),C332<=INDEX(Champ,MATCH(A332,Jour,0)+1,3))),\"occupé\",\"\")","v":""}]
["MERCREDI",4,"03:20:00",{"$f":"IF(OR(AND(C333>=INDEX(Champ,MATCH(A333,Jour,0),3),C333<=INDEX(Champ,MATCH(A333,Jour,0),4)),AND(C333>=INDEX(Champ,MATCH(A333,Jour,0)+1,4),C333<=INDEX(Champ,MATCH(A333,Jour,0)+1,3))),\"occupé\",\"\")","v":""}]
["MERCREDI",4,"03:30:00",{"$f":"IF(OR(AND(C334>=INDEX(Champ,MATCH(A334,Jour,0),3),C334<=INDEX(Champ,MATCH(A334,Jour,0),4)),AND(C334>=INDEX(Champ,MATCH(A334,Jour,0)+1,4),C334<=INDEX(Champ,MATCH(A334,Jour,0)+1,3))),\"occupé\",\"\")","v":""}]
["MERCREDI",4,"03:40:00",{"$f":"IF(OR(AND(C335>=INDEX(Champ,MATCH(A335,Jour,0),3),C335<=INDEX(Champ,MATCH(A335,Jour,0),4)),AND(C335>=INDEX(Champ,MATCH(A335,Jour,0)+1,4),C335<=INDEX(Champ,MATCH(A335,Jour,0)+1,3))),\"occupé\",\"\")","v":""}]
["MERCREDI",4,"03:50:00",{"$f":"IF(OR(AND(C336>=INDEX(Champ,MATCH(A336,Jour,0),3),C336<=INDEX(Champ,MATCH(A336,Jour,0),4)),AND(C336>=INDEX(Champ,MATCH(A336,Jour,0)+1,4),C336<=INDEX(Champ,MATCH(A336,Jour,0)+1,3))),\"occupé\",\"\")","v":""}]
["MERCREDI",5,"04:00:00",{"$f":"IF(OR(AND(C337>=INDEX(Champ,MATCH(A337,Jour,0),3),C337<=INDEX(Champ,MATCH(A337,Jour,0),4)),AND(C337>=INDEX(Champ,MATCH(A337,Jour,0)+1,4),C337<=INDEX(Champ,MATCH(A337,Jour,0)+1,3))),\"occupé\",\"\")","v":""}]
["MERCREDI",5,"04:10:00",{"$f":"IF(OR(AND(C338>=INDEX(Champ,MATCH(A338,Jour,0),3),C338<=INDEX(Champ,MATCH(A338,Jour,0),4)),AND(C338>=INDEX(Champ,MATCH(A338,Jour,0)+1,4),C338<=INDEX(Champ,MATCH(A338,Jour,0)+1,3))),\"occupé\",\"\")","v":""}]
["MERCREDI",5,"04:20:00",{"$f":"IF(OR(AND(C339>=INDEX(Champ,MATCH(A339,Jour,0),3),C339<=INDEX(Champ,MATCH(A339,Jour,0),4)),AND(C339>=INDEX(Champ,MATCH(A339,Jour,0)+1,4),C339<=INDEX(Champ,MATCH(A339,Jour,0)+1,3))),\"occupé\",\"\")","v":""}]
["MERCREDI",5,"04:30:00",{"$f":"IF(OR(AND(C340>=INDEX(Champ,MATCH(A340,Jour,0),3),C340<=INDEX(Champ,MATCH(A340,Jour,0),4)),AND(C340>=INDEX(Champ,MATCH(A340,Jour,0)+1,4),C340<=INDEX(Champ,MATCH(A340,Jour,0)+1,3))),\"occupé\",\"\")","v":""}]
["MERCREDI",5,"04:40:00",{"$f":"IF(OR(AND(C341>=INDEX(Champ,MATCH(A341,Jour,0),3),C341<=INDEX(Champ,MATCH(A341,Jour,0),4)),AND(C341>=INDEX(Champ,MATCH(A341,Jour,0)+1,4),C341<=INDEX(Champ,MATCH(A341,Jour,0)+1,3))),\"occupé\",\"\")","v":""}]
["MERCREDI",5,"04:50:00",{"$f":"IF(OR(AND(C342>=INDEX(Champ,MATCH(A342,Jour,0),3),C342<=INDEX(Champ,MATCH(A342,Jour,0),4)),AND(C342>=INDEX(Champ,MATCH(A342,Jour,0)+1,4),C342<=INDEX(Champ,MATCH(A342,Jour,0)+1,3))),\"occupé\",\"\")","v":""}]
["MERCREDI",6,"05:00:00",{"$f":"IF(OR(AND(C343>=INDEX(Champ,MATCH(A343,Jour,0),3),C343<=INDEX(Champ,MATCH(A343,Jour,0),4)),AND(C343>=INDEX(Champ,MATCH(A343,Jour,0)+1,4),C343<=INDEX(Champ,MATCH(A343,Jour,0)+1,3))),\"occupé\",\"\")","v":""}]
["MERCREDI",6,"05:10:00",{"$f":"IF(OR(AND(C344>=INDEX(Champ,MATCH(A344,Jour,0),3),C344<=INDEX(Champ,MATCH(A344,Jour,0),4)),AND(C344>=INDEX(Champ,MATCH(A344,Jour,0)+1,4),C344<=INDEX(Champ,MATCH(A344,Jour,0)+1,3))),\"occupé\",\"\")","v":""}]
["MERCREDI",6,"05:20:00",{"$f":"IF(OR(AND(C345>=INDEX(Champ,MATCH(A345,Jour,0),3),C345<=INDEX(Champ,MATCH(A345,Jour,0),4)),AND(C345>=INDEX(Champ,MATCH(A345,Jour,0)+1,4),C345<=INDEX(Champ,MATCH(A345,Jour,0)+1,3))),\"occupé\",\"\")","v":""}]
["MERCREDI",6,"05:30:00",{"$f":"IF(OR(AND(C346>=INDEX(Champ,MATCH(A346,Jour,0),3),C346<=INDEX(Champ,MATCH(A346,Jour,0),4)),AND(C346>=INDEX(Champ,MATCH(A346,Jour,0)+1,4),C346<=INDEX(Champ,MATCH(A346,Jour,0)+1,3))),\"occupé\",\"\")","v":""}]
["MERCREDI",6,"05:40:00",{"$f":"IF(OR(AND(C347>=INDEX(Champ,MATCH(A347,Jour,0),3),C347<=INDEX(Champ,MATCH(A347,Jour,0),4)),AND(C347>=INDEX(Champ,MATCH(A347,Jour,0)+1,4),C347<=INDEX(Champ,MATCH(A347,Jour,0)+1,3))),\"occupé\",\"\")","v":""}]
["MERCREDI",6,"05:50:00",{"$f":"IF(OR(AND(C348>=INDEX(Champ,MATCH(A348,Jour,0),3),C348<=INDEX(Champ,MATCH(A348,Jour,0),4)),AND(C348>=INDEX(Champ,MATCH(A348,Jour,0)+1,4),C348<=INDEX(Champ,MATCH(A348,Jour,0)+1,3))),\"occupé\",\"\")","v":""}]
["MERCREDI",7,"06:00:00",{"$f":"IF(OR(AND(C349>=INDEX(Champ,MATCH(A349,Jour,0),3),C349<=INDEX(Champ,MATCH(A349,Jour,0),4)),AND(C349>=INDEX(Champ,MATCH(A349,Jour,0)+1,4),C349<=INDEX(Champ,MATCH(A349,Jour,0)+1,3))),\"occupé\",\"\")","v":""}]
["MERCREDI",7,"06:10:00",{"$f":"IF(OR(AND(C350>=INDEX(Champ,MATCH(A350,Jour,0),3),C350<=INDEX(Champ,MATCH(A350,Jour,0),4)),AND(C350>=INDEX(Champ,MATCH(A350,Jour,0)+1,4),C350<=INDEX(Champ,MATCH(A350,Jour,0)+1,3))),\"occupé\",\"\")","v":""}]
["MERCREDI",7,"06:20:00",{"$f":"IF(OR(AND(C351>=INDEX(Champ,MATCH(A351,Jour,0),3),C351<=INDEX(Champ,MATCH(A351,Jour,0),4)),AND(C351>=INDEX(Champ,MATCH(A351,Jour,0)+1,4),C351<=INDEX(Champ,MATCH(A351,Jour,0)+1,3))),\"occupé\",\"\")","v":""}]
["MERCREDI",7,"06:30:00",{"$f":"IF(OR(AND(C352>=INDEX(Champ,MATCH(A352,Jour,0),3),C352<=INDEX(Champ,MATCH(A352,Jour,0),4)),AND(C352>=INDEX(Champ,MATCH(A352,Jour,0)+1,4),C352<=INDEX(Champ,MATCH(A352,Jour,0)+1,3))),\"occupé\",\"\")","v":""}]
["MERCREDI",7,"06:40:00",{"$f":"IF(OR(AND(C353>=INDEX(Champ,MATCH(A353,Jour,0),3),C353<=INDEX(Champ,MATCH(A353,Jour,0),4)),AND(C353>=INDEX(Champ,MATCH(A353,Jour,0)+1,4),C353<=INDEX(Champ,MATCH(A353,Jour,0)+1,3))),\"occupé\",\"\")","v":""}]
["MERCREDI",7,"06:50:00",{"$f":"IF(OR(AND(C354>=INDEX(Champ,MATCH(A354,Jour,0),3),C354<=INDEX(Champ,MATCH(A354,Jour,0),4)),AND(C354>=INDEX(Champ,MATCH(A354,Jour,0)+1,4),C354<=INDEX(Champ,MATCH(A354,Jour,0)+1,3))),\"occupé\",\"\")","v":""}]
["MERCREDI",8,"07:00:00",{"$f":"IF(OR(AND(C355>=INDEX(Champ,MATCH(A355,Jour,0),3),C355<=INDEX(Champ,MATCH(A355,Jour,0),4)),AND(C355>=INDEX(Champ,MATCH(A355,Jour,0)+1,4),C355<=INDEX(Champ,MATCH(A355,Jour,0)+1,3))),\"occupé\",\"\")","v":""}]
["MERCREDI",8,"07:10:00",{"$f":"IF(OR(AND(C356>=INDEX(Champ,MATCH(A356,Jour,0),3),C356<=INDEX(Champ,MATCH(A356,Jour,0),4)),AND(C356>=INDEX(Champ,MATCH(A356,Jour,0)+1,4),C356<=INDEX(Champ,MATCH(A356,Jour,0)+1,3))),\"occupé\",\"\")","v":""}]
["MERCREDI",8,"07:20:00",{"$f":"IF(OR(AND(C357>=INDEX(Champ,MATCH(A357,Jour,0),3),C357<=INDEX(Champ,MATCH(A357,Jour,0),4)),AND(C357>=INDEX(Champ,MATCH(A357,Jour,0)+1,4),C357<=INDEX(Champ,MATCH(A357,Jour,0)+1,3))),\"occupé\",\"\")","v":""}]
["MERCREDI",8,"07:30:00",{"$f":"IF(OR(AND(C358>=INDEX(Champ,MATCH(A358,Jour,0),3),C358<=INDEX(Champ,MATCH(A358,Jour,0),4)),AND(C358>=INDEX(Champ,MATCH(A358,Jour,0)+1,4),C358<=INDEX(Champ,MATCH(A358,Jour,0)+1,3))),\"occupé\",\"\")","v":""}]
["MERCREDI",8,"07:40:00",{"$f":"IF(OR(AND(C359>=INDEX(Champ,MATCH(A359,Jour,0),3),C359<=INDEX(Champ,MATCH(A359,Jour,0),4)),AND(C359>=INDEX(Champ,MATCH(A359,Jour,0)+1,4),C359<=INDEX(Champ,MATCH(A359,Jour,0)+1,3))),\"occupé\",\"\")","v":""}]
["MERCREDI",8,"07:50:00",{"$f":"IF(OR(AND(C360>=INDEX(Champ,MATCH(A360,Jour,0),3),C360<=INDEX(Champ,MATCH(A360,Jour,0),4)),AND(C360>=INDEX(Champ,MATCH(A360,Jour,0)+1,4),C360<=INDEX(Champ,MATCH(A360,Jour,0)+1,3))),\"occupé\",\"\")","v":""}]
["MERCREDI",9,"08:00:00",{"$f":"IF(OR(AND(C361>=INDEX(Champ,MATCH(A361,Jour,0),3),C361<=INDEX(Champ,MATCH(A361,Jour,0),4)),AND(C361>=INDEX(Champ,MATCH(A361,Jour,0)+1,4),C361<=INDEX(Champ,MATCH(A361,Jour,0)+1,3))),\"occupé\",\"\")","v":""}]
["MERCREDI",9,"08:10:00",{"$f":"IF(OR(AND(C362>=INDEX(Champ,MATCH(A362,Jour,0),3),C362<=INDEX(Champ,MATCH(A362,Jour,0),4)),AND(C362>=INDEX(Champ,MATCH(A362,Jour,0)+1,4),C362<=INDEX(Champ,MATCH(A362,Jour,0)+1,3))),\"occupé\",\"\")","v":""}]
["MERCREDI",9,"08:20:00",{"$f":"IF(OR(AND(C363>=INDEX(Champ,MATCH(A363,Jour,0),3),C363<=INDEX(Champ,MATCH(A363,Jour,0),4)),AND(C363>=INDEX(Champ,MATCH(A363,Jour,0)+1,4),C363<=INDEX(Champ,MATCH(A363,Jour,0)+1,3))),\"occupé\",\"\")","v":""}]
["MERCREDI",9,"08:30:00",{"$f":"IF(OR(AND(C364>=INDEX(Champ,MATCH(A364,Jour,0),3),C364<=INDEX(Champ,MATCH(A364,Jour,0),4)),AND(C364>=INDEX(Champ,MATCH(A364,Jour,0)+1,4),C364<=INDEX(Champ,MATCH(A364,Jour,0)+1,3))),\"occupé\",\"\")","v":""}]
["MERCREDI",9,"08:40:00",{"$f":"IF(OR(AND(C365>=INDEX(Champ,MATCH(A365,Jour,0),3),C365<=INDEX(Champ,MATCH(A365,Jour,0),4)),AND(C365>=INDEX(Champ,MATCH(A365,Jour,0)+1,4),C365<=INDEX(Champ,MATCH(A365,Jour,0)+1,3))),\"occupé\",\"\")","v":""}]
["MERCREDI",9,"08:50:00",{"$f":"IF(OR(AND(C366>=INDEX(Champ,MATCH(A366,Jour,0),3),C366<=INDEX(Champ,MATCH(A366,Jour,0),4)),AND(C366>=INDEX(Champ,MATCH(A366,Jour,0)+1,4),C366<=INDEX(Champ,MATCH(A366,Jour,0)+1,3))),\"occupé\",\"\")","v":""}]
["MERCREDI",10,"09:00:00",{"$f":"IF(OR(AND(C367>=INDEX(Champ,MATCH(A367,Jour,0),3),C367<=INDEX(Champ,MATCH(A367,Jour,0),4)),AND(C367>=INDEX(Champ,MATCH(A367,Jour,0)+1,4),C367<=INDEX(Champ,MATCH(A367,Jour,0)+1,3))),\"occupé\",\"\")","v":""}]
["MERCREDI",10,"09:10:00",{"$f":"IF(OR(AND(C368>=INDEX(Champ,MATCH(A368,Jour,0),3),C368<=INDEX(Champ,MATCH(A368,Jour,0),4)),AND(C368>=INDEX(Champ,MATCH(A368,Jour,0)+1,4),C368<=INDEX(Champ,MATCH(A368,Jour,0)+1,3))),\"occupé\",\"\")","v":""}]
["MERCREDI",10,"09:20:00",{"$f":"IF(OR(AND(C369>=INDEX(Champ,MATCH(A369,Jour,0),3),C369<=INDEX(Champ,MATCH(A369,Jour,0),4)),AND(C369>=INDEX(Champ,MATCH(A369,Jour,0)+1,4),C369<=INDEX(Champ,MATCH(A369,Jour,0)+1,3))),\"occupé\",\"\")","v":""}]
["MERCREDI",10,"09:30:00",{"$f":"IF(OR(AND(C370>=INDEX(Champ,MATCH(A370,Jour,0),3),C370<=INDEX(Champ,MATCH(A370,Jour,0),4)),AND(C370>=INDEX(Champ,MATCH(A370,Jour,0)+1,4),C370<=INDEX(Champ,MATCH(A370,Jour,0)+1,3))),\"occupé\",\"\")","v":""}]
["MERCREDI",10,"09:40:00",{"$f":"IF(OR(AND(C371>=INDEX(Champ,MATCH(A371,Jour,0),3),C371<=INDEX(Champ,MATCH(A371,Jour,0),4)),AND(C371>=INDEX(Champ,MATCH(A371,Jour,0)+1,4),C371<=INDEX(Champ,MATCH(A371,Jour,0)+1,3))),\"occupé\",\"\")","v":""}]
["MERCREDI",10,"09:50:00",{"$f":"IF(OR(AND(C372>=INDEX(Champ,MATCH(A372,Jour,0),3),C372<=INDEX(Champ,MATCH(A372,Jour,0),4)),AND(C372>=INDEX(Champ,MATCH(A372,Jour,0)+1,4),C372<=INDEX(Champ,MATCH(A372,Jour,0)+1,3))),\"occupé\",\"\")","v":""}]
["MERCREDI",11,"10:00:00",{"$f":"IF(OR(AND(C373>=INDEX(Champ,MATCH(A373,Jour,0),3),C373<=INDEX(Champ,MATCH(A373,Jour,0),4)),AND(C373>=INDEX(Champ,MATCH(A373,Jour,0)+1,4),C373<=INDEX(Champ,MATCH(A373,Jour,0)+1,3))),\"occupé\",\"\")","v":""}]
["MERCREDI",11,"10:10:00",{"$f":"IF(OR(AND(C374>=INDEX(Champ,MATCH(A374,Jour,0),3),C374<=INDEX(Champ,MATCH(A374,Jour,0),4)),AND(C374>=INDEX(Champ,MATCH(A374,Jour,0)+1,4),C374<=INDEX(Champ,MATCH(A374,Jour,0)+1,3))),\"occupé\",\"\")","v":""}]
["MERCREDI",11,"10:20:00",{"$f":"IF(OR(AND(C375>=INDEX(Champ,MATCH(A375,Jour,0),3),C375<=INDEX(Champ,MATCH(A375,Jour,0),4)),AND(C375>=INDEX(Champ,MATCH(A375,Jour,0)+1,4),C375<=INDEX(Champ,MATCH(A375,Jour,0)+1,3))),\"occupé\",\"\")","v":""}]
["MERCREDI",11,"10:30:00",{"$f":"IF(OR(AND(C376>=INDEX(Champ,MATCH(A376,Jour,0),3),C376<=INDEX(Champ,MATCH(A376,Jour,0),4)),AND(C376>=INDEX(Champ,MATCH(A376,Jour,0)+1,4),C376<=INDEX(Champ,MATCH(A376,Jour,0)+1,3))),\"occupé\",\"\")","v":""}]
["MERCREDI",11,"10:40:00",{"$f":"IF(OR(AND(C377>=INDEX(Champ,MATCH(A377,Jour,0),3),C377<=INDEX(Champ,MATCH(A377,Jour,0),4)),AND(C377>=INDEX(Champ,MATCH(A377,Jour,0)+1,4),C377<=INDEX(Champ,MATCH(A377,Jour,0)+1,3))),\"occupé\",\"\")","v":""}]
["MERCREDI",11,"10:50:00",{"$f":"IF(OR(AND(C378>=INDEX(Champ,MATCH(A378,Jour,0),3),C378<=INDEX(Champ,MATCH(A378,Jour,0),4)),AND(C378>=INDEX(Champ,MATCH(A378,Jour,0)+1,4),C378<=INDEX(Champ,MATCH(A378,Jour,0)+1,3))),\"occupé\",\"\")","v":""}]
["MERCREDI",12,"11:00:00",{"$f":"IF(OR(AND(C379>=INDEX(Champ,MATCH(A379,Jour,0),3),C379<=INDEX(Champ,MATCH(A379,Jour,0),4)),AND(C379>=INDEX(Champ,MATCH(A379,Jour,0)+1,4),C379<=INDEX(Champ,MATCH(A379,Jour,0)+1,3))),\"occupé\",\"\")","v":""}]
["MERCREDI",12,"11:10:00",{"$f":"IF(OR(AND(C380>=INDEX(Champ,MATCH(A380,Jour,0),3),C380<=INDEX(Champ,MATCH(A380,Jour,0),4)),AND(C380>=INDEX(Champ,MATCH(A380,Jour,0)+1,4),C380<=INDEX(Champ,MATCH(A380,Jour,0)+1,3))),\"occupé\",\"\")","v":""}]
["MERCREDI",12,"11:20:00",{"$f":"IF(OR(AND(C381>=INDEX(Champ,MATCH(A381,Jour,0),3),C381<=INDEX(Champ,MATCH(A381,Jour,0),4)),AND(C381>=INDEX(Champ,MATCH(A381,Jour,0)+1,4),C381<=INDEX(Champ,MATCH(A381,Jour,0)+1,3))),\"occupé\",\"\")","v":""}]
["MERCREDI",12,"11:30:00",{"$f":"IF(OR(AND(C382>=INDEX(Champ,MATCH(A382,Jour,0),3),C382<=INDEX(Champ,MATCH(A382,Jour,0),4)),AND(C382>=INDEX(Champ,MATCH(A382,Jour,0)+1,4),C382<=INDEX(Champ,MATCH(A382,Jour,0)+1,3))),\"occupé\",\"\")","v":""}]
["MERCREDI",12,"11:40:00",{"$f":"IF(OR(AND(C383>=INDEX(Champ,MATCH(A383,Jour,0),3),C383<=INDEX(Champ,MATCH(A383,Jour,0),4)),AND(C383>=INDEX(Champ,MATCH(A383,Jour,0)+1,4),C383<=INDEX(Champ,MATCH(A383,Jour,0)+1,3))),\"occupé\",\"\")","v":""}]
["MERCREDI",12,"11:50:00",{"$f":"IF(OR(AND(C384>=INDEX(Champ,MATCH(A384,Jour,0),3),C384<=INDEX(Champ,MATCH(A384,Jour,0),4)),AND(C384>=INDEX(Champ,MATCH(A384,Jour,0)+1,4),C384<=INDEX(Champ,MATCH(A384,Jour,0)+1,3))),\"occupé\",\"\")","v":""}]
["MERCREDI",13,"12:00:00",{"$f":"IF(OR(AND(C385>=INDEX(Champ,MATCH(A385,Jour,0),3),C385<=INDEX(Champ,MATCH(A385,Jour,0),4)),AND(C385>=INDEX(Champ,MATCH(A385,Jour,0)+1,4),C385<=INDEX(Champ,MATCH(A385,Jour,0)+1,3))),\"occupé\",\"\")","v":"occupé"}]
["MERCREDI",13,"12:10:00",{"$f":"IF(OR(AND(C386>=INDEX(Champ,MATCH(A386,Jour,0),3),C386<=INDEX(Champ,MATCH(A386,Jour,0),4)),AND(C386>=INDEX(Champ,MATCH(A386,Jour,0)+1,4),C386<=INDEX(Champ,MATCH(A386,Jour,0)+1,3))),\"occupé\",\"\")","v":""}]
["MERCREDI",13,"12:20:00",{"$f":"IF(OR(AND(C387>=INDEX(Champ,MATCH(A387,Jour,0),3),C387<=INDEX(Champ,MATCH(A387,Jour,0),4)),AND(C387>=INDEX(Champ,MATCH(A387,Jour,0)+1,4),C387<=INDEX(Champ,MATCH(A387,Jour,0)+1,3))),\"occupé\",\"\")","v":""}]
["MERCREDI",13,"12:30:00",{"$f":"IF(OR(AND(C388>=INDEX(Champ,MATCH(A388,Jour,0),3),C388<=INDEX(Champ,MATCH(A388,Jour,0),4)),AND(C388>=INDEX(Champ,MATCH(A388,Jour,0)+1,4),C388<=INDEX(Champ,MATCH(A388,Jour,0)+1,3))),\"occupé\",\"\")","v":""}]
["MERCREDI",13,"12:40:00",{"$f":"IF(OR(AND(C389>=INDEX(Champ,MATCH(A389,Jour,0),3),C389<=INDEX(Champ,MATCH(A389,Jour,0),4)),AND(C389>=INDEX(Champ,MATCH(A389,Jour,0)+1,4),C389<=INDEX(Champ,MATCH(A389,Jour,0)+1,3))),\"occupé\",\"\")","v":""}]
["MERCREDI",13,"12:50:00",{"$f":"IF(OR(AND(C390>=INDEX(Champ,MATCH(A390,Jour,0),3),C390<=INDEX(Champ,MATCH(A390,Jour,0),4)),AND(C390>=INDEX(Champ,MATCH(A390,Jour,0)+1,4),C390<=INDEX(Champ,MATCH(A390,Jour,0)+1,3))),\"occupé\",\"\")","v":""}]
["MERCREDI",14,"13:00:00",{"$f":"IF(OR(AND(C391>=INDEX(Champ,MATCH(A391,Jour,0),3),C391<=INDEX(Champ,MATCH(A391,Jour,0),4)),AND(C391>=INDEX(Champ,MATCH(A391,Jour,0)+1,4),C391<=INDEX(Champ,MATCH(A391,Jour,0)+1,3))),\"occupé\",\"\")","v":""}]
["MERCREDI",14,"13:10:00",{"$f":"IF(OR(AND(C392>=INDEX(Champ,MATCH(A392,Jour,0),3),C392<=INDEX(Champ,MATCH(A392,Jour,0),4)),AND(C392>=INDEX(Champ,MATCH(A392,Jour,0)+1,4),C392<=INDEX(Champ,MATCH(A392,Jour,0)+1,3))),\"occupé\",\"\")","v":""}]
["MERCREDI",14,"13:20:00",{"$f":"IF(OR(AND(C393>=INDEX(Champ,MATCH(A393,Jour,0),3),C393<=INDEX(Champ,MATCH(A393,Jour,0),4)),AND(C393>=INDEX(Champ,MATCH(A393,Jour,0)+1,4),C393<=INDEX(Champ,MATCH(A393,Jour,0)+1,3))),\"occupé\",\"\")","v":""}]
["MERCREDI",14,"13:30:00",{"$f":"IF(OR(AND(C394>=INDEX(Champ,MATCH(A394,Jour,0),3),C394<=INDEX(Champ,MATCH(A394,Jour,0),4)),AND(C394>=INDEX(Champ,MATCH(A394,Jour,0)+1,4),C394<=INDEX(Champ,MATCH(A394,Jour,0)+1,3))),\"occupé\",\"\")","v":""}]
["MERCREDI",14,"13:40:00",{"$f":"IF(OR(AND(C395>=INDEX(Champ,MATCH(A395,Jour,0),3),C395<=INDEX(Champ,MATCH(A395,Jour,0),4)),AND(C395>=INDEX(Champ,MATCH(A395,Jour,0)+1,4),C395<=INDEX(Champ,MATCH(A395,Jour,0)+1,3))),\"occupé\",\"\")","v":""}]
["MERCREDI",14,"13:50:00",{"$f":"IF(OR(AND(C396>=INDEX(Champ,MATCH(A396,Jour,0),3),C396<=INDEX(Champ,MATCH(A396,Jour,0),4)),AND(C396>=INDEX(Champ,MATCH(A396,Jour,0)+1,4),C396<=INDEX(Champ,MATCH(A396,Jour,0)+1,3))),\"occupé\",\"\")","v":""}]
["MERCREDI",15,"14:00:00",{"$f":"IF(OR(AND(C397>=INDEX(Champ,MATCH(A397,Jour,0),3),C397<=INDEX(Champ,MATCH(A397,Jour,0),4)),AND(C397>=INDEX(Champ,MATCH(A397,Jour,0)+1,4),C397<=INDEX(Champ,MATCH(A397,Jour,0)+1,3))),\"occupé\",\"\")","v":""}]
["MERCREDI",15,"14:10:00",{"$f":"IF(OR(AND(C398>=INDEX(Champ,MATCH(A398,Jour,0),3),C398<=INDEX(Champ,MATCH(A398,Jour,0),4)),AND(C398>=INDEX(Champ,MATCH(A398,Jour,0)+1,4),C398<=INDEX(Champ,MATCH(A398,Jour,0)+1,3))),\"occupé\",\"\")","v":""}]
["MERCREDI",15,"14:20:00",{"$f":"IF(OR(AND(C399>=INDEX(Champ,MATCH(A399,Jour,0),3),C399<=INDEX(Champ,MATCH(A399,Jour,0),4)),AND(C399>=INDEX(Champ,MATCH(A399,Jour,0)+1,4),C399<=INDEX(Champ,MATCH(A399,Jour,0)+1,3))),\"occupé\",\"\")","v":""}]
["MERCREDI",15,"14:30:00",{"$f":"IF(OR(AND(C400>=INDEX(Champ,MATCH(A400,Jour,0),3),C400<=INDEX(Champ,MATCH(A400,Jour,0),4)),AND(C400>=INDEX(Champ,MATCH(A400,Jour,0)+1,4),C400<=INDEX(Champ,MATCH(A400,Jour,0)+1,3))),\"occupé\",\"\")","v":""}]
["MERCREDI",15,"14:40:00",{"$f":"IF(OR(AND(C401>=INDEX(Champ,MATCH(A401,Jour,0),3),C401<=INDEX(Champ,MATCH(A401,Jour,0),4)),AND(C401>=INDEX(Champ,MATCH(A401,Jour,0)+1,4),C401<=INDEX(Champ,MATCH(A401,Jour,0)+1,3))),\"occupé\",\"\")","v":""}]
["MERCREDI",15,"14:50:00",{"$f":"IF(OR(AND(C402>=INDEX(Champ,MATCH(A402,Jour,0),3),C402<=INDEX(Champ,MATCH(A402,Jour,0),4)),AND(C402>=INDEX(Champ,MATCH(A402,Jour,0)+1,4),C402<=INDEX(Champ,MATCH(A402,Jour,0)+1,3))),\"occupé\",\"\")","v":""}]
["MERCREDI",16,"15:00:00",{"$f":"IF(OR(AND(C403>=INDEX(Champ,MATCH(A403,Jour,0),3),C403<=INDEX(Champ,MATCH(A403,Jour,0),4)),AND(C403>=INDEX(Champ,MATCH(A403,Jour,0)+1,4),C403<=INDEX(Champ,MATCH(A403,Jour,0)+1,3))),\"occupé\",\"\")","v":""}]
["MERCREDI",16,"15:10:00",{"$f":"IF(OR(AND(C404>=INDEX(Champ,MATCH(A404,Jour,0),3),C404<=INDEX(Champ,MATCH(A404,Jour,0),4)),AND(C404>=INDEX(Champ,MATCH(A404,Jour,0)+1,4),C404<=INDEX(Champ,MATCH(A404,Jour,0)+1,3))),\"occupé\",\"\")","v":""}]
["MERCREDI",16,"15:20:00",{"$f":"IF(OR(AND(C405>=INDEX(Champ,MATCH(A405,Jour,0),3),C405<=INDEX(Champ,MATCH(A405,Jour,0),4)),AND(C405>=INDEX(Champ,MATCH(A405,Jour,0)+1,4),C405<=INDEX(Champ,MATCH(A405,Jour,0)+1,3))),\"occupé\",\"\")","v":""}]
["MERCREDI",16,"15:30:00",{"$f":"IF(OR(AND(C406>=INDEX(Champ,MATCH(A406,Jour,0),3),C406<=INDEX(Champ,MATCH(A406,Jour,0),4)),AND(C406>=INDEX(Champ,MATCH(A406,Jour,0)+1,4),C406<=INDEX(Champ,MATCH(A406,Jour,0)+1,3))),\"occupé\",\"\")","v":""}]
["MERCREDI",16,"15:40:00",{"$f":"IF(OR(AND(C407>=INDEX(Champ,MATCH(A407,Jour,0),3),C407<=INDEX(Champ,MATCH(A407,Jour,0),4)),AND(C407>=INDEX(Champ,MATCH(A407,Jour,0)+1,4),C407<=INDEX(Champ,MATCH(A407,Jour,0)+1,3))),\"occupé\",\"\")","v":""}]
["MERCREDI",16,"15:50:00",{"$f":"IF(OR(AND(C408>=INDEX(Champ,MATCH(A408,Jour,0),3),C408<=INDEX(Champ,MATCH(A408,Jour,0),4)),AND(C408>=INDEX(Champ,MATCH(A408,Jour,0)+1,4),C408<=INDEX(Champ,MATCH(A408,Jour,0)+1,3))),\"occupé\",\"\")","v":""}]
["MERCREDI",17,"16:00:00",{"$f":"IF(OR(AND(C409>=INDEX(Champ,MATCH(A409,Jour,0),3),C409<=INDEX(Champ,MATCH(A409,Jour,0),4)),AND(C409>=INDEX(Champ,MATCH(A409,Jour,0)+1,4),C409<=INDEX(Champ,MATCH(A409,Jour,0)+1,3))),\"occupé\",\"\")","v":""}]
["MERCREDI",17,"16:10:00",{"$f":"IF(OR(AND(C410>=INDEX(Champ,MATCH(A410,Jour,0),3),C410<=INDEX(Champ,MATCH(A410,Jour,0),4)),AND(C410>=INDEX(Champ,MATCH(A410,Jour,0)+1,4),C410<=INDEX(Champ,MATCH(A410,Jour,0)+1,3))),\"occupé\",\"\")","v":""}]
["MERCREDI",17,"16:20:00",{"$f":"IF(OR(AND(C411>=INDEX(Champ,MATCH(A411,Jour,0),3),C411<=INDEX(Champ,MATCH(A411,Jour,0),4)),AND(C411>=INDEX(Champ,MATCH(A411,Jour,0)+1,4),C411<=INDEX(Champ,MATCH(A411,Jour,0)+1,3))),\"occupé\",\"\")","v":""}]
["MERCREDI",17,"16:30:00",{"$f":"IF(OR(AND(C412>=INDEX(Champ,MATCH(A412,Jour,0),3),C412<=INDEX(Champ,MATCH(A412,Jour,0),4)),AND(C412>=INDEX(Champ,MATCH(A412,Jour,0)+1,4),C412<=INDEX(Champ,MATCH(A412,Jour,0)+1,3))),\"occupé\",\"\")","v":""}]
["MERCREDI",17,"16:40:00",{"$f":"IF(OR(AND(C413>=INDEX(Champ,MATCH(A413,Jour,0),3),C413<=INDEX(Champ,MATCH(A413,Jour,0),4)),AND(C413>=INDEX(Champ,MATCH(A413,Jour,0)+1,4),C413<=INDEX(Champ,MATCH(A413,Jour,0)+1,3))),\"occupé\",\"\")","v":""}]
["MERCREDI",17,"16:50:00",{"$f":"IF(OR(AND(C414>=INDEX(Champ,MATCH(A414,Jour,0),3),C414<=INDEX(Champ,MATCH(A414,Jour,0),4)),AND(C414>=INDEX(Champ,MATCH(A414,Jour,0)+1,4),C414<=INDEX(Champ,MATCH(A414,Jour,0)+1,3))),\"occupé\",\"\")","v":""}]
["MERCREDI",18,"17:00:00",{"$f":"IF(OR(AND(C415>=INDEX(Champ,MATCH(A415,Jour,0),3),C415<=INDEX(Champ,MATCH(A415,Jour,0),4)),AND(C415>=INDEX(Champ,MATCH(A415,Jour,0)+1,4),C415<=INDEX(Champ,MATCH(A415,Jour,0)+1,3))),\"occupé\",\"\")","v":""}]
["MERCREDI",18,"17:10:00",{"$f":"IF(OR(AND(C416>=INDEX(Champ,MATCH(A416,Jour,0),3),C416<=INDEX(Champ,MATCH(A416,Jour,0),4)),AND(C416>=INDEX(Champ,MATCH(A416,Jour,0)+1,4),C416<=INDEX(Champ,MATCH(A416,Jour,0)+1,3))),\"occupé\",\"\")","v":""}]
["MERCREDI",18,"17:20:00",{"$f":"IF(OR(AND(C417>=INDEX(Champ,MATCH(A417,Jour,0),3),C417<=INDEX(Champ,MATCH(A417,Jour,0),4)),AND(C417>=INDEX(Champ,MATCH(A417,Jour,0)+1,4),C417<=INDEX(Champ,MATCH(A417,Jour,0)+1,3))),\"occupé\",\"\")","v":""}]
["MERCREDI",18,"17:30:00",{"$f":"IF(OR(AND(C418>=INDEX(Champ,MATCH(A418,Jour,0),3),C418<=INDEX(Champ,MATCH(A418,Jour,0),4)),AND(C418>=INDEX(Champ,MATCH(A418,Jour,0)+1,4),C418<=INDEX(Champ,MATCH(A418,Jour,0)+1,3))),\"occupé\",\"\")","v":""}]
["MERCREDI",18,"17:40:00",{"$f":"IF(OR(AND(C419>=INDEX(Champ,MATCH(A419,Jour,0),3),C419<=INDEX(Champ,MATCH(A419,Jour,0),4)),AND(C419>=INDEX(Champ,MATCH(A419,Jour,0)+1,4),C419<=INDEX(Champ,MATCH(A419,Jour,0)+1,3))),\"occupé\",\"\")","v":""}]
["MERCREDI",18,"17:50:00",{"$f":"IF(OR(AND(C420>=INDEX(Champ,MATCH(A420,Jour,0),3),C420<=INDEX(Champ,MATCH(A420,Jour,0),4)),AND(C420>=INDEX(Champ,MATCH(A420,Jour,0)+1,4),C420<=INDEX(Champ,MATCH(A420,Jour,0)+1,3))),\"occupé\",\"\")","v":""}]
["MERCREDI",19,"18:00:00",{"$f":"IF(OR(AND(C421>=INDEX(Champ,MATCH(A421,Jour,0),3),C421<=INDEX(Champ,MATCH(A421,Jour,0),4)),AND(C421>=INDEX(Champ,MATCH(A421,Jour,0)+1,4),C421<=INDEX(Champ,MATCH(A421,Jour,0)+1,3))),\"occupé\",\"\")","v":""}]
["MERCREDI",19,"18:10:00",{"$f":"IF(OR(AND(C422>=INDEX(Champ,MATCH(A422,Jour,0),3),C422<=INDEX(Champ,MATCH(A422,Jour,0),4)),AND(C422>=INDEX(Champ,MATCH(A422,Jour,0)+1,4),C422<=INDEX(Champ,MATCH(A422,Jour,0)+1,3))),\"occupé\",\"\")","v":""}]
["MERCREDI",19,"18:20:00",{"$f":"IF(OR(AND(C423>=INDEX(Champ,MATCH(A423,Jour,0),3),C423<=INDEX(Champ,MATCH(A423,Jour,0),4)),AND(C423>=INDEX(Champ,MATCH(A423,Jour,0)+1,4),C423<=INDEX(Champ,MATCH(A423,Jour,0)+1,3))),\"occupé\",\"\")","v":""}]
["MERCREDI",19,"18:30:00",{"$f":"IF(OR(AND(C424>=INDEX(Champ,MATCH(A424,Jour,0),3),C424<=INDEX(Champ,MATCH(A424,Jour,0),4)),AND(C424>=INDEX(Champ,MATCH(A424,Jour,0)+1,4),C424<=INDEX(Champ,MATCH(A424,Jour,0)+1,3))),\"occupé\",\"\")","v":""}]
["MERCREDI",19,"18:40:00",{"$f":"IF(OR(AND(C425>=INDEX(Champ,MATCH(A425,Jour,0),3),C425<=INDEX(Champ,MATCH(A425,Jour,0),4)),AND(C425>=INDEX(Champ,MATCH(A425,Jour,0)+1,4),C425<=INDEX(Champ,MATCH(A425,Jour,0)+1,3))),\"occupé\",\"\")","v":""}]
["MERCREDI",19,"18:50:00",{"$f":"IF(OR(AND(C426>=INDEX(Champ,MATCH(A426,Jour,0),3),C426<=INDEX(Champ,MATCH(A426,Jour,0),4)),AND(C426>=INDEX(Champ,MATCH(A426,Jour,0)+1,4),C426<=INDEX(Champ,MATCH(A426,Jour,0)+1,3))),\"occupé\",\"\")","v":""}]
["MERCREDI",20,"19:00:00",{"$f":"IF(OR(AND(C427>=INDEX(Champ,MATCH(A427,Jour,0),3),C427<=INDEX(Champ,MATCH(A427,Jour,0),4)),AND(C427>=INDEX(Champ,MATCH(A427,Jour,0)+1,4),C427<=INDEX(Champ,MATCH(A427,Jour,0)+1,3))),\"occupé\",\"\")","v":""}]
["MERCREDI",20,"19:10:00",{"$f":"IF(OR(AND(C428>=INDEX(Champ,MATCH(A428,Jour,0),3),C428<=INDEX(Champ,MATCH(A428,Jour,0),4)),AND(C428>=INDEX(Champ,MATCH(A428,Jour,0)+1,4),C428<=INDEX(Champ,MATCH(A428,Jour,0)+1,3))),\"occupé\",\"\")","v":""}]
["MERCREDI",20,"19:20:00",{"$f":"IF(OR(AND(C429>=INDEX(Champ,MATCH(A429,Jour,0),3),C429<=INDEX(Champ,MATCH(A429,Jour,0),4)),AND(C429>=INDEX(Champ,MATCH(A429,Jour,0)+1,4),C429<=INDEX(Champ,MATCH(A429,Jour,0)+1,3))),\"occupé\",\"\")","v":""}]
["MERCREDI",20,"19:30:00",{"$f":"IF(OR(AND(C430>=INDEX(Champ,MATCH(A430,Jour,0),3),C430<=INDEX(Champ,MATCH(A430,Jour,0),4)),AND(C430>=INDEX(Champ,MATCH(A430,Jour,0)+1,4),C430<=INDEX(Champ,MATCH(A430,Jour,0)+1,3))),\"occupé\",\"\")","v":""}]
["MERCREDI",20,"19:40:00",{"$f":"IF(OR(AND(C431>=INDEX(Champ,MATCH(A431,Jour,0),3),C431<=INDEX(Champ,MATCH(A431,Jour,0),4)),AND(C431>=INDEX(Champ,MATCH(A431,Jour,0)+1,4),C431<=INDEX(Champ,MATCH(A431,Jour,0)+1,3))),\"occupé\",\"\")","v":""}]
["MERCREDI",20,"19:50:00",{"$f":"IF(OR(AND(C432>=INDEX(Champ,MATCH(A432,Jour,0),3),C432<=INDEX(Champ,MATCH(A432,Jour,0),4)),AND(C432>=INDEX(Champ,MATCH(A432,Jour,0)+1,4),C432<=INDEX(Champ,MATCH(A432,Jour,0)+1,3))),\"occupé\",\"\")","v":""}]
["MERCREDI",21,"20:00:00",{"$f":"IF(OR(AND(C433>=INDEX(Champ,MATCH(A433,Jour,0),3),C433<=INDEX(Champ,MATCH(A433,Jour,0),4)),AND(C433>=INDEX(Champ,MATCH(A433,Jour,0)+1,4),C433<=INDEX(Champ,MATCH(A433,Jour,0)+1,3))),\"occupé\",\"\")","v":""}]
["MERCREDI",21,"20:10:00",{"$f":"IF(OR(AND(C434>=INDEX(Champ,MATCH(A434,Jour,0),3),C434<=INDEX(Champ,MATCH(A434,Jour,0),4)),AND(C434>=INDEX(Champ,MATCH(A434,Jour,0)+1,4),C434<=INDEX(Champ,MATCH(A434,Jour,0)+1,3))),\"occupé\",\"\")","v":""}]
["MERCREDI",21,"20:20:00",{"$f":"IF(OR(AND(C435>=INDEX(Champ,MATCH(A435,Jour,0),3),C435<=INDEX(Champ,MATCH(A435,Jour,0),4)),AND(C435>=INDEX(Champ,MATCH(A435,Jour,0)+1,4),C435<=INDEX(Champ,MATCH(A435,Jour,0)+1,3))),\"occupé\",\"\")","v":""}]
["MERCREDI",21,"20:30:00",{"$f":"IF(OR(AND(C436>=INDEX(Champ,MATCH(A436,Jour,0),3),C436<=INDEX(Champ,MATCH(A436,Jour,0),4)),AND(C436>=INDEX(Champ,MATCH(A436,Jour,0)+1,4),C436<=INDEX(Champ,MATCH(A436,Jour,0)+1,3))),\"occupé\",\"\")","v":""}]
["MERCREDI",21,"20:40:00",{"$f":"IF(OR(AND(C437>=INDEX(Champ,MATCH(A437,Jour,0),3),C437<=INDEX(Champ,MATCH(A437,Jour,0),4)),AND(C437>=INDEX(Champ,MATCH(A437,Jour,0)+1,4),C437<=INDEX(Champ,MATCH(A437,Jour,0)+1,3))),\"occupé\",\"\")","v":""}]
["MERCREDI",21,"20:50:00",{"$f":"IF(OR(AND(C438>=INDEX(Champ,MATCH(A438,Jour,0),3),C438<=INDEX(Champ,MATCH(A438,Jour,0),4)),AND(C438>=INDEX(Champ,MATCH(A438,Jour,0)+1,4),C438<=INDEX(Champ,MATCH(A438,Jour,0)+1,3))),\"occupé\",\"\")","v":""}]
["MERCREDI",22,"21:00:00",{"$f":"IF(OR(AND(C439>=INDEX(Champ,MATCH(A439,Jour,0),3),C439<=INDEX(Champ,MATCH(A439,Jour,0),4)),AND(C439>=INDEX(Champ,MATCH(A439,Jour,0)+1,4),C439<=INDEX(Champ,MATCH(A439,Jour,0)+1,3))),\"occupé\",\"\")","v":""}]
["MERCREDI",22,"21:10:00",{"$f":"IF(OR(AND(C440>=INDEX(Champ,MATCH(A440,Jour,0),3),C440<=INDEX(Champ,MATCH(A440,Jour,0),4)),AND(C440>=INDEX(Champ,MATCH(A440,Jour,0)+1,4),C440<=INDEX(Champ,MATCH(A440,Jour,0)+1,3))),\"occupé\",\"\")","v":""}]
["MERCREDI",22,"21:20:00",{"$f":"IF(OR(AND(C441>=INDEX(Champ,MATCH(A441,Jour,0),3),C441<=INDEX(Champ,MATCH(A441,Jour,0),4)),AND(C441>=INDEX(Champ,MATCH(A441,Jour,0)+1,4),C441<=INDEX(Champ,MATCH(A441,Jour,0)+1,3))),\"occupé\",\"\")","v":""}]
["MERCREDI",22,"21:30:00",{"$f":"IF(OR(AND(C442>=INDEX(Champ,MATCH(A442,Jour,0),3),C442<=INDEX(Champ,MATCH(A442,Jour,0),4)),AND(C442>=INDEX(Champ,MATCH(A442,Jour,0)+1,4),C442<=INDEX(Champ,MATCH(A442,Jour,0)+1,3))),\"occupé\",\"\")","v":""}]
["MERCREDI",22,"21:40:00",{"$f":"IF(OR(AND(C443>=INDEX(Champ,MATCH(A443,Jour,0),3),C443<=INDEX(Champ,MATCH(A443,Jour,0),4)),AND(C443>=INDEX(Champ,MATCH(A443,Jour,0)+1,4),C443<=INDEX(Champ,MATCH(A443,Jour,0)+1,3))),\"occupé\",\"\")","v":""}]
["MERCREDI",22,"21:50:00",{"$f":"IF(OR(AND(C444>=INDEX(Champ,MATCH(A444,Jour,0),3),C444<=INDEX(Champ,MATCH(A444,Jour,0),4)),AND(C444>=INDEX(Champ,MATCH(A444,Jour,0)+1,4),C444<=INDEX(Champ,MATCH(A444,Jour,0)+1,3))),\"occupé\",\"\")","v":""}]
["MERCREDI",23,"22:00:00",{"$f":"IF(OR(AND(C445>=INDEX(Champ,MATCH(A445,Jour,0),3),C445<=INDEX(Champ,MATCH(A445,Jour,0),4)),AND(C445>=INDEX(Champ,MATCH(A445,Jour,0)+1,4),C445<=INDEX(Champ,MATCH(A445,Jour,0)+1,3))),\"occupé\",\"\")","v":""}]
["MERCREDI",23,"22:10:00",{"$f":"IF(OR(AND(C446>=INDEX(Champ,MATCH(A446,Jour,0),3),C446<=INDEX(Champ,MATCH(A446,Jour,0),4)),AND(C446>=INDEX(Champ,MATCH(A446,Jour,0)+1,4),C446<=INDEX(Champ,MATCH(A446,Jour,0)+1,3))),\"occupé\",\"\")","v":""}]
["MERCREDI",23,"22:20:00",{"$f":"IF(OR(AND(C447>=INDEX(Champ,MATCH(A447,Jour,0),3),C447<=INDEX(Champ,MATCH(A447,Jour,0),4)),AND(C447>=INDEX(Champ,MATCH(A447,Jour,0)+1,4),C447<=INDEX(Champ,MATCH(A447,Jour,0)+1,3))),\"occupé\",\"\")","v":""}]
["MERCREDI",23,"22:30:00",{"$f":"IF(OR(AND(C448>=INDEX(Champ,MATCH(A448,Jour,0),3),C448<=INDEX(Champ,MATCH(A448,Jour,0),4)),AND(C448>=INDEX(Champ,MATCH(A448,Jour,0)+1,4),C448<=INDEX(Champ,MATCH(A448,Jour,0)+1,3))),\"occupé\",\"\")","v":""}]
["MERCREDI",23,"22:40:00",{"$f":"IF(OR(AND(C449>=INDEX(Champ,MATCH(A449,Jour,0),3),C449<=INDEX(Champ,MATCH(A449,Jour,0),4)),AND(C449>=INDEX(Champ,MATCH(A449,Jour,0)+1,4),C449<=INDEX(Champ,MATCH(A449,Jour,0)+1,3))),\"occupé\",\"\")","v":""}]
["MERCREDI",23,"22:50:00",{"$f":"IF(OR(AND(C450>=INDEX(Champ,MATCH(A450,Jour,0),3),C450<=INDEX(Champ,MATCH(A450,Jour,0),4)),AND(C450>=INDEX(Champ,MATCH(A450,Jour,0)+1,4),C450<=INDEX(Champ,MATCH(A450,Jour,0)+1,3))),\"occupé\",\"\")","v":""}]
["MERCREDI",24,"23:00:00",{"$f":"IF(OR(AND(C451>=INDEX(Champ,MATCH(A451,Jour,0),3),C451<=INDEX(Champ,MATCH(A451,Jour,0),4)),AND(C451>=INDEX(Champ,MATCH(A451,Jour,0)+1,4),C451<=INDEX(Champ,MATCH(A451,Jour,0)+1,3))),\"occupé\",\"\")","v":""}]
["MERCREDI",24,"23:10:00",{"$f":"IF(OR(AND(C452>=INDEX(Champ,MATCH(A452,Jour,0),3),C452<=INDEX(Champ,MATCH(A452,Jour,0),4)),AND(C452>=INDEX(Champ,MATCH(A452,Jour,0)+1,4),C452<=INDEX(Champ,MATCH(A452,Jour,0)+1,3))),\"occupé\",\"\")","v":""}]
["MERCREDI",24,"23:20:00",{"$f":"IF(OR(AND(C453>=INDEX(Champ,MATCH(A453,Jour,0),3),C453<=INDEX(Champ,MATCH(A453,Jour,0),4)),AND(C453>=INDEX(Champ,MATCH(A453,Jour,0)+1,4),C453<=INDEX(Champ,MATCH(A453,Jour,0)+1,3))),\"occupé\",\"\")","v":""}]
["MERCREDI",24,"23:30:00",{"$f":"IF(OR(AND(C454>=INDEX(Champ,MATCH(A454,Jour,0),3),C454<=INDEX(Champ,MATCH(A454,Jour,0),4)),AND(C454>=INDEX(Champ,MATCH(A454,Jour,0)+1,4),C454<=INDEX(Champ,MATCH(A454,Jour,0)+1,3))),\"occupé\",\"\")","v":""}]
["MERCREDI",24,"23:40:00",{"$f":"IF(OR(AND(C455>=INDEX(Champ,MATCH(A455,Jour,0),3),C455<=INDEX(Champ,MATCH(A455,Jour,0),4)),AND(C455>=INDEX(Champ,MATCH(A455,Jour,0)+1,4),C455<=INDEX(Champ,MATCH(A455,Jour,0)+1,3))),\"occupé\",\"\")","v":""}]
["MERCREDI",24,"23:50:00",{"$f":"IF(OR(AND(C456>=INDEX(Champ,MATCH(A456,Jour,0),3),C456<=INDEX(Champ,MATCH(A456,Jour,0),4)),AND(C456>=INDEX(Champ,MATCH(A456,Jour,0)+1,4),C456<=INDEX(Champ,MATCH(A456,Jour,0)+1,3))),\"occupé\",\"\")","v":""}]
["JEUDI",1,3,{"$f":"IF(OR(AND(C457>=INDEX(Champ,MATCH(A457,Jour,0),3),C457<=INDEX(Champ,MATCH(A457,Jour,0),4)),AND(C457>=INDEX(Champ,MATCH(A457,Jour,0)+1,4),C457<=INDEX(Champ,MATCH(A457,Jour,0)+1,3))),\"occupé\",\"\")","v":""}]
["JEUDI",1,3.0069444444444402,{"$f":"IF(OR(AND(C458>=INDEX(Champ,MATCH(A458,Jour,0),3),C458<=INDEX(Champ,MATCH(A458,Jour,0),4)),AND(C458>=INDEX(Champ,MATCH(A458,Jour,0)+1,4),C458<=INDEX(Champ,MATCH(A458,Jour,0)+1,3))),\"occupé\",\"\")","v":""}]
["JEUDI",1,3.0138888888888902,{"$f":"IF(OR(AND(C459>=INDEX(Champ,MATCH(A459,Jour,0),3),C459<=INDEX(Champ,MATCH(A459,Jour,0),4)),AND(C459>=INDEX(Champ,MATCH(A459,Jour,0)+1,4),C459<=INDEX(Champ,MATCH(A459,Jour,0)+1,3))),\"occupé\",\"\")","v":""}]
["JEUDI",1,3.0208333333333299,{"$f":"IF(OR(AND(C460>=INDEX(Champ,MATCH(A460,Jour,0),3),C460<=INDEX(Champ,MATCH(A460,Jour,0),4)),AND(C460>=INDEX(Champ,MATCH(A460,Jour,0)+1,4),C460<=INDEX(Champ,MATCH(A460,Jour,0)+1,3))),\"occupé\",\"\")","v":""}]
["JEUDI",1,3.0277777777777799,{"$f":"IF(OR(AND(C461>=INDEX(Champ,MATCH(A461,Jour,0),3),C461<=INDEX(Champ,MATCH(A461,Jour,0),4)),AND(C461>=INDEX(Champ,MATCH(A461,Jour,0)+1,4),C461<=INDEX(Champ,MATCH(A461,Jour,0)+1,3))),\"occupé\",\"\")","v":""}]
["JEUDI",1,3.0347222222222201,{"$f":"IF(OR(AND(C462>=INDEX(Champ,MATCH(A462,Jour,0),3),C462<=INDEX(Champ,MATCH(A462,Jour,0),4)),AND(C462>=INDEX(Champ,MATCH(A462,Jour,0)+1,4),C462<=INDEX(Champ,MATCH(A462,Jour,0)+1,3))),\"occupé\",\"\")","v":""}]
["JEUDI",2,3.0416666666666701,{"$f":"IF(OR(AND(C463>=INDEX(Champ,MATCH(A463,Jour,0),3),C463<=INDEX(Champ,MATCH(A463,Jour,0),4)),AND(C463>=INDEX(Champ,MATCH(A463,Jour,0)+1,4),C463<=INDEX(Champ,MATCH(A463,Jour,0)+1,3))),\"occupé\",\"\")","v":""}]
["JEUDI",2,3.0486111111111098,{"$f":"IF(OR(AND(C464>=INDEX(Champ,MATCH(A464,Jour,0),3),C464<=INDEX(Champ,MATCH(A464,Jour,0),4)),AND(C464>=INDEX(Champ,MATCH(A464,Jour,0)+1,4),C464<=INDEX(Champ,MATCH(A464,Jour,0)+1,3))),\"occupé\",\"\")","v":""}]
["JEUDI",2,3.0555555555555598,{"$f":"IF(OR(AND(C465>=INDEX(Champ,MATCH(A465,Jour,0),3),C465<=INDEX(Champ,MATCH(A465,Jour,0),4)),AND(C465>=INDEX(Champ,MATCH(A465,Jour,0)+1,4),C465<=INDEX(Champ,MATCH(A465,Jour,0)+1,3))),\"occupé\",\"\")","v":""}]
["JEUDI",2,3.0625,{"$f":"IF(OR(AND(C466>=INDEX(Champ,MATCH(A466,Jour,0),3),C466<=INDEX(Champ,MATCH(A466,Jour,0),4)),AND(C466>=INDEX(Champ,MATCH(A466,Jour,0)+1,4),C466<=INDEX(Champ,MATCH(A466,Jour,0)+1,3))),\"occupé\",\"\")","v":""}]
["JEUDI",2,3.0694444444444402,{"$f":"IF(OR(AND(C467>=INDEX(Champ,MATCH(A467,Jour,0),3),C467<=INDEX(Champ,MATCH(A467,Jour,0),4)),AND(C467>=INDEX(Champ,MATCH(A467,Jour,0)+1,4),C467<=INDEX(Champ,MATCH(A467,Jour,0)+1,3))),\"occupé\",\"\")","v":""}]
["JEUDI",2,3.0763888888888902,{"$f":"IF(OR(AND(C468>=INDEX(Champ,MATCH(A468,Jour,0),3),C468<=INDEX(Champ,MATCH(A468,Jour,0),4)),AND(C468>=INDEX(Champ,MATCH(A468,Jour,0)+1,4),C468<=INDEX(Champ,MATCH(A468,Jour,0)+1,3))),\"occupé\",\"\")","v":""}]
["JEUDI",3,3.0833333333333299,{"$f":"IF(OR(AND(C469>=INDEX(Champ,MATCH(A469,Jour,0),3),C469<=INDEX(Champ,MATCH(A469,Jour,0),4)),AND(C469>=INDEX(Champ,MATCH(A469,Jour,0)+1,4),C469<=INDEX(Champ,MATCH(A469,Jour,0)+1,3))),\"occupé\",\"\")","v":""}]
["JEUDI",3,3.0902777777777799,{"$f":"IF(OR(AND(C470>=INDEX(Champ,MATCH(A470,Jour,0),3),C470<=INDEX(Champ,MATCH(A470,Jour,0),4)),AND(C470>=INDEX(Champ,MATCH(A470,Jour,0)+1,4),C470<=INDEX(Champ,MATCH(A470,Jour,0)+1,3))),\"occupé\",\"\")","v":""}]
["JEUDI",3,3.0972222222222201,{"$f":"IF(OR(AND(C471>=INDEX(Champ,MATCH(A471,Jour,0),3),C471<=INDEX(Champ,MATCH(A471,Jour,0),4)),AND(C471>=INDEX(Champ,MATCH(A471,Jour,0)+1,4),C471<=INDEX(Champ,MATCH(A471,Jour,0)+1,3))),\"occupé\",\"\")","v":""}]
["JEUDI",3,3.1041666666666701,{"$f":"IF(OR(AND(C472>=INDEX(Champ,MATCH(A472,Jour,0),3),C472<=INDEX(Champ,MATCH(A472,Jour,0),4)),AND(C472>=INDEX(Champ,MATCH(A472,Jour,0)+1,4),C472<=INDEX(Champ,MATCH(A472,Jour,0)+1,3))),\"occupé\",\"\")","v":""}]
["JEUDI",3,3.1111111111111098,{"$f":"IF(OR(AND(C473>=INDEX(Champ,MATCH(A473,Jour,0),3),C473<=INDEX(Champ,MATCH(A473,Jour,0),4)),AND(C473>=INDEX(Champ,MATCH(A473,Jour,0)+1,4),C473<=INDEX(Champ,MATCH(A473,Jour,0)+1,3))),\"occupé\",\"\")","v":""}]
["JEUDI",3,3.1180555555555598,{"$f":"IF(OR(AND(C474>=INDEX(Champ,MATCH(A474,Jour,0),3),C474<=INDEX(Champ,MATCH(A474,Jour,0),4)),AND(C474>=INDEX(Champ,MATCH(A474,Jour,0)+1,4),C474<=INDEX(Champ,MATCH(A474,Jour,0)+1,3))),\"occupé\",\"\")","v":""}]
["JEUDI",4,3.125,{"$f":"IF(OR(AND(C475>=INDEX(Champ,MATCH(A475,Jour,0),3),C475<=INDEX(Champ,MATCH(A475,Jour,0),4)),AND(C475>=INDEX(Champ,MATCH(A475,Jour,0)+1,4),C475<=INDEX(Champ,MATCH(A475,Jour,0)+1,3))),\"occupé\",\"\")","v":""}]
["JEUDI",4,3.1319444444444402,{"$f":"IF(OR(AND(C476>=INDEX(Champ,MATCH(A476,Jour,0),3),C476<=INDEX(Champ,MATCH(A476,Jour,0),4)),AND(C476>=INDEX(Champ,MATCH(A476,Jour,0)+1,4),C476<=INDEX(Champ,MATCH(A476,Jour,0)+1,3))),\"occupé\",\"\")","v":""}]
["JEUDI",4,3.1388888888888902,{"$f":"IF(OR(AND(C477>=INDEX(Champ,MATCH(A477,Jour,0),3),C477<=INDEX(Champ,MATCH(A477,Jour,0),4)),AND(C477>=INDEX(Champ,MATCH(A477,Jour,0)+1,4),C477<=INDEX(Champ,MATCH(A477,Jour,0)+1,3))),\"occupé\",\"\")","v":""}]
["JEUDI",4,3.1458333333333299,{"$f":"IF(OR(AND(C478>=INDEX(Champ,MATCH(A478,Jour,0),3),C478<=INDEX(Champ,MATCH(A478,Jour,0),4)),AND(C478>=INDEX(Champ,MATCH(A478,Jour,0)+1,4),C478<=INDEX(Champ,MATCH(A478,Jour,0)+1,3))),\"occupé\",\"\")","v":""}]
["JEUDI",4,3.1527777777777799,{"$f":"IF(OR(AND(C479>=INDEX(Champ,MATCH(A479,Jour,0),3),C479<=INDEX(Champ,MATCH(A479,Jour,0),4)),AND(C479>=INDEX(Champ,MATCH(A479,Jour,0)+1,4),C479<=INDEX(Champ,MATCH(A479,Jour,0)+1,3))),\"occupé\",\"\")","v":""}]
["JEUDI",4,3.1597222222222201,{"$f":"IF(OR(AND(C480>=INDEX(Champ,MATCH(A480,Jour,0),3),C480<=INDEX(Champ,MATCH(A480,Jour,0),4)),AND(C480>=INDEX(Champ,MATCH(A480,Jour,0)+1,4),C480<=INDEX(Champ,MATCH(A480,Jour,0)+1,3))),\"occupé\",\"\")","v":""}]
["JEUDI",5,3.1666666666666701,{"$f":"IF(OR(AND(C481>=INDEX(Champ,MATCH(A481,Jour,0),3),C481<=INDEX(Champ,MATCH(A481,Jour,0),4)),AND(C481>=INDEX(Champ,MATCH(A481,Jour,0)+1,4),C481<=INDEX(Champ,MATCH(A481,Jour,0)+1,3))),\"occupé\",\"\")","v":""}]
["JEUDI",5,3.1736111111111098,{"$f":"IF(OR(AND(C482>=INDEX(Champ,MATCH(A482,Jour,0),3),C482<=INDEX(Champ,MATCH(A482,Jour,0),4)),AND(C482>=INDEX(Champ,MATCH(A482,Jour,0)+1,4),C482<=INDEX(Champ,MATCH(A482,Jour,0)+1,3))),\"occupé\",\"\")","v":""}]
["JEUDI",5,3.1805555555555598,{"$f":"IF(OR(AND(C483>=INDEX(Champ,MATCH(A483,Jour,0),3),C483<=INDEX(Champ,MATCH(A483,Jour,0),4)),AND(C483>=INDEX(Champ,MATCH(A483,Jour,0)+1,4),C483<=INDEX(Champ,MATCH(A483,Jour,0)+1,3))),\"occupé\",\"\")","v":""}]
["JEUDI",5,3.1875,{"$f":"IF(OR(AND(C484>=INDEX(Champ,MATCH(A484,Jour,0),3),C484<=INDEX(Champ,MATCH(A484,Jour,0),4)),AND(C484>=INDEX(Champ,MATCH(A484,Jour,0)+1,4),C484<=INDEX(Champ,MATCH(A484,Jour,0)+1,3))),\"occupé\",\"\")","v":""}]
["JEUDI",5,3.1944444444444402,{"$f":"IF(OR(AND(C485>=INDEX(Champ,MATCH(A485,Jour,0),3),C485<=INDEX(Champ,MATCH(A485,Jour,0),4)),AND(C485>=INDEX(Champ,MATCH(A485,Jour,0)+1,4),C485<=INDEX(Champ,MATCH(A485,Jour,0)+1,3))),\"occupé\",\"\")","v":""}]
["JEUDI",5,3.2013888888888902,{"$f":"IF(OR(AND(C486>=INDEX(Champ,MATCH(A486,Jour,0),3),C486<=INDEX(Champ,MATCH(A486,Jour,0),4)),AND(C486>=INDEX(Champ,MATCH(A486,Jour,0)+1,4),C486<=INDEX(Champ,MATCH(A486,Jour,0)+1,3))),\"occupé\",\"\")","v":""}]
["JEUDI",6,3.2083333333333299,{"$f":"IF(OR(AND(C487>=INDEX(Champ,MATCH(A487,Jour,0),3),C487<=INDEX(Champ,MATCH(A487,Jour,0),4)),AND(C487>=INDEX(Champ,MATCH(A487,Jour,0)+1,4),C487<=INDEX(Champ,MATCH(A487,Jour,0)+1,3))),\"occupé\",\"\")","v":""}]
["JEUDI",6,3.2152777777777799,{"$f":"IF(OR(AND(C488>=INDEX(Champ,MATCH(A488,Jour,0),3),C488<=INDEX(Champ,MATCH(A488,Jour,0),4)),AND(C488>=INDEX(Champ,MATCH(A488,Jour,0)+1,4),C488<=INDEX(Champ,MATCH(A488,Jour,0)+1,3))),\"occupé\",\"\")","v":""}]
["JEUDI",6,3.2222222222222201,{"$f":"IF(OR(AND(C489>=INDEX(Champ,MATCH(A489,Jour,0),3),C489<=INDEX(Champ,MATCH(A489,Jour,0),4)),AND(C489>=INDEX(Champ,MATCH(A489,Jour,0)+1,4),C489<=INDEX(Champ,MATCH(A489,Jour,0)+1,3))),\"occupé\",\"\")","v":""}]
["JEUDI",6,3.2291666666666701,{"$f":"IF(OR(AND(C490>=INDEX(Champ,MATCH(A490,Jour,0),3),C490<=INDEX(Champ,MATCH(A490,Jour,0),4)),AND(C490>=INDEX(Champ,MATCH(A490,Jour,0)+1,4),C490<=INDEX(Champ,MATCH(A490,Jour,0)+1,3))),\"occupé\",\"\")","v":""}]
["JEUDI",6,3.2361111111111098,{"$f":"IF(OR(AND(C491>=INDEX(Champ,MATCH(A491,Jour,0),3),C491<=INDEX(Champ,MATCH(A491,Jour,0),4)),AND(C491>=INDEX(Champ,MATCH(A491,Jour,0)+1,4),C491<=INDEX(Champ,MATCH(A491,Jour,0)+1,3))),\"occupé\",\"\")","v":""}]
["JEUDI",6,3.2430555555555598,{"$f":"IF(OR(AND(C492>=INDEX(Champ,MATCH(A492,Jour,0),3),C492<=INDEX(Champ,MATCH(A492,Jour,0),4)),AND(C492>=INDEX(Champ,MATCH(A492,Jour,0)+1,4),C492<=INDEX(Champ,MATCH(A492,Jour,0)+1,3))),\"occupé\",\"\")","v":""}]
["JEUDI",7,3.25,{"$f":"IF(OR(AND(C493>=INDEX(Champ,MATCH(A493,Jour,0),3),C493<=INDEX(Champ,MATCH(A493,Jour,0),4)),AND(C493>=INDEX(Champ,MATCH(A493,Jour,0)+1,4),C493<=INDEX(Champ,MATCH(A493,Jour,0)+1,3))),\"occupé\",\"\")","v":""}]
["JEUDI",7,3.2569444444444402,{"$f":"IF(OR(AND(C494>=INDEX(Champ,MATCH(A494,Jour,0),3),C494<=INDEX(Champ,MATCH(A494,Jour,0),4)),AND(C494>=INDEX(Champ,MATCH(A494,Jour,0)+1,4),C494<=INDEX(Champ,MATCH(A494,Jour,0)+1,3))),\"occupé\",\"\")","v":""}]
["JEUDI",7,3.2638888888888902,{"$f":"IF(OR(AND(C495>=INDEX(Champ,MATCH(A495,Jour,0),3),C495<=INDEX(Champ,MATCH(A495,Jour,0),4)),AND(C495>=INDEX(Champ,MATCH(A495,Jour,0)+1,4),C495<=INDEX(Champ,MATCH(A495,Jour,0)+1,3))),\"occupé\",\"\")","v":""}]
["JEUDI",7,3.2708333333333299,{"$f":"IF(OR(AND(C496>=INDEX(Champ,MATCH(A496,Jour,0),3),C496<=INDEX(Champ,MATCH(A496,Jour,0),4)),AND(C496>=INDEX(Champ,MATCH(A496,Jour,0)+1,4),C496<=INDEX(Champ,MATCH(A496,Jour,0)+1,3))),\"occupé\",\"\")","v":""}]
["JEUDI",7,3.2777777777777799,{"$f":"IF(OR(AND(C497>=INDEX(Champ,MATCH(A497,Jour,0),3),C497<=INDEX(Champ,MATCH(A497,Jour,0),4)),AND(C497>=INDEX(Champ,MATCH(A497,Jour,0)+1,4),C497<=INDEX(Champ,MATCH(A497,Jour,0)+1,3))),\"occupé\",\"\")","v":""}]
["JEUDI",7,3.2847222222222201,{"$f":"IF(OR(AND(C498>=INDEX(Champ,MATCH(A498,Jour,0),3),C498<=INDEX(Champ,MATCH(A498,Jour,0),4)),AND(C498>=INDEX(Champ,MATCH(A498,Jour,0)+1,4),C498<=INDEX(Champ,MATCH(A498,Jour,0)+1,3))),\"occupé\",\"\")","v":""}]
["JEUDI",8,3.2916666666666701,{"$f":"IF(OR(AND(C499>=INDEX(Champ,MATCH(A499,Jour,0),3),C499<=INDEX(Champ,MATCH(A499,Jour,0),4)),AND(C499>=INDEX(Champ,MATCH(A499,Jour,0)+1,4),C499<=INDEX(Champ,MATCH(A499,Jour,0)+1,3))),\"occupé\",\"\")","v":""}]
["JEUDI",8,3.2986111111111098,{"$f":"IF(OR(AND(C500>=INDEX(Champ,MATCH(A500,Jour,0),3),C500<=INDEX(Champ,MATCH(A500,Jour,0),4)),AND(C500>=INDEX(Champ,MATCH(A500,Jour,0)+1,4),C500<=INDEX(Champ,MATCH(A500,Jour,0)+1,3))),\"occupé\",\"\")","v":""}]
["JEUDI",8,3.3055555555555598,{"$f":"IF(OR(AND(C501>=INDEX(Champ,MATCH(A501,Jour,0),3),C501<=INDEX(Champ,MATCH(A501,Jour,0),4)),AND(C501>=INDEX(Champ,MATCH(A501,Jour,0)+1,4),C501<=INDEX(Champ,MATCH(A501,Jour,0)+1,3))),\"occupé\",\"\")","v":""}]
["JEUDI",8,3.3125,{"$f":"IF(OR(AND(C502>=INDEX(Champ,MATCH(A502,Jour,0),3),C502<=INDEX(Champ,MATCH(A502,Jour,0),4)),AND(C502>=INDEX(Champ,MATCH(A502,Jour,0)+1,4),C502<=INDEX(Champ,MATCH(A502,Jour,0)+1,3))),\"occupé\",\"\")","v":""}]
["JEUDI",8,3.3194444444444402,{"$f":"IF(OR(AND(C503>=INDEX(Champ,MATCH(A503,Jour,0),3),C503<=INDEX(Champ,MATCH(A503,Jour,0),4)),AND(C503>=INDEX(Champ,MATCH(A503,Jour,0)+1,4),C503<=INDEX(Champ,MATCH(A503,Jour,0)+1,3))),\"occupé\",\"\")","v":""}]
["JEUDI",8,3.3263888888888902,{"$f":"IF(OR(AND(C504>=INDEX(Champ,MATCH(A504,Jour,0),3),C504<=INDEX(Champ,MATCH(A504,Jour,0),4)),AND(C504>=INDEX(Champ,MATCH(A504,Jour,0)+1,4),C504<=INDEX(Champ,MATCH(A504,Jour,0)+1,3))),\"occupé\",\"\")","v":""}]
["JEUDI",9,3.3333333333333299,{"$f":"IF(OR(AND(C505>=INDEX(Champ,MATCH(A505,Jour,0),3),C505<=INDEX(Champ,MATCH(A505,Jour,0),4)),AND(C505>=INDEX(Champ,MATCH(A505,Jour,0)+1,4),C505<=INDEX(Champ,MATCH(A505,Jour,0)+1,3))),\"occupé\",\"\")","v":""}]
["JEUDI",9,3.3402777777777799,{"$f":"IF(OR(AND(C506>=INDEX(Champ,MATCH(A506,Jour,0),3),C506<=INDEX(Champ,MATCH(A506,Jour,0),4)),AND(C506>=INDEX(Champ,MATCH(A506,Jour,0)+1,4),C506<=INDEX(Champ,MATCH(A506,Jour,0)+1,3))),\"occupé\",\"\")","v":""}]
["JEUDI",9,3.3472222222222201,{"$f":"IF(OR(AND(C507>=INDEX(Champ,MATCH(A507,Jour,0),3),C507<=INDEX(Champ,MATCH(A507,Jour,0),4)),AND(C507>=INDEX(Champ,MATCH(A507,Jour,0)+1,4),C507<=INDEX(Champ,MATCH(A507,Jour,0)+1,3))),\"occupé\",\"\")","v":""}]
["JEUDI",9,3.3541666666666701,{"$f":"IF(OR(AND(C508>=INDEX(Champ,MATCH(A508,Jour,0),3),C508<=INDEX(Champ,MATCH(A508,Jour,0),4)),AND(C508>=INDEX(Champ,MATCH(A508,Jour,0)+1,4),C508<=INDEX(Champ,MATCH(A508,Jour,0)+1,3))),\"occupé\",\"\")","v":""}]
["JEUDI",9,3.3611111111111098,{"$f":"IF(OR(AND(C509>=INDEX(Champ,MATCH(A509,Jour,0),3),C509<=INDEX(Champ,MATCH(A509,Jour,0),4)),AND(C509>=INDEX(Champ,MATCH(A509,Jour,0)+1,4),C509<=INDEX(Champ,MATCH(A509,Jour,0)+1,3))),\"occupé\",\"\")","v":""}]
["JEUDI",9,3.3680555555555598,{"$f":"IF(OR(AND(C510>=INDEX(Champ,MATCH(A510,Jour,0),3),C510<=INDEX(Champ,MATCH(A510,Jour,0),4)),AND(C510>=INDEX(Champ,MATCH(A510,Jour,0)+1,4),C510<=INDEX(Champ,MATCH(A510,Jour,0)+1,3))),\"occupé\",\"\")","v":""}]
["JEUDI",10,3.375,{"$f":"IF(OR(AND(C511>=INDEX(Champ,MATCH(A511,Jour,0),3),C511<=INDEX(Champ,MATCH(A511,Jour,0),4)),AND(C511>=INDEX(Champ,MATCH(A511,Jour,0)+1,4),C511<=INDEX(Champ,MATCH(A511,Jour,0)+1,3))),\"occupé\",\"\")","v":""}]
["JEUDI",10,3.3819444444444402,{"$f":"IF(OR(AND(C512>=INDEX(Champ,MATCH(A512,Jour,0),3),C512<=INDEX(Champ,MATCH(A512,Jour,0),4)),AND(C512>=INDEX(Champ,MATCH(A512,Jour,0)+1,4),C512<=INDEX(Champ,MATCH(A512,Jour,0)+1,3))),\"occupé\",\"\")","v":""}]
["JEUDI",10,3.3888888888888902,{"$f":"IF(OR(AND(C513>=INDEX(Champ,MATCH(A513,Jour,0),3),C513<=INDEX(Champ,MATCH(A513,Jour,0),4)),AND(C513>=INDEX(Champ,MATCH(A513,Jour,0)+1,4),C513<=INDEX(Champ,MATCH(A513,Jour,0)+1,3))),\"occupé\",\"\")","v":""}]
["JEUDI",10,3.3958333333333299,{"$f":"IF(OR(AND(C514>=INDEX(Champ,MATCH(A514,Jour,0),3),C514<=INDEX(Champ,MATCH(A514,Jour,0),4)),AND(C514>=INDEX(Champ,MATCH(A514,Jour,0)+1,4),C514<=INDEX(Champ,MATCH(A514,Jour,0)+1,3))),\"occupé\",\"\")","v":""}]
["JEUDI",10,3.4027777777777799,{"$f":"IF(OR(AND(C515>=INDEX(Champ,MATCH(A515,Jour,0),3),C515<=INDEX(Champ,MATCH(A515,Jour,0),4)),AND(C515>=INDEX(Champ,MATCH(A515,Jour,0)+1,4),C515<=INDEX(Champ,MATCH(A515,Jour,0)+1,3))),\"occupé\",\"\")","v":""}]
["JEUDI",10,3.4097222222222201,{"$f":"IF(OR(AND(C516>=INDEX(Champ,MATCH(A516,Jour,0),3),C516<=INDEX(Champ,MATCH(A516,Jour,0),4)),AND(C516>=INDEX(Champ,MATCH(A516,Jour,0)+1,4),C516<=INDEX(Champ,MATCH(A516,Jour,0)+1,3))),\"occupé\",\"\")","v":""}]
["JEUDI",11,3.4166666666666701,{"$f":"IF(OR(AND(C517>=INDEX(Champ,MATCH(A517,Jour,0),3),C517<=INDEX(Champ,MATCH(A517,Jour,0),4)),AND(C517>=INDEX(Champ,MATCH(A517,Jour,0)+1,4),C517<=INDEX(Champ,MATCH(A517,Jour,0)+1,3))),\"occupé\",\"\")","v":""}]
["JEUDI",11,3.4236111111111098,{"$f":"IF(OR(AND(C518>=INDEX(Champ,MATCH(A518,Jour,0),3),C518<=INDEX(Champ,MATCH(A518,Jour,0),4)),AND(C518>=INDEX(Champ,MATCH(A518,Jour,0)+1,4),C518<=INDEX(Champ,MATCH(A518,Jour,0)+1,3))),\"occupé\",\"\")","v":""}]
["JEUDI",11,3.4305555555555598,{"$f":"IF(OR(AND(C519>=INDEX(Champ,MATCH(A519,Jour,0),3),C519<=INDEX(Champ,MATCH(A519,Jour,0),4)),AND(C519>=INDEX(Champ,MATCH(A519,Jour,0)+1,4),C519<=INDEX(Champ,MATCH(A519,Jour,0)+1,3))),\"occupé\",\"\")","v":""}]
["JEUDI",11,3.4375,{"$f":"IF(OR(AND(C520>=INDEX(Champ,MATCH(A520,Jour,0),3),C520<=INDEX(Champ,MATCH(A520,Jour,0),4)),AND(C520>=INDEX(Champ,MATCH(A520,Jour,0)+1,4),C520<=INDEX(Champ,MATCH(A520,Jour,0)+1,3))),\"occupé\",\"\")","v":""}]
["JEUDI",11,3.4444444444444402,{"$f":"IF(OR(AND(C521>=INDEX(Champ,MATCH(A521,Jour,0),3),C521<=INDEX(Champ,MATCH(A521,Jour,0),4)),AND(C521>=INDEX(Champ,MATCH(A521,Jour,0)+1,4),C521<=INDEX(Champ,MATCH(A521,Jour,0)+1,3))),\"occupé\",\"\")","v":""}]
["JEUDI",11,3.4513888888888902,{"$f":"IF(OR(AND(C522>=INDEX(Champ,MATCH(A522,Jour,0),3),C522<=INDEX(Champ,MATCH(A522,Jour,0),4)),AND(C522>=INDEX(Champ,MATCH(A522,Jour,0)+1,4),C522<=INDEX(Champ,MATCH(A522,Jour,0)+1,3))),\"occupé\",\"\")","v":""}]
["JEUDI",12,3.4583333333333299,{"$f":"IF(OR(AND(C523>=INDEX(Champ,MATCH(A523,Jour,0),3),C523<=INDEX(Champ,MATCH(A523,Jour,0),4)),AND(C523>=INDEX(Champ,MATCH(A523,Jour,0)+1,4),C523<=INDEX(Champ,MATCH(A523,Jour,0)+1,3))),\"occupé\",\"\")","v":""}]
["JEUDI",12,3.4652777777777799,{"$f":"IF(OR(AND(C524>=INDEX(Champ,MATCH(A524,Jour,0),3),C524<=INDEX(Champ,MATCH(A524,Jour,0),4)),AND(C524>=INDEX(Champ,MATCH(A524,Jour,0)+1,4),C524<=INDEX(Champ,MATCH(A524,Jour,0)+1,3))),\"occupé\",\"\")","v":""}]
["JEUDI",12,3.4722222222222201,{"$f":"IF(OR(AND(C525>=INDEX(Champ,MATCH(A525,Jour,0),3),C525<=INDEX(Champ,MATCH(A525,Jour,0),4)),AND(C525>=INDEX(Champ,MATCH(A525,Jour,0)+1,4),C525<=INDEX(Champ,MATCH(A525,Jour,0)+1,3))),\"occupé\",\"\")","v":""}]
["JEUDI",12,3.4791666666666701,{"$f":"IF(OR(AND(C526>=INDEX(Champ,MATCH(A526,Jour,0),3),C526<=INDEX(Champ,MATCH(A526,Jour,0),4)),AND(C526>=INDEX(Champ,MATCH(A526,Jour,0)+1,4),C526<=INDEX(Champ,MATCH(A526,Jour,0)+1,3))),\"occupé\",\"\")","v":""}]
["JEUDI",12,3.4861111111111098,{"$f":"IF(OR(AND(C527>=INDEX(Champ,MATCH(A527,Jour,0),3),C527<=INDEX(Champ,MATCH(A527,Jour,0),4)),AND(C527>=INDEX(Champ,MATCH(A527,Jour,0)+1,4),C527<=INDEX(Champ,MATCH(A527,Jour,0)+1,3))),\"occupé\",\"\")","v":""}]
["JEUDI",12,3.4930555555555598,{"$f":"IF(OR(AND(C528>=INDEX(Champ,MATCH(A528,Jour,0),3),C528<=INDEX(Champ,MATCH(A528,Jour,0),4)),AND(C528>=INDEX(Champ,MATCH(A528,Jour,0)+1,4),C528<=INDEX(Champ,MATCH(A528,Jour,0)+1,3))),\"occupé\",\"\")","v":""}]
["JEUDI",13,3.5,{"$f":"IF(OR(AND(C529>=INDEX(Champ,MATCH(A529,Jour,0),3),C529<=INDEX(Champ,MATCH(A529,Jour,0),4)),AND(C529>=INDEX(Champ,MATCH(A529,Jour,0)+1,4),C529<=INDEX(Champ,MATCH(A529,Jour,0)+1,3))),\"occupé\",\"\")","v":""}]
["JEUDI",13,3.5069444444444402,{"$f":"IF(OR(AND(C530>=INDEX(Champ,MATCH(A530,Jour,0),3),C530<=INDEX(Champ,MATCH(A530,Jour,0),4)),AND(C530>=INDEX(Champ,MATCH(A530,Jour,0)+1,4),C530<=INDEX(Champ,MATCH(A530,Jour,0)+1,3))),\"occupé\",\"\")","v":""}]
["JEUDI",13,3.5138888888888902,{"$f":"IF(OR(AND(C531>=INDEX(Champ,MATCH(A531,Jour,0),3),C531<=INDEX(Champ,MATCH(A531,Jour,0),4)),AND(C531>=INDEX(Champ,MATCH(A531,Jour,0)+1,4),C531<=INDEX(Champ,MATCH(A531,Jour,0)+1,3))),\"occupé\",\"\")","v":""}]
["JEUDI",13,3.5208333333333299,{"$f":"IF(OR(AND(C532>=INDEX(Champ,MATCH(A532,Jour,0),3),C532<=INDEX(Champ,MATCH(A532,Jour,0),4)),AND(C532>=INDEX(Champ,MATCH(A532,Jour,0)+1,4),C532<=INDEX(Champ,MATCH(A532,Jour,0)+1,3))),\"occupé\",\"\")","v":""}]
["JEUDI",13,3.5277777777777799,{"$f":"IF(OR(AND(C533>=INDEX(Champ,MATCH(A533,Jour,0),3),C533<=INDEX(Champ,MATCH(A533,Jour,0),4)),AND(C533>=INDEX(Champ,MATCH(A533,Jour,0)+1,4),C533<=INDEX(Champ,MATCH(A533,Jour,0)+1,3))),\"occupé\",\"\")","v":""}]
["JEUDI",13,3.5347222222222201,{"$f":"IF(OR(AND(C534>=INDEX(Champ,MATCH(A534,Jour,0),3),C534<=INDEX(Champ,MATCH(A534,Jour,0),4)),AND(C534>=INDEX(Champ,MATCH(A534,Jour,0)+1,4),C534<=INDEX(Champ,MATCH(A534,Jour,0)+1,3))),\"occupé\",\"\")","v":""}]
["JEUDI",14,3.5416666666666701,{"$f":"IF(OR(AND(C535>=INDEX(Champ,MATCH(A535,Jour,0),3),C535<=INDEX(Champ,MATCH(A535,Jour,0),4)),AND(C535>=INDEX(Champ,MATCH(A535,Jour,0)+1,4),C535<=INDEX(Champ,MATCH(A535,Jour,0)+1,3))),\"occupé\",\"\")","v":""}]
["JEUDI",14,3.5486111111111098,{"$f":"IF(OR(AND(C536>=INDEX(Champ,MATCH(A536,Jour,0),3),C536<=INDEX(Champ,MATCH(A536,Jour,0),4)),AND(C536>=INDEX(Champ,MATCH(A536,Jour,0)+1,4),C536<=INDEX(Champ,MATCH(A536,Jour,0)+1,3))),\"occupé\",\"\")","v":""}]
["JEUDI",14,3.5555555555555598,{"$f":"IF(OR(AND(C537>=INDEX(Champ,MATCH(A537,Jour,0),3),C537<=INDEX(Champ,MATCH(A537,Jour,0),4)),AND(C537>=INDEX(Champ,MATCH(A537,Jour,0)+1,4),C537<=INDEX(Champ,MATCH(A537,Jour,0)+1,3))),\"occupé\",\"\")","v":""}]
["JEUDI",14,3.5625,{"$f":"IF(OR(AND(C538>=INDEX(Champ,MATCH(A538,Jour,0),3),C538<=INDEX(Champ,MATCH(A538,Jour,0),4)),AND(C538>=INDEX(Champ,MATCH(A538,Jour,0)+1,4),C538<=INDEX(Champ,MATCH(A538,Jour,0)+1,3))),\"occupé\",\"\")","v":""}]
["JEUDI",14,3.5694444444444402,{"$f":"IF(OR(AND(C539>=INDEX(Champ,MATCH(A539,Jour,0),3),C539<=INDEX(Champ,MATCH(A539,Jour,0),4)),AND(C539>=INDEX(Champ,MATCH(A539,Jour,0)+1,4),C539<=INDEX(Champ,MATCH(A539,Jour,0)+1,3))),\"occupé\",\"\")","v":""}]
["JEUDI",14,3.5763888888888902,{"$f":"IF(OR(AND(C540>=INDEX(Champ,MATCH(A540,Jour,0),3),C540<=INDEX(Champ,MATCH(A540,Jour,0),4)),AND(C540>=INDEX(Champ,MATCH(A540,Jour,0)+1,4),C540<=INDEX(Champ,MATCH(A540,Jour,0)+1,3))),\"occupé\",\"\")","v":""}]
["JEUDI",15,3.5833333333333299,{"$f":"IF(OR(AND(C541>=INDEX(Champ,MATCH(A541,Jour,0),3),C541<=INDEX(Champ,MATCH(A541,Jour,0),4)),AND(C541>=INDEX(Champ,MATCH(A541,Jour,0)+1,4),C541<=INDEX(Champ,MATCH(A541,Jour,0)+1,3))),\"occupé\",\"\")","v":""}]
["JEUDI",15,3.5902777777777799,{"$f":"IF(OR(AND(C542>=INDEX(Champ,MATCH(A542,Jour,0),3),C542<=INDEX(Champ,MATCH(A542,Jour,0),4)),AND(C542>=INDEX(Champ,MATCH(A542,Jour,0)+1,4),C542<=INDEX(Champ,MATCH(A542,Jour,0)+1,3))),\"occupé\",\"\")","v":""}]
["JEUDI",15,3.5972222222222201,{"$f":"IF(OR(AND(C543>=INDEX(Champ,MATCH(A543,Jour,0),3),C543<=INDEX(Champ,MATCH(A543,Jour,0),4)),AND(C543>=INDEX(Champ,MATCH(A543,Jour,0)+1,4),C543<=INDEX(Champ,MATCH(A543,Jour,0)+1,3))),\"occupé\",\"\")","v":""}]
["JEUDI",15,3.6041666666666701,{"$f":"IF(OR(AND(C544>=INDEX(Champ,MATCH(A544,Jour,0),3),C544<=INDEX(Champ,MATCH(A544,Jour,0),4)),AND(C544>=INDEX(Champ,MATCH(A544,Jour,0)+1,4),C544<=INDEX(Champ,MATCH(A544,Jour,0)+1,3))),\"occupé\",\"\")","v":""}]
["JEUDI",15,3.6111111111111098,{"$f":"IF(OR(AND(C545>=INDEX(Champ,MATCH(A545,Jour,0),3),C545<=INDEX(Champ,MATCH(A545,Jour,0),4)),AND(C545>=INDEX(Champ,MATCH(A545,Jour,0)+1,4),C545<=INDEX(Champ,MATCH(A545,Jour,0)+1,3))),\"occupé\",\"\")","v":""}]
["JEUDI",15,3.6180555555555598,{"$f":"IF(OR(AND(C546>=INDEX(Champ,MATCH(A546,Jour,0),3),C546<=INDEX(Champ,MATCH(A546,Jour,0),4)),AND(C546>=INDEX(Champ,MATCH(A546,Jour,0)+1,4),C546<=INDEX(Champ,MATCH(A546,Jour,0)+1,3))),\"occupé\",\"\")","v":""}]
["JEUDI",16,3.625,{"$f":"IF(OR(AND(C547>=INDEX(Champ,MATCH(A547,Jour,0),3),C547<=INDEX(Champ,MATCH(A547,Jour,0),4)),AND(C547>=INDEX(Champ,MATCH(A547,Jour,0)+1,4),C547<=INDEX(Champ,MATCH(A547,Jour,0)+1,3))),\"occupé\",\"\")","v":""}]
["JEUDI",16,3.6319444444444402,{"$f":"IF(OR(AND(C548>=INDEX(Champ,MATCH(A548,Jour,0),3),C548<=INDEX(Champ,MATCH(A548,Jour,0),4)),AND(C548>=INDEX(Champ,MATCH(A548,Jour,0)+1,4),C548<=INDEX(Champ,MATCH(A548,Jour,0)+1,3))),\"occupé\",\"\")","v":""}]
["JEUDI",16,3.6388888888888902,{"$f":"IF(OR(AND(C549>=INDEX(Champ,MATCH(A549,Jour,0),3),C549<=INDEX(Champ,MATCH(A549,Jour,0),4)),AND(C549>=INDEX(Champ,MATCH(A549,Jour,0)+1,4),C549<=INDEX(Champ,MATCH(A549,Jour,0)+1,3))),\"occupé\",\"\")","v":""}]
["JEUDI",16,3.6458333333333299,{"$f":"IF(OR(AND(C550>=INDEX(Champ,MATCH(A550,Jour,0),3),C550<=INDEX(Champ,MATCH(A550,Jour,0),4)),AND(C550>=INDEX(Champ,MATCH(A550,Jour,0)+1,4),C550<=INDEX(Champ,MATCH(A550,Jour,0)+1,3))),\"occupé\",\"\")","v":""}]
["JEUDI",16,3.6527777777777799,{"$f":"IF(OR(AND(C551>=INDEX(Champ,MATCH(A551,Jour,0),3),C551<=INDEX(Champ,MATCH(A551,Jour,0),4)),AND(C551>=INDEX(Champ,MATCH(A551,Jour,0)+1,4),C551<=INDEX(Champ,MATCH(A551,Jour,0)+1,3))),\"occupé\",\"\")","v":""}]
["JEUDI",16,3.6597222222222201,{"$f":"IF(OR(AND(C552>=INDEX(Champ,MATCH(A552,Jour,0),3),C552<=INDEX(Champ,MATCH(A552,Jour,0),4)),AND(C552>=INDEX(Champ,MATCH(A552,Jour,0)+1,4),C552<=INDEX(Champ,MATCH(A552,Jour,0)+1,3))),\"occupé\",\"\")","v":""}]
["JEUDI",17,3.6666666666666701,{"$f":"IF(OR(AND(C553>=INDEX(Champ,MATCH(A553,Jour,0),3),C553<=INDEX(Champ,MATCH(A553,Jour,0),4)),AND(C553>=INDEX(Champ,MATCH(A553,Jour,0)+1,4),C553<=INDEX(Champ,MATCH(A553,Jour,0)+1,3))),\"occupé\",\"\")","v":""}]
["JEUDI",17,3.6736111111111098,{"$f":"IF(OR(AND(C554>=INDEX(Champ,MATCH(A554,Jour,0),3),C554<=INDEX(Champ,MATCH(A554,Jour,0),4)),AND(C554>=INDEX(Champ,MATCH(A554,Jour,0)+1,4),C554<=INDEX(Champ,MATCH(A554,Jour,0)+1,3))),\"occupé\",\"\")","v":""}]
["JEUDI",17,3.6805555555555598,{"$f":"IF(OR(AND(C555>=INDEX(Champ,MATCH(A555,Jour,0),3),C555<=INDEX(Champ,MATCH(A555,Jour,0),4)),AND(C555>=INDEX(Champ,MATCH(A555,Jour,0)+1,4),C555<=INDEX(Champ,MATCH(A555,Jour,0)+1,3))),\"occupé\",\"\")","v":""}]
["JEUDI",17,3.6875,{"$f":"IF(OR(AND(C556>=INDEX(Champ,MATCH(A556,Jour,0),3),C556<=INDEX(Champ,MATCH(A556,Jour,0),4)),AND(C556>=INDEX(Champ,MATCH(A556,Jour,0)+1,4),C556<=INDEX(Champ,MATCH(A556,Jour,0)+1,3))),\"occupé\",\"\")","v":""}]
["JEUDI",17,3.6944444444444402,{"$f":"IF(OR(AND(C557>=INDEX(Champ,MATCH(A557,Jour,0),3),C557<=INDEX(Champ,MATCH(A557,Jour,0),4)),AND(C557>=INDEX(Champ,MATCH(A557,Jour,0)+1,4),C557<=INDEX(Champ,MATCH(A557,Jour,0)+1,3))),\"occupé\",\"\")","v":""}]
["JEUDI",17,3.7013888888888902,{"$f":"IF(OR(AND(C558>=INDEX(Champ,MATCH(A558,Jour,0),3),C558<=INDEX(Champ,MATCH(A558,Jour,0),4)),AND(C558>=INDEX(Champ,MATCH(A558,Jour,0)+1,4),C558<=INDEX(Champ,MATCH(A558,Jour,0)+1,3))),\"occupé\",\"\")","v":""}]
["JEUDI",18,3.7083333333333299,{"$f":"IF(OR(AND(C559>=INDEX(Champ,MATCH(A559,Jour,0),3),C559<=INDEX(Champ,MATCH(A559,Jour,0),4)),AND(C559>=INDEX(Champ,MATCH(A559,Jour,0)+1,4),C559<=INDEX(Champ,MATCH(A559,Jour,0)+1,3))),\"occupé\",\"\")","v":""}]
["JEUDI",18,3.7152777777777799,{"$f":"IF(OR(AND(C560>=INDEX(Champ,MATCH(A560,Jour,0),3),C560<=INDEX(Champ,MATCH(A560,Jour,0),4)),AND(C560>=INDEX(Champ,MATCH(A560,Jour,0)+1,4),C560<=INDEX(Champ,MATCH(A560,Jour,0)+1,3))),\"occupé\",\"\")","v":""}]
["JEUDI",18,3.7222222222222201,{"$f":"IF(OR(AND(C561>=INDEX(Champ,MATCH(A561,Jour,0),3),C561<=INDEX(Champ,MATCH(A561,Jour,0),4)),AND(C561>=INDEX(Champ,MATCH(A561,Jour,0)+1,4),C561<=INDEX(Champ,MATCH(A561,Jour,0)+1,3))),\"occupé\",\"\")","v":""}]
["JEUDI",18,3.7291666666666701,{"$f":"IF(OR(AND(C562>=INDEX(Champ,MATCH(A562,Jour,0),3),C562<=INDEX(Champ,MATCH(A562,Jour,0),4)),AND(C562>=INDEX(Champ,MATCH(A562,Jour,0)+1,4),C562<=INDEX(Champ,MATCH(A562,Jour,0)+1,3))),\"occupé\",\"\")","v":""}]
["JEUDI",18,3.7361111111111098,{"$f":"IF(OR(AND(C563>=INDEX(Champ,MATCH(A563,Jour,0),3),C563<=INDEX(Champ,MATCH(A563,Jour,0),4)),AND(C563>=INDEX(Champ,MATCH(A563,Jour,0)+1,4),C563<=INDEX(Champ,MATCH(A563,Jour,0)+1,3))),\"occupé\",\"\")","v":""}]
["JEUDI",18,3.7430555555555598,{"$f":"IF(OR(AND(C564>=INDEX(Champ,MATCH(A564,Jour,0),3),C564<=INDEX(Champ,MATCH(A564,Jour,0),4)),AND(C564>=INDEX(Champ,MATCH(A564,Jour,0)+1,4),C564<=INDEX(Champ,MATCH(A564,Jour,0)+1,3))),\"occupé\",\"\")","v":""}]
["JEUDI",19,3.75,{"$f":"IF(OR(AND(C565>=INDEX(Champ,MATCH(A565,Jour,0),3),C565<=INDEX(Champ,MATCH(A565,Jour,0),4)),AND(C565>=INDEX(Champ,MATCH(A565,Jour,0)+1,4),C565<=INDEX(Champ,MATCH(A565,Jour,0)+1,3))),\"occupé\",\"\")","v":""}]
["JEUDI",19,3.7569444444444402,{"$f":"IF(OR(AND(C566>=INDEX(Champ,MATCH(A566,Jour,0),3),C566<=INDEX(Champ,MATCH(A566,Jour,0),4)),AND(C566>=INDEX(Champ,MATCH(A566,Jour,0)+1,4),C566<=INDEX(Champ,MATCH(A566,Jour,0)+1,3))),\"occupé\",\"\")","v":""}]
["JEUDI",19,3.7638888888888902,{"$f":"IF(OR(AND(C567>=INDEX(Champ,MATCH(A567,Jour,0),3),C567<=INDEX(Champ,MATCH(A567,Jour,0),4)),AND(C567>=INDEX(Champ,MATCH(A567,Jour,0)+1,4),C567<=INDEX(Champ,MATCH(A567,Jour,0)+1,3))),\"occupé\",\"\")","v":""}]
["JEUDI",19,3.7708333333333299,{"$f":"IF(OR(AND(C568>=INDEX(Champ,MATCH(A568,Jour,0),3),C568<=INDEX(Champ,MATCH(A568,Jour,0),4)),AND(C568>=INDEX(Champ,MATCH(A568,Jour,0)+1,4),C568<=INDEX(Champ,MATCH(A568,Jour,0)+1,3))),\"occupé\",\"\")","v":""}]
["JEUDI",19,3.7777777777777799,{"$f":"IF(OR(AND(C569>=INDEX(Champ,MATCH(A569,Jour,0),3),C569<=INDEX(Champ,MATCH(A569,Jour,0),4)),AND(C569>=INDEX(Champ,MATCH(A569,Jour,0)+1,4),C569<=INDEX(Champ,MATCH(A569,Jour,0)+1,3))),\"occupé\",\"\")","v":""}]
["JEUDI",19,3.7847222222222201,{"$f":"IF(OR(AND(C570>=INDEX(Champ,MATCH(A570,Jour,0),3),C570<=INDEX(Champ,MATCH(A570,Jour,0),4)),AND(C570>=INDEX(Champ,MATCH(A570,Jour,0)+1,4),C570<=INDEX(Champ,MATCH(A570,Jour,0)+1,3))),\"occupé\",\"\")","v":""}]
["JEUDI",20,3.7916666666666701,{"$f":"IF(OR(AND(C571>=INDEX(Champ,MATCH(A571,Jour,0),3),C571<=INDEX(Champ,MATCH(A571,Jour,0),4)),AND(C571>=INDEX(Champ,MATCH(A571,Jour,0)+1,4),C571<=INDEX(Champ,MATCH(A571,Jour,0)+1,3))),\"occupé\",\"\")","v":""}]
["JEUDI",20,3.7986111111111098,{"$f":"IF(OR(AND(C572>=INDEX(Champ,MATCH(A572,Jour,0),3),C572<=INDEX(Champ,MATCH(A572,Jour,0),4)),AND(C572>=INDEX(Champ,MATCH(A572,Jour,0)+1,4),C572<=INDEX(Champ,MATCH(A572,Jour,0)+1,3))),\"occupé\",\"\")","v":""}]
["JEUDI",20,3.8055555555555598,{"$f":"IF(OR(AND(C573>=INDEX(Champ,MATCH(A573,Jour,0),3),C573<=INDEX(Champ,MATCH(A573,Jour,0),4)),AND(C573>=INDEX(Champ,MATCH(A573,Jour,0)+1,4),C573<=INDEX(Champ,MATCH(A573,Jour,0)+1,3))),\"occupé\",\"\")","v":""}]
["JEUDI",20,3.8125,{"$f":"IF(OR(AND(C574>=INDEX(Champ,MATCH(A574,Jour,0),3),C574<=INDEX(Champ,MATCH(A574,Jour,0),4)),AND(C574>=INDEX(Champ,MATCH(A574,Jour,0)+1,4),C574<=INDEX(Champ,MATCH(A574,Jour,0)+1,3))),\"occupé\",\"\")","v":""}]
["JEUDI",20,3.8194444444444402,{"$f":"IF(OR(AND(C575>=INDEX(Champ,MATCH(A575,Jour,0),3),C575<=INDEX(Champ,MATCH(A575,Jour,0),4)),AND(C575>=INDEX(Champ,MATCH(A575,Jour,0)+1,4),C575<=INDEX(Champ,MATCH(A575,Jour,0)+1,3))),\"occupé\",\"\")","v":""}]
["JEUDI",20,3.8263888888888902,{"$f":"IF(OR(AND(C576>=INDEX(Champ,MATCH(A576,Jour,0),3),C576<=INDEX(Champ,MATCH(A576,Jour,0),4)),AND(C576>=INDEX(Champ,MATCH(A576,Jour,0)+1,4),C576<=INDEX(Champ,MATCH(A576,Jour,0)+1,3))),\"occupé\",\"\")","v":""}]
["JEUDI",21,3.8333333333333299,{"$f":"IF(OR(AND(C577>=INDEX(Champ,MATCH(A577,Jour,0),3),C577<=INDEX(Champ,MATCH(A577,Jour,0),4)),AND(C577>=INDEX(Champ,MATCH(A577,Jour,0)+1,4),C577<=INDEX(Champ,MATCH(A577,Jour,0)+1,3))),\"occupé\",\"\")","v":""}]
["JEUDI",21,3.8402777777777799,{"$f":"IF(OR(AND(C578>=INDEX(Champ,MATCH(A578,Jour,0),3),C578<=INDEX(Champ,MATCH(A578,Jour,0),4)),AND(C578>=INDEX(Champ,MATCH(A578,Jour,0)+1,4),C578<=INDEX(Champ,MATCH(A578,Jour,0)+1,3))),\"occupé\",\"\")","v":""}]
["JEUDI",21,3.8472222222222201,{"$f":"IF(OR(AND(C579>=INDEX(Champ,MATCH(A579,Jour,0),3),C579<=INDEX(Champ,MATCH(A579,Jour,0),4)),AND(C579>=INDEX(Champ,MATCH(A579,Jour,0)+1,4),C579<=INDEX(Champ,MATCH(A579,Jour,0)+1,3))),\"occupé\",\"\")","v":""}]
["JEUDI",21,3.8541666666666701,{"$f":"IF(OR(AND(C580>=INDEX(Champ,MATCH(A580,Jour,0),3),C580<=INDEX(Champ,MATCH(A580,Jour,0),4)),AND(C580>=INDEX(Champ,MATCH(A580,Jour,0)+1,4),C580<=INDEX(Champ,MATCH(A580,Jour,0)+1,3))),\"occupé\",\"\")","v":""}]
["JEUDI",21,3.8611111111111098,{"$f":"IF(OR(AND(C581>=INDEX(Champ,MATCH(A581,Jour,0),3),C581<=INDEX(Champ,MATCH(A581,Jour,0),4)),AND(C581>=INDEX(Champ,MATCH(A581,Jour,0)+1,4),C581<=INDEX(Champ,MATCH(A581,Jour,0)+1,3))),\"occupé\",\"\")","v":""}]
["JEUDI",21,3.8680555555555598,{"$f":"IF(OR(AND(C582>=INDEX(Champ,MATCH(A582,Jour,0),3),C582<=INDEX(Champ,MATCH(A582,Jour,0),4)),AND(C582>=INDEX(Champ,MATCH(A582,Jour,0)+1,4),C582<=INDEX(Champ,MATCH(A582,Jour,0)+1,3))),\"occupé\",\"\")","v":""}]
["JEUDI",22,3.875,{"$f":"IF(OR(AND(C583>=INDEX(Champ,MATCH(A583,Jour,0),3),C583<=INDEX(Champ,MATCH(A583,Jour,0),4)),AND(C583>=INDEX(Champ,MATCH(A583,Jour,0)+1,4),C583<=INDEX(Champ,MATCH(A583,Jour,0)+1,3))),\"occupé\",\"\")","v":""}]
["JEUDI",22,3.8819444444444402,{"$f":"IF(OR(AND(C584>=INDEX(Champ,MATCH(A584,Jour,0),3),C584<=INDEX(Champ,MATCH(A584,Jour,0),4)),AND(C584>=INDEX(Champ,MATCH(A584,Jour,0)+1,4),C584<=INDEX(Champ,MATCH(A584,Jour,0)+1,3))),\"occupé\",\"\")","v":""}]
["JEUDI",22,3.8888888888888902,{"$f":"IF(OR(AND(C585>=INDEX(Champ,MATCH(A585,Jour,0),3),C585<=INDEX(Champ,MATCH(A585,Jour,0),4)),AND(C585>=INDEX(Champ,MATCH(A585,Jour,0)+1,4),C585<=INDEX(Champ,MATCH(A585,Jour,0)+1,3))),\"occupé\",\"\")","v":""}]
["JEUDI",22,3.8958333333333299,{"$f":"IF(OR(AND(C586>=INDEX(Champ,MATCH(A586,Jour,0),3),C586<=INDEX(Champ,MATCH(A586,Jour,0),4)),AND(C586>=INDEX(Champ,MATCH(A586,Jour,0)+1,4),C586<=INDEX(Champ,MATCH(A586,Jour,0)+1,3))),\"occupé\",\"\")","v":""}]
["JEUDI",22,3.9027777777777799,{"$f":"IF(OR(AND(C587>=INDEX(Champ,MATCH(A587,Jour,0),3),C587<=INDEX(Champ,MATCH(A587,Jour,0),4)),AND(C587>=INDEX(Champ,MATCH(A587,Jour,0)+1,4),C587<=INDEX(Champ,MATCH(A587,Jour,0)+1,3))),\"occupé\",\"\")","v":""}]
["JEUDI",22,3.9097222222222201,{"$f":"IF(OR(AND(C588>=INDEX(Champ,MATCH(A588,Jour,0),3),C588<=INDEX(Champ,MATCH(A588,Jour,0),4)),AND(C588>=INDEX(Champ,MATCH(A588,Jour,0)+1,4),C588<=INDEX(Champ,MATCH(A588,Jour,0)+1,3))),\"occupé\",\"\")","v":""}]
["JEUDI",23,3.9166666666666701,{"$f":"IF(OR(AND(C589>=INDEX(Champ,MATCH(A589,Jour,0),3),C589<=INDEX(Champ,MATCH(A589,Jour,0),4)),AND(C589>=INDEX(Champ,MATCH(A589,Jour,0)+1,4),C589<=INDEX(Champ,MATCH(A589,Jour,0)+1,3))),\"occupé\",\"\")","v":""}]
["JEUDI",23,3.9236111111111098,{"$f":"IF(OR(AND(C590>=INDEX(Champ,MATCH(A590,Jour,0),3),C590<=INDEX(Champ,MATCH(A590,Jour,0),4)),AND(C590>=INDEX(Champ,MATCH(A590,Jour,0)+1,4),C590<=INDEX(Champ,MATCH(A590,Jour,0)+1,3))),\"occupé\",\"\")","v":""}]
["JEUDI",23,3.9305555555555598,{"$f":"IF(OR(AND(C591>=INDEX(Champ,MATCH(A591,Jour,0),3),C591<=INDEX(Champ,MATCH(A591,Jour,0),4)),AND(C591>=INDEX(Champ,MATCH(A591,Jour,0)+1,4),C591<=INDEX(Champ,MATCH(A591,Jour,0)+1,3))),\"occupé\",\"\")","v":""}]
["JEUDI",23,3.9375,{"$f":"IF(OR(AND(C592>=INDEX(Champ,MATCH(A592,Jour,0),3),C592<=INDEX(Champ,MATCH(A592,Jour,0),4)),AND(C592>=INDEX(Champ,MATCH(A592,Jour,0)+1,4),C592<=INDEX(Champ,MATCH(A592,Jour,0)+1,3))),\"occupé\",\"\")","v":""}]
["JEUDI",23,3.9444444444444402,{"$f":"IF(OR(AND(C593>=INDEX(Champ,MATCH(A593,Jour,0),3),C593<=INDEX(Champ,MATCH(A593,Jour,0),4)),AND(C593>=INDEX(Champ,MATCH(A593,Jour,0)+1,4),C593<=INDEX(Champ,MATCH(A593,Jour,0)+1,3))),\"occupé\",\"\")","v":""}]
["JEUDI",23,3.9513888888888902,{"$f":"IF(OR(AND(C594>=INDEX(Champ,MATCH(A594,Jour,0),3),C594<=INDEX(Champ,MATCH(A594,Jour,0),4)),AND(C594>=INDEX(Champ,MATCH(A594,Jour,0)+1,4),C594<=INDEX(Champ,MATCH(A594,Jour,0)+1,3))),\"occupé\",\"\")","v":""}]
["JEUDI",24,3.9583333333333299,{"$f":"IF(OR(AND(C595>=INDEX(Champ,MATCH(A595,Jour,0),3),C595<=INDEX(Champ,MATCH(A595,Jour,0),4)),AND(C595>=INDEX(Champ,MATCH(A595,Jour,0)+1,4),C595<=INDEX(Champ,MATCH(A595,Jour,0)+1,3))),\"occupé\",\"\")","v":""}]
["JEUDI",24,3.9652777777777799,{"$f":"IF(OR(AND(C596>=INDEX(Champ,MATCH(A596,Jour,0),3),C596<=INDEX(Champ,MATCH(A596,Jour,0),4)),AND(C596>=INDEX(Champ,MATCH(A596,Jour,0)+1,4),C596<=INDEX(Champ,MATCH(A596,Jour,0)+1,3))),\"occupé\",\"\")","v":""}]
["JEUDI",24,3.9722222222222201,{"$f":"IF(OR(AND(C597>=INDEX(Champ,MATCH(A597,Jour,0),3),C597<=INDEX(Champ,MATCH(A597,Jour,0),4)),AND(C597>=INDEX(Champ,MATCH(A597,Jour,0)+1,4),C597<=INDEX(Champ,MATCH(A597,Jour,0)+1,3))),\"occupé\",\"\")","v":""}]
["JEUDI",24,3.9791666666666701,{"$f":"IF(OR(AND(C598>=INDEX(Champ,MATCH(A598,Jour,0),3),C598<=INDEX(Champ,MATCH(A598,Jour,0),4)),AND(C598>=INDEX(Champ,MATCH(A598,Jour,0)+1,4),C598<=INDEX(Champ,MATCH(A598,Jour,0)+1,3))),\"occupé\",\"\")","v":""}]
["JEUDI",24,3.9861111111111098,{"$f":"IF(OR(AND(C599>=INDEX(Champ,MATCH(A599,Jour,0),3),C599<=INDEX(Champ,MATCH(A599,Jour,0),4)),AND(C599>=INDEX(Champ,MATCH(A599,Jour,0)+1,4),C599<=INDEX(Champ,MATCH(A599,Jour,0)+1,3))),\"occupé\",\"\")","v":""}]
["JEUDI",24,3.9930555555555598,{"$f":"IF(OR(AND(C600>=INDEX(Champ,MATCH(A600,Jour,0),3),C600<=INDEX(Champ,MATCH(A600,Jour,0),4)),AND(C600>=INDEX(Champ,MATCH(A600,Jour,0)+1,4),C600<=INDEX(Champ,MATCH(A600,Jour,0)+1,3))),\"occupé\",\"\")","v":""}]
["VENDREDI",1,4,{"$f":"IF(OR(AND(C601>=INDEX(Champ,MATCH(A601,Jour,0),3),C601<=INDEX(Champ,MATCH(A601,Jour,0),4)),AND(C601>=INDEX(Champ,MATCH(A601,Jour,0)+1,4),C601<=INDEX(Champ,MATCH(A601,Jour,0)+1,3))),\"occupé\",\"\")","v":""}]
["VENDREDI",1,4.0069444444444402,{"$f":"IF(OR(AND(C602>=INDEX(Champ,MATCH(A602,Jour,0),3),C602<=INDEX(Champ,MATCH(A602,Jour,0),4)),AND(C602>=INDEX(Champ,MATCH(A602,Jour,0)+1,4),C602<=INDEX(Champ,MATCH(A602,Jour,0)+1,3))),\"occupé\",\"\")","v":""}]
["VENDREDI",1,4.0138888888888902,{"$f":"IF(OR(AND(C603>=INDEX(Champ,MATCH(A603,Jour,0),3),C603<=INDEX(Champ,MATCH(A603,Jour,0),4)),AND(C603>=INDEX(Champ,MATCH(A603,Jour,0)+1,4),C603<=INDEX(Champ,MATCH(A603,Jour,0)+1,3))),\"occupé\",\"\")","v":""}]
["VENDREDI",1,4.0208333333333304,{"$f":"IF(OR(AND(C604>=INDEX(Champ,MATCH(A604,Jour,0),3),C604<=INDEX(Champ,MATCH(A604,Jour,0),4)),AND(C604>=INDEX(Champ,MATCH(A604,Jour,0)+1,4),C604<=INDEX(Champ,MATCH(A604,Jour,0)+1,3))),\"occupé\",\"\")","v":""}]
["VENDREDI",1,4.0277777777777803,{"$f":"IF(OR(AND(C605>=INDEX(Champ,MATCH(A605,Jour,0),3),C605<=INDEX(Champ,MATCH(A605,Jour,0),4)),AND(C605>=INDEX(Champ,MATCH(A605,Jour,0)+1,4),C605<=INDEX(Champ,MATCH(A605,Jour,0)+1,3))),\"occupé\",\"\")","v":""}]
["VENDREDI",1,4.0347222222222197,{"$f":"IF(OR(AND(C606>=INDEX(Champ,MATCH(A606,Jour,0),3),C606<=INDEX(Champ,MATCH(A606,Jour,0),4)),AND(C606>=INDEX(Champ,MATCH(A606,Jour,0)+1,4),C606<=INDEX(Champ,MATCH(A606,Jour,0)+1,3))),\"occupé\",\"\")","v":""}]
["VENDREDI",2,4.0416666666666696,{"$f":"IF(OR(AND(C607>=INDEX(Champ,MATCH(A607,Jour,0),3),C607<=INDEX(Champ,MATCH(A607,Jour,0),4)),AND(C607>=INDEX(Champ,MATCH(A607,Jour,0)+1,4),C607<=INDEX(Champ,MATCH(A607,Jour,0)+1,3))),\"occupé\",\"\")","v":""}]
["VENDREDI",2,4.0486111111111098,{"$f":"IF(OR(AND(C608>=INDEX(Champ,MATCH(A608,Jour,0),3),C608<=INDEX(Champ,MATCH(A608,Jour,0),4)),AND(C608>=INDEX(Champ,MATCH(A608,Jour,0)+1,4),C608<=INDEX(Champ,MATCH(A608,Jour,0)+1,3))),\"occupé\",\"\")","v":""}]
["VENDREDI",2,4.0555555555555598,{"$f":"IF(OR(AND(C609>=INDEX(Champ,MATCH(A609,Jour,0),3),C609<=INDEX(Champ,MATCH(A609,Jour,0),4)),AND(C609>=INDEX(Champ,MATCH(A609,Jour,0)+1,4),C609<=INDEX(Champ,MATCH(A609,Jour,0)+1,3))),\"occupé\",\"\")","v":""}]
["VENDREDI",2,4.0625,{"$f":"IF(OR(AND(C610>=INDEX(Champ,MATCH(A610,Jour,0),3),C610<=INDEX(Champ,MATCH(A610,Jour,0),4)),AND(C610>=INDEX(Champ,MATCH(A610,Jour,0)+1,4),C610<=INDEX(Champ,MATCH(A610,Jour,0)+1,3))),\"occupé\",\"\")","v":""}]
["VENDREDI",2,4.0694444444444402,{"$f":"IF(OR(AND(C611>=INDEX(Champ,MATCH(A611,Jour,0),3),C611<=INDEX(Champ,MATCH(A611,Jour,0),4)),AND(C611>=INDEX(Champ,MATCH(A611,Jour,0)+1,4),C611<=INDEX(Champ,MATCH(A611,Jour,0)+1,3))),\"occupé\",\"\")","v":""}]
["VENDREDI",2,4.0763888888888902,{"$f":"IF(OR(AND(C612>=INDEX(Champ,MATCH(A612,Jour,0),3),C612<=INDEX(Champ,MATCH(A612,Jour,0),4)),AND(C612>=INDEX(Champ,MATCH(A612,Jour,0)+1,4),C612<=INDEX(Champ,MATCH(A612,Jour,0)+1,3))),\"occupé\",\"\")","v":""}]
["VENDREDI",3,4.0833333333333304,{"$f":"IF(OR(AND(C613>=INDEX(Champ,MATCH(A613,Jour,0),3),C613<=INDEX(Champ,MATCH(A613,Jour,0),4)),AND(C613>=INDEX(Champ,MATCH(A613,Jour,0)+1,4),C613<=INDEX(Champ,MATCH(A613,Jour,0)+1,3))),\"occupé\",\"\")","v":""}]
["VENDREDI",3,4.0902777777777803,{"$f":"IF(OR(AND(C614>=INDEX(Champ,MATCH(A614,Jour,0),3),C614<=INDEX(Champ,MATCH(A614,Jour,0),4)),AND(C614>=INDEX(Champ,MATCH(A614,Jour,0)+1,4),C614<=INDEX(Champ,MATCH(A614,Jour,0)+1,3))),\"occupé\",\"\")","v":""}]
["VENDREDI",3,4.0972222222222197,{"$f":"IF(OR(AND(C615>=INDEX(Champ,MATCH(A615,Jour,0),3),C615<=INDEX(Champ,MATCH(A615,Jour,0),4)),AND(C615>=INDEX(Champ,MATCH(A615,Jour,0)+1,4),C615<=INDEX(Champ,MATCH(A615,Jour,0)+1,3))),\"occupé\",\"\")","v":""}]
["VENDREDI",3,4.1041666666666696,{"$f":"IF(OR(AND(C616>=INDEX(Champ,MATCH(A616,Jour,0),3),C616<=INDEX(Champ,MATCH(A616,Jour,0),4)),AND(C616>=INDEX(Champ,MATCH(A616,Jour,0)+1,4),C616<=INDEX(Champ,MATCH(A616,Jour,0)+1,3))),\"occupé\",\"\")","v":""}]
["VENDREDI",3,4.1111111111111098,{"$f":"IF(OR(AND(C617>=INDEX(Champ,MATCH(A617,Jour,0),3),C617<=INDEX(Champ,MATCH(A617,Jour,0),4)),AND(C617>=INDEX(Champ,MATCH(A617,Jour,0)+1,4),C617<=INDEX(Champ,MATCH(A617,Jour,0)+1,3))),\"occupé\",\"\")","v":""}]
["VENDREDI",3,4.1180555555555598,{"$f":"IF(OR(AND(C618>=INDEX(Champ,MATCH(A618,Jour,0),3),C618<=INDEX(Champ,MATCH(A618,Jour,0),4)),AND(C618>=INDEX(Champ,MATCH(A618,Jour,0)+1,4),C618<=INDEX(Champ,MATCH(A618,Jour,0)+1,3))),\"occupé\",\"\")","v":""}]
["VENDREDI",4,4.125,{"$f":"IF(OR(AND(C619>=INDEX(Champ,MATCH(A619,Jour,0),3),C619<=INDEX(Champ,MATCH(A619,Jour,0),4)),AND(C619>=INDEX(Champ,MATCH(A619,Jour,0)+1,4),C619<=INDEX(Champ,MATCH(A619,Jour,0)+1,3))),\"occupé\",\"\")","v":""}]
["VENDREDI",4,4.1319444444444402,{"$f":"IF(OR(AND(C620>=INDEX(Champ,MATCH(A620,Jour,0),3),C620<=INDEX(Champ,MATCH(A620,Jour,0),4)),AND(C620>=INDEX(Champ,MATCH(A620,Jour,0)+1,4),C620<=INDEX(Champ,MATCH(A620,Jour,0)+1,3))),\"occupé\",\"\")","v":""}]
["VENDREDI",4,4.1388888888888902,{"$f":"IF(OR(AND(C621>=INDEX(Champ,MATCH(A621,Jour,0),3),C621<=INDEX(Champ,MATCH(A621,Jour,0),4)),AND(C621>=INDEX(Champ,MATCH(A621,Jour,0)+1,4),C621<=INDEX(Champ,MATCH(A621,Jour,0)+1,3))),\"occupé\",\"\")","v":""}]
["VENDREDI",4,4.1458333333333304,{"$f":"IF(OR(AND(C622>=INDEX(Champ,MATCH(A622,Jour,0),3),C622<=INDEX(Champ,MATCH(A622,Jour,0),4)),AND(C622>=INDEX(Champ,MATCH(A622,Jour,0)+1,4),C622<=INDEX(Champ,MATCH(A622,Jour,0)+1,3))),\"occupé\",\"\")","v":""}]
["VENDREDI",4,4.1527777777777803,{"$f":"IF(OR(AND(C623>=INDEX(Champ,MATCH(A623,Jour,0),3),C623<=INDEX(Champ,MATCH(A623,Jour,0),4)),AND(C623>=INDEX(Champ,MATCH(A623,Jour,0)+1,4),C623<=INDEX(Champ,MATCH(A623,Jour,0)+1,3))),\"occupé\",\"\")","v":""}]
["VENDREDI",4,4.1597222222222197,{"$f":"IF(OR(AND(C624>=INDEX(Champ,MATCH(A624,Jour,0),3),C624<=INDEX(Champ,MATCH(A624,Jour,0),4)),AND(C624>=INDEX(Champ,MATCH(A624,Jour,0)+1,4),C624<=INDEX(Champ,MATCH(A624,Jour,0)+1,3))),\"occupé\",\"\")","v":""}]
["VENDREDI",5,4.1666666666666696,{"$f":"IF(OR(AND(C625>=INDEX(Champ,MATCH(A625,Jour,0),3),C625<=INDEX(Champ,MATCH(A625,Jour,0),4)),AND(C625>=INDEX(Champ,MATCH(A625,Jour,0)+1,4),C625<=INDEX(Champ,MATCH(A625,Jour,0)+1,3))),\"occupé\",\"\")","v":""}]
["VENDREDI",5,4.1736111111111098,{"$f":"IF(OR(AND(C626>=INDEX(Champ,MATCH(A626,Jour,0),3),C626<=INDEX(Champ,MATCH(A626,Jour,0),4)),AND(C626>=INDEX(Champ,MATCH(A626,Jour,0)+1,4),C626<=INDEX(Champ,MATCH(A626,Jour,0)+1,3))),\"occupé\",\"\")","v":""}]
["VENDREDI",5,4.1805555555555598,{"$f":"IF(OR(AND(C627>=INDEX(Champ,MATCH(A627,Jour,0),3),C627<=INDEX(Champ,MATCH(A627,Jour,0),4)),AND(C627>=INDEX(Champ,MATCH(A627,Jour,0)+1,4),C627<=INDEX(Champ,MATCH(A627,Jour,0)+1,3))),\"occupé\",\"\")","v":""}]
["VENDREDI",5,4.1875,{"$f":"IF(OR(AND(C628>=INDEX(Champ,MATCH(A628,Jour,0),3),C628<=INDEX(Champ,MATCH(A628,Jour,0),4)),AND(C628>=INDEX(Champ,MATCH(A628,Jour,0)+1,4),C628<=INDEX(Champ,MATCH(A628,Jour,0)+1,3))),\"occupé\",\"\")","v":""}]
["VENDREDI",5,4.1944444444444402,{"$f":"IF(OR(AND(C629>=INDEX(Champ,MATCH(A629,Jour,0),3),C629<=INDEX(Champ,MATCH(A629,Jour,0),4)),AND(C629>=INDEX(Champ,MATCH(A629,Jour,0)+1,4),C629<=INDEX(Champ,MATCH(A629,Jour,0)+1,3))),\"occupé\",\"\")","v":""}]
["VENDREDI",5,4.2013888888888902,{"$f":"IF(OR(AND(C630>=INDEX(Champ,MATCH(A630,Jour,0),3),C630<=INDEX(Champ,MATCH(A630,Jour,0),4)),AND(C630>=INDEX(Champ,MATCH(A630,Jour,0)+1,4),C630<=INDEX(Champ,MATCH(A630,Jour,0)+1,3))),\"occupé\",\"\")","v":""}]
["VENDREDI",6,4.2083333333333304,{"$f":"IF(OR(AND(C631>=INDEX(Champ,MATCH(A631,Jour,0),3),C631<=INDEX(Champ,MATCH(A631,Jour,0),4)),AND(C631>=INDEX(Champ,MATCH(A631,Jour,0)+1,4),C631<=INDEX(Champ,MATCH(A631,Jour,0)+1,3))),\"occupé\",\"\")","v":""}]
["VENDREDI",6,4.2152777777777803,{"$f":"IF(OR(AND(C632>=INDEX(Champ,MATCH(A632,Jour,0),3),C632<=INDEX(Champ,MATCH(A632,Jour,0),4)),AND(C632>=INDEX(Champ,MATCH(A632,Jour,0)+1,4),C632<=INDEX(Champ,MATCH(A632,Jour,0)+1,3))),\"occupé\",\"\")","v":""}]
["VENDREDI",6,4.2222222222222197,{"$f":"IF(OR(AND(C633>=INDEX(Champ,MATCH(A633,Jour,0),3),C633<=INDEX(Champ,MATCH(A633,Jour,0),4)),AND(C633>=INDEX(Champ,MATCH(A633,Jour,0)+1,4),C633<=INDEX(Champ,MATCH(A633,Jour,0)+1,3))),\"occupé\",\"\")","v":""}]
["VENDREDI",6,4.2291666666666696,{"$f":"IF(OR(AND(C634>=INDEX(Champ,MATCH(A634,Jour,0),3),C634<=INDEX(Champ,MATCH(A634,Jour,0),4)),AND(C634>=INDEX(Champ,MATCH(A634,Jour,0)+1,4),C634<=INDEX(Champ,MATCH(A634,Jour,0)+1,3))),\"occupé\",\"\")","v":""}]
["VENDREDI",6,4.2361111111111098,{"$f":"IF(OR(AND(C635>=INDEX(Champ,MATCH(A635,Jour,0),3),C635<=INDEX(Champ,MATCH(A635,Jour,0),4)),AND(C635>=INDEX(Champ,MATCH(A635,Jour,0)+1,4),C635<=INDEX(Champ,MATCH(A635,Jour,0)+1,3))),\"occupé\",\"\")","v":""}]
["VENDREDI",6,4.2430555555555598,{"$f":"IF(OR(AND(C636>=INDEX(Champ,MATCH(A636,Jour,0),3),C636<=INDEX(Champ,MATCH(A636,Jour,0),4)),AND(C636>=INDEX(Champ,MATCH(A636,Jour,0)+1,4),C636<=INDEX(Champ,MATCH(A636,Jour,0)+1,3))),\"occupé\",\"\")","v":""}]
["VENDREDI",7,4.25,{"$f":"IF(OR(AND(C637>=INDEX(Champ,MATCH(A637,Jour,0),3),C637<=INDEX(Champ,MATCH(A637,Jour,0),4)),AND(C637>=INDEX(Champ,MATCH(A637,Jour,0)+1,4),C637<=INDEX(Champ,MATCH(A637,Jour,0)+1,3))),\"occupé\",\"\")","v":""}]
["VENDREDI",7,4.2569444444444402,{"$f":"IF(OR(AND(C638>=INDEX(Champ,MATCH(A638,Jour,0),3),C638<=INDEX(Champ,MATCH(A638,Jour,0),4)),AND(C638>=INDEX(Champ,MATCH(A638,Jour,0)+1,4),C638<=INDEX(Champ,MATCH(A638,Jour,0)+1,3))),\"occupé\",\"\")","v":""}]
["VENDREDI",7,4.2638888888888902,{"$f":"IF(OR(AND(C639>=INDEX(Champ,MATCH(A639,Jour,0),3),C639<=INDEX(Champ,MATCH(A639,Jour,0),4)),AND(C639>=INDEX(Champ,MATCH(A639,Jour,0)+1,4),C639<=INDEX(Champ,MATCH(A639,Jour,0)+1,3))),\"occupé\",\"\")","v":""}]
["VENDREDI",7,4.2708333333333304,{"$f":"IF(OR(AND(C640>=INDEX(Champ,MATCH(A640,Jour,0),3),C640<=INDEX(Champ,MATCH(A640,Jour,0),4)),AND(C640>=INDEX(Champ,MATCH(A640,Jour,0)+1,4),C640<=INDEX(Champ,MATCH(A640,Jour,0)+1,3))),\"occupé\",\"\")","v":""}]
["VENDREDI",7,4.2777777777777803,{"$f":"IF(OR(AND(C641>=INDEX(Champ,MATCH(A641,Jour,0),3),C641<=INDEX(Champ,MATCH(A641,Jour,0),4)),AND(C641>=INDEX(Champ,MATCH(A641,Jour,0)+1,4),C641<=INDEX(Champ,MATCH(A641,Jour,0)+1,3))),\"occupé\",\"\")","v":""}]
["VENDREDI",7,4.2847222222222197,{"$f":"IF(OR(AND(C642>=INDEX(Champ,MATCH(A642,Jour,0),3),C642<=INDEX(Champ,MATCH(A642,Jour,0),4)),AND(C642>=INDEX(Champ,MATCH(A642,Jour,0)+1,4),C642<=INDEX(Champ,MATCH(A642,Jour,0)+1,3))),\"occupé\",\"\")","v":""}]
["VENDREDI",8,4.2916666666666696,{"$f":"IF(OR(AND(C643>=INDEX(Champ,MATCH(A643,Jour,0),3),C643<=INDEX(Champ,MATCH(A643,Jour,0),4)),AND(C643>=INDEX(Champ,MATCH(A643,Jour,0)+1,4),C643<=INDEX(Champ,MATCH(A643,Jour,0)+1,3))),\"occupé\",\"\")","v":""}]
["VENDREDI",8,4.2986111111111098,{"$f":"IF(OR(AND(C644>=INDEX(Champ,MATCH(A644,Jour,0),3),C644<=INDEX(Champ,MATCH(A644,Jour,0),4)),AND(C644>=INDEX(Champ,MATCH(A644,Jour,0)+1,4),C644<=INDEX(Champ,MATCH(A644,Jour,0)+1,3))),\"occupé\",\"\")","v":""}]
["VENDREDI",8,4.3055555555555598,{"$f":"IF(OR(AND(C645>=INDEX(Champ,MATCH(A645,Jour,0),3),C645<=INDEX(Champ,MATCH(A645,Jour,0),4)),AND(C645>=INDEX(Champ,MATCH(A645,Jour,0)+1,4),C645<=INDEX(Champ,MATCH(A645,Jour,0)+1,3))),\"occupé\",\"\")","v":""}]
["VENDREDI",8,4.3125,{"$f":"IF(OR(AND(C646>=INDEX(Champ,MATCH(A646,Jour,0),3),C646<=INDEX(Champ,MATCH(A646,Jour,0),4)),AND(C646>=INDEX(Champ,MATCH(A646,Jour,0)+1,4),C646<=INDEX(Champ,MATCH(A646,Jour,0)+1,3))),\"occupé\",\"\")","v":""}]
["VENDREDI",8,4.3194444444444402,{"$f":"IF(OR(AND(C647>=INDEX(Champ,MATCH(A647,Jour,0),3),C647<=INDEX(Champ,MATCH(A647,Jour,0),4)),AND(C647>=INDEX(Champ,MATCH(A647,Jour,0)+1,4),C647<=INDEX(Champ,MATCH(A647,Jour,0)+1,3))),\"occupé\",\"\")","v":""}]
["VENDREDI",8,4.3263888888888902,{"$f":"IF(OR(AND(C648>=INDEX(Champ,MATCH(A648,Jour,0),3),C648<=INDEX(Champ,MATCH(A648,Jour,0),4)),AND(C648>=INDEX(Champ,MATCH(A648,Jour,0)+1,4),C648<=INDEX(Champ,MATCH(A648,Jour,0)+1,3))),\"occupé\",\"\")","v":""}]
["VENDREDI",9,4.3333333333333304,{"$f":"IF(OR(AND(C649>=INDEX(Champ,MATCH(A649,Jour,0),3),C649<=INDEX(Champ,MATCH(A649,Jour,0),4)),AND(C649>=INDEX(Champ,MATCH(A649,Jour,0)+1,4),C649<=INDEX(Champ,MATCH(A649,Jour,0)+1,3))),\"occupé\",\"\")","v":""}]
["VENDREDI",9,4.3402777777777803,{"$f":"IF(OR(AND(C650>=INDEX(Champ,MATCH(A650,Jour,0),3),C650<=INDEX(Champ,MATCH(A650,Jour,0),4)),AND(C650>=INDEX(Champ,MATCH(A650,Jour,0)+1,4),C650<=INDEX(Champ,MATCH(A650,Jour,0)+1,3))),\"occupé\",\"\")","v":""}]
["VENDREDI",9,4.3472222222222197,{"$f":"IF(OR(AND(C651>=INDEX(Champ,MATCH(A651,Jour,0),3),C651<=INDEX(Champ,MATCH(A651,Jour,0),4)),AND(C651>=INDEX(Champ,MATCH(A651,Jour,0)+1,4),C651<=INDEX(Champ,MATCH(A651,Jour,0)+1,3))),\"occupé\",\"\")","v":""}]
["VENDREDI",9,4.3541666666666696,{"$f":"IF(OR(AND(C652>=INDEX(Champ,MATCH(A652,Jour,0),3),C652<=INDEX(Champ,MATCH(A652,Jour,0),4)),AND(C652>=INDEX(Champ,MATCH(A652,Jour,0)+1,4),C652<=INDEX(Champ,MATCH(A652,Jour,0)+1,3))),\"occupé\",\"\")","v":""}]
["VENDREDI",9,4.3611111111111098,{"$f":"IF(OR(AND(C653>=INDEX(Champ,MATCH(A653,Jour,0),3),C653<=INDEX(Champ,MATCH(A653,Jour,0),4)),AND(C653>=INDEX(Champ,MATCH(A653,Jour,0)+1,4),C653<=INDEX(Champ,MATCH(A653,Jour,0)+1,3))),\"occupé\",\"\")","v":""}]
["VENDREDI",9,4.3680555555555598,{"$f":"IF(OR(AND(C654>=INDEX(Champ,MATCH(A654,Jour,0),3),C654<=INDEX(Champ,MATCH(A654,Jour,0),4)),AND(C654>=INDEX(Champ,MATCH(A654,Jour,0)+1,4),C654<=INDEX(Champ,MATCH(A654,Jour,0)+1,3))),\"occupé\",\"\")","v":""}]
["VENDREDI",10,4.375,{"$f":"IF(OR(AND(C655>=INDEX(Champ,MATCH(A655,Jour,0),3),C655<=INDEX(Champ,MATCH(A655,Jour,0),4)),AND(C655>=INDEX(Champ,MATCH(A655,Jour,0)+1,4),C655<=INDEX(Champ,MATCH(A655,Jour,0)+1,3))),\"occupé\",\"\")","v":""}]
["VENDREDI",10,4.3819444444444402,{"$f":"IF(OR(AND(C656>=INDEX(Champ,MATCH(A656,Jour,0),3),C656<=INDEX(Champ,MATCH(A656,Jour,0),4)),AND(C656>=INDEX(Champ,MATCH(A656,Jour,0)+1,4),C656<=INDEX(Champ,MATCH(A656,Jour,0)+1,3))),\"occupé\",\"\")","v":""}]
["VENDREDI",10,4.3888888888888902,{"$f":"IF(OR(AND(C657>=INDEX(Champ,MATCH(A657,Jour,0),3),C657<=INDEX(Champ,MATCH(A657,Jour,0),4)),AND(C657>=INDEX(Champ,MATCH(A657,Jour,0)+1,4),C657<=INDEX(Champ,MATCH(A657,Jour,0)+1,3))),\"occupé\",\"\")","v":""}]
["VENDREDI",10,4.3958333333333304,{"$f":"IF(OR(AND(C658>=INDEX(Champ,MATCH(A658,Jour,0),3),C658<=INDEX(Champ,MATCH(A658,Jour,0),4)),AND(C658>=INDEX(Champ,MATCH(A658,Jour,0)+1,4),C658<=INDEX(Champ,MATCH(A658,Jour,0)+1,3))),\"occupé\",\"\")","v":""}]
["VENDREDI",10,4.4027777777777803,{"$f":"IF(OR(AND(C659>=INDEX(Champ,MATCH(A659,Jour,0),3),C659<=INDEX(Champ,MATCH(A659,Jour,0),4)),AND(C659>=INDEX(Champ,MATCH(A659,Jour,0)+1,4),C659<=INDEX(Champ,MATCH(A659,Jour,0)+1,3))),\"occupé\",\"\")","v":""}]
["VENDREDI",10,4.4097222222222197,{"$f":"IF(OR(AND(C660>=INDEX(Champ,MATCH(A660,Jour,0),3),C660<=INDEX(Champ,MATCH(A660,Jour,0),4)),AND(C660>=INDEX(Champ,MATCH(A660,Jour,0)+1,4),C660<=INDEX(Champ,MATCH(A660,Jour,0)+1,3))),\"occupé\",\"\")","v":""}]
["VENDREDI",11,4.4166666666666696,{"$f":"IF(OR(AND(C661>=INDEX(Champ,MATCH(A661,Jour,0),3),C661<=INDEX(Champ,MATCH(A661,Jour,0),4)),AND(C661>=INDEX(Champ,MATCH(A661,Jour,0)+1,4),C661<=INDEX(Champ,MATCH(A661,Jour,0)+1,3))),\"occupé\",\"\")","v":""}]
["VENDREDI",11,4.4236111111111098,{"$f":"IF(OR(AND(C662>=INDEX(Champ,MATCH(A662,Jour,0),3),C662<=INDEX(Champ,MATCH(A662,Jour,0),4)),AND(C662>=INDEX(Champ,MATCH(A662,Jour,0)+1,4),C662<=INDEX(Champ,MATCH(A662,Jour,0)+1,3))),\"occupé\",\"\")","v":""}]
["VENDREDI",11,4.4305555555555598,{"$f":"IF(OR(AND(C663>=INDEX(Champ,MATCH(A663,Jour,0),3),C663<=INDEX(Champ,MATCH(A663,Jour,0),4)),AND(C663>=INDEX(Champ,MATCH(A663,Jour,0)+1,4),C663<=INDEX(Champ,MATCH(A663,Jour,0)+1,3))),\"occupé\",\"\")","v":""}]
["VENDREDI",11,4.4375,{"$f":"IF(OR(AND(C664>=INDEX(Champ,MATCH(A664,Jour,0),3),C664<=INDEX(Champ,MATCH(A664,Jour,0),4)),AND(C664>=INDEX(Champ,MATCH(A664,Jour,0)+1,4),C664<=INDEX(Champ,MATCH(A664,Jour,0)+1,3))),\"occupé\",\"\")","v":""}]
["VENDREDI",11,4.4444444444444402,{"$f":"IF(OR(AND(C665>=INDEX(Champ,MATCH(A665,Jour,0),3),C665<=INDEX(Champ,MATCH(A665,Jour,0),4)),AND(C665>=INDEX(Champ,MATCH(A665,Jour,0)+1,4),C665<=INDEX(Champ,MATCH(A665,Jour,0)+1,3))),\"occupé\",\"\")","v":""}]
["VENDREDI",11,4.4513888888888902,{"$f":"IF(OR(AND(C666>=INDEX(Champ,MATCH(A666,Jour,0),3),C666<=INDEX(Champ,MATCH(A666,Jour,0),4)),AND(C666>=INDEX(Champ,MATCH(A666,Jour,0)+1,4),C666<=INDEX(Champ,MATCH(A666,Jour,0)+1,3))),\"occupé\",\"\")","v":""}]
["VENDREDI",12,4.4583333333333304,{"$f":"IF(OR(AND(C667>=INDEX(Champ,MATCH(A667,Jour,0),3),C667<=INDEX(Champ,MATCH(A667,Jour,0),4)),AND(C667>=INDEX(Champ,MATCH(A667,Jour,0)+1,4),C667<=INDEX(Champ,MATCH(A667,Jour,0)+1,3))),\"occupé\",\"\")","v":""}]
["VENDREDI",12,4.4652777777777803,{"$f":"IF(OR(AND(C668>=INDEX(Champ,MATCH(A668,Jour,0),3),C668<=INDEX(Champ,MATCH(A668,Jour,0),4)),AND(C668>=INDEX(Champ,MATCH(A668,Jour,0)+1,4),C668<=INDEX(Champ,MATCH(A668,Jour,0)+1,3))),\"occupé\",\"\")","v":""}]
["VENDREDI",12,4.4722222222222197,{"$f":"IF(OR(AND(C669>=INDEX(Champ,MATCH(A669,Jour,0),3),C669<=INDEX(Champ,MATCH(A669,Jour,0),4)),AND(C669>=INDEX(Champ,MATCH(A669,Jour,0)+1,4),C669<=INDEX(Champ,MATCH(A669,Jour,0)+1,3))),\"occupé\",\"\")","v":""}]
["VENDREDI",12,4.4791666666666696,{"$f":"IF(OR(AND(C670>=INDEX(Champ,MATCH(A670,Jour,0),3),C670<=INDEX(Champ,MATCH(A670,Jour,0),4)),AND(C670>=INDEX(Champ,MATCH(A670,Jour,0)+1,4),C670<=INDEX(Champ,MATCH(A670,Jour,0)+1,3))),\"occupé\",\"\")","v":""}]
["VENDREDI",12,4.4861111111111098,{"$f":"IF(OR(AND(C671>=INDEX(Champ,MATCH(A671,Jour,0),3),C671<=INDEX(Champ,MATCH(A671,Jour,0),4)),AND(C671>=INDEX(Champ,MATCH(A671,Jour,0)+1,4),C671<=INDEX(Champ,MATCH(A671,Jour,0)+1,3))),\"occupé\",\"\")","v":""}]
["VENDREDI",12,4.4930555555555598,{"$f":"IF(OR(AND(C672>=INDEX(Champ,MATCH(A672,Jour,0),3),C672<=INDEX(Champ,MATCH(A672,Jour,0),4)),AND(C672>=INDEX(Champ,MATCH(A672,Jour,0)+1,4),C672<=INDEX(Champ,MATCH(A672,Jour,0)+1,3))),\"occupé\",\"\")","v":""}]
["VENDREDI",13,4.5,{"$f":"IF(OR(AND(C673>=INDEX(Champ,MATCH(A673,Jour,0),3),C673<=INDEX(Champ,MATCH(A673,Jour,0),4)),AND(C673>=INDEX(Champ,MATCH(A673,Jour,0)+1,4),C673<=INDEX(Champ,MATCH(A673,Jour,0)+1,3))),\"occupé\",\"\")","v":""}]
["VENDREDI",13,4.5069444444444402,{"$f":"IF(OR(AND(C674>=INDEX(Champ,MATCH(A674,Jour,0),3),C674<=INDEX(Champ,MATCH(A674,Jour,0),4)),AND(C674>=INDEX(Champ,MATCH(A674,Jour,0)+1,4),C674<=INDEX(Champ,MATCH(A674,Jour,0)+1,3))),\"occupé\",\"\")","v":""}]
["VENDREDI",13,4.5138888888888902,{"$f":"IF(OR(AND(C675>=INDEX(Champ,MATCH(A675,Jour,0),3),C675<=INDEX(Champ,MATCH(A675,Jour,0),4)),AND(C675>=INDEX(Champ,MATCH(A675,Jour,0)+1,4),C675<=INDEX(Champ,MATCH(A675,Jour,0)+1,3))),\"occupé\",\"\")","v":""}]
["VENDREDI",13,4.5208333333333304,{"$f":"IF(OR(AND(C676>=INDEX(Champ,MATCH(A676,Jour,0),3),C676<=INDEX(Champ,MATCH(A676,Jour,0),4)),AND(C676>=INDEX(Champ,MATCH(A676,Jour,0)+1,4),C676<=INDEX(Champ,MATCH(A676,Jour,0)+1,3))),\"occupé\",\"\")","v":""}]
["VENDREDI",13,4.5277777777777803,{"$f":"IF(OR(AND(C677>=INDEX(Champ,MATCH(A677,Jour,0),3),C677<=INDEX(Champ,MATCH(A677,Jour,0),4)),AND(C677>=INDEX(Champ,MATCH(A677,Jour,0)+1,4),C677<=INDEX(Champ,MATCH(A677,Jour,0)+1,3))),\"occupé\",\"\")","v":""}]
["VENDREDI",13,4.5347222222222197,{"$f":"IF(OR(AND(C678>=INDEX(Champ,MATCH(A678,Jour,0),3),C678<=INDEX(Champ,MATCH(A678,Jour,0),4)),AND(C678>=INDEX(Champ,MATCH(A678,Jour,0)+1,4),C678<=INDEX(Champ,MATCH(A678,Jour,0)+1,3))),\"occupé\",\"\")","v":""}]
["VENDREDI",14,4.5416666666666696,{"$f":"IF(OR(AND(C679>=INDEX(Champ,MATCH(A679,Jour,0),3),C679<=INDEX(Champ,MATCH(A679,Jour,0),4)),AND(C679>=INDEX(Champ,MATCH(A679,Jour,0)+1,4),C679<=INDEX(Champ,MATCH(A679,Jour,0)+1,3))),\"occupé\",\"\")","v":""}]
["VENDREDI",14,4.5486111111111098,{"$f":"IF(OR(AND(C680>=INDEX(Champ,MATCH(A680,Jour,0),3),C680<=INDEX(Champ,MATCH(A680,Jour,0),4)),AND(C680>=INDEX(Champ,MATCH(A680,Jour,0)+1,4),C680<=INDEX(Champ,MATCH(A680,Jour,0)+1,3))),\"occupé\",\"\")","v":""}]
["VENDREDI",14,4.5555555555555598,{"$f":"IF(OR(AND(C681>=INDEX(Champ,MATCH(A681,Jour,0),3),C681<=INDEX(Champ,MATCH(A681,Jour,0),4)),AND(C681>=INDEX(Champ,MATCH(A681,Jour,0)+1,4),C681<=INDEX(Champ,MATCH(A681,Jour,0)+1,3))),\"occupé\",\"\")","v":""}]
["VENDREDI",14,4.5625,{"$f":"IF(OR(AND(C682>=INDEX(Champ,MATCH(A682,Jour,0),3),C682<=INDEX(Champ,MATCH(A682,Jour,0),4)),AND(C682>=INDEX(Champ,MATCH(A682,Jour,0)+1,4),C682<=INDEX(Champ,MATCH(A682,Jour,0)+1,3))),\"occupé\",\"\")","v":""}]
["VENDREDI",14,4.5694444444444402,{"$f":"IF(OR(AND(C683>=INDEX(Champ,MATCH(A683,Jour,0),3),C683<=INDEX(Champ,MATCH(A683,Jour,0),4)),AND(C683>=INDEX(Champ,MATCH(A683,Jour,0)+1,4),C683<=INDEX(Champ,MATCH(A683,Jour,0)+1,3))),\"occupé\",\"\")","v":""}]
["VENDREDI",14,4.5763888888888902,{"$f":"IF(OR(AND(C684>=INDEX(Champ,MATCH(A684,Jour,0),3),C684<=INDEX(Champ,MATCH(A684,Jour,0),4)),AND(C684>=INDEX(Champ,MATCH(A684,Jour,0)+1,4),C684<=INDEX(Champ,MATCH(A684,Jour,0)+1,3))),\"occupé\",\"\")","v":""}]
["VENDREDI",15,4.5833333333333304,{"$f":"IF(OR(AND(C685>=INDEX(Champ,MATCH(A685,Jour,0),3),C685<=INDEX(Champ,MATCH(A685,Jour,0),4)),AND(C685>=INDEX(Champ,MATCH(A685,Jour,0)+1,4),C685<=INDEX(Champ,MATCH(A685,Jour,0)+1,3))),\"occupé\",\"\")","v":""}]
["VENDREDI",15,4.5902777777777803,{"$f":"IF(OR(AND(C686>=INDEX(Champ,MATCH(A686,Jour,0),3),C686<=INDEX(Champ,MATCH(A686,Jour,0),4)),AND(C686>=INDEX(Champ,MATCH(A686,Jour,0)+1,4),C686<=INDEX(Champ,MATCH(A686,Jour,0)+1,3))),\"occupé\",\"\")","v":""}]
["VENDREDI",15,4.5972222222222197,{"$f":"IF(OR(AND(C687>=INDEX(Champ,MATCH(A687,Jour,0),3),C687<=INDEX(Champ,MATCH(A687,Jour,0),4)),AND(C687>=INDEX(Champ,MATCH(A687,Jour,0)+1,4),C687<=INDEX(Champ,MATCH(A687,Jour,0)+1,3))),\"occupé\",\"\")","v":""}]
["VENDREDI",15,4.6041666666666696,{"$f":"IF(OR(AND(C688>=INDEX(Champ,MATCH(A688,Jour,0),3),C688<=INDEX(Champ,MATCH(A688,Jour,0),4)),AND(C688>=INDEX(Champ,MATCH(A688,Jour,0)+1,4),C688<=INDEX(Champ,MATCH(A688,Jour,0)+1,3))),\"occupé\",\"\")","v":""}]
["VENDREDI",15,4.6111111111111098,{"$f":"IF(OR(AND(C689>=INDEX(Champ,MATCH(A689,Jour,0),3),C689<=INDEX(Champ,MATCH(A689,Jour,0),4)),AND(C689>=INDEX(Champ,MATCH(A689,Jour,0)+1,4),C689<=INDEX(Champ,MATCH(A689,Jour,0)+1,3))),\"occupé\",\"\")","v":""}]
["VENDREDI",15,4.6180555555555598,{"$f":"IF(OR(AND(C690>=INDEX(Champ,MATCH(A690,Jour,0),3),C690<=INDEX(Champ,MATCH(A690,Jour,0),4)),AND(C690>=INDEX(Champ,MATCH(A690,Jour,0)+1,4),C690<=INDEX(Champ,MATCH(A690,Jour,0)+1,3))),\"occupé\",\"\")","v":""}]
["VENDREDI",16,4.625,{"$f":"IF(OR(AND(C691>=INDEX(Champ,MATCH(A691,Jour,0),3),C691<=INDEX(Champ,MATCH(A691,Jour,0),4)),AND(C691>=INDEX(Champ,MATCH(A691,Jour,0)+1,4),C691<=INDEX(Champ,MATCH(A691,Jour,0)+1,3))),\"occupé\",\"\")","v":""}]
["VENDREDI",16,4.6319444444444402,{"$f":"IF(OR(AND(C692>=INDEX(Champ,MATCH(A692,Jour,0),3),C692<=INDEX(Champ,MATCH(A692,Jour,0),4)),AND(C692>=INDEX(Champ,MATCH(A692,Jour,0)+1,4),C692<=INDEX(Champ,MATCH(A692,Jour,0)+1,3))),\"occupé\",\"\")","v":""}]
["VENDREDI",16,4.6388888888888902,{"$f":"IF(OR(AND(C693>=INDEX(Champ,MATCH(A693,Jour,0),3),C693<=INDEX(Champ,MATCH(A693,Jour,0),4)),AND(C693>=INDEX(Champ,MATCH(A693,Jour,0)+1,4),C693<=INDEX(Champ,MATCH(A693,Jour,0)+1,3))),\"occupé\",\"\")","v":""}]
["VENDREDI",16,4.6458333333333304,{"$f":"IF(OR(AND(C694>=INDEX(Champ,MATCH(A694,Jour,0),3),C694<=INDEX(Champ,MATCH(A694,Jour,0),4)),AND(C694>=INDEX(Champ,MATCH(A694,Jour,0)+1,4),C694<=INDEX(Champ,MATCH(A694,Jour,0)+1,3))),\"occupé\",\"\")","v":""}]
["VENDREDI",16,4.6527777777777803,{"$f":"IF(OR(AND(C695>=INDEX(Champ,MATCH(A695,Jour,0),3),C695<=INDEX(Champ,MATCH(A695,Jour,0),4)),AND(C695>=INDEX(Champ,MATCH(A695,Jour,0)+1,4),C695<=INDEX(Champ,MATCH(A695,Jour,0)+1,3))),\"occupé\",\"\")","v":""}]
["VENDREDI",16,4.6597222222222197,{"$f":"IF(OR(AND(C696>=INDEX(Champ,MATCH(A696,Jour,0),3),C696<=INDEX(Champ,MATCH(A696,Jour,0),4)),AND(C696>=INDEX(Champ,MATCH(A696,Jour,0)+1,4),C696<=INDEX(Champ,MATCH(A696,Jour,0)+1,3))),\"occupé\",\"\")","v":""}]
["VENDREDI",17,4.6666666666666696,{"$f":"IF(OR(AND(C697>=INDEX(Champ,MATCH(A697,Jour,0),3),C697<=INDEX(Champ,MATCH(A697,Jour,0),4)),AND(C697>=INDEX(Champ,MATCH(A697,Jour,0)+1,4),C697<=INDEX(Champ,MATCH(A697,Jour,0)+1,3))),\"occupé\",\"\")","v":""}]
["VENDREDI",17,4.6736111111111098,{"$f":"IF(OR(AND(C698>=INDEX(Champ,MATCH(A698,Jour,0),3),C698<=INDEX(Champ,MATCH(A698,Jour,0),4)),AND(C698>=INDEX(Champ,MATCH(A698,Jour,0)+1,4),C698<=INDEX(Champ,MATCH(A698,Jour,0)+1,3))),\"occupé\",\"\")","v":""}]
["VENDREDI",17,4.6805555555555598,{"$f":"IF(OR(AND(C699>=INDEX(Champ,MATCH(A699,Jour,0),3),C699<=INDEX(Champ,MATCH(A699,Jour,0),4)),AND(C699>=INDEX(Champ,MATCH(A699,Jour,0)+1,4),C699<=INDEX(Champ,MATCH(A699,Jour,0)+1,3))),\"occupé\",\"\")","v":""}]
["VENDREDI",17,4.6875,{"$f":"IF(OR(AND(C700>=INDEX(Champ,MATCH(A700,Jour,0),3),C700<=INDEX(Champ,MATCH(A700,Jour,0),4)),AND(C700>=INDEX(Champ,MATCH(A700,Jour,0)+1,4),C700<=INDEX(Champ,MATCH(A700,Jour,0)+1,3))),\"occupé\",\"\")","v":""}]
["VENDREDI",17,4.6944444444444402,{"$f":"IF(OR(AND(C701>=INDEX(Champ,MATCH(A701,Jour,0),3),C701<=INDEX(Champ,MATCH(A701,Jour,0),4)),AND(C701>=INDEX(Champ,MATCH(A701,Jour,0)+1,4),C701<=INDEX(Champ,MATCH(A701,Jour,0)+1,3))),\"occupé\",\"\")","v":""}]
["VENDREDI",17,4.7013888888888902,{"$f":"IF(OR(AND(C702>=INDEX(Champ,MATCH(A702,Jour,0),3),C702<=INDEX(Champ,MATCH(A702,Jour,0),4)),AND(C702>=INDEX(Champ,MATCH(A702,Jour,0)+1,4),C702<=INDEX(Champ,MATCH(A702,Jour,0)+1,3))),\"occupé\",\"\")","v":""}]
["VENDREDI",18,4.7083333333333304,{"$f":"IF(OR(AND(C703>=INDEX(Champ,MATCH(A703,Jour,0),3),C703<=INDEX(Champ,MATCH(A703,Jour,0),4)),AND(C703>=INDEX(Champ,MATCH(A703,Jour,0)+1,4),C703<=INDEX(Champ,MATCH(A703,Jour,0)+1,3))),\"occupé\",\"\")","v":""}]
["VENDREDI",18,4.7152777777777803,{"$f":"IF(OR(AND(C704>=INDEX(Champ,MATCH(A704,Jour,0),3),C704<=INDEX(Champ,MATCH(A704,Jour,0),4)),AND(C704>=INDEX(Champ,MATCH(A704,Jour,0)+1,4),C704<=INDEX(Champ,MATCH(A704,Jour,0)+1,3))),\"occupé\",\"\")","v":""}]
["VENDREDI",18,4.7222222222222197,{"$f":"IF(OR(AND(C705>=INDEX(Champ,MATCH(A705,Jour,0),3),C705<=INDEX(Champ,MATCH(A705,Jour,0),4)),AND(C705>=INDEX(Champ,MATCH(A705,Jour,0)+1,4),C705<=INDEX(Champ,MATCH(A705,Jour,0)+1,3))),\"occupé\",\"\")","v":""}]
["VENDREDI",18,4.7291666666666696,{"$f":"IF(OR(AND(C706>=INDEX(Champ,MATCH(A706,Jour,0),3),C706<=INDEX(Champ,MATCH(A706,Jour,0),4)),AND(C706>=INDEX(Champ,MATCH(A706,Jour,0)+1,4),C706<=INDEX(Champ,MATCH(A706,Jour,0)+1,3))),\"occupé\",\"\")","v":""}]
["VENDREDI",18,4.7361111111111098,{"$f":"IF(OR(AND(C707>=INDEX(Champ,MATCH(A707,Jour,0),3),C707<=INDEX(Champ,MATCH(A707,Jour,0),4)),AND(C707>=INDEX(Champ,MATCH(A707,Jour,0)+1,4),C707<=INDEX(Champ,MATCH(A707,Jour,0)+1,3))),\"occupé\",\"\")","v":""}]
["VENDREDI",18,4.7430555555555598,{"$f":"IF(OR(AND(C708>=INDEX(Champ,MATCH(A708,Jour,0),3),C708<=INDEX(Champ,MATCH(A708,Jour,0),4)),AND(C708>=INDEX(Champ,MATCH(A708,Jour,0)+1,4),C708<=INDEX(Champ,MATCH(A708,Jour,0)+1,3))),\"occupé\",\"\")","v":""}]
["VENDREDI",19,4.75,{"$f":"IF(OR(AND(C709>=INDEX(Champ,MATCH(A709,Jour,0),3),C709<=INDEX(Champ,MATCH(A709,Jour,0),4)),AND(C709>=INDEX(Champ,MATCH(A709,Jour,0)+1,4),C709<=INDEX(Champ,MATCH(A709,Jour,0)+1,3))),\"occupé\",\"\")","v":""}]
["VENDREDI",19,4.7569444444444402,{"$f":"IF(OR(AND(C710>=INDEX(Champ,MATCH(A710,Jour,0),3),C710<=INDEX(Champ,MATCH(A710,Jour,0),4)),AND(C710>=INDEX(Champ,MATCH(A710,Jour,0)+1,4),C710<=INDEX(Champ,MATCH(A710,Jour,0)+1,3))),\"occupé\",\"\")","v":""}]
["VENDREDI",19,4.7638888888888902,{"$f":"IF(OR(AND(C711>=INDEX(Champ,MATCH(A711,Jour,0),3),C711<=INDEX(Champ,MATCH(A711,Jour,0),4)),AND(C711>=INDEX(Champ,MATCH(A711,Jour,0)+1,4),C711<=INDEX(Champ,MATCH(A711,Jour,0)+1,3))),\"occupé\",\"\")","v":""}]
["VENDREDI",19,4.7708333333333304,{"$f":"IF(OR(AND(C712>=INDEX(Champ,MATCH(A712,Jour,0),3),C712<=INDEX(Champ,MATCH(A712,Jour,0),4)),AND(C712>=INDEX(Champ,MATCH(A712,Jour,0)+1,4),C712<=INDEX(Champ,MATCH(A712,Jour,0)+1,3))),\"occupé\",\"\")","v":""}]
["VENDREDI",19,4.7777777777777803,{"$f":"IF(OR(AND(C713>=INDEX(Champ,MATCH(A713,Jour,0),3),C713<=INDEX(Champ,MATCH(A713,Jour,0),4)),AND(C713>=INDEX(Champ,MATCH(A713,Jour,0)+1,4),C713<=INDEX(Champ,MATCH(A713,Jour,0)+1,3))),\"occupé\",\"\")","v":""}]
["VENDREDI",19,4.7847222222222197,{"$f":"IF(OR(AND(C714>=INDEX(Champ,MATCH(A714,Jour,0),3),C714<=INDEX(Champ,MATCH(A714,Jour,0),4)),AND(C714>=INDEX(Champ,MATCH(A714,Jour,0)+1,4),C714<=INDEX(Champ,MATCH(A714,Jour,0)+1,3))),\"occupé\",\"\")","v":""}]
["VENDREDI",20,4.7916666666666696,{"$f":"IF(OR(AND(C715>=INDEX(Champ,MATCH(A715,Jour,0),3),C715<=INDEX(Champ,MATCH(A715,Jour,0),4)),AND(C715>=INDEX(Champ,MATCH(A715,Jour,0)+1,4),C715<=INDEX(Champ,MATCH(A715,Jour,0)+1,3))),\"occupé\",\"\")","v":""}]
["VENDREDI",20,4.7986111111111098,{"$f":"IF(OR(AND(C716>=INDEX(Champ,MATCH(A716,Jour,0),3),C716<=INDEX(Champ,MATCH(A716,Jour,0),4)),AND(C716>=INDEX(Champ,MATCH(A716,Jour,0)+1,4),C716<=INDEX(Champ,MATCH(A716,Jour,0)+1,3))),\"occupé\",\"\")","v":""}]
["VENDREDI",20,4.8055555555555598,{"$f":"IF(OR(AND(C717>=INDEX(Champ,MATCH(A717,Jour,0),3),C717<=INDEX(Champ,MATCH(A717,Jour,0),4)),AND(C717>=INDEX(Champ,MATCH(A717,Jour,0)+1,4),C717<=INDEX(Champ,MATCH(A717,Jour,0)+1,3))),\"occupé\",\"\")","v":""}]
["VENDREDI",20,4.8125,{"$f":"IF(OR(AND(C718>=INDEX(Champ,MATCH(A718,Jour,0),3),C718<=INDEX(Champ,MATCH(A718,Jour,0),4)),AND(C718>=INDEX(Champ,MATCH(A718,Jour,0)+1,4),C718<=INDEX(Champ,MATCH(A718,Jour,0)+1,3))),\"occupé\",\"\")","v":""}]
["VENDREDI",20,4.8194444444444402,{"$f":"IF(OR(AND(C719>=INDEX(Champ,MATCH(A719,Jour,0),3),C719<=INDEX(Champ,MATCH(A719,Jour,0),4)),AND(C719>=INDEX(Champ,MATCH(A719,Jour,0)+1,4),C719<=INDEX(Champ,MATCH(A719,Jour,0)+1,3))),\"occupé\",\"\")","v":""}]
["VENDREDI",20,4.8263888888888902,{"$f":"IF(OR(AND(C720>=INDEX(Champ,MATCH(A720,Jour,0),3),C720<=INDEX(Champ,MATCH(A720,Jour,0),4)),AND(C720>=INDEX(Champ,MATCH(A720,Jour,0)+1,4),C720<=INDEX(Champ,MATCH(A720,Jour,0)+1,3))),\"occupé\",\"\")","v":""}]
["VENDREDI",21,4.8333333333333304,{"$f":"IF(OR(AND(C721>=INDEX(Champ,MATCH(A721,Jour,0),3),C721<=INDEX(Champ,MATCH(A721,Jour,0),4)),AND(C721>=INDEX(Champ,MATCH(A721,Jour,0)+1,4),C721<=INDEX(Champ,MATCH(A721,Jour,0)+1,3))),\"occupé\",\"\")","v":""}]
["VENDREDI",21,4.8402777777777803,{"$f":"IF(OR(AND(C722>=INDEX(Champ,MATCH(A722,Jour,0),3),C722<=INDEX(Champ,MATCH(A722,Jour,0),4)),AND(C722>=INDEX(Champ,MATCH(A722,Jour,0)+1,4),C722<=INDEX(Champ,MATCH(A722,Jour,0)+1,3))),\"occupé\",\"\")","v":""}]
["VENDREDI",21,4.8472222222222197,{"$f":"IF(OR(AND(C723>=INDEX(Champ,MATCH(A723,Jour,0),3),C723<=INDEX(Champ,MATCH(A723,Jour,0),4)),AND(C723>=INDEX(Champ,MATCH(A723,Jour,0)+1,4),C723<=INDEX(Champ,MATCH(A723,Jour,0)+1,3))),\"occupé\",\"\")","v":""}]
["VENDREDI",21,4.8541666666666696,{"$f":"IF(OR(AND(C724>=INDEX(Champ,MATCH(A724,Jour,0),3),C724<=INDEX(Champ,MATCH(A724,Jour,0),4)),AND(C724>=INDEX(Champ,MATCH(A724,Jour,0)+1,4),C724<=INDEX(Champ,MATCH(A724,Jour,0)+1,3))),\"occupé\",\"\")","v":""}]
["VENDREDI",21,4.8611111111111098,{"$f":"IF(OR(AND(C725>=INDEX(Champ,MATCH(A725,Jour,0),3),C725<=INDEX(Champ,MATCH(A725,Jour,0),4)),AND(C725>=INDEX(Champ,MATCH(A725,Jour,0)+1,4),C725<=INDEX(Champ,MATCH(A725,Jour,0)+1,3))),\"occupé\",\"\")","v":""}]
["VENDREDI",21,4.8680555555555598,{"$f":"IF(OR(AND(C726>=INDEX(Champ,MATCH(A726,Jour,0),3),C726<=INDEX(Champ,MATCH(A726,Jour,0),4)),AND(C726>=INDEX(Champ,MATCH(A726,Jour,0)+1,4),C726<=INDEX(Champ,MATCH(A726,Jour,0)+1,3))),\"occupé\",\"\")","v":""}]
["VENDREDI",22,4.875,{"$f":"IF(OR(AND(C727>=INDEX(Champ,MATCH(A727,Jour,0),3),C727<=INDEX(Champ,MATCH(A727,Jour,0),4)),AND(C727>=INDEX(Champ,MATCH(A727,Jour,0)+1,4),C727<=INDEX(Champ,MATCH(A727,Jour,0)+1,3))),\"occupé\",\"\")","v":""}]
["VENDREDI",22,4.8819444444444402,{"$f":"IF(OR(AND(C728>=INDEX(Champ,MATCH(A728,Jour,0),3),C728<=INDEX(Champ,MATCH(A728,Jour,0),4)),AND(C728>=INDEX(Champ,MATCH(A728,Jour,0)+1,4),C728<=INDEX(Champ,MATCH(A728,Jour,0)+1,3))),\"occupé\",\"\")","v":""}]
["VENDREDI",22,4.8888888888888902,{"$f":"IF(OR(AND(C729>=INDEX(Champ,MATCH(A729,Jour,0),3),C729<=INDEX(Champ,MATCH(A729,Jour,0),4)),AND(C729>=INDEX(Champ,MATCH(A729,Jour,0)+1,4),C729<=INDEX(Champ,MATCH(A729,Jour,0)+1,3))),\"occupé\",\"\")","v":""}]
["VENDREDI",22,4.8958333333333304,{"$f":"IF(OR(AND(C730>=INDEX(Champ,MATCH(A730,Jour,0),3),C730<=INDEX(Champ,MATCH(A730,Jour,0),4)),AND(C730>=INDEX(Champ,MATCH(A730,Jour,0)+1,4),C730<=INDEX(Champ,MATCH(A730,Jour,0)+1,3))),\"occupé\",\"\")","v":""}]
["VENDREDI",22,4.9027777777777803,{"$f":"IF(OR(AND(C731>=INDEX(Champ,MATCH(A731,Jour,0),3),C731<=INDEX(Champ,MATCH(A731,Jour,0),4)),AND(C731>=INDEX(Champ,MATCH(A731,Jour,0)+1,4),C731<=INDEX(Champ,MATCH(A731,Jour,0)+1,3))),\"occupé\",\"\")","v":""}]
["VENDREDI",22,4.9097222222222197,{"$f":"IF(OR(AND(C732>=INDEX(Champ,MATCH(A732,Jour,0),3),C732<=INDEX(Champ,MATCH(A732,Jour,0),4)),AND(C732>=INDEX(Champ,MATCH(A732,Jour,0)+1,4),C732<=INDEX(Champ,MATCH(A732,Jour,0)+1,3))),\"occupé\",\"\")","v":""}]
["VENDREDI",23,4.9166666666666696,{"$f":"IF(OR(AND(C733>=INDEX(Champ,MATCH(A733,Jour,0),3),C733<=INDEX(Champ,MATCH(A733,Jour,0),4)),AND(C733>=INDEX(Champ,MATCH(A733,Jour,0)+1,4),C733<=INDEX(Champ,MATCH(A733,Jour,0)+1,3))),\"occupé\",\"\")","v":""}]
["VENDREDI",23,4.9236111111111098,{"$f":"IF(OR(AND(C734>=INDEX(Champ,MATCH(A734,Jour,0),3),C734<=INDEX(Champ,MATCH(A734,Jour,0),4)),AND(C734>=INDEX(Champ,MATCH(A734,Jour,0)+1,4),C734<=INDEX(Champ,MATCH(A734,Jour,0)+1,3))),\"occupé\",\"\")","v":""}]
["VENDREDI",23,4.9305555555555598,{"$f":"IF(OR(AND(C735>=INDEX(Champ,MATCH(A735,Jour,0),3),C735<=INDEX(Champ,MATCH(A735,Jour,0),4)),AND(C735>=INDEX(Champ,MATCH(A735,Jour,0)+1,4),C735<=INDEX(Champ,MATCH(A735,Jour,0)+1,3))),\"occupé\",\"\")","v":""}]
["VENDREDI",23,4.9375,{"$f":"IF(OR(AND(C736>=INDEX(Champ,MATCH(A736,Jour,0),3),C736<=INDEX(Champ,MATCH(A736,Jour,0),4)),AND(C736>=INDEX(Champ,MATCH(A736,Jour,0)+1,4),C736<=INDEX(Champ,MATCH(A736,Jour,0)+1,3))),\"occupé\",\"\")","v":""}]
["VENDREDI",23,4.9444444444444402,{"$f":"IF(OR(AND(C737>=INDEX(Champ,MATCH(A737,Jour,0),3),C737<=INDEX(Champ,MATCH(A737,Jour,0),4)),AND(C737>=INDEX(Champ,MATCH(A737,Jour,0)+1,4),C737<=INDEX(Champ,MATCH(A737,Jour,0)+1,3))),\"occupé\",\"\")","v":""}]
["VENDREDI",23,4.9513888888888902,{"$f":"IF(OR(AND(C738>=INDEX(Champ,MATCH(A738,Jour,0),3),C738<=INDEX(Champ,MATCH(A738,Jour,0),4)),AND(C738>=INDEX(Champ,MATCH(A738,Jour,0)+1,4),C738<=INDEX(Champ,MATCH(A738,Jour,0)+1,3))),\"occupé\",\"\")","v":""}]
["VENDREDI",24,4.9583333333333304,{"$f":"IF(OR(AND(C739>=INDEX(Champ,MATCH(A739,Jour,0),3),C739<=INDEX(Champ,MATCH(A739,Jour,0),4)),AND(C739>=INDEX(Champ,MATCH(A739,Jour,0)+1,4),C739<=INDEX(Champ,MATCH(A739,Jour,0)+1,3))),\"occupé\",\"\")","v":""}]
["VENDREDI",24,4.9652777777777803,{"$f":"IF(OR(AND(C740>=INDEX(Champ,MATCH(A740,Jour,0),3),C740<=INDEX(Champ,MATCH(A740,Jour,0),4)),AND(C740>=INDEX(Champ,MATCH(A740,Jour,0)+1,4),C740<=INDEX(Champ,MATCH(A740,Jour,0)+1,3))),\"occupé\",\"\")","v":""}]
["VENDREDI",24,4.9722222222222197,{"$f":"IF(OR(AND(C741>=INDEX(Champ,MATCH(A741,Jour,0),3),C741<=INDEX(Champ,MATCH(A741,Jour,0),4)),AND(C741>=INDEX(Champ,MATCH(A741,Jour,0)+1,4),C741<=INDEX(Champ,MATCH(A741,Jour,0)+1,3))),\"occupé\",\"\")","v":""}]
["VENDREDI",24,4.9791666666666696,{"$f":"IF(OR(AND(C742>=INDEX(Champ,MATCH(A742,Jour,0),3),C742<=INDEX(Champ,MATCH(A742,Jour,0),4)),AND(C742>=INDEX(Champ,MATCH(A742,Jour,0)+1,4),C742<=INDEX(Champ,MATCH(A742,Jour,0)+1,3))),\"occupé\",\"\")","v":""}]
["VENDREDI",24,4.9861111111111098,{"$f":"IF(OR(AND(C743>=INDEX(Champ,MATCH(A743,Jour,0),3),C743<=INDEX(Champ,MATCH(A743,Jour,0),4)),AND(C743>=INDEX(Champ,MATCH(A743,Jour,0)+1,4),C743<=INDEX(Champ,MATCH(A743,Jour,0)+1,3))),\"occupé\",\"\")","v":""}]
["VENDREDI",24,4.9930555555555598,{"$f":"IF(OR(AND(C744>=INDEX(Champ,MATCH(A744,Jour,0),3),C744<=INDEX(Champ,MATCH(A744,Jour,0),4)),AND(C744>=INDEX(Champ,MATCH(A744,Jour,0)+1,4),C744<=INDEX(Champ,MATCH(A744,Jour,0)+1,3))),\"occupé\",\"\")","v":""}]
["SAMEDI",1,5,{"$f":"IF(OR(AND(C745>=INDEX(Champ,MATCH(A745,Jour,0),3),C745<=INDEX(Champ,MATCH(A745,Jour,0),4)),AND(C745>=INDEX(Champ,MATCH(A745,Jour,0)+1,4),C745<=INDEX(Champ,MATCH(A745,Jour,0)+1,3))),\"occupé\",\"\")","v":""}]
["SAMEDI",1,5.0069444444444402,{"$f":"IF(OR(AND(C746>=INDEX(Champ,MATCH(A746,Jour,0),3),C746<=INDEX(Champ,MATCH(A746,Jour,0),4)),AND(C746>=INDEX(Champ,MATCH(A746,Jour,0)+1,4),C746<=INDEX(Champ,MATCH(A746,Jour,0)+1,3))),\"occupé\",\"\")","v":""}]
["SAMEDI",1,5.0138888888888902,{"$f":"IF(OR(AND(C747>=INDEX(Champ,MATCH(A747,Jour,0),3),C747<=INDEX(Champ,MATCH(A747,Jour,0),4)),AND(C747>=INDEX(Champ,MATCH(A747,Jour,0)+1,4),C747<=INDEX(Champ,MATCH(A747,Jour,0)+1,3))),\"occupé\",\"\")","v":""}]
["SAMEDI",1,5.0208333333333304,{"$f":"IF(OR(AND(C748>=INDEX(Champ,MATCH(A748,Jour,0),3),C748<=INDEX(Champ,MATCH(A748,Jour,0),4)),AND(C748>=INDEX(Champ,MATCH(A748,Jour,0)+1,4),C748<=INDEX(Champ,MATCH(A748,Jour,0)+1,3))),\"occupé\",\"\")","v":""}]
["SAMEDI",1,5.0277777777777803,{"$f":"IF(OR(AND(C749>=INDEX(Champ,MATCH(A749,Jour,0),3),C749<=INDEX(Champ,MATCH(A749,Jour,0),4)),AND(C749>=INDEX(Champ,MATCH(A749,Jour,0)+1,4),C749<=INDEX(Champ,MATCH(A749,Jour,0)+1,3))),\"occupé\",\"\")","v":""}]
["SAMEDI",1,5.0347222222222197,{"$f":"IF(OR(AND(C750>=INDEX(Champ,MATCH(A750,Jour,0),3),C750<=INDEX(Champ,MATCH(A750,Jour,0),4)),AND(C750>=INDEX(Champ,MATCH(A750,Jour,0)+1,4),C750<=INDEX(Champ,MATCH(A750,Jour,0)+1,3))),\"occupé\",\"\")","v":""}]
["SAMEDI",2,5.0416666666666696,{"$f":"IF(OR(AND(C751>=INDEX(Champ,MATCH(A751,Jour,0),3),C751<=INDEX(Champ,MATCH(A751,Jour,0),4)),AND(C751>=INDEX(Champ,MATCH(A751,Jour,0)+1,4),C751<=INDEX(Champ,MATCH(A751,Jour,0)+1,3))),\"occupé\",\"\")","v":""}]
["SAMEDI",2,5.0486111111111098,{"$f":"IF(OR(AND(C752>=INDEX(Champ,MATCH(A752,Jour,0),3),C752<=INDEX(Champ,MATCH(A752,Jour,0),4)),AND(C752>=INDEX(Champ,MATCH(A752,Jour,0)+1,4),C752<=INDEX(Champ,MATCH(A752,Jour,0)+1,3))),\"occupé\",\"\")","v":""}]
["SAMEDI",2,5.0555555555555598,{"$f":"IF(OR(AND(C753>=INDEX(Champ,MATCH(A753,Jour,0),3),C753<=INDEX(Champ,MATCH(A753,Jour,0),4)),AND(C753>=INDEX(Champ,MATCH(A753,Jour,0)+1,4),C753<=INDEX(Champ,MATCH(A753,Jour,0)+1,3))),\"occupé\",\"\")","v":""}]
["SAMEDI",2,5.0625,{"$f":"IF(OR(AND(C754>=INDEX(Champ,MATCH(A754,Jour,0),3),C754<=INDEX(Champ,MATCH(A754,Jour,0),4)),AND(C754>=INDEX(Champ,MATCH(A754,Jour,0)+1,4),C754<=INDEX(Champ,MATCH(A754,Jour,0)+1,3))),\"occupé\",\"\")","v":""}]
["SAMEDI",2,5.0694444444444402,{"$f":"IF(OR(AND(C755>=INDEX(Champ,MATCH(A755,Jour,0),3),C755<=INDEX(Champ,MATCH(A755,Jour,0),4)),AND(C755>=INDEX(Champ,MATCH(A755,Jour,0)+1,4),C755<=INDEX(Champ,MATCH(A755,Jour,0)+1,3))),\"occupé\",\"\")","v":""}]
["SAMEDI",2,5.0763888888888902,{"$f":"IF(OR(AND(C756>=INDEX(Champ,MATCH(A756,Jour,0),3),C756<=INDEX(Champ,MATCH(A756,Jour,0),4)),AND(C756>=INDEX(Champ,MATCH(A756,Jour,0)+1,4),C756<=INDEX(Champ,MATCH(A756,Jour,0)+1,3))),\"occupé\",\"\")","v":""}]
["SAMEDI",3,5.0833333333333304,{"$f":"IF(OR(AND(C757>=INDEX(Champ,MATCH(A757,Jour,0),3),C757<=INDEX(Champ,MATCH(A757,Jour,0),4)),AND(C757>=INDEX(Champ,MATCH(A757,Jour,0)+1,4),C757<=INDEX(Champ,MATCH(A757,Jour,0)+1,3))),\"occupé\",\"\")","v":""}]
["SAMEDI",3,5.0902777777777803,{"$f":"IF(OR(AND(C758>=INDEX(Champ,MATCH(A758,Jour,0),3),C758<=INDEX(Champ,MATCH(A758,Jour,0),4)),AND(C758>=INDEX(Champ,MATCH(A758,Jour,0)+1,4),C758<=INDEX(Champ,MATCH(A758,Jour,0)+1,3))),\"occupé\",\"\")","v":""}]
["SAMEDI",3,5.0972222222222197,{"$f":"IF(OR(AND(C759>=INDEX(Champ,MATCH(A759,Jour,0),3),C759<=INDEX(Champ,MATCH(A759,Jour,0),4)),AND(C759>=INDEX(Champ,MATCH(A759,Jour,0)+1,4),C759<=INDEX(Champ,MATCH(A759,Jour,0)+1,3))),\"occupé\",\"\")","v":""}]
["SAMEDI",3,5.1041666666666696,{"$f":"IF(OR(AND(C760>=INDEX(Champ,MATCH(A760,Jour,0),3),C760<=INDEX(Champ,MATCH(A760,Jour,0),4)),AND(C760>=INDEX(Champ,MATCH(A760,Jour,0)+1,4),C760<=INDEX(Champ,MATCH(A760,Jour,0)+1,3))),\"occupé\",\"\")","v":""}]
["SAMEDI",3,5.1111111111111098,{"$f":"IF(OR(AND(C761>=INDEX(Champ,MATCH(A761,Jour,0),3),C761<=INDEX(Champ,MATCH(A761,Jour,0),4)),AND(C761>=INDEX(Champ,MATCH(A761,Jour,0)+1,4),C761<=INDEX(Champ,MATCH(A761,Jour,0)+1,3))),\"occupé\",\"\")","v":""}]
["SAMEDI",3,5.1180555555555598,{"$f":"IF(OR(AND(C762>=INDEX(Champ,MATCH(A762,Jour,0),3),C762<=INDEX(Champ,MATCH(A762,Jour,0),4)),AND(C762>=INDEX(Champ,MATCH(A762,Jour,0)+1,4),C762<=INDEX(Champ,MATCH(A762,Jour,0)+1,3))),\"occupé\",\"\")","v":""}]
["SAMEDI",4,5.125,{"$f":"IF(OR(AND(C763>=INDEX(Champ,MATCH(A763,Jour,0),3),C763<=INDEX(Champ,MATCH(A763,Jour,0),4)),AND(C763>=INDEX(Champ,MATCH(A763,Jour,0)+1,4),C763<=INDEX(Champ,MATCH(A763,Jour,0)+1,3))),\"occupé\",\"\")","v":""}]
["SAMEDI",4,5.1319444444444402,{"$f":"IF(OR(AND(C764>=INDEX(Champ,MATCH(A764,Jour,0),3),C764<=INDEX(Champ,MATCH(A764,Jour,0),4)),AND(C764>=INDEX(Champ,MATCH(A764,Jour,0)+1,4),C764<=INDEX(Champ,MATCH(A764,Jour,0)+1,3))),\"occupé\",\"\")","v":""}]
["SAMEDI",4,5.1388888888888902,{"$f":"IF(OR(AND(C765>=INDEX(Champ,MATCH(A765,Jour,0),3),C765<=INDEX(Champ,MATCH(A765,Jour,0),4)),AND(C765>=INDEX(Champ,MATCH(A765,Jour,0)+1,4),C765<=INDEX(Champ,MATCH(A765,Jour,0)+1,3))),\"occupé\",\"\")","v":""}]
["SAMEDI",4,5.1458333333333304,{"$f":"IF(OR(AND(C766>=INDEX(Champ,MATCH(A766,Jour,0),3),C766<=INDEX(Champ,MATCH(A766,Jour,0),4)),AND(C766>=INDEX(Champ,MATCH(A766,Jour,0)+1,4),C766<=INDEX(Champ,MATCH(A766,Jour,0)+1,3))),\"occupé\",\"\")","v":""}]
["SAMEDI",4,5.1527777777777803,{"$f":"IF(OR(AND(C767>=INDEX(Champ,MATCH(A767,Jour,0),3),C767<=INDEX(Champ,MATCH(A767,Jour,0),4)),AND(C767>=INDEX(Champ,MATCH(A767,Jour,0)+1,4),C767<=INDEX(Champ,MATCH(A767,Jour,0)+1,3))),\"occupé\",\"\")","v":""}]
["SAMEDI",4,5.1597222222222197,{"$f":"IF(OR(AND(C768>=INDEX(Champ,MATCH(A768,Jour,0),3),C768<=INDEX(Champ,MATCH(A768,Jour,0),4)),AND(C768>=INDEX(Champ,MATCH(A768,Jour,0)+1,4),C768<=INDEX(Champ,MATCH(A768,Jour,0)+1,3))),\"occupé\",\"\")","v":""}]
["SAMEDI",5,5.1666666666666696,{"$f":"IF(OR(AND(C769>=INDEX(Champ,MATCH(A769,Jour,0),3),C769<=INDEX(Champ,MATCH(A769,Jour,0),4)),AND(C769>=INDEX(Champ,MATCH(A769,Jour,0)+1,4),C769<=INDEX(Champ,MATCH(A769,Jour,0)+1,3))),\"occupé\",\"\")","v":""}]
["SAMEDI",5,5.1736111111111098,{"$f":"IF(OR(AND(C770>=INDEX(Champ,MATCH(A770,Jour,0),3),C770<=INDEX(Champ,MATCH(A770,Jour,0),4)),AND(C770>=INDEX(Champ,MATCH(A770,Jour,0)+1,4),C770<=INDEX(Champ,MATCH(A770,Jour,0)+1,3))),\"occupé\",\"\")","v":""}]
["SAMEDI",5,5.1805555555555598,{"$f":"IF(OR(AND(C771>=INDEX(Champ,MATCH(A771,Jour,0),3),C771<=INDEX(Champ,MATCH(A771,Jour,0),4)),AND(C771>=INDEX(Champ,MATCH(A771,Jour,0)+1,4),C771<=INDEX(Champ,MATCH(A771,Jour,0)+1,3))),\"occupé\",\"\")","v":""}]
["SAMEDI",5,5.1875,{"$f":"IF(OR(AND(C772>=INDEX(Champ,MATCH(A772,Jour,0),3),C772<=INDEX(Champ,MATCH(A772,Jour,0),4)),AND(C772>=INDEX(Champ,MATCH(A772,Jour,0)+1,4),C772<=INDEX(Champ,MATCH(A772,Jour,0)+1,3))),\"occupé\",\"\")","v":""}]
["SAMEDI",5,5.1944444444444402,{"$f":"IF(OR(AND(C773>=INDEX(Champ,MATCH(A773,Jour,0),3),C773<=INDEX(Champ,MATCH(A773,Jour,0),4)),AND(C773>=INDEX(Champ,MATCH(A773,Jour,0)+1,4),C773<=INDEX(Champ,MATCH(A773,Jour,0)+1,3))),\"occupé\",\"\")","v":""}]
["SAMEDI",5,5.2013888888888902,{"$f":"IF(OR(AND(C774>=INDEX(Champ,MATCH(A774,Jour,0),3),C774<=INDEX(Champ,MATCH(A774,Jour,0),4)),AND(C774>=INDEX(Champ,MATCH(A774,Jour,0)+1,4),C774<=INDEX(Champ,MATCH(A774,Jour,0)+1,3))),\"occupé\",\"\")","v":""}]
["SAMEDI",6,5.2083333333333304,{"$f":"IF(OR(AND(C775>=INDEX(Champ,MATCH(A775,Jour,0),3),C775<=INDEX(Champ,MATCH(A775,Jour,0),4)),AND(C775>=INDEX(Champ,MATCH(A775,Jour,0)+1,4),C775<=INDEX(Champ,MATCH(A775,Jour,0)+1,3))),\"occupé\",\"\")","v":""}]
["SAMEDI",6,5.2152777777777803,{"$f":"IF(OR(AND(C776>=INDEX(Champ,MATCH(A776,Jour,0),3),C776<=INDEX(Champ,MATCH(A776,Jour,0),4)),AND(C776>=INDEX(Champ,MATCH(A776,Jour,0)+1,4),C776<=INDEX(Champ,MATCH(A776,Jour,0)+1,3))),\"occupé\",\"\")","v":""}]
["SAMEDI",6,5.2222222222222197,{"$f":"IF(OR(AND(C777>=INDEX(Champ,MATCH(A777,Jour,0),3),C777<=INDEX(Champ,MATCH(A777,Jour,0),4)),AND(C777>=INDEX(Champ,MATCH(A777,Jour,0)+1,4),C777<=INDEX(Champ,MATCH(A777,Jour,0)+1,3))),\"occupé\",\"\")","v":""}]
["SAMEDI",6,5.2291666666666696,{"$f":"IF(OR(AND(C778>=INDEX(Champ,MATCH(A778,Jour,0),3),C778<=INDEX(Champ,MATCH(A778,Jour,0),4)),AND(C778>=INDEX(Champ,MATCH(A778,Jour,0)+1,4),C778<=INDEX(Champ,MATCH(A778,Jour,0)+1,3))),\"occupé\",\"\")","v":""}]
["SAMEDI",6,5.2361111111111098,{"$f":"IF(OR(AND(C779>=INDEX(Champ,MATCH(A779,Jour,0),3),C779<=INDEX(Champ,MATCH(A779,Jour,0),4)),AND(C779>=INDEX(Champ,MATCH(A779,Jour,0)+1,4),C779<=INDEX(Champ,MATCH(A779,Jour,0)+1,3))),\"occupé\",\"\")","v":""}]
["SAMEDI",6,5.2430555555555598,{"$f":"IF(OR(AND(C780>=INDEX(Champ,MATCH(A780,Jour,0),3),C780<=INDEX(Champ,MATCH(A780,Jour,0),4)),AND(C780>=INDEX(Champ,MATCH(A780,Jour,0)+1,4),C780<=INDEX(Champ,MATCH(A780,Jour,0)+1,3))),\"occupé\",\"\")","v":""}]
["SAMEDI",7,5.25,{"$f":"IF(OR(AND(C781>=INDEX(Champ,MATCH(A781,Jour,0),3),C781<=INDEX(Champ,MATCH(A781,Jour,0),4)),AND(C781>=INDEX(Champ,MATCH(A781,Jour,0)+1,4),C781<=INDEX(Champ,MATCH(A781,Jour,0)+1,3))),\"occupé\",\"\")","v":""}]
["SAMEDI",7,5.2569444444444402,{"$f":"IF(OR(AND(C782>=INDEX(Champ,MATCH(A782,Jour,0),3),C782<=INDEX(Champ,MATCH(A782,Jour,0),4)),AND(C782>=INDEX(Champ,MATCH(A782,Jour,0)+1,4),C782<=INDEX(Champ,MATCH(A782,Jour,0)+1,3))),\"occupé\",\"\")","v":""}]
["SAMEDI",7,5.2638888888888902,{"$f":"IF(OR(AND(C783>=INDEX(Champ,MATCH(A783,Jour,0),3),C783<=INDEX(Champ,MATCH(A783,Jour,0),4)),AND(C783>=INDEX(Champ,MATCH(A783,Jour,0)+1,4),C783<=INDEX(Champ,MATCH(A783,Jour,0)+1,3))),\"occupé\",\"\")","v":""}]
["SAMEDI",7,5.2708333333333304,{"$f":"IF(OR(AND(C784>=INDEX(Champ,MATCH(A784,Jour,0),3),C784<=INDEX(Champ,MATCH(A784,Jour,0),4)),AND(C784>=INDEX(Champ,MATCH(A784,Jour,0)+1,4),C784<=INDEX(Champ,MATCH(A784,Jour,0)+1,3))),\"occupé\",\"\")","v":""}]
["SAMEDI",7,5.2777777777777803,{"$f":"IF(OR(AND(C785>=INDEX(Champ,MATCH(A785,Jour,0),3),C785<=INDEX(Champ,MATCH(A785,Jour,0),4)),AND(C785>=INDEX(Champ,MATCH(A785,Jour,0)+1,4),C785<=INDEX(Champ,MATCH(A785,Jour,0)+1,3))),\"occupé\",\"\")","v":""}]
["SAMEDI",7,5.2847222222222197,{"$f":"IF(OR(AND(C786>=INDEX(Champ,MATCH(A786,Jour,0),3),C786<=INDEX(Champ,MATCH(A786,Jour,0),4)),AND(C786>=INDEX(Champ,MATCH(A786,Jour,0)+1,4),C786<=INDEX(Champ,MATCH(A786,Jour,0)+1,3))),\"occupé\",\"\")","v":""}]
["SAMEDI",8,5.2916666666666696,{"$f":"IF(OR(AND(C787>=INDEX(Champ,MATCH(A787,Jour,0),3),C787<=INDEX(Champ,MATCH(A787,Jour,0),4)),AND(C787>=INDEX(Champ,MATCH(A787,Jour,0)+1,4),C787<=INDEX(Champ,MATCH(A787,Jour,0)+1,3))),\"occupé\",\"\")","v":""}]
["SAMEDI",8,5.2986111111111098,{"$f":"IF(OR(AND(C788>=INDEX(Champ,MATCH(A788,Jour,0),3),C788<=INDEX(Champ,MATCH(A788,Jour,0),4)),AND(C788>=INDEX(Champ,MATCH(A788,Jour,0)+1,4),C788<=INDEX(Champ,MATCH(A788,Jour,0)+1,3))),\"occupé\",\"\")","v":""}]
["SAMEDI",8,5.3055555555555598,{"$f":"IF(OR(AND(C789>=INDEX(Champ,MATCH(A789,Jour,0),3),C789<=INDEX(Champ,MATCH(A789,Jour,0),4)),AND(C789>=INDEX(Champ,MATCH(A789,Jour,0)+1,4),C789<=INDEX(Champ,MATCH(A789,Jour,0)+1,3))),\"occupé\",\"\")","v":""}]
["SAMEDI",8,5.3125,{"$f":"IF(OR(AND(C790>=INDEX(Champ,MATCH(A790,Jour,0),3),C790<=INDEX(Champ,MATCH(A790,Jour,0),4)),AND(C790>=INDEX(Champ,MATCH(A790,Jour,0)+1,4),C790<=INDEX(Champ,MATCH(A790,Jour,0)+1,3))),\"occupé\",\"\")","v":""}]
["SAMEDI",8,5.3194444444444402,{"$f":"IF(OR(AND(C791>=INDEX(Champ,MATCH(A791,Jour,0),3),C791<=INDEX(Champ,MATCH(A791,Jour,0),4)),AND(C791>=INDEX(Champ,MATCH(A791,Jour,0)+1,4),C791<=INDEX(Champ,MATCH(A791,Jour,0)+1,3))),\"occupé\",\"\")","v":""}]
["SAMEDI",8,5.3263888888888902,{"$f":"IF(OR(AND(C792>=INDEX(Champ,MATCH(A792,Jour,0),3),C792<=INDEX(Champ,MATCH(A792,Jour,0),4)),AND(C792>=INDEX(Champ,MATCH(A792,Jour,0)+1,4),C792<=INDEX(Champ,MATCH(A792,Jour,0)+1,3))),\"occupé\",\"\")","v":""}]
["SAMEDI",9,5.3333333333333304,{"$f":"IF(OR(AND(C793>=INDEX(Champ,MATCH(A793,Jour,0),3),C793<=INDEX(Champ,MATCH(A793,Jour,0),4)),AND(C793>=INDEX(Champ,MATCH(A793,Jour,0)+1,4),C793<=INDEX(Champ,MATCH(A793,Jour,0)+1,3))),\"occupé\",\"\")","v":""}]
["SAMEDI",9,5.3402777777777803,{"$f":"IF(OR(AND(C794>=INDEX(Champ,MATCH(A794,Jour,0),3),C794<=INDEX(Champ,MATCH(A794,Jour,0),4)),AND(C794>=INDEX(Champ,MATCH(A794,Jour,0)+1,4),C794<=INDEX(Champ,MATCH(A794,Jour,0)+1,3))),\"occupé\",\"\")","v":""}]
["SAMEDI",9,5.3472222222222197,{"$f":"IF(OR(AND(C795>=INDEX(Champ,MATCH(A795,Jour,0),3),C795<=INDEX(Champ,MATCH(A795,Jour,0),4)),AND(C795>=INDEX(Champ,MATCH(A795,Jour,0)+1,4),C795<=INDEX(Champ,MATCH(A795,Jour,0)+1,3))),\"occupé\",\"\")","v":""}]
["SAMEDI",9,5.3541666666666696,{"$f":"IF(OR(AND(C796>=INDEX(Champ,MATCH(A796,Jour,0),3),C796<=INDEX(Champ,MATCH(A796,Jour,0),4)),AND(C796>=INDEX(Champ,MATCH(A796,Jour,0)+1,4),C796<=INDEX(Champ,MATCH(A796,Jour,0)+1,3))),\"occupé\",\"\")","v":""}]
["SAMEDI",9,5.3611111111111098,{"$f":"IF(OR(AND(C797>=INDEX(Champ,MATCH(A797,Jour,0),3),C797<=INDEX(Champ,MATCH(A797,Jour,0),4)),AND(C797>=INDEX(Champ,MATCH(A797,Jour,0)+1,4),C797<=INDEX(Champ,MATCH(A797,Jour,0)+1,3))),\"occupé\",\"\")","v":""}]
["SAMEDI",9,5.3680555555555598,{"$f":"IF(OR(AND(C798>=INDEX(Champ,MATCH(A798,Jour,0),3),C798<=INDEX(Champ,MATCH(A798,Jour,0),4)),AND(C798>=INDEX(Champ,MATCH(A798,Jour,0)+1,4),C798<=INDEX(Champ,MATCH(A798,Jour,0)+1,3))),\"occupé\",\"\")","v":""}]
["SAMEDI",10,5.375,{"$f":"IF(OR(AND(C799>=INDEX(Champ,MATCH(A799,Jour,0),3),C799<=INDEX(Champ,MATCH(A799,Jour,0),4)),AND(C799>=INDEX(Champ,MATCH(A799,Jour,0)+1,4),C799<=INDEX(Champ,MATCH(A799,Jour,0)+1,3))),\"occupé\",\"\")","v":""}]
["SAMEDI",10,5.3819444444444402,{"$f":"IF(OR(AND(C800>=INDEX(Champ,MATCH(A800,Jour,0),3),C800<=INDEX(Champ,MATCH(A800,Jour,0),4)),AND(C800>=INDEX(Champ,MATCH(A800,Jour,0)+1,4),C800<=INDEX(Champ,MATCH(A800,Jour,0)+1,3))),\"occupé\",\"\")","v":""}]
["SAMEDI",10,5.3888888888888902,{"$f":"IF(OR(AND(C801>=INDEX(Champ,MATCH(A801,Jour,0),3),C801<=INDEX(Champ,MATCH(A801,Jour,0),4)),AND(C801>=INDEX(Champ,MATCH(A801,Jour,0)+1,4),C801<=INDEX(Champ,MATCH(A801,Jour,0)+1,3))),\"occupé\",\"\")","v":""}]
["SAMEDI",10,5.3958333333333304,{"$f":"IF(OR(AND(C802>=INDEX(Champ,MATCH(A802,Jour,0),3),C802<=INDEX(Champ,MATCH(A802,Jour,0),4)),AND(C802>=INDEX(Champ,MATCH(A802,Jour,0)+1,4),C802<=INDEX(Champ,MATCH(A802,Jour,0)+1,3))),\"occupé\",\"\")","v":""}]
["SAMEDI",10,5.4027777777777803,{"$f":"IF(OR(AND(C803>=INDEX(Champ,MATCH(A803,Jour,0),3),C803<=INDEX(Champ,MATCH(A803,Jour,0),4)),AND(C803>=INDEX(Champ,MATCH(A803,Jour,0)+1,4),C803<=INDEX(Champ,MATCH(A803,Jour,0)+1,3))),\"occupé\",\"\")","v":""}]
["SAMEDI",10,5.4097222222222197,{"$f":"IF(OR(AND(C804>=INDEX(Champ,MATCH(A804,Jour,0),3),C804<=INDEX(Champ,MATCH(A804,Jour,0),4)),AND(C804>=INDEX(Champ,MATCH(A804,Jour,0)+1,4),C804<=INDEX(Champ,MATCH(A804,Jour,0)+1,3))),\"occupé\",\"\")","v":""}]
["SAMEDI",11,5.4166666666666696,{"$f":"IF(OR(AND(C805>=INDEX(Champ,MATCH(A805,Jour,0),3),C805<=INDEX(Champ,MATCH(A805,Jour,0),4)),AND(C805>=INDEX(Champ,MATCH(A805,Jour,0)+1,4),C805<=INDEX(Champ,MATCH(A805,Jour,0)+1,3))),\"occupé\",\"\")","v":""}]
["SAMEDI",11,5.4236111111111098,{"$f":"IF(OR(AND(C806>=INDEX(Champ,MATCH(A806,Jour,0),3),C806<=INDEX(Champ,MATCH(A806,Jour,0),4)),AND(C806>=INDEX(Champ,MATCH(A806,Jour,0)+1,4),C806<=INDEX(Champ,MATCH(A806,Jour,0)+1,3))),\"occupé\",\"\")","v":""}]
["SAMEDI",11,5.4305555555555598,{"$f":"IF(OR(AND(C807>=INDEX(Champ,MATCH(A807,Jour,0),3),C807<=INDEX(Champ,MATCH(A807,Jour,0),4)),AND(C807>=INDEX(Champ,MATCH(A807,Jour,0)+1,4),C807<=INDEX(Champ,MATCH(A807,Jour,0)+1,3))),\"occupé\",\"\")","v":""}]
["SAMEDI",11,5.4375,{"$f":"IF(OR(AND(C808>=INDEX(Champ,MATCH(A808,Jour,0),3),C808<=INDEX(Champ,MATCH(A808,Jour,0),4)),AND(C808>=INDEX(Champ,MATCH(A808,Jour,0)+1,4),C808<=INDEX(Champ,MATCH(A808,Jour,0)+1,3))),\"occupé\",\"\")","v":""}]
["SAMEDI",11,5.4444444444444402,{"$f":"IF(OR(AND(C809>=INDEX(Champ,MATCH(A809,Jour,0),3),C809<=INDEX(Champ,MATCH(A809,Jour,0),4)),AND(C809>=INDEX(Champ,MATCH(A809,Jour,0)+1,4),C809<=INDEX(Champ,MATCH(A809,Jour,0)+1,3))),\"occupé\",\"\")","v":""}]
["SAMEDI",11,5.4513888888888902,{"$f":"IF(OR(AND(C810>=INDEX(Champ,MATCH(A810,Jour,0),3),C810<=INDEX(Champ,MATCH(A810,Jour,0),4)),AND(C810>=INDEX(Champ,MATCH(A810,Jour,0)+1,4),C810<=INDEX(Champ,MATCH(A810,Jour,0)+1,3))),\"occupé\",\"\")","v":""}]
["SAMEDI",12,5.4583333333333304,{"$f":"IF(OR(AND(C811>=INDEX(Champ,MATCH(A811,Jour,0),3),C811<=INDEX(Champ,MATCH(A811,Jour,0),4)),AND(C811>=INDEX(Champ,MATCH(A811,Jour,0)+1,4),C811<=INDEX(Champ,MATCH(A811,Jour,0)+1,3))),\"occupé\",\"\")","v":""}]
["SAMEDI",12,5.4652777777777803,{"$f":"IF(OR(AND(C812>=INDEX(Champ,MATCH(A812,Jour,0),3),C812<=INDEX(Champ,MATCH(A812,Jour,0),4)),AND(C812>=INDEX(Champ,MATCH(A812,Jour,0)+1,4),C812<=INDEX(Champ,MATCH(A812,Jour,0)+1,3))),\"occupé\",\"\")","v":""}]
["SAMEDI",12,5.4722222222222197,{"$f":"IF(OR(AND(C813>=INDEX(Champ,MATCH(A813,Jour,0),3),C813<=INDEX(Champ,MATCH(A813,Jour,0),4)),AND(C813>=INDEX(Champ,MATCH(A813,Jour,0)+1,4),C813<=INDEX(Champ,MATCH(A813,Jour,0)+1,3))),\"occupé\",\"\")","v":""}]
["SAMEDI",12,5.4791666666666696,{"$f":"IF(OR(AND(C814>=INDEX(Champ,MATCH(A814,Jour,0),3),C814<=INDEX(Champ,MATCH(A814,Jour,0),4)),AND(C814>=INDEX(Champ,MATCH(A814,Jour,0)+1,4),C814<=INDEX(Champ,MATCH(A814,Jour,0)+1,3))),\"occupé\",\"\")","v":""}]
["SAMEDI",12,5.4861111111111098,{"$f":"IF(OR(AND(C815>=INDEX(Champ,MATCH(A815,Jour,0),3),C815<=INDEX(Champ,MATCH(A815,Jour,0),4)),AND(C815>=INDEX(Champ,MATCH(A815,Jour,0)+1,4),C815<=INDEX(Champ,MATCH(A815,Jour,0)+1,3))),\"occupé\",\"\")","v":""}]
["SAMEDI",12,5.4930555555555598,{"$f":"IF(OR(AND(C816>=INDEX(Champ,MATCH(A816,Jour,0),3),C816<=INDEX(Champ,MATCH(A816,Jour,0),4)),AND(C816>=INDEX(Champ,MATCH(A816,Jour,0)+1,4),C816<=INDEX(Champ,MATCH(A816,Jour,0)+1,3))),\"occupé\",\"\")","v":""}]
["SAMEDI",13,5.5,{"$f":"IF(OR(AND(C817>=INDEX(Champ,MATCH(A817,Jour,0),3),C817<=INDEX(Champ,MATCH(A817,Jour,0),4)),AND(C817>=INDEX(Champ,MATCH(A817,Jour,0)+1,4),C817<=INDEX(Champ,MATCH(A817,Jour,0)+1,3))),\"occupé\",\"\")","v":""}]
["SAMEDI",13,5.5069444444444402,{"$f":"IF(OR(AND(C818>=INDEX(Champ,MATCH(A818,Jour,0),3),C818<=INDEX(Champ,MATCH(A818,Jour,0),4)),AND(C818>=INDEX(Champ,MATCH(A818,Jour,0)+1,4),C818<=INDEX(Champ,MATCH(A818,Jour,0)+1,3))),\"occupé\",\"\")","v":""}]
["SAMEDI",13,5.5138888888888902,{"$f":"IF(OR(AND(C819>=INDEX(Champ,MATCH(A819,Jour,0),3),C819<=INDEX(Champ,MATCH(A819,Jour,0),4)),AND(C819>=INDEX(Champ,MATCH(A819,Jour,0)+1,4),C819<=INDEX(Champ,MATCH(A819,Jour,0)+1,3))),\"occupé\",\"\")","v":""}]
["SAMEDI",13,5.5208333333333304,{"$f":"IF(OR(AND(C820>=INDEX(Champ,MATCH(A820,Jour,0),3),C820<=INDEX(Champ,MATCH(A820,Jour,0),4)),AND(C820>=INDEX(Champ,MATCH(A820,Jour,0)+1,4),C820<=INDEX(Champ,MATCH(A820,Jour,0)+1,3))),\"occupé\",\"\")","v":""}]
["SAMEDI",13,5.5277777777777803,{"$f":"IF(OR(AND(C821>=INDEX(Champ,MATCH(A821,Jour,0),3),C821<=INDEX(Champ,MATCH(A821,Jour,0),4)),AND(C821>=INDEX(Champ,MATCH(A821,Jour,0)+1,4),C821<=INDEX(Champ,MATCH(A821,Jour,0)+1,3))),\"occupé\",\"\")","v":""}]
["SAMEDI",13,5.5347222222222197,{"$f":"IF(OR(AND(C822>=INDEX(Champ,MATCH(A822,Jour,0),3),C822<=INDEX(Champ,MATCH(A822,Jour,0),4)),AND(C822>=INDEX(Champ,MATCH(A822,Jour,0)+1,4),C822<=INDEX(Champ,MATCH(A822,Jour,0)+1,3))),\"occupé\",\"\")","v":""}]
["SAMEDI",14,5.5416666666666696,{"$f":"IF(OR(AND(C823>=INDEX(Champ,MATCH(A823,Jour,0),3),C823<=INDEX(Champ,MATCH(A823,Jour,0),4)),AND(C823>=INDEX(Champ,MATCH(A823,Jour,0)+1,4),C823<=INDEX(Champ,MATCH(A823,Jour,0)+1,3))),\"occupé\",\"\")","v":""}]
["SAMEDI",14,5.5486111111111098,{"$f":"IF(OR(AND(C824>=INDEX(Champ,MATCH(A824,Jour,0),3),C824<=INDEX(Champ,MATCH(A824,Jour,0),4)),AND(C824>=INDEX(Champ,MATCH(A824,Jour,0)+1,4),C824<=INDEX(Champ,MATCH(A824,Jour,0)+1,3))),\"occupé\",\"\")","v":""}]
["SAMEDI",14,5.5555555555555598,{"$f":"IF(OR(AND(C825>=INDEX(Champ,MATCH(A825,Jour,0),3),C825<=INDEX(Champ,MATCH(A825,Jour,0),4)),AND(C825>=INDEX(Champ,MATCH(A825,Jour,0)+1,4),C825<=INDEX(Champ,MATCH(A825,Jour,0)+1,3))),\"occupé\",\"\")","v":""}]
["SAMEDI",14,5.5625,{"$f":"IF(OR(AND(C826>=INDEX(Champ,MATCH(A826,Jour,0),3),C826<=INDEX(Champ,MATCH(A826,Jour,0),4)),AND(C826>=INDEX(Champ,MATCH(A826,Jour,0)+1,4),C826<=INDEX(Champ,MATCH(A826,Jour,0)+1,3))),\"occupé\",\"\")","v":""}]
["SAMEDI",14,5.5694444444444402,{"$f":"IF(OR(AND(C827>=INDEX(Champ,MATCH(A827,Jour,0),3),C827<=INDEX(Champ,MATCH(A827,Jour,0),4)),AND(C827>=INDEX(Champ,MATCH(A827,Jour,0)+1,4),C827<=INDEX(Champ,MATCH(A827,Jour,0)+1,3))),\"occupé\",\"\")","v":""}]
["SAMEDI",14,5.5763888888888902,{"$f":"IF(OR(AND(C828>=INDEX(Champ,MATCH(A828,Jour,0),3),C828<=INDEX(Champ,MATCH(A828,Jour,0),4)),AND(C828>=INDEX(Champ,MATCH(A828,Jour,0)+1,4),C828<=INDEX(Champ,MATCH(A828,Jour,0)+1,3))),\"occupé\",\"\")","v":""}]
["SAMEDI",15,5.5833333333333304,{"$f":"IF(OR(AND(C829>=INDEX(Champ,MATCH(A829,Jour,0),3),C829<=INDEX(Champ,MATCH(A829,Jour,0),4)),AND(C829>=INDEX(Champ,MATCH(A829,Jour,0)+1,4),C829<=INDEX(Champ,MATCH(A829,Jour,0)+1,3))),\"occupé\",\"\")","v":""}]
["SAMEDI",15,5.5902777777777803,{"$f":"IF(OR(AND(C830>=INDEX(Champ,MATCH(A830,Jour,0),3),C830<=INDEX(Champ,MATCH(A830,Jour,0),4)),AND(C830>=INDEX(Champ,MATCH(A830,Jour,0)+1,4),C830<=INDEX(Champ,MATCH(A830,Jour,0)+1,3))),\"occupé\",\"\")","v":""}]
["SAMEDI",15,5.5972222222222197,{"$f":"IF(OR(AND(C831>=INDEX(Champ,MATCH(A831,Jour,0),3),C831<=INDEX(Champ,MATCH(A831,Jour,0),4)),AND(C831>=INDEX(Champ,MATCH(A831,Jour,0)+1,4),C831<=INDEX(Champ,MATCH(A831,Jour,0)+1,3))),\"occupé\",\"\")","v":""}]
["SAMEDI",15,5.6041666666666696,{"$f":"IF(OR(AND(C832>=INDEX(Champ,MATCH(A832,Jour,0),3),C832<=INDEX(Champ,MATCH(A832,Jour,0),4)),AND(C832>=INDEX(Champ,MATCH(A832,Jour,0)+1,4),C832<=INDEX(Champ,MATCH(A832,Jour,0)+1,3))),\"occupé\",\"\")","v":""}]
["SAMEDI",15,5.6111111111111098,{"$f":"IF(OR(AND(C833>=INDEX(Champ,MATCH(A833,Jour,0),3),C833<=INDEX(Champ,MATCH(A833,Jour,0),4)),AND(C833>=INDEX(Champ,MATCH(A833,Jour,0)+1,4),C833<=INDEX(Champ,MATCH(A833,Jour,0)+1,3))),\"occupé\",\"\")","v":""}]
["SAMEDI",15,5.6180555555555598,{"$f":"IF(OR(AND(C834>=INDEX(Champ,MATCH(A834,Jour,0),3),C834<=INDEX(Champ,MATCH(A834,Jour,0),4)),AND(C834>=INDEX(Champ,MATCH(A834,Jour,0)+1,4),C834<=INDEX(Champ,MATCH(A834,Jour,0)+1,3))),\"occupé\",\"\")","v":""}]
["SAMEDI",16,5.625,{"$f":"IF(OR(AND(C835>=INDEX(Champ,MATCH(A835,Jour,0),3),C835<=INDEX(Champ,MATCH(A835,Jour,0),4)),AND(C835>=INDEX(Champ,MATCH(A835,Jour,0)+1,4),C835<=INDEX(Champ,MATCH(A835,Jour,0)+1,3))),\"occupé\",\"\")","v":""}]
["SAMEDI",16,5.6319444444444402,{"$f":"IF(OR(AND(C836>=INDEX(Champ,MATCH(A836,Jour,0),3),C836<=INDEX(Champ,MATCH(A836,Jour,0),4)),AND(C836>=INDEX(Champ,MATCH(A836,Jour,0)+1,4),C836<=INDEX(Champ,MATCH(A836,Jour,0)+1,3))),\"occupé\",\"\")","v":""}]
["SAMEDI",16,5.6388888888888902,{"$f":"IF(OR(AND(C837>=INDEX(Champ,MATCH(A837,Jour,0),3),C837<=INDEX(Champ,MATCH(A837,Jour,0),4)),AND(C837>=INDEX(Champ,MATCH(A837,Jour,0)+1,4),C837<=INDEX(Champ,MATCH(A837,Jour,0)+1,3))),\"occupé\",\"\")","v":""}]
["SAMEDI",16,5.6458333333333304,{"$f":"IF(OR(AND(C838>=INDEX(Champ,MATCH(A838,Jour,0),3),C838<=INDEX(Champ,MATCH(A838,Jour,0),4)),AND(C838>=INDEX(Champ,MATCH(A838,Jour,0)+1,4),C838<=INDEX(Champ,MATCH(A838,Jour,0)+1,3))),\"occupé\",\"\")","v":""}]
["SAMEDI",16,5.6527777777777803,{"$f":"IF(OR(AND(C839>=INDEX(Champ,MATCH(A839,Jour,0),3),C839<=INDEX(Champ,MATCH(A839,Jour,0),4)),AND(C839>=INDEX(Champ,MATCH(A839,Jour,0)+1,4),C839<=INDEX(Champ,MATCH(A839,Jour,0)+1,3))),\"occupé\",\"\")","v":""}]
["SAMEDI",16,5.6597222222222197,{"$f":"IF(OR(AND(C840>=INDEX(Champ,MATCH(A840,Jour,0),3),C840<=INDEX(Champ,MATCH(A840,Jour,0),4)),AND(C840>=INDEX(Champ,MATCH(A840,Jour,0)+1,4),C840<=INDEX(Champ,MATCH(A840,Jour,0)+1,3))),\"occupé\",\"\")","v":""}]
["SAMEDI",17,5.6666666666666696,{"$f":"IF(OR(AND(C841>=INDEX(Champ,MATCH(A841,Jour,0),3),C841<=INDEX(Champ,MATCH(A841,Jour,0),4)),AND(C841>=INDEX(Champ,MATCH(A841,Jour,0)+1,4),C841<=INDEX(Champ,MATCH(A841,Jour,0)+1,3))),\"occupé\",\"\")","v":""}]
["SAMEDI",17,5.6736111111111098,{"$f":"IF(OR(AND(C842>=INDEX(Champ,MATCH(A842,Jour,0),3),C842<=INDEX(Champ,MATCH(A842,Jour,0),4)),AND(C842>=INDEX(Champ,MATCH(A842,Jour,0)+1,4),C842<=INDEX(Champ,MATCH(A842,Jour,0)+1,3))),\"occupé\",\"\")","v":""}]
["SAMEDI",17,5.6805555555555598,{"$f":"IF(OR(AND(C843>=INDEX(Champ,MATCH(A843,Jour,0),3),C843<=INDEX(Champ,MATCH(A843,Jour,0),4)),AND(C843>=INDEX(Champ,MATCH(A843,Jour,0)+1,4),C843<=INDEX(Champ,MATCH(A843,Jour,0)+1,3))),\"occupé\",\"\")","v":""}]
["SAMEDI",17,5.6875,{"$f":"IF(OR(AND(C844>=INDEX(Champ,MATCH(A844,Jour,0),3),C844<=INDEX(Champ,MATCH(A844,Jour,0),4)),AND(C844>=INDEX(Champ,MATCH(A844,Jour,0)+1,4),C844<=INDEX(Champ,MATCH(A844,Jour,0)+1,3))),\"occupé\",\"\")","v":""}]
["SAMEDI",17,5.6944444444444402,{"$f":"IF(OR(AND(C845>=INDEX(Champ,MATCH(A845,Jour,0),3),C845<=INDEX(Champ,MATCH(A845,Jour,0),4)),AND(C845>=INDEX(Champ,MATCH(A845,Jour,0)+1,4),C845<=INDEX(Champ,MATCH(A845,Jour,0)+1,3))),\"occupé\",\"\")","v":""}]
["SAMEDI",17,5.7013888888888902,{"$f":"IF(OR(AND(C846>=INDEX(Champ,MATCH(A846,Jour,0),3),C846<=INDEX(Champ,MATCH(A846,Jour,0),4)),AND(C846>=INDEX(Champ,MATCH(A846,Jour,0)+1,4),C846<=INDEX(Champ,MATCH(A846,Jour,0)+1,3))),\"occupé\",\"\")","v":""}]
["SAMEDI",18,5.7083333333333304,{"$f":"IF(OR(AND(C847>=INDEX(Champ,MATCH(A847,Jour,0),3),C847<=INDEX(Champ,MATCH(A847,Jour,0),4)),AND(C847>=INDEX(Champ,MATCH(A847,Jour,0)+1,4),C847<=INDEX(Champ,MATCH(A847,Jour,0)+1,3))),\"occupé\",\"\")","v":""}]
["SAMEDI",18,5.7152777777777803,{"$f":"IF(OR(AND(C848>=INDEX(Champ,MATCH(A848,Jour,0),3),C848<=INDEX(Champ,MATCH(A848,Jour,0),4)),AND(C848>=INDEX(Champ,MATCH(A848,Jour,0)+1,4),C848<=INDEX(Champ,MATCH(A848,Jour,0)+1,3))),\"occupé\",\"\")","v":""}]
["SAMEDI",18,5.7222222222222197,{"$f":"IF(OR(AND(C849>=INDEX(Champ,MATCH(A849,Jour,0),3),C849<=INDEX(Champ,MATCH(A849,Jour,0),4)),AND(C849>=INDEX(Champ,MATCH(A849,Jour,0)+1,4),C849<=INDEX(Champ,MATCH(A849,Jour,0)+1,3))),\"occupé\",\"\")","v":""}]
["SAMEDI",18,5.7291666666666696,{"$f":"IF(OR(AND(C850>=INDEX(Champ,MATCH(A850,Jour,0),3),C850<=INDEX(Champ,MATCH(A850,Jour,0),4)),AND(C850>=INDEX(Champ,MATCH(A850,Jour,0)+1,4),C850<=INDEX(Champ,MATCH(A850,Jour,0)+1,3))),\"occupé\",\"\")","v":""}]
["SAMEDI",18,5.7361111111111098,{"$f":"IF(OR(AND(C851>=INDEX(Champ,MATCH(A851,Jour,0),3),C851<=INDEX(Champ,MATCH(A851,Jour,0),4)),AND(C851>=INDEX(Champ,MATCH(A851,Jour,0)+1,4),C851<=INDEX(Champ,MATCH(A851,Jour,0)+1,3))),\"occupé\",\"\")","v":""}]
["SAMEDI",18,5.7430555555555598,{"$f":"IF(OR(AND(C852>=INDEX(Champ,MATCH(A852,Jour,0),3),C852<=INDEX(Champ,MATCH(A852,Jour,0),4)),AND(C852>=INDEX(Champ,MATCH(A852,Jour,0)+1,4),C852<=INDEX(Champ,MATCH(A852,Jour,0)+1,3))),\"occupé\",\"\")","v":""}]
["SAMEDI",19,5.75,{"$f":"IF(OR(AND(C853>=INDEX(Champ,MATCH(A853,Jour,0),3),C853<=INDEX(Champ,MATCH(A853,Jour,0),4)),AND(C853>=INDEX(Champ,MATCH(A853,Jour,0)+1,4),C853<=INDEX(Champ,MATCH(A853,Jour,0)+1,3))),\"occupé\",\"\")","v":""}]
["SAMEDI",19,5.7569444444444402,{"$f":"IF(OR(AND(C854>=INDEX(Champ,MATCH(A854,Jour,0),3),C854<=INDEX(Champ,MATCH(A854,Jour,0),4)),AND(C854>=INDEX(Champ,MATCH(A854,Jour,0)+1,4),C854<=INDEX(Champ,MATCH(A854,Jour,0)+1,3))),\"occupé\",\"\")","v":""}]
["SAMEDI",19,5.7638888888888902,{"$f":"IF(OR(AND(C855>=INDEX(Champ,MATCH(A855,Jour,0),3),C855<=INDEX(Champ,MATCH(A855,Jour,0),4)),AND(C855>=INDEX(Champ,MATCH(A855,Jour,0)+1,4),C855<=INDEX(Champ,MATCH(A855,Jour,0)+1,3))),\"occupé\",\"\")","v":""}]
["SAMEDI",19,5.7708333333333304,{"$f":"IF(OR(AND(C856>=INDEX(Champ,MATCH(A856,Jour,0),3),C856<=INDEX(Champ,MATCH(A856,Jour,0),4)),AND(C856>=INDEX(Champ,MATCH(A856,Jour,0)+1,4),C856<=INDEX(Champ,MATCH(A856,Jour,0)+1,3))),\"occupé\",\"\")","v":""}]
["SAMEDI",19,5.7777777777777803,{"$f":"IF(OR(AND(C857>=INDEX(Champ,MATCH(A857,Jour,0),3),C857<=INDEX(Champ,MATCH(A857,Jour,0),4)),AND(C857>=INDEX(Champ,MATCH(A857,Jour,0)+1,4),C857<=INDEX(Champ,MATCH(A857,Jour,0)+1,3))),\"occupé\",\"\")","v":""}]
["SAMEDI",19,5.7847222222222197,{"$f":"IF(OR(AND(C858>=INDEX(Champ,MATCH(A858,Jour,0),3),C858<=INDEX(Champ,MATCH(A858,Jour,0),4)),AND(C858>=INDEX(Champ,MATCH(A858,Jour,0)+1,4),C858<=INDEX(Champ,MATCH(A858,Jour,0)+1,3))),\"occupé\",\"\")","v":""}]
["SAMEDI",20,5.7916666666666696,{"$f":"IF(OR(AND(C859>=INDEX(Champ,MATCH(A859,Jour,0),3),C859<=INDEX(Champ,MATCH(A859,Jour,0),4)),AND(C859>=INDEX(Champ,MATCH(A859,Jour,0)+1,4),C859<=INDEX(Champ,MATCH(A859,Jour,0)+1,3))),\"occupé\",\"\")","v":""}]
["SAMEDI",20,5.7986111111111098,{"$f":"IF(OR(AND(C860>=INDEX(Champ,MATCH(A860,Jour,0),3),C860<=INDEX(Champ,MATCH(A860,Jour,0),4)),AND(C860>=INDEX(Champ,MATCH(A860,Jour,0)+1,4),C860<=INDEX(Champ,MATCH(A860,Jour,0)+1,3))),\"occupé\",\"\")","v":""}]
["SAMEDI",20,5.8055555555555598,{"$f":"IF(OR(AND(C861>=INDEX(Champ,MATCH(A861,Jour,0),3),C861<=INDEX(Champ,MATCH(A861,Jour,0),4)),AND(C861>=INDEX(Champ,MATCH(A861,Jour,0)+1,4),C861<=INDEX(Champ,MATCH(A861,Jour,0)+1,3))),\"occupé\",\"\")","v":""}]
["SAMEDI",20,5.8125,{"$f":"IF(OR(AND(C862>=INDEX(Champ,MATCH(A862,Jour,0),3),C862<=INDEX(Champ,MATCH(A862,Jour,0),4)),AND(C862>=INDEX(Champ,MATCH(A862,Jour,0)+1,4),C862<=INDEX(Champ,MATCH(A862,Jour,0)+1,3))),\"occupé\",\"\")","v":""}]
["SAMEDI",20,5.8194444444444402,{"$f":"IF(OR(AND(C863>=INDEX(Champ,MATCH(A863,Jour,0),3),C863<=INDEX(Champ,MATCH(A863,Jour,0),4)),AND(C863>=INDEX(Champ,MATCH(A863,Jour,0)+1,4),C863<=INDEX(Champ,MATCH(A863,Jour,0)+1,3))),\"occupé\",\"\")","v":""}]
["SAMEDI",20,5.8263888888888902,{"$f":"IF(OR(AND(C864>=INDEX(Champ,MATCH(A864,Jour,0),3),C864<=INDEX(Champ,MATCH(A864,Jour,0),4)),AND(C864>=INDEX(Champ,MATCH(A864,Jour,0)+1,4),C864<=INDEX(Champ,MATCH(A864,Jour,0)+1,3))),\"occupé\",\"\")","v":""}]
["SAMEDI",21,5.8333333333333304,{"$f":"IF(OR(AND(C865>=INDEX(Champ,MATCH(A865,Jour,0),3),C865<=INDEX(Champ,MATCH(A865,Jour,0),4)),AND(C865>=INDEX(Champ,MATCH(A865,Jour,0)+1,4),C865<=INDEX(Champ,MATCH(A865,Jour,0)+1,3))),\"occupé\",\"\")","v":""}]
["SAMEDI",21,5.8402777777777803,{"$f":"IF(OR(AND(C866>=INDEX(Champ,MATCH(A866,Jour,0),3),C866<=INDEX(Champ,MATCH(A866,Jour,0),4)),AND(C866>=INDEX(Champ,MATCH(A866,Jour,0)+1,4),C866<=INDEX(Champ,MATCH(A866,Jour,0)+1,3))),\"occupé\",\"\")","v":""}]
["SAMEDI",21,5.8472222222222197,{"$f":"IF(OR(AND(C867>=INDEX(Champ,MATCH(A867,Jour,0),3),C867<=INDEX(Champ,MATCH(A867,Jour,0),4)),AND(C867>=INDEX(Champ,MATCH(A867,Jour,0)+1,4),C867<=INDEX(Champ,MATCH(A867,Jour,0)+1,3))),\"occupé\",\"\")","v":""}]
["SAMEDI",21,5.8541666666666696,{"$f":"IF(OR(AND(C868>=INDEX(Champ,MATCH(A868,Jour,0),3),C868<=INDEX(Champ,MATCH(A868,Jour,0),4)),AND(C868>=INDEX(Champ,MATCH(A868,Jour,0)+1,4),C868<=INDEX(Champ,MATCH(A868,Jour,0)+1,3))),\"occupé\",\"\")","v":""}]
["SAMEDI",21,5.8611111111111098,{"$f":"IF(OR(AND(C869>=INDEX(Champ,MATCH(A869,Jour,0),3),C869<=INDEX(Champ,MATCH(A869,Jour,0),4)),AND(C869>=INDEX(Champ,MATCH(A869,Jour,0)+1,4),C869<=INDEX(Champ,MATCH(A869,Jour,0)+1,3))),\"occupé\",\"\")","v":""}]
["SAMEDI",21,5.8680555555555598,{"$f":"IF(OR(AND(C870>=INDEX(Champ,MATCH(A870,Jour,0),3),C870<=INDEX(Champ,MATCH(A870,Jour,0),4)),AND(C870>=INDEX(Champ,MATCH(A870,Jour,0)+1,4),C870<=INDEX(Champ,MATCH(A870,Jour,0)+1,3))),\"occupé\",\"\")","v":""}]
["SAMEDI",22,5.875,{"$f":"IF(OR(AND(C871>=INDEX(Champ,MATCH(A871,Jour,0),3),C871<=INDEX(Champ,MATCH(A871,Jour,0),4)),AND(C871>=INDEX(Champ,MATCH(A871,Jour,0)+1,4),C871<=INDEX(Champ,MATCH(A871,Jour,0)+1,3))),\"occupé\",\"\")","v":""}]
["SAMEDI",22,5.8819444444444402,{"$f":"IF(OR(AND(C872>=INDEX(Champ,MATCH(A872,Jour,0),3),C872<=INDEX(Champ,MATCH(A872,Jour,0),4)),AND(C872>=INDEX(Champ,MATCH(A872,Jour,0)+1,4),C872<=INDEX(Champ,MATCH(A872,Jour,0)+1,3))),\"occupé\",\"\")","v":""}]
["SAMEDI",22,5.8888888888888902,{"$f":"IF(OR(AND(C873>=INDEX(Champ,MATCH(A873,Jour,0),3),C873<=INDEX(Champ,MATCH(A873,Jour,0),4)),AND(C873>=INDEX(Champ,MATCH(A873,Jour,0)+1,4),C873<=INDEX(Champ,MATCH(A873,Jour,0)+1,3))),\"occupé\",\"\")","v":""}]
["SAMEDI",22,5.8958333333333304,{"$f":"IF(OR(AND(C874>=INDEX(Champ,MATCH(A874,Jour,0),3),C874<=INDEX(Champ,MATCH(A874,Jour,0),4)),AND(C874>=INDEX(Champ,MATCH(A874,Jour,0)+1,4),C874<=INDEX(Champ,MATCH(A874,Jour,0)+1,3))),\"occupé\",\"\")","v":""}]
["SAMEDI",22,5.9027777777777803,{"$f":"IF(OR(AND(C875>=INDEX(Champ,MATCH(A875,Jour,0),3),C875<=INDEX(Champ,MATCH(A875,Jour,0),4)),AND(C875>=INDEX(Champ,MATCH(A875,Jour,0)+1,4),C875<=INDEX(Champ,MATCH(A875,Jour,0)+1,3))),\"occupé\",\"\")","v":""}]
["SAMEDI",22,5.9097222222222197,{"$f":"IF(OR(AND(C876>=INDEX(Champ,MATCH(A876,Jour,0),3),C876<=INDEX(Champ,MATCH(A876,Jour,0),4)),AND(C876>=INDEX(Champ,MATCH(A876,Jour,0)+1,4),C876<=INDEX(Champ,MATCH(A876,Jour,0)+1,3))),\"occupé\",\"\")","v":""}]
["SAMEDI",23,5.9166666666666696,{"$f":"IF(OR(AND(C877>=INDEX(Champ,MATCH(A877,Jour,0),3),C877<=INDEX(Champ,MATCH(A877,Jour,0),4)),AND(C877>=INDEX(Champ,MATCH(A877,Jour,0)+1,4),C877<=INDEX(Champ,MATCH(A877,Jour,0)+1,3))),\"occupé\",\"\")","v":""}]
["SAMEDI",23,5.9236111111111098,{"$f":"IF(OR(AND(C878>=INDEX(Champ,MATCH(A878,Jour,0),3),C878<=INDEX(Champ,MATCH(A878,Jour,0),4)),AND(C878>=INDEX(Champ,MATCH(A878,Jour,0)+1,4),C878<=INDEX(Champ,MATCH(A878,Jour,0)+1,3))),\"occupé\",\"\")","v":""}]
["SAMEDI",23,5.9305555555555598,{"$f":"IF(OR(AND(C879>=INDEX(Champ,MATCH(A879,Jour,0),3),C879<=INDEX(Champ,MATCH(A879,Jour,0),4)),AND(C879>=INDEX(Champ,MATCH(A879,Jour,0)+1,4),C879<=INDEX(Champ,MATCH(A879,Jour,0)+1,3))),\"occupé\",\"\")","v":""}]
["SAMEDI",23,5.9375,{"$f":"IF(OR(AND(C880>=INDEX(Champ,MATCH(A880,Jour,0),3),C880<=INDEX(Champ,MATCH(A880,Jour,0),4)),AND(C880>=INDEX(Champ,MATCH(A880,Jour,0)+1,4),C880<=INDEX(Champ,MATCH(A880,Jour,0)+1,3))),\"occupé\",\"\")","v":""}]
["SAMEDI",23,5.9444444444444402,{"$f":"IF(OR(AND(C881>=INDEX(Champ,MATCH(A881,Jour,0),3),C881<=INDEX(Champ,MATCH(A881,Jour,0),4)),AND(C881>=INDEX(Champ,MATCH(A881,Jour,0)+1,4),C881<=INDEX(Champ,MATCH(A881,Jour,0)+1,3))),\"occupé\",\"\")","v":""}]
["SAMEDI",23,5.9513888888888902,{"$f":"IF(OR(AND(C882>=INDEX(Champ,MATCH(A882,Jour,0),3),C882<=INDEX(Champ,MATCH(A882,Jour,0),4)),AND(C882>=INDEX(Champ,MATCH(A882,Jour,0)+1,4),C882<=INDEX(Champ,MATCH(A882,Jour,0)+1,3))),\"occupé\",\"\")","v":""}]
["SAMEDI",24,5.9583333333333304,{"$f":"IF(OR(AND(C883>=INDEX(Champ,MATCH(A883,Jour,0),3),C883<=INDEX(Champ,MATCH(A883,Jour,0),4)),AND(C883>=INDEX(Champ,MATCH(A883,Jour,0)+1,4),C883<=INDEX(Champ,MATCH(A883,Jour,0)+1,3))),\"occupé\",\"\")","v":""}]
["SAMEDI",24,5.9652777777777803,{"$f":"IF(OR(AND(C884>=INDEX(Champ,MATCH(A884,Jour,0),3),C884<=INDEX(Champ,MATCH(A884,Jour,0),4)),AND(C884>=INDEX(Champ,MATCH(A884,Jour,0)+1,4),C884<=INDEX(Champ,MATCH(A884,Jour,0)+1,3))),\"occupé\",\"\")","v":""}]
["SAMEDI",24,5.9722222222222197,{"$f":"IF(OR(AND(C885>=INDEX(Champ,MATCH(A885,Jour,0),3),C885<=INDEX(Champ,MATCH(A885,Jour,0),4)),AND(C885>=INDEX(Champ,MATCH(A885,Jour,0)+1,4),C885<=INDEX(Champ,MATCH(A885,Jour,0)+1,3))),\"occupé\",\"\")","v":""}]
["SAMEDI",24,5.9791666666666696,{"$f":"IF(OR(AND(C886>=INDEX(Champ,MATCH(A886,Jour,0),3),C886<=INDEX(Champ,MATCH(A886,Jour,0),4)),AND(C886>=INDEX(Champ,MATCH(A886,Jour,0)+1,4),C886<=INDEX(Champ,MATCH(A886,Jour,0)+1,3))),\"occupé\",\"\")","v":""}]
["SAMEDI",24,5.9861111111111098,{"$f":"IF(OR(AND(C887>=INDEX(Champ,MATCH(A887,Jour,0),3),C887<=INDEX(Champ,MATCH(A887,Jour,0),4)),AND(C887>=INDEX(Champ,MATCH(A887,Jour,0)+1,4),C887<=INDEX(Champ,MATCH(A887,Jour,0)+1,3))),\"occupé\",\"\")","v":""}]
["SAMEDI",24,5.9930555555555598,{"$f":"IF(OR(AND(C888>=INDEX(Champ,MATCH(A888,Jour,0),3),C888<=INDEX(Champ,MATCH(A888,Jour,0),4)),AND(C888>=INDEX(Champ,MATCH(A888,Jour,0)+1,4),C888<=INDEX(Champ,MATCH(A888,Jour,0)+1,3))),\"occupé\",\"\")","v":""}]
["DIMANCHE",1,6,{"$f":"IF(OR(AND(C889>=INDEX(Champ,MATCH(A889,Jour,0),3),C889<=INDEX(Champ,MATCH(A889,Jour,0),4)),AND(C889>=INDEX(Champ,MATCH(A889,Jour,0)+1,4),C889<=INDEX(Champ,MATCH(A889,Jour,0)+1,3))),\"occupé\",\"\")","v":""}]
["DIMANCHE",1,6.0069444444444402,{"$f":"IF(OR(AND(C890>=INDEX(Champ,MATCH(A890,Jour,0),3),C890<=INDEX(Champ,MATCH(A890,Jour,0),4)),AND(C890>=INDEX(Champ,MATCH(A890,Jour,0)+1,4),C890<=INDEX(Champ,MATCH(A890,Jour,0)+1,3))),\"occupé\",\"\")","v":""}]
["DIMANCHE",1,6.0138888888888902,{"$f":"IF(OR(AND(C891>=INDEX(Champ,MATCH(A891,Jour,0),3),C891<=INDEX(Champ,MATCH(A891,Jour,0),4)),AND(C891>=INDEX(Champ,MATCH(A891,Jour,0)+1,4),C891<=INDEX(Champ,MATCH(A891,Jour,0)+1,3))),\"occupé\",\"\")","v":""}]
["DIMANCHE",1,6.0208333333333304,{"$f":"IF(OR(AND(C892>=INDEX(Champ,MATCH(A892,Jour,0),3),C892<=INDEX(Champ,MATCH(A892,Jour,0),4)),AND(C892>=INDEX(Champ,MATCH(A892,Jour,0)+1,4),C892<=INDEX(Champ,MATCH(A892,Jour,0)+1,3))),\"occupé\",\"\")","v":""}]
["DIMANCHE",1,6.0277777777777803,{"$f":"IF(OR(AND(C893>=INDEX(Champ,MATCH(A893,Jour,0),3),C893<=INDEX(Champ,MATCH(A893,Jour,0),4)),AND(C893>=INDEX(Champ,MATCH(A893,Jour,0)+1,4),C893<=INDEX(Champ,MATCH(A893,Jour,0)+1,3))),\"occupé\",\"\")","v":""}]
["DIMANCHE",1,6.0347222222222197,{"$f":"IF(OR(AND(C894>=INDEX(Champ,MATCH(A894,Jour,0),3),C894<=INDEX(Champ,MATCH(A894,Jour,0),4)),AND(C894>=INDEX(Champ,MATCH(A894,Jour,0)+1,4),C894<=INDEX(Champ,MATCH(A894,Jour,0)+1,3))),\"occupé\",\"\")","v":""}]
["DIMANCHE",2,6.0416666666666696,{"$f":"IF(OR(AND(C895>=INDEX(Champ,MATCH(A895,Jour,0),3),C895<=INDEX(Champ,MATCH(A895,Jour,0),4)),AND(C895>=INDEX(Champ,MATCH(A895,Jour,0)+1,4),C895<=INDEX(Champ,MATCH(A895,Jour,0)+1,3))),\"occupé\",\"\")","v":""}]
["DIMANCHE",2,6.0486111111111098,{"$f":"IF(OR(AND(C896>=INDEX(Champ,MATCH(A896,Jour,0),3),C896<=INDEX(Champ,MATCH(A896,Jour,0),4)),AND(C896>=INDEX(Champ,MATCH(A896,Jour,0)+1,4),C896<=INDEX(Champ,MATCH(A896,Jour,0)+1,3))),\"occupé\",\"\")","v":""}]
["DIMANCHE",2,6.0555555555555598,{"$f":"IF(OR(AND(C897>=INDEX(Champ,MATCH(A897,Jour,0),3),C897<=INDEX(Champ,MATCH(A897,Jour,0),4)),AND(C897>=INDEX(Champ,MATCH(A897,Jour,0)+1,4),C897<=INDEX(Champ,MATCH(A897,Jour,0)+1,3))),\"occupé\",\"\")","v":""}]
["DIMANCHE",2,6.0625,{"$f":"IF(OR(AND(C898>=INDEX(Champ,MATCH(A898,Jour,0),3),C898<=INDEX(Champ,MATCH(A898,Jour,0),4)),AND(C898>=INDEX(Champ,MATCH(A898,Jour,0)+1,4),C898<=INDEX(Champ,MATCH(A898,Jour,0)+1,3))),\"occupé\",\"\")","v":""}]
["DIMANCHE",2,6.0694444444444402,{"$f":"IF(OR(AND(C899>=INDEX(Champ,MATCH(A899,Jour,0),3),C899<=INDEX(Champ,MATCH(A899,Jour,0),4)),AND(C899>=INDEX(Champ,MATCH(A899,Jour,0)+1,4),C899<=INDEX(Champ,MATCH(A899,Jour,0)+1,3))),\"occupé\",\"\")","v":""}]
["DIMANCHE",2,6.0763888888888902,{"$f":"IF(OR(AND(C900>=INDEX(Champ,MATCH(A900,Jour,0),3),C900<=INDEX(Champ,MATCH(A900,Jour,0),4)),AND(C900>=INDEX(Champ,MATCH(A900,Jour,0)+1,4),C900<=INDEX(Champ,MATCH(A900,Jour,0)+1,3))),\"occupé\",\"\")","v":""}]
["DIMANCHE",3,6.0833333333333304,{"$f":"IF(OR(AND(C901>=INDEX(Champ,MATCH(A901,Jour,0),3),C901<=INDEX(Champ,MATCH(A901,Jour,0),4)),AND(C901>=INDEX(Champ,MATCH(A901,Jour,0)+1,4),C901<=INDEX(Champ,MATCH(A901,Jour,0)+1,3))),\"occupé\",\"\")","v":""}]
["DIMANCHE",3,6.0902777777777803,{"$f":"IF(OR(AND(C902>=INDEX(Champ,MATCH(A902,Jour,0),3),C902<=INDEX(Champ,MATCH(A902,Jour,0),4)),AND(C902>=INDEX(Champ,MATCH(A902,Jour,0)+1,4),C902<=INDEX(Champ,MATCH(A902,Jour,0)+1,3))),\"occupé\",\"\")","v":""}]
["DIMANCHE",3,6.0972222222222197,{"$f":"IF(OR(AND(C903>=INDEX(Champ,MATCH(A903,Jour,0),3),C903<=INDEX(Champ,MATCH(A903,Jour,0),4)),AND(C903>=INDEX(Champ,MATCH(A903,Jour,0)+1,4),C903<=INDEX(Champ,MATCH(A903,Jour,0)+1,3))),\"occupé\",\"\")","v":""}]
["DIMANCHE",3,6.1041666666666696,{"$f":"IF(OR(AND(C904>=INDEX(Champ,MATCH(A904,Jour,0),3),C904<=INDEX(Champ,MATCH(A904,Jour,0),4)),AND(C904>=INDEX(Champ,MATCH(A904,Jour,0)+1,4),C904<=INDEX(Champ,MATCH(A904,Jour,0)+1,3))),\"occupé\",\"\")","v":""}]
["DIMANCHE",3,6.1111111111111098,{"$f":"IF(OR(AND(C905>=INDEX(Champ,MATCH(A905,Jour,0),3),C905<=INDEX(Champ,MATCH(A905,Jour,0),4)),AND(C905>=INDEX(Champ,MATCH(A905,Jour,0)+1,4),C905<=INDEX(Champ,MATCH(A905,Jour,0)+1,3))),\"occupé\",\"\")","v":""}]
["DIMANCHE",3,6.1180555555555598,{"$f":"IF(OR(AND(C906>=INDEX(Champ,MATCH(A906,Jour,0),3),C906<=INDEX(Champ,MATCH(A906,Jour,0),4)),AND(C906>=INDEX(Champ,MATCH(A906,Jour,0)+1,4),C906<=INDEX(Champ,MATCH(A906,Jour,0)+1,3))),\"occupé\",\"\")","v":""}]
["DIMANCHE",4,6.125,{"$f":"IF(OR(AND(C907>=INDEX(Champ,MATCH(A907,Jour,0),3),C907<=INDEX(Champ,MATCH(A907,Jour,0),4)),AND(C907>=INDEX(Champ,MATCH(A907,Jour,0)+1,4),C907<=INDEX(Champ,MATCH(A907,Jour,0)+1,3))),\"occupé\",\"\")","v":""}]
["DIMANCHE",4,6.1319444444444402,{"$f":"IF(OR(AND(C908>=INDEX(Champ,MATCH(A908,Jour,0),3),C908<=INDEX(Champ,MATCH(A908,Jour,0),4)),AND(C908>=INDEX(Champ,MATCH(A908,Jour,0)+1,4),C908<=INDEX(Champ,MATCH(A908,Jour,0)+1,3))),\"occupé\",\"\")","v":""}]
["DIMANCHE",4,6.1388888888888902,{"$f":"IF(OR(AND(C909>=INDEX(Champ,MATCH(A909,Jour,0),3),C909<=INDEX(Champ,MATCH(A909,Jour,0),4)),AND(C909>=INDEX(Champ,MATCH(A909,Jour,0)+1,4),C909<=INDEX(Champ,MATCH(A909,Jour,0)+1,3))),\"occupé\",\"\")","v":""}]
["DIMANCHE",4,6.1458333333333304,{"$f":"IF(OR(AND(C910>=INDEX(Champ,MATCH(A910,Jour,0),3),C910<=INDEX(Champ,MATCH(A910,Jour,0),4)),AND(C910>=INDEX(Champ,MATCH(A910,Jour,0)+1,4),C910<=INDEX(Champ,MATCH(A910,Jour,0)+1,3))),\"occupé\",\"\")","v":""}]
["DIMANCHE",4,6.1527777777777803,{"$f":"IF(OR(AND(C911>=INDEX(Champ,MATCH(A911,Jour,0),3),C911<=INDEX(Champ,MATCH(A911,Jour,0),4)),AND(C911>=INDEX(Champ,MATCH(A911,Jour,0)+1,4),C911<=INDEX(Champ,MATCH(A911,Jour,0)+1,3))),\"occupé\",\"\")","v":""}]
["DIMANCHE",4,6.1597222222222197,{"$f":"IF(OR(AND(C912>=INDEX(Champ,MATCH(A912,Jour,0),3),C912<=INDEX(Champ,MATCH(A912,Jour,0),4)),AND(C912>=INDEX(Champ,MATCH(A912,Jour,0)+1,4),C912<=INDEX(Champ,MATCH(A912,Jour,0)+1,3))),\"occupé\",\"\")","v":""}]
["DIMANCHE",5,6.1666666666666696,{"$f":"IF(OR(AND(C913>=INDEX(Champ,MATCH(A913,Jour,0),3),C913<=INDEX(Champ,MATCH(A913,Jour,0),4)),AND(C913>=INDEX(Champ,MATCH(A913,Jour,0)+1,4),C913<=INDEX(Champ,MATCH(A913,Jour,0)+1,3))),\"occupé\",\"\")","v":""}]
["DIMANCHE",5,6.1736111111111098,{"$f":"IF(OR(AND(C914>=INDEX(Champ,MATCH(A914,Jour,0),3),C914<=INDEX(Champ,MATCH(A914,Jour,0),4)),AND(C914>=INDEX(Champ,MATCH(A914,Jour,0)+1,4),C914<=INDEX(Champ,MATCH(A914,Jour,0)+1,3))),\"occupé\",\"\")","v":""}]
["DIMANCHE",5,6.1805555555555598,{"$f":"IF(OR(AND(C915>=INDEX(Champ,MATCH(A915,Jour,0),3),C915<=INDEX(Champ,MATCH(A915,Jour,0),4)),AND(C915>=INDEX(Champ,MATCH(A915,Jour,0)+1,4),C915<=INDEX(Champ,MATCH(A915,Jour,0)+1,3))),\"occupé\",\"\")","v":""}]
["DIMANCHE",5,6.1875,{"$f":"IF(OR(AND(C916>=INDEX(Champ,MATCH(A916,Jour,0),3),C916<=INDEX(Champ,MATCH(A916,Jour,0),4)),AND(C916>=INDEX(Champ,MATCH(A916,Jour,0)+1,4),C916<=INDEX(Champ,MATCH(A916,Jour,0)+1,3))),\"occupé\",\"\")","v":""}]
["DIMANCHE",5,6.1944444444444402,{"$f":"IF(OR(AND(C917>=INDEX(Champ,MATCH(A917,Jour,0),3),C917<=INDEX(Champ,MATCH(A917,Jour,0),4)),AND(C917>=INDEX(Champ,MATCH(A917,Jour,0)+1,4),C917<=INDEX(Champ,MATCH(A917,Jour,0)+1,3))),\"occupé\",\"\")","v":""}]
["DIMANCHE",5,6.2013888888888902,{"$f":"IF(OR(AND(C918>=INDEX(Champ,MATCH(A918,Jour,0),3),C918<=INDEX(Champ,MATCH(A918,Jour,0),4)),AND(C918>=INDEX(Champ,MATCH(A918,Jour,0)+1,4),C918<=INDEX(Champ,MATCH(A918,Jour,0)+1,3))),\"occupé\",\"\")","v":""}]
["DIMANCHE",6,6.2083333333333304,{"$f":"IF(OR(AND(C919>=INDEX(Champ,MATCH(A919,Jour,0),3),C919<=INDEX(Champ,MATCH(A919,Jour,0),4)),AND(C919>=INDEX(Champ,MATCH(A919,Jour,0)+1,4),C919<=INDEX(Champ,MATCH(A919,Jour,0)+1,3))),\"occupé\",\"\")","v":""}]
["DIMANCHE",6,6.2152777777777803,{"$f":"IF(OR(AND(C920>=INDEX(Champ,MATCH(A920,Jour,0),3),C920<=INDEX(Champ,MATCH(A920,Jour,0),4)),AND(C920>=INDEX(Champ,MATCH(A920,Jour,0)+1,4),C920<=INDEX(Champ,MATCH(A920,Jour,0)+1,3))),\"occupé\",\"\")","v":""}]
["DIMANCHE",6,6.2222222222222197,{"$f":"IF(OR(AND(C921>=INDEX(Champ,MATCH(A921,Jour,0),3),C921<=INDEX(Champ,MATCH(A921,Jour,0),4)),AND(C921>=INDEX(Champ,MATCH(A921,Jour,0)+1,4),C921<=INDEX(Champ,MATCH(A921,Jour,0)+1,3))),\"occupé\",\"\")","v":""}]
["DIMANCHE",6,6.2291666666666696,{"$f":"IF(OR(AND(C922>=INDEX(Champ,MATCH(A922,Jour,0),3),C922<=INDEX(Champ,MATCH(A922,Jour,0),4)),AND(C922>=INDEX(Champ,MATCH(A922,Jour,0)+1,4),C922<=INDEX(Champ,MATCH(A922,Jour,0)+1,3))),\"occupé\",\"\")","v":""}]
["DIMANCHE",6,6.2361111111111098,{"$f":"IF(OR(AND(C923>=INDEX(Champ,MATCH(A923,Jour,0),3),C923<=INDEX(Champ,MATCH(A923,Jour,0),4)),AND(C923>=INDEX(Champ,MATCH(A923,Jour,0)+1,4),C923<=INDEX(Champ,MATCH(A923,Jour,0)+1,3))),\"occupé\",\"\")","v":""}]
["DIMANCHE",6,6.2430555555555598,{"$f":"IF(OR(AND(C924>=INDEX(Champ,MATCH(A924,Jour,0),3),C924<=INDEX(Champ,MATCH(A924,Jour,0),4)),AND(C924>=INDEX(Champ,MATCH(A924,Jour,0)+1,4),C924<=INDEX(Champ,MATCH(A924,Jour,0)+1,3))),\"occupé\",\"\")","v":""}]
["DIMANCHE",7,6.25,{"$f":"IF(OR(AND(C925>=INDEX(Champ,MATCH(A925,Jour,0),3),C925<=INDEX(Champ,MATCH(A925,Jour,0),4)),AND(C925>=INDEX(Champ,MATCH(A925,Jour,0)+1,4),C925<=INDEX(Champ,MATCH(A925,Jour,0)+1,3))),\"occupé\",\"\")","v":""}]
["DIMANCHE",7,6.2569444444444402,{"$f":"IF(OR(AND(C926>=INDEX(Champ,MATCH(A926,Jour,0),3),C926<=INDEX(Champ,MATCH(A926,Jour,0),4)),AND(C926>=INDEX(Champ,MATCH(A926,Jour,0)+1,4),C926<=INDEX(Champ,MATCH(A926,Jour,0)+1,3))),\"occupé\",\"\")","v":""}]
["DIMANCHE",7,6.2638888888888902,{"$f":"IF(OR(AND(C927>=INDEX(Champ,MATCH(A927,Jour,0),3),C927<=INDEX(Champ,MATCH(A927,Jour,0),4)),AND(C927>=INDEX(Champ,MATCH(A927,Jour,0)+1,4),C927<=INDEX(Champ,MATCH(A927,Jour,0)+1,3))),\"occupé\",\"\")","v":""}]
["DIMANCHE",7,6.2708333333333304,{"$f":"IF(OR(AND(C928>=INDEX(Champ,MATCH(A928,Jour,0),3),C928<=INDEX(Champ,MATCH(A928,Jour,0),4)),AND(C928>=INDEX(Champ,MATCH(A928,Jour,0)+1,4),C928<=INDEX(Champ,MATCH(A928,Jour,0)+1,3))),\"occupé\",\"\")","v":""}]
["DIMANCHE",7,6.2777777777777803,{"$f":"IF(OR(AND(C929>=INDEX(Champ,MATCH(A929,Jour,0),3),C929<=INDEX(Champ,MATCH(A929,Jour,0),4)),AND(C929>=INDEX(Champ,MATCH(A929,Jour,0)+1,4),C929<=INDEX(Champ,MATCH(A929,Jour,0)+1,3))),\"occupé\",\"\")","v":""}]
["DIMANCHE",7,6.2847222222222197,{"$f":"IF(OR(AND(C930>=INDEX(Champ,MATCH(A930,Jour,0),3),C930<=INDEX(Champ,MATCH(A930,Jour,0),4)),AND(C930>=INDEX(Champ,MATCH(A930,Jour,0)+1,4),C930<=INDEX(Champ,MATCH(A930,Jour,0)+1,3))),\"occupé\",\"\")","v":""}]
["DIMANCHE",8,6.2916666666666696,{"$f":"IF(OR(AND(C931>=INDEX(Champ,MATCH(A931,Jour,0),3),C931<=INDEX(Champ,MATCH(A931,Jour,0),4)),AND(C931>=INDEX(Champ,MATCH(A931,Jour,0)+1,4),C931<=INDEX(Champ,MATCH(A931,Jour,0)+1,3))),\"occupé\",\"\")","v":""}]
["DIMANCHE",8,6.2986111111111098,{"$f":"IF(OR(AND(C932>=INDEX(Champ,MATCH(A932,Jour,0),3),C932<=INDEX(Champ,MATCH(A932,Jour,0),4)),AND(C932>=INDEX(Champ,MATCH(A932,Jour,0)+1,4),C932<=INDEX(Champ,MATCH(A932,Jour,0)+1,3))),\"occupé\",\"\")","v":""}]
["DIMANCHE",8,6.3055555555555598,{"$f":"IF(OR(AND(C933>=INDEX(Champ,MATCH(A933,Jour,0),3),C933<=INDEX(Champ,MATCH(A933,Jour,0),4)),AND(C933>=INDEX(Champ,MATCH(A933,Jour,0)+1,4),C933<=INDEX(Champ,MATCH(A933,Jour,0)+1,3))),\"occupé\",\"\")","v":""}]
["DIMANCHE",8,6.3125,{"$f":"IF(OR(AND(C934>=INDEX(Champ,MATCH(A934,Jour,0),3),C934<=INDEX(Champ,MATCH(A934,Jour,0),4)),AND(C934>=INDEX(Champ,MATCH(A934,Jour,0)+1,4),C934<=INDEX(Champ,MATCH(A934,Jour,0)+1,3))),\"occupé\",\"\")","v":""}]
["DIMANCHE",8,6.3194444444444402,{"$f":"IF(OR(AND(C935>=INDEX(Champ,MATCH(A935,Jour,0),3),C935<=INDEX(Champ,MATCH(A935,Jour,0),4)),AND(C935>=INDEX(Champ,MATCH(A935,Jour,0)+1,4),C935<=INDEX(Champ,MATCH(A935,Jour,0)+1,3))),\"occupé\",\"\")","v":""}]
["DIMANCHE",8,6.3263888888888902,{"$f":"IF(OR(AND(C936>=INDEX(Champ,MATCH(A936,Jour,0),3),C936<=INDEX(Champ,MATCH(A936,Jour,0),4)),AND(C936>=INDEX(Champ,MATCH(A936,Jour,0)+1,4),C936<=INDEX(Champ,MATCH(A936,Jour,0)+1,3))),\"occupé\",\"\")","v":""}]
["DIMANCHE",9,6.3333333333333304,{"$f":"IF(OR(AND(C937>=INDEX(Champ,MATCH(A937,Jour,0),3),C937<=INDEX(Champ,MATCH(A937,Jour,0),4)),AND(C937>=INDEX(Champ,MATCH(A937,Jour,0)+1,4),C937<=INDEX(Champ,MATCH(A937,Jour,0)+1,3))),\"occupé\",\"\")","v":""}]
["DIMANCHE",9,6.3402777777777803,{"$f":"IF(OR(AND(C938>=INDEX(Champ,MATCH(A938,Jour,0),3),C938<=INDEX(Champ,MATCH(A938,Jour,0),4)),AND(C938>=INDEX(Champ,MATCH(A938,Jour,0)+1,4),C938<=INDEX(Champ,MATCH(A938,Jour,0)+1,3))),\"occupé\",\"\")","v":""}]
["DIMANCHE",9,6.3472222222222197,{"$f":"IF(OR(AND(C939>=INDEX(Champ,MATCH(A939,Jour,0),3),C939<=INDEX(Champ,MATCH(A939,Jour,0),4)),AND(C939>=INDEX(Champ,MATCH(A939,Jour,0)+1,4),C939<=INDEX(Champ,MATCH(A939,Jour,0)+1,3))),\"occupé\",\"\")","v":""}]
["DIMANCHE",9,6.3541666666666696,{"$f":"IF(OR(AND(C940>=INDEX(Champ,MATCH(A940,Jour,0),3),C940<=INDEX(Champ,MATCH(A940,Jour,0),4)),AND(C940>=INDEX(Champ,MATCH(A940,Jour,0)+1,4),C940<=INDEX(Champ,MATCH(A940,Jour,0)+1,3))),\"occupé\",\"\")","v":""}]
["DIMANCHE",9,6.3611111111111098,{"$f":"IF(OR(AND(C941>=INDEX(Champ,MATCH(A941,Jour,0),3),C941<=INDEX(Champ,MATCH(A941,Jour,0),4)),AND(C941>=INDEX(Champ,MATCH(A941,Jour,0)+1,4),C941<=INDEX(Champ,MATCH(A941,Jour,0)+1,3))),\"occupé\",\"\")","v":""}]
["DIMANCHE",9,6.3680555555555598,{"$f":"IF(OR(AND(C942>=INDEX(Champ,MATCH(A942,Jour,0),3),C942<=INDEX(Champ,MATCH(A942,Jour,0),4)),AND(C942>=INDEX(Champ,MATCH(A942,Jour,0)+1,4),C942<=INDEX(Champ,MATCH(A942,Jour,0)+1,3))),\"occupé\",\"\")","v":""}]
["DIMANCHE",10,6.375,{"$f":"IF(OR(AND(C943>=INDEX(Champ,MATCH(A943,Jour,0),3),C943<=INDEX(Champ,MATCH(A943,Jour,0),4)),AND(C943>=INDEX(Champ,MATCH(A943,Jour,0)+1,4),C943<=INDEX(Champ,MATCH(A943,Jour,0)+1,3))),\"occupé\",\"\")","v":""}]
["DIMANCHE",10,6.3819444444444402,{"$f":"IF(OR(AND(C944>=INDEX(Champ,MATCH(A944,Jour,0),3),C944<=INDEX(Champ,MATCH(A944,Jour,0),4)),AND(C944>=INDEX(Champ,MATCH(A944,Jour,0)+1,4),C944<=INDEX(Champ,MATCH(A944,Jour,0)+1,3))),\"occupé\",\"\")","v":""}]
["DIMANCHE",10,6.3888888888888902,{"$f":"IF(OR(AND(C945>=INDEX(Champ,MATCH(A945,Jour,0),3),C945<=INDEX(Champ,MATCH(A945,Jour,0),4)),AND(C945>=INDEX(Champ,MATCH(A945,Jour,0)+1,4),C945<=INDEX(Champ,MATCH(A945,Jour,0)+1,3))),\"occupé\",\"\")","v":""}]
["DIMANCHE",10,6.3958333333333304,{"$f":"IF(OR(AND(C946>=INDEX(Champ,MATCH(A946,Jour,0),3),C946<=INDEX(Champ,MATCH(A946,Jour,0),4)),AND(C946>=INDEX(Champ,MATCH(A946,Jour,0)+1,4),C946<=INDEX(Champ,MATCH(A946,Jour,0)+1,3))),\"occupé\",\"\")","v":""}]
["DIMANCHE",10,6.4027777777777803,{"$f":"IF(OR(AND(C947>=INDEX(Champ,MATCH(A947,Jour,0),3),C947<=INDEX(Champ,MATCH(A947,Jour,0),4)),AND(C947>=INDEX(Champ,MATCH(A947,Jour,0)+1,4),C947<=INDEX(Champ,MATCH(A947,Jour,0)+1,3))),\"occupé\",\"\")","v":""}]
["DIMANCHE",10,6.4097222222222197,{"$f":"IF(OR(AND(C948>=INDEX(Champ,MATCH(A948,Jour,0),3),C948<=INDEX(Champ,MATCH(A948,Jour,0),4)),AND(C948>=INDEX(Champ,MATCH(A948,Jour,0)+1,4),C948<=INDEX(Champ,MATCH(A948,Jour,0)+1,3))),\"occupé\",\"\")","v":""}]
["DIMANCHE",11,6.4166666666666696,{"$f":"IF(OR(AND(C949>=INDEX(Champ,MATCH(A949,Jour,0),3),C949<=INDEX(Champ,MATCH(A949,Jour,0),4)),AND(C949>=INDEX(Champ,MATCH(A949,Jour,0)+1,4),C949<=INDEX(Champ,MATCH(A949,Jour,0)+1,3))),\"occupé\",\"\")","v":""}]
["DIMANCHE",11,6.4236111111111098,{"$f":"IF(OR(AND(C950>=INDEX(Champ,MATCH(A950,Jour,0),3),C950<=INDEX(Champ,MATCH(A950,Jour,0),4)),AND(C950>=INDEX(Champ,MATCH(A950,Jour,0)+1,4),C950<=INDEX(Champ,MATCH(A950,Jour,0)+1,3))),\"occupé\",\"\")","v":""}]
["DIMANCHE",11,6.4305555555555598,{"$f":"IF(OR(AND(C951>=INDEX(Champ,MATCH(A951,Jour,0),3),C951<=INDEX(Champ,MATCH(A951,Jour,0),4)),AND(C951>=INDEX(Champ,MATCH(A951,Jour,0)+1,4),C951<=INDEX(Champ,MATCH(A951,Jour,0)+1,3))),\"occupé\",\"\")","v":""}]
["DIMANCHE",11,6.4375,{"$f":"IF(OR(AND(C952>=INDEX(Champ,MATCH(A952,Jour,0),3),C952<=INDEX(Champ,MATCH(A952,Jour,0),4)),AND(C952>=INDEX(Champ,MATCH(A952,Jour,0)+1,4),C952<=INDEX(Champ,MATCH(A952,Jour,0)+1,3))),\"occupé\",\"\")","v":""}]
["DIMANCHE",11,6.4444444444444402,{"$f":"IF(OR(AND(C953>=INDEX(Champ,MATCH(A953,Jour,0),3),C953<=INDEX(Champ,MATCH(A953,Jour,0),4)),AND(C953>=INDEX(Champ,MATCH(A953,Jour,0)+1,4),C953<=INDEX(Champ,MATCH(A953,Jour,0)+1,3))),\"occupé\",\"\")","v":""}]
["DIMANCHE",11,6.4513888888888902,{"$f":"IF(OR(AND(C954>=INDEX(Champ,MATCH(A954,Jour,0),3),C954<=INDEX(Champ,MATCH(A954,Jour,0),4)),AND(C954>=INDEX(Champ,MATCH(A954,Jour,0)+1,4),C954<=INDEX(Champ,MATCH(A954,Jour,0)+1,3))),\"occupé\",\"\")","v":""}]
["DIMANCHE",12,6.4583333333333304,{"$f":"IF(OR(AND(C955>=INDEX(Champ,MATCH(A955,Jour,0),3),C955<=INDEX(Champ,MATCH(A955,Jour,0),4)),AND(C955>=INDEX(Champ,MATCH(A955,Jour,0)+1,4),C955<=INDEX(Champ,MATCH(A955,Jour,0)+1,3))),\"occupé\",\"\")","v":""}]
["DIMANCHE",12,6.4652777777777803,{"$f":"IF(OR(AND(C956>=INDEX(Champ,MATCH(A956,Jour,0),3),C956<=INDEX(Champ,MATCH(A956,Jour,0),4)),AND(C956>=INDEX(Champ,MATCH(A956,Jour,0)+1,4),C956<=INDEX(Champ,MATCH(A956,Jour,0)+1,3))),\"occupé\",\"\")","v":""}]
["DIMANCHE",12,6.4722222222222197,{"$f":"IF(OR(AND(C957>=INDEX(Champ,MATCH(A957,Jour,0),3),C957<=INDEX(Champ,MATCH(A957,Jour,0),4)),AND(C957>=INDEX(Champ,MATCH(A957,Jour,0)+1,4),C957<=INDEX(Champ,MATCH(A957,Jour,0)+1,3))),\"occupé\",\"\")","v":""}]
["DIMANCHE",12,6.4791666666666696,{"$f":"IF(OR(AND(C958>=INDEX(Champ,MATCH(A958,Jour,0),3),C958<=INDEX(Champ,MATCH(A958,Jour,0),4)),AND(C958>=INDEX(Champ,MATCH(A958,Jour,0)+1,4),C958<=INDEX(Champ,MATCH(A958,Jour,0)+1,3))),\"occupé\",\"\")","v":""}]
["DIMANCHE",12,6.4861111111111098,{"$f":"IF(OR(AND(C959>=INDEX(Champ,MATCH(A959,Jour,0),3),C959<=INDEX(Champ,MATCH(A959,Jour,0),4)),AND(C959>=INDEX(Champ,MATCH(A959,Jour,0)+1,4),C959<=INDEX(Champ,MATCH(A959,Jour,0)+1,3))),\"occupé\",\"\")","v":""}]
["DIMANCHE",12,6.4930555555555598,{"$f":"IF(OR(AND(C960>=INDEX(Champ,MATCH(A960,Jour,0),3),C960<=INDEX(Champ,MATCH(A960,Jour,0),4)),AND(C960>=INDEX(Champ,MATCH(A960,Jour,0)+1,4),C960<=INDEX(Champ,MATCH(A960,Jour,0)+1,3))),\"occupé\",\"\")","v":""}]
["DIMANCHE",13,6.5,{"$f":"IF(OR(AND(C961>=INDEX(Champ,MATCH(A961,Jour,0),3),C961<=INDEX(Champ,MATCH(A961,Jour,0),4)),AND(C961>=INDEX(Champ,MATCH(A961,Jour,0)+1,4),C961<=INDEX(Champ,MATCH(A961,Jour,0)+1,3))),\"occupé\",\"\")","v":""}]
["DIMANCHE",13,6.5069444444444402,{"$f":"IF(OR(AND(C962>=INDEX(Champ,MATCH(A962,Jour,0),3),C962<=INDEX(Champ,MATCH(A962,Jour,0),4)),AND(C962>=INDEX(Champ,MATCH(A962,Jour,0)+1,4),C962<=INDEX(Champ,MATCH(A962,Jour,0)+1,3))),\"occupé\",\"\")","v":""}]
["DIMANCHE",13,6.5138888888888902,{"$f":"IF(OR(AND(C963>=INDEX(Champ,MATCH(A963,Jour,0),3),C963<=INDEX(Champ,MATCH(A963,Jour,0),4)),AND(C963>=INDEX(Champ,MATCH(A963,Jour,0)+1,4),C963<=INDEX(Champ,MATCH(A963,Jour,0)+1,3))),\"occupé\",\"\")","v":""}]
["DIMANCHE",13,6.5208333333333304,{"$f":"IF(OR(AND(C964>=INDEX(Champ,MATCH(A964,Jour,0),3),C964<=INDEX(Champ,MATCH(A964,Jour,0),4)),AND(C964>=INDEX(Champ,MATCH(A964,Jour,0)+1,4),C964<=INDEX(Champ,MATCH(A964,Jour,0)+1,3))),\"occupé\",\"\")","v":""}]
["DIMANCHE",13,6.5277777777777803,{"$f":"IF(OR(AND(C965>=INDEX(Champ,MATCH(A965,Jour,0),3),C965<=INDEX(Champ,MATCH(A965,Jour,0),4)),AND(C965>=INDEX(Champ,MATCH(A965,Jour,0)+1,4),C965<=INDEX(Champ,MATCH(A965,Jour,0)+1,3))),\"occupé\",\"\")","v":""}]
["DIMANCHE",13,6.5347222222222197,{"$f":"IF(OR(AND(C966>=INDEX(Champ,MATCH(A966,Jour,0),3),C966<=INDEX(Champ,MATCH(A966,Jour,0),4)),AND(C966>=INDEX(Champ,MATCH(A966,Jour,0)+1,4),C966<=INDEX(Champ,MATCH(A966,Jour,0)+1,3))),\"occupé\",\"\")","v":""}]
["DIMANCHE",14,6.5416666666666696,{"$f":"IF(OR(AND(C967>=INDEX(Champ,MATCH(A967,Jour,0),3),C967<=INDEX(Champ,MATCH(A967,Jour,0),4)),AND(C967>=INDEX(Champ,MATCH(A967,Jour,0)+1,4),C967<=INDEX(Champ,MATCH(A967,Jour,0)+1,3))),\"occupé\",\"\")","v":""}]
["DIMANCHE",14,6.5486111111111098,{"$f":"IF(OR(AND(C968>=INDEX(Champ,MATCH(A968,Jour,0),3),C968<=INDEX(Champ,MATCH(A968,Jour,0),4)),AND(C968>=INDEX(Champ,MATCH(A968,Jour,0)+1,4),C968<=INDEX(Champ,MATCH(A968,Jour,0)+1,3))),\"occupé\",\"\")","v":""}]
["DIMANCHE",14,6.5555555555555598,{"$f":"IF(OR(AND(C969>=INDEX(Champ,MATCH(A969,Jour,0),3),C969<=INDEX(Champ,MATCH(A969,Jour,0),4)),AND(C969>=INDEX(Champ,MATCH(A969,Jour,0)+1,4),C969<=INDEX(Champ,MATCH(A969,Jour,0)+1,3))),\"occupé\",\"\")","v":""}]
["DIMANCHE",14,6.5625,{"$f":"IF(OR(AND(C970>=INDEX(Champ,MATCH(A970,Jour,0),3),C970<=INDEX(Champ,MATCH(A970,Jour,0),4)),AND(C970>=INDEX(Champ,MATCH(A970,Jour,0)+1,4),C970<=INDEX(Champ,MATCH(A970,Jour,0)+1,3))),\"occupé\",\"\")","v":""}]
["DIMANCHE",14,6.5694444444444402,{"$f":"IF(OR(AND(C971>=INDEX(Champ,MATCH(A971,Jour,0),3),C971<=INDEX(Champ,MATCH(A971,Jour,0),4)),AND(C971>=INDEX(Champ,MATCH(A971,Jour,0)+1,4),C971<=INDEX(Champ,MATCH(A971,Jour,0)+1,3))),\"occupé\",\"\")","v":""}]
["DIMANCHE",14,6.5763888888888902,{"$f":"IF(OR(AND(C972>=INDEX(Champ,MATCH(A972,Jour,0),3),C972<=INDEX(Champ,MATCH(A972,Jour,0),4)),AND(C972>=INDEX(Champ,MATCH(A972,Jour,0)+1,4),C972<=INDEX(Champ,MATCH(A972,Jour,0)+1,3))),\"occupé\",\"\")","v":""}]
["DIMANCHE",15,6.5833333333333304,{"$f":"IF(OR(AND(C973>=INDEX(Champ,MATCH(A973,Jour,0),3),C973<=INDEX(Champ,MATCH(A973,Jour,0),4)),AND(C973>=INDEX(Champ,MATCH(A973,Jour,0)+1,4),C973<=INDEX(Champ,MATCH(A973,Jour,0)+1,3))),\"occupé\",\"\")","v":""}]
["DIMANCHE",15,6.5902777777777803,{"$f":"IF(OR(AND(C974>=INDEX(Champ,MATCH(A974,Jour,0),3),C974<=INDEX(Champ,MATCH(A974,Jour,0),4)),AND(C974>=INDEX(Champ,MATCH(A974,Jour,0)+1,4),C974<=INDEX(Champ,MATCH(A974,Jour,0)+1,3))),\"occupé\",\"\")","v":""}]
["DIMANCHE",15,6.5972222222222197,{"$f":"IF(OR(AND(C975>=INDEX(Champ,MATCH(A975,Jour,0),3),C975<=INDEX(Champ,MATCH(A975,Jour,0),4)),AND(C975>=INDEX(Champ,MATCH(A975,Jour,0)+1,4),C975<=INDEX(Champ,MATCH(A975,Jour,0)+1,3))),\"occupé\",\"\")","v":""}]
["DIMANCHE",15,6.6041666666666696,{"$f":"IF(OR(AND(C976>=INDEX(Champ,MATCH(A976,Jour,0),3),C976<=INDEX(Champ,MATCH(A976,Jour,0),4)),AND(C976>=INDEX(Champ,MATCH(A976,Jour,0)+1,4),C976<=INDEX(Champ,MATCH(A976,Jour,0)+1,3))),\"occupé\",\"\")","v":""}]
["DIMANCHE",15,6.6111111111111098,{"$f":"IF(OR(AND(C977>=INDEX(Champ,MATCH(A977,Jour,0),3),C977<=INDEX(Champ,MATCH(A977,Jour,0),4)),AND(C977>=INDEX(Champ,MATCH(A977,Jour,0)+1,4),C977<=INDEX(Champ,MATCH(A977,Jour,0)+1,3))),\"occupé\",\"\")","v":""}]
["DIMANCHE",15,6.6180555555555598,{"$f":"IF(OR(AND(C978>=INDEX(Champ,MATCH(A978,Jour,0),3),C978<=INDEX(Champ,MATCH(A978,Jour,0),4)),AND(C978>=INDEX(Champ,MATCH(A978,Jour,0)+1,4),C978<=INDEX(Champ,MATCH(A978,Jour,0)+1,3))),\"occupé\",\"\")","v":""}]
["DIMANCHE",16,6.625,{"$f":"IF(OR(AND(C979>=INDEX(Champ,MATCH(A979,Jour,0),3),C979<=INDEX(Champ,MATCH(A979,Jour,0),4)),AND(C979>=INDEX(Champ,MATCH(A979,Jour,0)+1,4),C979<=INDEX(Champ,MATCH(A979,Jour,0)+1,3))),\"occupé\",\"\")","v":""}]
["DIMANCHE",16,6.6319444444444402,{"$f":"IF(OR(AND(C980>=INDEX(Champ,MATCH(A980,Jour,0),3),C980<=INDEX(Champ,MATCH(A980,Jour,0),4)),AND(C980>=INDEX(Champ,MATCH(A980,Jour,0)+1,4),C980<=INDEX(Champ,MATCH(A980,Jour,0)+1,3))),\"occupé\",\"\")","v":""}]
["DIMANCHE",16,6.6388888888888902,{"$f":"IF(OR(AND(C981>=INDEX(Champ,MATCH(A981,Jour,0),3),C981<=INDEX(Champ,MATCH(A981,Jour,0),4)),AND(C981>=INDEX(Champ,MATCH(A981,Jour,0)+1,4),C981<=INDEX(Champ,MATCH(A981,Jour,0)+1,3))),\"occupé\",\"\")","v":""}]
["DIMANCHE",16,6.6458333333333304,{"$f":"IF(OR(AND(C982>=INDEX(Champ,MATCH(A982,Jour,0),3),C982<=INDEX(Champ,MATCH(A982,Jour,0),4)),AND(C982>=INDEX(Champ,MATCH(A982,Jour,0)+1,4),C982<=INDEX(Champ,MATCH(A982,Jour,0)+1,3))),\"occupé\",\"\")","v":""}]
["DIMANCHE",16,6.6527777777777803,{"$f":"IF(OR(AND(C983>=INDEX(Champ,MATCH(A983,Jour,0),3),C983<=INDEX(Champ,MATCH(A983,Jour,0),4)),AND(C983>=INDEX(Champ,MATCH(A983,Jour,0)+1,4),C983<=INDEX(Champ,MATCH(A983,Jour,0)+1,3))),\"occupé\",\"\")","v":""}]
["DIMANCHE",16,6.6597222222222197,{"$f":"IF(OR(AND(C984>=INDEX(Champ,MATCH(A984,Jour,0),3),C984<=INDEX(Champ,MATCH(A984,Jour,0),4)),AND(C984>=INDEX(Champ,MATCH(A984,Jour,0)+1,4),C984<=INDEX(Champ,MATCH(A984,Jour,0)+1,3))),\"occupé\",\"\")","v":""}]
["DIMANCHE",17,6.6666666666666696,{"$f":"IF(OR(AND(C985>=INDEX(Champ,MATCH(A985,Jour,0),3),C985<=INDEX(Champ,MATCH(A985,Jour,0),4)),AND(C985>=INDEX(Champ,MATCH(A985,Jour,0)+1,4),C985<=INDEX(Champ,MATCH(A985,Jour,0)+1,3))),\"occupé\",\"\")","v":""}]
["DIMANCHE",17,6.6736111111111098,{"$f":"IF(OR(AND(C986>=INDEX(Champ,MATCH(A986,Jour,0),3),C986<=INDEX(Champ,MATCH(A986,Jour,0),4)),AND(C986>=INDEX(Champ,MATCH(A986,Jour,0)+1,4),C986<=INDEX(Champ,MATCH(A986,Jour,0)+1,3))),\"occupé\",\"\")","v":""}]
["DIMANCHE",17,6.6805555555555598,{"$f":"IF(OR(AND(C987>=INDEX(Champ,MATCH(A987,Jour,0),3),C987<=INDEX(Champ,MATCH(A987,Jour,0),4)),AND(C987>=INDEX(Champ,MATCH(A987,Jour,0)+1,4),C987<=INDEX(Champ,MATCH(A987,Jour,0)+1,3))),\"occupé\",\"\")","v":""}]
["DIMANCHE",17,6.6875,{"$f":"IF(OR(AND(C988>=INDEX(Champ,MATCH(A988,Jour,0),3),C988<=INDEX(Champ,MATCH(A988,Jour,0),4)),AND(C988>=INDEX(Champ,MATCH(A988,Jour,0)+1,4),C988<=INDEX(Champ,MATCH(A988,Jour,0)+1,3))),\"occupé\",\"\")","v":""}]
["DIMANCHE",17,6.6944444444444402,{"$f":"IF(OR(AND(C989>=INDEX(Champ,MATCH(A989,Jour,0),3),C989<=INDEX(Champ,MATCH(A989,Jour,0),4)),AND(C989>=INDEX(Champ,MATCH(A989,Jour,0)+1,4),C989<=INDEX(Champ,MATCH(A989,Jour,0)+1,3))),\"occupé\",\"\")","v":""}]
["DIMANCHE",17,6.7013888888888902,{"$f":"IF(OR(AND(C990>=INDEX(Champ,MATCH(A990,Jour,0),3),C990<=INDEX(Champ,MATCH(A990,Jour,0),4)),AND(C990>=INDEX(Champ,MATCH(A990,Jour,0)+1,4),C990<=INDEX(Champ,MATCH(A990,Jour,0)+1,3))),\"occupé\",\"\")","v":""}]
["DIMANCHE",18,6.7083333333333304,{"$f":"IF(OR(AND(C991>=INDEX(Champ,MATCH(A991,Jour,0),3),C991<=INDEX(Champ,MATCH(A991,Jour,0),4)),AND(C991>=INDEX(Champ,MATCH(A991,Jour,0)+1,4),C991<=INDEX(Champ,MATCH(A991,Jour,0)+1,3))),\"occupé\",\"\")","v":""}]
["DIMANCHE",18,6.7152777777777803,{"$f":"IF(OR(AND(C992>=INDEX(Champ,MATCH(A992,Jour,0),3),C992<=INDEX(Champ,MATCH(A992,Jour,0),4)),AND(C992>=INDEX(Champ,MATCH(A992,Jour,0)+1,4),C992<=INDEX(Champ,MATCH(A992,Jour,0)+1,3))),\"occupé\",\"\")","v":""}]
["DIMANCHE",18,6.7222222222222197,{"$f":"IF(OR(AND(C993>=INDEX(Champ,MATCH(A993,Jour,0),3),C993<=INDEX(Champ,MATCH(A993,Jour,0),4)),AND(C993>=INDEX(Champ,MATCH(A993,Jour,0)+1,4),C993<=INDEX(Champ,MATCH(A993,Jour,0)+1,3))),\"occupé\",\"\")","v":""}]
["DIMANCHE",18,6.7291666666666696,{"$f":"IF(OR(AND(C994>=INDEX(Champ,MATCH(A994,Jour,0),3),C994<=INDEX(Champ,MATCH(A994,Jour,0),4)),AND(C994>=INDEX(Champ,MATCH(A994,Jour,0)+1,4),C994<=INDEX(Champ,MATCH(A994,Jour,0)+1,3))),\"occupé\",\"\")","v":""}]
["DIMANCHE",18,6.7361111111111098,{"$f":"IF(OR(AND(C995>=INDEX(Champ,MATCH(A995,Jour,0),3),C995<=INDEX(Champ,MATCH(A995,Jour,0),4)),AND(C995>=INDEX(Champ,MATCH(A995,Jour,0)+1,4),C995<=INDEX(Champ,MATCH(A995,Jour,0)+1,3))),\"occupé\",\"\")","v":""}]
["DIMANCHE",18,6.7430555555555598,{"$f":"IF(OR(AND(C996>=INDEX(Champ,MATCH(A996,Jour,0),3),C996<=INDEX(Champ,MATCH(A996,Jour,0),4)),AND(C996>=INDEX(Champ,MATCH(A996,Jour,0)+1,4),C996<=INDEX(Champ,MATCH(A996,Jour,0)+1,3))),\"occupé\",\"\")","v":""}]
["DIMANCHE",19,6.75,{"$f":"IF(OR(AND(C997>=INDEX(Champ,MATCH(A997,Jour,0),3),C997<=INDEX(Champ,MATCH(A997,Jour,0),4)),AND(C997>=INDEX(Champ,MATCH(A997,Jour,0)+1,4),C997<=INDEX(Champ,MATCH(A997,Jour,0)+1,3))),\"occupé\",\"\")","v":""}]
["DIMANCHE",19,6.7569444444444402,{"$f":"IF(OR(AND(C998>=INDEX(Champ,MATCH(A998,Jour,0),3),C998<=INDEX(Champ,MATCH(A998,Jour,0),4)),AND(C998>=INDEX(Champ,MATCH(A998,Jour,0)+1,4),C998<=INDEX(Champ,MATCH(A998,Jour,0)+1,3))),\"occupé\",\"\")","v":""}]
["DIMANCHE",19,6.7638888888888902,{"$f":"IF(OR(AND(C999>=INDEX(Champ,MATCH(A999,Jour,0),3),C999<=INDEX(Champ,MATCH(A999,Jour,0),4)),AND(C999>=INDEX(Champ,MATCH(A999,Jour,0)+1,4),C999<=INDEX(Champ,MATCH(A999,Jour,0)+1,3))),\"occupé\",\"\")","v":""}]
["DIMANCHE",19,6.7708333333333304,{"$f":"IF(OR(AND(C1000>=INDEX(Champ,MATCH(A1000,Jour,0),3),C1000<=INDEX(Champ,MATCH(A1000,Jour,0),4)),AND(C1000>=INDEX(Champ,MATCH(A1000,Jour,0)+1,4),C1000<=INDEX(Champ,MATCH(A1000,Jour,0)+1,3))),\"occupé\",\"\")","v":""}]
["DIMANCHE",19,6.7777777777777803,{"$f":"IF(OR(AND(C1001>=INDEX(Champ,MATCH(A1001,Jour,0),3),C1001<=INDEX(Champ,MATCH(A1001,Jour,0),4)),AND(C1001>=INDEX(Champ,MATCH(A1001,Jour,0)+1,4),C1001<=INDEX(Champ,MATCH(A1001,Jour,0)+1,3))),\"occupé\",\"\")","v":""}]
["DIMANCHE",19,6.7847222222222197,{"$f":"IF(OR(AND(C1002>=INDEX(Champ,MATCH(A1002,Jour,0),3),C1002<=INDEX(Champ,MATCH(A1002,Jour,0),4)),AND(C1002>=INDEX(Champ,MATCH(A1002,Jour,0)+1,4),C1002<=INDEX(Champ,MATCH(A1002,Jour,0)+1,3))),\"occupé\",\"\")","v":""}]
["DIMANCHE",20,6.7916666666666696,{"$f":"IF(OR(AND(C1003>=INDEX(Champ,MATCH(A1003,Jour,0),3),C1003<=INDEX(Champ,MATCH(A1003,Jour,0),4)),AND(C1003>=INDEX(Champ,MATCH(A1003,Jour,0)+1,4),C1003<=INDEX(Champ,MATCH(A1003,Jour,0)+1,3))),\"occupé\",\"\")","v":""}]
["DIMANCHE",20,6.7986111111111098,{"$f":"IF(OR(AND(C1004>=INDEX(Champ,MATCH(A1004,Jour,0),3),C1004<=INDEX(Champ,MATCH(A1004,Jour,0),4)),AND(C1004>=INDEX(Champ,MATCH(A1004,Jour,0)+1,4),C1004<=INDEX(Champ,MATCH(A1004,Jour,0)+1,3))),\"occupé\",\"\")","v":""}]
["DIMANCHE",20,6.8055555555555598,{"$f":"IF(OR(AND(C1005>=INDEX(Champ,MATCH(A1005,Jour,0),3),C1005<=INDEX(Champ,MATCH(A1005,Jour,0),4)),AND(C1005>=INDEX(Champ,MATCH(A1005,Jour,0)+1,4),C1005<=INDEX(Champ,MATCH(A1005,Jour,0)+1,3))),\"occupé\",\"\")","v":""}]
["DIMANCHE",20,6.8125,{"$f":"IF(OR(AND(C1006>=INDEX(Champ,MATCH(A1006,Jour,0),3),C1006<=INDEX(Champ,MATCH(A1006,Jour,0),4)),AND(C1006>=INDEX(Champ,MATCH(A1006,Jour,0)+1,4),C1006<=INDEX(Champ,MATCH(A1006,Jour,0)+1,3))),\"occupé\",\"\")","v":""}]
["DIMANCHE",20,6.8194444444444402,{"$f":"IF(OR(AND(C1007>=INDEX(Champ,MATCH(A1007,Jour,0),3),C1007<=INDEX(Champ,MATCH(A1007,Jour,0),4)),AND(C1007>=INDEX(Champ,MATCH(A1007,Jour,0)+1,4),C1007<=INDEX(Champ,MATCH(A1007,Jour,0)+1,3))),\"occupé\",\"\")","v":""}]
["DIMANCHE",20,6.8263888888888902,{"$f":"IF(OR(AND(C1008>=INDEX(Champ,MATCH(A1008,Jour,0),3),C1008<=INDEX(Champ,MATCH(A1008,Jour,0),4)),AND(C1008>=INDEX(Champ,MATCH(A1008,Jour,0)+1,4),C1008<=INDEX(Champ,MATCH(A1008,Jour,0)+1,3))),\"occupé\",\"\")","v":""}]
["DIMANCHE",21,6.8333333333333304,{"$f":"IF(OR(AND(C1009>=INDEX(Champ,MATCH(A1009,Jour,0),3),C1009<=INDEX(Champ,MATCH(A1009,Jour,0),4)),AND(C1009>=INDEX(Champ,MATCH(A1009,Jour,0)+1,4),C1009<=INDEX(Champ,MATCH(A1009,Jour,0)+1,3))),\"occupé\",\"\")","v":""}]
["DIMANCHE",21,6.8402777777777803,{"$f":"IF(OR(AND(C1010>=INDEX(Champ,MATCH(A1010,Jour,0),3),C1010<=INDEX(Champ,MATCH(A1010,Jour,0),4)),AND(C1010>=INDEX(Champ,MATCH(A1010,Jour,0)+1,4),C1010<=INDEX(Champ,MATCH(A1010,Jour,0)+1,3))),\"occupé\",\"\")","v":""}]
["DIMANCHE",21,6.8472222222222197,{"$f":"IF(OR(AND(C1011>=INDEX(Champ,MATCH(A1011,Jour,0),3),C1011<=INDEX(Champ,MATCH(A1011,Jour,0),4)),AND(C1011>=INDEX(Champ,MATCH(A1011,Jour,0)+1,4),C1011<=INDEX(Champ,MATCH(A1011,Jour,0)+1,3))),\"occupé\",\"\")","v":""}]
["DIMANCHE",21,6.8541666666666696,{"$f":"IF(OR(AND(C1012>=INDEX(Champ,MATCH(A1012,Jour,0),3),C1012<=INDEX(Champ,MATCH(A1012,Jour,0),4)),AND(C1012>=INDEX(Champ,MATCH(A1012,Jour,0)+1,4),C1012<=INDEX(Champ,MATCH(A1012,Jour,0)+1,3))),\"occupé\",\"\")","v":""}]
["DIMANCHE",21,6.8611111111111098,{"$f":"IF(OR(AND(C1013>=INDEX(Champ,MATCH(A1013,Jour,0),3),C1013<=INDEX(Champ,MATCH(A1013,Jour,0),4)),AND(C1013>=INDEX(Champ,MATCH(A1013,Jour,0)+1,4),C1013<=INDEX(Champ,MATCH(A1013,Jour,0)+1,3))),\"occupé\",\"\")","v":""}]
["DIMANCHE",21,6.8680555555555598,{"$f":"IF(OR(AND(C1014>=INDEX(Champ,MATCH(A1014,Jour,0),3),C1014<=INDEX(Champ,MATCH(A1014,Jour,0),4)),AND(C1014>=INDEX(Champ,MATCH(A1014,Jour,0)+1,4),C1014<=INDEX(Champ,MATCH(A1014,Jour,0)+1,3))),\"occupé\",\"\")","v":""}]
["DIMANCHE",22,6.875,{"$f":"IF(OR(AND(C1015>=INDEX(Champ,MATCH(A1015,Jour,0),3),C1015<=INDEX(Champ,MATCH(A1015,Jour,0),4)),AND(C1015>=INDEX(Champ,MATCH(A1015,Jour,0)+1,4),C1015<=INDEX(Champ,MATCH(A1015,Jour,0)+1,3))),\"occupé\",\"\")","v":""}]
["DIMANCHE",22,6.8819444444444402,{"$f":"IF(OR(AND(C1016>=INDEX(Champ,MATCH(A1016,Jour,0),3),C1016<=INDEX(Champ,MATCH(A1016,Jour,0),4)),AND(C1016>=INDEX(Champ,MATCH(A1016,Jour,0)+1,4),C1016<=INDEX(Champ,MATCH(A1016,Jour,0)+1,3))),\"occupé\",\"\")","v":""}]
["DIMANCHE",22,6.8888888888888902,{"$f":"IF(OR(AND(C1017>=INDEX(Champ,MATCH(A1017,Jour,0),3),C1017<=INDEX(Champ,MATCH(A1017,Jour,0),4)),AND(C1017>=INDEX(Champ,MATCH(A1017,Jour,0)+1,4),C1017<=INDEX(Champ,MATCH(A1017,Jour,0)+1,3))),\"occupé\",\"\")","v":""}]
["DIMANCHE",22,6.8958333333333304,{"$f":"IF(OR(AND(C1018>=INDEX(Champ,MATCH(A1018,Jour,0),3),C1018<=INDEX(Champ,MATCH(A1018,Jour,0),4)),AND(C1018>=INDEX(Champ,MATCH(A1018,Jour,0)+1,4),C1018<=INDEX(Champ,MATCH(A1018,Jour,0)+1,3))),\"occupé\",\"\")","v":""}]
["DIMANCHE",22,6.9027777777777803,{"$f":"IF(OR(AND(C1019>=INDEX(Champ,MATCH(A1019,Jour,0),3),C1019<=INDEX(Champ,MATCH(A1019,Jour,0),4)),AND(C1019>=INDEX(Champ,MATCH(A1019,Jour,0)+1,4),C1019<=INDEX(Champ,MATCH(A1019,Jour,0)+1,3))),\"occupé\",\"\")","v":""}]
["DIMANCHE",22,6.9097222222222197,{"$f":"IF(OR(AND(C1020>=INDEX(Champ,MATCH(A1020,Jour,0),3),C1020<=INDEX(Champ,MATCH(A1020,Jour,0),4)),AND(C1020>=INDEX(Champ,MATCH(A1020,Jour,0)+1,4),C1020<=INDEX(Champ,MATCH(A1020,Jour,0)+1,3))),\"occupé\",\"\")","v":""}]
["DIMANCHE",23,6.9166666666666696,{"$f":"IF(OR(AND(C1021>=INDEX(Champ,MATCH(A1021,Jour,0),3),C1021<=INDEX(Champ,MATCH(A1021,Jour,0),4)),AND(C1021>=INDEX(Champ,MATCH(A1021,Jour,0)+1,4),C1021<=INDEX(Champ,MATCH(A1021,Jour,0)+1,3))),\"occupé\",\"\")","v":""}]
["DIMANCHE",23,6.9236111111111098,{"$f":"IF(OR(AND(C1022>=INDEX(Champ,MATCH(A1022,Jour,0),3),C1022<=INDEX(Champ,MATCH(A1022,Jour,0),4)),AND(C1022>=INDEX(Champ,MATCH(A1022,Jour,0)+1,4),C1022<=INDEX(Champ,MATCH(A1022,Jour,0)+1,3))),\"occupé\",\"\")","v":""}]
["DIMANCHE",23,6.9305555555555598,{"$f":"IF(OR(AND(C1023>=INDEX(Champ,MATCH(A1023,Jour,0),3),C1023<=INDEX(Champ,MATCH(A1023,Jour,0),4)),AND(C1023>=INDEX(Champ,MATCH(A1023,Jour,0)+1,4),C1023<=INDEX(Champ,MATCH(A1023,Jour,0)+1,3))),\"occupé\",\"\")","v":""}]
["DIMANCHE",23,6.9375,{"$f":"IF(OR(AND(C1024>=INDEX(Champ,MATCH(A1024,Jour,0),3),C1024<=INDEX(Champ,MATCH(A1024,Jour,0),4)),AND(C1024>=INDEX(Champ,MATCH(A1024,Jour,0)+1,4),C1024<=INDEX(Champ,MATCH(A1024,Jour,0)+1,3))),\"occupé\",\"\")","v":""}]
["DIMANCHE",23,6.9444444444444402,{"$f":"IF(OR(AND(C1025>=INDEX(Champ,MATCH(A1025,Jour,0),3),C1025<=INDEX(Champ,MATCH(A1025,Jour,0),4)),AND(C1025>=INDEX(Champ,MATCH(A1025,Jour,0)+1,4),C1025<=INDEX(Champ,MATCH(A1025,Jour,0)+1,3))),\"occupé\",\"\")","v":""}]
["DIMANCHE",23,6.9513888888888902,{"$f":"IF(OR(AND(C1026>=INDEX(Champ,MATCH(A1026,Jour,0),3),C1026<=INDEX(Champ,MATCH(A1026,Jour,0),4)),AND(C1026>=INDEX(Champ,MATCH(A1026,Jour,0)+1,4),C1026<=INDEX(Champ,MATCH(A1026,Jour,0)+1,3))),\"occupé\",\"\")","v":""}]
["DIMANCHE",24,6.9583333333333304,{"$f":"IF(OR(AND(C1027>=INDEX(Champ,MATCH(A1027,Jour,0),3),C1027<=INDEX(Champ,MATCH(A1027,Jour,0),4)),AND(C1027>=INDEX(Champ,MATCH(A1027,Jour,0)+1,4),C1027<=INDEX(Champ,MATCH(A1027,Jour,0)+1,3))),\"occupé\",\"\")","v":""}]
["DIMANCHE",24,6.9652777777777803,{"$f":"IF(OR(AND(C1028>=INDEX(Champ,MATCH(A1028,Jour,0),3),C1028<=INDEX(Champ,MATCH(A1028,Jour,0),4)),AND(C1028>=INDEX(Champ,MATCH(A1028,Jour,0)+1,4),C1028<=INDEX(Champ,MATCH(A1028,Jour,0)+1,3))),\"occupé\",\"\")","v":""}]
["DIMANCHE",24,6.9722222222222197,{"$f":"IF(OR(AND(C1029>=INDEX(Champ,MATCH(A1029,Jour,0),3),C1029<=INDEX(Champ,MATCH(A1029,Jour,0),4)),AND(C1029>=INDEX(Champ,MATCH(A1029,Jour,0)+1,4),C1029<=INDEX(Champ,MATCH(A1029,Jour,0)+1,3))),\"occupé\",\"\")","v":""}]
["DIMANCHE",24,6.9791666666666696,{"$f":"IF(OR(AND(C1030>=INDEX(Champ,MATCH(A1030,Jour,0),3),C1030<=INDEX(Champ,MATCH(A1030,Jour,0),4)),AND(C1030>=INDEX(Champ,MATCH(A1030,Jour,0)+1,4),C1030<=INDEX(Champ,MATCH(A1030,Jour,0)+1,3))),\"occupé\",\"\")","v":""}]
["DIMANCHE",24,6.9861111111111098,{"$f":"IF(OR(AND(C1031>=INDEX(Champ,MATCH(A1031,Jour,0),3),C1031<=INDEX(Champ,MATCH(A1031,Jour,0),4)),AND(C1031>=INDEX(Champ,MATCH(A1031,Jour,0)+1,4),C1031<=INDEX(Champ,MATCH(A1031,Jour,0)+1,3))),\"occupé\",\"\")","v":""}]
["DIMANCHE",24,6.9930555555555598,{"$f":"IF(OR(AND(C1032>=INDEX(Champ,MATCH(A1032,Jour,0),3),C1032<=INDEX(Champ,MATCH(A1032,Jour,0),4)),AND(C1032>=INDEX(Champ,MATCH(A1032,Jour,0)+1,4),C1032<=INDEX(Champ,MATCH(A1032,Jour,0)+1,3))),\"occupé\",\"\")","v":""}]

{"sheet":"recapitulatif etat initial","index":5,"n_rows":290,"n_cols":29,"rows_kept":290,"cut":false,"hidden":false,"merged":[]}
[null,null,null,null,352,null,null,null,null,{"$f":"E1*0.75","v":264},null,null,null,null,{"$f":"0.5*$E$1","v":176},null,null,null,null,{"$f":"0.25*$E$1","v":88}]
["température extérieure ","température de soufflage","débit",null,"Occupation 100%","température","humidité","conso batterie chaude","conso électrique ","Occupation 75%","température","humidité","conso batterie chaude","conso électrique ","Occupation 50%","température","humidité","conso batterie chaude","conso électrique "," Occupation 25%","température","humidité","conso batterie chaude","conso électrique ","taux réglementaire CO2"]
[6,17,458.33333333333337,"00:00:00",500,15,43.806173136834332,null,null,500,15,43.806173136834332,null,null,500,15,43.806173136834332,null,null,500,15,43.806173136834332,null,null,{"$f":"CO2Lim","v":1700}]
[6,17,458.33333333333337,"00:05:00",500,15.870245068356349,41.420598725912662,null,null,500,15.870245068356349,41.420598725912662,null,null,500,15.870245068356349,41.420598725912662,null,null,500,15.870245068356349,41.420598725912662,null,null,1700]
[6.1,17,458.33333333333337,"00:10:00",500,16.358238712278322,40.268875796796699,null,null,500,16.358238712278322,40.268875796796699,null,null,500,16.358238712278322,40.268875796796699,null,null,500,16.358238712278322,40.268875796796699,null,null,1700]
[6.1,17,458.33333333333337,"00:15:00",500,16.631883235145914,39.639282710334442,null,null,500,16.631883235145914,39.639282710334442,null,null,500,16.631883235145914,39.639282710334442,null,null,500,16.631883235145914,39.639282710334442,null,null,1700]
[6.2,17,458.33333333333337,"00:20:00",500,16.785330571659586,39.410780754230245,null,null,500,16.785330571659586,39.410780754230245,null,null,500,16.785330571659586,39.410780754230245,null,null,500,16.785330571659586,39.410780754230245,null,null,1700]
[6.2,17,458.33333333333337,"00:25:00",500,16.871376821869152,39.283509301260558,null,null,500,16.871376821869152,39.283509301260558,null,null,500,16.871376821869152,39.283509301260558,null,null,500,16.871376821869152,39.283509301260558,null,null,1700]
[6.2,17,458.33333333333337,"00:30:00",500,16.919627624674501,39.212500144147761,null,null,500,16.919627624674501,39.212500144147761,null,null,500,16.919627624674501,39.212500144147761,null,null,500,16.919627624674501,39.212500144147761,null,null,1700]
[6.2,17,458.33333333333337,"00:35:00",500,16.946684468705357,39.172844179966155,null,null,500,16.946684468705357,39.172844179966155,null,null,500,16.946684468705357,39.172844179966155,null,null,500,16.946684468705357,39.172844179966155,null,null,1700]
[6.2,17,458.33333333333337,"00:40:00",500,16.961856709711657,39.150686322324326,null,null,500,16.961856709711657,39.150686322324326,null,null,500,16.961856709711657,39.150686322324326,null,null,500,16.961856709711657,39.150686322324326,null,null,1700]
[6.2,17,458.33333333333337,"00:45:00",500,16.97036460874418,39.1383021101908,null,null,500,16.97036460874418,39.1383021101908,null,null,500,16.97036460874418,39.1383021101908,null,null,500,16.97036460874418,39.1383021101908,null,null,1700]
[6.2,17,458.33333333333337,"00:50:00",500,16.975135449513029,39.131379458316125,null,null,500,16.975135449513029,39.131379458316125,null,null,500,16.975135449513029,39.131379458316125,null,null,500,16.975135449513029,39.131379458316125,null,null,1700]
[6.2,17,458.33333333333337,"00:55:00",500,16.977810718877961,39.127509486200886,null,null,500,16.977810718877961,39.127509486200886,null,null,500,16.977810718877961,39.127509486200886,null,null,500,16.977810718877961,39.127509486200886,null,null,1700]
[6.2,17,458.33333333333337,"01:00:00",500,16.97931088761587,39.125345988592436,null,null,500,16.97931088761587,39.125345988592436,null,null,500,16.97931088761587,39.125345988592436,null,null,500,16.97931088761587,39.125345988592436,null,null,1700]
[6.2,17,458.33333333333337,"01:05:00",500,16.980152113651535,39.124136482127753,null,null,500,16.980152113651535,39.124136482127753,null,null,500,16.980152113651535,39.124136482127753,null,null,500,16.980152113651535,39.124136482127753,null,null,1700]
[6.2,17,458.33333333333337,"01:10:00",500,16.980623834748766,39.123460309588936,null,null,500,16.980623834748766,39.123460309588936,null,null,500,16.980623834748766,39.123460309588936,null,null,500,16.980623834748766,39.123460309588936,null,null,1700]
[6.2,17,458.33333333333337,"01:15:00",500,16.980888354371483,39.123082301362302,null,null,500,16.980888354371483,39.123082301362302,null,null,500,16.980888354371483,39.123082301362302,null,null,500,16.980888354371483,39.123082301362302,null,null,1700]
[6.3,17,458.33333333333337,"01:20:00",500,16.981036684881214,39.241599674310201,null,null,500,16.981036684881214,39.241599674310201,null,null,500,16.981036684881214,39.241599674310201,null,null,500,16.981036684881214,39.241599674310201,null,null,1700]
[6.3,17,458.33333333333337,"01:25:00",500,16.981119861848921,39.308331422009907,null,null,500,16.981119861848921,39.308331422009907,null,null,500,16.981119861848921,39.308331422009907,null,null,500,16.981119861848921,39.308331422009907,null,null,1700]
[6.3,17,458.33333333333337,"01:30:00",500,16.981166503689291,39.345905872007982,null,null,500,16.981166503689291,39.345905872007982,null,null,500,16.981166503689291,39.345905872007982,null,null,500,16.981166503689291,39.345905872007982,null,null,1700]
[6.3,17,458.33333333333337,"01:35:00",500,16.981192658300756,39.367063071571231,null,null,500,16.981192658300756,39.367063071571231,null,null,500,16.981192658300756,39.367063071571231,null,null,500,16.981192658300756,39.367063071571231,null,null,1700]
[6.3,17,458.33333333333337,"01:40:00",500,16.981207324610992,39.378976225939518,null,null,500,16.981207324610992,39.378976225939518,null,null,500,16.981207324610992,39.378976225939518,null,null,500,16.981207324610992,39.378976225939518,null,null,1700,null,"Consommations d'énergies"]
[6.3,17,458.33333333333337,"01:45:00",500,16.981215548807182,39.385684287721887,null,null,500,16.981215548807182,39.385684287721887,null,null,500,16.981215548807182,39.385684287721887,null,null,500,16.981215548807182,39.385684287721887,null,null,1700]
[6.4,17,458.33333333333337,"01:50:00",500,16.981220160560369,39.50891665784264,null,null,500,16.981220160560369,39.50891665784264,null,null,500,16.981220160560369,39.50891665784264,null,null,500,16.981220160560369,39.50891665784264,null,null,1700,null,"batterie Chaude",{"$f":"'debit réf'!#REF!","v":{"$error":"#REF!"}},"Kwh"]
[6.4,17,458.33333333333337,"01:55:00",500,16.981222746620695,39.578303246518452,null,null,500,16.981222746620695,39.578303246518452,null,null,500,16.981222746620695,39.578303246518452,null,null,500,16.981222746620695,39.578303246518452,null,null,1700,null,"Ventilateur",{"$f":"'debit réf'!#REF!","v":{"$error":"#REF!"}},"Wh"]
[6.4,17,458.33333333333337,"02:00:00",500,16.98122419676508,39.617372349552497,null,null,500,16.98122419676508,39.617372349552497,null,null,500,16.98122419676508,39.617372349552497,null,null,500,16.98122419676508,39.617372349552497,null,null,1700]
[6.4,17,458.33333333333337,"02:05:00",500,16.981225009939745,39.639370966677227,null,null,500,16.981225009939745,39.639370966677227,null,null,500,16.981225009939745,39.639370966677227,null,null,500,16.981225009939745,39.639370966677227,null,null,1700]
[6.4,17,458.33333333333337,"02:10:00",500,16.981225465930915,39.651757780036668,null,null,500,16.981225465930915,39.651757780036668,null,null,500,16.981225465930915,39.651757780036668,null,null,500,16.981225465930915,39.651757780036668,null,null,1700]
[6.4,17,458.33333333333337,"02:15:00",500,16.981225721629915,39.658732472864905,null,null,500,16.981225721629915,39.658732472864905,null,null,500,16.981225721629915,39.658732472864905,null,null,500,16.981225721629915,39.658732472864905,null,null,1700]
[6.4,17,458.33333333333337,"02:20:00",500,16.98122586501422,39.662659747723424,null,null,500,16.98122586501422,39.662659747723424,null,null,500,16.98122586501422,39.662659747723424,null,null,500,16.98122586501422,39.662659747723424,null,null,1700]
[6.4,17,458.33333333333337,"02:25:00",500,16.981225945417588,39.664871099904573,null,null,500,16.981225945417588,39.664871099904573,null,null,500,16.981225945417588,39.664871099904573,null,null,500,16.981225945417588,39.664871099904573,null,null,1700]
[6.3,17,458.33333333333337,"02:30:00",500,16.981225990504115,39.546668394668046,null,null,500,16.981225990504115,39.546668394668046,null,null,500,16.981225990504115,39.546668394668046,null,null,500,16.981225990504115,39.546668394668046,null,null,1700]
[6.3,17,458.33333333333337,"02:35:00",500,16.981226015786582,39.48010891281308,null,null,500,16.981226015786582,39.48010891281308,null,null,500,16.981226015786582,39.48010891281308,null,null,500,16.981226015786582,39.48010891281308,null,null,1700]
[6.3,17,458.33333333333337,"02:40:00",500,16.981226029963832,39.442630114496922,null,null,500,16.981226029963832,39.442630114496922,null,null,500,16.981226029963832,39.442630114496922,null,null,500,16.981226029963832,39.442630114496922,null,null,1700]
[6.3,17,458.33333333333337,"02:45:00",500,16.981226037913785,39.421526465311132,null,null,500,16.981226037913785,39.421526465311132,null,null,500,16.981226037913785,39.421526465311132,null,null,500,16.981226037913785,39.421526465311132,null,null,1700]
[6.3,17,458.33333333333337,"02:50:00",500,16.981226042371755,39.409643432213862,null,null,500,16.981226042371755,39.409643432213862,null,null,500,16.981226042371755,39.409643432213862,null,null,500,16.981226042371755,39.409643432213862,null,null,1700]
[6.3,17,458.33333333333337,"02:55:00",500,16.981226044871583,39.402952358071488,null,null,500,16.981226044871583,39.402952358071488,null,null,500,16.981226044871583,39.402952358071488,null,null,500,16.981226044871583,39.402952358071488,null,null,1700]
[6.3,17,458.33333333333337,"03:00:00",500,16.98122604627337,39.399184767555226,null,null,500,16.98122604627337,39.399184767555226,null,null,500,16.98122604627337,39.399184767555226,null,null,500,16.98122604627337,39.399184767555226,null,null,1700]
[6.3,17,458.33333333333337,"03:05:00",500,16.981226047059426,39.397063325551827,null,null,500,16.981226047059426,39.397063325551827,null,null,500,16.981226047059426,39.397063325551827,null,null,500,16.981226047059426,39.397063325551827,null,null,1700]
[6.3,17,458.33333333333337,"03:10:00",500,16.981226047500211,39.395868791827588,null,null,500,16.981226047500211,39.395868791827588,null,null,500,16.981226047500211,39.395868791827588,null,null,500,16.981226047500211,39.395868791827588,null,null,1700]
[6.3,17,458.33333333333337,"03:15:00",500,16.981226047747384,39.395196178380843,null,null,500,16.981226047747384,39.395196178380843,null,null,500,16.981226047747384,39.395196178380843,null,null,500,16.981226047747384,39.395196178380843,null,null,1700]
[6.3,17,458.33333333333337,"03:20:00",500,16.98122604788599,39.394817445852759,null,null,500,16.98122604788599,39.394817445852759,null,null,500,16.98122604788599,39.394817445852759,null,null,500,16.98122604788599,39.394817445852759,null,null,1700]
[6.3,17,458.33333333333337,"03:25:00",500,16.981226047963712,39.394604190652856,null,null,500,16.981226047963712,39.394604190652856,null,null,500,16.981226047963712,39.394604190652856,null,null,500,16.981226047963712,39.394604190652856,null,null,1700]
[6.3,17,458.33333333333337,"03:30:00",500,16.981226048007294,39.394484111772236,null,null,500,16.981226048007294,39.394484111772236,null,null,500,16.981226048007294,39.394484111772236,null,null,500,16.981226048007294,39.394484111772236,null,null,1700]
[6.3,17,458.33333333333337,"03:35:00",500,16.981226048031733,39.394416498240844,null,null,500,16.981226048031733,39.394416498240844,null,null,500,16.981226048031733,39.394416498240844,null,null,500,16.981226048031733,39.394416498240844,null,null,1700]
[6.2,17,458.33333333333337,"03:40:00",500,16.981226048045436,39.275658214110202,null,null,500,16.981226048045436,39.275658214110202,null,null,500,16.981226048045436,39.275658214110202,null,null,500,16.981226048045436,39.275658214110202,null,null,1700]
[6.2,17,458.33333333333337,"03:45:00",500,16.98122604805312,39.208785876256215,null,null,500,16.98122604805312,39.208785876256215,null,null,500,16.98122604805312,39.208785876256215,null,null,500,16.98122604805312,39.208785876256215,null,null,1700]
[6.2,17,458.33333333333337,"03:50:00",500,16.98122604805743,39.171130908931971,null,null,500,16.98122604805743,39.171130908931971,null,null,500,16.98122604805743,39.171130908931971,null,null,500,16.98122604805743,39.171130908931971,null,null,1700]
[6.2,17,458.33333333333337,"03:55:00",500,16.981226048059849,39.14992806085862,null,null,500,16.981226048059849,39.14992806085862,null,null,500,16.981226048059849,39.14992806085862,null,null,500,16.981226048059849,39.14992806085862,null,null,1700]
[6.2,17,458.33333333333337,"04:00:00",500,16.981226048061206,39.137989170486591,null,null,500,16.981226048061206,39.137989170486591,null,null,500,16.981226048061206,39.137989170486591,null,null,500,16.981226048061206,39.137989170486591,null,null,1700]
[6.2,17,458.33333333333337,"04:05:00",500,16.981226048061963,39.131266644201915,null,null,500,16.981226048061963,39.131266644201915,null,null,500,16.981226048061963,39.131266644201915,null,null,500,16.981226048061963,39.131266644201915,null,null,1700]
[6.2,17,458.33333333333337,"04:10:00",500,16.981226048062389,39.127481343653933,null,null,500,16.981226048062389,39.127481343653933,null,null,500,16.981226048062389,39.127481343653933,null,null,500,16.981226048062389,39.127481343653933,null,null,1700]
[6.2,17,458.33333333333337,"04:15:00",500,16.981226048062631,39.1253499295265,null,null,500,16.981226048062631,39.1253499295265,null,null,500,16.981226048062631,39.1253499295265,null,null,500,16.981226048062631,39.1253499295265,null,null,1700]
[6.2,17,458.33333333333337,"04:20:00",500,16.981226048062762,39.124149780727194,null,null,500,16.981226048062762,39.124149780727194,null,null,500,16.981226048062762,39.124149780727194,null,null,500,16.981226048062762,39.124149780727194,null,null,1700]
[6.2,17,458.33333333333337,"04:25:00",500,16.981226048062837,39.123474005561953,null,null,500,16.981226048062837,39.123474005561953,null,null,500,16.981226048062837,39.123474005561953,null,null,500,16.981226048062837,39.123474005561953,null,null,1700]
[6.2,17,458.33333333333337,"04:30:00",500,16.981226048062883,39.123093492744047,null,null,500,16.981226048062883,39.123093492744047,null,null,500,16.981226048062883,39.123093492744047,null,null,500,16.981226048062883,39.123093492744047,null,null,1700]
[6.2,17,458.33333333333337,"04:35:00",500,16.981226048062908,39.122879235104691,null,null,500,16.981226048062908,39.122879235104691,null,null,500,16.981226048062908,39.122879235104691,null,null,500,16.981226048062908,39.122879235104691,null,null,1700]
[6.2,17,458.33333333333337,"04:40:00",500,16.981226048062918,39.122758591774073,null,null,500,16.981226048062918,39.122758591774073,null,null,500,16.981226048062918,39.122758591774073,null,null,500,16.981226048062918,39.122758591774073,null,null,1700]
[6.2,17,458.33333333333337,"04:45:00",500,16.981226048062922,39.122690660414136,null,null,500,16.981226048062922,39.122690660414136,null,null,500,16.981226048062922,39.122690660414136,null,null,500,16.981226048062922,39.122690660414136,null,null,1700]
[6.2,17,458.33333333333337,"04:50:00",500,16.981226048062926,39.122652409898642,null,null,500,16.981226048062926,39.122652409898642,null,null,500,16.981226048062926,39.122652409898642,null,null,500,16.981226048062926,39.122652409898642,null,null,1700]
[6.2,17,458.33333333333337,"04:55:00",500,16.981226048062929,39.12263087195322,null,null,500,16.981226048062929,39.12263087195322,null,null,500,16.981226048062929,39.12263087195322,null,null,500,16.981226048062929,39.12263087195322,null,null,1700]
[6.2,17,458.33333333333337,"05:00:00",500,16.981226048062933,39.122618744454165,null,null,500,16.981226048062933,39.122618744454165,null,null,500,16.981226048062933,39.122618744454165,null,null,500,16.981226048062933,39.122618744454165,null,null,1700]
[6.2,17,458.33333333333337,"05:05:00",500,16.981226048062936,39.12261191575115,null,null,500,16.981226048062936,39.12261191575115,null,null,500,16.981226048062936,39.12261191575115,null,null,500,16.981226048062936,39.12261191575115,null,null,1700]
[6.2,17,458.33333333333337,"05:10:00",500,16.981226048062936,39.122608070672733,null,null,500,16.981226048062936,39.122608070672733,null,null,500,16.981226048062936,39.122608070672733,null,null,500,16.981226048062936,39.122608070672733,null,null,1700]
[6.2,17,458.33333333333337,"05:15:00",500,16.981226048062936,39.122605905601574,null,null,500,16.981226048062936,39.122605905601574,null,null,500,16.981226048062936,39.122605905601574,null,null,500,16.981226048062936,39.122605905601574,null,null,1700]
[6.2,17,458.33333333333337,"05:20:00",500,16.981226048062936,39.122604686502065,null,null,500,16.981226048062936,39.122604686502065,null,null,500,16.981226048062936,39.122604686502065,null,null,500,16.981226048062936,39.122604686502065,null,null,{"$f":"CO2Lim","v":1700}]
[6.2,17,458.33333333333337,"05:25:00",500,16.981226048062936,39.122604000056462,null,null,500,16.981226048062936,39.122604000056462,null,null,500,16.981226048062936,39.122604000056462,null,null,500,16.981226048062936,39.122604000056462,null,null,1700]
[6.2,17,458.33333333333337,"05:30:00",500,16.981226048062936,39.122603613535468,null,null,500,16.981226048062936,39.122603613535468,null,null,500,16.981226048062936,39.122603613535468,null,null,500,16.981226048062936,39.122603613535468,null,null,1700]
[6.2,17,458.33333333333337,"05:35:00",500,16.981226048062936,39.122603395894785,null,null,500,16.981226048062936,39.122603395894785,null,null,500,16.981226048062936,39.122603395894785,null,null,500,16.981226048062936,39.122603395894785,null,null,1700]
[6.1,17,458.33333333333337,"05:40:00",500,16.981226048062936,39.004606823439673,null,null,500,16.981226048062936,39.004606823439673,null,null,500,16.981226048062936,39.004606823439673,null,null,500,16.981226048062936,39.004606823439673,null,null,1700]
[6.1,17,458.33333333333337,"05:45:00",500,16.981226048062936,38.938163417981549,null,null,500,16.981226048062936,38.938163417981549,null,null,500,16.981226048062936,38.938163417981549,null,null,500,16.981226048062936,38.938163417981549,null,null,1700]
[6.1,17,458.33333333333337,"05:50:00",500,16.981226048062936,38.900749981960963,null,null,500,16.981226048062936,38.900749981960963,null,null,500,16.981226048062936,38.900749981960963,null,null,500,16.981226048062936,38.900749981960963,null,null,1700]
[6.1,17,458.33333333333337,"05:55:00",500,16.981226048062936,38.879683137458613,null,null,500,16.981226048062936,38.879683137458613,null,null,500,16.981226048062936,38.879683137458613,null,null,500,16.981226048062936,38.879683137458613,null,null,1700]
[6.1,17,458.33333333333337,"06:00:00",500,16.981226048062936,38.867820828410046,null,null,500,16.981226048062936,38.867820828410046,null,null,500,16.981226048062936,38.867820828410046,null,null,500,16.981226048062936,38.867820828410046,null,null,1700]
[6.1,17,458.33333333333337,"06:05:00",500,16.981226048062936,38.861141423538456,null,null,500,16.981226048062936,38.861141423538456,null,null,500,16.981226048062936,38.861141423538456,null,null,500,16.981226048062936,38.861141423538456,null,null,1700]
[6.1,17,458.33333333333337,"06:10:00",500,16.981226048062936,38.85738040371983,null,null,500,16.981226048062936,38.85738040371983,null,null,500,16.981226048062936,38.85738040371983,null,null,500,16.981226048062936,38.85738040371983,null,null,1700]
[6.1,17,458.33333333333337,"06:15:00",500,16.981226048062936,38.855262661518402,null,null,500,16.981226048062936,38.855262661518402,null,null,500,16.981226048062936,38.855262661518402,null,null,500,16.981226048062936,38.855262661518402,null,null,1700]
[6,17,458.33333333333337,"06:20:00",500,16.981226048062936,38.736793802654155,null,null,500,16.981226048062936,38.736793802654155,null,null,500,16.981226048062936,38.736793802654155,null,null,500,16.981226048062936,38.736793802654155,null,null,1700]
[6,17,458.33333333333337,"06:25:00",500,16.981226048062936,38.670084445162409,null,null,500,16.981226048062936,38.670084445162409,null,null,500,16.981226048062936,38.670084445162409,null,null,500,16.981226048062936,38.670084445162409,null,null,1700]
[6,17,458.33333333333337,"06:30:00",500,16.981226048062936,38.632521251950891,null,null,500,16.981226048062936,38.632521251950891,null,null,500,16.981226048062936,38.632521251950891,null,null,500,16.981226048062936,38.632521251950891,null,null,1700]
[6,17,458.33333333333337,"06:35:00",500,16.981226048062936,38.611370080874849,null,null,500,16.981226048062936,38.611370080874849,null,null,500,16.981226048062936,38.611370080874849,null,null,500,16.981226048062936,38.611370080874849,null,null,1700]
[5.9,17,458.33333333333337,"06:40:00",500,16.981226048062936,38.482900698571683,null,null,500,16.981226048062936,38.482900698571683,null,null,500,16.981226048062936,38.482900698571683,null,null,500,16.981226048062936,38.482900698571683,null,null,1700]
[5.9,17,458.33333333333337,"06:45:00",500,16.981226048062936,38.410559865995594,null,null,500,16.981226048062936,38.410559865995594,null,null,500,16.981226048062936,38.410559865995594,null,null,500,16.981226048062936,38.410559865995594,null,null,1700]
[5.7,17,458.33333333333337,"06:50:00",500,16.981226048062936,38.138849938373895,null,null,500,16.981226048062936,38.138849938373895,null,null,500,16.981226048062936,38.138849938373895,null,null,500,16.981226048062936,38.138849938373895,null,null,1700]
[5.7,17,458.33333333333337,"06:55:00",500,16.981226048062936,37.985844028313629,null,null,500,16.981226048062936,37.985844028313629,null,null,500,16.981226048062936,37.985844028313629,null,null,500,16.981226048062936,37.985844028313629,null,null,1700]
[5.7,17,458.33333333333337,"07:00:00",500,16.981226048062936,37.899686090113555,null,null,500,16.981226048062936,37.899686090113555,null,null,500,16.981226048062936,37.899686090113555,null,null,500,16.981226048062936,37.899686090113555,null,null,1700]
[5.7,17,458.33333333333337,"07:05:00",500,16.981226048062936,37.851171362256913,null,null,500,16.981226048062936,37.851171362256913,null,null,500,16.981226048062936,37.851171362256913,null,null,500,16.981226048062936,37.851171362256913,null,null,1700]
[5.6,17,458.33333333333337,"07:10:00",500,16.981226048062936,37.709420847227577,null,null,500,16.981226048062936,37.709420847227577,null,null,500,16.981226048062936,37.709420847227577,null,null,500,16.981226048062936,37.709420847227577,null,null,1700]
[5.6,17,458.33333333333337,"07:15:00",500,16.981226048062936,37.629601116958199,null,null,500,16.981226048062936,37.629601116958199,null,null,500,16.981226048062936,37.629601116958199,null,null,500,16.981226048062936,37.629601116958199,null,null,1700]
[5.6,17,458.33333333333337,"07:20:00",500,16.981226048062936,37.58465546090671,null,null,500,16.981226048062936,37.58465546090671,null,null,500,16.981226048062936,37.58465546090671,null,null,500,16.981226048062936,37.58465546090671,null,null,1700]
[5.6,17,458.33333333333337,"07:25:00",500,16.981226048062936,37.559347298813755,null,null,500,16.981226048062936,37.559347298813755,null,null,500,16.981226048062936,37.559347298813755,null,null,500,16.981226048062936,37.559347298813755,null,null,1700]
[5.6,30,458.33333333333337,"07:30:00",500,22.637818992379213,26.407094926659706,null,null,500,22.637818992379213,26.407094926659706,null,null,500,22.637818992379213,26.407094926659706,null,null,500,22.637818992379213,26.407094926659706,null,null,1700]
[5.6,30,458.33333333333337,"07:35:00",500,25.809777677872045,21.815344159911039,null,null,500,25.809777677872045,21.815344159911039,null,null,500,25.809777677872045,21.815344159911039,null,null,500,25.809777677872045,21.815344159911039,null,null,1700]
[5.6,30,458.33333333333337,"07:40:00",500,27.588467076511378,19.638077440392561,null,null,500,27.588467076511378,19.638077440392561,null,null,500,27.588467076511378,19.638077440392561,null,null,500,27.588467076511378,19.638077440392561,null,null,1700]
[5.6,30,458.33333333333337,"07:45:00",500,28.585874763850281,18.524924313820716,null,null,500,28.585874763850281,18.524924313820716,null,null,500,28.585874763850281,18.524924313820716,null,null,500,28.585874763850281,18.524924313820716,null,null,1700]
[5.5,30,458.33333333333337,"07:50:00",500,29.145175390212451,17.877594463761866,null,null,500,29.145175390212451,17.877594463761866,null,null,500,29.145175390212451,17.877594463761866,null,null,500,29.145175390212451,17.877594463761866,null,null,1700]
[5.5,30,458.33333333333337,"07:55:00",500,29.458805608447207,17.525382922243811,null,null,500,29.458805608447207,17.525382922243811,null,null,500,29.458805608447207,17.525382922243811,null,null,500,29.458805608447207,17.525382922243811,null,null,1700]
[5.4,30,458.33333333333337,"08:00:00",1118.6844613918015,35.4719109739383,16.153882754764343,null,null,964.01334604385147,34.012602004115671,16.509917768587094,null,null,809.34223069590075,32.553293034293048,16.823961229875763,null,null,654.67111534795038,31.093984064470419,17.084668470873602,null,null,1700]
[5.4,20,458.33333333333337,"08:05:00",1467.0507993601118,34.492560182546072,19.239659784927657,null,null,1225.2880995200842,32.214937466761306,20.123495428168585,null,null,983.5253996800559,29.937314750976537,20.931457740582854,null,null,741.76269984002795,27.659692035191767,21.6188736601062,null,null,1700]
[5.5,20,458.33333333333337,"08:10:00",1663.2075044379146,33.943385037811254,21.144658680425419,null,null,1372.4056283284365,31.20688938923557,22.463466666165015,null,null,1081.6037522189574,28.47039374065989,23.700708841847678,null,null,790.80187610947871,25.733898092084203,24.778167164434294,null,null,1700]
[5.5,20,458.33333333333337,"08:15:00",1773.6586265853143,33.635432726703442,22.259851298459999,null,null,1455.2439699389863,30.641622118569593,23.871465687110987,null,null,1136.8293132926572,27.647811510435748,25.406526642733347,null,null,818.41465664632858,24.65400090230191,26.76232956049191,null,null,1700]
[5.5,20,458.33333333333337,"08:20:00",1835.8509966028523,33.46274715120741,22.901214363368343,null,null,1501.8882474521397,30.324646079023488,24.693568513825863,null,null,1167.9254983014262,27.186545006839577,26.415615596760837,null,null,833.96274915071308,24.048443934655673,27.948982486896263,null,null,1700]
[5.5,20,458.33333333333337,"08:25:00",1870.8700241437095,33.365912976210893,23.266428076834799,null,null,1528.1525181077825,30.146900409213245,25.165533897207325,null,null,1185.4350120718548,26.927887842215615,26.999061266340203,null,null,842.71750603592739,23.708875275217984,28.639208856385327,null,null,1700]
[5.4,20,458.33333333333337,"08:30:00",1890.5883961813322,33.311612798443761,23.431076331551726,null,null,1542.9412971359995,30.047228764689166,25.383033932285809,null,null,1195.2941980906662,26.782844730934588,27.270377062824338,null,null,847.64709904533311,23.518460697180011,28.959239081836536,null,null,1700]
[5.4,20,458.33333333333337,"08:35:00",1901.6913371570765,33.281163741531259,23.52397467505525,null,null,1551.2685028678079,29.991337463749225,25.505942387041721,null,null,1200.8456685785384,26.701511185967203,27.423887490501002,null,null,850.42283428926919,23.41168490818518,29.140442439767245,null,null,1700]
[5.3,20,458.33333333333337,"08:40:00",1907.9431361431011,33.26408930264386,23.534291390548113,null,null,1555.9573521073262,29.959996177712718,25.524373454038678,null,null,1203.9715680715506,26.655903052781579,27.448635578683533,null,null,851.98578403577528,23.351809927850454,29.167124837700598,null,null,1700]
[5.3,20,458.33333333333337,"08:45:00",1911.4633737672623,33.254514738014237,23.540048327849874,null,null,1558.5975303254472,29.942421417528152,25.534641511456407,null,null,1205.7316868836313,26.630328097042085,27.462380190365348,null,null,852.86584344181563,23.318234776556018,29.18183916980686,null,null,1700]
[5.2,20,458.33333333333337,"08:50:00",1913.4455348953252,33.249145759949926,23.501474610200979,null,null,1560.0841511714943,29.932566295591393,25.489764976966722,null,null,1206.7227674476626,26.615986831232863,27.408463003315838,null,null,853.36138372383141,23.299407366874341,29.114717521477878,null,null,1700]
[5.2,20,458.33333333333337,"08:55:00",1914.5616421463346,33.246135082538466,23.479726188089682,null,null,1560.9212316097517,29.927039993817225,25.464435566730881,null,null,1207.2808210731675,26.607944905095994,27.378000032536441,null,null,853.64041053658377,23.288849816374771,29.076761371122078,null,null,1700]
[5.2,20,458.33333333333337,"09:00:00",1915.1900952918031,33.244446832304007,23.467467145819164,null,null,1561.392571468853,29.92394109646262,25.450145846906157,null,null,1207.5950476459018,26.603435360621248,27.360801178375667,null,null,853.79752382295089,23.282929624779882,29.055319265760239,null,null,1700]
[5.2,20,458.33333333333337,"09:05:00",1915.5439621407927,33.243500138764759,23.460557999550097,null,null,1561.6579716055951,29.922203376517743,25.442086405535068,null,null,1207.7719810703966,26.600906614270734,27.351095031193356,null,null,853.88599053519818,23.279609852023725,29.043213082006485,null,null,1700]
[5.2,20,458.33333333333337,"09:10:00",1915.7432160513138,33.242969276313843,23.456664345416971,null,null,1561.8074120384856,29.921228942626826,25.437541561025899,null,null,1207.871608025657,26.599488608939808,27.345618676974677,null,null,853.93580401282838,23.277748275252797,29.03638014593632,null,null,1700]
[5.2,20,458.33333333333337,"09:15:00",1915.855411135344,33.242671592924111,23.454470176171593,null,null,1561.8915583515084,29.920682524655057,25.434978882328103,null,null,1207.9277055676721,26.598693456386002,27.342529258487751,null,null,853.96385278383593,23.276704388116954,29.032524235811536,null,null,1700]
[5.2,20,458.33333333333337,"09:20:00",1915.9185854883474,33.242504665690191,23.453233742427397,null,null,1561.9389391162608,29.92037611844048,25.433533954591308,null,null,1207.9592927441738,26.598247571190768,27.340786541982887,null,null,853.97964637208679,23.276119023941071,29.030348535562233,null,null,1700]
[5.2,20,458.33333333333337,"09:25:00",1915.9541574468863,33.242411060529861,23.452537013001873,null,null,1561.965618085165,29.920204299845224,25.432719280697142,null,null,1207.9770787234431,26.597997539160591,27.339803538319309,null,null,853.98853936172156,23.275790778475965,29.029120976414209,null,null,1700]
[5.2,20,458.33333333333337,"09:30:00",1915.9741871610684,33.242358571035879,23.452144410900196,null,null,1561.9806403708017,29.92010795183311,25.432259964087141,null,null,1207.9870935805343,26.59785733263034,27.339249079177506,null,null,853.99354679026715,23.275606713427571,29.028428400423291,null,null,1700]
[5.2,20,458.33333333333337,"09:35:00",1915.9854654113162,33.242329137327637,23.451923184116914,null,null,1561.9890990584877,29.920053924273255,25.432001003316625,null,null,1207.9927327056582,26.597778711218872,27.338936345775128,null,null,853.99636635282911,23.275503498164483,29.028037667561531,null,null,1700]
[5.0999999999999996,20,458.33333333333337,"09:40:00",1915.9918159227366,33.24231263224987,23.410253359601825,null,null,1561.9938619420527,29.920023628088003,25.38153213698136,null,null,1207.9959079613684,26.597734623926144,27.277517596038464,null,null,853.99795398068409,23.275445619764284,28.952921494512417,null,null,1700]
[5.0999999999999996,20,458.33333333333337,"09:45:00",1915.995391742958,33.242303376956926,23.38678921204685,null,null,1561.9965438072188,29.920006639372552,25.353113196701475,null,null,1207.9976958714792,26.597709901788193,27.242932705243806,null,null,853.99884793573949,23.275413164203833,28.910623490347426,null,null,1700]
[5.0999999999999996,20,458.33333333333337,"09:50:00",1915.9974052013097,33.242298187011819,23.373576826359603,null,null,1561.9980539009825,29.919997112877709,25.3371107900435,null,null,1207.998702600655,26.59769603874361,27.22345827910258,null,null,853.99935130032736,23.275394964609511,28.886805844193038,null,null,1700]
[5.0999999999999996,20,458.33333333333337,"09:55:00",1915.9985389312742,33.242295276727901,23.366137151421007,null,null,1561.9989041984559,29.919991770854985,25.328100083723871,null,null,1207.9992694656373,26.597688264982068,27.212492515319198,null,null,853.99963473281855,23.275384759109151,28.87339446010332,null,null,1700]
[5.2,20,458.33333333333337,"10:00:00",1915.9991773073459,33.242293644773753,23.40349529167959,null,null,1561.9993829805098,29.919988775292893,25.373351795635578,null,null,1207.9995886536731,26.597683905812033,27.267563486408282,null,null,853.99979432683654,23.275379036331181,28.940742518950231,null,null,1700]
[5.2,20,458.33333333333337,"10:05:00",1915.9995367615559,33.242292729648476,23.424530127869971,null,null,1561.9996525711674,29.919987095518643,25.398831176387343,null,null,1207.9997683807781,26.597681461388799,27.298571687865124,null,null,853.99988419038903,23.275375827258962,28.978663444732117,null,null,1700]
[5.3,20,458.33333333333337,"10:10:00",1915.999739161575,33.242292216488067,23.478179401705649,null,null,1561.9998043711817,29.919986153578044,25.463815726807603,null,null,1207.9998695807876,26.597680090668014,27.377657261265746,null,null,853.99993479039381,23.275374027757991,29.075380304497234,null,null,1700]
[5.3,20,458.33333333333337,"10:15:00",1915.9998531281569,33.242291928731177,23.50838671358207,null,null,1561.9998898461183,29.919985625380825,25.500405383028298,null,null,1207.9999265640788,26.597679322030469,27.422186519538965,null,null,853.99996328203929,23.275373018680128,29.129836885109867,null,null,1700]
[5.5,20,458.33333333333337,"10:20:00",1915.9999172999981,33.242291767370261,23.609785560812149,null,null,1561.9999379749991,29.919985329191981,25.623228024634543,null,null,1207.9999586499991,26.597678891013683,27.571660434872925,null,null,853.99997932499957,23.275372452835398,29.312634654574953,null,null,1700]
[5.5,20,458.33333333333337,"10:25:00",1915.999953433618,33.242291676886445,23.666876156284452,null,null,1561.999965075214,29.919985163102808,25.692380853073615,null,null,1207.9999767168092,26.597678649319175,27.655818721418957,null,null,853.99998835840461,23.275372135535548,29.415555258693161,null,null,1700]
[5.8,20,458.33333333333337,"10:30:00",1915.9999737795902,33.242291626147257,23.827575377561729,null,null,1561.9999803346932,29.919985069967602,25.887032893169643,null,null,1207.9999868897953,26.597678513787951,27.892708224615255,null,null,853.99999344489765,23.275371957608293,29.705257127157491,null,null,1700]
[5.8,20,458.33333333333337,"10:35:00",1915.9999852359178,33.242291597695043,23.918049547137887,null,null,1561.9999889269388,29.919985017741638,25.996622589854734,null,null,1207.9999926179592,26.597678437788232,28.02607772186343,null,null,853.99999630897958,23.275371857834827,29.868360118055527,null,null,1700]
[6.1,20,458.33333333333337,"10:40:00",1915.9999916867002,33.242291581740346,24.099936185969746,null,null,1561.9999937650257,29.919984988455703,26.216938478458442,null,null,1207.9999958433505,26.597678395171069,28.294199770077235,null,null,853.99999792167512,23.275371801886429,30.196257448313645,null,null,{"$f":"CO2Lim","v":1700}]
[6.1,20,458.33333333333337,"10:45:00",1915.9999953189808,33.242291572793675,24.202337191102753,null,null,1561.9999964892361,29.919984972033483,26.340974881146217,null,null,1207.9999976594906,26.597678371273307,28.445150700370391,null,null,853.99999882974521,23.275371770513125,30.380861431572843,null,null,1700]
[6.4,20,458.33333333333337,"10:50:00",1915.9999973642305,33.242291567776789,24.393366695389215,null,null,1561.9999980231732,29.919984962824657,26.572365263620689,null,null,1207.9999986821153,26.597678357872535,28.726750183266851,null,null,853.99999934105767,23.275371752920407,30.72524074006796,null,null,1700]
[6.4,20,458.33333333333337,"10:55:00",1915.9999985158615,33.242291564963551,24.500914281221114,null,null,1561.9999988868965,29.919984957660773,26.702635571289424,null,null,1207.9999992579308,26.597678350357995,28.885287646693218,null,null,853.99999962896538,23.275371743055217,30.919122529393693,null,null,1700]
[6.6,20,458.33333333333337,"11:00:00",1915.9999991643172,33.242291563386019,24.651747980247453,null,null,1561.9999993732381,29.919984954765098,26.885337478713662,null,null,1207.9999995821586,26.597678346144185,29.107633726042543,null,null,853.99999979107929,23.275371737523272,31.191038376676772,null,null,1700]
[6.6,20,458.33333333333337,"11:05:00",1915.999999529447,33.242291562501407,24.736668498909591,null,null,1561.9999996470854,29.919984953141338,26.988200025425833,null,null,1207.9999997647235,26.597678343781272,29.232816220615888,null,null,853.99999988236175,23.275371734421206,31.344128995798865,null,null,1700]
[6.9,20,458.33333333333337,"11:10:00",1915.9999997350426,33.242291562005349,24.92198579910335,null,null,1561.9999998012822,29.919984952230806,27.212671171276469,null,null,1207.9999998675214,26.597678342456259,29.505994885110091,null,null,853.99999993376071,23.275371732681712,31.678209921710131,null,null,1700]
[6.9,20,458.33333333333337,"11:15:00",1915.9999998508088,33.242291561727185,25.026317949838369,null,null,1561.9999998881069,29.919984951720224,27.339046599164401,null,null,1207.9999999254046,26.597678341713255,29.659792221085514,null,null,853.99999996270219,23.275371731706286,31.866294693929078,null,null,1700]
[7,20,458.33333333333337,"11:20:00",1915.9999999159938,33.242291561571207,25.131452842017872,null,null,1561.9999999369957,29.919984951433911,27.466394354537961,null,null,1207.999999957997,26.597678341296611,29.814772846881382,null,null,853.99999997899852,23.275371731159311,32.055826532143683,null,null,1700]
[7,20,458.33333333333337,"11:25:00",1915.9999999526981,33.242291561483739,25.190646760825107,null,null,1561.9999999645238,29.919984951273364,27.538094736276975,null,null,1207.999999976349,26.597678341062974,29.902031305689043,null,null,853.99999998817452,23.275371730852591,32.162538285785239,null,null,1700]
[7.2,20,458.33333333333337,"11:30:00",1915.9999999733652,33.242291561434698,25.317610816039405,null,null,1561.9999999800243,29.919984951183338,27.691883678248342,null,null,1207.9999999866827,26.59767834093196,30.089190483049805,null,null,853.99999999334136,23.275371730680597,32.391422475621553,null,null,1700]
[7.2,20,458.33333333333337,"11:35:00",1915.9999999850027,33.2422915614072,25.389093914452825,null,null,1561.9999999887523,29.919984951132847,27.778469670374662,null,null,1207.9999999925014,26.597678340858497,30.19456451578197,null,null,853.99999999625072,23.275371730584148,32.52028843554919,null,null,1700]
[7.4,20,458.33333333333337,"11:40:00",1915.9999999915551,33.242291561391781,25.524120323095527,null,null,1561.9999999936667,29.919984951104539,27.942024332627302,null,null,1207.9999999957777,26.597678340817303,30.393608398503286,null,null,853.99999999788884,23.275371730530068,32.763706827744834,null,null,1700]
[7.4,20,458.33333333333337,"11:45:00",1915.9999999952447,33.242291561383126,25.60014218049238,null,null,1561.9999999964339,29.919984951088665,28.034108004739306,null,null,1207.9999999976226,26.597678340794204,30.505673006821215,null,null,853.99999999881118,23.275371730499742,32.900754913437538,null,null,1700]
[7.6,20,458.33333333333337,"11:50:00",1915.9999999973222,33.242291561378273,25.738878702046986,null,null,1561.9999999979921,29.919984951079762,28.202156603543038,null,null,1207.9999999986612,26.59767834078125,30.710185895917824,null,null,853.99999999933061,23.275371730482739,33.150861494992945,null,null,1700]
[7.6,20,458.33333333333337,"11:55:00",1915.9999999984923,33.242291561375559,25.816989173389398,null,null,1561.9999999988695,29.919984951074767,28.296770143669018,null,null,1207.9999999992463,26.597678340773989,30.82532928835867,null,null,853.99999999962313,23.275371730473204,33.291674704391632,null,null,1700]
[7.6,20,458.33333333333337,"12:00:00",1915.9999999991508,33.242291561374039,25.860968534418443,null,null,1561.9999999993636,29.919984951071967,28.350041397119803,null,null,1207.9999999995755,26.597678340769914,30.890159674747785,null,null,853.99999999978775,23.27537173046786,33.370958229633274,null,null,1700]
[7.6,20,458.33333333333337,"12:05:00",1297.3155386077201,27.405055682082676,30.339231913790098,null,null,1097.9866539557904,25.542058041602512,31.756760225054908,null,null,898.65776930386016,23.679060401122374,33.140929789839461,null,null,699.32888465193014,21.816062760642236,34.459389619602256,null,null,1700]
[7.7,20,458.33333333333337,"12:10:00",948.94920063961877,24.131800698233619,32.937302940464285,null,null,836.71190047971425,23.087116803715205,33.699571852727033,null,null,724.47460031980938,22.042432909196808,34.437419772990566,null,null,612.23730015990475,20.997749014678408,35.14334520018533,null,null,1700]
[7.7,20,458.33333333333337,"12:15:00",752.79249556193338,22.296308967069695,34.341453656605822,null,null,689.59437167145018,21.710498005341972,34.745757188821436,null,null,626.39624778096675,21.124687043614262,35.139087772430862,null,null,563.19812389048343,20.538876081886549,35.519899844460859,null,null,1700]
[7.8,20,458.33333333333337,"12:20:00",642.34137341459984,21.267049128836913,35.192411511691596,null,null,606.75603006095002,20.938553126667227,35.410330077188966,null,null,571.17068670729998,20.610057124497544,35.62413752022254,null,null,535.58534335365005,20.281561122327862,35.833536609886949,null,null,1700]
[7.8,20,458.33333333333337,"12:25:00",580.14900339709914,20.68988727263655,35.65885375970575,null,null,560.11175254782438,20.50568173451687,35.777249325843819,null,null,540.07450169854962,20.321476196397185,35.894213646275979,null,null,520.03725084927487,20.137270658277497,36.009691471564587,null,null,1700]
[7.8,20,458.33333333333337,"12:30:00",545.12997585626294,20.366241293381602,35.915499877807164,null,null,533.84748189219727,20.262947250075605,35.98028346095591,null,null,522.56498792813159,20.159653206769605,36.044587492216301,null,null,511.28249396406579,20.056359163463604,36.10840189555622,null,null,1700]
[7.8,20,458.33333333333337,"12:35:00",525.411603818652,20.184755426353806,36.057239381578,null,null,519.05870286398908,20.126832849804728,36.092866045427975,null,null,512.70580190932606,20.06891027325565,36.128335323545571,null,null,506.35290095466308,20.010987696706572,36.163645397853962,null,null,1700]
[7.8,20,458.33333333333337,"12:40:00",514.30866284291437,20.082986450244,36.135730060359172,null,null,510.73149713218578,20.050506117722357,36.155384782139969,null,null,507.15433142145719,20.018025785200717,36.174988437425014,null,null,503.57716571072865,19.985545452679069,36.194540700130915,null,null,1700]
[7.8,20,458.33333333333337,"12:45:00",508.05686385689364,20.025919061647549,36.179270555967577,null,null,506.04264789267023,20.007705576275011,36.190134247217529,null,null,504.02843192844682,19.989492090902466,36.200981474641836,null,null,502.01421596422347,19.971278605529932,36.211812179952794,null,null,1700]
[7.8,20,458.33333333333337,"12:50:00",504.53662623273453,19.993918279427792,36.203448178894952,null,null,503.4024696745509,19.983704989610185,36.209459160445007,null,null,502.26831311636727,19.973491699792579,36.215464853316668,null,null,501.13415655818369,19.963278409974976,36.221465247110977,null,null,1700]
[7.8,20,458.33333333333337,"12:55:00",502.55446510467289,19.975973703937964,36.216881483133065,null,null,501.91584882850469,19.970246557992805,36.220209219847106,null,null,501.27723255233644,19.964519412047654,36.223535261257965,null,null,500.63861627616831,19.958792266102506,36.226859605512367,null,null,1700]
[7.8,20,458.33333333333337,"13:00:00",501.43835785366394,19.965911206487153,36.224347353409478,null,null,501.07876839024794,19.962699684904699,36.226190053645709,null,null,500.719178926832,19.959488163322252,36.228032211132501,null,null,500.359589463416,19.956276641739802,36.229873825539862,null,null,1700]
[7.8,20,458.33333333333337,"13:05:00",500.80990470819592,19.960268618006587,36.228497216200765,null,null,500.60742853114692,19.958467743544279,36.229517645651264,null,null,500.40495235409799,19.956666869081964,36.230537901478279,null,null,500.20247617704899,19.954865994619656,36.231557983623063,null,null,1700]
[7.8,20,458.33333333333337,"13:10:00",500.45603785920662,19.957104512384038,36.230803960492587,null,null,500.34202839440491,19.956094664327363,36.231369009617119,null,null,500.22801892960337,19.955084816270688,36.231934003229263,null,null,500.11400946480165,19.954074968214019,36.232498941318596,null,null,1700]
[7.8,20,458.33333333333337,"13:15:00",500.25678394868578,19.955330226624024,36.232086148755229,null,null,500.19258796151433,19.954763950007354,36.232398998271819,null,null,500.12839197434295,19.954197673390688,36.232711830046114,null,null,500.06419598717144,19.953631396774018,36.233024644076401,null,null,1700]
[7.8,20,458.33333333333337,"13:20:00",500.14458886465565,19.954335288295887,36.232798797083447,null,null,500.10844164849169,19.95401774626125,36.232971983117999,null,null,500.07229443232785,19.953700204226617,36.23314516348362,null,null,500.0361472161639,19.953382662191977,36.233318338180034,null,null,1700]
[7.8,20,458.33333333333337,"13:25:00",500.08141451165233,19.953777372373256,36.233194856547222,null,null,500.06106088373923,19.953599309319277,36.233290709761029,null,null,500.04070725582619,19.953421246265304,36.233386561163933,null,null,500.0203536279131,19.953243183211317,36.233482410755947,null,null,1700]
[7.9,20,458.33333333333337,"13:30:00",1118.730303944915,25.79070039792407,31.976497353018168,null,null,964.04772795868644,24.331291578482386,33.123977116880866,null,null,809.36515197245762,22.871882759040709,34.245903158419267,null,null,654.68257598622881,21.412473939599025,35.325459341888553,null,null,1700]
[7.9,20,458.33333333333337,"13:35:00",1467.0766121990432,29.063779947700102,29.424155171766813,null,null,1225.3074591492827,26.786101240814411,31.237167842237351,null,null,983.53830609952172,24.508422533928726,33.04000934497585,null,null,741.7691530497608,22.230743827043028,34.784212817757115,null,null,1700]
[8,20,458.33333333333337,"13:40:00",1663.2220390265982,30.899173303457282,28.064242209554031,null,null,1372.4165292699488,28.162646257632296,30.236257189954468,null,null,1081.6110195132992,25.426119211807315,32.427207322119528,null,null,790.8055097566496,22.689592165982326,34.565778176721864,null,null,1700]
[8,20,458.33333333333337,"13:45:00",1773.6668106625775,31.928377977260006,27.309690680062911,null,null,1455.2501079969334,28.934549762984339,29.673072170676789,null,null,1136.8334053312888,25.940721548708677,32.078175012356667,null,null,818.41670266564449,22.946893334433014,34.439946864421408,null,null,1700]
[7.8,20,458.33333333333337,"13:50:00",1835.8556048598941,32.505508899770277,26.788429351116122,null,null,1501.8917036449209,29.367397954867045,29.235133898359404,null,null,1167.9278024299472,26.229287009963809,31.733591016803942,null,null,833.96390121497359,23.09117606506058,34.189647161665199,null,null,1700]
[7.8,20,458.33333333333337,"13:55:00",1870.8726189423999,32.829137532826223,26.50078008514825,null,null,1528.1544642068002,29.610119429659001,28.992743162838401,null,null,1185.4363094712,26.391101326491778,31.542395631184728,null,null,842.71815473560002,23.172083223324563,34.050313003281744,null,null,1700]
[7.7,20,458.33333333333337,"14:00:00",1890.5898572500578,33.010613672898742,26.291790083881384,null,null,1542.9423929375437,29.746226534713387,28.7984041434189,null,null,1195.2949286250291,26.481839396528041,31.36365788115063,null,null,847.64746431251456,23.217452258342689,33.884445648634035,null,null,1700]
[7.7,20,458.33333333333337,"14:05:00",1901.6921598497304,33.112377194576773,26.175552738604974,null,null,1551.2691198872983,29.822549175971908,28.690156454222222,null,null,1200.8460799248655,26.532721157367053,31.263899098349395,null,null,850.42303996243265,23.242893138762199,33.791566221156636,null,null,1700]
[7.6,20,458.33333333333337,"14:10:00",1907.9435993815448,33.16944152457728,26.062108917513239,null,null,1555.957699536159,29.865347423472286,28.570896128049146,null,null,1203.9717996907727,26.561253322367307,31.136606016025777,null,null,851.98589984538626,23.257159221262327,33.652143364485774,null,null,1700]
[7.6,20,458.33333333333337,"14:15:00",1911.463634605687,33.201440591676281,25.998642045118359,null,null,1558.5977259542656,29.889346723796542,28.504097858923917,null,null,1205.7318173028436,26.577252855916807,31.065204939237084,null,null,852.86590865142182,23.265158988037072,33.573798345582837,null,null,1700]
[7.6,20,458.33333333333337,"14:20:00",1913.4456817671678,33.219384205404808,25.963081987321424,null,null,1560.084261325376,29.902804434092943,28.466636877999886,null,null,1206.722840883584,26.586224662781074,31.025116978962846,null,null,853.36142044179201,23.269644891469213,33.529751282010153,null,null,1700]
[7.6,20,458.33333333333337,"14:25:00",1914.5617248463366,33.229446163543869,25.943141190392982,null,null,1560.9212936347526,29.910350902697225,28.445613647057851,null,null,1207.2808624231684,26.591255641850598,31.002597748327883,null,null,853.64043121158409,23.272160381003971,33.50497985404354,null,null,1700]
[7.7,20,458.33333333333337,"14:30:00",1915.1901418581849,33.235088449603055,25.980372151523117,null,null,1561.392606393639,29.914582617241621,28.492453128000662,null,null,1207.5950709290926,26.594076784880194,31.061303832757847,null,null,853.79753546454617,23.273570952518767,33.578306021000635,null,null,1700]
[7.7,20,458.33333333333337,"14:35:00",1915.5439883612021,33.23825238564153,26.001342833964742,null,null,1561.6579912709019,29.916955569270478,28.518831676144362,null,null,1207.771994180601,26.595658752899428,31.094361649159147,null,null,853.88599709030052,23.274361936528386,33.619593817429134,null,null,1700]
[7.8,20,458.33333333333337,"14:40:00",1915.7432308153952,33.240026576306533,26.061856904724916,null,null,1561.807423111547,29.91828621226923,28.592676568450049,null,null,1207.8716154076978,26.59654584823193,31.184762639126305,null,null,853.93580770384892,23.274805484194644,33.730627192396732,null,null,1700]
[7.8,20,458.33333333333337,"14:45:00",1915.8554194486433,33.241021461309749,26.095929748661899,null,null,1561.8915645864827,29.91903237602164,28.634254734010987,null,null,1207.9277097243216,26.597043290733538,31.235662248128321,null,null,853.96385486216082,23.27505420544545,33.79314372438936,null,null,1700]
[7.8,20,458.33333333333337,"14:50:00",1915.9185901693663,33.241579347330202,26.115116458863529,null,null,1561.938942627025,29.919450790536978,28.657666979569228,null,null,1207.9592950846832,26.597322233743768,31.264322571989268,null,null,853.97964754234158,23.275193676950565,33.828344628207844,null,null,1700]
[7.8,20,458.33333333333337,"14:55:00",1915.9541600826553,33.241892184302117,26.125921216281959,null,null,1561.9656200619918,29.919685418265914,28.670850736275277,null,null,1207.9770800413278,26.597478652229729,31.280461026407981,null,null,853.98854002066389,23.275271886193536,33.84816549373511,null,null,1700]
[7.9,20,458.33333333333337,"15:00:00",1915.9741886452064,33.242067608972064,26.180993597732812,null,null,1561.9806414839052,29.919816986768375,28.737612342607459,null,null,1207.9870943226033,26.597566364564695,31.36176130186108,null,null,853.99354716130165,23.275315742361016,33.947637577115415,null,null,1700]
[7.8,20,458.33333333333337,"15:05:00",1915.9854662469988,33.242165979105984,26.163016465159362,null,null,1561.9890996852496,29.919890764368816,28.715867257105486,null,null,1207.9927331234994,26.597615549631652,31.335327378604987,null,null,853.99636656174982,23.275340334894494,33.915337118812509,null,null,1700]
[7.8,20,458.33333333333337,"15:10:00",1915.9918163932894,33.242221140579282,26.152894253316926,null,null,1561.9938622949674,29.919932135473786,28.703623311884151,null,null,1207.9959081966447,26.597643130368304,31.320443137093047,null,null,853.99795409832234,23.275354125262822,33.89714940466628,null,null,1700]
[7.8,20,458.33333333333337,"15:15:00",1915.9953920079149,33.24225207261135,26.147194849533012,null,null,1561.9965440059366,29.919955334497836,28.696729169817015,null,null,1207.9976960039576,26.597658596384338,31.312062250663786,null,null,853.99884800197867,23.275361858270841,33.886908336154718,null,null,1700]
[7.8,20,458.33333333333337,"15:20:00",1915.9974053505005,33.242269417880621,26.143985752190058,null,null,1561.9980540128756,29.919968343449789,28.692847323821351,null,null,1207.9987026752503,26.597667269018977,31.307343226754959,null,null,853.99935133762517,23.275366194588159,33.881141851492053,null,null,1700]
[7.9,20,458.33333333333337,"15:25:00",1915.9985390152799,33.242279144314544,26.191165374420848,null,null,1561.9989042614602,29.919975638275233,28.749997892048089,null,null,1207.9992695076401,26.597672132235939,31.376897507237789,null,null,853.99963475382003,23.275368626196638,33.966204909035326,null,null,1700]
[8,20,458.33333333333337,"15:30:00",1915.9991773546476,33.242284598453963,26.267014603775319,null,null,1561.9993830159858,29.919979728879802,28.841874024636272,null,null,1207.9995886773238,26.597674859305648,31.488711040450283,null,null,853.9997943386619,23.275369989731495,34.102947246396873,null,null,1700]
[8,20,458.33333333333337,"15:35:00",1915.9995367881902,33.242287656885964,26.30972086878673,null,null,1561.9996525911429,29.919982022703806,28.893604096627652,null,null,1207.9997683940953,26.597676388521652,31.551666690935313,null,null,853.99988419704766,23.275370754339498,34.179938842077192,null,null,1700]
[8.1,20,458.33333333333337,"15:40:00",1915.9997391765721,33.242289371914794,26.38334894736742,null,null,1561.9998043824296,29.919983308975432,28.982788661253984,null,null,1207.9998695882862,26.597677246036067,31.660203516213535,null,null,853.9999347941432,23.275371183096702,34.312672980252891,null,null,1700]
[8.1,20,458.33333333333337,"15:45:00",1915.9998531366016,33.242290333624545,26.42480468802464,null,null,1561.9998898524518,29.919984030257744,29.033003361333858,null,null,1207.9999265683009,26.597677726890947,31.721314356933604,null,null,853.99996328415057,23.275371423524149,34.38740793041535,null,null,1700]
[8.1,20,458.33333333333337,"15:50:00",1915.9999173047531,33.242290872907404,26.448146640164456,null,null,1561.9999379785652,29.919984434719886,29.061277106587504,null,null,1207.9999586523766,26.597677996532372,31.755723249920543,null,null,853.99997932618828,23.275371558344858,34.429487972793652,null,null,1700]
[8.1,20,458.33333333333337,"15:55:00",1915.9999534362953,33.242291175312573,26.461289686016514,null,null,1561.999965077222,29.919984661523763,29.07719707367707,null,null,1207.9999767181478,26.597678147734957,31.775097705331685,null,null,853.99998835907388,23.27537163394615,34.453181785586388,null,null,1700]
[8.1,20,458.33333333333337,"16:00:00",1915.9999737810979,33.242291344887569,26.468690141472926,null,null,1561.9999803358237,29.919984788705001,29.086161129863431,null,null,1207.9999868905491,26.597678232522451,31.786006879840141,null,null,853.99999344527453,23.275371676339894,34.466523060110831,null,null,{"$f":"CO2Lim","v":1700}]
[8.1,20,458.33333333333337,"16:05:00",1915.9999852367669,33.242291439977464,26.472857135605139,null,null,1561.9999889275753,29.919984860022424,29.091208544582052,null,null,1207.9999926183834,26.597678280067402,31.792149537198277,null,null,853.99999630919172,23.275371700112373,34.474035166098581,null,null,1700]
[8.1,20,458.33333333333337,"16:10:00",1915.9999916871784,33.242291493299533,26.475203462197726,null,null,1561.999993765384,29.919984900013979,29.094050613102912,null,null,1207.9999958435892,26.597678306728437,31.795608308349493,null,null,853.9999979217946,23.275371713442887,34.478265038132648,null,null,1700]
[8.1,20,458.33333333333337,"16:15:00",1915.9999953192498,33.242291523200116,26.476524619942737,null,null,1561.9999964894378,29.919984922439411,29.095650910643279,null,null,1207.999997659625,26.597678321678725,31.797555855606213,null,null,853.99999882981251,23.275371720918031,34.480646772869797,null,null,1700]
[8,20,458.33333333333337,"16:20:00",1915.9999973643821,33.242291539966985,26.427691306000529,null,null,1561.9999980232869,29.919984935014568,29.036500219662965,null,null,1207.9999986821911,26.597678330062163,31.725570335383459,null,null,853.99999934109553,23.27537172510975,34.392613037897569,null,null,1700]
[8,20,458.33333333333337,"16:25:00",1915.999998515947,33.242291549369085,26.400193359955161,null,null,1561.9999988869604,29.919984942066144,29.003192576612431,null,null,1207.9999992579733,26.597678334763213,31.685035422068324,null,null,853.99999962898676,23.275371727460275,34.34304140207081,null,null,1700]
[8,20,458.33333333333337,"16:30:00",1915.9999991643654,33.242291554641355,26.38470958505177,null,null,1561.9999993732742,29.919984946020342,28.984437428091699,null,null,1207.9999995821827,26.597678337399344,31.662210680618287,null,null,853.99999979109134,23.275371728778339,34.315128185774746,null,null,1700]
[8,20,458.33333333333337,"16:35:00",1915.9999995294743,33.242291557597795,26.375990935135224,null,null,1561.9999996471058,29.919984948237676,28.973876723241222,null,null,1207.9999997647369,26.597678338877564,31.649358457061549,null,null,853.99999988236857,23.275371729517445,34.299410728357664,null,null,1700]
[7.9,20,458.33333333333337,"16:40:00",1915.9999997350581,33.242291559255634,26.321802426036555,null,null,1561.9999998012938,29.919984949481055,28.908239391560691,null,null,1207.9999998675291,26.597678339706487,31.569478775160647,null,null,853.99999993376457,23.275371729931912,34.201722916044005,null,null,1700]
[7.9,20,458.33333333333337,"16:45:00",1915.9999998508174,33.242291560185279,26.291288848133348,null,null,1561.9999998881133,29.919984950178289,28.871278973658853,null,null,1207.9999999254087,26.59767834017131,31.524498479509166,null,null,853.99999996270446,23.275371730164323,34.146714848744516,null,null,1700]
[7.8,20,458.33333333333337,"16:50:00",1915.9999999159988,33.242291560706583,26.225124656278009,null,null,1561.9999999369993,29.919984950569265,28.791135755037129,null,null,1207.9999999579993,26.597678340431958,31.426965331603107,null,null,853.99999997899977,23.275371730294651,34.027437946836649,null,null,1700]
[7.8,20,458.33333333333337,"16:55:00",1915.9999999527008,33.242291560998908,26.187867205793331,null,null,1561.9999999645258,29.919984950788511,28.746006628353804,null,null,1207.9999999763504,26.597678340578117,31.372043827900409,null,null,853.9999999881752,23.275371730367731,33.960272399697189,null,null,1700]
[7.7,20,458.33333333333337,"17:00:00",1915.9999999733668,33.242291561162823,26.118200313537471,null,null,1561.9999999800254,29.919984950911449,28.661620654986709,null,null,1207.9999999866834,26.597678340660078,31.26934729441227,null,null,853.9999999933417,23.275371730408708,33.834680985171325,null,null,1700]
[7.7,20,458.33333333333337,"17:05:00",1915.9999999850031,33.242291561254738,26.078970361026759,null,null,1561.999999988753,29.919984950980385,28.614102273585189,null,null,1207.9999999925017,26.59767834070604,31.211518093760244,null,null,853.99999999625084,23.275371730431694,33.763959497598982,null,null,1700]
[7.6,20,458.33333333333337,"17:10:00",1915.9999999915553,33.242291561306288,26.008485854349207,null,null,1561.999999993667,29.919984951019046,28.52872592994909,null,null,1207.9999999957779,26.597678340731811,31.107616279165928,null,null,853.99999999788895,23.275371730444576,33.636894082134077,null,null,1700]
[7.6,20,458.33333333333337,"17:15:00",1915.9999999952447,33.242291561335179,25.968795470977962,null,null,1561.9999999964341,29.919984951040725,28.480649831992928,null,null,1207.9999999976226,26.59767834074626,31.049108337097504,null,null,853.99999999881129,23.275371730451802,33.565342526273852,null,null,1700]
[7.6,20,458.33333333333337,"17:20:00",1915.9999999973222,33.242291561351394,25.946446056422591,null,null,1561.9999999979921,29.919984951052875,28.453578471260244,null,null,1207.9999999986612,26.597678340754367,31.016162866572511,null,null,853.99999999933073,23.275371730455852,33.525052273620297,null,null,1700]
[7.6,20,458.33333333333337,"17:25:00",1915.9999999984923,33.242291561360489,25.933861412175919,null,null,1561.9999999988695,29.919984951059689,28.438334964508599,null,null,1207.9999999992463,26.597678340758911,30.997611729873469,null,null,853.99999999962313,23.275371730458126,33.502365391648141,null,null,1700]
[7.6,20,458.33333333333337,"17:30:00",1915.9999999991508,33.242291561365576,25.926775229899828,null,null,1561.9999999993636,29.919984951063512,28.429751625432402,null,null,1207.9999999995755,26.597678340761462,30.987165924906858,null,null,853.99999999978775,23.275371730459398,33.489590824180411,null,null,1700]
[7.6,20,458.33333333333337,"17:35:00",1915.9999999995216,33.242291561368432,25.92278514834469,null,null,1561.9999999996417,29.919984951065658,28.424918526051584,null,null,1207.999999999761,26.59767834076289,30.981284109750156,null,null,853.99999999988052,23.275371730460122,33.482397731324056,null,null,1700]
[7.5,20,458.33333333333337,"17:40:00",1915.9999999997306,33.242291561370038,25.872434324206932,null,null,1561.9999999997983,29.919984951066866,28.363929661023224,null,null,1207.9999999998654,26.597678340763689,30.907061501247757,null,null,853.9999999999327,23.27537173046052,33.391628110147622,null,null,1700]
[7.5,20,458.33333333333337,"17:45:00",1915.9999999998481,33.242291561370934,25.844081836626863,null,null,1561.9999999998865,29.919984951067541,28.329586903888959,null,null,1207.9999999999241,26.597678340764141,30.865266836852712,null,null,853.99999999996214,23.275371730460748,33.340515839615932,null,null,1700]
[7.5,20,458.33333333333337,"17:50:00",1915.9999999999145,33.242291561371431,25.828116868350858,null,null,1561.9999999999361,29.919984951067917,28.310248881358213,null,null,1207.999999999957,26.597678340764389,30.841732728003119,null,null,853.99999999997863,23.275371730460876,33.311735089973432,null,null,1700]
[7.5,20,458.33333333333337,"17:55:00",1915.9999999999518,33.242291561371715,25.819127263167701,null,null,1561.9999999999641,29.91998495106813,28.299359965869602,null,null,1207.9999999999757,26.597678340764535,30.828481066617545,null,null,853.99999999998795,23.27537173046094,33.295529133027642,null,null,1700]
[7.5,20,458.33333333333337,"18:00:00",1915.9999999999727,33.242291561371886,25.814065396085599,null,null,1561.9999999999798,29.919984951068251,28.293228635044514,null,null,1207.9999999999864,26.597678340764613,30.821019320702597,null,null,853.99999999999329,23.275371730460975,33.286403882192573,null,null,1700]
[7.5,17,458.33333333333337,"18:05:00",1297.3155386081826,26.099688079546933,32.656042491184486,null,null,1097.9866539561372,24.236690439065903,34.210799934247262,null,null,898.6577693040914,22.373692798584873,35.731804738637713,null,null,699.32888465204576,20.510695158103847,37.183736920528688,null,null,1700]
[7.5,17,458.33333333333337,"18:10:00",948.94920063987911,22.09444262981545,37.002050344216364,null,null,836.71190047990945,21.049758735296553,37.884142778401028,null,null,724.47460031993955,20.005074840777656,38.739380898945711,null,null,612.23730015996989,18.960390946258752,39.559094766280637,null,null,1700]
[7.5,17,458.33333333333337,"18:15:00",752.79249556207992,19.848484114350438,39.542835716651858,null,null,689.59437167156011,19.262673152622448,40.025665725301508,null,null,626.39624778103996,18.676862190894461,40.49594164064068,null,null,563.19812389052004,18.09105122916646,40.95181652268225,null,null,1700]
[7.5,17,458.33333333333337,"18:20:00",642.34137341468238,18.589053271347307,40.978611482654635,null,null,606.75603006101187,18.260557269177475,41.241162702375618,null,null,571.17068670734125,17.932061267007636,41.498850955757327,null,null,535.58534335367062,17.60356526483779,41.75131267542195,null,null,1700]
[7.5,17,458.33333333333337,"18:25:00",580.14900339714563,17.8828220398327,41.780475774777692,null,null,560.11175254785928,17.69861650171293,41.923720075041878,null,null,540.07450169857282,17.514410963593154,42.065241381195179,null,null,520.03725084928635,17.330205425473377,42.204971221678115,null,null,1700]
[7.5,17,458.33333333333337,"18:30:00",545.12997585628921,17.486799856369782,42.22688449691605,null,null,533.84748189221693,17.383505813063739,42.305425866893096,null,null,522.56498792814455,17.280211769757685,42.383384385891219,null,null,511.28249396407227,17.176917726451638,42.460747474296227,null,null,1700]
[7.5,17,458.33333333333337,"18:35:00",525.41160381866678,17.264728723295725,42.475309768617052,null,null,519.05870286400011,17.206806146746622,42.518547795731848,null,null,512.70580190933345,17.148883570197512,42.561593521336341,null,null,506.35290095466667,17.090960993648409,42.604444666229583,null,null,1700]
[7.4,17,458.33333333333337,"18:40:00",514.30866284292267,17.140201385676484,42.487189787260199,null,null,510.73149713219203,17.107721053154826,42.510793090500357,null,null,507.15433142146134,17.075240720633168,42.534333195776568,null,null,503.5771657107307,17.04276038811151,42.557809691760248,null,null,1700]
[7.4,17,458.33333333333337,"18:45:00",508.0568638568983,17.070372148531263,42.492131641350035,null,null,506.04264789267376,17.052158663158714,42.50509568466223,null,null,504.02843192844915,17.033945177786162,42.518039213536383,null,null,502.0142159642246,17.015731692413617,42.53096215419599,null,null,1700]
[7.4,17,458.33333333333337,"18:50:00",504.53662623273715,17.031215105158239,42.49416589172251,null,null,503.40246967455283,17.021001815340629,42.501312027353762,null,null,502.26831311636857,17.010788525523015,42.508451549299117,null,null,501.13415655818432,17.000575235705409,42.515584444371548,null,null,1700]
[7.4,17,458.33333333333337,"18:55:00",502.55446510467436,17.009257625621007,42.494966539107985,null,null,501.91584882850577,17.003530479675856,42.498913713707843,null,null,501.27723255233724,16.997803333730701,42.50285876432352,null,null,500.63861627616865,16.99207618778555,42.506801688602494,null,null,1700]
[7.4,17,458.33333333333337,"19:00:00",501.43835785366474,16.996944875063335,42.495248037446018,null,null,501.07876839024857,16.993733353480884,42.497430661615233,null,null,500.7191789268324,16.99052183189843,42.499612605180864,null,null,500.35958946341623,16.987310310315983,42.501793867723748,null,null,1700]
[7.4,17,458.33333333333337,"19:05:00",500.80990470819637,16.990040447529275,42.495319259699535,null,null,500.60742853114726,16.988239573066966,42.49652682112049,null,null,500.40495235409821,16.986438698604655,42.497734164737523,null,null,500.20247617704911,16.984637824142343,42.498941290475948,null,null,1700]
[7.4,17,458.33333333333337,"19:10:00",500.45603785920684,16.986168760260874,42.495312861259407,null,null,500.34202839440513,16.985158912204202,42.495981107557746,null,null,500.22801892960348,16.98414906414753,42.496649284211962,null,null,500.11400946480177,16.983139216090859,42.497317391208753,null,null,1700]
[7.4,17,458.33333333333337,"19:15:00",500.25678394868589,16.983997695066787,42.495283958929647,null,null,500.19258796151439,16.98343141845012,42.495653768790319,null,null,500.128391974343,16.98286514183345,42.496023556393666,null,null,500.0641959871715,16.98229886521678,42.496393321737393,null,null,1700]
[7.4,17,458.33333333333337,"19:20:00",500.1445888646557,16.982780260974053,42.49525374469745,null,null,500.10844164849175,16.982462718939416,42.495458382665923,null,null,500.07229443232785,16.982145176904787,42.495663013523846,null,null,500.0361472161639,16.98182763487015,42.495867637270912,null,null,1700]
[7.4,17,458.33333333333337,"19:25:00",500.08141451165233,16.982097579599863,42.495228993242399,null,null,500.06106088373929,16.981919516545883,42.495342215118946,null,null,500.04070725582619,16.98174145349191,42.495455434724541,null,null,500.0203536279131,16.981563390437934,42.49556865205917,null,null,1700]
[7.4,17,458.33333333333337,"19:30:00",500.04584255311346,16.98171476309961,42.495210741756516,null,null,500.03438191483508,16.981614913480556,42.49527337322467,null,null,500.02292127655676,16.981515063861508,42.495336003967687,null,null,500.01146063827838,16.98141521424245,42.495398633985623,null,null,1700]
[7.4,17,458.33333333333337,"19:35:00",500.02581283893142,16.981500097109873,42.495198053289137,null,null,500.01935962919856,16.981444106008954,42.495232691940267,null,null,500.01290641946571,16.981388114908039,42.495267330359901,null,null,500.00645320973291,16.981332123807118,42.495301968548048,null,null,1700]
[7.4,17,458.33333333333337,"19:40:00",500.01453458868332,16.981379722238049,42.495189558970125,null,null,500.01090094151249,16.981348324988751,42.495208711540641,null,null,500.00726729434166,16.981316927739449,42.495227864037304,null,null,500.00363364717083,16.981285530490148,42.495247016460063,null,null,1700]
[7.4,17,458.33333333333337,"19:45:00",500.00818407726308,16.981312221513861,42.495184019942108,null,null,500.00613805794728,16.981294615372033,42.495194607223155,null,null,500.00409203863154,16.981277009230212,42.495205194480583,null,null,500.00204601931574,16.981259403088391,42.495215781714421,null,null,1700]
[7.3,17,458.33333333333337,"19:50:00",500.00460825704164,16.981274370194086,42.36824416838725,null,null,500.00345619278124,16.981264497474758,42.368249938655538,null,null,500.00230412852085,16.981254624755433,42.368255708916259,null,null,500.00115206426045,16.981244752036108,42.368261479169398,null,null,1700]
[7.3,17,458.33333333333337,"19:55:00",500.0025947986901,16.981253144904642,42.296764132607166,null,null,500.00194609901763,16.981247608735057,42.296767294468978,null,null,500.00129739934511,16.981242072565472,42.296770456328368,null,null,500.00064869967252,16.981236536395883,42.296773618185348,null,null,1700]
[7.4,17,458.33333333333337,"20:00:00",500.0014610687254,16.981241242732811,42.383456432427543,null,null,500.00109580154412,16.981238138302036,42.383458195560955,null,null,500.00073053436273,16.981235033871265,42.383459958693621,null,null,500.00036526718134,16.98123192944049,42.383461721825519,null,null,1700]
[7.4,17,458.33333333333337,"20:05:00",500.0008226926538,16.981234568539051,42.432269483083275,null,null,500.00061701949033,16.981232827716216,42.432270461911628,null,null,500.00041134632687,16.981231086893388,42.432271440739768,null,null,500.00020567316341,16.981229346070556,42.432272419567596,null,null,1700]
[7.4,17,458.33333333333337,"20:10:00",500.00046323844379,16.981230825956356,42.459754507926519,null,null,500.00034742883287,16.981229849782508,42.459755049905851,null,null,500.00023161922184,16.981228873608664,42.459755591885127,null,null,500.00011580961092,16.981227897434817,42.459756133864261,null,null,1700]
[7.4,17,458.33333333333337,"20:15:00",500.00026083842465,16.981228727287103,42.47523051777916,null,null,500.00019562881852,16.981228179893446,42.475230817382304,null,null,500.00013041921233,16.981227632499788,42.475231116985476,null,null,500.00006520960613,16.981227085106131,42.475231416588564,null,null,1700]
[7.3,17,458.33333333333337,"20:20:00",500.0001468718425,16.981227550449347,42.357007388534569,null,null,500.00011015388191,16.981227243496011,42.357007551464385,null,null,500.00007343592131,16.981226936542676,42.357007714394292,null,null,500.00003671796065,16.981226629589344,42.357007877324151,null,null,1700]
[7.3,17,458.33333333333337,"20:25:00",500.0000827000016,16.981226890532543,42.290436388464862,null,null,500.00006202500123,16.981226718407147,42.290436477549569,null,null,500.0000413500008,16.98122654628175,42.29043656663422,null,null,500.00002067500037,16.981226374156357,42.290436655718864,null,null,1700]
[7.3,17,458.33333333333337,"20:30:00",500.00004656638157,16.981226520481371,42.252951096988902,null,null,500.00003492478623,16.981226423961317,42.252951145842765,null,null,500.00002328319084,16.981226327441266,42.252951194696678,null,null,500.00001164159539,16.981226230921216,42.252951243550598,null,null,1700]
[7.3,17,458.33333333333337,"20:35:00",500.00002622040932,16.98122631297359,42.231843788239154,null,null,500.00001966530704,16.98122625884956,42.231843815072033,null,null,500.00001311020469,16.98122620472553,42.231843841904904,null,null,500.00000655510229,16.981226150601501,42.231843868737812,null,null,1700]
[7.3,17,458.33333333333337,"20:40:00",500.00001476408181,16.98122619661272,42.219958692863656,null,null,500.00001107306139,16.981226166262438,42.219958707612001,null,null,500.00000738204091,16.981226135912156,42.219958722360332,null,null,500.00000369102042,16.981226105561877,42.219958737108648,null,null,1700]
[7.3,17,458.33333333333337,"20:45:00",500.00000831329936,16.98122613136286,42.213266456647915,null,null,500.00000623497448,16.981226114343812,42.213266464755883,null,null,500.00000415664965,16.981226097324765,42.213266472863808,null,null,500.00000207832488,16.981226080305714,42.213266480971789,null,null,1700]
[7.3,17,458.33333333333337,"20:50:00",500.00000468101888,16.981226094773721,42.209498211342506,null,null,500.00000351076409,16.981226085230219,42.209498215799528,null,null,500.00000234050941,16.981226075686713,42.209498220256556,null,null,500.00000117025473,16.981226066143211,42.209498224713577,null,null,1700]
[7.3,17,458.33333333333337,"20:55:00",500.00000263576914,16.98122607425621,42.207376400396647,null,null,500.00000197682687,16.981226068904647,42.207376402846087,null,null,500.00000131788454,16.981226063553084,42.207376405295591,null,null,500.00000065894233,16.981226058201525,42.207376407745031,null,null,1700]
[7.3,17,458.33333333333337,"21:00:00",500.00000148413824,16.981226062750924,42.206181658794101,null,null,500.00000111310362,16.981226059750018,42.206181660139741,null,null,500.00000074206912,16.981226056749104,42.206181661485438,null,null,500.00000037103456,16.981226053748191,42.206181662831078,null,null,1700]
[7.3,17,458.33333333333337,"21:05:00",500.00000083568256,16.981226056299288,42.205508928220866,null,null,500.0000006267619,16.981226054616517,42.205508928959787,null,null,500.00000041784125,16.981226052933742,42.205508929698738,null,null,500.00000020892065,16.981226051250964,42.205508930437659,null,null,1700]
[7.3,17,458.33333333333337,"21:10:00",500.00000047055278,16.981226052681503,42.205130129699711,null,null,500.00000035291458,16.981226051737885,42.20513013010526,null,null,500.00000023527639,16.981226050794263,42.205130130510874,null,null,500.00000011763825,16.981226049850637,42.205130130916437,null,null,1700]
[7.3,17,458.33333333333337,"21:15:00",500.00000026495695,16.981226050652818,42.204916837317242,null,null,500.00000019871771,16.981226050123677,42.204916837539685,null,null,500.00000013247848,16.98122604959454,42.20491683776217,null,null,500.00000006623935,16.981226049065398,42.204916837984648,null,null,1700]
[7.3,17,458.33333333333337,"21:20:00",500.00000014919084,16.981226049515225,42.204796737486866,null,null,500.00000011189314,16.981226049218506,42.204796737608874,null,null,500.00000007459545,16.981226048921791,42.204796737730845,null,null,500.00000003729781,16.981226048625068,42.20479673785286,null,null,{"$f":"CO2Lim","v":1700}]
[7.3,17,458.33333333333337,"21:25:00",500.00000008400576,16.981226048877314,42.204729112151831,null,null,500.00000006300434,16.981226048710926,42.204729112218665,null,null,500.00000004200291,16.981226048544542,42.204729112285499,null,null,500.00000002100148,16.981226048378154,42.204729112352339,null,null,1700]
[7.3,17,458.33333333333337,"21:30:00",500.00000004730157,16.981226048519602,42.20469103394764,null,null,500.00000003547621,16.981226048426297,42.204691033984233,null,null,500.00000002365078,16.981226048332996,42.204691034020811,null,null,500.00000001182542,16.981226048239698,42.204691034057426,null,null,1700]
[7.3,17,458.33333333333337,"21:35:00",500.00000002663438,16.981226048319012,42.204669593024306,null,null,500.0000000199758,16.981226048266691,42.204669593044336,null,null,500.00000001331716,16.981226048214371,42.204669593064359,null,null,500.00000000665864,16.981226048162053,42.20466959308439,null,null,1700]
[7.3,17,458.33333333333337,"21:40:00",500.00000001499717,16.98122604820653,42.204657520154839,null,null,500.00000001124795,16.981226048177192,42.204657520165782,null,null,500.00000000749861,16.981226048147857,42.204657520176731,null,null,500.00000000374934,16.981226048118515,42.204657520187681,null,null,1700]
[7.3,17,458.33333333333337,"21:45:00",500.00000000844454,16.981226048143458,42.204650722211682,null,null,500.00000000633349,16.981226048127002,42.204650722217679,null,null,500.00000000422233,16.981226048110557,42.204650722223668,null,null,500.00000000211116,16.981226048094101,42.204650722229644,null,null,1700]
[7.3,17,458.33333333333337,"21:50:00",500.0000000047549,16.981226048108088,42.20464689445302,null,null,500.00000000356624,16.981226048098861,42.20464689445631,null,null,500.00000000237748,16.981226048089638,42.2046468944596,null,null,500.00000000118877,16.981226048080412,42.20464689446284,null,null,1700]
[7.3,17,458.33333333333337,"21:55:00",500.00000000267738,16.981226048088256,42.204644739134011,null,null,500.00000000200811,16.98122604808308,42.20464473913578,null,null,500.00000000133872,16.981226048077907,42.204644739137578,null,null,500.00000000066939,16.981226048072738,42.204644739139326,null,null,1700]
[7.3,17,458.33333333333337,"22:00:00",500.00000000150754,16.981226048077133,42.204643525525562,null,null,500.00000000113073,16.981226048074227,42.204643525526564,null,null,500.00000000075386,16.981226048071328,42.204643525527516,null,null,500.00000000037693,16.981226048068432,42.204643525528468,null,null,1700]
[7.3,17,458.33333333333337,"22:05:00",500.00000000084884,16.981226048070898,42.204642842171744,null,null,500.0000000006367,16.981226048069267,42.204642842172319,null,null,500.00000000042451,16.981226048067644,42.204642842172831,null,null,500.0000000002122,16.98122604806602,42.204642842173349,null,null,1700]
[7.3,17,458.33333333333337,"22:10:00",500.000000000478,16.981226048067402,42.204642457391643,null,null,500.00000000035851,16.981226048066489,42.204642457391962,null,null,500.00000000023908,16.981226048065576,42.204642457392247,null,null,500.00000000011948,16.981226048064666,42.204642457392502,null,null,1700]
[7.3,17,458.33333333333337,"22:15:00",500.00000000026915,16.981226048065441,42.204642240731211,null,null,500.00000000020185,16.981226048064926,42.204642240731374,null,null,500.00000000013466,16.981226048064414,42.204642240731538,null,null,500.0000000000673,16.981226048063906,42.204642240731658,null,null,1700]
[7.3,17,458.33333333333337,"22:20:00",500.00000000015154,16.98122604806434,42.204642118734888,null,null,500.00000000011363,16.981226048064055,42.204642118734995,null,null,500.00000000007583,16.981226048063764,42.204642118735066,null,null,500.00000000003791,16.981226048063483,42.204642118735165,null,null,1700]
[7.3,17,458.33333333333337,"22:25:00",500.00000000008538,16.981226048063725,42.204642050041684,null,null,500.00000000006395,16.981226048063565,42.204642050041734,null,null,500.00000000004269,16.981226048063402,42.204642050041777,null,null,500.00000000002137,16.981226048063242,42.204642050041862,null,null,1700]
[7.3,17,458.33333333333337,"22:30:00",500.00000000004809,16.98122604806338,42.204642011362225,null,null,500.00000000003604,16.981226048063288,42.204642011362267,null,null,500.0000000000241,16.981226048063196,42.20464201136231,null,null,500.00000000001205,16.981226048063107,42.20464201136231,null,null,1700]
[7.3,17,458.33333333333337,"22:35:00",500.00000000002711,16.981226048063185,42.204641989582726,null,null,500.00000000002029,16.981226048063135,42.20464198958274,null,null,500.00000000001359,16.981226048063082,42.204641989582782,null,null,500.00000000000682,16.981226048063036,42.20464198958279,null,null,1700]
[7.2,17,458.33333333333337,"22:40:00",500.00000000001529,16.981226048063075,42.078471855100794,null,null,500.00000000001143,16.98122604806305,42.078471855100759,null,null,500.00000000000762,16.981226048063018,42.078471855100815,null,null,500.00000000000387,16.98122604806299,42.078471855100801,null,null,1700]
[7.2,17,458.33333333333337,"22:45:00",500.00000000000858,16.981226048063014,42.007425771588935,null,null,500.00000000000642,16.981226048063,42.007425771588949,null,null,500.00000000000432,16.981226048062982,42.007425771588956,null,null,500.00000000000222,16.981226048062965,42.007425771588949,null,null,1700]
[7.2,17,458.33333333333337,"22:50:00",500.00000000000483,16.981226048062979,41.967420569867571,null,null,500.00000000000358,16.981226048062968,41.967420569867592,null,null,500.00000000000244,16.981226048062961,41.967420569867571,null,null,500.00000000000125,16.98122604806295,41.967420569867585,null,null,1700]
[7.2,17,458.33333333333337,"22:55:00",500.00000000000273,16.981226048062958,41.944894330071655,null,null,500.00000000000205,16.98122604806295,41.944894330071691,null,null,500.00000000000136,16.98122604806295,41.944894330071683,null,null,500.00000000000074,16.981226048062943,41.944894330071662,null,null,1700]
[7.2,17,458.33333333333337,"23:00:00",500.00000000000153,16.981226048062947,41.932210259740707,null,null,500.00000000000114,16.981226048062943,41.9322102597407,null,null,500.0000000000008,16.981226048062943,41.9322102597407,null,null,500.00000000000074,16.981226048062936,41.932210259740728,null,null,1700]
[7.2,17,458.33333333333337,"23:05:00",500.00000000000085,16.98122604806294,41.925068137402945,null,null,500.00000000000063,16.981226048062936,41.925068137402945,null,null,500.00000000000045,16.981226048062936,41.925068137402945,null,null,500.00000000000074,16.981226048062936,41.925068137402938,null,null,1700]
[7.2,17,458.33333333333337,"23:10:00",500.00000000000051,16.981226048062936,41.921046571414102,null,null,500.00000000000063,16.981226048062936,41.921046571414102,null,null,500.00000000000045,16.981226048062936,41.921046571414102,null,null,500.00000000000074,16.981226048062936,41.921046571414102,null,null,1700]
[7.2,17,458.33333333333337,"23:15:00",500.00000000000051,16.981226048062936,41.91878212158425,null,null,500.00000000000063,16.981226048062936,41.91878212158425,null,null,500.00000000000045,16.981226048062936,41.91878212158425,null,null,500.00000000000074,16.981226048062936,41.91878212158425,null,null,1700]
[7.2,17,458.33333333333337,"23:20:00",500.00000000000051,16.981226048062936,41.917507063480876,null,null,500.00000000000063,16.981226048062936,41.917507063480876,null,null,500.00000000000045,16.981226048062936,41.917507063480876,null,null,500.00000000000074,16.981226048062936,41.917507063480876,null,null,1700]
[7.2,17,458.33333333333337,"23:25:00",500.00000000000051,16.981226048062936,41.916789108656616,null,null,500.00000000000063,16.981226048062936,41.916789108656616,null,null,500.00000000000045,16.981226048062936,41.916789108656616,null,null,500.00000000000074,16.981226048062936,41.916789108656616,null,null,1700]
[7.4,17,458.33333333333337,"23:30:00",500.00000000000051,16.981226048062936,42.169515627999253,null,null,500.00000000000063,16.981226048062936,42.169515627999253,null,null,500.00000000000045,16.981226048062936,42.169515627999253,null,null,500.00000000000074,16.981226048062936,42.169515627999253,null,null,1700]
[7.4,17,458.33333333333337,"23:35:00",500.00000000000051,16.981226048062936,42.311808956512664,null,null,500.00000000000063,16.981226048062936,42.311808956512664,null,null,500.00000000000045,16.981226048062936,42.311808956512664,null,null,500.00000000000074,16.981226048062936,42.311808956512664,null,null,1700]
[7.4,17,458.33333333333337,"23:40:00",500.00000000000051,16.981226048062936,42.391927452902237,null,null,500.00000000000063,16.981226048062936,42.391927452902237,null,null,500.00000000000045,16.981226048062936,42.391927452902237,null,null,500.00000000000074,16.981226048062936,42.391927452902237,null,null,1700]
[7.4,17,458.33333333333337,"23:45:00",500.00000000000051,16.981226048062936,42.437039155921688,null,null,500.00000000000063,16.981226048062936,42.437039155921688,null,null,500.00000000000045,16.981226048062936,42.437039155921688,null,null,500.00000000000074,16.981226048062936,42.437039155921688,null,null,1700]
[7.4,17,458.33333333333337,"23:50:00",500.00000000000051,16.981226048062936,42.462440123557258,null,null,500.00000000000063,16.981226048062936,42.462440123557258,null,null,500.00000000000045,16.981226048062936,42.462440123557258,null,null,500.00000000000074,16.981226048062936,42.462440123557258,null,null,1700]
[7.4,17,0,"23:55:00",500.00000000000051,16.973057078519542,42.4844995967009,null,null,500.00000000000063,16.973057078519542,42.4844995967009,null,null,500.00000000000045,16.973057078519542,42.4844995967009,null,null,500.00000000000074,16.973057078519542,42.4844995967009,null,null,1700]

{"sheet":"Résultats expérience","index":6,"n_rows":10,"n_cols":5,"rows_kept":10,"cut":false,"hidden":false,"merged":[]}
[]
[]
[]
[null,null,"occupation 100%"]
["augmentation débit %","débit m3/h","CO2 ppm","T °C","HR %"]
[{"$f":"((B6-$B$6)/$B$6)","v":0},5500,1880,33.4,15.3]
[{"$f":"((B7-$B$6)/$B$6)","v":9.0909090909090912E-2},6000,1790,32.200000000000003,15.4]
[{"$f":"((B8-$B$6)/$B$6)","v":0.18181818181818182},6500,1680,31.3,15.5]
[{"$f":"((B9-$B$6)/$B$6)","v":0.22727272727272727},6750,1643,30.9,15.5]
[{"$f":"((B10-$B$6)/$B$6)","v":0.27272727272727271},7000,1606,30.5,15.5]

{"sheet":"bilan","index":8,"n_rows":291,"n_cols":7,"rows_kept":291,"cut":false,"hidden":false,"merged":[]}
[]
[null,null,{"$f":"MAX(C4:C291)","v":{"$error":"#REF!"}},{"$f":"MAX(D4:D291)","v":{"$error":"#REF!"}},{"$f":"MAX(E4:E291)","v":{"$error":"#REF!"}},{"$f":"MAX(F4:F291)","v":{"$error":"#REF!"}}]
[null,{"$f":"'debit réf'!C24","v":"Heure"},"Taux d'occupation 100%","Taux d'occupation 75%","Taux d'occupation 50%","Taux d'occupation 25%","taux reglementaire"]
[null,{"$f":"'debit réf'!C25","v":"00:00:00"},{"$f":"'debit réf'!#REF!","v":{"$error":"#REF!"}},{"$f":"'debit réf'!#REF!","v":{"$error":"#REF!"}},{"$f":"'debit réf'!#REF!","v":{"$error":"#REF!"}},{"$f":"'debit réf'!#REF!","v":{"$error":"#REF!"}},{"$f":"CO2Lim","v":1700}]
[null,{"$f":"'debit réf'!C26","v":"00:10:00"},{"$f":"'debit réf'!#REF!","v":{"$error":"#REF!"}},{"$f":"'debit réf'!#REF!","v":{"$error":"#REF!"}},{"$f":"'debit réf'!#REF!","v":{"$error":"#REF!"}},{"$f":"'debit réf'!#REF!","v":{"$error":"#REF!"}},1700]
[null,{"$f":"'debit réf'!C27","v":"00:20:00"},{"$f":"'debit réf'!#REF!","v":{"$error":"#REF!"}},{"$f":"'debit réf'!#REF!","v":{"$error":"#REF!"}},{"$f":"'debit réf'!#REF!","v":{"$error":"#REF!"}},{"$f":"'debit réf'!#REF!","v":{"$error":"#REF!"}},1700]
[null,{"$f":"'debit réf'!C28","v":"00:30:00"},{"$f":"'debit réf'!#REF!","v":{"$error":"#REF!"}},{"$f":"'debit réf'!#REF!","v":{"$error":"#REF!"}},{"$f":"'debit réf'!#REF!","v":{"$error":"#REF!"}},{"$f":"'debit réf'!#REF!","v":{"$error":"#REF!"}},1700]
[null,{"$f":"'debit réf'!C29","v":"00:40:00"},{"$f":"'debit réf'!#REF!","v":{"$error":"#REF!"}},{"$f":"'debit réf'!#REF!","v":{"$error":"#REF!"}},{"$f":"'debit réf'!#REF!","v":{"$error":"#REF!"}},{"$f":"'debit réf'!#REF!","v":{"$error":"#REF!"}},1700]
[null,{"$f":"'debit réf'!C30","v":"00:50:00"},{"$f":"'debit réf'!#REF!","v":{"$error":"#REF!"}},{"$f":"'debit réf'!#REF!","v":{"$error":"#REF!"}},{"$f":"'debit réf'!#REF!","v":{"$error":"#REF!"}},{"$f":"'debit réf'!#REF!","v":{"$error":"#REF!"}},1700]
[null,{"$f":"'debit réf'!C31","v":"01:00:00"},{"$f":"'debit réf'!#REF!","v":{"$error":"#REF!"}},{"$f":"'debit réf'!#REF!","v":{"$error":"#REF!"}},{"$f":"'debit réf'!#REF!","v":{"$error":"#REF!"}},{"$f":"'debit réf'!#REF!","v":{"$error":"#REF!"}},1700]
[null,{"$f":"'debit réf'!C32","v":"01:10:00"},{"$f":"'debit réf'!#REF!","v":{"$error":"#REF!"}},{"$f":"'debit réf'!#REF!","v":{"$error":"#REF!"}},{"$f":"'debit réf'!#REF!","v":{"$error":"#REF!"}},{"$f":"'debit réf'!#REF!","v":{"$error":"#REF!"}},1700]
[null,{"$f":"'debit réf'!C33","v":"01:20:00"},{"$f":"'debit réf'!#REF!","v":{"$error":"#REF!"}},{"$f":"'debit réf'!#REF!","v":{"$error":"#REF!"}},{"$f":"'debit réf'!#REF!","v":{"$error":"#REF!"}},{"$f":"'debit réf'!#REF!","v":{"$error":"#REF!"}},1700]
[null,{"$f":"'debit réf'!C34","v":"01:30:00"},{"$f":"'debit réf'!#REF!","v":{"$error":"#REF!"}},{"$f":"'debit réf'!#REF!","v":{"$error":"#REF!"}},{"$f":"'debit réf'!#REF!","v":{"$error":"#REF!"}},{"$f":"'debit réf'!#REF!","v":{"$error":"#REF!"}},1700]
[null,{"$f":"'debit réf'!C35","v":"01:40:00"},{"$f":"'debit réf'!#REF!","v":{"$error":"#REF!"}},{"$f":"'debit réf'!#REF!","v":{"$error":"#REF!"}},{"$f":"'debit réf'!#REF!","v":{"$error":"#REF!"}},{"$f":"'debit réf'!#REF!","v":{"$error":"#REF!"}},1700]
[null,{"$f":"'debit réf'!C36","v":"01:50:00"},{"$f":"'debit réf'!#REF!","v":{"$error":"#REF!"}},{"$f":"'debit réf'!#REF!","v":{"$error":"#REF!"}},{"$f":"'debit réf'!#REF!","v":{"$error":"#REF!"}},{"$f":"'debit réf'!#REF!","v":{"$error":"#REF!"}},1700]
[null,{"$f":"'debit réf'!C37","v":"02:00:00"},{"$f":"'debit réf'!#REF!","v":{"$error":"#REF!"}},{"$f":"'debit réf'!#REF!","v":{"$error":"#REF!"}},{"$f":"'debit réf'!#REF!","v":{"$error":"#REF!"}},{"$f":"'debit réf'!#REF!","v":{"$error":"#REF!"}},1700]
[null,{"$f":"'debit réf'!C38","v":"02:10:00"},{"$f":"'debit réf'!#REF!","v":{"$error":"#REF!"}},{"$f":"'debit réf'!#REF!","v":{"$error":"#REF!"}},{"$f":"'debit réf'!#REF!","v":{"$error":"#REF!"}},{"$f":"'debit réf'!#REF!","v":{"$error":"#REF!"}},1700]
[null,{"$f":"'debit réf'!C39","v":"02:20:00"},{"$f":"'debit réf'!#REF!","v":{"$error":"#REF!"}},{"$f":"'debit réf'!#REF!","v":{"$error":"#REF!"}},{"$f":"'debit réf'!#REF!","v":{"$error":"#REF!"}},{"$f":"'debit réf'!#REF!","v":{"$error":"#REF!"}},1700]
[null,{"$f":"'debit réf'!C40","v":"02:30:00"},{"$f":"'debit réf'!#REF!","v":{"$error":"#REF!"}},{"$f":"'debit réf'!#REF!","v":{"$error":"#REF!"}},{"$f":"'debit réf'!#REF!","v":{"$error":"#REF!"}},{"$f":"'debit réf'!#REF!","v":{"$error":"#REF!"}},1700]
[null,{"$f":"'debit réf'!C41","v":"02:40:00"},{"$f":"'debit réf'!#REF!","v":{"$error":"#REF!"}},{"$f":"'debit réf'!#REF!","v":{"$error":"#REF!"}},{"$f":"'debit réf'!#REF!","v":{"$error":"#REF!"}},{"$f":"'debit réf'!#REF!","v":{"$error":"#REF!"}},1700]
[null,{"$f":"'debit réf'!C42","v":"02:50:00"},{"$f":"'debit réf'!#REF!","v":{"$error":"#REF!"}},{"$f":"'debit réf'!#REF!","v":{"$error":"#REF!"}},{"$f":"'debit réf'!#REF!","v":{"$error":"#REF!"}},{"$f":"'debit réf'!#REF!","v":{"$error":"#REF!"}},1700]
[null,{"$f":"'debit réf'!C43","v":"03:00:00"},{"$f":"'debit réf'!#REF!","v":{"$error":"#REF!"}},{"$f":"'debit réf'!#REF!","v":{"$error":"#REF!"}},{"$f":"'debit réf'!#REF!","v":{"$error":"#REF!"}},{"$f":"'debit réf'!#REF!","v":{"$error":"#REF!"}},1700]
[null,{"$f":"'debit réf'!C44","v":"03:10:00"},{"$f":"'debit réf'!#REF!","v":{"$error":"#REF!"}},{"$f":"'debit réf'!#REF!","v":{"$error":"#REF!"}},{"$f":"'debit réf'!#REF!","v":{"$error":"#REF!"}},{"$f":"'debit réf'!#REF!","v":{"$error":"#REF!"}},1700]
[null,{"$f":"'debit réf'!C45","v":"03:20:00"},{"$f":"'debit réf'!#REF!","v":{"$error":"#REF!"}},{"$f":"'debit réf'!#REF!","v":{"$error":"#REF!"}},{"$f":"'debit réf'!#REF!","v":{"$error":"#REF!"}},{"$f":"'debit réf'!#REF!","v":{"$error":"#REF!"}},1700]
[null,{"$f":"'debit réf'!C46","v":"03:30:00"},{"$f":"'debit réf'!#REF!","v":{"$error":"#REF!"}},{"$f":"'debit réf'!#REF!","v":{"$error":"#REF!"}},{"$f":"'debit réf'!#REF!","v":{"$error":"#REF!"}},{"$f":"'debit réf'!#REF!","v":{"$error":"#REF!"}},1700]
[null,{"$f":"'debit réf'!C47","v":"03:40:00"},{"$f":"'debit réf'!#REF!","v":{"$error":"#REF!"}},{"$f":"'debit réf'!#REF!","v":{"$error":"#REF!"}},{"$f":"'debit réf'!#REF!","v":{"$error":"#REF!"}},{"$f":"'debit réf'!#REF!","v":{"$error":"#REF!"}},1700]
[null,{"$f":"'debit réf'!C48","v":"03:50:00"},{"$f":"'debit réf'!#REF!","v":{"$error":"#REF!"}},{"$f":"'debit réf'!#REF!","v":{"$error":"#REF!"}},{"$f":"'debit réf'!#REF!","v":{"$error":"#REF!"}},{"$f":"'debit réf'!#REF!","v":{"$error":"#REF!"}},1700]
[null,{"$f":"'debit réf'!C49","v":"04:00:00"},{"$f":"'debit réf'!#REF!","v":{"$error":"#REF!"}},{"$f":"'debit réf'!#REF!","v":{"$error":"#REF!"}},{"$f":"'debit réf'!#REF!","v":{"$error":"#REF!"}},{"$f":"'debit réf'!#REF!","v":{"$error":"#REF!"}},1700]
[null,{"$f":"'debit réf'!C50","v":"04:10:00"},{"$f":"'debit réf'!#REF!","v":{"$error":"#REF!"}},{"$f":"'debit réf'!#REF!","v":{"$error":"#REF!"}},{"$f":"'debit réf'!#REF!","v":{"$error":"#REF!"}},{"$f":"'debit réf'!#REF!","v":{"$error":"#REF!"}},1700]
[null,{"$f":"'debit réf'!C51","v":"04:20:00"},{"$f":"'debit réf'!#REF!","v":{"$error":"#REF!"}},{"$f":"'debit réf'!#REF!","v":{"$error":"#REF!"}},{"$f":"'debit réf'!#REF!","v":{"$error":"#REF!"}},{"$f":"'debit réf'!#REF!","v":{"$error":"#REF!"}},1700]
[null,{"$f":"'debit réf'!C52","v":"04:30:00"},{"$f":"'debit réf'!#REF!","v":{"$error":"#REF!"}},{"$f":"'debit réf'!#REF!","v":{"$error":"#REF!"}},{"$f":"'debit réf'!#REF!","v":{"$error":"#REF!"}},{"$f":"'debit réf'!#REF!","v":{"$error":"#REF!"}},1700]
[null,{"$f":"'debit réf'!C53","v":"04:40:00"},{"$f":"'debit réf'!#REF!","v":{"$error":"#REF!"}},{"$f":"'debit réf'!#REF!","v":{"$error":"#REF!"}},{"$f":"'debit réf'!#REF!","v":{"$error":"#REF!"}},{"$f":"'debit réf'!#REF!","v":{"$error":"#REF!"}},1700]
[null,{"$f":"'debit réf'!C54","v":"04:50:00"},{"$f":"'debit réf'!#REF!","v":{"$error":"#REF!"}},{"$f":"'debit réf'!#REF!","v":{"$error":"#REF!"}},{"$f":"'debit réf'!#REF!","v":{"$error":"#REF!"}},{"$f":"'debit réf'!#REF!","v":{"$error":"#REF!"}},1700]
[null,{"$f":"'debit réf'!C55","v":"05:00:00"},{"$f":"'debit réf'!#REF!","v":{"$error":"#REF!"}},{"$f":"'debit réf'!#REF!","v":{"$error":"#REF!"}},{"$f":"'debit réf'!#REF!","v":{"$error":"#REF!"}},{"$f":"'debit réf'!#REF!","v":{"$error":"#REF!"}},1700]
[null,{"$f":"'debit réf'!C56","v":"05:10:00"},{"$f":"'debit réf'!#REF!","v":{"$error":"#REF!"}},{"$f":"'debit réf'!#REF!","v":{"$error":"#REF!"}},{"$f":"'debit réf'!#REF!","v":{"$error":"#REF!"}},{"$f":"'debit réf'!#REF!","v":{"$error":"#REF!"}},1700]
[null,{"$f":"'debit réf'!C57","v":"05:20:00"},{"$f":"'debit réf'!#REF!","v":{"$error":"#REF!"}},{"$f":"'debit réf'!#REF!","v":{"$error":"#REF!"}},{"$f":"'debit réf'!#REF!","v":{"$error":"#REF!"}},{"$f":"'debit réf'!#REF!","v":{"$error":"#REF!"}},1700]
[null,{"$f":"'debit réf'!C58","v":"05:30:00"},{"$f":"'debit réf'!#REF!","v":{"$error":"#REF!"}},{"$f":"'debit réf'!#REF!","v":{"$error":"#REF!"}},{"$f":"'debit réf'!#REF!","v":{"$error":"#REF!"}},{"$f":"'debit réf'!#REF!","v":{"$error":"#REF!"}},1700]
[null,{"$f":"'debit réf'!C59","v":"05:40:00"},{"$f":"'debit réf'!#REF!","v":{"$error":"#REF!"}},{"$f":"'debit réf'!#REF!","v":{"$error":"#REF!"}},{"$f":"'debit réf'!#REF!","v":{"$error":"#REF!"}},{"$f":"'debit réf'!#REF!","v":{"$error":"#REF!"}},1700]
[null,{"$f":"'debit réf'!C60","v":"05:50:00"},{"$f":"'debit réf'!#REF!","v":{"$error":"#REF!"}},{"$f":"'debit réf'!#REF!","v":{"$error":"#REF!"}},{"$f":"'debit réf'!#REF!","v":{"$error":"#REF!"}},{"$f":"'debit réf'!#REF!","v":{"$error":"#REF!"}},1700]
[null,{"$f":"'debit réf'!C61","v":"06:00:00"},{"$f":"'debit réf'!#REF!","v":{"$error":"#REF!"}},{"$f":"'debit réf'!#REF!","v":{"$error":"#REF!"}},{"$f":"'debit réf'!#REF!","v":{"$error":"#REF!"}},{"$f":"'debit réf'!#REF!","v":{"$error":"#REF!"}},1700]
[null,{"$f":"'debit réf'!C62","v":"06:10:00"},{"$f":"'debit réf'!#REF!","v":{"$error":"#REF!"}},{"$f":"'debit réf'!#REF!","v":{"$error":"#REF!"}},{"$f":"'debit réf'!#REF!","v":{"$error":"#REF!"}},{"$f":"'debit réf'!#REF!","v":{"$error":"#REF!"}},1700]
[null,{"$f":"'debit réf'!C63","v":"06:20:00"},{"$f":"'debit réf'!#REF!","v":{"$error":"#REF!"}},{"$f":"'debit réf'!#REF!","v":{"$error":"#REF!"}},{"$f":"'debit réf'!#REF!","v":{"$error":"#REF!"}},{"$f":"'debit réf'!#REF!","v":{"$error":"#REF!"}},1700]
[null,{"$f":"'debit réf'!C64","v":"06:30:00"},{"$f":"'debit réf'!#REF!","v":{"$error":"#REF!"}},{"$f":"'debit réf'!#REF!","v":{"$error":"#REF!"}},{"$f":"'debit réf'!#REF!","v":{"$error":"#REF!"}},{"$f":"'debit réf'!#REF!","v":{"$error":"#REF!"}},1700]
[null,{"$f":"'debit réf'!C65","v":"06:40:00"},{"$f":"'debit réf'!#REF!","v":{"$error":"#REF!"}},{"$f":"'debit réf'!#REF!","v":{"$error":"#REF!"}},{"$f":"'debit réf'!#REF!","v":{"$error":"#REF!"}},{"$f":"'debit réf'!#REF!","v":{"$error":"#REF!"}},1700]
[null,{"$f":"'debit réf'!C66","v":"06:50:00"},{"$f":"'debit réf'!#REF!","v":{"$error":"#REF!"}},{"$f":"'debit réf'!#REF!","v":{"$error":"#REF!"}},{"$f":"'debit réf'!#REF!","v":{"$error":"#REF!"}},{"$f":"'debit réf'!#REF!","v":{"$error":"#REF!"}},1700]
[null,{"$f":"'debit réf'!C67","v":"07:00:00"},{"$f":"'debit réf'!#REF!","v":{"$error":"#REF!"}},{"$f":"'debit réf'!#REF!","v":{"$error":"#REF!"}},{"$f":"'debit réf'!#REF!","v":{"$error":"#REF!"}},{"$f":"'debit réf'!#REF!","v":{"$error":"#REF!"}},1700]
[null,{"$f":"'debit réf'!C68","v":"07:10:00"},{"$f":"'debit réf'!#REF!","v":{"$error":"#REF!"}},{"$f":"'debit réf'!#REF!","v":{"$error":"#REF!"}},{"$f":"'debit réf'!#REF!","v":{"$error":"#REF!"}},{"$f":"'debit réf'!#REF!","v":{"$error":"#REF!"}},1700]
[null,{"$f":"'debit réf'!C69","v":"07:20:00"},{"$f":"'debit réf'!#REF!","v":{"$error":"#REF!"}},{"$f":"'debit réf'!#REF!","v":{"$error":"#REF!"}},{"$f":"'debit réf'!#REF!","v":{"$error":"#REF!"}},{"$f":"'debit réf'!#REF!","v":{"$error":"#REF!"}},1700]
[null,{"$f":"'debit réf'!C70","v":"07:30:00"},{"$f":"'debit réf'!#REF!","v":{"$error":"#REF!"}},{"$f":"'debit réf'!#REF!","v":{"$error":"#REF!"}},{"$f":"'debit réf'!#REF!","v":{"$error":"#REF!"}},{"$f":"'debit réf'!#REF!","v":{"$error":"#REF!"}},1700]
[null,{"$f":"'debit réf'!C71","v":"07:40:00"},{"$f":"'debit réf'!#REF!","v":{"$error":"#REF!"}},{"$f":"'debit réf'!#REF!","v":{"$error":"#REF!"}},{"$f":"'debit réf'!#REF!","v":{"$error":"#REF!"}},{"$f":"'debit réf'!#REF!","v":{"$error":"#REF!"}},1700]
[null,{"$f":"'debit réf'!C72","v":"07:50:00"},{"$f":"'debit réf'!#REF!","v":{"$error":"#REF!"}},{"$f":"'debit réf'!#REF!","v":{"$error":"#REF!"}},{"$f":"'debit réf'!#REF!","v":{"$error":"#REF!"}},{"$f":"'debit réf'!#REF!","v":{"$error":"#REF!"}},1700]
[null,{"$f":"'debit réf'!C73","v":"08:00:00"},{"$f":"'debit réf'!#REF!","v":{"$error":"#REF!"}},{"$f":"'debit réf'!#REF!","v":{"$error":"#REF!"}},{"$f":"'debit réf'!#REF!","v":{"$error":"#REF!"}},{"$f":"'debit réf'!#REF!","v":{"$error":"#REF!"}},1700]
[null,{"$f":"'debit réf'!C74","v":"08:10:00"},{"$f":"'debit réf'!#REF!","v":{"$error":"#REF!"}},{"$f":"'debit réf'!#REF!","v":{"$error":"#REF!"}},{"$f":"'debit réf'!#REF!","v":{"$error":"#REF!"}},{"$f":"'debit réf'!#REF!","v":{"$error":"#REF!"}},1700]
[null,{"$f":"'debit réf'!C75","v":"08:20:00"},{"$f":"'debit réf'!#REF!","v":{"$error":"#REF!"}},{"$f":"'debit réf'!#REF!","v":{"$error":"#REF!"}},{"$f":"'debit réf'!#REF!","v":{"$error":"#REF!"}},{"$f":"'debit réf'!#REF!","v":{"$error":"#REF!"}},1700]
[null,{"$f":"'debit réf'!C76","v":"08:30:00"},{"$f":"'debit réf'!#REF!","v":{"$error":"#REF!"}},{"$f":"'debit réf'!#REF!","v":{"$error":"#REF!"}},{"$f":"'debit réf'!#REF!","v":{"$error":"#REF!"}},{"$f":"'debit réf'!#REF!","v":{"$error":"#REF!"}},1700]
[null,{"$f":"'debit réf'!C77","v":"08:40:00"},{"$f":"'debit réf'!#REF!","v":{"$error":"#REF!"}},{"$f":"'debit réf'!#REF!","v":{"$error":"#REF!"}},{"$f":"'debit réf'!#REF!","v":{"$error":"#REF!"}},{"$f":"'debit réf'!#REF!","v":{"$error":"#REF!"}},1700]
[null,{"$f":"'debit réf'!C78","v":"08:50:00"},{"$f":"'debit réf'!#REF!","v":{"$error":"#REF!"}},{"$f":"'debit réf'!#REF!","v":{"$error":"#REF!"}},{"$f":"'debit réf'!#REF!","v":{"$error":"#REF!"}},{"$f":"'debit réf'!#REF!","v":{"$error":"#REF!"}},1700]
[null,{"$f":"'debit réf'!C79","v":"09:00:00"},{"$f":"'debit réf'!#REF!","v":{"$error":"#REF!"}},{"$f":"'debit réf'!#REF!","v":{"$error":"#REF!"}},{"$f":"'debit réf'!#REF!","v":{"$error":"#REF!"}},{"$f":"'debit réf'!#REF!","v":{"$error":"#REF!"}},1700]
[null,{"$f":"'debit réf'!C80","v":"09:10:00"},{"$f":"'debit réf'!#REF!","v":{"$error":"#REF!"}},{"$f":"'debit réf'!#REF!","v":{"$error":"#REF!"}},{"$f":"'debit réf'!#REF!","v":{"$error":"#REF!"}},{"$f":"'debit réf'!#REF!","v":{"$error":"#REF!"}},1700]
[null,{"$f":"'debit réf'!C81","v":"09:20:00"},{"$f":"'debit réf'!#REF!","v":{"$error":"#REF!"}},{"$f":"'debit réf'!#REF!","v":{"$error":"#REF!"}},{"$f":"'debit réf'!#REF!","v":{"$error":"#REF!"}},{"$f":"'debit réf'!#REF!","v":{"$error":"#REF!"}},1700]
[null,{"$f":"'debit réf'!C82","v":"09:30:00"},{"$f":"'debit réf'!#REF!","v":{"$error":"#REF!"}},{"$f":"'debit réf'!#REF!","v":{"$error":"#REF!"}},{"$f":"'debit réf'!#REF!","v":{"$error":"#REF!"}},{"$f":"'debit réf'!#REF!","v":{"$error":"#REF!"}},1700]
[null,{"$f":"'debit réf'!C83","v":"09:40:00"},{"$f":"'debit réf'!#REF!","v":{"$error":"#REF!"}},{"$f":"'debit réf'!#REF!","v":{"$error":"#REF!"}},{"$f":"'debit réf'!#REF!","v":{"$error":"#REF!"}},{"$f":"'debit réf'!#REF!","v":{"$error":"#REF!"}},1700]
[null,{"$f":"'debit réf'!C84","v":"09:50:00"},{"$f":"'debit réf'!#REF!","v":{"$error":"#REF!"}},{"$f":"'debit réf'!#REF!","v":{"$error":"#REF!"}},{"$f":"'debit réf'!#REF!","v":{"$error":"#REF!"}},{"$f":"'debit réf'!#REF!","v":{"$error":"#REF!"}},1700]
[null,{"$f":"'debit réf'!C85","v":"10:00:00"},{"$f":"'debit réf'!#REF!","v":{"$error":"#REF!"}},{"$f":"'debit réf'!#REF!","v":{"$error":"#REF!"}},{"$f":"'debit réf'!#REF!","v":{"$error":"#REF!"}},{"$f":"'debit réf'!#REF!","v":{"$error":"#REF!"}},1700]
[null,{"$f":"'debit réf'!C86","v":"10:10:00"},{"$f":"'debit réf'!#REF!","v":{"$error":"#REF!"}},{"$f":"'debit réf'!#REF!","v":{"$error":"#REF!"}},{"$f":"'debit réf'!#REF!","v":{"$error":"#REF!"}},{"$f":"'debit réf'!#REF!","v":{"$error":"#REF!"}},1700]
[null,{"$f":"'debit réf'!C87","v":"10:20:00"},{"$f":"'debit réf'!#REF!","v":{"$error":"#REF!"}},{"$f":"'debit réf'!#REF!","v":{"$error":"#REF!"}},{"$f":"'debit réf'!#REF!","v":{"$error":"#REF!"}},{"$f":"'debit réf'!#REF!","v":{"$error":"#REF!"}},1700]
[null,{"$f":"'debit réf'!C88","v":"10:30:00"},{"$f":"'debit réf'!#REF!","v":{"$error":"#REF!"}},{"$f":"'debit réf'!#REF!","v":{"$error":"#REF!"}},{"$f":"'debit réf'!#REF!","v":{"$error":"#REF!"}},{"$f":"'debit réf'!#REF!","v":{"$error":"#REF!"}},1700]
[null,{"$f":"'debit réf'!C89","v":"10:40:00"},{"$f":"'debit réf'!#REF!","v":{"$error":"#REF!"}},{"$f":"'debit réf'!#REF!","v":{"$error":"#REF!"}},{"$f":"'debit réf'!#REF!","v":{"$error":"#REF!"}},{"$f":"'debit réf'!#REF!","v":{"$error":"#REF!"}},{"$f":"CO2Lim","v":1700}]
[null,{"$f":"'debit réf'!C90","v":"10:50:00"},{"$f":"'debit réf'!#REF!","v":{"$error":"#REF!"}},{"$f":"'debit réf'!#REF!","v":{"$error":"#REF!"}},{"$f":"'debit réf'!#REF!","v":{"$error":"#REF!"}},{"$f":"'debit réf'!#REF!","v":{"$error":"#REF!"}},1700]
[null,{"$f":"'debit réf'!C91","v":"11:00:00"},{"$f":"'debit réf'!#REF!","v":{"$error":"#REF!"}},{"$f":"'debit réf'!#REF!","v":{"$error":"#REF!"}},{"$f":"'debit réf'!#REF!","v":{"$error":"#REF!"}},{"$f":"'debit réf'!#REF!","v":{"$error":"#REF!"}},1700]
[null,{"$f":"'debit réf'!C92","v":"11:10:00"},{"$f":"'debit réf'!#REF!","v":{"$error":"#REF!"}},{"$f":"'debit réf'!#REF!","v":{"$error":"#REF!"}},{"$f":"'debit réf'!#REF!","v":{"$error":"#REF!"}},{"$f":"'debit réf'!#REF!","v":{"$error":"#REF!"}},1700]
[null,{"$f":"'debit réf'!C93","v":"11:20:00"},{"$f":"'debit réf'!#REF!","v":{"$error":"#REF!"}},{"$f":"'debit réf'!#REF!","v":{"$error":"#REF!"}},{"$f":"'debit réf'!#REF!","v":{"$error":"#REF!"}},{"$f":"'debit réf'!#REF!","v":{"$error":"#REF!"}},1700]
[null,{"$f":"'debit réf'!C94","v":"11:30:00"},{"$f":"'debit réf'!#REF!","v":{"$error":"#REF!"}},{"$f":"'debit réf'!#REF!","v":{"$error":"#REF!"}},{"$f":"'debit réf'!#REF!","v":{"$error":"#REF!"}},{"$f":"'debit réf'!#REF!","v":{"$error":"#REF!"}},1700]
[null,{"$f":"'debit réf'!C95","v":"11:40:00"},{"$f":"'debit réf'!#REF!","v":{"$error":"#REF!"}},{"$f":"'debit réf'!#REF!","v":{"$error":"#REF!"}},{"$f":"'debit réf'!#REF!","v":{"$error":"#REF!"}},{"$f":"'debit réf'!#REF!","v":{"$error":"#REF!"}},1700]
[null,{"$f":"'debit réf'!C96","v":"11:50:00"},{"$f":"'debit réf'!#REF!","v":{"$error":"#REF!"}},{"$f":"'debit réf'!#REF!","v":{"$error":"#REF!"}},{"$f":"'debit réf'!#REF!","v":{"$error":"#REF!"}},{"$f":"'debit réf'!#REF!","v":{"$error":"#REF!"}},1700]
[null,{"$f":"'debit réf'!C97","v":"12:00:00"},{"$f":"'debit réf'!#REF!","v":{"$error":"#REF!"}},{"$f":"'debit réf'!#REF!","v":{"$error":"#REF!"}},{"$f":"'debit réf'!#REF!","v":{"$error":"#REF!"}},{"$f":"'debit réf'!#REF!","v":{"$error":"#REF!"}},1700]
[null,{"$f":"'debit réf'!C98","v":"12:10:00"},{"$f":"'debit réf'!#REF!","v":{"$error":"#REF!"}},{"$f":"'debit réf'!#REF!","v":{"$error":"#REF!"}},{"$f":"'debit réf'!#REF!","v":{"$error":"#REF!"}},{"$f":"'debit réf'!#REF!","v":{"$error":"#REF!"}},1700]
[null,{"$f":"'debit réf'!C99","v":"12:20:00"},{"$f":"'debit réf'!#REF!","v":{"$error":"#REF!"}},{"$f":"'debit réf'!#REF!","v":{"$error":"#REF!"}},{"$f":"'debit réf'!#REF!","v":{"$error":"#REF!"}},{"$f":"'debit réf'!#REF!","v":{"$error":"#REF!"}},1700]
[null,{"$f":"'debit réf'!C100","v":"12:30:00"},{"$f":"'debit réf'!#REF!","v":{"$error":"#REF!"}},{"$f":"'debit réf'!#REF!","v":{"$error":"#REF!"}},{"$f":"'debit réf'!#REF!","v":{"$error":"#REF!"}},{"$f":"'debit réf'!#REF!","v":{"$error":"#REF!"}},1700]
[null,{"$f":"'debit réf'!C101","v":"12:40:00"},{"$f":"'debit réf'!#REF!","v":{"$error":"#REF!"}},{"$f":"'debit réf'!#REF!","v":{"$error":"#REF!"}},{"$f":"'debit réf'!#REF!","v":{"$error":"#REF!"}},{"$f":"'debit réf'!#REF!","v":{"$error":"#REF!"}},1700]
[null,{"$f":"'debit réf'!C102","v":"12:50:00"},{"$f":"'debit réf'!#REF!","v":{"$error":"#REF!"}},{"$f":"'debit réf'!#REF!","v":{"$error":"#REF!"}},{"$f":"'debit réf'!#REF!","v":{"$error":"#REF!"}},{"$f":"'debit réf'!#REF!","v":{"$error":"#REF!"}},1700]
[null,{"$f":"'debit réf'!C103","v":"13:00:00"},{"$f":"'debit réf'!#REF!","v":{"$error":"#REF!"}},{"$f":"'debit réf'!#REF!","v":{"$error":"#REF!"}},{"$f":"'debit réf'!#REF!","v":{"$error":"#REF!"}},{"$f":"'debit réf'!#REF!","v":{"$error":"#REF!"}},1700]
[null,{"$f":"'debit réf'!C104","v":"13:10:00"},{"$f":"'debit réf'!#REF!","v":{"$error":"#REF!"}},{"$f":"'debit réf'!#REF!","v":{"$error":"#REF!"}},{"$f":"'debit réf'!#REF!","v":{"$error":"#REF!"}},{"$f":"'debit réf'!#REF!","v":{"$error":"#REF!"}},1700]
[null,{"$f":"'debit réf'!C105","v":"13:20:00"},{"$f":"'debit réf'!#REF!","v":{"$error":"#REF!"}},{"$f":"'debit réf'!#REF!","v":{"$error":"#REF!"}},{"$f":"'debit réf'!#REF!","v":{"$error":"#REF!"}},{"$f":"'debit réf'!#REF!","v":{"$error":"#REF!"}},1700]
[null,{"$f":"'debit réf'!C106","v":"13:30:00"},{"$f":"'debit réf'!#REF!","v":{"$error":"#REF!"}},{"$f":"'debit réf'!#REF!","v":{"$error":"#REF!"}},{"$f":"'debit réf'!#REF!","v":{"$error":"#REF!"}},{"$f":"'debit réf'!#REF!","v":{"$error":"#REF!"}},1700]
[null,{"$f":"'debit réf'!C107","v":"13:40:00"},{"$f":"'debit réf'!#REF!","v":{"$error":"#REF!"}},{"$f":"'debit réf'!#REF!","v":{"$error":"#REF!"}},{"$f":"'debit réf'!#REF!","v":{"$error":"#REF!"}},{"$f":"'debit réf'!#REF!","v":{"$error":"#REF!"}},1700]
[null,{"$f":"'debit réf'!C108","v":"13:50:00"},{"$f":"'debit réf'!#REF!","v":{"$error":"#REF!"}},{"$f":"'debit réf'!#REF!","v":{"$error":"#REF!"}},{"$f":"'debit réf'!#REF!","v":{"$error":"#REF!"}},{"$f":"'debit réf'!#REF!","v":{"$error":"#REF!"}},1700]
[null,{"$f":"'debit réf'!C109","v":"14:00:00"},{"$f":"'debit réf'!#REF!","v":{"$error":"#REF!"}},{"$f":"'debit réf'!#REF!","v":{"$error":"#REF!"}},{"$f":"'debit réf'!#REF!","v":{"$error":"#REF!"}},{"$f":"'debit réf'!#REF!","v":{"$error":"#REF!"}},1700]
[null,{"$f":"'debit réf'!C110","v":"14:10:00"},{"$f":"'debit réf'!#REF!","v":{"$error":"#REF!"}},{"$f":"'debit réf'!#REF!","v":{"$error":"#REF!"}},{"$f":"'debit réf'!#REF!","v":{"$error":"#REF!"}},{"$f":"'debit réf'!#REF!","v":{"$error":"#REF!"}},1700]
[null,{"$f":"'debit réf'!C111","v":"14:20:00"},{"$f":"'debit réf'!#REF!","v":{"$error":"#REF!"}},{"$f":"'debit réf'!#REF!","v":{"$error":"#REF!"}},{"$f":"'debit réf'!#REF!","v":{"$error":"#REF!"}},{"$f":"'debit réf'!#REF!","v":{"$error":"#REF!"}},1700]
[null,{"$f":"'debit réf'!C112","v":"14:30:00"},{"$f":"'debit réf'!#REF!","v":{"$error":"#REF!"}},{"$f":"'debit réf'!#REF!","v":{"$error":"#REF!"}},{"$f":"'debit réf'!#REF!","v":{"$error":"#REF!"}},{"$f":"'debit réf'!#REF!","v":{"$error":"#REF!"}},1700]
[null,{"$f":"'debit réf'!C113","v":"14:40:00"},{"$f":"'debit réf'!#REF!","v":{"$error":"#REF!"}},{"$f":"'debit réf'!#REF!","v":{"$error":"#REF!"}},{"$f":"'debit réf'!#REF!","v":{"$error":"#REF!"}},{"$f":"'debit réf'!#REF!","v":{"$error":"#REF!"}},1700]
[null,{"$f":"'debit réf'!C114","v":"14:50:00"},{"$f":"'debit réf'!#REF!","v":{"$error":"#REF!"}},{"$f":"'debit réf'!#REF!","v":{"$error":"#REF!"}},{"$f":"'debit réf'!#REF!","v":{"$error":"#REF!"}},{"$f":"'debit réf'!#REF!","v":{"$error":"#REF!"}},1700]
[null,{"$f":"'debit réf'!C115","v":"15:00:00"},{"$f":"'debit réf'!#REF!","v":{"$error":"#REF!"}},{"$f":"'debit réf'!#REF!","v":{"$error":"#REF!"}},{"$f":"'debit réf'!#REF!","v":{"$error":"#REF!"}},{"$f":"'debit réf'!#REF!","v":{"$error":"#REF!"}},1700]
[null,{"$f":"'debit réf'!C116","v":"15:10:00"},{"$f":"'debit réf'!#REF!","v":{"$error":"#REF!"}},{"$f":"'debit réf'!#REF!","v":{"$error":"#REF!"}},{"$f":"'debit réf'!#REF!","v":{"$error":"#REF!"}},{"$f":"'debit réf'!#REF!","v":{"$error":"#REF!"}},1700]
[null,{"$f":"'debit réf'!C117","v":"15:20:00"},{"$f":"'debit réf'!#REF!","v":{"$error":"#REF!"}},{"$f":"'debit réf'!#REF!","v":{"$error":"#REF!"}},{"$f":"'debit réf'!#REF!","v":{"$error":"#REF!"}},{"$f":"'debit réf'!#REF!","v":{"$error":"#REF!"}},1700]
[null,{"$f":"'debit réf'!C118","v":"15:30:00"},{"$f":"'debit réf'!#REF!","v":{"$error":"#REF!"}},{"$f":"'debit réf'!#REF!","v":{"$error":"#REF!"}},{"$f":"'debit réf'!#REF!","v":{"$error":"#REF!"}},{"$f":"'debit réf'!#REF!","v":{"$error":"#REF!"}},1700]
[null,{"$f":"'debit réf'!C119","v":"15:40:00"},{"$f":"'debit réf'!#REF!","v":{"$error":"#REF!"}},{"$f":"'debit réf'!#REF!","v":{"$error":"#REF!"}},{"$f":"'debit réf'!#REF!","v":{"$error":"#REF!"}},{"$f":"'debit réf'!#REF!","v":{"$error":"#REF!"}},1700]
[null,{"$f":"'debit réf'!C120","v":"15:50:00"},{"$f":"'debit réf'!#REF!","v":{"$error":"#REF!"}},{"$f":"'debit réf'!#REF!","v":{"$error":"#REF!"}},{"$f":"'debit réf'!#REF!","v":{"$error":"#REF!"}},{"$f":"'debit réf'!#REF!","v":{"$error":"#REF!"}},1700]
[null,{"$f":"'debit réf'!C121","v":"16:00:00"},{"$f":"'debit réf'!#REF!","v":{"$error":"#REF!"}},{"$f":"'debit réf'!#REF!","v":{"$error":"#REF!"}},{"$f":"'debit réf'!#REF!","v":{"$error":"#REF!"}},{"$f":"'debit réf'!#REF!","v":{"$error":"#REF!"}},1700]
[null,{"$f":"'debit réf'!C122","v":"16:10:00"},{"$f":"'debit réf'!#REF!","v":{"$error":"#REF!"}},{"$f":"'debit réf'!#REF!","v":{"$error":"#REF!"}},{"$f":"'debit réf'!#REF!","v":{"$error":"#REF!"}},{"$f":"'debit réf'!#REF!","v":{"$error":"#REF!"}},1700]
[null,{"$f":"'debit réf'!C123","v":"16:20:00"},{"$f":"'debit réf'!#REF!","v":{"$error":"#REF!"}},{"$f":"'debit réf'!#REF!","v":{"$error":"#REF!"}},{"$f":"'debit réf'!#REF!","v":{"$error":"#REF!"}},{"$f":"'debit réf'!#REF!","v":{"$error":"#REF!"}},1700]
[null,{"$f":"'debit réf'!C124","v":"16:30:00"},{"$f":"'debit réf'!#REF!","v":{"$error":"#REF!"}},{"$f":"'debit réf'!#REF!","v":{"$error":"#REF!"}},{"$f":"'debit réf'!#REF!","v":{"$error":"#REF!"}},{"$f":"'debit réf'!#REF!","v":{"$error":"#REF!"}},1700]
[null,{"$f":"'debit réf'!C125","v":"16:40:00"},{"$f":"'debit réf'!#REF!","v":{"$error":"#REF!"}},{"$f":"'debit réf'!#REF!","v":{"$error":"#REF!"}},{"$f":"'debit réf'!#REF!","v":{"$error":"#REF!"}},{"$f":"'debit réf'!#REF!","v":{"$error":"#REF!"}},1700]
[null,{"$f":"'debit réf'!C126","v":"16:50:00"},{"$f":"'debit réf'!#REF!","v":{"$error":"#REF!"}},{"$f":"'debit réf'!#REF!","v":{"$error":"#REF!"}},{"$f":"'debit réf'!#REF!","v":{"$error":"#REF!"}},{"$f":"'debit réf'!#REF!","v":{"$error":"#REF!"}},1700]
[null,{"$f":"'debit réf'!C127","v":"17:00:00"},{"$f":"'debit réf'!#REF!","v":{"$error":"#REF!"}},{"$f":"'debit réf'!#REF!","v":{"$error":"#REF!"}},{"$f":"'debit réf'!#REF!","v":{"$error":"#REF!"}},{"$f":"'debit réf'!#REF!","v":{"$error":"#REF!"}},1700]
[null,{"$f":"'debit réf'!C128","v":"17:10:00"},{"$f":"'debit réf'!#REF!","v":{"$error":"#REF!"}},{"$f":"'debit réf'!#REF!","v":{"$error":"#REF!"}},{"$f":"'debit réf'!#REF!","v":{"$error":"#REF!"}},{"$f":"'debit réf'!#REF!","v":{"$error":"#REF!"}},1700]
[null,{"$f":"'debit réf'!C129","v":"17:20:00"},{"$f":"'debit réf'!#REF!","v":{"$error":"#REF!"}},{"$f":"'debit réf'!#REF!","v":{"$error":"#REF!"}},{"$f":"'debit réf'!#REF!","v":{"$error":"#REF!"}},{"$f":"'debit réf'!#REF!","v":{"$error":"#REF!"}},1700]
[null,{"$f":"'debit réf'!C130","v":"17:30:00"},{"$f":"'debit réf'!#REF!","v":{"$error":"#REF!"}},{"$f":"'debit réf'!#REF!","v":{"$error":"#REF!"}},{"$f":"'debit réf'!#REF!","v":{"$error":"#REF!"}},{"$f":"'debit réf'!#REF!","v":{"$error":"#REF!"}},1700]
[null,{"$f":"'debit réf'!C131","v":"17:40:00"},{"$f":"'debit réf'!#REF!","v":{"$error":"#REF!"}},{"$f":"'debit réf'!#REF!","v":{"$error":"#REF!"}},{"$f":"'debit réf'!#REF!","v":{"$error":"#REF!"}},{"$f":"'debit réf'!#REF!","v":{"$error":"#REF!"}},1700]
[null,{"$f":"'debit réf'!C132","v":"17:50:00"},{"$f":"'debit réf'!#REF!","v":{"$error":"#REF!"}},{"$f":"'debit réf'!#REF!","v":{"$error":"#REF!"}},{"$f":"'debit réf'!#REF!","v":{"$error":"#REF!"}},{"$f":"'debit réf'!#REF!","v":{"$error":"#REF!"}},1700]
[null,{"$f":"'debit réf'!C133","v":"18:00:00"},{"$f":"'debit réf'!#REF!","v":{"$error":"#REF!"}},{"$f":"'debit réf'!#REF!","v":{"$error":"#REF!"}},{"$f":"'debit réf'!#REF!","v":{"$error":"#REF!"}},{"$f":"'debit réf'!#REF!","v":{"$error":"#REF!"}},1700]
[null,{"$f":"'debit réf'!C134","v":"18:10:00"},{"$f":"'debit réf'!#REF!","v":{"$error":"#REF!"}},{"$f":"'debit réf'!#REF!","v":{"$error":"#REF!"}},{"$f":"'debit réf'!#REF!","v":{"$error":"#REF!"}},{"$f":"'debit réf'!#REF!","v":{"$error":"#REF!"}},1700]
[null,{"$f":"'debit réf'!C135","v":"18:20:00"},{"$f":"'debit réf'!#REF!","v":{"$error":"#REF!"}},{"$f":"'debit réf'!#REF!","v":{"$error":"#REF!"}},{"$f":"'debit réf'!#REF!","v":{"$error":"#REF!"}},{"$f":"'debit réf'!#REF!","v":{"$error":"#REF!"}},1700]
[null,{"$f":"'debit réf'!C136","v":"18:30:00"},{"$f":"'debit réf'!#REF!","v":{"$error":"#REF!"}},{"$f":"'debit réf'!#REF!","v":{"$error":"#REF!"}},{"$f":"'debit réf'!#REF!","v":{"$error":"#REF!"}},{"$f":"'debit réf'!#REF!","v":{"$error":"#REF!"}},1700]
[null,{"$f":"'debit réf'!C137","v":"18:40:00"},{"$f":"'debit réf'!#REF!","v":{"$error":"#REF!"}},{"$f":"'debit réf'!#REF!","v":{"$error":"#REF!"}},{"$f":"'debit réf'!#REF!","v":{"$error":"#REF!"}},{"$f":"'debit réf'!#REF!","v":{"$error":"#REF!"}},1700]
[null,{"$f":"'debit réf'!C138","v":"18:50:00"},{"$f":"'debit réf'!#REF!","v":{"$error":"#REF!"}},{"$f":"'debit réf'!#REF!","v":{"$error":"#REF!"}},{"$f":"'debit réf'!#REF!","v":{"$error":"#REF!"}},{"$f":"'debit réf'!#REF!","v":{"$error":"#REF!"}},1700]
[null,{"$f":"'debit réf'!C139","v":"19:00:00"},{"$f":"'debit réf'!#REF!","v":{"$error":"#REF!"}},{"$f":"'debit réf'!#REF!","v":{"$error":"#REF!"}},{"$f":"'debit réf'!#REF!","v":{"$error":"#REF!"}},{"$f":"'debit réf'!#REF!","v":{"$error":"#REF!"}},1700]
[null,{"$f":"'debit réf'!C140","v":"19:10:00"},{"$f":"'debit réf'!#REF!","v":{"$error":"#REF!"}},{"$f":"'debit réf'!#REF!","v":{"$error":"#REF!"}},{"$f":"'debit réf'!#REF!","v":{"$error":"#REF!"}},{"$f":"'debit réf'!#REF!","v":{"$error":"#REF!"}},1700]
[null,{"$f":"'debit réf'!C141","v":"19:20:00"},{"$f":"'debit réf'!#REF!","v":{"$error":"#REF!"}},{"$f":"'debit réf'!#REF!","v":{"$error":"#REF!"}},{"$f":"'debit réf'!#REF!","v":{"$error":"#REF!"}},{"$f":"'debit réf'!#REF!","v":{"$error":"#REF!"}},1700]
[null,{"$f":"'debit réf'!C142","v":"19:30:00"},{"$f":"'debit réf'!#REF!","v":{"$error":"#REF!"}},{"$f":"'debit réf'!#REF!","v":{"$error":"#REF!"}},{"$f":"'debit réf'!#REF!","v":{"$error":"#REF!"}},{"$f":"'debit réf'!#REF!","v":{"$error":"#REF!"}},1700]
[null,{"$f":"'debit réf'!C143","v":"19:40:00"},{"$f":"'debit réf'!#REF!","v":{"$error":"#REF!"}},{"$f":"'debit réf'!#REF!","v":{"$error":"#REF!"}},{"$f":"'debit réf'!#REF!","v":{"$error":"#REF!"}},{"$f":"'debit réf'!#REF!","v":{"$error":"#REF!"}},1700]
[null,{"$f":"'debit réf'!C144","v":"19:50:00"},{"$f":"'debit réf'!#REF!","v":{"$error":"#REF!"}},{"$f":"'debit réf'!#REF!","v":{"$error":"#REF!"}},{"$f":"'debit réf'!#REF!","v":{"$error":"#REF!"}},{"$f":"'debit réf'!#REF!","v":{"$error":"#REF!"}},1700]
[null,{"$f":"'debit réf'!C145","v":"20:00:00"},{"$f":"'debit réf'!#REF!","v":{"$error":"#REF!"}},{"$f":"'debit réf'!#REF!","v":{"$error":"#REF!"}},{"$f":"'debit réf'!#REF!","v":{"$error":"#REF!"}},{"$f":"'debit réf'!#REF!","v":{"$error":"#REF!"}},1700]
[null,{"$f":"'debit réf'!C146","v":"20:10:00"},{"$f":"'debit réf'!#REF!","v":{"$error":"#REF!"}},{"$f":"'debit réf'!#REF!","v":{"$error":"#REF!"}},{"$f":"'debit réf'!#REF!","v":{"$error":"#REF!"}},{"$f":"'debit réf'!#REF!","v":{"$error":"#REF!"}},1700]
[null,{"$f":"'debit réf'!C147","v":"20:20:00"},{"$f":"'debit réf'!#REF!","v":{"$error":"#REF!"}},{"$f":"'debit réf'!#REF!","v":{"$error":"#REF!"}},{"$f":"'debit réf'!#REF!","v":{"$error":"#REF!"}},{"$f":"'debit réf'!#REF!","v":{"$error":"#REF!"}},1700]
[null,{"$f":"'debit réf'!C148","v":"20:30:00"},{"$f":"'debit réf'!#REF!","v":{"$error":"#REF!"}},{"$f":"'debit réf'!#REF!","v":{"$error":"#REF!"}},{"$f":"'debit réf'!#REF!","v":{"$error":"#REF!"}},{"$f":"'debit réf'!#REF!","v":{"$error":"#REF!"}},1700]
[null,{"$f":"'debit réf'!C149","v":"20:40:00"},{"$f":"'debit réf'!#REF!","v":{"$error":"#REF!"}},{"$f":"'debit réf'!#REF!","v":{"$error":"#REF!"}},{"$f":"'debit réf'!#REF!","v":{"$error":"#REF!"}},{"$f":"'debit réf'!#REF!","v":{"$error":"#REF!"}},1700]
[null,{"$f":"'debit réf'!C150","v":"20:50:00"},{"$f":"'debit réf'!#REF!","v":{"$error":"#REF!"}},{"$f":"'debit réf'!#REF!","v":{"$error":"#REF!"}},{"$f":"'debit réf'!#REF!","v":{"$error":"#REF!"}},{"$f":"'debit réf'!#REF!","v":{"$error":"#REF!"}},1700]
[null,{"$f":"'debit réf'!C151","v":"21:00:00"},{"$f":"'debit réf'!#REF!","v":{"$error":"#REF!"}},{"$f":"'debit réf'!#REF!","v":{"$error":"#REF!"}},{"$f":"'debit réf'!#REF!","v":{"$error":"#REF!"}},{"$f":"'debit réf'!#REF!","v":{"$error":"#REF!"}},1700]
[null,{"$f":"'debit réf'!C152","v":"21:10:00"},{"$f":"'debit réf'!#REF!","v":{"$error":"#REF!"}},{"$f":"'debit réf'!#REF!","v":{"$error":"#REF!"}},{"$f":"'debit réf'!#REF!","v":{"$error":"#REF!"}},{"$f":"'debit réf'!#REF!","v":{"$error":"#REF!"}},1700]
[null,{"$f":"'debit réf'!C153","v":"21:20:00"},{"$f":"'debit réf'!#REF!","v":{"$error":"#REF!"}},{"$f":"'debit réf'!#REF!","v":{"$error":"#REF!"}},{"$f":"'debit réf'!#REF!","v":{"$error":"#REF!"}},{"$f":"'debit réf'!#REF!","v":{"$error":"#REF!"}},{"$f":"CO2Lim","v":1700}]
[null,{"$f":"'debit réf'!C154","v":"21:30:00"},{"$f":"'debit réf'!#REF!","v":{"$error":"#REF!"}},{"$f":"'debit réf'!#REF!","v":{"$error":"#REF!"}},{"$f":"'debit réf'!#REF!","v":{"$error":"#REF!"}},{"$f":"'debit réf'!#REF!","v":{"$error":"#REF!"}},1700]
[null,{"$f":"'debit réf'!C155","v":"21:40:00"},{"$f":"'debit réf'!#REF!","v":{"$error":"#REF!"}},{"$f":"'debit réf'!#REF!","v":{"$error":"#REF!"}},{"$f":"'debit réf'!#REF!","v":{"$error":"#REF!"}},{"$f":"'debit réf'!#REF!","v":{"$error":"#REF!"}},1700]
[null,{"$f":"'debit réf'!C156","v":"21:50:00"},{"$f":"'debit réf'!#REF!","v":{"$error":"#REF!"}},{"$f":"'debit réf'!#REF!","v":{"$error":"#REF!"}},{"$f":"'debit réf'!#REF!","v":{"$error":"#REF!"}},{"$f":"'debit réf'!#REF!","v":{"$error":"#REF!"}},1700]
[null,{"$f":"'debit réf'!C157","v":"22:00:00"},{"$f":"'debit réf'!#REF!","v":{"$error":"#REF!"}},{"$f":"'debit réf'!#REF!","v":{"$error":"#REF!"}},{"$f":"'debit réf'!#REF!","v":{"$error":"#REF!"}},{"$f":"'debit réf'!#REF!","v":{"$error":"#REF!"}},1700]
[null,{"$f":"'debit réf'!C158","v":"22:10:00"},{"$f":"'debit réf'!#REF!","v":{"$error":"#REF!"}},{"$f":"'debit réf'!#REF!","v":{"$error":"#REF!"}},{"$f":"'debit réf'!#REF!","v":{"$error":"#REF!"}},{"$f":"'debit réf'!#REF!","v":{"$error":"#REF!"}},1700]
[null,{"$f":"'debit réf'!C159","v":"22:20:00"},{"$f":"'debit réf'!#REF!","v":{"$error":"#REF!"}},{"$f":"'debit réf'!#REF!","v":{"$error":"#REF!"}},{"$f":"'debit réf'!#REF!","v":{"$error":"#REF!"}},{"$f":"'debit réf'!#REF!","v":{"$error":"#REF!"}},1700]
[null,{"$f":"'debit réf'!C160","v":"22:30:00"},{"$f":"'debit réf'!#REF!","v":{"$error":"#REF!"}},{"$f":"'debit réf'!#REF!","v":{"$error":"#REF!"}},{"$f":"'debit réf'!#REF!","v":{"$error":"#REF!"}},{"$f":"'debit réf'!#REF!","v":{"$error":"#REF!"}},1700]
[null,{"$f":"'debit réf'!C161","v":"22:40:00"},{"$f":"'debit réf'!#REF!","v":{"$error":"#REF!"}},{"$f":"'debit réf'!#REF!","v":{"$error":"#REF!"}},{"$f":"'debit réf'!#REF!","v":{"$error":"#REF!"}},{"$f":"'debit réf'!#REF!","v":{"$error":"#REF!"}},1700]
[null,{"$f":"'debit réf'!C162","v":"22:50:00"},{"$f":"'debit réf'!#REF!","v":{"$error":"#REF!"}},{"$f":"'debit réf'!#REF!","v":{"$error":"#REF!"}},{"$f":"'debit réf'!#REF!","v":{"$error":"#REF!"}},{"$f":"'debit réf'!#REF!","v":{"$error":"#REF!"}},1700]
[null,{"$f":"'debit réf'!C163","v":"23:00:00"},{"$f":"'debit réf'!#REF!","v":{"$error":"#REF!"}},{"$f":"'debit réf'!#REF!","v":{"$error":"#REF!"}},{"$f":"'debit réf'!#REF!","v":{"$error":"#REF!"}},{"$f":"'debit réf'!#REF!","v":{"$error":"#REF!"}},1700]
[null,{"$f":"'debit réf'!C164","v":"23:10:00"},{"$f":"'debit réf'!#REF!","v":{"$error":"#REF!"}},{"$f":"'debit réf'!#REF!","v":{"$error":"#REF!"}},{"$f":"'debit réf'!#REF!","v":{"$error":"#REF!"}},{"$f":"'debit réf'!#REF!","v":{"$error":"#REF!"}},1700]
[null,{"$f":"'debit réf'!C165","v":"23:20:00"},{"$f":"'debit réf'!#REF!","v":{"$error":"#REF!"}},{"$f":"'debit réf'!#REF!","v":{"$error":"#REF!"}},{"$f":"'debit réf'!#REF!","v":{"$error":"#REF!"}},{"$f":"'debit réf'!#REF!","v":{"$error":"#REF!"}},1700]
[null,{"$f":"'debit réf'!C166","v":"23:30:00"},{"$f":"'debit réf'!#REF!","v":{"$error":"#REF!"}},{"$f":"'debit réf'!#REF!","v":{"$error":"#REF!"}},{"$f":"'debit réf'!#REF!","v":{"$error":"#REF!"}},{"$f":"'debit réf'!#REF!","v":{"$error":"#REF!"}},1700]
[null,{"$f":"'debit réf'!C167","v":"23:40:00"},{"$f":"'debit réf'!#REF!","v":{"$error":"#REF!"}},{"$f":"'debit réf'!#REF!","v":{"$error":"#REF!"}},{"$f":"'debit réf'!#REF!","v":{"$error":"#REF!"}},{"$f":"'debit réf'!#REF!","v":{"$error":"#REF!"}},1700]
[null,{"$f":"'debit réf'!C168","v":"23:50:00"},{"$f":"'debit réf'!#REF!","v":{"$error":"#REF!"}},{"$f":"'debit réf'!#REF!","v":{"$error":"#REF!"}},{"$f":"'debit réf'!#REF!","v":{"$error":"#REF!"}},{"$f":"'debit réf'!#REF!","v":{"$error":"#REF!"}},1700]
[null,{"$f":"'debit réf'!C169","v":"00:00:00"},{"$f":"'debit réf'!#REF!","v":{"$error":"#REF!"}},{"$f":"'debit réf'!#REF!","v":{"$error":"#REF!"}},{"$f":"'debit réf'!#REF!","v":{"$error":"#REF!"}},{"$f":"'debit réf'!#REF!","v":{"$error":"#REF!"}},1700]
[null,{"$f":"'debit réf'!C170","v":"00:10:00"},{"$f":"'debit réf'!#REF!","v":{"$error":"#REF!"}},{"$f":"'debit réf'!#REF!","v":{"$error":"#REF!"}},{"$f":"'debit réf'!#REF!","v":{"$error":"#REF!"}},{"$f":"'debit réf'!#REF!","v":{"$error":"#REF!"}},1700]
[null,{"$f":"'debit réf'!C171","v":"00:20:00"},{"$f":"'debit réf'!#REF!","v":{"$error":"#REF!"}},{"$f":"'debit réf'!#REF!","v":{"$error":"#REF!"}},{"$f":"'debit réf'!#REF!","v":{"$error":"#REF!"}},{"$f":"'debit réf'!#REF!","v":{"$error":"#REF!"}},1700]
[null,{"$f":"'debit réf'!C172","v":"00:30:00"},{"$f":"'debit réf'!#REF!","v":{"$error":"#REF!"}},{"$f":"'debit réf'!#REF!","v":{"$error":"#REF!"}},{"$f":"'debit réf'!#REF!","v":{"$error":"#REF!"}},{"$f":"'debit réf'!#REF!","v":{"$error":"#REF!"}},1700]
[null,{"$f":"'debit réf'!C173","v":"00:40:00"},{"$f":"'debit réf'!#REF!","v":{"$error":"#REF!"}},{"$f":"'debit réf'!#REF!","v":{"$error":"#REF!"}},{"$f":"'debit réf'!#REF!","v":{"$error":"#REF!"}},{"$f":"'debit réf'!#REF!","v":{"$error":"#REF!"}},1700]
[null,{"$f":"'debit réf'!C174","v":"00:50:00"},{"$f":"'debit réf'!#REF!","v":{"$error":"#REF!"}},{"$f":"'debit réf'!#REF!","v":{"$error":"#REF!"}},{"$f":"'debit réf'!#REF!","v":{"$error":"#REF!"}},{"$f":"'debit réf'!#REF!","v":{"$error":"#REF!"}},1700]
[null,{"$f":"'debit réf'!C175","v":"01:00:00"},{"$f":"'debit réf'!#REF!","v":{"$error":"#REF!"}},{"$f":"'debit réf'!#REF!","v":{"$error":"#REF!"}},{"$f":"'debit réf'!#REF!","v":{"$error":"#REF!"}},{"$f":"'debit réf'!#REF!","v":{"$error":"#REF!"}},1700]
[null,{"$f":"'debit réf'!C176","v":"01:10:00"},{"$f":"'debit réf'!#REF!","v":{"$error":"#REF!"}},{"$f":"'debit réf'!#REF!","v":{"$error":"#REF!"}},{"$f":"'debit réf'!#REF!","v":{"$error":"#REF!"}},{"$f":"'debit réf'!#REF!","v":{"$error":"#REF!"}},1700]
[null,{"$f":"'debit réf'!C177","v":"01:20:00"},{"$f":"'debit réf'!#REF!","v":{"$error":"#REF!"}},{"$f":"'debit réf'!#REF!","v":{"$error":"#REF!"}},{"$f":"'debit réf'!#REF!","v":{"$error":"#REF!"}},{"$f":"'debit réf'!#REF!","v":{"$error":"#REF!"}},1700]
[null,{"$f":"'debit réf'!C178","v":"01:30:00"},{"$f":"'debit réf'!#REF!","v":{"$error":"#REF!"}},{"$f":"'debit réf'!#REF!","v":{"$error":"#REF!"}},{"$f":"'debit réf'!#REF!","v":{"$error":"#REF!"}},{"$f":"'debit réf'!#REF!","v":{"$error":"#REF!"}},1700]
[null,{"$f":"'debit réf'!C179","v":"01:40:00"},{"$f":"'debit réf'!#REF!","v":{"$error":"#REF!"}},{"$f":"'debit réf'!#REF!","v":{"$error":"#REF!"}},{"$f":"'debit réf'!#REF!","v":{"$error":"#REF!"}},{"$f":"'debit réf'!#REF!","v":{"$error":"#REF!"}},1700]
[null,{"$f":"'debit réf'!C180","v":"01:50:00"},{"$f":"'debit réf'!#REF!","v":{"$error":"#REF!"}},{"$f":"'debit réf'!#REF!","v":{"$error":"#REF!"}},{"$f":"'debit réf'!#REF!","v":{"$error":"#REF!"}},{"$f":"'debit réf'!#REF!","v":{"$error":"#REF!"}},1700]
[null,{"$f":"'debit réf'!C181","v":"02:00:00"},{"$f":"'debit réf'!#REF!","v":{"$error":"#REF!"}},{"$f":"'debit réf'!#REF!","v":{"$error":"#REF!"}},{"$f":"'debit réf'!#REF!","v":{"$error":"#REF!"}},{"$f":"'debit réf'!#REF!","v":{"$error":"#REF!"}},1700]
[null,{"$f":"'debit réf'!C182","v":"02:10:00"},{"$f":"'debit réf'!#REF!","v":{"$error":"#REF!"}},{"$f":"'debit réf'!#REF!","v":{"$error":"#REF!"}},{"$f":"'debit réf'!#REF!","v":{"$error":"#REF!"}},{"$f":"'debit réf'!#REF!","v":{"$error":"#REF!"}},1700]
[null,{"$f":"'debit réf'!C183","v":"02:20:00"},{"$f":"'debit réf'!#REF!","v":{"$error":"#REF!"}},{"$f":"'debit réf'!#REF!","v":{"$error":"#REF!"}},{"$f":"'debit réf'!#REF!","v":{"$error":"#REF!"}},{"$f":"'debit réf'!#REF!","v":{"$error":"#REF!"}},1700]
[null,{"$f":"'debit réf'!C184","v":"02:30:00"},{"$f":"'debit réf'!#REF!","v":{"$error":"#REF!"}},{"$f":"'debit réf'!#REF!","v":{"$error":"#REF!"}},{"$f":"'debit réf'!#REF!","v":{"$error":"#REF!"}},{"$f":"'debit réf'!#REF!","v":{"$error":"#REF!"}},1700]
[null,{"$f":"'debit réf'!C185","v":"02:40:00"},{"$f":"'debit réf'!#REF!","v":{"$error":"#REF!"}},{"$f":"'debit réf'!#REF!","v":{"$error":"#REF!"}},{"$f":"'debit réf'!#REF!","v":{"$error":"#REF!"}},{"$f":"'debit réf'!#REF!","v":{"$error":"#REF!"}},1700]
[null,{"$f":"'debit réf'!C186","v":"02:50:00"},{"$f":"'debit réf'!#REF!","v":{"$error":"#REF!"}},{"$f":"'debit réf'!#REF!","v":{"$error":"#REF!"}},{"$f":"'debit réf'!#REF!","v":{"$error":"#REF!"}},{"$f":"'debit réf'!#REF!","v":{"$error":"#REF!"}},1700]
[null,{"$f":"'debit réf'!C187","v":"03:00:00"},{"$f":"'debit réf'!#REF!","v":{"$error":"#REF!"}},{"$f":"'debit réf'!#REF!","v":{"$error":"#REF!"}},{"$f":"'debit réf'!#REF!","v":{"$error":"#REF!"}},{"$f":"'debit réf'!#REF!","v":{"$error":"#REF!"}},1700]
[null,{"$f":"'debit réf'!C188","v":"03:10:00"},{"$f":"'debit réf'!#REF!","v":{"$error":"#REF!"}},{"$f":"'debit réf'!#REF!","v":{"$error":"#REF!"}},{"$f":"'debit réf'!#REF!","v":{"$error":"#REF!"}},{"$f":"'debit réf'!#REF!","v":{"$error":"#REF!"}},1700]
[null,{"$f":"'debit réf'!C189","v":"03:20:00"},{"$f":"'debit réf'!#REF!","v":{"$error":"#REF!"}},{"$f":"'debit réf'!#REF!","v":{"$error":"#REF!"}},{"$f":"'debit réf'!#REF!","v":{"$error":"#REF!"}},{"$f":"'debit réf'!#REF!","v":{"$error":"#REF!"}},1700]
[null,{"$f":"'debit réf'!C190","v":"03:30:00"},{"$f":"'debit réf'!#REF!","v":{"$error":"#REF!"}},{"$f":"'debit réf'!#REF!","v":{"$error":"#REF!"}},{"$f":"'debit réf'!#REF!","v":{"$error":"#REF!"}},{"$f":"'debit réf'!#REF!","v":{"$error":"#REF!"}},1700]
[null,{"$f":"'debit réf'!C191","v":"03:40:00"},{"$f":"'debit réf'!#REF!","v":{"$error":"#REF!"}},{"$f":"'debit réf'!#REF!","v":{"$error":"#REF!"}},{"$f":"'debit réf'!#REF!","v":{"$error":"#REF!"}},{"$f":"'debit réf'!#REF!","v":{"$error":"#REF!"}},1700]
[null,{"$f":"'debit réf'!C192","v":"03:50:00"},{"$f":"'debit réf'!#REF!","v":{"$error":"#REF!"}},{"$f":"'debit réf'!#REF!","v":{"$error":"#REF!"}},{"$f":"'debit réf'!#REF!","v":{"$error":"#REF!"}},{"$f":"'debit réf'!#REF!","v":{"$error":"#REF!"}},1700]
[null,{"$f":"'debit réf'!C193","v":"04:00:00"},{"$f":"'debit réf'!#REF!","v":{"$error":"#REF!"}},{"$f":"'debit réf'!#REF!","v":{"$error":"#REF!"}},{"$f":"'debit réf'!#REF!","v":{"$error":"#REF!"}},{"$f":"'debit réf'!#REF!","v":{"$error":"#REF!"}},1700]
[null,{"$f":"'debit réf'!C194","v":"04:10:00"},{"$f":"'debit réf'!#REF!","v":{"$error":"#REF!"}},{"$f":"'debit réf'!#REF!","v":{"$error":"#REF!"}},{"$f":"'debit réf'!#REF!","v":{"$error":"#REF!"}},{"$f":"'debit réf'!#REF!","v":{"$error":"#REF!"}},1700]
[null,{"$f":"'debit réf'!C195","v":"04:20:00"},{"$f":"'debit réf'!#REF!","v":{"$error":"#REF!"}},{"$f":"'debit réf'!#REF!","v":{"$error":"#REF!"}},{"$f":"'debit réf'!#REF!","v":{"$error":"#REF!"}},{"$f":"'debit réf'!#REF!","v":{"$error":"#REF!"}},1700]
[null,{"$f":"'debit réf'!C196","v":"04:30:00"},{"$f":"'debit réf'!#REF!","v":{"$error":"#REF!"}},{"$f":"'debit réf'!#REF!","v":{"$error":"#REF!"}},{"$f":"'debit réf'!#REF!","v":{"$error":"#REF!"}},{"$f":"'debit réf'!#REF!","v":{"$error":"#REF!"}},1700]
[null,{"$f":"'debit réf'!C197","v":"04:40:00"},{"$f":"'debit réf'!#REF!","v":{"$error":"#REF!"}},{"$f":"'debit réf'!#REF!","v":{"$error":"#REF!"}},{"$f":"'debit réf'!#REF!","v":{"$error":"#REF!"}},{"$f":"'debit réf'!#REF!","v":{"$error":"#REF!"}},1700]
[null,{"$f":"'debit réf'!C198","v":"04:50:00"},{"$f":"'debit réf'!#REF!","v":{"$error":"#REF!"}},{"$f":"'debit réf'!#REF!","v":{"$error":"#REF!"}},{"$f":"'debit réf'!#REF!","v":{"$error":"#REF!"}},{"$f":"'debit réf'!#REF!","v":{"$error":"#REF!"}},1700]
[null,{"$f":"'debit réf'!C199","v":"05:00:00"},{"$f":"'debit réf'!#REF!","v":{"$error":"#REF!"}},{"$f":"'debit réf'!#REF!","v":{"$error":"#REF!"}},{"$f":"'debit réf'!#REF!","v":{"$error":"#REF!"}},{"$f":"'debit réf'!#REF!","v":{"$error":"#REF!"}},1700]
[null,{"$f":"'debit réf'!C200","v":"05:10:00"},{"$f":"'debit réf'!#REF!","v":{"$error":"#REF!"}},{"$f":"'debit réf'!#REF!","v":{"$error":"#REF!"}},{"$f":"'debit réf'!#REF!","v":{"$error":"#REF!"}},{"$f":"'debit réf'!#REF!","v":{"$error":"#REF!"}},1700]
[null,{"$f":"'debit réf'!C201","v":"05:20:00"},{"$f":"'debit réf'!#REF!","v":{"$error":"#REF!"}},{"$f":"'debit réf'!#REF!","v":{"$error":"#REF!"}},{"$f":"'debit réf'!#REF!","v":{"$error":"#REF!"}},{"$f":"'debit réf'!#REF!","v":{"$error":"#REF!"}},1700]
[null,{"$f":"'debit réf'!C202","v":"05:30:00"},{"$f":"'debit réf'!#REF!","v":{"$error":"#REF!"}},{"$f":"'debit réf'!#REF!","v":{"$error":"#REF!"}},{"$f":"'debit réf'!#REF!","v":{"$error":"#REF!"}},{"$f":"'debit réf'!#REF!","v":{"$error":"#REF!"}},1700]
[null,{"$f":"'debit réf'!C203","v":"05:40:00"},{"$f":"'debit réf'!#REF!","v":{"$error":"#REF!"}},{"$f":"'debit réf'!#REF!","v":{"$error":"#REF!"}},{"$f":"'debit réf'!#REF!","v":{"$error":"#REF!"}},{"$f":"'debit réf'!#REF!","v":{"$error":"#REF!"}},1700]
[null,{"$f":"'debit réf'!C204","v":"05:50:00"},{"$f":"'debit réf'!#REF!","v":{"$error":"#REF!"}},{"$f":"'debit réf'!#REF!","v":{"$error":"#REF!"}},{"$f":"'debit réf'!#REF!","v":{"$error":"#REF!"}},{"$f":"'debit réf'!#REF!","v":{"$error":"#REF!"}},1700]
[null,{"$f":"'debit réf'!C205","v":"06:00:00"},{"$f":"'debit réf'!#REF!","v":{"$error":"#REF!"}},{"$f":"'debit réf'!#REF!","v":{"$error":"#REF!"}},{"$f":"'debit réf'!#REF!","v":{"$error":"#REF!"}},{"$f":"'debit réf'!#REF!","v":{"$error":"#REF!"}},1700]
[null,{"$f":"'debit réf'!C206","v":"06:10:00"},{"$f":"'debit réf'!#REF!","v":{"$error":"#REF!"}},{"$f":"'debit réf'!#REF!","v":{"$error":"#REF!"}},{"$f":"'debit réf'!#REF!","v":{"$error":"#REF!"}},{"$f":"'debit réf'!#REF!","v":{"$error":"#REF!"}},1700]
[null,{"$f":"'debit réf'!C207","v":"06:20:00"},{"$f":"'debit réf'!#REF!","v":{"$error":"#REF!"}},{"$f":"'debit réf'!#REF!","v":{"$error":"#REF!"}},{"$f":"'debit réf'!#REF!","v":{"$error":"#REF!"}},{"$f":"'debit réf'!#REF!","v":{"$error":"#REF!"}},1700]
[null,{"$f":"'debit réf'!C208","v":"06:30:00"},{"$f":"'debit réf'!#REF!","v":{"$error":"#REF!"}},{"$f":"'debit réf'!#REF!","v":{"$error":"#REF!"}},{"$f":"'debit réf'!#REF!","v":{"$error":"#REF!"}},{"$f":"'debit réf'!#REF!","v":{"$error":"#REF!"}},1700]
[null,{"$f":"'debit réf'!C209","v":"06:40:00"},{"$f":"'debit réf'!#REF!","v":{"$error":"#REF!"}},{"$f":"'debit réf'!#REF!","v":{"$error":"#REF!"}},{"$f":"'debit réf'!#REF!","v":{"$error":"#REF!"}},{"$f":"'debit réf'!#REF!","v":{"$error":"#REF!"}},1700]
[null,{"$f":"'debit réf'!C210","v":"06:50:00"},{"$f":"'debit réf'!#REF!","v":{"$error":"#REF!"}},{"$f":"'debit réf'!#REF!","v":{"$error":"#REF!"}},{"$f":"'debit réf'!#REF!","v":{"$error":"#REF!"}},{"$f":"'debit réf'!#REF!","v":{"$error":"#REF!"}},1700]
[null,{"$f":"'debit réf'!C211","v":"07:00:00"},{"$f":"'debit réf'!#REF!","v":{"$error":"#REF!"}},{"$f":"'debit réf'!#REF!","v":{"$error":"#REF!"}},{"$f":"'debit réf'!#REF!","v":{"$error":"#REF!"}},{"$f":"'debit réf'!#REF!","v":{"$error":"#REF!"}},1700]
[null,{"$f":"'debit réf'!C212","v":"07:10:00"},{"$f":"'debit réf'!#REF!","v":{"$error":"#REF!"}},{"$f":"'debit réf'!#REF!","v":{"$error":"#REF!"}},{"$f":"'debit réf'!#REF!","v":{"$error":"#REF!"}},{"$f":"'debit réf'!#REF!","v":{"$error":"#REF!"}},1700]
[null,{"$f":"'debit réf'!C213","v":"07:20:00"},{"$f":"'debit réf'!#REF!","v":{"$error":"#REF!"}},{"$f":"'debit réf'!#REF!","v":{"$error":"#REF!"}},{"$f":"'debit réf'!#REF!","v":{"$error":"#REF!"}},{"$f":"'debit réf'!#REF!","v":{"$error":"#REF!"}},1700]
[null,{"$f":"'debit réf'!C214","v":"07:30:00"},{"$f":"'debit réf'!#REF!","v":{"$error":"#REF!"}},{"$f":"'debit réf'!#REF!","v":{"$error":"#REF!"}},{"$f":"'debit réf'!#REF!","v":{"$error":"#REF!"}},{"$f":"'debit réf'!#REF!","v":{"$error":"#REF!"}},1700]
[null,{"$f":"'debit réf'!C215","v":"07:40:00"},{"$f":"'debit réf'!#REF!","v":{"$error":"#REF!"}},{"$f":"'debit réf'!#REF!","v":{"$error":"#REF!"}},{"$f":"'debit réf'!#REF!","v":{"$error":"#REF!"}},{"$f":"'debit réf'!#REF!","v":{"$error":"#REF!"}},1700]
[null,{"$f":"'debit réf'!C216","v":"07:50:00"},{"$f":"'debit réf'!#REF!","v":{"$error":"#REF!"}},{"$f":"'debit réf'!#REF!","v":{"$error":"#REF!"}},{"$f":"'debit réf'!#REF!","v":{"$error":"#REF!"}},{"$f":"'debit réf'!#REF!","v":{"$error":"#REF!"}},1700]
[null,{"$f":"'debit réf'!C217","v":"08:00:00"},{"$f":"'debit réf'!#REF!","v":{"$error":"#REF!"}},{"$f":"'debit réf'!#REF!","v":{"$error":"#REF!"}},{"$f":"'debit réf'!#REF!","v":{"$error":"#REF!"}},{"$f":"'debit réf'!#REF!","v":{"$error":"#REF!"}},{"$f":"CO2Lim","v":1700}]
[null,{"$f":"'debit réf'!C218","v":"08:10:00"},{"$f":"'debit réf'!#REF!","v":{"$error":"#REF!"}},{"$f":"'debit réf'!#REF!","v":{"$error":"#REF!"}},{"$f":"'debit réf'!#REF!","v":{"$error":"#REF!"}},{"$f":"'debit réf'!#REF!","v":{"$error":"#REF!"}},1700]
[null,{"$f":"'debit réf'!C219","v":"08:20:00"},{"$f":"'debit réf'!#REF!","v":{"$error":"#REF!"}},{"$f":"'debit réf'!#REF!","v":{"$error":"#REF!"}},{"$f":"'debit réf'!#REF!","v":{"$error":"#REF!"}},{"$f":"'debit réf'!#REF!","v":{"$error":"#REF!"}},1700]
[null,{"$f":"'debit réf'!C220","v":"08:30:00"},{"$f":"'debit réf'!#REF!","v":{"$error":"#REF!"}},{"$f":"'debit réf'!#REF!","v":{"$error":"#REF!"}},{"$f":"'debit réf'!#REF!","v":{"$error":"#REF!"}},{"$f":"'debit réf'!#REF!","v":{"$error":"#REF!"}},1700]
[null,{"$f":"'debit réf'!C221","v":"08:40:00"},{"$f":"'debit réf'!#REF!","v":{"$error":"#REF!"}},{"$f":"'debit réf'!#REF!","v":{"$error":"#REF!"}},{"$f":"'debit réf'!#REF!","v":{"$error":"#REF!"}},{"$f":"'debit réf'!#REF!","v":{"$error":"#REF!"}},1700]
[null,{"$f":"'debit réf'!C222","v":"08:50:00"},{"$f":"'debit réf'!#REF!","v":{"$error":"#REF!"}},{"$f":"'debit réf'!#REF!","v":{"$error":"#REF!"}},{"$f":"'debit réf'!#REF!","v":{"$error":"#REF!"}},{"$f":"'debit réf'!#REF!","v":{"$error":"#REF!"}},1700]
[null,{"$f":"'debit réf'!C223","v":"09:00:00"},{"$f":"'debit réf'!#REF!","v":{"$error":"#REF!"}},{"$f":"'debit réf'!#REF!","v":{"$error":"#REF!"}},{"$f":"'debit réf'!#REF!","v":{"$error":"#REF!"}},{"$f":"'debit réf'!#REF!","v":{"$error":"#REF!"}},1700]
[null,{"$f":"'debit réf'!C224","v":"09:10:00"},{"$f":"'debit réf'!#REF!","v":{"$error":"#REF!"}},{"$f":"'debit réf'!#REF!","v":{"$error":"#REF!"}},{"$f":"'debit réf'!#REF!","v":{"$error":"#REF!"}},{"$f":"'debit réf'!#REF!","v":{"$error":"#REF!"}},1700]
[null,{"$f":"'debit réf'!C225","v":"09:20:00"},{"$f":"'debit réf'!#REF!","v":{"$error":"#REF!"}},{"$f":"'debit réf'!#REF!","v":{"$error":"#REF!"}},{"$f":"'debit réf'!#REF!","v":{"$error":"#REF!"}},{"$f":"'debit réf'!#REF!","v":{"$error":"#REF!"}},1700]
[null,{"$f":"'debit réf'!C226","v":"09:30:00"},{"$f":"'debit réf'!#REF!","v":{"$error":"#REF!"}},{"$f":"'debit réf'!#REF!","v":{"$error":"#REF!"}},{"$f":"'debit réf'!#REF!","v":{"$error":"#REF!"}},{"$f":"'debit réf'!#REF!","v":{"$error":"#REF!"}},1700]
[null,{"$f":"'debit réf'!C227","v":"09:40:00"},{"$f":"'debit réf'!#REF!","v":{"$error":"#REF!"}},{"$f":"'debit réf'!#REF!","v":{"$error":"#REF!"}},{"$f":"'debit réf'!#REF!","v":{"$error":"#REF!"}},{"$f":"'debit réf'!#REF!","v":{"$error":"#REF!"}},1700]
[null,{"$f":"'debit réf'!C228","v":"09:50:00"},{"$f":"'debit réf'!#REF!","v":{"$error":"#REF!"}},{"$f":"'debit réf'!#REF!","v":{"$error":"#REF!"}},{"$f":"'debit réf'!#REF!","v":{"$error":"#REF!"}},{"$f":"'debit réf'!#REF!","v":{"$error":"#REF!"}},1700]
[null,{"$f":"'debit réf'!C229","v":"10:00:00"},{"$f":"'debit réf'!#REF!","v":{"$error":"#REF!"}},{"$f":"'debit réf'!#REF!","v":{"$error":"#REF!"}},{"$f":"'debit réf'!#REF!","v":{"$error":"#REF!"}},{"$f":"'debit réf'!#REF!","v":{"$error":"#REF!"}},1700]
[null,{"$f":"'debit réf'!C230","v":"10:10:00"},{"$f":"'debit réf'!#REF!","v":{"$error":"#REF!"}},{"$f":"'debit réf'!#REF!","v":{"$error":"#REF!"}},{"$f":"'debit réf'!#REF!","v":{"$error":"#REF!"}},{"$f":"'debit réf'!#REF!","v":{"$error":"#REF!"}},1700]
[null,{"$f":"'debit réf'!C231","v":"10:20:00"},{"$f":"'debit réf'!#REF!","v":{"$error":"#REF!"}},{"$f":"'debit réf'!#REF!","v":{"$error":"#REF!"}},{"$f":"'debit réf'!#REF!","v":{"$error":"#REF!"}},{"$f":"'debit réf'!#REF!","v":{"$error":"#REF!"}},1700]
[null,{"$f":"'debit réf'!C232","v":"10:30:00"},{"$f":"'debit réf'!#REF!","v":{"$error":"#REF!"}},{"$f":"'debit réf'!#REF!","v":{"$error":"#REF!"}},{"$f":"'debit réf'!#REF!","v":{"$error":"#REF!"}},{"$f":"'debit réf'!#REF!","v":{"$error":"#REF!"}},1700]
[null,{"$f":"'debit réf'!C233","v":"10:40:00"},{"$f":"'debit réf'!#REF!","v":{"$error":"#REF!"}},{"$f":"'debit réf'!#REF!","v":{"$error":"#REF!"}},{"$f":"'debit réf'!#REF!","v":{"$error":"#REF!"}},{"$f":"'debit réf'!#REF!","v":{"$error":"#REF!"}},1700]
[null,{"$f":"'debit réf'!C234","v":"10:50:00"},{"$f":"'debit réf'!#REF!","v":{"$error":"#REF!"}},{"$f":"'debit réf'!#REF!","v":{"$error":"#REF!"}},{"$f":"'debit réf'!#REF!","v":{"$error":"#REF!"}},{"$f":"'debit réf'!#REF!","v":{"$error":"#REF!"}},1700]
[null,{"$f":"'debit réf'!C235","v":"11:00:00"},{"$f":"'debit réf'!#REF!","v":{"$error":"#REF!"}},{"$f":"'debit réf'!#REF!","v":{"$error":"#REF!"}},{"$f":"'debit réf'!#REF!","v":{"$error":"#REF!"}},{"$f":"'debit réf'!#REF!","v":{"$error":"#REF!"}},1700]
[null,{"$f":"'debit réf'!C236","v":"11:10:00"},{"$f":"'debit réf'!#REF!","v":{"$error":"#REF!"}},{"$f":"'debit réf'!#REF!","v":{"$error":"#REF!"}},{"$f":"'debit réf'!#REF!","v":{"$error":"#REF!"}},{"$f":"'debit réf'!#REF!","v":{"$error":"#REF!"}},1700]
[null,{"$f":"'debit réf'!C237","v":"11:20:00"},{"$f":"'debit réf'!#REF!","v":{"$error":"#REF!"}},{"$f":"'debit réf'!#REF!","v":{"$error":"#REF!"}},{"$f":"'debit réf'!#REF!","v":{"$error":"#REF!"}},{"$f":"'debit réf'!#REF!","v":{"$error":"#REF!"}},1700]
[null,{"$f":"'debit réf'!C238","v":"11:30:00"},{"$f":"'debit réf'!#REF!","v":{"$error":"#REF!"}},{"$f":"'debit réf'!#REF!","v":{"$error":"#REF!"}},{"$f":"'debit réf'!#REF!","v":{"$error":"#REF!"}},{"$f":"'debit réf'!#REF!","v":{"$error":"#REF!"}},1700]
[null,{"$f":"'debit réf'!C239","v":"11:40:00"},{"$f":"'debit réf'!#REF!","v":{"$error":"#REF!"}},{"$f":"'debit réf'!#REF!","v":{"$error":"#REF!"}},{"$f":"'debit réf'!#REF!","v":{"$error":"#REF!"}},{"$f":"'debit réf'!#REF!","v":{"$error":"#REF!"}},1700]
[null,{"$f":"'debit réf'!C240","v":"11:50:00"},{"$f":"'debit réf'!#REF!","v":{"$error":"#REF!"}},{"$f":"'debit réf'!#REF!","v":{"$error":"#REF!"}},{"$f":"'debit réf'!#REF!","v":{"$error":"#REF!"}},{"$f":"'debit réf'!#REF!","v":{"$error":"#REF!"}},1700]
[null,{"$f":"'debit réf'!C241","v":"12:00:00"},{"$f":"'debit réf'!#REF!","v":{"$error":"#REF!"}},{"$f":"'debit réf'!#REF!","v":{"$error":"#REF!"}},{"$f":"'debit réf'!#REF!","v":{"$error":"#REF!"}},{"$f":"'debit réf'!#REF!","v":{"$error":"#REF!"}},1700]
[null,{"$f":"'debit réf'!C242","v":"12:10:00"},{"$f":"'debit réf'!#REF!","v":{"$error":"#REF!"}},{"$f":"'debit réf'!#REF!","v":{"$error":"#REF!"}},{"$f":"'debit réf'!#REF!","v":{"$error":"#REF!"}},{"$f":"'debit réf'!#REF!","v":{"$error":"#REF!"}},1700]
[null,{"$f":"'debit réf'!C243","v":"12:20:00"},{"$f":"'debit réf'!#REF!","v":{"$error":"#REF!"}},{"$f":"'debit réf'!#REF!","v":{"$error":"#REF!"}},{"$f":"'debit réf'!#REF!","v":{"$error":"#REF!"}},{"$f":"'debit réf'!#REF!","v":{"$error":"#REF!"}},1700]
[null,{"$f":"'debit réf'!C244","v":"12:30:00"},{"$f":"'debit réf'!#REF!","v":{"$error":"#REF!"}},{"$f":"'debit réf'!#REF!","v":{"$error":"#REF!"}},{"$f":"'debit réf'!#REF!","v":{"$error":"#REF!"}},{"$f":"'debit réf'!#REF!","v":{"$error":"#REF!"}},1700]
[null,{"$f":"'debit réf'!C245","v":"12:40:00"},{"$f":"'debit réf'!#REF!","v":{"$error":"#REF!"}},{"$f":"'debit réf'!#REF!","v":{"$error":"#REF!"}},{"$f":"'debit réf'!#REF!","v":{"$error":"#REF!"}},{"$f":"'debit réf'!#REF!","v":{"$error":"#REF!"}},1700]
[null,{"$f":"'debit réf'!C246","v":"12:50:00"},{"$f":"'debit réf'!#REF!","v":{"$error":"#REF!"}},{"$f":"'debit réf'!#REF!","v":{"$error":"#REF!"}},{"$f":"'debit réf'!#REF!","v":{"$error":"#REF!"}},{"$f":"'debit réf'!#REF!","v":{"$error":"#REF!"}},1700]
[null,{"$f":"'debit réf'!C247","v":"13:00:00"},{"$f":"'debit réf'!#REF!","v":{"$error":"#REF!"}},{"$f":"'debit réf'!#REF!","v":{"$error":"#REF!"}},{"$f":"'debit réf'!#REF!","v":{"$error":"#REF!"}},{"$f":"'debit réf'!#REF!","v":{"$error":"#REF!"}},1700]
[null,{"$f":"'debit réf'!C248","v":"13:10:00"},{"$f":"'debit réf'!#REF!","v":{"$error":"#REF!"}},{"$f":"'debit réf'!#REF!","v":{"$error":"#REF!"}},{"$f":"'debit réf'!#REF!","v":{"$error":"#REF!"}},{"$f":"'debit réf'!#REF!","v":{"$error":"#REF!"}},1700]
[null,{"$f":"'debit réf'!C249","v":"13:20:00"},{"$f":"'debit réf'!#REF!","v":{"$error":"#REF!"}},{"$f":"'debit réf'!#REF!","v":{"$error":"#REF!"}},{"$f":"'debit réf'!#REF!","v":{"$error":"#REF!"}},{"$f":"'debit réf'!#REF!","v":{"$error":"#REF!"}},1700]
[null,{"$f":"'debit réf'!C250","v":"13:30:00"},{"$f":"'debit réf'!#REF!","v":{"$error":"#REF!"}},{"$f":"'debit réf'!#REF!","v":{"$error":"#REF!"}},{"$f":"'debit réf'!#REF!","v":{"$error":"#REF!"}},{"$f":"'debit réf'!#REF!","v":{"$error":"#REF!"}},1700]
[null,{"$f":"'debit réf'!C251","v":"13:40:00"},{"$f":"'debit réf'!#REF!","v":{"$error":"#REF!"}},{"$f":"'debit réf'!#REF!","v":{"$error":"#REF!"}},{"$f":"'debit réf'!#REF!","v":{"$error":"#REF!"}},{"$f":"'debit réf'!#REF!","v":{"$error":"#REF!"}},1700]
[null,{"$f":"'debit réf'!C252","v":"13:50:00"},{"$f":"'debit réf'!#REF!","v":{"$error":"#REF!"}},{"$f":"'debit réf'!#REF!","v":{"$error":"#REF!"}},{"$f":"'debit réf'!#REF!","v":{"$error":"#REF!"}},{"$f":"'debit réf'!#REF!","v":{"$error":"#REF!"}},1700]
[null,{"$f":"'debit réf'!C253","v":"14:00:00"},{"$f":"'debit réf'!#REF!","v":{"$error":"#REF!"}},{"$f":"'debit réf'!#REF!","v":{"$error":"#REF!"}},{"$f":"'debit réf'!#REF!","v":{"$error":"#REF!"}},{"$f":"'debit réf'!#REF!","v":{"$error":"#REF!"}},1700]
[null,{"$f":"'debit réf'!C254","v":"14:10:00"},{"$f":"'debit réf'!#REF!","v":{"$error":"#REF!"}},{"$f":"'debit réf'!#REF!","v":{"$error":"#REF!"}},{"$f":"'debit réf'!#REF!","v":{"$error":"#REF!"}},{"$f":"'debit réf'!#REF!","v":{"$error":"#REF!"}},1700]
[null,{"$f":"'debit réf'!C255","v":"14:20:00"},{"$f":"'debit réf'!#REF!","v":{"$error":"#REF!"}},{"$f":"'debit réf'!#REF!","v":{"$error":"#REF!"}},{"$f":"'debit réf'!#REF!","v":{"$error":"#REF!"}},{"$f":"'debit réf'!#REF!","v":{"$error":"#REF!"}},1700]
[null,{"$f":"'debit réf'!C256","v":"14:30:00"},{"$f":"'debit réf'!#REF!","v":{"$error":"#REF!"}},{"$f":"'debit réf'!#REF!","v":{"$error":"#REF!"}},{"$f":"'debit réf'!#REF!","v":{"$error":"#REF!"}},{"$f":"'debit réf'!#REF!","v":{"$error":"#REF!"}},1700]
[null,{"$f":"'debit réf'!C257","v":"14:40:00"},{"$f":"'debit réf'!#REF!","v":{"$error":"#REF!"}},{"$f":"'debit réf'!#REF!","v":{"$error":"#REF!"}},{"$f":"'debit réf'!#REF!","v":{"$error":"#REF!"}},{"$f":"'debit réf'!#REF!","v":{"$error":"#REF!"}},1700]
[null,{"$f":"'debit réf'!C258","v":"14:50:00"},{"$f":"'debit réf'!#REF!","v":{"$error":"#REF!"}},{"$f":"'debit réf'!#REF!","v":{"$error":"#REF!"}},{"$f":"'debit réf'!#REF!","v":{"$error":"#REF!"}},{"$f":"'debit réf'!#REF!","v":{"$error":"#REF!"}},1700]
[null,{"$f":"'debit réf'!C259","v":"15:00:00"},{"$f":"'debit réf'!#REF!","v":{"$error":"#REF!"}},{"$f":"'debit réf'!#REF!","v":{"$error":"#REF!"}},{"$f":"'debit réf'!#REF!","v":{"$error":"#REF!"}},{"$f":"'debit réf'!#REF!","v":{"$error":"#REF!"}},1700]
[null,{"$f":"'debit réf'!C260","v":"15:10:00"},{"$f":"'debit réf'!#REF!","v":{"$error":"#REF!"}},{"$f":"'debit réf'!#REF!","v":{"$error":"#REF!"}},{"$f":"'debit réf'!#REF!","v":{"$error":"#REF!"}},{"$f":"'debit réf'!#REF!","v":{"$error":"#REF!"}},1700]
[null,{"$f":"'debit réf'!C261","v":"15:20:00"},{"$f":"'debit réf'!#REF!","v":{"$error":"#REF!"}},{"$f":"'debit réf'!#REF!","v":{"$error":"#REF!"}},{"$f":"'debit réf'!#REF!","v":{"$error":"#REF!"}},{"$f":"'debit réf'!#REF!","v":{"$error":"#REF!"}},1700]
[null,{"$f":"'debit réf'!C262","v":"15:30:00"},{"$f":"'debit réf'!#REF!","v":{"$error":"#REF!"}},{"$f":"'debit réf'!#REF!","v":{"$error":"#REF!"}},{"$f":"'debit réf'!#REF!","v":{"$error":"#REF!"}},{"$f":"'debit réf'!#REF!","v":{"$error":"#REF!"}},1700]
[null,{"$f":"'debit réf'!C263","v":"15:40:00"},{"$f":"'debit réf'!#REF!","v":{"$error":"#REF!"}},{"$f":"'debit réf'!#REF!","v":{"$error":"#REF!"}},{"$f":"'debit réf'!#REF!","v":{"$error":"#REF!"}},{"$f":"'debit réf'!#REF!","v":{"$error":"#REF!"}},1700]
[null,{"$f":"'debit réf'!C264","v":"15:50:00"},{"$f":"'debit réf'!#REF!","v":{"$error":"#REF!"}},{"$f":"'debit réf'!#REF!","v":{"$error":"#REF!"}},{"$f":"'debit réf'!#REF!","v":{"$error":"#REF!"}},{"$f":"'debit réf'!#REF!","v":{"$error":"#REF!"}},1700]
[null,{"$f":"'debit réf'!C265","v":"16:00:00"},{"$f":"'debit réf'!#REF!","v":{"$error":"#REF!"}},{"$f":"'debit réf'!#REF!","v":{"$error":"#REF!"}},{"$f":"'debit réf'!#REF!","v":{"$error":"#REF!"}},{"$f":"'debit réf'!#REF!","v":{"$error":"#REF!"}},1700]
[null,{"$f":"'debit réf'!C266","v":"16:10:00"},{"$f":"'debit réf'!#REF!","v":{"$error":"#REF!"}},{"$f":"'debit réf'!#REF!","v":{"$error":"#REF!"}},{"$f":"'debit réf'!#REF!","v":{"$error":"#REF!"}},{"$f":"'debit réf'!#REF!","v":{"$error":"#REF!"}},1700]
[null,{"$f":"'debit réf'!C267","v":"16:20:00"},{"$f":"'debit réf'!#REF!","v":{"$error":"#REF!"}},{"$f":"'debit réf'!#REF!","v":{"$error":"#REF!"}},{"$f":"'debit réf'!#REF!","v":{"$error":"#REF!"}},{"$f":"'debit réf'!#REF!","v":{"$error":"#REF!"}},1700]
[null,{"$f":"'debit réf'!C268","v":"16:30:00"},{"$f":"'debit réf'!#REF!","v":{"$error":"#REF!"}},{"$f":"'debit réf'!#REF!","v":{"$error":"#REF!"}},{"$f":"'debit réf'!#REF!","v":{"$error":"#REF!"}},{"$f":"'debit réf'!#REF!","v":{"$error":"#REF!"}},1700]
[null,{"$f":"'debit réf'!C269","v":"16:40:00"},{"$f":"'debit réf'!#REF!","v":{"$error":"#REF!"}},{"$f":"'debit réf'!#REF!","v":{"$error":"#REF!"}},{"$f":"'debit réf'!#REF!","v":{"$error":"#REF!"}},{"$f":"'debit réf'!#REF!","v":{"$error":"#REF!"}},1700]
[null,{"$f":"'debit réf'!C270","v":"16:50:00"},{"$f":"'debit réf'!#REF!","v":{"$error":"#REF!"}},{"$f":"'debit réf'!#REF!","v":{"$error":"#REF!"}},{"$f":"'debit réf'!#REF!","v":{"$error":"#REF!"}},{"$f":"'debit réf'!#REF!","v":{"$error":"#REF!"}},1700]
[null,{"$f":"'debit réf'!C271","v":"17:00:00"},{"$f":"'debit réf'!#REF!","v":{"$error":"#REF!"}},{"$f":"'debit réf'!#REF!","v":{"$error":"#REF!"}},{"$f":"'debit réf'!#REF!","v":{"$error":"#REF!"}},{"$f":"'debit réf'!#REF!","v":{"$error":"#REF!"}},1700]
[null,{"$f":"'debit réf'!C272","v":"17:10:00"},{"$f":"'debit réf'!#REF!","v":{"$error":"#REF!"}},{"$f":"'debit réf'!#REF!","v":{"$error":"#REF!"}},{"$f":"'debit réf'!#REF!","v":{"$error":"#REF!"}},{"$f":"'debit réf'!#REF!","v":{"$error":"#REF!"}},1700]
[null,{"$f":"'debit réf'!C273","v":"17:20:00"},{"$f":"'debit réf'!#REF!","v":{"$error":"#REF!"}},{"$f":"'debit réf'!#REF!","v":{"$error":"#REF!"}},{"$f":"'debit réf'!#REF!","v":{"$error":"#REF!"}},{"$f":"'debit réf'!#REF!","v":{"$error":"#REF!"}},1700]
[null,{"$f":"'debit réf'!C274","v":"17:30:00"},{"$f":"'debit réf'!#REF!","v":{"$error":"#REF!"}},{"$f":"'debit réf'!#REF!","v":{"$error":"#REF!"}},{"$f":"'debit réf'!#REF!","v":{"$error":"#REF!"}},{"$f":"'debit réf'!#REF!","v":{"$error":"#REF!"}},1700]
[null,{"$f":"'debit réf'!C275","v":"17:40:00"},{"$f":"'debit réf'!#REF!","v":{"$error":"#REF!"}},{"$f":"'debit réf'!#REF!","v":{"$error":"#REF!"}},{"$f":"'debit réf'!#REF!","v":{"$error":"#REF!"}},{"$f":"'debit réf'!#REF!","v":{"$error":"#REF!"}},1700]
[null,{"$f":"'debit réf'!C276","v":"17:50:00"},{"$f":"'debit réf'!#REF!","v":{"$error":"#REF!"}},{"$f":"'debit réf'!#REF!","v":{"$error":"#REF!"}},{"$f":"'debit réf'!#REF!","v":{"$error":"#REF!"}},{"$f":"'debit réf'!#REF!","v":{"$error":"#REF!"}},1700]
[null,{"$f":"'debit réf'!C277","v":"18:00:00"},{"$f":"'debit réf'!#REF!","v":{"$error":"#REF!"}},{"$f":"'debit réf'!#REF!","v":{"$error":"#REF!"}},{"$f":"'debit réf'!#REF!","v":{"$error":"#REF!"}},{"$f":"'debit réf'!#REF!","v":{"$error":"#REF!"}},1700]
[null,{"$f":"'debit réf'!C278","v":"18:10:00"},{"$f":"'debit réf'!#REF!","v":{"$error":"#REF!"}},{"$f":"'debit réf'!#REF!","v":{"$error":"#REF!"}},{"$f":"'debit réf'!#REF!","v":{"$error":"#REF!"}},{"$f":"'debit réf'!#REF!","v":{"$error":"#REF!"}},1700]
[null,{"$f":"'debit réf'!C279","v":"18:20:00"},{"$f":"'debit réf'!#REF!","v":{"$error":"#REF!"}},{"$f":"'debit réf'!#REF!","v":{"$error":"#REF!"}},{"$f":"'debit réf'!#REF!","v":{"$error":"#REF!"}},{"$f":"'debit réf'!#REF!","v":{"$error":"#REF!"}},1700]
[null,{"$f":"'debit réf'!C280","v":"18:30:00"},{"$f":"'debit réf'!#REF!","v":{"$error":"#REF!"}},{"$f":"'debit réf'!#REF!","v":{"$error":"#REF!"}},{"$f":"'debit réf'!#REF!","v":{"$error":"#REF!"}},{"$f":"'debit réf'!#REF!","v":{"$error":"#REF!"}},1700]
[null,{"$f":"'debit réf'!C281","v":"18:40:00"},{"$f":"'debit réf'!#REF!","v":{"$error":"#REF!"}},{"$f":"'debit réf'!#REF!","v":{"$error":"#REF!"}},{"$f":"'debit réf'!#REF!","v":{"$error":"#REF!"}},{"$f":"'debit réf'!#REF!","v":{"$error":"#REF!"}},{"$f":"CO2Lim","v":1700}]
[null,{"$f":"'debit réf'!C282","v":"18:50:00"},{"$f":"'debit réf'!#REF!","v":{"$error":"#REF!"}},{"$f":"'debit réf'!#REF!","v":{"$error":"#REF!"}},{"$f":"'debit réf'!#REF!","v":{"$error":"#REF!"}},{"$f":"'debit réf'!#REF!","v":{"$error":"#REF!"}},1700]
[null,{"$f":"'debit réf'!C283","v":"19:00:00"},{"$f":"'debit réf'!#REF!","v":{"$error":"#REF!"}},{"$f":"'debit réf'!#REF!","v":{"$error":"#REF!"}},{"$f":"'debit réf'!#REF!","v":{"$error":"#REF!"}},{"$f":"'debit réf'!#REF!","v":{"$error":"#REF!"}},1700]
[null,{"$f":"'debit réf'!C284","v":"19:10:00"},{"$f":"'debit réf'!#REF!","v":{"$error":"#REF!"}},{"$f":"'debit réf'!#REF!","v":{"$error":"#REF!"}},{"$f":"'debit réf'!#REF!","v":{"$error":"#REF!"}},{"$f":"'debit réf'!#REF!","v":{"$error":"#REF!"}},1700]
[null,{"$f":"'debit réf'!C285","v":"19:20:00"},{"$f":"'debit réf'!#REF!","v":{"$error":"#REF!"}},{"$f":"'debit réf'!#REF!","v":{"$error":"#REF!"}},{"$f":"'debit réf'!#REF!","v":{"$error":"#REF!"}},{"$f":"'debit réf'!#REF!","v":{"$error":"#REF!"}},1700]
[null,{"$f":"'debit réf'!C286","v":"19:30:00"},{"$f":"'debit réf'!#REF!","v":{"$error":"#REF!"}},{"$f":"'debit réf'!#REF!","v":{"$error":"#REF!"}},{"$f":"'debit réf'!#REF!","v":{"$error":"#REF!"}},{"$f":"'debit réf'!#REF!","v":{"$error":"#REF!"}},1700]
[null,{"$f":"'debit réf'!C287","v":"19:40:00"},{"$f":"'debit réf'!#REF!","v":{"$error":"#REF!"}},{"$f":"'debit réf'!#REF!","v":{"$error":"#REF!"}},{"$f":"'debit réf'!#REF!","v":{"$error":"#REF!"}},{"$f":"'debit réf'!#REF!","v":{"$error":"#REF!"}},1700]
[null,{"$f":"'debit réf'!C288","v":"19:50:00"},{"$f":"'debit réf'!#REF!","v":{"$error":"#REF!"}},{"$f":"'debit réf'!#REF!","v":{"$error":"#REF!"}},{"$f":"'debit réf'!#REF!","v":{"$error":"#REF!"}},{"$f":"'debit réf'!#REF!","v":{"$error":"#REF!"}},1700]
[null,{"$f":"'debit réf'!C289","v":"20:00:00"},{"$f":"'debit réf'!#REF!","v":{"$error":"#REF!"}},{"$f":"'debit réf'!#REF!","v":{"$error":"#REF!"}},{"$f":"'debit réf'!#REF!","v":{"$error":"#REF!"}},{"$f":"'debit réf'!#REF!","v":{"$error":"#REF!"}},1700]
[null,{"$f":"'debit réf'!C290","v":"20:10:00"},{"$f":"'debit réf'!#REF!","v":{"$error":"#REF!"}},{"$f":"'debit réf'!#REF!","v":{"$error":"#REF!"}},{"$f":"'debit réf'!#REF!","v":{"$error":"#REF!"}},{"$f":"'debit réf'!#REF!","v":{"$error":"#REF!"}},1700]
[null,{"$f":"'debit réf'!C291","v":"20:20:00"},{"$f":"'debit réf'!#REF!","v":{"$error":"#REF!"}},{"$f":"'debit réf'!#REF!","v":{"$error":"#REF!"}},{"$f":"'debit réf'!#REF!","v":{"$error":"#REF!"}},{"$f":"'debit réf'!#REF!","v":{"$error":"#REF!"}},1700]
[null,{"$f":"'debit réf'!C292","v":"20:30:00"},{"$f":"'debit réf'!#REF!","v":{"$error":"#REF!"}},{"$f":"'debit réf'!#REF!","v":{"$error":"#REF!"}},{"$f":"'debit réf'!#REF!","v":{"$error":"#REF!"}},{"$f":"'debit réf'!#REF!","v":{"$error":"#REF!"}},1700]
[null,{"$f":"'debit réf'!C293","v":"20:40:00"},{"$f":"'debit réf'!#REF!","v":{"$error":"#REF!"}},{"$f":"'debit réf'!#REF!","v":{"$error":"#REF!"}},{"$f":"'debit réf'!#REF!","v":{"$error":"#REF!"}},{"$f":"'debit réf'!#REF!","v":{"$error":"#REF!"}},1700]
[null,{"$f":"'debit réf'!C294","v":"20:50:00"},{"$f":"'debit réf'!#REF!","v":{"$error":"#REF!"}},{"$f":"'debit réf'!#REF!","v":{"$error":"#REF!"}},{"$f":"'debit réf'!#REF!","v":{"$error":"#REF!"}},{"$f":"'debit réf'!#REF!","v":{"$error":"#REF!"}},1700]
[null,{"$f":"'debit réf'!C295","v":"21:00:00"},{"$f":"'debit réf'!#REF!","v":{"$error":"#REF!"}},{"$f":"'debit réf'!#REF!","v":{"$error":"#REF!"}},{"$f":"'debit réf'!#REF!","v":{"$error":"#REF!"}},{"$f":"'debit réf'!#REF!","v":{"$error":"#REF!"}},1700]
[null,{"$f":"'debit réf'!C296","v":"21:10:00"},{"$f":"'debit réf'!#REF!","v":{"$error":"#REF!"}},{"$f":"'debit réf'!#REF!","v":{"$error":"#REF!"}},{"$f":"'debit réf'!#REF!","v":{"$error":"#REF!"}},{"$f":"'debit réf'!#REF!","v":{"$error":"#REF!"}},1700]
[null,{"$f":"'debit réf'!C297","v":"21:20:00"},{"$f":"'debit réf'!#REF!","v":{"$error":"#REF!"}},{"$f":"'debit réf'!#REF!","v":{"$error":"#REF!"}},{"$f":"'debit réf'!#REF!","v":{"$error":"#REF!"}},{"$f":"'debit réf'!#REF!","v":{"$error":"#REF!"}},1700]
[null,{"$f":"'debit réf'!C298","v":"21:30:00"},{"$f":"'debit réf'!#REF!","v":{"$error":"#REF!"}},{"$f":"'debit réf'!#REF!","v":{"$error":"#REF!"}},{"$f":"'debit réf'!#REF!","v":{"$error":"#REF!"}},{"$f":"'debit réf'!#REF!","v":{"$error":"#REF!"}},1700]
[null,{"$f":"'debit réf'!C299","v":"21:40:00"},{"$f":"'debit réf'!#REF!","v":{"$error":"#REF!"}},{"$f":"'debit réf'!#REF!","v":{"$error":"#REF!"}},{"$f":"'debit réf'!#REF!","v":{"$error":"#REF!"}},{"$f":"'debit réf'!#REF!","v":{"$error":"#REF!"}},1700]
[null,{"$f":"'debit réf'!C300","v":"21:50:00"},{"$f":"'debit réf'!#REF!","v":{"$error":"#REF!"}},{"$f":"'debit réf'!#REF!","v":{"$error":"#REF!"}},{"$f":"'debit réf'!#REF!","v":{"$error":"#REF!"}},{"$f":"'debit réf'!#REF!","v":{"$error":"#REF!"}},1700]
[null,{"$f":"'debit réf'!C301","v":"22:00:00"},{"$f":"'debit réf'!#REF!","v":{"$error":"#REF!"}},{"$f":"'debit réf'!#REF!","v":{"$error":"#REF!"}},{"$f":"'debit réf'!#REF!","v":{"$error":"#REF!"}},{"$f":"'debit réf'!#REF!","v":{"$error":"#REF!"}},1700]
[null,{"$f":"'debit réf'!C302","v":"22:10:00"},{"$f":"'debit réf'!#REF!","v":{"$error":"#REF!"}},{"$f":"'debit réf'!#REF!","v":{"$error":"#REF!"}},{"$f":"'debit réf'!#REF!","v":{"$error":"#REF!"}},{"$f":"'debit réf'!#REF!","v":{"$error":"#REF!"}},1700]
[null,{"$f":"'debit réf'!C303","v":"22:20:00"},{"$f":"'debit réf'!#REF!","v":{"$error":"#REF!"}},{"$f":"'debit réf'!#REF!","v":{"$error":"#REF!"}},{"$f":"'debit réf'!#REF!","v":{"$error":"#REF!"}},{"$f":"'debit réf'!#REF!","v":{"$error":"#REF!"}},1700]
[null,{"$f":"'debit réf'!C304","v":"22:30:00"},{"$f":"'debit réf'!#REF!","v":{"$error":"#REF!"}},{"$f":"'debit réf'!#REF!","v":{"$error":"#REF!"}},{"$f":"'debit réf'!#REF!","v":{"$error":"#REF!"}},{"$f":"'debit réf'!#REF!","v":{"$error":"#REF!"}},1700]
[null,{"$f":"'debit réf'!C305","v":"22:40:00"},{"$f":"'debit réf'!#REF!","v":{"$error":"#REF!"}},{"$f":"'debit réf'!#REF!","v":{"$error":"#REF!"}},{"$f":"'debit réf'!#REF!","v":{"$error":"#REF!"}},{"$f":"'debit réf'!#REF!","v":{"$error":"#REF!"}},1700]
[null,{"$f":"'debit réf'!C306","v":"22:50:00"},{"$f":"'debit réf'!#REF!","v":{"$error":"#REF!"}},{"$f":"'debit réf'!#REF!","v":{"$error":"#REF!"}},{"$f":"'debit réf'!#REF!","v":{"$error":"#REF!"}},{"$f":"'debit réf'!#REF!","v":{"$error":"#REF!"}},1700]
[null,{"$f":"'debit réf'!C307","v":"23:00:00"},{"$f":"'debit réf'!#REF!","v":{"$error":"#REF!"}},{"$f":"'debit réf'!#REF!","v":{"$error":"#REF!"}},{"$f":"'debit réf'!#REF!","v":{"$error":"#REF!"}},{"$f":"'debit réf'!#REF!","v":{"$error":"#REF!"}},1700]
[null,{"$f":"'debit réf'!C308","v":"23:10:00"},{"$f":"'debit réf'!#REF!","v":{"$error":"#REF!"}},{"$f":"'debit réf'!#REF!","v":{"$error":"#REF!"}},{"$f":"'debit réf'!#REF!","v":{"$error":"#REF!"}},{"$f":"'debit réf'!#REF!","v":{"$error":"#REF!"}},1700]
[null,{"$f":"'debit réf'!C309","v":"23:20:00"},{"$f":"'debit réf'!#REF!","v":{"$error":"#REF!"}},{"$f":"'debit réf'!#REF!","v":{"$error":"#REF!"}},{"$f":"'debit réf'!#REF!","v":{"$error":"#REF!"}},{"$f":"'debit réf'!#REF!","v":{"$error":"#REF!"}},1700]
[null,{"$f":"'debit réf'!C310","v":"23:30:00"},{"$f":"'debit réf'!#REF!","v":{"$error":"#REF!"}},{"$f":"'debit réf'!#REF!","v":{"$error":"#REF!"}},{"$f":"'debit réf'!#REF!","v":{"$error":"#REF!"}},{"$f":"'debit réf'!#REF!","v":{"$error":"#REF!"}},1700]
[null,{"$f":"'debit réf'!C311","v":"23:40:00"},{"$f":"'debit réf'!#REF!","v":{"$error":"#REF!"}},{"$f":"'debit réf'!#REF!","v":{"$error":"#REF!"}},{"$f":"'debit réf'!#REF!","v":{"$error":"#REF!"}},{"$f":"'debit réf'!#REF!","v":{"$error":"#REF!"}},1700]
[null,{"$f":"'debit réf'!C312","v":"23:50:00"},{"$f":"'debit réf'!#REF!","v":{"$error":"#REF!"}},{"$f":"'debit réf'!#REF!","v":{"$error":"#REF!"}},{"$f":"'debit réf'!#REF!","v":{"$error":"#REF!"}},{"$f":"'debit réf'!#REF!","v":{"$error":"#REF!"}},1700]

{"sheet":"Bilan GRAPH","index":9,"n_rows":0,"n_cols":0,"rows_kept":0,"cut":false,"hidden":false,"merged":[]}

{"sheet":"Sources","index":10,"n_rows":24,"n_cols":6,"rows_kept":24,"cut":false,"hidden":false,"merged":[]}
[]
[]
[null,"http://www.cap-sciences.net/upload/Eau_p24_26.pdf"]
[null,"L'eau rejetée : "]
[null,". respiration (0,5 L/jour) "]
[null,". perspiration et transpiration : 0,9L "]
[null,"(plus en cas de transpiration due à la "]
[null,"chaleur) "]
[null,". urine (1,5L/jour) "]
[null,". selles (0,1L)"]
[]
[null,"http://www.energieplus-lesite.be/index.php?id=15348#c19671"]
[null,"Tableau A.9 – Béton lourd normal"]
[]
[null,"La chaleur massique vaut 1 000 J/(kg.K)"]
[]
[null,"Béton lourd normal",null,"λUi","λUe"," Masse volumique ρ (kg/m³)"]
[null,null,null,"W/(m.K)","W/(m.K)"]
[null,"Armé",null,"1.70","2.20","2 400"]
[null,"Non armé",null,"1.30","1.70","2 400"]
[]
[]
[null," λU,i : Conductivité thermique utilisée pour un matériau dans une paroi intérieure ou dans une paroi extérieure, à condition que ce matériau soit protégé contre l'humidité due à la pluie ou à la condensation."]
[null,"λU,e : Conductivité thermique utilisée pour un matériau dans une paroi extérieure qui n'est pas protégé contre l'humidité due à la pluie ou à la condensation."]

{"sheet":"Formules utilisées","index":11,"n_rows":88,"n_cols":2,"rows_kept":88,"cut":false,"hidden":false,"merged":[[3,0,3,1],[23,0,23,1],[69,0,69,1]]}
[]
["CO2"]
[]
["TauxCO2ppm=MCO2I,n*1000000/Mamphi"]
[]
["Avec"]
["Mamphi","masse d'air contenue dans l'amphithéâtre"]
["MCO2I,n","Masse de CO2 dans l'amphi au moment n"]
[]
["MCO2I,n=MCO2I,(n-1)+MCO2Entrant,n+MCO2Occ,n-MCO2Sortant,n"]
[]
["MCO2I,(n-1)","Masse de CO2 dans l'amphi au moment n-1, soit 5 min plus tôt"]
["MCO2Entrant,n","Masse de CO2 soufflée par la ventilation au moment n"]
["MCO2Sortant,n","Masse de CO2 reprise par la ventilation au moment n"]
["MCO2Occ,n","Masse de CO2 produite par les occupants au moment n"]
[]
[]
[]
[]
[]
[]
["Températures"]
[]
["Ti,n=DTocc,n+(Mamphi*Ti,(n-1)+Mentrant*Tsoufflage,n-Msortant*Treprise,n)/Mamphi"]
[]
["Avec"]
[]
["Ti,n","Température intérieure au moment n"]
["Ti,(n-1)","Température intérieure au moment n-1, soit 5 minutes plus tôt"]
["Tsoufflage,n","Température de soufflage au moment n"]
["Treprise,n","Température de reprise au moment n, Treprise,n=Ti,(n-1)"]
["DTocc,n","Elévation de température due aux occupants au moment n"]
[]
["DTocc,n=Pocc*5min/(CpAir*Mamphi)"]
["Pocc","Puissance totale apportée par les occupants"]
[]
[]
["Mamphi","masse d'air contenue dans l'amphithéâtre"]
["Mentrant","masse d'air soufflée"]
["Msortant","masse d'air reprise"]
["Mentrant=Msortant=rhoair*DébitVolumique*5min"]
[]
[]
[]
[]
[]
[]
["Equipements"]
[]
["Puissance batterie"]
[]
["Pbatterie,n=0,34*débit(m3/h)*(Tsoufflage,n-Textérieure,n)"]
[]
[]
["Débit batterie eau chaude"]
["Qv,n=Pbatterie,n/(CpEau*(TEauEntrée,n-TeauSortie,n)"]
[]
["Avec"]
["Qv,n","débit volumique au moment n"]
["TEauEntrée","Température de l'eau à l'entrée de l'échangeur, température aller"]
["TEauSortie","Température de l'eau à la sortie de l'échangeur, température retour"]
["CpEau","Capacité calorifique de l'eau"]
[]
[]
[]
[]
[]
["Hygrométrie"]
[]
["hygrométrie,n=MEauI,n/Mamphi"]
[]
["Avec"]
["MEauI,n","Masse d'eau intérieur au moment n"]
["Mamphi","masse d'air contenue dans l'amphithéâtre"]
[]
["MEauI,n=MEauI,(n-1)+MEauEntrant,n+MEauOcc,n-MEauSortant,n"]
["MEauI,(n-1)","Masse d'eau intérieur au moment n-1, soit 5min plus tôt"]
["MEauEntrant,n","Masse d'eau soufflée par la ventilation au moment n"]
["MEauSortant,n","Masse d'eau reprise par la ventilation au moment n"]
["MEauOcc,n","Masse d'eau produite par les occupants au moment n"]
[]
[]
[]
[]
["mélange"]
[]
[]
["debit variable"]

{"sheet":"liste déroulante","index":12,"n_rows":147,"n_cols":4,"rows_kept":147,"cut":false,"hidden":false,"merged":[]}
[]
[null,"heure",null,"oui"]
[null,"00:00:00",null,"non"]
[null,"00:10:00"]
[null,"00:20:00"]
[null,"00:30:00"]
[null,"00:40:00"]
[null,"00:50:00"]
[null,"01:00:00"]
[null,"01:10:00"]
[null,"01:20:00"]
[null,"01:30:00"]
[null,"01:40:00"]
[null,"01:50:00"]
[null,"02:00:00"]
[null,"02:10:00"]
[null,"02:20:00"]
[null,"02:30:00"]
[null,"02:40:00"]
[null,"02:50:00"]
[null,"03:00:00"]
[null,"03:10:00"]
[null,"03:20:00"]
[null,"03:30:00"]
[null,"03:40:00"]
[null,"03:50:00"]
[null,"04:00:00"]
[null,"04:10:00"]
[null,"04:20:00"]
[null,"04:30:00"]
[null,"04:40:00"]
[null,"04:50:00"]
[null,"05:00:00"]
[null,"05:10:00"]
[null,"05:20:00"]
[null,"05:30:00"]
[null,"05:40:00"]
[null,"05:50:00"]
[null,"06:00:00"]
[null,"06:10:00"]
[null,"06:20:00"]
[null,"06:30:00"]
[null,"06:40:00"]
[null,"06:50:00"]
[null,"07:00:00"]
[null,"07:10:00"]
[null,"07:20:00"]
[null,"07:30:00"]
[null,"07:40:00"]
[null,"07:50:00"]
[null,"08:00:00"]
[null,"08:10:00"]
[null,"08:20:00"]
[null,"08:30:00"]
[null,"08:40:00"]
[null,"08:50:00"]
[null,"09:00:00"]
[null,"09:10:00"]
[null,"09:20:00"]
[null,"09:30:00"]
[null,"09:40:00"]
[null,"09:50:00"]
[null,"10:00:00"]
[null,"10:10:00"]
[null,"10:20:00"]
[null,"10:30:00"]
[null,"10:40:00"]
[null,"10:50:00"]
[null,"11:00:00"]
[null,"11:10:00"]
[null,"11:20:00"]
[null,"11:30:00"]
[null,"11:40:00"]
[null,"11:50:00"]
[null,"12:00:00"]
[null,"12:10:00"]
[null,"12:20:00"]
[null,"12:30:00"]
[null,"12:40:00"]
[null,"12:50:00"]
[null,"13:00:00"]
[null,"13:10:00"]
[null,"13:20:00"]
[null,"13:30:00"]
[null,"13:40:00"]
[null,"13:50:00"]
[null,"14:00:00"]
[null,"14:10:00"]
[null,"14:20:00"]
[null,"14:30:00"]
[null,"14:40:00"]
[null,"14:50:00"]
[null,"15:00:00"]
[null,"15:10:00"]
[null,"15:20:00"]
[null,"15:30:00"]
[null,"15:40:00"]
[null,"15:50:00"]
[null,"16:00:00"]
[null,"16:10:00"]
[null,"16:20:00"]
[null,"16:30:00"]
[null,"16:40:00"]
[null,"16:50:00"]
[null,"17:00:00"]
[null,"17:10:00"]
[null,"17:20:00"]
[null,"17:30:00"]
[null,"17:40:00"]
[null,"17:50:00"]
[null,"18:00:00"]
[null,"18:10:00"]
[null,"18:20:00"]
[null,"18:30:00"]
[null,"18:40:00"]
[null,"18:50:00"]
[null,"19:00:00"]
[null,"19:10:00"]
[null,"19:20:00"]
[null,"19:30:00"]
[null,"19:40:00"]
[null,"19:50:00"]
[null,"20:00:00"]
[null,"20:10:00"]
[null,"20:20:00"]
[null,"20:30:00"]
[null,"20:40:00"]
[null,"20:50:00"]
[null,"21:00:00"]
[null,"21:10:00"]
[null,"21:20:00"]
[null,"21:30:00"]
[null,"21:40:00"]
[null,"21:50:00"]
[null,"22:00:00"]
[null,"22:10:00"]
[null,"22:20:00"]
[null,"22:30:00"]
[null,"22:40:00"]
[null,"22:50:00"]
[null,"23:00:00"]
[null,"23:10:00"]
[null,"23:20:00"]
[null,"23:30:00"]
[null,"23:40:00"]
[null,"23:50:00"]
[null,1]

{"sheet":"Feuil1","index":13,"n_rows":14,"n_cols":10,"rows_kept":14,"cut":false,"hidden":false,"merged":[]}
[null,null,null,null,null,null,null,null,"numerateur",{"$f":"C5-D5-H5*E5","v":388.30632348268193}]
[null,null,null,null,null,null,null,null,"deno",{"$f":"((B5-D5)/1000000)*G5*H5","v":-9.532888465204957E-2}]
[]
[null,"c02an","co2l","co2l-1","co2prod","debit","roair","a","q"]
[null,600,1700,700,0.77,null,{"$f":"roair","v":1.2},{"$f":"1000000/masseair","v":794.40737210041311},{"$f":"$J$1/$J$2","v":-4073.3333333333335}]
[null,600,1700,4000,0.77,null,1.2,794.40737210041311,{"$f":"$J$1/$J$2","v":-4073.3333333333335}]
[null,600,1700,1800,0.77,null,1.2,794.40737210041311,{"$f":"$J$1/$J$2","v":-4073.3333333333335}]
[null,600,1700,1800,0.77,null,1.2,794.40737210041311,-4073.3333333333335]
[null,600,1700,1800,0.77,null,1.2,794.40737210041311,-4073.3333333333335]
[null,600,1700,1800,0.77,null,1.2,794.40737210041311,-4073.3333333333335]
[null,600,1700,1800,0.77,null,1.2,794.40737210041311,-4073.3333333333335]
[null,600,1700,1800,0.77,null,1.2,794.40737210041311,-4073.3333333333335]
[null,600,1700,1800,0.77,null,1.2,794.40737210041311,-4073.3333333333335]
[null,600,1700,1800,0.77,null,1.2,794.40737210041311,-4073.3333333333335]

{"sheet":"Feuil2","index":14,"n_rows":291,"n_cols":7,"rows_kept":291,"cut":false,"hidden":false,"merged":[]}
[]
[]
[]
[null,null,null,null,null,null,"temperature du 12 mai"]
[]
[null,null,"2014-05-12",null,null,null,10.6]
[null,null,"2014-05-12T00:10:00",null,null,null,10.6]
[null,null,"2014-05-12T00:20:00",null,null,null,10.6]
[null,null,"2014-05-12T00:30:00",null,null,null,10.6]
[null,null,"2014-05-12T00:40:00",null,null,null,10.6]
[null,null,"2014-05-12T00:50:00",null,null,null,10.6]
[null,null,"2014-05-12T01:00:00",null,null,null,10.6]
[null,null,"2014-05-12T01:10:00",null,null,null,10.6]
[null,null,"2014-05-12T01:20:00",null,null,null,10.5]
[null,null,"2014-05-12T01:30:00",null,null,null,10.5]
[null,null,"2014-05-12T01:40:00",null,null,null,10.4]
[null,null,"2014-05-12T01:50:00",null,null,null,10.4]
[null,null,"2014-05-12T02:00:00",null,null,null,10.3333333333333]
[null,null,"2014-05-12T02:10:00",null,null,null,10.283333333333299]
[null,null,"2014-05-12T02:20:00",null,null,null,10.233333333333301]
[null,null,"2014-05-12T02:30:00",null,null,null,10.1833333333333]
[null,null,"2014-05-12T02:40:00",null,null,null,10.199999999999999]
[null,null,"2014-05-12T02:50:00",null,null,null,10.199999999999999]
[null,null,"2014-05-12T03:00:00",null,null,null,10.199999999999999]
[null,null,"2014-05-12T03:10:00",null,null,null,10.199999999999999]
[null,null,"2014-05-12T03:20:00",null,null,null,10.199999999999999]
[null,null,"2014-05-12T03:30:00",null,null,null,10.199999999999999]
[null,null,"2014-05-12T03:40:00",null,null,null,10.1]
[null,null,"2014-05-12T03:50:00",null,null,null,10.1]
[null,null,"2014-05-12T04:00:00",null,null,null,10]
[null,null,"2014-05-12T04:10:00",null,null,null,10]
[null,null,"2014-05-12T04:20:00",null,null,null,9.9]
[null,null,"2014-05-12T04:30:00",null,null,null,9.9]
[null,null,"2014-05-12T04:40:00",null,null,null,9.9]
[null,null,"2014-05-12T04:50:00",null,null,null,9.9]
[null,null,"2014-05-12T05:00:00",null,null,null,9.8000000000000007]
[null,null,"2014-05-12T05:10:00",null,null,null,9.8000000000000007]
[null,null,"2014-05-12T05:20:00",null,null,null,9.8000000000000007]
[null,null,"2014-05-12T05:30:00",null,null,null,9.8000000000000007]
[null,null,"2014-05-12T05:40:00",null,null,null,9.8000000000000007]
[null,null,"2014-05-12T05:50:00",null,null,null,9.8000000000000007]
[null,null,"2014-05-12T06:00:00",null,null,null,9.8000000000000007]
[null,null,"2014-05-12T06:10:00",null,null,null,9.8000000000000007]
[null,null,"2014-05-12T06:20:00",null,null,null,9.6999999999999993]
[null,null,"2014-05-12T06:30:00",null,null,null,9.6999999999999993]
[null,null,"2014-05-12T06:40:00",null,null,null,9.6999999999999993]
[null,null,"2014-05-12T06:50:00",null,null,null,9.6999999999999993]
[null,null,"2014-05-12T07:00:00",null,null,null,9.5]
[null,null,"2014-05-12T07:10:00",null,null,null,9.5]
[null,null,"2014-05-12T07:20:00",null,null,null,9.5]
[null,null,"2014-05-12T07:30:00",null,null,null,9.5]
[null,null,"2014-05-12T07:40:00",null,null,null,9.4]
[null,null,"2014-05-12T07:50:00",null,null,null,9.4]
[null,null,"2014-05-12T08:00:00",null,null,null,9.3000000000000007]
[null,null,"2014-05-12T08:10:00",null,null,null,9.3000000000000007]
[null,null,"2014-05-12T08:20:00",null,null,null,9.1]
[null,null,"2014-05-12T08:30:00",null,null,null,9.1]
[null,null,"2014-05-12T08:40:00",null,null,null,9.1]
[null,null,"2014-05-12T08:50:00",null,null,null,9.1]
[null,null,"2014-05-12T09:00:00",null,null,null,9]
[null,null,"2014-05-12T09:10:00",null,null,null,9]
[null,null,"2014-05-12T09:20:00",null,null,null,9]
[null,null,"2014-05-12T09:30:00",null,null,null,9]
[null,null,"2014-05-12T09:40:00",null,null,null,9]
[null,null,"2014-05-12T09:50:00",null,null,null,9]
[null,null,"2014-05-12T10:00:00",null,null,null,9]
[null,null,"2014-05-12T10:10:00",null,null,null,9]
[null,null,"2014-05-12T10:20:00",null,null,null,9]
[null,null,"2014-05-12T10:30:00",null,null,null,9]
[null,null,"2014-05-12T10:40:00",null,null,null,9.1]
[null,null,"2014-05-12T10:50:00",null,null,null,9.1]
[null,null,"2014-05-12T11:00:00",null,null,null,9.1999999999999993]
[null,null,"2014-05-12T11:10:00",null,null,null,9.1999999999999993]
[null,null,"2014-05-12T11:20:00",null,null,null,9.1999999999999993]
[null,null,"2014-05-12T11:30:00",null,null,null,9.1999999999999993]
[null,null,"2014-05-12T11:40:00",null,null,null,9.1]
[null,null,"2014-05-12T11:50:00",null,null,null,9.1]
[null,null,"2014-05-12T12:00:00",null,null,null,9]
[null,null,"2014-05-12T12:10:00",null,null,null,9]
[null,null,"2014-05-12T12:20:00",null,null,null,9.1999999999999993]
[null,null,"2014-05-12T12:30:00",null,null,null,9.1999999999999993]
[null,null,"2014-05-12T12:40:00",null,null,null,9.1999999999999993]
[null,null,"2014-05-12T12:50:00",null,null,null,9.1999999999999993]
[null,null,"2014-05-12T13:00:00",null,null,null,9.3000000000000007]
[null,null,"2014-05-12T13:10:00",null,null,null,9.3000000000000007]
[null,null,"2014-05-12T13:20:00",null,null,null,9.4]
[null,null,"2014-05-12T13:30:00",null,null,null,9.4]
[null,null,"2014-05-12T13:40:00",null,null,null,9.5]
[null,null,"2014-05-12T13:50:00",null,null,null,9.5]
[null,null,"2014-05-12T14:00:00",null,null,null,9.5]
[null,null,"2014-05-12T14:10:00",null,null,null,9.5]
[null,null,"2014-05-12T14:20:00",null,null,null,9.6]
[null,null,"2014-05-12T14:30:00",null,null,null,9.6]
[null,null,"2014-05-12T14:40:00",null,null,null,9.6]
[null,null,"2014-05-12T14:50:00",null,null,null,9.6]
[null,null,"2014-05-12T15:00:00",null,null,null,9.6]
[null,null,"2014-05-12T15:10:00",null,null,null,9.6]
[null,null,"2014-05-12T15:20:00",null,null,null,9.6999999999999993]
[null,null,"2014-05-12T15:30:00",null,null,null,9.6999999999999993]
[null,null,"2014-05-12T15:40:00",null,null,null,9.9]
[null,null,"2014-05-12T15:50:00",null,null,null,9.9]
[null,null,"2014-05-12T16:00:00",null,null,null,10.199999999999999]
[null,null,"2014-05-12T16:10:00",null,null,null,10.199999999999999]
[null,null,"2014-05-12T16:20:00",null,null,null,10.199999999999999]
[null,null,"2014-05-12T16:30:00",null,null,null,10.199999999999999]
[null,null,"2014-05-12T16:40:00",null,null,null,10.199999999999999]
[null,null,"2014-05-12T16:50:00",null,null,null,10.199999999999999]
[null,null,"2014-05-12T17:00:00",null,null,null,10.4]
[null,null,"2014-05-12T17:10:00",null,null,null,10.4]
[null,null,"2014-05-12T17:20:00",null,null,null,10.5]
[null,null,"2014-05-12T17:30:00",null,null,null,10.5]
[null,null,"2014-05-12T17:40:00",null,null,null,10.7]
[null,null,"2014-05-12T17:50:00",null,null,null,10.7]
[null,null,"2014-05-12T18:00:00",null,null,null,11]
[null,null,"2014-05-12T18:10:00",null,null,null,11]
[null,null,"2014-05-12T18:20:00",null,null,null,11.3]
[null,null,"2014-05-12T18:30:00",null,null,null,11.3]
[null,null,"2014-05-12T18:40:00",null,null,null,11.3]
[null,null,"2014-05-12T18:50:00",null,null,null,11.3]
[null,null,"2014-05-12T19:00:00",null,null,null,11.3]
[null,null,"2014-05-12T19:10:00",null,null,null,11.3]
[null,null,"2014-05-12T19:20:00",null,null,null,11.3]
[null,null,"2014-05-12T19:30:00",null,null,null,11.3]
[null,null,"2014-05-12T19:40:00",null,null,null,11.7]
[null,null,"2014-05-12T19:50:00",null,null,null,11.7]
[null,null,"2014-05-12T20:00:00",null,null,null,12.1]
[null,null,"2014-05-12T20:10:00",null,null,null,12.1]
[null,null,"2014-05-12T20:20:00",null,null,null,13]
[null,null,"2014-05-12T20:30:00",null,null,null,13]
[null,null,"2014-05-12T20:40:00",null,null,null,13.2]
[null,null,"2014-05-12T20:50:00",null,null,null,13.2]
[null,null,"2014-05-12T21:00:00",null,null,null,13.3]
[null,null,"2014-05-12T21:10:00",null,null,null,13.3]
[null,null,"2014-05-12T21:20:00",null,null,null,13.5]
[null,null,"2014-05-12T21:30:00",null,null,null,13.5]
[null,null,"2014-05-12T21:40:00",null,null,null,13.8]
[null,null,"2014-05-12T21:50:00",null,null,null,13.8]
[null,null,"2014-05-12T22:00:00",null,null,null,14.3]
[null,null,"2014-05-12T22:10:00",null,null,null,14.3]
[null,null,"2014-05-12T22:20:00",null,null,null,14.9]
[null,null,"2014-05-12T22:30:00",null,null,null,14.9]
[null,null,"2014-05-12T22:40:00",null,null,null,14.7]
[null,null,"2014-05-12T22:50:00",null,null,null,14.7]
[null,null,"2014-05-12T23:00:00",null,null,null,14.5]
[null,null,"2014-05-12T23:10:00",null,null,null,14.5]
[null,null,"2014-05-12T23:20:00",null,null,null,13.8]
[null,null,"2014-05-12T23:30:00",null,null,null,13.8]
[null,null,"2014-05-12T23:40:00",null,null,null,13.7]
[null,null,null,null,null,null,13.7]
[null,null,null,null,null,null,13.2]
[null,null,null,null,null,null,13.2]
[null,null,null,null,null,null,12.7]
[null,null,null,null,null,null,12.7]
[null,null,null,null,null,null,12.8]
[null,null,null,null,null,null,12.8]
[null,null,null,null,null,null,13.6]
[null,null,null,null,null,null,13.6]
[null,null,null,null,null,null,15]
[null,null,null,null,null,null,15]
[null,null,null,null,null,null,15.2]
[null,null,null,null,null,null,15.2]
[null,null,null,null,null,null,15.5]
[null,null,null,null,null,null,15.5]
[null,null,null,null,null,null,15.7]
[null,null,null,null,null,null,15.7]
[null,null,null,null,null,null,16]
[null,null,null,null,null,null,16]
[null,null,null,null,null,null,15]
[null,null,null,null,null,null,15]
[null,null,null,null,null,null,15.4]
[null,null,null,null,null,null,15.4]
[null,null,null,null,null,null,16]
[null,null,null,null,null,null,16]
[null,null,null,null,null,null,15.5]
[null,null,null,null,null,null,15.5]
[null,null,null,null,null,null,15.5]
[null,null,null,null,null,null,15.5]
[null,null,null,null,null,null,15.9]
[null,null,null,null,null,null,15.9]
[null,null,null,null,null,null,15.9]
[null,null,null,null,null,null,15.9]
[null,null,null,null,null,null,15.5]
[null,null,null,null,null,null,15.5]
[null,null,null,null,null,null,15.4]
[null,null,null,null,null,null,15.4]
[null,null,null,null,null,null,15.6]
[null,null,null,null,null,null,15.6]
[null,null,null,null,null,null,16]
[null,null,null,null,null,null,16]
[null,null,null,null,null,null,16.100000000000001]
[null,null,null,null,null,null,16.100000000000001]
[null,null,null,null,null,null,16.399999999999999]
[null,null,null,null,null,null,16.399999999999999]
[null,null,null,null,null,null,16.100000000000001]
[null,null,null,null,null,null,16.100000000000001]
[null,null,null,null,null,null,16.2]
[null,null,null,null,null,null,16.2]
[null,null,null,null,null,null,16.3]
[null,null,null,null,null,null,16.3]
[null,null,null,null,null,null,16.3]
[null,null,null,null,null,null,16.3]
[null,null,null,null,null,null,16.399999999999999]
[null,null,null,null,null,null,16.399999999999999]
[null,null,null,null,null,null,16.399999999999999]
[null,null,null,null,null,null,16.399999999999999]
[null,null,null,null,null,null,16.2]
[null,null,null,null,null,null,16.2]
[null,null,null,null,null,null,16]
[null,null,null,null,null,null,16]
[null,null,null,null,null,null,15.8]
[null,null,null,null,null,null,15.8]
[null,null,null,null,null,null,15.7]
[null,null,null,null,null,null,15.7]
[null,null,null,null,null,null,16]
[null,null,null,null,null,null,16]
[null,null,null,null,null,null,15.9]
[null,null,null,null,null,null,15.9]
[null,null,null,null,null,null,16]
[null,null,null,null,null,null,16]
[null,null,null,null,null,null,15.8]
[null,null,null,null,null,null,15.8]
[null,null,null,null,null,null,15.7]
[null,null,null,null,null,null,15.7]
[null,null,null,null,null,null,15.7]
[null,null,null,null,null,null,15.7]
[null,null,null,null,null,null,15.2]
[null,null,null,null,null,null,15.2]
[null,null,null,null,null,null,15.2]
[null,null,null,null,null,null,15.2]
[null,null,null,null,null,null,15]
[null,null,null,null,null,null,15]
[null,null,null,null,null,null,15]
[null,null,null,null,null,null,15]
[null,null,null,null,null,null,14.9]
[null,null,null,null,null,null,14.9]
[null,null,null,null,null,null,14.8]
[null,null,null,null,null,null,14.8]
[null,null,null,null,null,null,14.5]
[null,null,null,null,null,null,14.5]
[null,null,null,null,null,null,14.4]
[null,null,null,null,null,null,14.4]
[null,null,null,null,null,null,14.3]
[null,null,null,null,null,null,14.3]
[null,null,null,null,null,null,14.2]
[null,null,null,null,null,null,14.2]
[null,null,null,null,null,null,14]
[null,null,null,null,null,null,14]
[null,null,null,null,null,null,13.8]
[null,null,null,null,null,null,13.8]
[null,null,null,null,null,null,13.6]
[null,null,null,null,null,null,13.6]
[null,null,null,null,null,null,13.5]
[null,null,null,null,null,null,13.5]
[null,null,null,null,null,null,13.3]
[null,null,null,null,null,null,13.3]
[null,null,null,null,null,null,13.2]
[null,null,null,null,null,null,13.2]
[null,null,null,null,null,null,13.1]
[null,null,null,null,null,null,13.1]
[null,null,null,null,null,null,13]
[null,null,null,null,null,null,13]
[null,null,null,null,null,null,12.8]
[null,null,null,null,null,null,12.8]
[null,null,null,null,null,null,12.7]
[null,null,null,null,null,null,12.7]
[null,null,null,null,null,null,12.5]
[null,null,null,null,null,null,12.5]
[null,null,null,null,null,null,12.4]
[null,null,null,null,null,null,12.4]
[null,null,null,null,null,null,12.2]
[null,null,null,null,null,null,12.2]
[null,null,null,null,null,null,12.1]
[null,null,null,null,null,null,12.1]
[null,null,null,null,null,null,12]
[null,null,null,null,null,null,12]
[null,null,null,null,null,null,11.9]
[null,null,null,null,null,null,11.9]
[null,null,null,null,null,null,11.8]
[null,null,null,null,null,null,11.8]
[null,null,null,null,null,null,11.7]
[null,null,null,null,null,null,11.7]
[null,null,null,null,null,null,11.7]
[null,null,null,null,null,null,11.7]
[null,null,null,null,null,null,11.6]
[null,null,null,null,null,null,11.6]
[null,null,null,null,null,null,11.6]
[null,null,null,null,null,null,11.6]
[null,null,null,null,null,null,11.5]
[null,null,null,null,null,null,11.5]
[null,null,null,null,null,null,11.4]
[null,null,null,null,null,null,11.4]