{"text_format":"1","workbook":"xlsx","n_sheets":2,"sheets":["BdD","EDIT"],"not_rendered":{"charts":0,"images":0,"macros":0,"external_links":0,"defined_names":1,"comments":0,"pivot_tables":0},"unopened":[],"bounds":{"document_bytes":16777216,"sheet_cells":100000,"rows_first":2000,"rows_last":500,"rows_between":2000,"halvings":0,"cell_chars":16384,"cell_head_chars":4096},"cells_cut":0,"cells_raw":0,"read":"whole","date_system":"1900"}

{"sheet":"BdD","index":0,"n_rows":65,"n_cols":12,"rows_kept":65,"cut":false,"hidden":false,"merged":[]}
["Nom","Info_1","Info_2","Info_3","Info_4","Info_5","Info_6","Info_7","Info_8",null,"Codage","Liste ref"]
["Marcel","Limoges","Blanc","Charente","Juillet","Q","Séquoïa","AA_43",43,null,{"$f":"A2&\"_\"&COUNTIF($A$2:A2,A2)","v":"Marcel_1"},"Roger"]
["Paul","Montpellier","Marron","Calvados","Mai","O","Tremble","AA_47",63,null,{"$f":"A3&\"_\"&COUNTIF($A$2:A3,A3)","v":"Paul_1"},"Paul"]
["Paul","Marseille","Azur","Aube","Août","l","Peuplier","AA_34",1,null,{"$f":"A4&\"_\"&COUNTIF($A$2:A4,A4)","v":"Paul_2"},"Marcel"]
["Gilles","Bézier","Indigo","Aube","Mai","G","Pin","AA_64",42,null,{"$f":"A5&\"_\"&COUNTIF($A$2:A5,A5)","v":"Gilles_1"},"André"]
["Lucas","Nice","Chrome","Ain","Décembre","W","If","AA_06",4,null,{"$f":"A6&\"_\"&COUNTIF($A$2:A6,A6)","v":"Lucas_1"},"Kevin"]
["Roger","Paris","Beige","Alpes De Haute Provence","Avril","D","Frêne","AA_10",56,null,{"$f":"A7&\"_\"&COUNTIF($A$2:A7,A7)","v":"Roger_1"},"Simone"]
["Marcel","Perpignan","Noir","Cantal","Février","X","Sycomore","AA_56",62,null,{"$f":"A8&\"_\"&COUNTIF($A$2:A8,A8)","v":"Marcel_2"},"Léa"]
["André","Rennes","Bleu Ciel","Dordogne","Février","A","Chêne","AA_54",47,null,{"$f":"A9&\"_\"&COUNTIF($A$2:A9,A9)","v":"André_1"},"Lucas"]
["Paul","Angoulème","Brun","Ain","Mars","Y","Tuyas","AA_45",12,null,{"$f":"A10&\"_\"&COUNTIF($A$2:A10,A10)","v":"Paul_3"},"Eric"]
["Simone","Narbonne","Jaune","Charente Maritime","Août","P","Baobab","AA_39",52,null,{"$f":"A11&\"_\"&COUNTIF($A$2:A11,A11)","v":"Simone_1"},"Gilles"]
["Eric","Pau","Beige","Ardennes","Juillet","M","Erable","AA_53",36,null,{"$f":"A12&\"_\"&COUNTIF($A$2:A12,A12)","v":"Eric_1"}]
["Lucas","Soisson","Bleu Roi","Ariege","Janvier","H","Mélèze","AA_55",9,null,{"$f":"A13&\"_\"&COUNTIF($A$2:A13,A13)","v":"Lucas_2"}]
["Eric","Paris","Indigo","Corse","Octobre","F","Sorbier","AA_48",30,null,{"$f":"A14&\"_\"&COUNTIF($A$2:A14,A14)","v":"Eric_2"}]
["Simone","Bézier","Cyan","Charente Maritime","Janvier","S","Palmier","AA_36",50,null,{"$f":"A15&\"_\"&COUNTIF($A$2:A15,A15)","v":"Simone_2"}]
["Kevin","Marseille","Noir","Aisne","Octobre","K","Olivier","AA_35",26,null,{"$f":"A16&\"_\"&COUNTIF($A$2:A16,A16)","v":"Kevin_1"}]
["André","Lyon","Bleu Roi","Aude","Janvier","l","Peuplier","AA_11",34,null,{"$f":"A17&\"_\"&COUNTIF($A$2:A17,A17)","v":"André_2"}]
["Lucas","Chaumont","Bleu Ciel","Cher","Novembre","H","Mélèze","AA_07",54,null,{"$f":"A18&\"_\"&COUNTIF($A$2:A18,A18)","v":"Lucas_3"}]
["Eric","Toulouse","Turquoise","Alpes Maritimes","Septembre","Y","Tuyas","AA_31",57,null,{"$f":"A19&\"_\"&COUNTIF($A$2:A19,A19)","v":"Eric_3"}]
["Lucas","Biarritz","Isabelle","Cantal","Octobre","O","Tremble","AA_27",23,null,{"$f":"A20&\"_\"&COUNTIF($A$2:A20,A20)","v":"Lucas_4"}]
{"$rows_left_out":46}
{"sheet":"EDIT","index":1,"n_rows":151,"n_cols":9,"rows_kept":151,"cut":false,"hidden":false,"merged":[]}
["Roger","<<< Sélectionner le nom"]
["INFO_1","INFO_2","INFO_3","INFO_4","INFO_5","INFO_6","INFO_7","INFO_8"]
[{"$f":"IF(COUNTIF(BdD!$A:$A,$A$1)>=ROW()-2,INDEX(BdD!B:B,MATCH($A$1&\"_\"&ROW()-2,BdD!$K:$K,0)),\"\")","v":"Paris"},{"$f":"IF(COUNTIF(BdD!$A:$A,$A$1)>=ROW()-2,INDEX(BdD!C:C,MATCH($A$1&\"_\"&ROW()-2,BdD!$K:$K,0)),\"\")","v":"Beige"},{"$f":"IF(COUNTIF(BdD!$A:$A,$A$1)>=ROW()-2,INDEX(BdD!D:D,MATCH($A$1&\"_\"&ROW()-2,BdD!$K:$K,0)),\"\")","v":"Alpes De Haute Provence"},{"$f":"IF(COUNTIF(BdD!$A:$A,$A$1)>=ROW()-2,INDEX(BdD!E:E,MATCH($A$1&\"_\"&ROW()-2,BdD!$K:$K,0)),\"\")","v":"Avril"},{"$f":"IF(COUNTIF(BdD!$A:$A,$A$1)>=ROW()-2,INDEX(BdD!F:F,MATCH($A$1&\"_\"&ROW()-2,BdD!$K:$K,0)),\"\")","v":"D"},{"$f":"IF(COUNTIF(BdD!$A:$A,$A$1)>=ROW()-2,INDEX(BdD!G:G,MATCH($A$1&\"_\"&ROW()-2,BdD!$K:$K,0)),\"\")","v":"Frêne"},{"$f":"IF(COUNTIF(BdD!$A:$A,$A$1)>=ROW()-2,INDEX(BdD!H:H,MATCH($A$1&\"_\"&ROW()-2,BdD!$K:$K,0)),\"\")","v":"AA_10"},{"$f":"IF(COUNTIF(BdD!$A:$A,$A$1)>=ROW()-2,INDEX(BdD!I:I,MATCH($A$1&\"_\"&ROW()-2,BdD!$K:$K,0)),\"\")","v":56}]
[{"$f":"IF(COUNTIF(BdD!$A:$A,$A$1)>=ROW()-2,INDEX(BdD!B:B,MATCH($A$1&\"_\"&ROW()-2,BdD!$K:$K,0)),\"\")","v":"Pau"},{"$f":"IF(COUNTIF(BdD!$A:$A,$A$1)>=ROW()-2,INDEX(BdD!C:C,MATCH($A$1&\"_\"&ROW()-2,BdD!$K:$K,0)),\"\")","v":"Jaune"},{"$f":"IF(COUNTIF(BdD!$A:$A,$A$1)>=ROW()-2,INDEX(BdD!D:D,MATCH($A$1&\"_\"&ROW()-2,BdD!$K:$K,0)),\"\")","v":"Bouches Du Rhone"},{"$f":"IF(COUNTIF(BdD!$A:$A,$A$1)>=ROW()-2,INDEX(BdD!E:E,MATCH($A$1&\"_\"&ROW()-2,BdD!$K:$K,0)),\"\")","v":"Février"},{"$f":"IF(COUNTIF(BdD!$A:$A,$A$1)>=ROW()-2,INDEX(BdD!F:F,MATCH($A$1&\"_\"&ROW()-2,BdD!$K:$K,0)),\"\")","v":"C"},{"$f":"IF(COUNTIF(BdD!$A:$A,$A$1)>=ROW()-2,INDEX(BdD!G:G,MATCH($A$1&\"_\"&ROW()-2,BdD!$K:$K,0)),\"\")","v":"Bouleau"},{"$f":"IF(COUNTIF(BdD!$A:$A,$A$1)>=ROW()-2,INDEX(BdD!H:H,MATCH($A$1&\"_\"&ROW()-2,BdD!$K:$K,0)),\"\")","v":"AA_58"},{"$f":"IF(COUNTIF(BdD!$A:$A,$A$1)>=ROW()-2,INDEX(BdD!I:I,MATCH($A$1&\"_\"&ROW()-2,BdD!$K:$K,0)),\"\")","v":24}]
[{"$f":"IF(COUNTIF(BdD!$A:$A,$A$1)>=ROW()-2,INDEX(BdD!B:B,MATCH($A$1&\"_\"&ROW()-2,BdD!$K:$K,0)),\"\")","v":"Nantes"},{"$f":"IF(COUNTIF(BdD!$A:$A,$A$1)>=ROW()-2,INDEX(BdD!C:C,MATCH($A$1&\"_\"&ROW()-2,BdD!$K:$K,0)),\"\")","v":"Argent"},{"$f":"IF(COUNTIF(BdD!$A:$A,$A$1)>=ROW()-2,INDEX(BdD!D:D,MATCH($A$1&\"_\"&ROW()-2,BdD!$K:$K,0)),\"\")","v":"Corse"},{"$f":"IF(COUNTIF(BdD!$A:$A,$A$1)>=ROW()-2,INDEX(BdD!E:E,MATCH($A$1&\"_\"&ROW()-2,BdD!$K:$K,0)),\"\")","v":"Décembre"},{"$f":"IF(COUNTIF(BdD!$A:$A,$A$1)>=ROW()-2,INDEX(BdD!F:F,MATCH($A$1&\"_\"&ROW()-2,BdD!$K:$K,0)),\"\")","v":"I"},{"$f":"IF(COUNTIF(BdD!$A:$A,$A$1)>=ROW()-2,INDEX(BdD!G:G,MATCH($A$1&\"_\"&ROW()-2,BdD!$K:$K,0)),\"\")","v":"Epicéa"},{"$f":"IF(COUNTIF(BdD!$A:$A,$A$1)>=ROW()-2,INDEX(BdD!H:H,MATCH($A$1&\"_\"&ROW()-2,BdD!$K:$K,0)),\"\")","v":"AA_62"},{"$f":"IF(COUNTIF(BdD!$A:$A,$A$1)>=ROW()-2,INDEX(BdD!I:I,MATCH($A$1&\"_\"&ROW()-2,BdD!$K:$K,0)),\"\")","v":39}]
[{"$f":"IF(COUNTIF(BdD!$A:$A,$A$1)>=ROW()-2,INDEX(BdD!B:B,MATCH($A$1&\"_\"&ROW()-2,BdD!$K:$K,0)),\"\")","v":"Toulouse"},{"$f":"IF(COUNTIF(BdD!$A:$A,$A$1)>=ROW()-2,INDEX(BdD!C:C,MATCH($A$1&\"_\"&ROW()-2,BdD!$K:$K,0)),\"\")","v":"Saumon"},{"$f":"IF(COUNTIF(BdD!$A:$A,$A$1)>=ROW()-2,INDEX(BdD!D:D,MATCH($A$1&\"_\"&ROW()-2,BdD!$K:$K,0)),\"\")","v":"Ardeche"},{"$f":"IF(COUNTIF(BdD!$A:$A,$A$1)>=ROW()-2,INDEX(BdD!E:E,MATCH($A$1&\"_\"&ROW()-2,BdD!$K:$K,0)),\"\")","v":"Mars"},{"$f":"IF(COUNTIF(BdD!$A:$A,$A$1)>=ROW()-2,INDEX(BdD!F:F,MATCH($A$1&\"_\"&ROW()-2,BdD!$K:$K,0)),\"\")","v":"A"},{"$f":"IF(COUNTIF(BdD!$A:$A,$A$1)>=ROW()-2,INDEX(BdD!G:G,MATCH($A$1&\"_\"&ROW()-2,BdD!$K:$K,0)),\"\")","v":"Chêne"},{"$f":"IF(COUNTIF(BdD!$A:$A,$A$1)>=ROW()-2,INDEX(BdD!H:H,MATCH($A$1&\"_\"&ROW()-2,BdD!$K:$K,0)),\"\")","v":"AA_51"},{"$f":"IF(COUNTIF(BdD!$A:$A,$A$1)>=ROW()-2,INDEX(BdD!I:I,MATCH($A$1&\"_\"&ROW()-2,BdD!$K:$K,0)),\"\")","v":21},"Voir le codage en colonne K de BdD"]
[{"$f":"IF(COUNTIF(BdD!$A:$A,$A$1)>=ROW()-2,INDEX(BdD!B:B,MATCH($A$1&\"_\"&ROW()-2,BdD!$K:$K,0)),\"\")","v":"Nantes"},{"$f":"IF(COUNTIF(BdD!$A:$A,$A$1)>=ROW()-2,INDEX(BdD!C:C,MATCH($A$1&\"_\"&ROW()-2,BdD!$K:$K,0)),\"\")","v":"Magenta"},{"$f":"IF(COUNTIF(BdD!$A:$A,$A$1)>=ROW()-2,INDEX(BdD!D:D,MATCH($A$1&\"_\"&ROW()-2,BdD!$K:$K,0)),\"\")","v":"Aisne"},{"$f":"IF(COUNTIF(BdD!$A:$A,$A$1)>=ROW()-2,INDEX(BdD!E:E,MATCH($A$1&\"_\"&ROW()-2,BdD!$K:$K,0)),\"\")","v":"Avril"},{"$f":"IF(COUNTIF(BdD!$A:$A,$A$1)>=ROW()-2,INDEX(BdD!F:F,MATCH($A$1&\"_\"&ROW()-2,BdD!$K:$K,0)),\"\")","v":"I"},{"$f":"IF(COUNTIF(BdD!$A:$A,$A$1)>=ROW()-2,INDEX(BdD!G:G,MATCH($A$1&\"_\"&ROW()-2,BdD!$K:$K,0)),\"\")","v":"Epicéa"},{"$f":"IF(COUNTIF(BdD!$A:$A,$A$1)>=ROW()-2,INDEX(BdD!H:H,MATCH($A$1&\"_\"&ROW()-2,BdD!$K:$K,0)),\"\")","v":"AA_26"},{"$f":"IF(COUNTIF(BdD!$A:$A,$A$1)>=ROW()-2,INDEX(BdD!I:I,MATCH($A$1&\"_\"&ROW()-2,BdD!$K:$K,0)),\"\")","v":33},"La liste de ref est nommée Ref pour validation en A1"]
[{"$f":"IF(COUNTIF(BdD!$A:$A,$A$1)>=ROW()-2,INDEX(BdD!B:B,MATCH($A$1&\"_\"&ROW()-2,BdD!$K:$K,0)),\"\")","v":"Grasse"},{"$f":"IF(COUNTIF(BdD!$A:$A,$A$1)>=ROW()-2,INDEX(BdD!C:C,MATCH($A$1&\"_\"&ROW()-2,BdD!$K:$K,0)),\"\")","v":"Noir"},{"$f":"IF(COUNTIF(BdD!$A:$A,$A$1)>=ROW()-2,INDEX(BdD!D:D,MATCH($A$1&\"_\"&ROW()-2,BdD!$K:$K,0)),\"\")","v":"Cher"},{"$f":"IF(COUNTIF(BdD!$A:$A,$A$1)>=ROW()-2,INDEX(BdD!E:E,MATCH($A$1&\"_\"&ROW()-2,BdD!$K:$K,0)),\"\")","v":"Avril"},{"$f":"IF(COUNTIF(BdD!$A:$A,$A$1)>=ROW()-2,INDEX(BdD!F:F,MATCH($A$1&\"_\"&ROW()-2,BdD!$K:$K,0)),\"\")","v":"C"},{"$f":"IF(COUNTIF(BdD!$A:$A,$A$1)>=ROW()-2,INDEX(BdD!G:G,MATCH($A$1&\"_\"&ROW()-2,BdD!$K:$K,0)),\"\")","v":"Bouleau"},{"$f":"IF(COUNTIF(BdD!$A:$A,$A$1)>=ROW()-2,INDEX(BdD!H:H,MATCH($A$1&\"_\"&ROW()-2,BdD!$K:$K,0)),\"\")","v":"AA_16"},{"$f":"IF(COUNTIF(BdD!$A:$A,$A$1)>=ROW()-2,INDEX(BdD!I:I,MATCH($A$1&\"_\"&ROW()-2,BdD!$K:$K,0)),\"\")","v":8}]
[{"$f":"IF(COUNTIF(BdD!$A:$A,$A$1)>=ROW()-2,INDEX(BdD!B:B,MATCH($A$1&\"_\"&ROW()-2,BdD!$K:$K,0)),\"\")","v":"Toulouse"},{"$f":"IF(COUNTIF(BdD!$A:$A,$A$1)>=ROW()-2,INDEX(BdD!C:C,MATCH($A$1&\"_\"&ROW()-2,BdD!$K:$K,0)),\"\")","v":"Isabelle"},{"$f":"IF(COUNTIF(BdD!$A:$A,$A$1)>=ROW()-2,INDEX(BdD!D:D,MATCH($A$1&\"_\"&ROW()-2,BdD!$K:$K,0)),\"\")","v":"Alpes De Haute Provence"},{"$f":"IF(COUNTIF(BdD!$A:$A,$A$1)>=ROW()-2,INDEX(BdD!E:E,MATCH($A$1&\"_\"&ROW()-2,BdD!$K:$K,0)),\"\")","v":"Août"},{"$f":"IF(COUNTIF(BdD!$A:$A,$A$1)>=ROW()-2,INDEX(BdD!F:F,MATCH($A$1&\"_\"&ROW()-2,BdD!$K:$K,0)),\"\")","v":"F"},{"$f":"IF(COUNTIF(BdD!$A:$A,$A$1)>=ROW()-2,INDEX(BdD!G:G,MATCH($A$1&\"_\"&ROW()-2,BdD!$K:$K,0)),\"\")","v":"Sorbier"},{"$f":"IF(COUNTIF(BdD!$A:$A,$A$1)>=ROW()-2,INDEX(BdD!H:H,MATCH($A$1&\"_\"&ROW()-2,BdD!$K:$K,0)),\"\")","v":"AA_59"},{"$f":"IF(COUNTIF(BdD!$A:$A,$A$1)>=ROW()-2,INDEX(BdD!I:I,MATCH($A$1&\"_\"&ROW()-2,BdD!$K:$K,0)),\"\")","v":13},"Pour créer un tableau par référence"]
[{"$f":"IF(COUNTIF(BdD!$A:$A,$A$1)>=ROW()-2,INDEX(BdD!B:B,MATCH($A$1&\"_\"&ROW()-2,BdD!$K:$K,0)),\"\")","v":""},{"$f":"IF(COUNTIF(BdD!$A:$A,$A$1)>=ROW()-2,INDEX(BdD!C:C,MATCH($A$1&\"_\"&ROW()-2,BdD!$K:$K,0)),\"\")","v":""},{"$f":"IF(COUNTIF(BdD!$A:$A,$A$1)>=ROW()-2,INDEX(BdD!D:D,MATCH($A$1&\"_\"&ROW()-2,BdD!$K:$K,0)),\"\")","v":""},{"$f":"IF(COUNTIF(BdD!$A:$A,$A$1)>=ROW()-2,INDEX(BdD!E:E,MATCH($A$1&\"_\"&ROW()-2,BdD!$K:$K,0)),\"\")","v":""},{"$f":"IF(COUNTIF(BdD!$A:$A,$A$1)>=ROW()-2,INDEX(BdD!F:F,MATCH($A$1&\"_\"&ROW()-2,BdD!$K:$K,0)),\"\")","v":""},{"$f":"IF(COUNTIF(BdD!$A:$A,$A$1)>=ROW()-2,INDEX(BdD!G:G,MATCH($A$1&\"_\"&ROW()-2,BdD!$K:$K,0)),\"\")","v":""},{"$f":"IF(COUNTIF(BdD!$A:$A,$A$1)>=ROW()-2,INDEX(BdD!H:H,MATCH($A$1&\"_\"&ROW()-2,BdD!$K:$K,0)),\"\")","v":""},{"$f":"IF(COUNTIF(BdD!$A:$A,$A$1)>=ROW()-2,INDEX(BdD!I:I,MATCH($A$1&\"_\"&ROW()-2,BdD!$K:$K,0)),\"\")","v":""},"il suffit de copier cette feuille et de modifier le nom en A1"]
[{"$f":"IF(COUNTIF(BdD!$A:$A,$A$1)>=ROW()-2,INDEX(BdD!B:B,MATCH($A$1&\"_\"&ROW()-2,BdD!$K:$K,0)),\"\")","v":""},{"$f":"IF(COUNTIF(BdD!$A:$A,$A$1)>=ROW()-2,INDEX(BdD!C:C,MATCH($A$1&\"_\"&ROW()-2,BdD!$K:$K,0)),\"\")","v":""},{"$f":"IF(COUNTIF(BdD!$A:$A,$A$1)>=ROW()-2,INDEX(BdD!D:D,MATCH($A$1&\"_\"&ROW()-2,BdD!$K:$K,0)),\"\")","v":""},{"$f":"IF(COUNTIF(BdD!$A:$A,$A$1)>=ROW()-2,INDEX(BdD!E:E,MATCH($A$1&\"_\"&ROW()-2,BdD!$K:$K,0)),\"\")","v":""},{"$f":"IF(COUNTIF(BdD!$A:$A,$A$1)>=ROW()-2,INDEX(BdD!F:F,MATCH($A$1&\"_\"&ROW()-2,BdD!$K:$K,0)),\"\")","v":""},{"$f":"IF(COUNTIF(BdD!$A:$A,$A$1)>=ROW()-2,INDEX(BdD!G:G,MATCH($A$1&\"_\"&ROW()-2,BdD!$K:$K,0)),\"\")","v":""},{"$f":"IF(COUNTIF(BdD!$A:$A,$A$1)>=ROW()-2,INDEX(BdD!H:H,MATCH($A$1&\"_\"&ROW()-2,BdD!$K:$K,0)),\"\")","v":""},{"$f":"IF(COUNTIF(BdD!$A:$A,$A$1)>=ROW()-2,INDEX(BdD!I:I,MATCH($A$1&\"_\"&ROW()-2,BdD!$K:$K,0)),\"\")","v":""}]
[{"$f":"IF(COUNTIF(BdD!$A:$A,$A$1)>=ROW()-2,INDEX(BdD!B:B,MATCH($A$1&\"_\"&ROW()-2,BdD!$K:$K,0)),\"\")","v":""},{"$f":"IF(COUNTIF(BdD!$A:$A,$A$1)>=ROW()-2,INDEX(BdD!C:C,MATCH($A$1&\"_\"&ROW()-2,BdD!$K:$K,0)),\"\")","v":""},{"$f":"IF(COUNTIF(BdD!$A:$A,$A$1)>=ROW()-2,INDEX(BdD!D:D,MATCH($A$1&\"_\"&ROW()-2,BdD!$K:$K,0)),\"\")","v":""},{"$f":"IF(COUNTIF(BdD!$A:$A,$A$1)>=ROW()-2,INDEX(BdD!E:E,MATCH($A$1&\"_\"&ROW()-2,BdD!$K:$K,0)),\"\")","v":""},{"$f":"IF(COUNTIF(BdD!$A:$A,$A$1)>=ROW()-2,INDEX(BdD!F:F,MATCH($A$1&\"_\"&ROW()-2,BdD!$K:$K,0)),\"\")","v":""},{"$f":"IF(COUNTIF(BdD!$A:$A,$A$1)>=ROW()-2,INDEX(BdD!G:G,MATCH($A$1&\"_\"&ROW()-2,BdD!$K:$K,0)),\"\")","v":""},{"$f":"IF(COUNTIF(BdD!$A:$A,$A$1)>=ROW()-2,INDEX(BdD!H:H,MATCH($A$1&\"_\"&ROW()-2,BdD!$K:$K,0)),\"\")","v":""},{"$f":"IF(COUNTIF(BdD!$A:$A,$A$1)>=ROW()-2,INDEX(BdD!I:I,MATCH($A$1&\"_\"&ROW()-2,BdD!$K:$K,0)),\"\")","v":""}]
[{"$f":"IF(COUNTIF(BdD!$A:$A,$A$1)>=ROW()-2,INDEX(BdD!B:B,MATCH($A$1&\"_\"&ROW()-2,BdD!$K:$K,0)),\"\")","v":""},{"$f":"IF(COUNTIF(BdD!$A:$A,$A$1)>=ROW()-2,INDEX(BdD!C:C,MATCH($A$1&\"_\"&ROW()-2,BdD!$K:$K,0)),\"\")","v":""},{"$f":"IF(COUNTIF(BdD!$A:$A,$A$1)>=ROW()-2,INDEX(BdD!D:D,MATCH($A$1&\"_\"&ROW()-2,BdD!$K:$K,0)),\"\")","v":""},{"$f":"IF(COUNTIF(BdD!$A:$A,$A$1)>=ROW()-2,INDEX(BdD!E:E,MATCH($A$1&\"_\"&ROW()-2,BdD!$K:$K,0)),\"\")","v":""},{"$f":"IF(COUNTIF(BdD!$A:$A,$A$1)>=ROW()-2,INDEX(BdD!F:F,MATCH($A$1&\"_\"&ROW()-2,BdD!$K:$K,0)),\"\")","v":""},{"$f":"IF(COUNTIF(BdD!$A:$A,$A$1)>=ROW()-2,INDEX(BdD!G:G,MATCH($A$1&\"_\"&ROW()-2,BdD!$K:$K,0)),\"\")","v":""},{"$f":"IF(COUNTIF(BdD!$A:$A,$A$1)>=ROW()-2,INDEX(BdD!H:H,MATCH($A$1&\"_\"&ROW()-2,BdD!$K:$K,0)),\"\")","v":""},{"$f":"IF(COUNTIF(BdD!$A:$A,$A$1)>=ROW()-2,INDEX(BdD!I:I,MATCH($A$1&\"_\"&ROW()-2,BdD!$K:$K,0)),\"\")","v":""}]
[{"$f":"IF(COUNTIF(BdD!$A:$A,$A$1)>=ROW()-2,INDEX(BdD!B:B,MATCH($A$1&\"_\"&ROW()-2,BdD!$K:$K,0)),\"\")","v":""},{"$f":"IF(COUNTIF(BdD!$A:$A,$A$1)>=ROW()-2,INDEX(BdD!C:C,MATCH($A$1&\"_\"&ROW()-2,BdD!$K:$K,0)),\"\")","v":""},{"$f":"IF(COUNTIF(BdD!$A:$A,$A$1)>=ROW()-2,INDEX(BdD!D:D,MATCH($A$1&\"_\"&ROW()-2,BdD!$K:$K,0)),\"\")","v":""},{"$f":"IF(COUNTIF(BdD!$A:$A,$A$1)>=ROW()-2,INDEX(BdD!E:E,MATCH($A$1&\"_\"&ROW()-2,BdD!$K:$K,0)),\"\")","v":""},{"$f":"IF(COUNTIF(BdD!$A:$A,$A$1)>=ROW()-2,INDEX(BdD!F:F,MATCH($A$1&\"_\"&ROW()-2,BdD!$K:$K,0)),\"\")","v":""},{"$f":"IF(COUNTIF(BdD!$A:$A,$A$1)>=ROW()-2,INDEX(BdD!G:G,MATCH($A$1&\"_\"&ROW()-2,BdD!$K:$K,0)),\"\")","v":""},{"$f":"IF(COUNTIF(BdD!$A:$A,$A$1)>=ROW()-2,INDEX(BdD!H:H,MATCH($A$1&\"_\"&ROW()-2,BdD!$K:$K,0)),\"\")","v":""},{"$f":"IF(COUNTIF(BdD!$A:$A,$A$1)>=ROW()-2,INDEX(BdD!I:I,MATCH($A$1&\"_\"&ROW()-2,BdD!$K:$K,0)),\"\")","v":""}]
[{"$f":"IF(COUNTIF(BdD!$A:$A,$A$1)>=ROW()-2,INDEX(BdD!B:B,MATCH($A$1&\"_\"&ROW()-2,BdD!$K:$K,0)),\"\")","v":""},{"$f":"IF(COUNTIF(BdD!$A:$A,$A$1)>=ROW()-2,INDEX(BdD!C:C,MATCH($A$1&\"_\"&ROW()-2,BdD!$K:$K,0)),\"\")","v":""},{"$f":"IF(COUNTIF(BdD!$A:$A,$A$1)>=ROW()-2,INDEX(BdD!D:D,MATCH($A$1&\"_\"&ROW()-2,BdD!$K:$K,0)),\"\")","v":""},{"$f":"IF(COUNTIF(BdD!$A:$A,$A$1)>=ROW()-2,INDEX(BdD!E:E,MATCH($A$1&\"_\"&ROW()-2,BdD!$K:$K,0)),\"\")","v":""},{"$f":"IF(COUNTIF(BdD!$A:$A,$A$1)>=ROW()-2,INDEX(BdD!F:F,MATCH($A$1&\"_\"&ROW()-2,BdD!$K:$K,0)),\"\")","v":""},{"$f":"IF(COUNTIF(BdD!$A:$A,$A$1)>=ROW()-2,INDEX(BdD!G:G,MATCH($A$1&\"_\"&ROW()-2,BdD!$K:$K,0)),\"\")","v":""},{"$f":"IF(COUNTIF(BdD!$A:$A,$A$1)>=ROW()-2,INDEX(BdD!H:H,MATCH($A$1&\"_\"&ROW()-2,BdD!$K:$K,0)),\"\")","v":""},{"$f":"IF(COUNTIF(BdD!$A:$A,$A$1)>=ROW()-2,INDEX(BdD!I:I,MATCH($A$1&\"_\"&ROW()-2,BdD!$K:$K,0)),\"\")","v":""}]
[{"$f":"IF(COUNTIF(BdD!$A:$A,$A$1)>=ROW()-2,INDEX(BdD!B:B,MATCH($A$1&\"_\"&ROW()-2,BdD!$K:$K,0)),\"\")","v":""},{"$f":"IF(COUNTIF(BdD!$A:$A,$A$1)>=ROW()-2,INDEX(BdD!C:C,MATCH($A$1&\"_\"&ROW()-2,BdD!$K:$K,0)),\"\")","v":""},{"$f":"IF(COUNTIF(BdD!$A:$A,$A$1)>=ROW()-2,INDEX(BdD!D:D,MATCH($A$1&\"_\"&ROW()-2,BdD!$K:$K,0)),\"\")","v":""},{"$f":"IF(COUNTIF(BdD!$A:$A,$A$1)>=ROW()-2,INDEX(BdD!E:E,MATCH($A$1&\"_\"&ROW()-2,BdD!$K:$K,0)),\"\")","v":""},{"$f":"IF(COUNTIF(BdD!$A:$A,$A$1)>=ROW()-2,INDEX(BdD!F:F,MATCH($A$1&\"_\"&ROW()-2,BdD!$K:$K,0)),\"\")","v":""},{"$f":"IF(COUNTIF(BdD!$A:$A,$A$1)>=ROW()-2,INDEX(BdD!G:G,MATCH($A$1&\"_\"&ROW()-2,BdD!$K:$K,0)),\"\")","v":""},{"$f":"IF(COUNTIF(BdD!$A:$A,$A$1)>=ROW()-2,INDEX(BdD!H:H,MATCH($A$1&\"_\"&ROW()-2,BdD!$K:$K,0)),\"\")","v":""},{"$f":"IF(COUNTIF(BdD!$A:$A,$A$1)>=ROW()-2,INDEX(BdD!I:I,MATCH($A$1&\"_\"&ROW()-2,BdD!$K:$K,0)),\"\")","v":""}]
[{"$f":"IF(COUNTIF(BdD!$A:$A,$A$1)>=ROW()-2,INDEX(BdD!B:B,MATCH($A$1&\"_\"&ROW()-2,BdD!$K:$K,0)),\"\")","v":""},{"$f":"IF(COUNTIF(BdD!$A:$A,$A$1)>=ROW()-2,INDEX(BdD!C:C,MATCH($A$1&\"_\"&ROW()-2,BdD!$K:$K,0)),\"\")","v":""},{"$f":"IF(COUNTIF(BdD!$A:$A,$A$1)>=ROW()-2,INDEX(BdD!D:D,MATCH($A$1&\"_\"&ROW()-2,BdD!$K:$K,0)),\"\")","v":""},{"$f":"IF(COUNTIF(BdD!$A:$A,$A$1)>=ROW()-2,INDEX(BdD!E:E,MATCH($A$1&\"_\"&ROW()-2,BdD!$K:$K,0)),\"\")","v":""},{"$f":"IF(COUNTIF(BdD!$A:$A,$A$1)>=ROW()-2,INDEX(BdD!F:F,MATCH($A$1&\"_\"&ROW()-2,BdD!$K:$K,0)),\"\")","v":""},{"$f":"IF(COUNTIF(BdD!$A:$A,$A$1)>=ROW()-2,INDEX(BdD!G:G,MATCH($A$1&\"_\"&ROW()-2,BdD!$K:$K,0)),\"\")","v":""},{"$f":"IF(COUNTIF(BdD!$A:$A,$A$1)>=ROW()-2,INDEX(BdD!H:H,MATCH($A$1&\"_\"&ROW()-2,BdD!$K:$K,0)),\"\")","v":""},{"$f":"IF(COUNTIF(BdD!$A:$A,$A$1)>=ROW()-2,INDEX(BdD!I:I,MATCH($A$1&\"_\"&ROW()-2,BdD!$K:$K,0)),\"\")","v":""}]
[{"$f":"IF(COUNTIF(BdD!$A:$A,$A$1)>=ROW()-2,INDEX(BdD!B:B,MATCH($A$1&\"_\"&ROW()-2,BdD!$K:$K,0)),\"\")","v":""},{"$f":"IF(COUNTIF(BdD!$A:$A,$A$1)>=ROW()-2,INDEX(BdD!C:C,MATCH($A$1&\"_\"&ROW()-2,BdD!$K:$K,0)),\"\")","v":""},{"$f":"IF(COUNTIF(BdD!$A:$A,$A$1)>=ROW()-2,INDEX(BdD!D:D,MATCH($A$1&\"_\"&ROW()-2,BdD!$K:$K,0)),\"\")","v":""},{"$f":"IF(COUNTIF(BdD!$A:$A,$A$1)>=ROW()-2,INDEX(BdD!E:E,MATCH($A$1&\"_\"&ROW()-2,BdD!$K:$K,0)),\"\")","v":""},{"$f":"IF(COUNTIF(BdD!$A:$A,$A$1)>=ROW()-2,INDEX(BdD!F:F,MATCH($A$1&\"_\"&ROW()-2,BdD!$K:$K,0)),\"\")","v":""},{"$f":"IF(COUNTIF(BdD!$A:$A,$A$1)>=ROW()-2,INDEX(BdD!G:G,MATCH($A$1&\"_\"&ROW()-2,BdD!$K:$K,0)),\"\")","v":""},{"$f":"IF(COUNTIF(BdD!$A:$A,$A$1)>=ROW()-2,INDEX(BdD!H:H,MATCH($A$1&\"_\"&ROW()-2,BdD!$K:$K,0)),\"\")","v":""},{"$f":"IF(COUNTIF(BdD!$A:$A,$A$1)>=ROW()-2,INDEX(BdD!I:I,MATCH($A$1&\"_\"&ROW()-2,BdD!$K:$K,0)),\"\")","v":""}]
[{"$f":"IF(COUNTIF(BdD!$A:$A,$A$1)>=ROW()-2,INDEX(BdD!B:B,MATCH($A$1&\"_\"&ROW()-2,BdD!$K:$K,0)),\"\")","v":""},{"$f":"IF(COUNTIF(BdD!$A:$A,$A$1)>=ROW()-2,INDEX(BdD!C:C,MATCH($A$1&\"_\"&ROW()-2,BdD!$K:$K,0)),\"\")","v":""},{"$f":"IF(COUNTIF(BdD!$A:$A,$A$1)>=ROW()-2,INDEX(BdD!D:D,MATCH($A$1&\"_\"&ROW()-2,BdD!$K:$K,0)),\"\")","v":""},{"$f":"IF(COUNTIF(BdD!$A:$A,$A$1)>=ROW()-2,INDEX(BdD!E:E,MATCH($A$1&\"_\"&ROW()-2,BdD!$K:$K,0)),\"\")","v":""},{"$f":"IF(COUNTIF(BdD!$A:$A,$A$1)>=ROW()-2,INDEX(BdD!F:F,MATCH($A$1&\"_\"&ROW()-2,BdD!$K:$K,0)),\"\")","v":""},{"$f":"IF(COUNTIF(BdD!$A:$A,$A$1)>=ROW()-2,INDEX(BdD!G:G,MATCH($A$1&\"_\"&ROW()-2,BdD!$K:$K,0)),\"\")","v":""},{"$f":"IF(COUNTIF(BdD!$A:$A,$A$1)>=ROW()-2,INDEX(BdD!H:H,MATCH($A$1&\"_\"&ROW()-2,BdD!$K:$K,0)),\"\")","v":""},{"$f":"IF(COUNTIF(BdD!$A:$A,$A$1)>=ROW()-2,INDEX(BdD!I:I,MATCH($A$1&\"_\"&ROW()-2,BdD!$K:$K,0)),\"\")","v":""}]
[{"$f":"IF(COUNTIF(BdD!$A:$A,$A$1)>=ROW()-2,INDEX(BdD!B:B,MATCH($A$1&\"_\"&ROW()-2,BdD!$K:$K,0)),\"\")","v":""},{"$f":"IF(COUNTIF(BdD!$A:$A,$A$1)>=ROW()-2,INDEX(BdD!C:C,MATCH($A$1&\"_\"&ROW()-2,BdD!$K:$K,0)),\"\")","v":""},{"$f":"IF(COUNTIF(BdD!$A:$A,$A$1)>=ROW()-2,INDEX(BdD!D:D,MATCH($A$1&\"_\"&ROW()-2,BdD!$K:$K,0)),\"\")","v":""},{"$f":"IF(COUNTIF(BdD!$A:$A,$A$1)>=ROW()-2,INDEX(BdD!E:E,MATCH($A$1&\"_\"&ROW()-2,BdD!$K:$K,0)),\"\")","v":""},{"$f":"IF(COUNTIF(BdD!$A:$A,$A$1)>=ROW()-2,INDEX(BdD!F:F,MATCH($A$1&\"_\"&ROW()-2,BdD!$K:$K,0)),\"\")","v":""},{"$f":"IF(COUNTIF(BdD!$A:$A,$A$1)>=ROW()-2,INDEX(BdD!G:G,MATCH($A$1&\"_\"&ROW()-2,BdD!$K:$K,0)),\"\")","v":""},{"$f":"IF(COUNTIF(BdD!$A:$A,$A$1)>=ROW()-2,INDEX(BdD!H:H,MATCH($A$1&\"_\"&ROW()-2,BdD!$K:$K,0)),\"\")","v":""},{"$f":"IF(COUNTIF(BdD!$A:$A,$A$1)>=ROW()-2,INDEX(BdD!I:I,MATCH($A$1&\"_\"&ROW()-2,BdD!$K:$K,0)),\"\")","v":""}]
{"$rows_left_out":131}