{"text_format":"1","workbook":"xlsx","n_sheets":13,"sheets":["2004-2006","2006-2007","2007-2008","2008-2009","2009-2010","2010-2011","2011-2012","2012-2013","2013-2014","2014-2015","2015-2016","Total","Participation"],"not_rendered":{"charts":0,"images":2,"macros":1,"external_links":0,"defined_names":12,"comments":0,"pivot_tables":0},"unopened":[],"bounds":{"document_bytes":16777216,"sheet_cells":100000,"rows_first":2000,"rows_last":500,"rows_between":2000,"halvings":0,"cell_chars":16384,"cell_head_chars":4096},"cells_cut":0,"cells_raw":0,"read":"whole","date_system":"1900"}

{"sheet":"2004-2006","index":0,"n_rows":82,"n_cols":14,"rows_kept":82,"cut":false,"hidden":false,"merged":[[1,6,2,6],[1,1,2,1],[1,2,2,2],[1,3,2,3],[1,4,2,4],[1,5,2,5],[1,13,2,13],[1,7,2,7],[1,8,2,8],[1,9,2,9],[1,10,1,12]]}
[]
[null,"Nom","Prénom","N° Carte","Adresse","CP","Ville","Téléphone","Portable","Email","Date Naiss",null,null,"Date"]
[null,null,null,null,null,null,null,null,null,null,"Mois","Jour","Année"]
[75,"ASSEZ","Sylvie",75,"cotes Belot",21170,"Montot",380298411,null,null,{"$f":"IF((N4)=\"\",\"\",IF(MONTH(N4)=1,\"Janvier\",IF(MONTH(N4)=2,\"Février\",IF(MONTH(N4)=3,\"Mars\",IF(MONTH(N4)=4,\"Avril\",IF(MONTH(N4)=5,\"Mai\",IF(MONTH(N4)=6,\"Juin\",IF(MONTH(N4)=7,\"Juillet\",IF(MONTH(N4)=8,\"Août\",IF(MONTH(N4)=9,\"Septembre\",IF(MONTH(N4)=10,\"Octobre\",IF(MONTH(N4)=11,\"Novembre\",\"Décembre\"))))))))))))","v":""},{"$f":"IF(N4=\"\",\"\",DAY(N4))","v":""},{"$f":"IF(N4=\"\",\"\",YEAR(N4))","v":""}]
[76,"BAJOTET","Marie-Thérèse",76,null,21470,"Brazey en plaine",null,626473855,null,"","",""]
[4,"BEHEREC","Franck",4,"3 Impasse Verdi",21470,"Brazey en plaine",380298947,614462165,"franck.beherec@wanadoo.fr","Octobre",24,1967,"1967-10-24"]
{"$rows_left_out":77}
{"sheet":"2006-2007","index":1,"n_rows":60,"n_cols":14,"rows_kept":60,"cut":false,"hidden":false,"merged":[[1,6,2,6],[1,1,2,1],[1,2,2,2],[1,3,2,3],[1,4,2,4],[1,5,2,5],[1,13,2,13],[1,7,2,7],[1,8,2,8],[1,9,2,9],[1,10,1,12]]}
[]
[null,"Nom","Prénom","N° Carte","Adresse","CP","Ville","Téléphone","Portable","Email","Date Naiss",null,null,"Date"]
[null,null,null,null,null,null,null,null,null,null,"Mois","Jour","Année"]
[4,"BEHEREC","Franck",4,"3 Impasse Verdi",21470,"Brazey en plaine",380298947,614462165,"franck.beherec@wanadoo.fr",{"$f":"IF((N4)=\"\",\"\",IF(MONTH(N4)=1,\"Janvier\",IF(MONTH(N4)=2,\"Février\",IF(MONTH(N4)=3,\"Mars\",IF(MONTH(N4)=4,\"Avril\",IF(MONTH(N4)=5,\"Mai\",IF(MONTH(N4)=6,\"Juin\",IF(MONTH(N4)=7,\"Juillet\",IF(MONTH(N4)=8,\"Août\",IF(MONTH(N4)=9,\"Septembre\",IF(MONTH(N4)=10,\"Octobre\",IF(MONTH(N4)=11,\"Novembre\",\"Décembre\"))))))))))))","v":"Octobre"},{"$f":"IF(N4=\"\",\"\",DAY(N4))","v":24},{"$f":"IF(N4=\"\",\"\",YEAR(N4))","v":1967},"1967-10-24"]
[135,"BEUDET","Jean",135,"12, Clos de Bellevue",21250,"Pouilly sur Saone",380204308,null,null,"Janvier",6,1938,"1938-01-06"]
[79,"BOILLAUD","Jean-Louis",79,"8 Route de Beaune",21170,"St Usage",380290667,679396168,"jl.boillaud@wanadoo.fr","Juin",8,1945,"1945-06-08"]
{"$rows_left_out":55}
{"sheet":"2007-2008","index":2,"n_rows":56,"n_cols":16,"rows_kept":56,"cut":false,"hidden":false,"merged":[[1,15,2,15],[1,6,2,6],[1,1,2,1],[1,2,2,2],[1,3,2,3],[1,4,2,4],[1,5,2,5],[1,7,2,7],[1,8,2,8],[1,9,2,9],[1,13,2,13],[1,14,2,14],[1,10,1,12]]}
[]
[null,"Nom","Prénom","N° Carte","Adresse","CP","Ville","Téléphone","Portable","Email","Date Naiss",null,null,"A ou R",null,"Date"]
[null,null,null,null,null,null,null,null,null,null,"Mois","Jour","Année"]
[126,"Amiot","André",126,"14, Rue des Oies  ",21170,"Echenon",380290222,null,null,{"$f":"IF((P4)=\"\",\"\",IF(MONTH(P4)=1,\"Janvier\",IF(MONTH(P4)=2,\"Février\",IF(MONTH(P4)=3,\"Mars\",IF(MONTH(P4)=4,\"Avril\",IF(MONTH(P4)=5,\"Mai\",IF(MONTH(P4)=6,\"Juin\",IF(MONTH(P4)=7,\"Juillet\",IF(MONTH(P4)=8,\"Août\",IF(MONTH(P4)=9,\"Septembre\",IF(MONTH(P4)=10,\"Octobre\",IF(MONTH(P4)=11,\"Novembre\",\"Décembre\"))))))))))))","v":"Janvier"},{"$f":"IF(P4=\"\",\"\",DAY(P4))","v":19},{"$f":"IF(P4=\"\",\"\",YEAR(P4))","v":1947},"A","P","1947-01-19"]
[4,"Beherec","Franck",4,"3 Impasse Verdi",21470,"Brazey en plaine",380298947,614462165,"franck.beherec@wanadoo.fr",{"$f":"IF((P5)=\"\",\"\",IF(MONTH(P5)=1,\"Janvier\",IF(MONTH(P5)=2,\"Février\",IF(MONTH(P5)=3,\"Mars\",IF(MONTH(P5)=4,\"Avril\",IF(MONTH(P5)=5,\"Mai\",IF(MONTH(P5)=6,\"Juin\",IF(MONTH(P5)=7,\"Juillet\",IF(MONTH(P5)=8,\"Août\",IF(MONTH(P5)=9,\"Septembre\",IF(MONTH(P5)=10,\"Octobre\",IF(MONTH(P5)=11,\"Novembre\",\"Décembre\"))))))))))))","v":"Octobre"},{"$f":"IF(P5=\"\",\"\",DAY(P5))","v":24},{"$f":"IF(P5=\"\",\"\",YEAR(P5))","v":1967},"R","P","1967-10-24"]
[135,"Beudet","Jean",135,"12, Clos de Bellevue",21250,"Pouilly sur Saone",380204308,null,null,"Janvier",6,1938,"R","P","1938-01-06"]
{"$rows_left_out":51}
{"sheet":"2008-2009","index":3,"n_rows":71,"n_cols":16,"rows_kept":71,"cut":false,"hidden":false,"merged":[[1,0,2,0],[1,1,2,1],[1,2,2,2],[1,3,2,3],[1,4,2,4],[1,15,2,15],[1,13,2,13],[1,14,2,14],[1,10,1,12],[1,5,2,5],[1,6,2,6],[1,7,2,7],[1,8,2,8],[1,9,2,9]]}
[]
[null,"Nom","Prénom","N° Carte","Adresse","CP","Ville","Téléphone","Portable","Email","Date Naiss",null,null,"A ou R",null,"Date"]
[null,null,null,null,null,null,null,null,null,null,"Mois","Jour","Année"]
[155,"Baland","Monique",155,null,null,null,null,null,null,{"$f":"IF((P4)=\"\",\"\",IF(MONTH(P4)=1,\"Janvier\",IF(MONTH(P4)=2,\"Février\",IF(MONTH(P4)=3,\"Mars\",IF(MONTH(P4)=4,\"Avril\",IF(MONTH(P4)=5,\"Mai\",IF(MONTH(P4)=6,\"Juin\",IF(MONTH(P4)=7,\"Juillet\",IF(MONTH(P4)=8,\"Août\",IF(MONTH(P4)=9,\"Septembre\",IF(MONTH(P4)=10,\"Octobre\",IF(MONTH(P4)=11,\"Novembre\",\"Décembre\"))))))))))))","v":"Juin"},{"$f":"IF(P4=\"\",\"\",DAY(P4))","v":1},{"$f":"IF(P4=\"\",\"\",YEAR(P4))","v":1940},"A","P","1940-06-01"]
[4,"Beherec","Franck",4,null,null,null,null,null,null,{"$f":"IF((P5)=\"\",\"\",IF(MONTH(P5)=1,\"Janvier\",IF(MONTH(P5)=2,\"Février\",IF(MONTH(P5)=3,\"Mars\",IF(MONTH(P5)=4,\"Avril\",IF(MONTH(P5)=5,\"Mai\",IF(MONTH(P5)=6,\"Juin\",IF(MONTH(P5)=7,\"Juillet\",IF(MONTH(P5)=8,\"Août\",IF(MONTH(P5)=9,\"Septembre\",IF(MONTH(P5)=10,\"Octobre\",IF(MONTH(P5)=11,\"Novembre\",\"Décembre\"))))))))))))","v":"Octobre"},{"$f":"IF(P5=\"\",\"\",DAY(P5))","v":24},{"$f":"IF(P5=\"\",\"\",YEAR(P5))","v":1967},"R",null,"1967-10-24"]
[156,"Beliard","Christophe",156,null,null,null,null,null,null,"Novembre",30,1972,"A","P","1972-11-30"]
{"$rows_left_out":66}
{"sheet":"2009-2010","index":4,"n_rows":69,"n_cols":16,"rows_kept":69,"cut":false,"hidden":false,"merged":[[1,0,2,0],[1,1,2,1],[1,2,2,2],[1,3,2,3],[1,4,2,4],[1,15,2,15],[1,13,2,13],[1,14,2,14],[1,10,1,12],[1,5,2,5],[1,6,2,6],[1,7,2,7],[1,8,2,8],[1,9,2,9]]}
[]
[null,"Nom","Prénom","N° Carte","Adresse","CP","Ville","Téléphone","Portable","Email","Date Naiss",null,null,"A ou R",null,"Date"]
[null,null,null,null,null,null,null,null,null,null,"Mois","Jour","Année"]
[183,"Alagama","Alex",183,"9a, Rue Maréchal Delattre de Tassigny",21470,"Brazey en plaine",380329906,632060653,null,{"$f":"IF((P4)=\"\",\"\",IF(MONTH(P4)=1,\"Janvier\",IF(MONTH(P4)=2,\"Février\",IF(MONTH(P4)=3,\"Mars\",IF(MONTH(P4)=4,\"Avril\",IF(MONTH(P4)=5,\"Mai\",IF(MONTH(P4)=6,\"Juin\",IF(MONTH(P4)=7,\"Juillet\",IF(MONTH(P4)=8,\"Août\",IF(MONTH(P4)=9,\"Septembre\",IF(MONTH(P4)=10,\"Octobre\",IF(MONTH(P4)=11,\"Novembre\",\"Décembre\"))))))))))))","v":"Septembre"},{"$f":"IF(P4=\"\",\"\",DAY(P4))","v":19},{"$f":"IF(P4=\"\",\"\",YEAR(P4))","v":1960},"A","P","1960-09-19"]
[178,"Arbassier","Jean-Claude",178,"16, Route d'Auxonne",21170,"Montot",null,698808355,null,{"$f":"IF((P5)=\"\",\"\",IF(MONTH(P5)=1,\"Janvier\",IF(MONTH(P5)=2,\"Février\",IF(MONTH(P5)=3,\"Mars\",IF(MONTH(P5)=4,\"Avril\",IF(MONTH(P5)=5,\"Mai\",IF(MONTH(P5)=6,\"Juin\",IF(MONTH(P5)=7,\"Juillet\",IF(MONTH(P5)=8,\"Août\",IF(MONTH(P5)=9,\"Septembre\",IF(MONTH(P5)=10,\"Octobre\",IF(MONTH(P5)=11,\"Novembre\",\"Décembre\"))))))))))))","v":"Juillet"},{"$f":"IF(P5=\"\",\"\",DAY(P5))","v":1},{"$f":"IF(P5=\"\",\"\",YEAR(P5))","v":1954},"A","P","1954-07-01"]
[155,"Baland","Monique",155,"5 bd, Mansard - Appt 7",21800,"Quétigny",380317303,620431090,"monique.baland@wanadoo.fr ","Juin",1,1940,"R","P","1940-06-01"]
{"$rows_left_out":64}
{"sheet":"2010-2011","index":5,"n_rows":73,"n_cols":16,"rows_kept":73,"cut":false,"hidden":false,"merged":[[1,1,2,1],[1,2,2,2],[1,3,2,3],[1,4,2,4],[1,5,2,5],[1,15,2,15],[1,14,2,14],[1,10,1,12],[1,6,2,6],[1,7,2,7],[1,8,2,8],[1,9,2,9],[1,13,2,13]]}
[]
[null,"Nom","Prénom","N° Carte","Adresse","CP","Ville","Téléphone","Portable","Email","Date Naiss",null,null,"A ou R",null,"Date"]
[null,null,null,null,null,null,null,null,null,null,"Mois","Jour","Année"]
[192,"Agostini","Christiane",192,null,null,null,null,null,null,{"$f":"IF((P4)=\"\",\"\",IF(MONTH(P4)=1,\"Janvier\",IF(MONTH(P4)=2,\"Février\",IF(MONTH(P4)=3,\"Mars\",IF(MONTH(P4)=4,\"Avril\",IF(MONTH(P4)=5,\"Mai\",IF(MONTH(P4)=6,\"Juin\",IF(MONTH(P4)=7,\"Juillet\",IF(MONTH(P4)=8,\"Août\",IF(MONTH(P4)=9,\"Septembre\",IF(MONTH(P4)=10,\"Octobre\",IF(MONTH(P4)=11,\"Novembre\",\"Décembre\"))))))))))))","v":"Septembre"},{"$f":"IF(P4=\"\",\"\",DAY(P4))","v":17},{"$f":"IF(P4=\"\",\"\",YEAR(P4))","v":1952},"A","P","1952-09-17"]
[210,"Agostini","Séverine",210,null,null,null,null,null,null,{"$f":"IF((P5)=\"\",\"\",IF(MONTH(P5)=1,\"Janvier\",IF(MONTH(P5)=2,\"Février\",IF(MONTH(P5)=3,\"Mars\",IF(MONTH(P5)=4,\"Avril\",IF(MONTH(P5)=5,\"Mai\",IF(MONTH(P5)=6,\"Juin\",IF(MONTH(P5)=7,\"Juillet\",IF(MONTH(P5)=8,\"Août\",IF(MONTH(P5)=9,\"Septembre\",IF(MONTH(P5)=10,\"Octobre\",IF(MONTH(P5)=11,\"Novembre\",\"Décembre\"))))))))))))","v":"Janvier"},{"$f":"IF(P5=\"\",\"\",DAY(P5))","v":2},{"$f":"IF(P5=\"\",\"\",YEAR(P5))","v":1975},"A","P","1975-01-02"]
[4,"Beherec","Franck",4,null,null,null,null,null,null,"Octobre",24,1967,"R","Ani","1967-10-24"]
{"$rows_left_out":68}
{"sheet":"2011-2012","index":6,"n_rows":86,"n_cols":18,"rows_kept":86,"cut":false,"hidden":false,"merged":[[1,17,2,17],[1,6,2,6],[1,15,2,15],[1,1,2,1],[1,2,2,2],[1,3,2,3],[1,4,2,4],[1,5,2,5],[1,7,2,7],[1,8,2,8],[1,9,2,9],[1,13,2,13],[1,14,2,14],[1,10,1,12]]}
[]
[null,"Nom","Prénom","N° Carte","Adresse","CP","Ville","Téléphone","Portable","Email","Date Naiss",null,null,"N ou R",null,"Date",null,"Age"]
[null,null,null,null,null,null,null,null,null,null,"Mois","Jour","Année"]
[192,"Agostini","Christiane",192,null,null,null,null,null,null,{"$f":"IF((P4)=\"\",\"\",IF(MONTH(P4)=1,\"Janvier\",IF(MONTH(P4)=2,\"Février\",IF(MONTH(P4)=3,\"Mars\",IF(MONTH(P4)=4,\"Avril\",IF(MONTH(P4)=5,\"Mai\",IF(MONTH(P4)=6,\"Juin\",IF(MONTH(P4)=7,\"Juillet\",IF(MONTH(P4)=8,\"Août\",IF(MONTH(P4)=9,\"Septembre\",IF(MONTH(P4)=10,\"Octobre\",IF(MONTH(P4)=11,\"Novembre\",\"Décembre\"))))))))))))","v":"Septembre"},{"$f":"IF(P4=\"\",\"\",DAY(P4))","v":17},{"$f":"IF(P4=\"\",\"\",YEAR(P4))","v":1952},"R","AO","1952-09-17",null,{"$f":"IF(P4=\"\",\"\",DATEDIF(P4,TODAY(),\"y\"))","v":61}]
[4,"Beherec","Franck",4,null,null,null,null,null,null,"Octobre",24,1967,"R","Ani","1967-10-24",null,{"$f":"IF(P5=\"\",\"\",DATEDIF(P5,TODAY(),\"y\"))","v":46}]
[228,"Blondot","Marie-Thèrese",228,null,null,null,null,null,null,"Mai",4,1949,"N ","P","1949-05-04",null,65]
{"$rows_left_out":81}
{"sheet":"2012-2013","index":7,"n_rows":65,"n_cols":18,"rows_kept":65,"cut":false,"hidden":false,"merged":[[1,15,2,15],[1,17,2,17],[1,13,2,13],[1,14,2,14],[1,0,2,0],[1,10,1,12],[1,1,2,1],[1,2,2,2],[1,3,2,3],[1,4,2,4],[1,5,2,5],[1,6,2,6],[1,7,2,7],[1,8,2,8],[1,9,2,9]]}
[]
[null,"Nom","Prénom","N° Carte","Adresse","CP","Ville","Téléphone","Portable","Email","Date Naiss",null,null,"N ou R",null,"Date",null,"Age"]
[null,null,null,null,null,null,null,null,null,null,"Mois","Jour","Année"]
[192,"Agostini","Christiane",192,null,null,null,null,null,null,{"$f":"IF((P4)=\"\",\"\",IF(MONTH(P4)=1,\"Janvier\",IF(MONTH(P4)=2,\"Février\",IF(MONTH(P4)=3,\"Mars\",IF(MONTH(P4)=4,\"Avril\",IF(MONTH(P4)=5,\"Mai\",IF(MONTH(P4)=6,\"Juin\",IF(MONTH(P4)=7,\"Juillet\",IF(MONTH(P4)=8,\"Août\",IF(MONTH(P4)=9,\"Septembre\",IF(MONTH(P4)=10,\"Octobre\",IF(MONTH(P4)=11,\"Novembre\",\"Décembre\"))))))))))))","v":"Septembre"},9,{"$f":"IF(P4=\"\",\"\",YEAR(P4))","v":1952},"R","P","1952-09-17",null,{"$f":"IF(P4=\"\",\"\",DATEDIF(P4,TODAY(),\"y\"))","v":61}]
[4,"Beherec","Franck",4,null,null,null,null,null,null,{"$f":"IF((P5)=\"\",\"\",IF(MONTH(P5)=1,\"Janvier\",IF(MONTH(P5)=2,\"Février\",IF(MONTH(P5)=3,\"Mars\",IF(MONTH(P5)=4,\"Avril\",IF(MONTH(P5)=5,\"Mai\",IF(MONTH(P5)=6,\"Juin\",IF(MONTH(P5)=7,\"Juillet\",IF(MONTH(P5)=8,\"Août\",IF(MONTH(P5)=9,\"Septembre\",IF(MONTH(P5)=10,\"Octobre\",IF(MONTH(P5)=11,\"Novembre\",\"Décembre\"))))))))))))","v":"Octobre"},{"$f":"IF(P5=\"\",\"\",DAY(P5))","v":24},1967,"R","Ani","1967-10-24",null,{"$f":"IF(P5=\"\",\"\",DATEDIF(P5,TODAY(),\"y\"))","v":46}]
[254,"Belot","Anne-Lise",254,null,null,null,null,null,null,{"$f":"IF((P6)=\"\",\"\",IF(MONTH(P6)=1,\"Janvier\",IF(MONTH(P6)=2,\"Février\",IF(MONTH(P6)=3,\"Mars\",IF(MONTH(P6)=4,\"Avril\",IF(MONTH(P6)=5,\"Mai\",IF(MONTH(P6)=6,\"Juin\",IF(MONTH(P6)=7,\"Juillet\",IF(MONTH(P6)=8,\"Août\",IF(MONTH(P6)=9,\"Septembre\",IF(MONTH(P6)=10,\"Octobre\",IF(MONTH(P6)=11,\"Novembre\",\"Décembre\"))))))))))))","v":"Août"},19,1982,"N","P","1982-08-19",null,31]
{"$rows_left_out":60}
{"sheet":"2013-2014","index":8,"n_rows":118,"n_cols":17,"rows_kept":118,"cut":false,"hidden":false,"merged":[]}
[]
[null,"Nom","Prénom","N° Carte","Adresse","CP","Ville","Téléphone","Portable","Email","Date","Age","Adhésion","Activité","Cotisation","Animateurs"]
[276,"Agostini","Patrick",276,null,null,null,null,null,null,"1953-06-14",{"$f":"IF(K3=\"\",\"\",DATEDIF(K3,TODAY(),\"y\"))","v":61},"A","Initiation","Oui","Franck"]
[192,"Agostini","Christiane",192,null,null,null,null,null,null,"1952-09-17",{"$f":"IF(K4=\"\",\"\",DATEDIF(K4,TODAY(),\"y\"))","v":61},"R","Initiation","Oui","Franck","Chantal M"]
[272,"Bastien","Odette",272,null,null,null,null,null,null,"1941-10-20",{"$f":"IF(K5=\"\",\"\",DATEDIF(K5,TODAY(),\"y\"))","v":72},"A","Initiation","Oui","Richard J"]
[4,"Beherec","Franck",4,null,null,null,null,null,null,"1967-10-24",{"$f":"IF(K6=\"\",\"\",DATEDIF(K6,TODAY(),\"y\"))","v":46},"R","Animateur","Anim","Franck"]
{"$rows_left_out":113}
{"sheet":"2014-2015","index":9,"n_rows":94,"n_cols":18,"rows_kept":94,"cut":false,"hidden":false,"merged":[[1,17,2,17],[1,15,2,15],[1,16,2,16],[1,10,2,10],[1,14,2,14],[1,11,1,13],[1,0,2,0],[1,1,2,1],[1,2,2,2],[1,3,2,3],[1,4,2,4],[1,5,2,5],[1,6,2,6],[1,7,2,7],[1,8,2,8],[1,9,2,9]]}
[]
[null,"Nom","Prénom","N° Carte","Adresse","CP","Ville","Téléphone","Portable","Email","Date","Date Naiss",null,null,"Age","Adhésion","Activité","Cotisation"]
[null,null,null,null,null,null,null,null,null,null,null,"Mois","Jour","Année"]
[null,null,null,null,null,null,null,null,null,null,"2000-01-10",{"$f":"IF((K4)=\"\",\"\",IF(MONTH(K4)=1,\"Janv\",IF(MONTH(K4)=2,\"Fév\",IF(MONTH(K4)=3,\"Mars\",IF(MONTH(K4)=4,\"Avr\",IF(MONTH(K4)=5,\"Mai\",IF(MONTH(K4)=6,\"Juin\",IF(MONTH(K4)=7,\"Juil\",IF(MONTH(K4)=8,\"Août\",IF(MONTH(K4)=9,\"Sep\",IF(MONTH(K4)=10,\"Oct\",IF(MONTH(K4)=11,\"Nov\",\"Déc\"))))))))))))","v":"Janv"},{"$f":"IF(K4=\"\",\"\",DAY(K4))","v":10},{"$f":"IF(K4=\"\",\"\",YEAR(K4))","v":2000},{"$f":"IF(K4=\"\",\"\",DATEDIF(K4,TODAY(),\"y\"))","v":14}]
[null,null,null,null,null,null,null,null,null,null,null,{"$f":"IF((K5)=\"\",\"\",IF(MONTH(K5)=1,\"Janvier\",IF(MONTH(K5)=2,\"Février\",IF(MONTH(K5)=3,\"Mars\",IF(MONTH(K5)=4,\"Avril\",IF(MONTH(K5)=5,\"Mai\",IF(MONTH(K5)=6,\"Juin\",IF(MONTH(K5)=7,\"Juillet\",IF(MONTH(K5)=8,\"Août\",IF(MONTH(K5)=9,\"Septembre\",IF(MONTH(K5)=10,\"Octobre\",IF(MONTH(K5)=11,\"Novembre\",\"Décembre\"))))))))))))","v":""},{"$f":"IF(K5=\"\",\"\",DAY(K5))","v":""},{"$f":"IF(K5=\"\",\"\",YEAR(K5))","v":""},""]
[null,null,null,null,null,null,null,null,null,null,null,{"$f":"IF((K6)=\"\",\"\",IF(MONTH(K6)=1,\"Janvier\",IF(MONTH(K6)=2,\"Février\",IF(MONTH(K6)=3,\"Mars\",IF(MONTH(K6)=4,\"Avril\",IF(MONTH(K6)=5,\"Mai\",IF(MONTH(K6)=6,\"Juin\",IF(MONTH(K6)=7,\"Juillet\",IF(MONTH(K6)=8,\"Août\",IF(MONTH(K6)=9,\"Septembre\",IF(MONTH(K6)=10,\"Octobre\",IF(MONTH(K6)=11,\"Novembre\",\"Décembre\"))))))))))))","v":""},{"$f":"IF(K6=\"\",\"\",DAY(K6))","v":""},{"$f":"IF(K6=\"\",\"\",YEAR(K6))","v":""},""]
{"$rows_left_out":89}
{"sheet":"2015-2016","index":10,"n_rows":65,"n_cols":18,"rows_kept":65,"cut":false,"hidden":false,"merged":[[1,5,2,5],[1,0,2,0],[1,1,2,1],[1,2,2,2],[1,3,2,3],[1,4,2,4],[1,14,2,14],[1,15,2,15],[1,17,2,17],[1,6,2,6],[1,7,2,7],[1,8,2,8],[1,9,2,9],[1,10,1,12],[1,13,2,13]]}
[]
[null,"Nom","Prénom","N° Carte","Adresse","CP","Ville","Téléphone","Portable","Email","Date Naiss",null,null,"N ou R",null,"Date",null,"Age"]
[null,null,null,null,null,null,null,null,null,null,"Mois","Jour","Année"]
[null,null,null,null,null,null,null,null,null,null,{"$f":"IF((P4)=\"\",\"\",IF(MONTH(P4)=1,\"Janv\",IF(MONTH(P4)=2,\"Fév\",IF(MONTH(P4)=3,\"Mars\",IF(MONTH(P4)=4,\"Avr\",IF(MONTH(P4)=5,\"Mai\",IF(MONTH(P4)=6,\"Juin\",IF(MONTH(P4)=7,\"Juil\",IF(MONTH(P4)=8,\"Août\",IF(MONTH(P4)=9,\"Sep\",IF(MONTH(P4)=10,\"Oct\",IF(MONTH(P4)=11,\"Nov\",\"Déc\"))))))))))))","v":""},{"$f":"IF(P4=\"\",\"\",DAY(P4))","v":""},{"$f":"IF(P4=\"\",\"\",YEAR(P4))","v":""},null,null,null,null,{"$f":"IF(P4=\"\",\"\",DATEDIF(P4,TODAY(),\"y\"))","v":""}]
[null,null,null,null,null,null,null,null,null,null,{"$f":"IF((P5)=\"\",\"\",IF(MONTH(P5)=1,\"Janvier\",IF(MONTH(P5)=2,\"Février\",IF(MONTH(P5)=3,\"Mars\",IF(MONTH(P5)=4,\"Avril\",IF(MONTH(P5)=5,\"Mai\",IF(MONTH(P5)=6,\"Juin\",IF(MONTH(P5)=7,\"Juillet\",IF(MONTH(P5)=8,\"Août\",IF(MONTH(P5)=9,\"Septembre\",IF(MONTH(P5)=10,\"Octobre\",IF(MONTH(P5)=11,\"Novembre\",\"Décembre\"))))))))))))","v":""},"","",null,null,null,null,{"$f":"IF(P5=\"\",\"\",DATEDIF(P5,TODAY(),\"y\"))","v":""}]
[null,null,null,null,null,null,null,null,null,null,{"$f":"IF((P6)=\"\",\"\",IF(MONTH(P6)=1,\"Janvier\",IF(MONTH(P6)=2,\"Février\",IF(MONTH(P6)=3,\"Mars\",IF(MONTH(P6)=4,\"Avril\",IF(MONTH(P6)=5,\"Mai\",IF(MONTH(P6)=6,\"Juin\",IF(MONTH(P6)=7,\"Juillet\",IF(MONTH(P6)=8,\"Août\",IF(MONTH(P6)=9,\"Septembre\",IF(MONTH(P6)=10,\"Octobre\",IF(MONTH(P6)=11,\"Novembre\",\"Décembre\"))))))))))))","v":""},"","",null,null,null,null,""]
{"$rows_left_out":60}
{"sheet":"Total","index":11,"n_rows":286,"n_cols":30,"rows_kept":286,"cut":false,"hidden":false,"merged":[]}
[null,null,null,null,null,null,null,null,null,null,null,null,null,null,null,null,null,null,null,null,null,null,null,null,null,null,null,null,null,{"$f":"\"Total : \"&COUNTA(B:B)-1&\" adhérents\"","v":"Total : 283 adhérents"}]
["N°","Nom","Prénom","N° Carte","Adresse","CP","Ville","Téléphone","Portable","Email","Date naissance","Age","2013-2014",null,null,"Age","Nbr",null,null,null,null,null,null,null,null,null,null,null,null,{"$f":"M2&\" : \"&COUNTA(M:M)-1&\" adhérents\"","v":"2013-2014 : 64 adhérents"}]
[{"$f":"ROW()-2","v":1},"Agostini","Christiane",192,null,null,null,null,null,null,"1952-09-17",{"$f":"IF(K3=\"\",\"\",DATEDIF(K3,TODAY(),\"y\"))","v":61},"R",null,null,90,{"$f":"COUNTIF($L$3:L275,P3)","v":0}]
[{"$f":"ROW()-2","v":2},"Agostini","Patrick",276,null,null,null,null,null,null,"1953-06-16",{"$f":"IF(K4=\"\",\"\",DATEDIF(K4,TODAY(),\"y\"))","v":61},"A"]
[{"$f":"ROW()-2","v":3},"Agostini","Séverine",210,null,null,null,null,null,null,"1975-01-02",{"$f":"IF(K5=\"\",\"\",DATEDIF(K5,TODAY(),\"y\"))","v":39},null,null,null,89,{"$f":"COUNTIF($L$3:L276,P5)","v":0}]
[{"$f":"ROW()-2","v":4},"Alagama","Alex",183,null,null,null,null,null,null,"1960-09-19",{"$f":"IF(K6=\"\",\"\",DATEDIF(K6,TODAY(),\"y\"))","v":53},null,null,null,88,{"$f":"COUNTIF($L$3:L277,P6)","v":0}]
{"$rows_left_out":281}
{"sheet":"Participation","index":12,"n_rows":313,"n_cols":27,"rows_kept":313,"cut":false,"hidden":false,"merged":[]}
[null,null,null,null,null,null,null,null,null,null,null,null,null,null,null,null,null,null,null,"Nombre"]
["N°","Nom","Prénom","N° Carte",{"$f":"IF(OFFSET(Années,COLUMN()-5,,1)<=Total!$M$2,OFFSET(Années,COLUMN()-5,,1),\"\")","v":"2004-2006"},{"$f":"IF(OFFSET(Années,COLUMN()-5,,1)<=Total!$M$2,OFFSET(Années,COLUMN()-5,,1),\"\")","v":"2006-2007"},{"$f":"IF(OFFSET(Années,COLUMN()-5,,1)<=Total!$M$2,OFFSET(Années,COLUMN()-5,,1),\"\")","v":"2007-2008"},{"$f":"IF(OFFSET(Années,COLUMN()-5,,1)<=Total!$M$2,OFFSET(Années,COLUMN()-5,,1),\"\")","v":"2008-2009"},{"$f":"IF(OFFSET(Années,COLUMN()-5,,1)<=Total!$M$2,OFFSET(Années,COLUMN()-5,,1),\"\")","v":"2009-2010"},{"$f":"IF(OFFSET(Années,COLUMN()-5,,1)<=Total!$M$2,OFFSET(Années,COLUMN()-5,,1),\"\")","v":"2010-2011"},{"$f":"IF(OFFSET(Années,COLUMN()-5,,1)<=Total!$M$2,OFFSET(Années,COLUMN()-5,,1),\"\")","v":"2011-2012"},{"$f":"IF(OFFSET(Années,COLUMN()-5,,1)<=Total!$M$2,OFFSET(Années,COLUMN()-5,,1),\"\")","v":"2012-2013"},{"$f":"IF(OFFSET(Années,COLUMN()-5,,1)<=Total!$M$2,OFFSET(Années,COLUMN()-5,,1),\"\")","v":"2013-2014"},{"$f":"IF(OFFSET(Années,COLUMN()-5,,1)<=Total!$M$2,OFFSET(Années,COLUMN()-5,,1),\"\")","v":""},{"$f":"IF(OFFSET(Années,COLUMN()-5,,1)<=Total!$M$2,OFFSET(Années,COLUMN()-5,,1),\"\")","v":""},{"$f":"IF(OFFSET(Années,COLUMN()-5,,1)<=Total!$M$2,OFFSET(Années,COLUMN()-5,,1),\"\")","v":""},{"$f":"IF(OFFSET(Années,COLUMN()-5,,1)<=Total!$M$2,OFFSET(Années,COLUMN()-5,,1),\"\")","v":""},{"$f":"IF(OFFSET(Années,COLUMN()-5,,1)<=Total!$M$2,OFFSET(Années,COLUMN()-5,,1),\"\")","v":""},{"$f":"IF(OFFSET(Années,COLUMN()-5,,1)<=Total!$M$2,OFFSET(Années,COLUMN()-5,,1),\"\")","v":""},"Participation"]
[{"$f":"Total!A3","v":1},{"$f":"IF($A4>0,Total!B3,\"\")","v":"Agostini"},{"$f":"IF($A4>0,Total!C3,\"\")","v":"Christiane"},{"$f":"IF($A4>0,Total!D3,\"\")","v":192},{"$f":"IFERROR(MATCH($D3,INDIRECT(\"'\"&E$2&\"'!D:D\"),0),\"\")","v":""},{"$f":"IFERROR(MATCH($D3,INDIRECT(\"'\"&F$2&\"'!D:D\"),0),\"\")","v":""},"","","",4,4,4,4,"","","","","","",{"$f":"IF(D3<>\"\",COUNT(E3:S3),\"\")","v":4},null,null,null,null,null,null,"2004-2006"]
[{"$f":"Total!A4","v":2},{"$f":"IF($A5>0,Total!B4,\"\")","v":"Agostini"},{"$f":"IF($A5>0,Total!C4,\"\")","v":"Patrick"},{"$f":"IF($A5>0,Total!D4,\"\")","v":276},{"$f":"IFERROR(MATCH($D4,INDIRECT(\"'\"&E$2&\"'!D:D\"),0),\"\")","v":""},"","","","","","","",3,"","","","","","",{"$f":"IF(D4<>\"\",COUNT(E4:S4),\"\")","v":1},null,null,null,null,null,null,"2006-2007"]
[{"$f":"Total!A5","v":3},{"$f":"IF($A6>0,Total!B5,\"\")","v":"Agostini"},{"$f":"IF($A6>0,Total!C5,\"\")","v":"Séverine"},{"$f":"IF($A6>0,Total!D5,\"\")","v":210},"","","","","",5,"","","","","","","","","",1,null,null,null,null,null,null,"2007-2008"]
[{"$f":"Total!A6","v":4},{"$f":"IF($A7>0,Total!B6,\"\")","v":"Alagama"},{"$f":"IF($A7>0,Total!C6,\"\")","v":"Alex"},{"$f":"IF($A7>0,Total!D6,\"\")","v":183},"","","","",4,"","","","","","","","","","",1,null,null,null,null,null,null,"2008-2009"]
{"$rows_left_out":307}