{"text_format":"1","workbook":"xlsx","n_sheets":13,"sheets":["2004-2006","2006-2007","2007-2008","2008-2009","2009-2010","2010-2011","2011-2012","2012-2013","2013-2014","2014-2015","2015-2016","Total","Participation"],"not_rendered":{"charts":0,"images":2,"macros":1,"external_links":0,"defined_names":12,"comments":0,"pivot_tables":0},"unopened":[],"bounds":{"document_bytes":16777216,"sheet_cells":100000,"rows_first":2000,"rows_last":500,"rows_between":2000,"halvings":0,"cell_chars":16384,"cell_head_chars":4096},"cells_cut":0,"cells_raw":0,"read":"whole","date_system":"1900"}

{"sheet":"2004-2006","index":0,"n_rows":82,"n_cols":14,"rows_kept":82,"cut":false,"hidden":false,"merged":[[1,6,2,6],[1,1,2,1],[1,2,2,2],[1,3,2,3],[1,4,2,4],[1,5,2,5],[1,13,2,13],[1,7,2,7],[1,8,2,8],[1,9,2,9],[1,10,1,12]]}
[]
[null,"Nom","Prénom","N° Carte","Adresse","CP","Ville","Téléphone","Portable","Email","Date Naiss",null,null,"Date"]
[null,null,null,null,null,null,null,null,null,null,"Mois","Jour","Année"]
[75,"ASSEZ","Sylvie",75,"cotes Belot",21170,"Montot",380298411,null,null,{"$f":"IF((N4)=\"\",\"\",IF(MONTH(N4)=1,\"Janvier\",IF(MONTH(N4)=2,\"Février\",IF(MONTH(N4)=3,\"Mars\",IF(MONTH(N4)=4,\"Avril\",IF(MONTH(N4)=5,\"Mai\",IF(MONTH(N4)=6,\"Juin\",IF(MONTH(N4)=7,\"Juillet\",IF(MONTH(N4)=8,\"Août\",IF(MONTH(N4)=9,\"Septembre\",IF(MONTH(N4)=10,\"Octobre\",IF(MONTH(N4)=11,\"Novembre\",\"Décembre\"))))))))))))","v":""},{"$f":"IF(N4=\"\",\"\",DAY(N4))","v":""},{"$f":"IF(N4=\"\",\"\",YEAR(N4))","v":""}]
[76,"BAJOTET","Marie-Thérèse",76,null,21470,"Brazey en plaine",null,626473855,null,"","",""]
[4,"BEHEREC","Franck",4,"3 Impasse Verdi",21470,"Brazey en plaine",380298947,614462165,"franck.beherec@wanadoo.fr","Octobre",24,1967,"1967-10-24"]
[77,"Belleterre","Christiane",77,"39, Quai de la butte",21170,"Losne",null,null,null,"Octobre",14,1950,"1950-10-14"]
[7,"Bernigaud","Yvonne",7,"Les Floralies",21170,"St Jean de Losne",null,null,null,"Janvier",24,1932,"1932-01-24"]
[8,"Blanc","Gérard",8,"19, Ancienne route de Seurre",21170,"Losne",null,null,null,"Décembre",12,1961,"1961-12-12"]
[9,"Boudrot","Alain",9,"13, Rue des illes",21170,"St Jean de Losne",null,null,null,"Février",9,1965,"1965-02-09"]
[10,"Bougaud","Catherine",10,"10, Rue de St Loup",39410,"St Aubin (39)",null,null,null,"Septembre",13,1963,"1963-09-13"]
[11,"Boulardot","Jean-Paul",11,"35, Rue de la Saône",21170,"St Jean de Losne",null,null,null,"Avril",21,1957,"1957-04-21"]
[12,"Bruant ","Gérard",12,"10, Rue de la Saône",21170,"Chaugey",null,null,null,"Mai",21,1936,"1936-05-21"]
[64,"Bullier ","Patrick",64,"4, Rue des bois",21250,"Chamblanc",null,null,null,"Avril",19,1953,"1953-04-19"]
[19,"CLEMENCE","Bernard",19,"9 Rue de la petite levée",21170,"Losne",380392678,677647670,"bernard-clemence@wanadoo.fr","Mars",6,1942,"1942-03-06"]
[13,"Cattano","François",13,"23, Rue du moulin",21170,"Echenon",null,null,null,"","",""]
[14,"Cattano","Michel",14,"23, Rue du moulin",21170,"Echenon",null,null,null,"","",""]
[15,"Caty","Alain",15,"Rue du patis des buissons",21250,"Tichey",null,null,null,"Mars",4,1936,"1936-03-04"]
[16,"CATY","Anne Marie",16,"rue du patis des buissons",21250,"Tichey",380210868,null,null,"Février",13,1938,"1938-02-13"]
[3,"Chaventon","Emmanuel",3,"4, Ruelle des Morts",21170,"Charrey sur Saône",null,null,null,"","",""]
[18,"Chaventon","Françoise",18,"4, Ruelle des morts",21170,"Charrey sur Saône",null,null,null,"","",""]
[17,"Chaventon","Gérard",17,"4, Ruelle des morts",21170,"Charrey sur Saône",null,null,null,"","",""]
[65,"Constancias","Anne-Marie",65,"12, Imp de fleurs",21250,"Seurre",null,null,null,"Septembre",5,1947,"1947-09-05"]
[20,"CORNOT","Daniel",20,"4 ter grande rue du faubourg St Michel",21250,"Seurre",380210480,null,"cornot.daniel@wanadoo.fr","","",""]
[21,"CORNUEL","Michel",21,"14 Rue St Jacques",21170,"St Usage",380291162,null,"cornuel.michel@wanadoo.fr","Septembre",5,1943,"1943-09-05"]
[66,"Crotet ","Roger",66,"51, Grand chemin de Charrey",21170,"Esbarres",null,null,null,"","",""]
[22,"Cureau","Bernard",22,"5, Quai National",21170,"St Jean de Losne",null,null,null,"Avril",5,1927,"1927-04-05"]
[23,"Degrace","Michele",23,"21, Rue du paradis",21170,"Maison-Dieu",null,null,null,"","",""]
[24,"Del Gaudio","Anne",24,"79, Grande rue",21130,"Champdotre",null,null,null,"","",""]
[25,"Del Gaudio","Isa",25,"79 Grande rue",21130,"Champdotre",380394711,null,null,"","",""]
[26,"DELAGRANGE","Michel",26,"225 Rue du château",21250,"Broin",380269485,null,"michel.delagrange@wanadoo.fr","Avril",18,1938,"1938-04-18"]
[66,"Donnet","Sandrine",66,"17, Rue Marion",21170,"St Jean de Losne",null,null,null,"Septembre",23,1950,"1950-09-23"]
[27,"Dromard","Michelle",27,"1, Rue du 8 mai 1945",21250,"Seurre",null,null,null,"Mars",10,1938,"1938-03-10"]
[28,"Dromard","Robert",28,"1, Rue du 8 mai 1945",21250,"Seurre",null,null,null,"Octobre",6,1937,"1937-10-06"]
[67,"Drouelle","Denise",67,"7, Port St Jean",21170,"St Jean de Losne",null,null,null,"Mars",16,1931,"1931-03-16"]
[29,"Dubroca","Thierry",29,"37b, Rue Charles Dumont",21000,"Dijon",null,null,null,"Novembre",10,1951,"1951-11-10"]
[68,"Evrard","Stéphanie",68,"Rue Capitaine Coignet",21130,"Auxonne",null,null,null,"","",""]
[32,"GANEE","Daniel",32,"13bis Rue porte de Dijon",21170,"St Jean de Losne",380392406,687393975,null,"Décembre",19,1949,"1949-12-19"]
[30,"Farion-Variot","Jocelyne",30,"29, Allée de Bellevue",21170,"Losne",null,null,null,{"$f":"IF((N39)=\"\",\"\",IF(MONTH(N39)=1,\"Janvier\",IF(MONTH(N39)=2,\"Février\",IF(MONTH(N39)=3,\"Mars\",IF(MONTH(N39)=4,\"Avril\",IF(MONTH(N39)=5,\"Mai\",IF(MONTH(N39)=6,\"Juin\",IF(MONTH(N39)=7,\"Juillet\",IF(MONTH(N39)=8,\"Août\",IF(MONTH(N39)=9,\"Septembre\",IF(MONTH(N39)=10,\"Octobre\",IF(MONTH(N39)=11,\"Novembre\",\"Décembre\"))))))))))))","v":""},{"$f":"IF(N39=\"\",\"\",DAY(N39))","v":""},{"$f":"IF(N39=\"\",\"\",YEAR(N39))","v":""}]
[2,"Faure","Robert",2," Rue de la Liberté",21170,"St Jean de Losne",null,null,null,"Avril",7,1968,"1968-04-07"]
[1,"Faure","Sylvain",1,"14, Rue des Messiers  ",21170,"St Jean de Losne",null,null,null,"Décembre",20,1971,"1971-12-20"]
[31,"François","Pascal",31,"11, Avenue de Chambolland",21700,"Nuit St Georges",null,null,null,"","",""]
[33,"Gautheron","Christiane",33,"2, Rue des lilas",21170,"Losne",380291147,616900396,"gautheroncl@wanadoo.fr","","",""]
[34,"Gautheron","Claude",34,"2, Rue des lilas",21170,"Losne",380291147,616900396,"gautheroncl@wanadoo.fr","Février",16,1937,"1937-02-16"]
[35,"Hallvin","Pierre",35,"5 Rue de la place",21250,"Labruyère",null,null,null,"","",""]
[6,"Jamin","Frédéric",6,"8, Rue du champ Baudot",21170,"Echenon",null,null,null,"","",""]
[36,"JAN","LOUIS",36,"5 Route de Trouhans",21170,"St Usage",380392269,null,"jan.louis2@wanadoo.fr","Février",11,1923,"1923-02-11"]
[69,"Gestin","Joël",69,"10, Rue du chagnot",21170,"Echenon",null,null,null,"","",""]
[37,"LACREUSE","Gérard",37,"1, Rue Sainte Barbe",21250,"Seurre",380211007,null,"anglacreuse@orange.fr","Octobre",14,1947,"1947-10-14"]
[38,"Lefevre","Denise",38,"Rue d'en haut",21250,"Montagny les Seurre",null,null,null,"","",""]
[39,"Lefevre","Joelle",39,"Rue d'en haut",21250,"Montagny les Seurre",null,null,null,"","",""]
[41,"Malnoy","Monique",41,"5, Rue des bleuets ",21170,"Maison-Dieu",null,null,null,"","",""]
[42,"Marguery","Bernard",42,"6, Rue de la place",21250,"Labruyère",null,null,null,"Décembre",31,1930,"1930-12-31"]
[43,"Momus","Denise",43,"6, Rue de la place",21250,"Labruyère",null,null,null,"Mars",14,1930,"1930-03-14"]
[44,"MOREUX","Richard",44,"4 Rue du château",21110,"Bessey les Citeaux",380297726,662937092,"richardmoreux@aol.com","Août",21,1949,"1949-08-21"]
[45,"Moullet","Danielle",45,"18, Rue du château",21170,"St Jean de Losne",null,null,null,"Mai",11,1943,"1943-05-11"]
[46,"Muller ","Christine",46,"1, Rue de Verdun",39410,"St Aubin",null,null,null,"","",""]
[47,"Papirer","Dominique",47,"11, Rue d'Amont",21250,"Bonnencontre",null,null,null,"Avril",21,1951,"1951-04-21"]
[49,"Parriaux","Françoise",49,"8 Impasse des fleurs",21250,"Seurre",380210878,620163759,"parriaux.jean-marie@wanadoo.fr","Avril",14,1945,"1945-04-14"]
[50,"Parriaux","Jean-Marie",50,"8, Impasse des fleurs",21250,"Seurre",null,null,null,"Octobre",8,1943,"1943-10-08"]
[48,"PARIZOT","Evelyne",48,"17 Ancienne route de Seurre",21170,"Losne",380392997,null,"parizot.eveline@neuf.fr","Août",18,1951,"1951-08-18"]
[54,"PERRIGUEUR","Suzanne",54,"Rue du Bernon",21250,"Broin",380269104,699210787,"supauze@wanadoo.fr","Avril",1,1942,"1942-04-01"]
[51,"Perret","Sophie",51,"10, Rue du port de pierre",21170,"Maison-Dieu",null,null,null,"Juillet",7,1959,"1959-07-07"]
[52,"Perret","Frédéric",52,"10, Rue du port de pierre",21170,"Maison-Dieu",null,null,null,"Octobre",30,1968,"1968-10-30"]
[53,"Perret","Anthony",53,"10, Rue du pont de pierre",21170,"Maison-Dieu",null,null,null,"Juillet",27,1989,"1989-07-27"]
[55,"Poussiere","Jacques",55,"24, Rue de Chamergy",21170,"Losne",null,null,null,"Juillet",21,1941,"1941-07-21"]
[71,"Rassalle","Catherine",71,"13, Quai de la butte",21170,"Losne",null,null,null,"Avril",18,1960,"1960-04-18"]
[56,"Ricamard","Marie-Claude",56,"10, Rue du port Bernard",21170,"Echenon",null,null,null,"Mars",29,1943,"1943-03-29"]
[57,"Richard","Gaëtant",57,"12, Rue de Savernnes",21170,"Laperrière sur Saône",null,null,null,"Septembre",20,1985,"1985-09-20"]
[58,"RICHETIN","Paul",58,"Rue du Brenon",21250,"Broin",380269104,699210787,"supauze@wanadoo.fr","Avril",17,1936,"1936-04-17"]
[72,"Robelet ","Jacqueline",72,"25, Quai National",21170,"St Jean de Losne",null,null,null,"Octobre",7,1952,"1952-10-07"]
[73,"Said Oili","Oili Issouf",73,"3, Place de halles",21170,"St Jean de Losne",null,null,null,"Décembre",12,1973,"1973-12-12"]
[59,"Saint Felix","Georgette",59,"10, Bastions du Wauxhall",21170,"St Jean de Losne",380290333,null,"georgette.saintfelix@orange.fr","Août",27,1929,"1929-08-27"]
[60,"Taberlet","Claude",60,"15, Route de Losne",39410,"St Aubin",null,null,null,"","",""]
[61,"THIEBEAUX","Chantal",61,"20 Route de Dijon",21470,"Brazey en plaine",380299528,null,"mamiebrazey@aliceadsl.fr","Mai",26,1939,"1939-05-26"]
[62,"Vandel","Isabelle",62,"9, Route de Pagny",21170,"Charrey sur Saône",null,null,null,"Août",30,1960,"1960-08-30"]
[74,"Verne","Martine",74,"12, Rue Vernier",21170,"St Symphorien sur Saône",null,null,null,"","",""]
[5,"Vossaert","Olivier",5,"3, Rue du poirier",21170,"Laperrière sur Saône",null,null,null,"","",""]
[63,"Zobel","Fabienne",63,"25, Avenue de la gare",21170,"St Usage",null,null,null,"","",""]
[]
[]
[null,null,null,null,"78 Adhérents"]

{"sheet":"2006-2007","index":1,"n_rows":60,"n_cols":14,"rows_kept":60,"cut":false,"hidden":false,"merged":[[1,6,2,6],[1,1,2,1],[1,2,2,2],[1,3,2,3],[1,4,2,4],[1,5,2,5],[1,13,2,13],[1,7,2,7],[1,8,2,8],[1,9,2,9],[1,10,1,12]]}
[]
[null,"Nom","Prénom","N° Carte","Adresse","CP","Ville","Téléphone","Portable","Email","Date Naiss",null,null,"Date"]
[null,null,null,null,null,null,null,null,null,null,"Mois","Jour","Année"]
[4,"BEHEREC","Franck",4,"3 Impasse Verdi",21470,"Brazey en plaine",380298947,614462165,"franck.beherec@wanadoo.fr",{"$f":"IF((N4)=\"\",\"\",IF(MONTH(N4)=1,\"Janvier\",IF(MONTH(N4)=2,\"Février\",IF(MONTH(N4)=3,\"Mars\",IF(MONTH(N4)=4,\"Avril\",IF(MONTH(N4)=5,\"Mai\",IF(MONTH(N4)=6,\"Juin\",IF(MONTH(N4)=7,\"Juillet\",IF(MONTH(N4)=8,\"Août\",IF(MONTH(N4)=9,\"Septembre\",IF(MONTH(N4)=10,\"Octobre\",IF(MONTH(N4)=11,\"Novembre\",\"Décembre\"))))))))))))","v":"Octobre"},{"$f":"IF(N4=\"\",\"\",DAY(N4))","v":24},{"$f":"IF(N4=\"\",\"\",YEAR(N4))","v":1967},"1967-10-24"]
[135,"BEUDET","Jean",135,"12, Clos de Bellevue",21250,"Pouilly sur Saone",380204308,null,null,"Janvier",6,1938,"1938-01-06"]
[79,"BOILLAUD","Jean-Louis",79,"8 Route de Beaune",21170,"St Usage",380290667,679396168,"jl.boillaud@wanadoo.fr","Juin",8,1945,"1945-06-08"]
[80,"BUSSIERE","Monique",80,"9, Grande rue",21250,"Bonnencontre",380363662,null,null,"Juillet",7,1947,"1947-07-07"]
[81,"CAPELLI","Chantal",81,"26 Route de Beaune",21170,"St Usage",380779059,null,"Biquette999@yahoo.fr","Août",10,1944,"1944-08-10"]
[82,"CARREZ","Alain",82,"15 Rue de la mare",21170,"Montot",380329317,678333988,"acarrez@wanadoo.fr","Juillet",23,1947,"1947-07-23"]
[16,"CATY","Anne Marie",16,"rue du patis des buissons",21250,"Tichey",380210868,null,null,"Février",13,1938,"1938-02-13"]
[83,"CHEVALIER","Rachel",83,"23 Rue Chanoine Bonnard",21470,"Brazey en plaine",380298577,null,null,"","",""]
[84,"COMBET","Monique",84,null,21250,"Pagny la Ville",380363450,null,null,"","",""]
[85,"DECOSNE","Denise",85,"29 Rue de Meix ",21250,"Seurre",380210183,null,null,"","",""]
[26,"DELAGRANGE","Michel",26,"225 Rue du château",21250,"Broin",380269485,null,"michel.delagrange@wanadoo.fr","Avril",18,1938,"1938-04-18"]
[2,"FAURE","Robert",2," Rue de la Liberté",21170,"St Jean de Losne",null,null,null,"Avril",7,1968,"1968-04-07"]
[1,"FAURE","Sylvain",1,"14, Rue des Messiers  ",21170,"St Jean de Losne",null,null,null,{"$f":"IF((N16)=\"\",\"\",IF(MONTH(N16)=1,\"Janvier\",IF(MONTH(N16)=2,\"Février\",IF(MONTH(N16)=3,\"Mars\",IF(MONTH(N16)=4,\"Avril\",IF(MONTH(N16)=5,\"Mai\",IF(MONTH(N16)=6,\"Juin\",IF(MONTH(N16)=7,\"Juillet\",IF(MONTH(N16)=8,\"Août\",IF(MONTH(N16)=9,\"Septembre\",IF(MONTH(N16)=10,\"Octobre\",IF(MONTH(N16)=11,\"Novembre\",\"Décembre\"))))))))))))","v":"Décembre"},{"$f":"IF(N16=\"\",\"\",DAY(N16))","v":20},{"$f":"IF(N16=\"\",\"\",YEAR(N16))","v":1971},"1971-12-20"]
[86,"FORTIN","Marie-Thérèse",86,"50, Avenue de la Gare",21910,"Saulon la Chapelle",380397913,null,"mariethe.fo1@aliceadsl.fr","Mai",31,1943,"1943-05-31"]
[87,"FREYLON","Patrick",87,null,21250,"Pagny la Ville",null,623308282,"patrick-freylon@neuf,fr","","",""]
[88,"GAGNEPAIN","Sabine",88,"4, Rue de Beauraing",21250,"Seurre",380203724,null,null,"","",""]
[33,"GAUTHERON","Christiane",33,"2, Rue des lilas",21170,"Losne",380291147,616900396,"gautheroncl@wanadoo.fr","","",""]
[34,"GAUTHERON","Claude",34,"2, Rue des lilas",21170,"Losne",380291147,616900396,"gautheroncl@wanadoo.fr","Février",16,1937,"1937-02-16"]
[89,"HELIOT","Alexis",89,"25 Route de la Saône",21170,"Losne",380291553,null,null,"","",""]
[90,"HUGUENOT","Jean-Louis",90,"25 Rue Chanoine Bonnard",21470,"Brazey en plaine",380298316,null,"huguenotjl@aol.com","","",""]
[91,"HUGUENOT","Etienne",91,"25 Rue Chanoine Bonnard",21470,"Brazey en plaine",380298316,null,null,"","",""]
[92,"HUGUENOT","Robin",92,"25 Rue Chanoine Bonnard",21470,"Brazey en plaine",380298316,null,null,"","",""]
[36,"JAN","LOUIS",36,"5 Route de Trouhans",21170,"St Usage",380392269,null,"jan.louis2@wanadoo.fr","Février",11,1923,"1923-02-11"]
[93,"JEANNIN","Gérard",93,"15 Rue Monge",21170,"St Jean de Losne",380501337,null,null,"","",""]
[94,"JEANNIN","Sylvie",94,"15 Rue Monge",21170,"St Jean de Losne",380501337,611668101,"jeannin_rougelet@hotmail.fr","","",""]
[37,"LACREUSE","Gérard",37,"1, Rue Sainte Barbe",21250,"Seurre",380211007,null,"anglacreuse@orange.fr","Octobre",14,1947,"1947-10-14"]
[40,"LEGROS","Lucien",40,"66, Grande rue",21250,"Pagny la Ville",380363191,null,"legros.lucien@wanadoo.fr","Février",16,1933,"1933-02-16"]
[95,"LEROUX","Patrick",95,null,21470,"Brazey en plaine",null,603430826,null,"Janvier",12,1954,"1954-01-12"]
[96,"LEROY","Claude",96,"20 Meix aux Cas",21470,"Brazey en plaine",380298966,null,null,"","",""]
[97,"LINCK","Quentin",97,"11 Cours Pierre et Marie Curie",21470,"Brazey en plaine",380298966,null,null,"","",""]
[98,"MARCHAND","Michel",98,"19 Rue du Jura",21110,"Aiserey",380297202,null,null,"","",""]
[42,"MARGUERY","Bernard",42,"6, Rue de la place",21250,"Labruyère",null,null,null,"Décembre",31,1930,"1930-12-31"]
[99,"MATHIRON","David",99,"3 Rue de la rivière",21110,"Bessey les Citeaux",null,623664409,null,{"$f":"IF((N36)=\"\",\"\",IF(MONTH(N36)=1,\"Janvier\",IF(MONTH(N36)=2,\"Février\",IF(MONTH(N36)=3,\"Mars\",IF(MONTH(N36)=4,\"Avril\",IF(MONTH(N36)=5,\"Mai\",IF(MONTH(N36)=6,\"Juin\",IF(MONTH(N36)=7,\"Juillet\",IF(MONTH(N36)=8,\"Août\",IF(MONTH(N36)=9,\"Septembre\",IF(MONTH(N36)=10,\"Octobre\",IF(MONTH(N36)=11,\"Novembre\",\"Décembre\"))))))))))))","v":""},{"$f":"IF(N36=\"\",\"\",DAY(N36))","v":""},{"$f":"IF(N36=\"\",\"\",YEAR(N36))","v":""}]
[100,"MATHIRON","Ghislaine",100,"3 Rue de la rivière",21110,"Bessey les Citeaux",380297865,null,null,{"$f":"IF((N37)=\"\",\"\",IF(MONTH(N37)=1,\"Janvier\",IF(MONTH(N37)=2,\"Février\",IF(MONTH(N37)=3,\"Mars\",IF(MONTH(N37)=4,\"Avril\",IF(MONTH(N37)=5,\"Mai\",IF(MONTH(N37)=6,\"Juin\",IF(MONTH(N37)=7,\"Juillet\",IF(MONTH(N37)=8,\"Août\",IF(MONTH(N37)=9,\"Septembre\",IF(MONTH(N37)=10,\"Octobre\",IF(MONTH(N37)=11,\"Novembre\",\"Décembre\"))))))))))))","v":""},{"$f":"IF(N37=\"\",\"\",DAY(N37))","v":""},{"$f":"IF(N37=\"\",\"\",YEAR(N37))","v":""}]
[101,"MATHIRON","Virginie",101,"Allée bastion des Charmilles",21170,"St Jean de Losne",null,678718325,null,{"$f":"IF((N38)=\"\",\"\",IF(MONTH(N38)=1,\"Janvier\",IF(MONTH(N38)=2,\"Février\",IF(MONTH(N38)=3,\"Mars\",IF(MONTH(N38)=4,\"Avril\",IF(MONTH(N38)=5,\"Mai\",IF(MONTH(N38)=6,\"Juin\",IF(MONTH(N38)=7,\"Juillet\",IF(MONTH(N38)=8,\"Août\",IF(MONTH(N38)=9,\"Septembre\",IF(MONTH(N38)=10,\"Octobre\",IF(MONTH(N38)=11,\"Novembre\",\"Décembre\"))))))))))))","v":""},{"$f":"IF(N38=\"\",\"\",DAY(N38))","v":""},{"$f":"IF(N38=\"\",\"\",YEAR(N38))","v":""}]
[102,"MAZUE","Nelly",102,"29 Grande route de Seurre",21250,"Chamblanc",380204515,null,null,{"$f":"IF((N39)=\"\",\"\",IF(MONTH(N39)=1,\"Janvier\",IF(MONTH(N39)=2,\"Février\",IF(MONTH(N39)=3,\"Mars\",IF(MONTH(N39)=4,\"Avril\",IF(MONTH(N39)=5,\"Mai\",IF(MONTH(N39)=6,\"Juin\",IF(MONTH(N39)=7,\"Juillet\",IF(MONTH(N39)=8,\"Août\",IF(MONTH(N39)=9,\"Septembre\",IF(MONTH(N39)=10,\"Octobre\",IF(MONTH(N39)=11,\"Novembre\",\"Décembre\"))))))))))))","v":""},{"$f":"IF(N39=\"\",\"\",DAY(N39))","v":""},{"$f":"IF(N39=\"\",\"\",YEAR(N39))","v":""}]
[103,"MICHAUD","Sylvie",103,"Impasse Jean Curé ",21470,"Brazey en plaine",380298230,null,null,{"$f":"IF((N40)=\"\",\"\",IF(MONTH(N40)=1,\"Janvier\",IF(MONTH(N40)=2,\"Février\",IF(MONTH(N40)=3,\"Mars\",IF(MONTH(N40)=4,\"Avril\",IF(MONTH(N40)=5,\"Mai\",IF(MONTH(N40)=6,\"Juin\",IF(MONTH(N40)=7,\"Juillet\",IF(MONTH(N40)=8,\"Août\",IF(MONTH(N40)=9,\"Septembre\",IF(MONTH(N40)=10,\"Octobre\",IF(MONTH(N40)=11,\"Novembre\",\"Décembre\"))))))))))))","v":""},{"$f":"IF(N40=\"\",\"\",DAY(N40))","v":""},{"$f":"IF(N40=\"\",\"\",YEAR(N40))","v":""}]
[70,"MILLIOT","Virginie",70,"17, Rue meix brulé",21170,"St Jean de Losne",null,null,null,"Juillet",7,1955,"1955-07-07"]
[44,"MOREUX","Richard",44,"4 Rue du château",21110,"Bessey les Citeaux",380297726,662937092,"richardmoreux@aol.com",{"$f":"IF((N42)=\"\",\"\",IF(MONTH(N42)=1,\"Janvier\",IF(MONTH(N42)=2,\"Février\",IF(MONTH(N42)=3,\"Mars\",IF(MONTH(N42)=4,\"Avril\",IF(MONTH(N42)=5,\"Mai\",IF(MONTH(N42)=6,\"Juin\",IF(MONTH(N42)=7,\"Juillet\",IF(MONTH(N42)=8,\"Août\",IF(MONTH(N42)=9,\"Septembre\",IF(MONTH(N42)=10,\"Octobre\",IF(MONTH(N42)=11,\"Novembre\",\"Décembre\"))))))))))))","v":"Août"},{"$f":"IF(N42=\"\",\"\",DAY(N42))","v":21},{"$f":"IF(N42=\"\",\"\",YEAR(N42))","v":1949},"1949-08-21"]
[104,"MOUROLIN","Jean-Claude",104,"20 Rue du paradis",21170,"Maison-Dieu",380291556,null,null,{"$f":"IF((N43)=\"\",\"\",IF(MONTH(N43)=1,\"Janvier\",IF(MONTH(N43)=2,\"Février\",IF(MONTH(N43)=3,\"Mars\",IF(MONTH(N43)=4,\"Avril\",IF(MONTH(N43)=5,\"Mai\",IF(MONTH(N43)=6,\"Juin\",IF(MONTH(N43)=7,\"Juillet\",IF(MONTH(N43)=8,\"Août\",IF(MONTH(N43)=9,\"Septembre\",IF(MONTH(N43)=10,\"Octobre\",IF(MONTH(N43)=11,\"Novembre\",\"Décembre\"))))))))))))","v":""},{"$f":"IF(N43=\"\",\"\",DAY(N43))","v":""},{"$f":"IF(N43=\"\",\"\",YEAR(N43))","v":""}]
[46,"MULLER","Christine",46,"1, Rue de Verdun",39410,"St Aubin"]
[105,"NIOLLET","Michele",105,"1 Ancienne route de Seurre",21170,"St Jean de Losne",380392354,610386150,"niollet.michele@neuf.fr",{"$f":"IF((N45)=\"\",\"\",IF(MONTH(N45)=1,\"Janvier\",IF(MONTH(N45)=2,\"Février\",IF(MONTH(N45)=3,\"Mars\",IF(MONTH(N45)=4,\"Avril\",IF(MONTH(N45)=5,\"Mai\",IF(MONTH(N45)=6,\"Juin\",IF(MONTH(N45)=7,\"Juillet\",IF(MONTH(N45)=8,\"Août\",IF(MONTH(N45)=9,\"Septembre\",IF(MONTH(N45)=10,\"Octobre\",IF(MONTH(N45)=11,\"Novembre\",\"Décembre\"))))))))))))","v":"Juillet"},{"$f":"IF(N45=\"\",\"\",DAY(N45))","v":6},{"$f":"IF(N45=\"\",\"\",YEAR(N45))","v":1944},"1944-07-06"]
[106,"ORENGA","Catherine",106,"2 ruelle des Moreaux",21170,"Maison-Dieu",380290833,608184914,"vincent.orenga@club-internet.fr","Février",1,1964,"1964-02-01"]
[108,"PASSEMARD","Annie",108,"1 Rue du moulin",21470,"Brazey en plaine",380299171,null,null,"","",""]
[109,"PASSEMARD","Jacqueline",109,"5 Rue de la Biètre",21470,"Brazey en plaine",380299274,null,null,"","",""]
[110,"PASSEMARD","Robert",110,"5 Rue de la Biètre",21470,"Brazey en plaine",380299274,null,null,"","",""]
[54,"PERRIGUEUR","Suzanne",54,"Rue du Bernon",21250,"Broin",380269104,699210787,"supauze@wanadoo.fr","Avril",1,1942,"1942-04-01"]
[111,"PICARD","Jean",111,"59 Rue Antoine Masson",21130,"Auxonne",380373004,null,null,{"$f":"IF((N51)=\"\",\"\",IF(MONTH(N51)=1,\"Janvier\",IF(MONTH(N51)=2,\"Février\",IF(MONTH(N51)=3,\"Mars\",IF(MONTH(N51)=4,\"Avril\",IF(MONTH(N51)=5,\"Mai\",IF(MONTH(N51)=6,\"Juin\",IF(MONTH(N51)=7,\"Juillet\",IF(MONTH(N51)=8,\"Août\",IF(MONTH(N51)=9,\"Septembre\",IF(MONTH(N51)=10,\"Octobre\",IF(MONTH(N51)=11,\"Novembre\",\"Décembre\"))))))))))))","v":""},{"$f":"IF(N51=\"\",\"\",DAY(N51))","v":""},{"$f":"IF(N51=\"\",\"\",YEAR(N51))","v":""}]
[112,"PICARD","Adrienne",112,"59 Rue Antoine Masson",21130,"Auxonne",380373004,null,null,"","",""]
[58,"RICHETIN","Paul",58,"Rue du Brenon",21250,"Broin",380269104,699210787,"supauze@wanadoo.fr",{"$f":"IF((N53)=\"\",\"\",IF(MONTH(N53)=1,\"Janvier\",IF(MONTH(N53)=2,\"Février\",IF(MONTH(N53)=3,\"Mars\",IF(MONTH(N53)=4,\"Avril\",IF(MONTH(N53)=5,\"Mai\",IF(MONTH(N53)=6,\"Juin\",IF(MONTH(N53)=7,\"Juillet\",IF(MONTH(N53)=8,\"Août\",IF(MONTH(N53)=9,\"Septembre\",IF(MONTH(N53)=10,\"Octobre\",IF(MONTH(N53)=11,\"Novembre\",\"Décembre\"))))))))))))","v":"Avril"},{"$f":"IF(N53=\"\",\"\",DAY(N53))","v":17},{"$f":"IF(N53=\"\",\"\",YEAR(N53))","v":1936},"1936-04-17"]
[114,"SAUDER","Marie-Odile",114,"12 Meix d'Ebarres",21470,"Brazey en plaine",380299731,null,null,"","",""]
[115,"SEGUIN","Joelle",115,"10 Rue du tissage",21470,"Brazey en plaine",380299412,null,null,"","",""]
[61,"THIEBEAUX","Chantal",61,"20 Route de Dijon",21470,"Brazey en plaine",380299528,null,"mamiebrazey@aliceadsl.fr","Mai",26,1939,"1939-05-26"]
[117,"WINTER","Michel",117,"22, Rue du Brevail",21470,"Brazey en plaine",380299416,null,null,"Août",15,1934,"1934-08-15"]
[118,"WINTER","Michele",118,"22 Rue du Brevail",21470,"Brazey en plaine",380299416,null,null,"","",""]
[]
[null,null,null,null,"55 Adhérents"]

{"sheet":"2007-2008","index":2,"n_rows":56,"n_cols":16,"rows_kept":56,"cut":false,"hidden":false,"merged":[[1,15,2,15],[1,6,2,6],[1,1,2,1],[1,2,2,2],[1,3,2,3],[1,4,2,4],[1,5,2,5],[1,7,2,7],[1,8,2,8],[1,9,2,9],[1,13,2,13],[1,14,2,14],[1,10,1,12]]}
[]
[null,"Nom","Prénom","N° Carte","Adresse","CP","Ville","Téléphone","Portable","Email","Date Naiss",null,null,"A ou R",null,"Date"]
[null,null,null,null,null,null,null,null,null,null,"Mois","Jour","Année"]
[126,"Amiot","André",126,"14, Rue des Oies  ",21170,"Echenon",380290222,null,null,{"$f":"IF((P4)=\"\",\"\",IF(MONTH(P4)=1,\"Janvier\",IF(MONTH(P4)=2,\"Février\",IF(MONTH(P4)=3,\"Mars\",IF(MONTH(P4)=4,\"Avril\",IF(MONTH(P4)=5,\"Mai\",IF(MONTH(P4)=6,\"Juin\",IF(MONTH(P4)=7,\"Juillet\",IF(MONTH(P4)=8,\"Août\",IF(MONTH(P4)=9,\"Septembre\",IF(MONTH(P4)=10,\"Octobre\",IF(MONTH(P4)=11,\"Novembre\",\"Décembre\"))))))))))))","v":"Janvier"},{"$f":"IF(P4=\"\",\"\",DAY(P4))","v":19},{"$f":"IF(P4=\"\",\"\",YEAR(P4))","v":1947},"A","P","1947-01-19"]
[4,"Beherec","Franck",4,"3 Impasse Verdi",21470,"Brazey en plaine",380298947,614462165,"franck.beherec@wanadoo.fr",{"$f":"IF((P5)=\"\",\"\",IF(MONTH(P5)=1,\"Janvier\",IF(MONTH(P5)=2,\"Février\",IF(MONTH(P5)=3,\"Mars\",IF(MONTH(P5)=4,\"Avril\",IF(MONTH(P5)=5,\"Mai\",IF(MONTH(P5)=6,\"Juin\",IF(MONTH(P5)=7,\"Juillet\",IF(MONTH(P5)=8,\"Août\",IF(MONTH(P5)=9,\"Septembre\",IF(MONTH(P5)=10,\"Octobre\",IF(MONTH(P5)=11,\"Novembre\",\"Décembre\"))))))))))))","v":"Octobre"},{"$f":"IF(P5=\"\",\"\",DAY(P5))","v":24},{"$f":"IF(P5=\"\",\"\",YEAR(P5))","v":1967},"R","P","1967-10-24"]
[135,"Beudet","Jean",135,"12, Clos de Bellevue",21250,"Pouilly sur Saone",380204308,null,null,"Janvier",6,1938,"R","P","1938-01-06"]
[79,"Boillaud","Jean-Louis",79,"8 Route de Beaune",21170,"St Usage",380290667,679396168,"jl.boillaud@wanadoo.fr","Juin",6,1945,"R","P","1945-06-06"]
[133,"Boulogne","Jean-Marie",133,"28, Rue du Chanoine Bonnard",21470,"Brazey en plaine",null,630499384,null,"Juin",24,1941,"A","P","1941-06-24"]
[80,"Bussiere","Monique",80,"9, Grande rue",21250,"Bonnencontre",380363662,null,null,"Juillet",7,1947,"R","P","1947-07-07"]
[81,"Capelli","Chantal",81,"26 Route de Beaune",21170,"St Usage",380779059,null,"Biquette999@yahoo.fr","Août",10,1944,"R","P","1944-08-10"]
[82,"Carrez","Alain",82,"15 Rue de la mare",21170,"Montot",380329317,678333988,"acarrez@wanadoo.fr","Juillet",23,1947,"A","P","1947-07-23"]
[128,"Chauvot","Madeleine",128,"61, Rue le Meix au tas ",21470,"Brazey en plaine",380299829,null,null,"Septembre",21,1949,"A","P","1949-09-21"]
[127,"Chenevoy","Paulette",127,"1; Rue du Ponteux",21170,"Losne",380290468,632368023,"paulette.chenevoy@orange.fr","Mars",30,1935,"A","P","1935-03-30"]
[null,"Chevalier","Rachel","83","23, Rue Chanoine Bonnard",21470,"Brazey en plaine"]
[19,"Clemence","Bernard",19,"9 Rue de la petite levée",21170,"Losne",380392678,677647670,"bernard-clemence@wanadoo.fr","Mars",6,1942,"R","P","1942-03-06"]
[136,"Clemence","René",136,"9, Rue d'Auxonne",21470,"Brazey en plaine",380298449,null,null,"Février",28,1943,"A","P","1943-02-28"]
[null,"Combet","Monique","84",null,21250,"Pagny la Ville"]
[21,"Cornuel","Michel",21,"14 Rue St Jacques",21170,"St Usage",380291162,null,"cornuel.michel@wanadoo.fr","Septembre",5,1943,"R","P","1943-09-05"]
[129,"Degobe","Annie",129,"8, Rue du canal",21470,"Brazey en plaine",380298005,677326924,null,"","","","A","P"]
[26,"Delagrange","Michel",26,"225 Rue du château",21250,"Broin",380269485,null,"michel.delagrange@wanadoo.fr",{"$f":"IF((P20)=\"\",\"\",IF(MONTH(P20)=1,\"Janvier\",IF(MONTH(P20)=2,\"Février\",IF(MONTH(P20)=3,\"Mars\",IF(MONTH(P20)=4,\"Avril\",IF(MONTH(P20)=5,\"Mai\",IF(MONTH(P20)=6,\"Juin\",IF(MONTH(P20)=7,\"Juillet\",IF(MONTH(P20)=8,\"Août\",IF(MONTH(P20)=9,\"Septembre\",IF(MONTH(P20)=10,\"Octobre\",IF(MONTH(P20)=11,\"Novembre\",\"Décembre\"))))))))))))","v":"Avril"},{"$f":"IF(P20=\"\",\"\",DAY(P20))","v":18},{"$f":"IF(P20=\"\",\"\",YEAR(P20))","v":1938},"R","P","1938-04-18"]
[131,"Dessint","Michel",131,"8, Ancienne route de Seurre",21170,"Losne",null,624976601,null,"Août",3,1934,"A","P","1934-08-03"]
[132,"Dupart","Michel",132,"23, Route de Montot",21170,"St Usage",null,672774655,null,"Mars",13,1965,"A","P","1965-03-13"]
[1,"Fauré","Sylvain",1,"14, Rue des Messiers",21170,"Losne",null,650073803,"sylvain@idis21.fr","Décembre",20,1971,"R","P","1971-12-20"]
[86,"Fortin","Marie-Thérèse",86,"50, Avenue de la Gare",21910,"Saulon la Chapelle",380397913,null,"mariethe.fo1@aliceadsl.fr","Mai",31,1943,"R","P","1943-05-31"]
[119,"Garcia","Jean-Paul",119,"12 Route de Trouhans",21170,"St Usage",380291109,null,null,"Septembre",18,1936,"A","P","1936-09-18"]
[34,"Gautheron","Claude",34,"2 Rue des lilas",21170,"Losne",380291147,616900396,"gautheroncl@wanadoo.fr","Février",16,1937,"R","P","1937-02-16"]
[123,"Grosjean","Denise",123,"606, Rue d'Amont",21250,"Broin",380269365,680818913,"grosjean.d2@wanadoo.fr","Décembre",14,1944,"A","P","1944-12-14"]
[122,"Hory","Patricia",122,"2, Rue du chanoine Bonnard",21470,"Brazey en plaine",380298050,661553459,null,"Mars",19,1965,"A","P","1965-03-19"]
[130,"Jacotot","Louis-Nicolas",130,"3, Grande rue",21250,"Bonnencontre",380363174,null,null,"Avril",22,1998,"A","P","1998-04-22"]
[120,"Jacoutot","Jean",120,"19, Rue des gardes",39410,"St Aubin",384700232,null,"jean.jacoutot@free.fr","Novembre",22,1951,"A","P","1951-11-22"]
[36,"Jan","Louis",36,"5 Route de Trouhans",21170,"St Usage",380392269,null,"jan.louis2@wanadoo.fr","Février",11,1923,"R","P","1923-02-11"]
[134,"Jeanniard","Robert",134,"3, Rue des Bleuets",21110,"Aiserey",380297547,null,"robert.jeanniard@tele2.fr","Janvier",28,1947,"A","P","1947-01-28"]
[37,"Lacreuse","Gérard",37,"1, Rue Sainte Barbe",21250,"Seurre",380211007,null,"anglacreuse@orange.fr","Octobre",14,1947,"R","P","1947-10-14"]
[40,"Legros ","Lucien",40,"66, Grande rue",21250,"Pagny la Ville",380363191,null,"legros.lucien@wanadoo.fr","Février",16,1933,"R","P","1933-02-16"]
[125,"Martiny","Jean-Pierre",125,"43, Rue de Seurre",21170,"Losne",380390805,null,"jean-pierre.martiny21@orange.fr","Septembre",23,1942,"A","P","1942-09-23"]
[121,"Monot","Sylvie",121,"Rue du Tissage",21470,"Brazey en plaine",null,677027216,null,"Octobre",28,1956,"A","P","1956-10-28"]
[44,"Moreux","Richard",44,"4 Rue du château",21110,"Bessey les Citeaux",380297726,662937092,"richardmoreux@aol.com",{"$f":"IF((P37)=\"\",\"\",IF(MONTH(P37)=1,\"Janvier\",IF(MONTH(P37)=2,\"Février\",IF(MONTH(P37)=3,\"Mars\",IF(MONTH(P37)=4,\"Avril\",IF(MONTH(P37)=5,\"Mai\",IF(MONTH(P37)=6,\"Juin\",IF(MONTH(P37)=7,\"Juillet\",IF(MONTH(P37)=8,\"Août\",IF(MONTH(P37)=9,\"Septembre\",IF(MONTH(P37)=10,\"Octobre\",IF(MONTH(P37)=11,\"Novembre\",\"Décembre\"))))))))))))","v":"Août"},{"$f":"IF(P37=\"\",\"\",DAY(P37))","v":12},{"$f":"IF(P37=\"\",\"\",YEAR(P37))","v":1949},"R","P","1949-08-12"]
[107,"Pamart","Alain",107,"9 Rue champ Baudot",21170,"Echenon",380343871,null,"pamartalain@neuf.fr","Mai",6,1944,"R","P","1944-05-06"]
[48,"Parizot","Eveline",48,"17, Ancienne route de Seurre",21170,"Losne",380392997,null,"parizot.evelyne@neuf.fr","Août",18,1951,"R","P","1951-08-18"]
[null,"Pascanet","Odile","116","3, Rue des Meix",21250,"Chamblanc"]
[null,"Passemard","Annie","108","1, Rue du moulin",21470,"Brazey en plaine"]
[null,"Passemard","Jaqueline","109","5, Rue de la Biètre",21470,"Brazey en plaine"]
[null,"Passemard","Robert","110","5, Rue de la Biètre",21470,"Brazey en plaine"]
[54,"Perrigueur","Suzanne",54,"Rue du Bernon",21250,"Broin",380269104,699210787,"supauze@wanadoo.fr","Avril",1,1942,"R","P","1942-04-01"]
[124,"Pilotto","Michele",124,"35, Avenue de la Gare",21470,"St Usage",380368907,null,"michel.pilotto@wanadoo.fr","Mars",31,1947,"A","P","1947-03-31"]
[113,"Renard","Georges",113,"7 Rue du champ Baudot",21170,"Echenon",380779267,null,"gren2@neuf.fr","Novembre",23,1936,"R","P","1936-11-23"]
[58,"Richetin","Paul",58,"Rue du Brenon",21250,"Broin",380269104,699210787,"supauze@wanadoo.fr","Mars",17,1936,"R","P","1936-03-17"]
[61,"Thiebeaux","Chantal",61,"20 Route de Dijon",21470,"Brazey en plaine",380299528,null,"mamiebrazey@aliceadsl.fr","Mai",26,1939,"R","P","1939-05-26"]
[117,"Winter","Michel",117,"22, Rue du Brevail",21470,"Brazey en plaine",380299416,null,null,{"$f":"IF((P49)=\"\",\"\",IF(MONTH(P49)=1,\"Janvier\",IF(MONTH(P49)=2,\"Février\",IF(MONTH(P49)=3,\"Mars\",IF(MONTH(P49)=4,\"Avril\",IF(MONTH(P49)=5,\"Mai\",IF(MONTH(P49)=6,\"Juin\",IF(MONTH(P49)=7,\"Juillet\",IF(MONTH(P49)=8,\"Août\",IF(MONTH(P49)=9,\"Septembre\",IF(MONTH(P49)=10,\"Octobre\",IF(MONTH(P49)=11,\"Novembre\",\"Décembre\"))))))))))))","v":"Septembre"},{"$f":"IF(P49=\"\",\"\",DAY(P49))","v":15},{"$f":"IF(P49=\"\",\"\",YEAR(P49))","v":1934},"R","P","1934-09-15"]
[]
[null,null,null,"En Gras : Les membres du bureau",null,"En Bleu Gras : Les Formateurs"]
[]
[]
[null,"Total = 46"]
[]
[null,null,"Dont : 17 Nouveaux Adhérents"]

{"sheet":"2008-2009","index":3,"n_rows":71,"n_cols":16,"rows_kept":71,"cut":false,"hidden":false,"merged":[[1,0,2,0],[1,1,2,1],[1,2,2,2],[1,3,2,3],[1,4,2,4],[1,15,2,15],[1,13,2,13],[1,14,2,14],[1,10,1,12],[1,5,2,5],[1,6,2,6],[1,7,2,7],[1,8,2,8],[1,9,2,9]]}
[]
[null,"Nom","Prénom","N° Carte","Adresse","CP","Ville","Téléphone","Portable","Email","Date Naiss",null,null,"A ou R",null,"Date"]
[null,null,null,null,null,null,null,null,null,null,"Mois","Jour","Année"]
[155,"Baland","Monique",155,null,null,null,null,null,null,{"$f":"IF((P4)=\"\",\"\",IF(MONTH(P4)=1,\"Janvier\",IF(MONTH(P4)=2,\"Février\",IF(MONTH(P4)=3,\"Mars\",IF(MONTH(P4)=4,\"Avril\",IF(MONTH(P4)=5,\"Mai\",IF(MONTH(P4)=6,\"Juin\",IF(MONTH(P4)=7,\"Juillet\",IF(MONTH(P4)=8,\"Août\",IF(MONTH(P4)=9,\"Septembre\",IF(MONTH(P4)=10,\"Octobre\",IF(MONTH(P4)=11,\"Novembre\",\"Décembre\"))))))))))))","v":"Juin"},{"$f":"IF(P4=\"\",\"\",DAY(P4))","v":1},{"$f":"IF(P4=\"\",\"\",YEAR(P4))","v":1940},"A","P","1940-06-01"]
[4,"Beherec","Franck",4,null,null,null,null,null,null,{"$f":"IF((P5)=\"\",\"\",IF(MONTH(P5)=1,\"Janvier\",IF(MONTH(P5)=2,\"Février\",IF(MONTH(P5)=3,\"Mars\",IF(MONTH(P5)=4,\"Avril\",IF(MONTH(P5)=5,\"Mai\",IF(MONTH(P5)=6,\"Juin\",IF(MONTH(P5)=7,\"Juillet\",IF(MONTH(P5)=8,\"Août\",IF(MONTH(P5)=9,\"Septembre\",IF(MONTH(P5)=10,\"Octobre\",IF(MONTH(P5)=11,\"Novembre\",\"Décembre\"))))))))))))","v":"Octobre"},{"$f":"IF(P5=\"\",\"\",DAY(P5))","v":24},{"$f":"IF(P5=\"\",\"\",YEAR(P5))","v":1967},"R",null,"1967-10-24"]
[156,"Beliard","Christophe",156,null,null,null,null,null,null,"Novembre",30,1972,"A","P","1972-11-30"]
[144,"Bettler","Christian",144,null,null,null,null,null,null,"Février",27,1954,"A","P","1954-02-27"]
[135,"Beudet","Jean",135,null,null,null,null,null,null,"Janvier",6,1938,"R","P","1938-01-06"]
[133,"Boulogne","Jean-Marie",133,null,null,null,null,null,null,"Juin",24,1941,"R","P","1941-06-24"]
[160,"Brugnot","Claudette",160,null,null,null,null,null,null,"Septembre",20,1947,"A","P","1947-09-20"]
[154,"Brun","Ghislaine",154,null,null,null,null,null,null,"Janvier",14,1955,"A","P","1955-01-14"]
[80,"Bussiere","Monique",80,null,null,null,null,null,null,"Juillet",7,1947,"R","P","1947-07-07"]
[81,"Capelli","Chantal",81,null,null,null,null,null,null,"Août",10,1944,"R","P","1944-08-10"]
[82,"Carrez","Alain",82,null,null,null,null,null,null,"Juillet",23,1947,"R","P","1947-07-23"]
[127,"Chenevoy","Paulette",127,null,null,null,null,null,null,"Mars",30,1935,"R","P","1935-03-30"]
[19,"Clemence","Bernard",19,null,null,null,null,null,null,"Mars",6,1942,"R","P","1942-03-06"]
[136,"Clemence","René",136,null,null,null,null,null,null,"Février",28,1943,"R","P","1943-02-28"]
[21,"Cornuel","Michel",21,null,null,null,null,null,null,"Septembre",5,1943,"R","P","1943-09-05"]
[153,"De Duytsche","Michel",153,null,null,null,null,null,null,"Novembre",21,1948,"A","P","1948-11-21"]
[131,"Dessint","Michel",131,null,null,null,null,null,null,"Août",3,1934,"R","P","1934-08-03"]
[137,"Deville ","Jean Louis",137,null,null,null,null,null,null,"Septembre",4,1934,"A","P","1934-09-04"]
[132,"Dupart","Béatrice",157,null,null,null,null,null,null,{"$f":"IF((P22)=\"\",\"\",IF(MONTH(P22)=1,\"Janvier\",IF(MONTH(P22)=2,\"Février\",IF(MONTH(P22)=3,\"Mars\",IF(MONTH(P22)=4,\"Avril\",IF(MONTH(P22)=5,\"Mai\",IF(MONTH(P22)=6,\"Juin\",IF(MONTH(P22)=7,\"Juillet\",IF(MONTH(P22)=8,\"Août\",IF(MONTH(P22)=9,\"Septembre\",IF(MONTH(P22)=10,\"Octobre\",IF(MONTH(P22)=11,\"Novembre\",\"Décembre\"))))))))))))","v":"Novembre"},{"$f":"IF(P22=\"\",\"\",DAY(P22))","v":29},{"$f":"IF(P22=\"\",\"\",YEAR(P22))","v":1966},"R","P","1966-11-29"]
[157,"Dupart","Michel",132,null,null,null,null,null,null,{"$f":"IF((P23)=\"\",\"\",IF(MONTH(P23)=1,\"Janvier\",IF(MONTH(P23)=2,\"Février\",IF(MONTH(P23)=3,\"Mars\",IF(MONTH(P23)=4,\"Avril\",IF(MONTH(P23)=5,\"Mai\",IF(MONTH(P23)=6,\"Juin\",IF(MONTH(P23)=7,\"Juillet\",IF(MONTH(P23)=8,\"Août\",IF(MONTH(P23)=9,\"Septembre\",IF(MONTH(P23)=10,\"Octobre\",IF(MONTH(P23)=11,\"Novembre\",\"Décembre\"))))))))))))","v":"Mars"},{"$f":"IF(P23=\"\",\"\",DAY(P23))","v":13},{"$f":"IF(P23=\"\",\"\",YEAR(P23))","v":1965},"A","P","1965-03-13"]
[1,"Fauré","Sylvain",1,null,null,null,null,null,null,"Décembre",20,1971,"R",null,"1971-12-20"]
[143,"Fevre","Virginie",143,null,null,null,null,null,null,"Août",3,1964,"A","P","1964-08-03"]
[86,"Fortin","Marie-Thérèse",86,null,null,null,null,null,null,{"$f":"IF((P26)=\"\",\"\",IF(MONTH(P26)=1,\"Janvier\",IF(MONTH(P26)=2,\"Février\",IF(MONTH(P26)=3,\"Mars\",IF(MONTH(P26)=4,\"Avril\",IF(MONTH(P26)=5,\"Mai\",IF(MONTH(P26)=6,\"Juin\",IF(MONTH(P26)=7,\"Juillet\",IF(MONTH(P26)=8,\"Août\",IF(MONTH(P26)=9,\"Septembre\",IF(MONTH(P26)=10,\"Octobre\",IF(MONTH(P26)=11,\"Novembre\",\"Décembre\"))))))))))))","v":"Mai"},{"$f":"IF(P26=\"\",\"\",DAY(P26))","v":31},{"$f":"IF(P26=\"\",\"\",YEAR(P26))","v":1943},"R","P","1943-05-31"]
[139,"Garaudet ","Martine",139,null,null,null,null,null,null,{"$f":"IF((P27)=\"\",\"\",IF(MONTH(P27)=1,\"Janvier\",IF(MONTH(P27)=2,\"Février\",IF(MONTH(P27)=3,\"Mars\",IF(MONTH(P27)=4,\"Avril\",IF(MONTH(P27)=5,\"Mai\",IF(MONTH(P27)=6,\"Juin\",IF(MONTH(P27)=7,\"Juillet\",IF(MONTH(P27)=8,\"Août\",IF(MONTH(P27)=9,\"Septembre\",IF(MONTH(P27)=10,\"Octobre\",IF(MONTH(P27)=11,\"Novembre\",\"Décembre\"))))))))))))","v":"Août"},{"$f":"IF(P27=\"\",\"\",DAY(P27))","v":19},{"$f":"IF(P27=\"\",\"\",YEAR(P27))","v":1943},"A","P","1943-08-19"]
[119,"Garcia","Jean-Paul",119,null,null,null,null,null,null,"Septembre",19,1936,"R","P","1936-09-19"]
[163,"Gaudez","Martine",163,null,null,null,null,null,null,"Juin",9,1957,"A","P","1957-06-09"]
[141,"Gaussens","Didier",141,null,null,null,null,null,null,"Mars",7,1952,"A","P","1952-03-07"]
[34,"Gautheron","Claude",34,null,null,null,null,null,null,"Février",16,1937,"R","P","1937-02-16"]
[159,"Gautheron","Roger",159,null,null,null,null,null,null,"Juin",16,1944,"A","P","1944-06-16"]
[122,"Hory","Patricia",122,null,null,null,null,null,null,"Mars",19,1965,"R","P","1965-03-19"]
[130,"Jacotot","Louis-Nicolas",130,null,null,null,null,null,null,"Avril",22,1998,"R","P","1998-04-22"]
[164,"Jacotot","Laurence",164,null,null,null,null,null,null,"Juillet",8,1959,"A","P","1959-07-08"]
[120,"Jacoutot","Jean",120,null,null,null,null,null,null,"Novembre",22,1951,"R","P","1951-11-22"]
[151,"Jakubzack","Monique",151,null,null,null,null,null,null,"Avril",27,1956,"A","P","1956-04-27"]
[36,"Jan","Louis",36,null,null,null,null,null,null,"Février",11,1923,"R","P","1923-02-11"]
[37,"Lacreuse","Gérard",37,null,null,null,null,null,null,"Octobre",14,1947,"R",null,"1947-10-14"]
[145,"Lapostolle","François",145,null,null,null,null,null,null,"Décembre",4,1937,"A","P","1937-12-04"]
[40,"Legros ","Lucien",40,null,null,null,null,null,null,"Février",16,1933,"R","P","1933-02-16"]
[161,"Lerondeau","Michele",161,null,null,null,null,null,null,"Juin",25,1950,"A","P","1950-06-25"]
[95,"Leroux","Patrick",95,null,null,null,null,null,null,"Janvier",12,1954,"R","P","1954-01-12"]
[158,"Lhuillier","Paul",158,null,null,null,null,null,null,"Septembre",23,1951,"A","P","1951-09-23"]
[125,"Martiny","Jean-Pierre",125,null,null,null,null,null,null,"Septembre",23,1942,"R","P","1942-09-23"]
[103,"Michaud","Sylvie",103,null,null,null,null,null,null,{"$f":"IF((P46)=\"\",\"\",IF(MONTH(P46)=1,\"Janvier\",IF(MONTH(P46)=2,\"Février\",IF(MONTH(P46)=3,\"Mars\",IF(MONTH(P46)=4,\"Avril\",IF(MONTH(P46)=5,\"Mai\",IF(MONTH(P46)=6,\"Juin\",IF(MONTH(P46)=7,\"Juillet\",IF(MONTH(P46)=8,\"Août\",IF(MONTH(P46)=9,\"Septembre\",IF(MONTH(P46)=10,\"Octobre\",IF(MONTH(P46)=11,\"Novembre\",\"Décembre\"))))))))))))","v":""},{"$f":"IF(P46=\"\",\"\",DAY(P46))","v":""},{"$f":"IF(P46=\"\",\"\",YEAR(P46))","v":""},"A","P"]
[162,"Mignot","Mireille",162,null,null,null,null,null,null,{"$f":"IF((P47)=\"\",\"\",IF(MONTH(P47)=1,\"Janvier\",IF(MONTH(P47)=2,\"Février\",IF(MONTH(P47)=3,\"Mars\",IF(MONTH(P47)=4,\"Avril\",IF(MONTH(P47)=5,\"Mai\",IF(MONTH(P47)=6,\"Juin\",IF(MONTH(P47)=7,\"Juillet\",IF(MONTH(P47)=8,\"Août\",IF(MONTH(P47)=9,\"Septembre\",IF(MONTH(P47)=10,\"Octobre\",IF(MONTH(P47)=11,\"Novembre\",\"Décembre\"))))))))))))","v":"Janvier"},{"$f":"IF(P47=\"\",\"\",DAY(P47))","v":28},{"$f":"IF(P47=\"\",\"\",YEAR(P47))","v":1947},"A","P","1947-01-28"]
[121,"Monot","Sylvie",121,null,null,null,null,null,null,"Octobre",28,1956,"R","P","1956-10-28"]
[44,"Moreux","Richard",44,null,null,null,null,null,null,"Août",21,1949,"R",null,"1949-08-21"]
[142,"Nicolas","Monique",142,null,null,null,null,null,null,"Mars",12,1948,"A","P","1948-03-12"]
[140,"Paget","Rose Marie",140,null,null,null,null,null,null,"Mai",26,1952,"A","P","1952-05-26"]
[107,"Pamart","Alain",107,null,null,null,null,null,null,"Mai",6,1944,"R","P","1944-05-06"]
[48,"Parizot","Eveline",48,null,null,null,null,null,null,"Août",18,1951,"R","P","1951-08-18"]
[54,"Perrigueur","Suzanne",54,null,null,null,null,null,null,"Avril",1,1942,"R","P","1942-04-01"]
[149,"Pouthier","Chantal",149,null,null,null,null,null,null,"Août",17,1948,"A","P","1948-08-17"]
[146,"Prat","Richard",146,null,null,null,null,null,null,"Avril",21,1947,"A","P","1947-04-21"]
[147,"Prat","Nicole",147,null,null,null,null,null,null,"Juin",1,1949,"A","P","1949-06-01"]
[58,"Richetin","Paul",58,null,null,null,null,null,null,"Mars",17,1936,"R","P","1936-03-17"]
[150,"Royer-Cassard","Martine",150,null,null,null,null,null,null,"Mai",14,1957,"A","P","1957-05-14"]
[61,"Thiebeaux","Chantal",61,null,null,null,null,null,null,"Mai",26,1939,"R",null,"1939-05-26"]
[152,"Tisserandot","Michele",152,null,null,null,null,null,null,"Juillet",24,1948,"A","P","1948-07-24"]
[148,"Vauchet","Georgette",148,null,null,null,null,null,null,"Novembre",21,1948,"A","P","1948-11-21"]
[138,"Villemin","Janine",138,null,null,null,null,null,null,"","","","A","P"]
[117,"Winter","Michel",117,null,null,null,null,null,null,"Septembre",15,1934,"R","P","1934-09-15"]
[]
[]
["Adhérents","Total = ",61,"Adhérents"]
["Noveaux ","Dont :",28,"Nouveaux "]
[]
[]
["En Gras : Les membres du bureau",null,null,"En Gras : Les membres du bureau",null,"En Bleu Gras : Les Animateurs "]

{"sheet":"2009-2010","index":4,"n_rows":69,"n_cols":16,"rows_kept":69,"cut":false,"hidden":false,"merged":[[1,0,2,0],[1,1,2,1],[1,2,2,2],[1,3,2,3],[1,4,2,4],[1,15,2,15],[1,13,2,13],[1,14,2,14],[1,10,1,12],[1,5,2,5],[1,6,2,6],[1,7,2,7],[1,8,2,8],[1,9,2,9]]}
[]
[null,"Nom","Prénom","N° Carte","Adresse","CP","Ville","Téléphone","Portable","Email","Date Naiss",null,null,"A ou R",null,"Date"]
[null,null,null,null,null,null,null,null,null,null,"Mois","Jour","Année"]
[183,"Alagama","Alex",183,"9a, Rue Maréchal Delattre de Tassigny",21470,"Brazey en plaine",380329906,632060653,null,{"$f":"IF((P4)=\"\",\"\",IF(MONTH(P4)=1,\"Janvier\",IF(MONTH(P4)=2,\"Février\",IF(MONTH(P4)=3,\"Mars\",IF(MONTH(P4)=4,\"Avril\",IF(MONTH(P4)=5,\"Mai\",IF(MONTH(P4)=6,\"Juin\",IF(MONTH(P4)=7,\"Juillet\",IF(MONTH(P4)=8,\"Août\",IF(MONTH(P4)=9,\"Septembre\",IF(MONTH(P4)=10,\"Octobre\",IF(MONTH(P4)=11,\"Novembre\",\"Décembre\"))))))))))))","v":"Septembre"},{"$f":"IF(P4=\"\",\"\",DAY(P4))","v":19},{"$f":"IF(P4=\"\",\"\",YEAR(P4))","v":1960},"A","P","1960-09-19"]
[178,"Arbassier","Jean-Claude",178,"16, Route d'Auxonne",21170,"Montot",null,698808355,null,{"$f":"IF((P5)=\"\",\"\",IF(MONTH(P5)=1,\"Janvier\",IF(MONTH(P5)=2,\"Février\",IF(MONTH(P5)=3,\"Mars\",IF(MONTH(P5)=4,\"Avril\",IF(MONTH(P5)=5,\"Mai\",IF(MONTH(P5)=6,\"Juin\",IF(MONTH(P5)=7,\"Juillet\",IF(MONTH(P5)=8,\"Août\",IF(MONTH(P5)=9,\"Septembre\",IF(MONTH(P5)=10,\"Octobre\",IF(MONTH(P5)=11,\"Novembre\",\"Décembre\"))))))))))))","v":"Juillet"},{"$f":"IF(P5=\"\",\"\",DAY(P5))","v":1},{"$f":"IF(P5=\"\",\"\",YEAR(P5))","v":1954},"A","P","1954-07-01"]
[155,"Baland","Monique",155,"5 bd, Mansard - Appt 7",21800,"Quétigny",380317303,620431090,"monique.baland@wanadoo.fr ","Juin",1,1940,"R","P","1940-06-01"]
[4,"Beherec","Franck",4,"3 Impasse Verdi",21470,"Brazey en plaine",380298947,614462165,"frafra21000@gmail.com","Octobre",24,1967,"R",null,"1967-10-24"]
[171,"Besson","Marie-France",171,"28, Rue des Cyclamens",21110,"Aiserey",380297245,null,"t20@orange.fr","Novembre",11,1956,"A","P","1956-11-11"]
[135,"Beudet","Jean",135,"12, Clos de Bellevue",21250,"Pouilly sur Saone",380204308,null,"jean.regina.cb@orange.fr","Janvier",6,1938,"R","P","1938-01-06"]
[172,"Bourgeon","Isabelle",172,"6 Bis, Route de St Usage",21170,"Echenon",380392085,null,"eric.bourgeon@orange.fr","Mai",30,1964,"A","P","1964-05-30"]
[175,"Brubach","Daniel",175,"4, Rue du commun au loups",21110,"Bessey les Citeaux",380566435,613871455,"danetcath@orange.fr","Mars",8,1943,"A","P","1943-03-08"]
[154,"Brun","Ghislaine",154,"6, Rue Mathiron",21130,"Champdotre",964204008,650516215,"ghislainebrun@wanadoo.fr","Janvier",14,1955,"R","P","1955-01-14"]
[82,"Carrez","Alain",82,"15, Rue de la mare",21170,"Montot",380329317,678333988,"a.carrez21@wanadoo.fr","Juillet",23,1947,"R",null,"1947-07-23"]
[188,"Charmont","Nelly",188,"1, Ruelle Notre Dame",21700,"Villebichot",380610928,632224200,"nellycharmont@numeo.fr","Novembre",5,1940,"A","P","1940-11-05"]
[185,"Chaventon","Maurice",185,"3, Le Meix au Car",21470,"Brazey en plaine",380299613,null,null,"Mai",15,1941,"A","P","1941-05-15"]
[186,"Chaventon","Yvonne",186,"3, Le Meix au Car",21470,"Brazey en plaine",380299613,null,null,"Avril",29,1946,"A","P","1946-04-29"]
[127,"Chenevoy","Paulette",127,"1, Rue du Ponteux",21170,"Losne",380290468,632368023,"paulette.chenevoy@orange.fr","Mars",30,1935,"R","P","1935-03-30"]
[136,"Clemence","René",136,"9, Rue d'Auxonne",21470,"Brazey en plaine",380298449,null,null,"Février",28,1943,"R","P","1943-02-28"]
[21,"Cornuel","Michel",21,"14, Rue St Jacques",21170,"St Usage",380291162,667261131,"cornuel.michel@wanadoo.fr","Septembre",5,1943,"R","P","1943-09-05"]
[170,"Dehorter","Anne-Marie",170,"10, Rue du 19 mars 1962",21170,"St Usage",380291282,null,"andre.dehoter@wanadoo.fr","Mars",23,1946,"A","P","1946-03-23"]
[177,"Demongeot","Isabelle",177,"8, Rue Tarnier",21110,"Aiserey",380297750,662083409,null,"Avril",19,1974,"A","P","1974-04-19"]
[131,"Dessint","Michel",131,"4, Place des Ecoles",21170,"St Usage",963291006,632500486,"michel.dessaint0443@orange.fr","Août",3,1934,"R","P","1934-08-03"]
[132,"Dupart","Béatrice",157,"23, Route de Montot",21170,"St Usage",null,672774655,"michel.dupart21@gmail.com","Novembre",29,1966,"R","P","1966-11-29"]
[157,"Dupart","Michel",132,"23, Route de Montot",21170,"St Usage",380290484,672774659,"beadupart@neuf.fr","Mars",13,1965," R ","P","1965-03-13"]
[143,"Fevre","Virginie",143,"15, Rue du Tabourot",21470,"Brazey en plaine",380298213,607483265,"vffevre@wanadoo.fr","Août",3,1964,"R","p","1964-08-03"]
[173,"Gadriot","Daniel",173,"17, Rue de Lée",21110,"Bessey les Citeaux",380297290,null,"danielgadriot@sfr.fr","Juillet",1,1950,"A","G","1950-07-01"]
[139,"Garaudet ","Martine",139,"Place de Verdun",21170,"St Jean de Losne",380392514,632630894,"martine.garaudet@orange.fr","Août",19,1943,"R","P","1943-08-19"]
[141,"Gaussens","Didier",141,"N° 2, Lotissement \"Entre les moulins\"",21170,"Trouhans",380392676,684783912,"didier.gaussens@neuf.fr","Mars",7,1952,"R","P","1952-03-07"]
[34,"Gautheron","Claude",34,"2, Rue des lilas",21170,"Losne",380291147,616900396,"gautheroncl@wanadoo.fr","Février",16,1937,"R","P","1937-02-16"]
[184,"Gautheron","Valérie",184,"130, Route de Dijon",21470,"Brazey en plaine",380298464,null,"gautheronpvayc@aol.com","Septembre",9,1965,"A","P","1965-09-09"]
[122,"Hory","Patricia",122,"8, Place de l'Hotel de ville",21470,"Brazey en plaine",380298050,607060118,null,"Mars",19,1965,"R","P","1965-03-19"]
[130,"Jacotot","Louis-Nicolas",130,"3, Grande rue",21250,"Bonnencontre",380363174,null,"louisnicolas21250@gmail.com","Avril",22,1998,"R","P","1998-04-22"]
[120,"Jacoutot","Jean",120,"19, Rue des gardes",39410,"St Aubin (39)",384700232,699625739,"jean.jacoutot@free.fr","Novembre",22,1951,"R","P","1951-11-22"]
[36,"Jan","Louis",36,"5, Route de Trouhans",21170,"St Usage",380392269,null,"jan.louis2@orange.fr ","Février",11,1923,"R","P","1923-02-11"]
[37,"Lacreuse","Gérard",37,"1, Rue Sainte Barbe",21250,"Seurre",380211007,null,"anglacreuse@orange.fr",{"$f":"IF((P35)=\"\",\"\",IF(MONTH(P35)=1,\"Janvier\",IF(MONTH(P35)=2,\"Février\",IF(MONTH(P35)=3,\"Mars\",IF(MONTH(P35)=4,\"Avril\",IF(MONTH(P35)=5,\"Mai\",IF(MONTH(P35)=6,\"Juin\",IF(MONTH(P35)=7,\"Juillet\",IF(MONTH(P35)=8,\"Août\",IF(MONTH(P35)=9,\"Septembre\",IF(MONTH(P35)=10,\"Octobre\",IF(MONTH(P35)=11,\"Novembre\",\"Décembre\"))))))))))))","v":"Octobre"},{"$f":"IF(P35=\"\",\"\",DAY(P35))","v":14},{"$f":"IF(P35=\"\",\"\",YEAR(P35))","v":1947},"R",null,"1947-10-14"]
[145,"Lapostolle","François",145,"6, Rue Degrange",21170,"Trouhans",380291311,673717837,null,{"$f":"IF((P36)=\"\",\"\",IF(MONTH(P36)=1,\"Janvier\",IF(MONTH(P36)=2,\"Février\",IF(MONTH(P36)=3,\"Mars\",IF(MONTH(P36)=4,\"Avril\",IF(MONTH(P36)=5,\"Mai\",IF(MONTH(P36)=6,\"Juin\",IF(MONTH(P36)=7,\"Juillet\",IF(MONTH(P36)=8,\"Août\",IF(MONTH(P36)=9,\"Septembre\",IF(MONTH(P36)=10,\"Octobre\",IF(MONTH(P36)=11,\"Novembre\",\"Décembre\"))))))))))))","v":"Décembre"},{"$f":"IF(P36=\"\",\"\",DAY(P36))","v":4},{"$f":"IF(P36=\"\",\"\",YEAR(P36))","v":1937},"R","P","1937-12-04"]
[40,"Legros ","Lucien",40,"66, Grande rue",21250,"Pagny la Ville",380363191,null,"legros.lucien@wanadoo.fr","Février",16,1933,"R","P","1933-02-16"]
[161,"Lerondeau","Michele",161,"3, Rue due Beauraing",21250,"Seurre",380211650,null,"lerondeau_metm@yahoo.fr","Juin",25,1950,"R","P","1950-06-25"]
[95,"Leroux","Patrick",95,"8, Place de l'Hotel de ville",21470,"Brazey en plaine",380298050,646270075,"patrick.leroux21470@gmail.com","Janvier",12,1954,"R","P","1954-01-12"]
[158,"Lhuillier","Paul",158,"6, Rue des Séves",21170,"Echenon",380291890,null,"paul.elisabeth0822@orange.fr ","Septembre",23,1951,"R","P","1951-09-23"]
[176,"Marin","Paul",176,"67, Grande rue",21130,"Champdotre",380394089,null,null,"Décembre",1,1938,"A","P","1938-12-01"]
[125,"Martiny","Jean-Pierre",125,"43, Rue de Seurre",21170,"Losne",380390805,null,"jean-pierre.martiny21@orange.fr","Septembre",23,1942,"R","P","1942-09-23"]
[169,"Michaudet","Denise",169,"1Bis, Rue du pasquier",39410,"St Aubin (39)",384700310,null,"denise.michaudet@laposte.net","Avril",23,1950,"A","P ","1950-04-23"]
[174,"Midol-Monnet","Thérèse",174,"2, Rue du champ de Pain",21250,"Jallanges",380904152,null,"henri.midol-monnet@orange.fr","Juillet",26,1942,"A","P","1942-07-26"]
[187,"Mielniczuk","Jeannine",187,"2, Route de Beaune",21170,"St Usage",380291583,null,"gerard.mielniczuk@dbmail.com","Décembre",26,1946,"A","P","1946-12-26"]
[182,"Moissenet","Michel",182,"10, Rue des Roses",21110,"Aiserey",380297830,null,null,"Novembre",28,1949,"A","P","1949-11-28"]
[121,"Monot","Sylvie",121,"Rue du Tissage",21470,"Brazey en plaine",380298859,677027216,"lepetitgalopin21@free.fr","Octobre",28,1956,"R","P","1956-10-28"]
[44,"Moreux","Richard",44,"4, Rue du château",21110,"Bessey les Citeaux",380297726,662937092,"richardmoreux@aol.com","Août",21,1949,"R",null,"1949-08-21"]
[142,"Nicolas","Monique",142,"125, Route de St Jean de Losne",21470,"Brazey en plaine",380299421,null,null,"Mars",12,1948,"R","P","1948-03-12"]
[168,"Once Duthoit","Marie-France",168,"3, Chemin des Calotier",21170,"St Jean de Losne",null,660021584,null,"Juillet",5,1947,"A","P","1947-07-05"]
[107,"Pamart","Alain",107,"9, Rue champ Baudot",21170,"Echenon",380343871,null,"pamartalain@neuf.fr","Mai",6,1944,"R","P","1944-05-06"]
[181,"Pascanet","Odile",181,"3, Rue dues Meix",21150,"Chamblanc",null,672388947,null,"Septembre",25,1960,"A","P","1960-09-25"]
[167,"Peillon","Frédérique",167,"4, Rue Croix Bressand",21170,"St Usage",380392243,null,null,"","","","A","P"]
[149,"Pouthier","Chantal",149,"12, Route de Dijon",39410,"St Aubin (39)",384701643,668826908,"c.pouthier@club-Internet.fr",{"$f":"IF((P54)=\"\",\"\",IF(MONTH(P54)=1,\"Janvier\",IF(MONTH(P54)=2,\"Février\",IF(MONTH(P54)=3,\"Mars\",IF(MONTH(P54)=4,\"Avril\",IF(MONTH(P54)=5,\"Mai\",IF(MONTH(P54)=6,\"Juin\",IF(MONTH(P54)=7,\"Juillet\",IF(MONTH(P54)=8,\"Août\",IF(MONTH(P54)=9,\"Septembre\",IF(MONTH(P54)=10,\"Octobre\",IF(MONTH(P54)=11,\"Novembre\",\"Décembre\"))))))))))))","v":"Août"},{"$f":"IF(P54=\"\",\"\",DAY(P54))","v":17},{"$f":"IF(P54=\"\",\"\",YEAR(P54))","v":1948},"R","P","1948-08-17"]
[113,"Renard","Georges",113,"7, Rue du champ Baudot",21170,"Echenon",380779267,null,"gren2@neuf.fr",{"$f":"IF((P55)=\"\",\"\",IF(MONTH(P55)=1,\"Janvier\",IF(MONTH(P55)=2,\"Février\",IF(MONTH(P55)=3,\"Mars\",IF(MONTH(P55)=4,\"Avril\",IF(MONTH(P55)=5,\"Mai\",IF(MONTH(P55)=6,\"Juin\",IF(MONTH(P55)=7,\"Juillet\",IF(MONTH(P55)=8,\"Août\",IF(MONTH(P55)=9,\"Septembre\",IF(MONTH(P55)=10,\"Octobre\",IF(MONTH(P55)=11,\"Novembre\",\"Décembre\"))))))))))))","v":"Novembre"},{"$f":"IF(P55=\"\",\"\",DAY(P55))","v":23},{"$f":"IF(P55=\"\",\"\",YEAR(P55))","v":1936},"R",null,"1936-11-23"]
[166,"Riffet","Nicole",166,"65, Rue de la saône",21170,"Losne",380291345,null,"nicole.riffet@wanadoo.fr","Décembre",7,1953,"A","P","1953-12-07"]
[165,"Schoutith","Michelle",165,"33, Rue de l'oucherotte",21110,"Aiserey",380297135,621455848,null,"Décembre",1,1945,"A","P","1945-12-01"]
[61,"Thiebeaux","Chantal",61,"20, Route de Dijon",21470,"Brazey en plaine",380299528,null,"mamiebrazey@aliceadsl.fr","Mai",26,1939,"R",null,"1939-05-26"]
[148,"Vauchet","Georgette",148,"3 Bis, Rue des Bois",39410,"St Aubin (39)",384700758,684100856,null,"Novembre",21,1948,"R","P","1948-11-21"]
[138,"Villemin","Janine",138,"10, Rue du port",21470,"Brazey en plaine",380298487,622881874,"janine.villemin@gmail.fr","Juin",5,1937,"R","P","1937-06-05"]
[180,"Vuillemin","Lilyane",180,"2, Route de Citeaux",21170,"Aubigny en Plaine",380298028,null,"lilyane21170@live.fr","Mai",28,1961,"A","P","1961-05-28"]
[117,"Winter","Michel",117,"22, Rue du Brevail",21470,"Brazey en plaine",380299416,null,"michel.winter123@orange.fr ","Septembre",15,1934,"R","P","1934-09-15"]
[]
[]
[null,"Total = ",59,"Adhérents"]
[null,"Dont :",24,"Nouveaux "]
[]
[]
["En Gras : Les membres du bureau",null,null,"En Gras : Les membres du bureau",null,"En Bleu Gras : Les Animateurs "]

{"sheet":"2010-2011","index":5,"n_rows":73,"n_cols":16,"rows_kept":73,"cut":false,"hidden":false,"merged":[[1,1,2,1],[1,2,2,2],[1,3,2,3],[1,4,2,4],[1,5,2,5],[1,15,2,15],[1,14,2,14],[1,10,1,12],[1,6,2,6],[1,7,2,7],[1,8,2,8],[1,9,2,9],[1,13,2,13]]}
[]
[null,"Nom","Prénom","N° Carte","Adresse","CP","Ville","Téléphone","Portable","Email","Date Naiss",null,null,"A ou R",null,"Date"]
[null,null,null,null,null,null,null,null,null,null,"Mois","Jour","Année"]
[192,"Agostini","Christiane",192,null,null,null,null,null,null,{"$f":"IF((P4)=\"\",\"\",IF(MONTH(P4)=1,\"Janvier\",IF(MONTH(P4)=2,\"Février\",IF(MONTH(P4)=3,\"Mars\",IF(MONTH(P4)=4,\"Avril\",IF(MONTH(P4)=5,\"Mai\",IF(MONTH(P4)=6,\"Juin\",IF(MONTH(P4)=7,\"Juillet\",IF(MONTH(P4)=8,\"Août\",IF(MONTH(P4)=9,\"Septembre\",IF(MONTH(P4)=10,\"Octobre\",IF(MONTH(P4)=11,\"Novembre\",\"Décembre\"))))))))))))","v":"Septembre"},{"$f":"IF(P4=\"\",\"\",DAY(P4))","v":17},{"$f":"IF(P4=\"\",\"\",YEAR(P4))","v":1952},"A","P","1952-09-17"]
[210,"Agostini","Séverine",210,null,null,null,null,null,null,{"$f":"IF((P5)=\"\",\"\",IF(MONTH(P5)=1,\"Janvier\",IF(MONTH(P5)=2,\"Février\",IF(MONTH(P5)=3,\"Mars\",IF(MONTH(P5)=4,\"Avril\",IF(MONTH(P5)=5,\"Mai\",IF(MONTH(P5)=6,\"Juin\",IF(MONTH(P5)=7,\"Juillet\",IF(MONTH(P5)=8,\"Août\",IF(MONTH(P5)=9,\"Septembre\",IF(MONTH(P5)=10,\"Octobre\",IF(MONTH(P5)=11,\"Novembre\",\"Décembre\"))))))))))))","v":"Janvier"},{"$f":"IF(P5=\"\",\"\",DAY(P5))","v":2},{"$f":"IF(P5=\"\",\"\",YEAR(P5))","v":1975},"A","P","1975-01-02"]
[4,"Beherec","Franck",4,null,null,null,null,null,null,"Octobre",24,1967,"R","Ani","1967-10-24"]
[207,"Boisseaux","Jocelyne",207,null,null,null,null,null,null,"Février",25,1958,"A","P","1958-02-25"]
[193,"Bougaud","Chantal",193,null,null,null,null,null,null,"Décembre",28,1951,"A","P","1951-12-28"]
[219,"Briselance","Denise",219,null,null,null,null,null,null,"Avril",4,1951,"A","P","1951-04-04"]
[82,"Carrez","Alain",82,null,null,null,null,null,null,"Juillet",23,1947,"R","Ani","1947-07-23"]
[196,"Cattaneo","Nathalie",196,null,null,null,null,null,null,"Août",14,1967,"A","P","1967-08-14"]
[195,"Chaillon","Marie-Christine",195,null,null,null,null,null,null,"Octobre",5,1956,"A","P","1956-10-05"]
[186,"Chaventon","Yvonne",186,null,null,null,null,null,null,"Avril",29,1946,"R","P","1946-04-29"]
[127,"Chenevoy","Paulette",127,null,null,null,null,null,null,"Mars",30,1935,"R","P","1935-03-30"]
[136,"Clemence","René",136,null,null,null,null,null,null,"Février",28,1943,"R","P","1943-02-28"]
[21,"Cornuel","Michel",21,null,null,null,null,null,null,"Septembre",5,1943,"R","P","1943-09-05"]
[194,"Curé","Rémy",194,null,null,null,null,null,null,"Mai",5,1956,"A","P","1956-05-05"]
[129,"Delgobe","Annie",129,null,null,null,null,null,null,"Octobre",28,1947,"A","P ","1947-10-28"]
[131,"Dessaint","Michel",131,null,null,null,null,null,null,"Août",3,1934,"R",null,"1934-08-03"]
[157,"Dupart","Béatrice",157,null,null,null,null,null,null,"Novembre",29,1966,"R","P","1966-11-29"]
[143,"Fevre","Virginie",143,null,null,null,null,null,null,"Août",3,1964,"R","P","1964-08-03"]
[197,"Fleury","Françoise",197,null,null,null,null,null,null,"Septembre",29,1961,"A","MB","1961-09-29"]
[173,"Gadriot","Daniel",173,null,null,null,null,null,null,"Juillet",1,1950,"R","P","1950-07-01"]
[214,"Ganée","Véronique",214,null,null,null,null,null,null,"Mai",10,1958,"A","P","1958-05-10"]
[198,"Garnier","Andrée",198,null,null,null,null,null,null,"Novembre",14,1935,"A","P","1935-11-14"]
[141,"Gaussens","Didier",141,null,null,null,null,null,null,"Mars",7,1952,"R","P","1952-03-07"]
[34,"Gautheron","Claude",34,null,null,null,null,null,null,"Février",16,1937,"R","Ani","1937-02-16"]
[184,"Gautheron","Valérie",184,null,null,null,null,null,null,"Septembre",9,1965,"R","P","1965-09-09"]
[199,"Grivelet","Alain",199,null,null,null,null,null,null,"Octobre",21,1948,"A","P","1948-10-21"]
[200,"Guichard","Yvette",200,null,null,null,null,null,null,"Mars",29,1943,"A","P","1943-03-29"]
[213,"Heliot","Marie-Odile",213,null,null,null,null,null,null,"Mai",21,1950,"A","P","1950-05-21"]
[201,"Henriot","Isabelle",201,null,null,null,null,null,null,"Décembre",27,1962,"A","P","1962-12-27"]
[120,"Jacoutot","Jean",120,null,null,null,null,null,null,"Novembre",22,1951,"R","P","1951-11-22"]
[36,"Jan","Louis",36,null,null,null,null,null,null,"Février",11,1923,"R","P","1923-02-11"]
[37,"Lacreuse","Gérard",37,null,null,null,null,null,null,{"$f":"IF((P35)=\"\",\"\",IF(MONTH(P35)=1,\"Janvier\",IF(MONTH(P35)=2,\"Février\",IF(MONTH(P35)=3,\"Mars\",IF(MONTH(P35)=4,\"Avril\",IF(MONTH(P35)=5,\"Mai\",IF(MONTH(P35)=6,\"Juin\",IF(MONTH(P35)=7,\"Juillet\",IF(MONTH(P35)=8,\"Août\",IF(MONTH(P35)=9,\"Septembre\",IF(MONTH(P35)=10,\"Octobre\",IF(MONTH(P35)=11,\"Novembre\",\"Décembre\"))))))))))))","v":"Octobre"},{"$f":"IF(P35=\"\",\"\",DAY(P35))","v":14},{"$f":"IF(P35=\"\",\"\",YEAR(P35))","v":1947},"R","Ani","1947-10-14"]
[215,"Lahoussine","Marie-France",215,null,null,null,null,null,null,{"$f":"IF((P36)=\"\",\"\",IF(MONTH(P36)=1,\"Janvier\",IF(MONTH(P36)=2,\"Février\",IF(MONTH(P36)=3,\"Mars\",IF(MONTH(P36)=4,\"Avril\",IF(MONTH(P36)=5,\"Mai\",IF(MONTH(P36)=6,\"Juin\",IF(MONTH(P36)=7,\"Juillet\",IF(MONTH(P36)=8,\"Août\",IF(MONTH(P36)=9,\"Septembre\",IF(MONTH(P36)=10,\"Octobre\",IF(MONTH(P36)=11,\"Novembre\",\"Décembre\"))))))))))))","v":"Juillet"},{"$f":"IF(P36=\"\",\"\",DAY(P36))","v":24},{"$f":"IF(P36=\"\",\"\",YEAR(P36))","v":1953},"A","P","1953-07-24"]
[202,"Lasseigne","Anne",202,null,null,null,null,null,null,"Janvier",11,1957,"A","P","1957-01-11"]
[190,"Lauer","Aymeric",190,null,null,null,null,null,null,"Mai",24,1994,"A","P","1994-05-24"]
[191,"Lauer","Nathalie",191,null,null,null,null,null,null,"Juin",25,1965,"A","P","1965-06-25"]
[null,"Lhermitte","Claudia","203"]
[158,"Lhuillier","Paul",158,null,null,null,null,null,null,"Septembre",23,1951,"R","P","1951-09-23"]
[204,"Marseille","Huguette",204,null,null,null,null,null,null,"Août",10,1944,"A","P","1944-08-10"]
[125,"Martiny","Jean-Pierre",125,null,null,null,null,null,null,"Septembre",23,1942,"R ","P","1942-09-23"]
[205,"Masi","Marie-Thérèse",205,null,null,null,null,null,null,"Août",17,1942,"A","P","1942-08-17"]
[169,"Michaudet","Denise",169,null,null,null,null,null,null,"Avril",23,1950,"R","P","1950-04-23"]
[187,"Mielniczuk","Jeannine",187,null,null,null,null,null,null,"Décembre",26,1946,"R","P","1946-12-26"]
[209,"Mielniczuk","Gérard",209,null,null,null,null,null,null,"Janvier",1,1951,"A","P","1951-01-01"]
[212,"Milliere","Christine",212,null,null,null,null,null,null,"Août",26,1955,"A","P","1955-08-26"]
[121,"Monot","Sylvie",121,null,null,null,null,null,null,"Octobre",28,1956,"R","P","1956-10-28"]
[44,"Moreux","Richard",44,null,null,null,null,null,null,"Août",21,1949,"R","Ani","1949-08-21"]
[218,"Mutin","Odile",218,null,null,null,null,null,null,"Avril",4,1953,"A","P","1953-04-04"]
[211,"Muzeau","Huguette",211,null,null,null,null,null,null,"Janvier",13,1947,"A","P","1947-01-13"]
[206,"Nicolas","Jocelyne",206,null,null,null,null,null,null,"Juin",13,1955,"A","P","1955-06-13"]
[107,"Pamart","Alain",107,null,null,null,null,null,null,"Mai",6,1944,"R","P","1944-05-06"]
[181,"Pascanet","Odile",181,null,null,null,null,null,null,"Septembre",25,1960,"R","P","1960-09-25"]
[208,"Philippe","Marie-Jeanne",208,null,null,null,null,null,null,"Janvier",13,1937,"A","P","1937-01-13"]
[189,"Pierron","Michel",189,null,null,null,null,null,null,"Juillet",21,1970,"A","P","1970-07-21"]
[149,"Pouthier","Chantal",149,null,null,null,null,null,null,"Août",17,1948,"R","P","1948-08-17"]
[217,"Raverot","Marie-Claude",217,null,null,null,null,null,null,"Novembre",16,1955,"A","P","1955-11-16"]
[113,"Renard","Georges",113,null,null,null,null,null,null,"Novembre",23,1936,"R","Ani","1936-11-23"]
[166,"Riffet","Nicole",166,null,null,null,null,null,null,"Décembre",7,1953,"R","P","1953-12-07"]
[216,"Sohn","Marie-Thérèse",216,null,null,null,null,null,null,{"$f":"IF((P62)=\"\",\"\",IF(MONTH(P62)=1,\"Janvier\",IF(MONTH(P62)=2,\"Février\",IF(MONTH(P62)=3,\"Mars\",IF(MONTH(P62)=4,\"Avril\",IF(MONTH(P62)=5,\"Mai\",IF(MONTH(P62)=6,\"Juin\",IF(MONTH(P62)=7,\"Juillet\",IF(MONTH(P62)=8,\"Août\",IF(MONTH(P62)=9,\"Septembre\",IF(MONTH(P62)=10,\"Octobre\",IF(MONTH(P62)=11,\"Novembre\",\"Décembre\"))))))))))))","v":"Avril"},{"$f":"IF(P62=\"\",\"\",DAY(P62))","v":17},{"$f":"IF(P62=\"\",\"\",YEAR(P62))","v":1947},"A","P","1947-04-17"]
[220,"Stighezza","René",220,null,null,null,null,null,null,{"$f":"IF((P63)=\"\",\"\",IF(MONTH(P63)=1,\"Janvier\",IF(MONTH(P63)=2,\"Février\",IF(MONTH(P63)=3,\"Mars\",IF(MONTH(P63)=4,\"Avril\",IF(MONTH(P63)=5,\"Mai\",IF(MONTH(P63)=6,\"Juin\",IF(MONTH(P63)=7,\"Juillet\",IF(MONTH(P63)=8,\"Août\",IF(MONTH(P63)=9,\"Septembre\",IF(MONTH(P63)=10,\"Octobre\",IF(MONTH(P63)=11,\"Novembre\",\"Décembre\"))))))))))))","v":"Octobre"},{"$f":"IF(P63=\"\",\"\",DAY(P63))","v":5},{"$f":"IF(P63=\"\",\"\",YEAR(P63))","v":1929},"A","P","1929-10-05"]
[61,"Thiebeaux","Chantal",61,null,null,null,null,null,null,"Mai",26,1939,"R","Ani","1939-05-26"]
[148,"Vauchet","Georgette",148,null,null,null,null,null,null,"Novembre",21,1948,"R","P","1948-11-21"]
[117,"Winter","Michel",117,null,null,null,null,null,null,"Septembre",15,1934,"R","P","1934-09-15"]
[]
[]
["Adhérents","Total = ",63,"Adhérents"]
["Nouveaux ","Dont :",31,"Nouveaux "]
[]
[]
["En Gras : Les membres du bureau",null,null,"En Gras : Les membres du bureau",null,"En Bleu Gras : Les Animateurs "]

{"sheet":"2011-2012","index":6,"n_rows":86,"n_cols":18,"rows_kept":86,"cut":false,"hidden":false,"merged":[[1,17,2,17],[1,6,2,6],[1,15,2,15],[1,1,2,1],[1,2,2,2],[1,3,2,3],[1,4,2,4],[1,5,2,5],[1,7,2,7],[1,8,2,8],[1,9,2,9],[1,13,2,13],[1,14,2,14],[1,10,1,12]]}
[]
[null,"Nom","Prénom","N° Carte","Adresse","CP","Ville","Téléphone","Portable","Email","Date Naiss",null,null,"N ou R",null,"Date",null,"Age"]
[null,null,null,null,null,null,null,null,null,null,"Mois","Jour","Année"]
[192,"Agostini","Christiane",192,null,null,null,null,null,null,{"$f":"IF((P4)=\"\",\"\",IF(MONTH(P4)=1,\"Janvier\",IF(MONTH(P4)=2,\"Février\",IF(MONTH(P4)=3,\"Mars\",IF(MONTH(P4)=4,\"Avril\",IF(MONTH(P4)=5,\"Mai\",IF(MONTH(P4)=6,\"Juin\",IF(MONTH(P4)=7,\"Juillet\",IF(MONTH(P4)=8,\"Août\",IF(MONTH(P4)=9,\"Septembre\",IF(MONTH(P4)=10,\"Octobre\",IF(MONTH(P4)=11,\"Novembre\",\"Décembre\"))))))))))))","v":"Septembre"},{"$f":"IF(P4=\"\",\"\",DAY(P4))","v":17},{"$f":"IF(P4=\"\",\"\",YEAR(P4))","v":1952},"R","AO","1952-09-17",null,{"$f":"IF(P4=\"\",\"\",DATEDIF(P4,TODAY(),\"y\"))","v":61}]
[4,"Beherec","Franck",4,null,null,null,null,null,null,"Octobre",24,1967,"R","Ani","1967-10-24",null,{"$f":"IF(P5=\"\",\"\",DATEDIF(P5,TODAY(),\"y\"))","v":46}]
[228,"Blondot","Marie-Thèrese",228,null,null,null,null,null,null,"Mai",4,1949,"N ","P","1949-05-04",null,65]
[207,"Boisseaux","Jocelyne",207,null,null,null,null,null,null,"Février",25,1958,"R","P","1958-02-25",null,56]
[193,"Bougaud","Chantal",193,null,null,null,null,null,null,"Décembre",28,1951,"R","P","1951-12-28",null,62]
[219,"Bougaud","Denise",219,null,null,null,null,null,null,"Avril",4,1951,"R","P","1951-04-04",null,63]
[221,"Bougaud ","Martine",221,null,null,null,null,null,null,"Juillet",2,1953,"N","P","1953-07-02",null,60]
[82,"Carrez","Alain",82,null,null,null,null,null,null,"Juillet",23,1947,"R","P","1947-07-23",null,66]
[196,"Cattaneo","Nathalie",196,null,null,null,null,null,null,"Août",14,1967,"R","P","1967-08-14",null,{"$f":"IF(P12=\"\",\"\",DATEDIF(P12,TODAY(),\"y\"))","v":46}]
[249,"Chapelotte","Nicole",249,null,null,null,null,null,null,"Mai",30,1944,"N","P","1944-05-30",null,{"$f":"IF(P13=\"\",\"\",DATEDIF(P13,TODAY(),\"y\"))","v":70}]
[186,"Chaventon","Maurice",185,null,null,null,null,null,null,"Avril",29,1946,"R","P","1946-04-29",null,68]
[185,"Chaventon","Yvonne",186,null,null,null,null,null,null,"Mai",15,1941,"R","P","1941-05-15",null,73]
[127,"Chenevoy","Paulette",127,null,null,null,null,null,null,"Mars",30,1935,"R","P","1935-03-30",null,79]
[136,"Clemence","René",136,null,null,null,null,null,null,"Février",28,1943,"R","P","1943-02-28",null,71]
[244,"Clémence","Bernadette",244,null,null,null,null,null,null,"Octobre",30,1944,"N","P","1944-10-30",null,69]
[21,"Cornuel","Michel",21,null,null,null,null,null,null,"Septembre",5,1943,"R","P","1943-09-05",null,70]
[250,"Costanza","Giovanni",250,null,null,null,null,null,null,"Juillet",30,1952,"N","P","1952-07-30",null,61]
[252,"Courtot","Paulette",252,null,null,null,null,null,null,"Janvier",28,1942,"N","P","1942-01-28",null,72]
[245,"Danjean","Jean-Claude",245,null,null,null,null,null,null,"Mai",2,1944,"N","P","1944-05-02",null,70]
[129,"Delgobe","Annie",129,null,null,null,null,null,null,"Octobre",28,1947,"R","P","1947-10-28",null,66]
[225,"Develle","Jacqueline",225,null,null,null,null,null,null,"Juin",18,1956,"N","P","1956-06-18",null,58]
[226,"Develle","Jean-Luc",226,null,null,null,null,null,null,"Mars",6,1955,"N","P","1955-03-06",null,59]
[157,"Dupart","Béatrice",157,null,null,null,null,null,null,"Novembre",29,1966,"R","P","1966-11-29",null,47]
[132,"Dupart","Michel",132,null,null,null,null,null,null,"Mars",13,1965,"R","P","1965-03-13",null,49]
[197,"Fleury","Françoise",197,null,null,null,null,null,null,"Septembre",29,1961,"R","MB","1961-09-29",null,52]
[240,"Fleury","Benjamin",240,null,null,null,null,null,null,"Janvier",21,2001,"N","P","2001-01-21",null,13]
[246,"Forey","Roger",246,null,null,null,null,null,null,"Février",15,1947,"N","P","1947-02-15",null,67]
[247,"Forey","Marie-Claude",247,null,null,null,null,null,null,{"$f":"IF((P31)=\"\",\"\",IF(MONTH(P31)=1,\"Janvier\",IF(MONTH(P31)=2,\"Février\",IF(MONTH(P31)=3,\"Mars\",IF(MONTH(P31)=4,\"Avril\",IF(MONTH(P31)=5,\"Mai\",IF(MONTH(P31)=6,\"Juin\",IF(MONTH(P31)=7,\"Juillet\",IF(MONTH(P31)=8,\"Août\",IF(MONTH(P31)=9,\"Septembre\",IF(MONTH(P31)=10,\"Octobre\",IF(MONTH(P31)=11,\"Novembre\",\"Décembre\"))))))))))))","v":"Avril"},{"$f":"IF(P31=\"\",\"\",DAY(P31))","v":13},{"$f":"IF(P31=\"\",\"\",YEAR(P31))","v":1951},"N","P","1951-04-13",null,63]
[236,"Frizot","Colette",236,null,null,null,null,null,null,"Juillet",31,1927,"N","P","1927-07-31",null,86]
[173,"Gadriot","Daniel",173,null,null,null,null,null,null,"Juillet",1,1950,"R","P","1950-07-01",null,63]
[198,"Garnier","Andrée",198,null,null,null,null,null,null,"Novembre",14,1935,"R","P","1935-11-14",null,78]
[141,"Gaussens","Didier",141,null,null,null,null,null,null,"Mars",7,1952,"R","P","1952-03-07",null,62]
[34,"Gautheron","Claude",34,null,null,null,null,null,null,"Février",16,1937,"R","P","1937-02-16",null,77]
[184,"Gautheron","Valérie",184,null,null,null,null,null,null,"Septembre",9,1965,"R","P","1965-09-09",null,48]
[243,"Gauthier","Françoise",243,null,null,null,null,null,null,"Juin",10,1943,"N","P","1943-06-10",null,71]
[237,"Gay","Fabienne",237,null,null,null,null,null,null,"Janvier",25,1958,"N","P","1958-01-25",null,56]
[242,"Gomes - Da silva","Rose",242,null,null,null,null,null,null,"Novembre",18,1956,"N","P","1956-11-18",null,57]
[248,"Grenot","Claudette",248,null,null,null,null,null,null,"Septembre",30,1951,"N","P","1951-09-30",null,62]
[227,"Guéritée","Claudine",227,null,null,null,null,null,null,"Mai",11,1951,"N","P","1951-05-11",null,63]
[200,"Guichard","Yvette",200,null,null,null,null,null,null,"Mars",29,1943,"R","P","1943-03-29",null,71]
[120,"Jacoutot","Jean",120,null,null,null,null,null,null,"Novembre",22,1951,"R","P","1951-11-22",null,62]
[36,"Jan","Louis",36,null,null,null,null,null,null,"Février",11,1923,"MH","MH","1923-02-11",null,91]
[253,"Jardon","Geneviève",253,null,null,null,null,null,null,"Février",21,1950,"N","P","1950-02-21",null,64]
[37,"Lacreuse","Gérard",37,null,null,null,null,null,null,"Octobre",14,1947,"R","Ani","1947-10-14",null,66]
[191,"Lauer","Nathalie",191,null,null,null,null,null,null,"Juin",25,1965,"R","P","1965-06-25",null,48]
[40,"Legros ","Lucien",40,null,null,null,null,null,null,"Février",16,1933,"R","P","1933-02-16",null,81]
[161,"Lerondeau","Michele",161,null,null,null,null,null,null,"Juin",25,1950,"R","P","1950-06-25",null,63]
[239,"Lerondeau","Michel",239,null,null,null,null,null,null,"Mai",20,1948,"N","P","1948-05-20",null,66]
[158,"Lhuillier","Paul",158,null,null,null,null,null,null,"Septembre",23,1951,"R","P","1951-09-23",null,62]
[204,"Marseille","Huguette",204,null,null,null,null,null,null,{"$f":"IF((P53)=\"\",\"\",IF(MONTH(P53)=1,\"Janvier\",IF(MONTH(P53)=2,\"Février\",IF(MONTH(P53)=3,\"Mars\",IF(MONTH(P53)=4,\"Avril\",IF(MONTH(P53)=5,\"Mai\",IF(MONTH(P53)=6,\"Juin\",IF(MONTH(P53)=7,\"Juillet\",IF(MONTH(P53)=8,\"Août\",IF(MONTH(P53)=9,\"Septembre\",IF(MONTH(P53)=10,\"Octobre\",IF(MONTH(P53)=11,\"Novembre\",\"Décembre\"))))))))))))","v":"Août"},{"$f":"IF(P53=\"\",\"\",DAY(P53))","v":10},{"$f":"IF(P53=\"\",\"\",YEAR(P53))","v":1944},"R","P","1944-08-10",null,69]
[205,"Masi","Marie-Thérèse",205,null,null,null,null,null,null,"Août",17,1942,"R","P","1942-08-17",null,71]
[169,"Michaudet","Denise",169,null,null,null,null,null,null,"Avril",23,1950,"R","P","1950-04-23",null,64]
[187,"Mielniczuk","Jeannine",187,null,null,null,null,null,null,"Décembre",26,1946,"R","P","1946-12-26",null,67]
[209,"Mielniczuk","Gérard",209,null,null,null,null,null,null,"Janvier",1,1951,"R","P","1951-01-01",null,63]
[212,"Milliere","Christine",212,null,null,null,null,null,null,"Août",26,1955,"R","P","1955-08-26",null,58]
[44,"Moreux","Richard",44,null,null,null,null,null,null,"Août",21,1949,"R","Ani","1949-08-21",null,64]
[218,"Mutin","Odile",218,null,null,null,null,null,null,"Avril",4,1953,"R","P","1953-04-04",null,61]
[211,"Muzeau","Huguette",211,null,null,null,null,null,null,"Janvier",13,1947,"R","P","1947-01-13",null,67]
[230,"Nikonoff","Jeanne-Renée",230,null,null,null,null,null,null,"Janvier",12,1935,"N","P","1935-01-12",null,79]
[181,"Pascanet","Odile",181,null,null,null,null,null,null,"Septembre",26,1960,"R","P","1960-09-26",null,53]
[241,"Pasteur","Jean-Claude",241,null,null,null,null,null,null,"Septembre",14,1951,"N","P","1951-09-14",null,62]
[251,"Pauthier","Michele",251,null,null,null,null,null,null,"Juillet",26,1948,"N","P","1948-07-26",null,65]
[149,"Pouthier","Chantal",149,null,null,null,null,null,null,"Août",17,1948,"R","P","1948-08-17",null,65]
[234,"Pusset ","Raymond",234,null,null,null,null,null,null,"Juillet",30,1944,"N","P","1944-07-30",null,69]
[217,"Raverot","Marie-Claude",217,null,null,null,null,null,null,"Novembre",16,1955,"R","P","1955-11-16",null,58]
[113,"Renard","Georges",113,null,null,null,null,null,null,"Novembre",23,1936,"R","Ani","1936-11-23",null,{"$f":"IF(P69=\"\",\"\",DATEDIF(P69,TODAY(),\"y\"))","v":77}]
[231,"Richard","Pierre",231,null,null,null,null,null,null,"Janvier",15,1937,"N","P","1937-01-15",null,77]
[232,"Richard","Aleth",232,null,null,null,null,null,null,"Décembre",10,1944,"N","P","1944-12-10",null,69]
[223,"Roux","Martine",223,null,null,null,null,null,null,"Février",6,1951,"N","P","1951-02-06",null,63]
[59,"Saint Felix","Georgette",59,null,null,null,null,null,null,"Août",27,1929,"R","P","1929-08-27",null,84]
[220,"Stighezza","René",220,null,null,null,null,null,null,"Octobre",5,1929,"R","P","1929-10-05",null,84]
[61,"Thiebeaux","Chantal",61,null,null,null,null,null,null,"Mai",26,1939,"R","Ani","1939-05-26",null,75]
[238,"Thiebeaux","Jean-Claude",238,null,null,null,null,null,null,"Juillet",4,1960,"N","P","1960-07-04",null,53]
[148,"Vauchet","Georgette",148,null,null,null,null,null,null,"Novembre",21,1948,"R","P","1948-11-21",null,65]
[224,"Verpaux","Gisèle",224,null,null,null,null,null,null,"Mars",28,1945,"N","P","1945-03-28",null,69]
[117,"Winter","Michel",117,null,null,null,null,null,null,"Septembre",15,1934,"R","P","1934-09-15",null,79]
[]
[]
["Adhérents","Total = ",76,"Adhérents"]
["Nouveaux ","Dont :",29,"Nouveaux "]
[]
[]
["En Gras : Les membres du bureau",null,null,"En Gras : Les membres du bureau",null,"En Bleu Gras : Les Animateurs "]

{"sheet":"2012-2013","index":7,"n_rows":65,"n_cols":18,"rows_kept":65,"cut":false,"hidden":false,"merged":[[1,15,2,15],[1,17,2,17],[1,13,2,13],[1,14,2,14],[1,0,2,0],[1,10,1,12],[1,1,2,1],[1,2,2,2],[1,3,2,3],[1,4,2,4],[1,5,2,5],[1,6,2,6],[1,7,2,7],[1,8,2,8],[1,9,2,9]]}
[]
[null,"Nom","Prénom","N° Carte","Adresse","CP","Ville","Téléphone","Portable","Email","Date Naiss",null,null,"N ou R",null,"Date",null,"Age"]
[null,null,null,null,null,null,null,null,null,null,"Mois","Jour","Année"]
[192,"Agostini","Christiane",192,null,null,null,null,null,null,{"$f":"IF((P4)=\"\",\"\",IF(MONTH(P4)=1,\"Janvier\",IF(MONTH(P4)=2,\"Février\",IF(MONTH(P4)=3,\"Mars\",IF(MONTH(P4)=4,\"Avril\",IF(MONTH(P4)=5,\"Mai\",IF(MONTH(P4)=6,\"Juin\",IF(MONTH(P4)=7,\"Juillet\",IF(MONTH(P4)=8,\"Août\",IF(MONTH(P4)=9,\"Septembre\",IF(MONTH(P4)=10,\"Octobre\",IF(MONTH(P4)=11,\"Novembre\",\"Décembre\"))))))))))))","v":"Septembre"},9,{"$f":"IF(P4=\"\",\"\",YEAR(P4))","v":1952},"R","P","1952-09-17",null,{"$f":"IF(P4=\"\",\"\",DATEDIF(P4,TODAY(),\"y\"))","v":61}]
[4,"Beherec","Franck",4,null,null,null,null,null,null,{"$f":"IF((P5)=\"\",\"\",IF(MONTH(P5)=1,\"Janvier\",IF(MONTH(P5)=2,\"Février\",IF(MONTH(P5)=3,\"Mars\",IF(MONTH(P5)=4,\"Avril\",IF(MONTH(P5)=5,\"Mai\",IF(MONTH(P5)=6,\"Juin\",IF(MONTH(P5)=7,\"Juillet\",IF(MONTH(P5)=8,\"Août\",IF(MONTH(P5)=9,\"Septembre\",IF(MONTH(P5)=10,\"Octobre\",IF(MONTH(P5)=11,\"Novembre\",\"Décembre\"))))))))))))","v":"Octobre"},{"$f":"IF(P5=\"\",\"\",DAY(P5))","v":24},1967,"R","Ani","1967-10-24",null,{"$f":"IF(P5=\"\",\"\",DATEDIF(P5,TODAY(),\"y\"))","v":46}]
[254,"Belot","Anne-Lise",254,null,null,null,null,null,null,{"$f":"IF((P6)=\"\",\"\",IF(MONTH(P6)=1,\"Janvier\",IF(MONTH(P6)=2,\"Février\",IF(MONTH(P6)=3,\"Mars\",IF(MONTH(P6)=4,\"Avril\",IF(MONTH(P6)=5,\"Mai\",IF(MONTH(P6)=6,\"Juin\",IF(MONTH(P6)=7,\"Juillet\",IF(MONTH(P6)=8,\"Août\",IF(MONTH(P6)=9,\"Septembre\",IF(MONTH(P6)=10,\"Octobre\",IF(MONTH(P6)=11,\"Novembre\",\"Décembre\"))))))))))))","v":"Août"},19,1982,"N","P","1982-08-19",null,31]
[256,"Bernier","Martine",256,null,null,null,null,null,null,"Janvier",1,1951,"N","P","1951-01-01",null,63]
[228,"Blondot","Marie-Thèrese",228,null,null,null,null,null,null,"Mai",5,1949,"R","P","1949-05-05",null,65]
[207,"Boisseaux","Jocelyne",207,null,null,null,null,null,null,"Février",25,1958,"R","P","1958-02-25",null,56]
[262,"Cabus","Bernadette",262,null,null,null,null,null,null,"Septembre",11,1950,"N","P","1950-09-11",null,63]
[82,"Carrez","Alain",82,null,null,null,null,null,null,"Juillet",23,1947,"R","P","1947-07-23",null,66]
[196,"Cattaneo","Nathalie",196,null,null,null,null,null,null,"Août",14,1967,"R","P","1967-08-14",null,{"$f":"IF(P12=\"\",\"\",DATEDIF(P12,TODAY(),\"y\"))","v":46}]
[186,"Chaventon","Yvonne",186,null,null,null,null,null,null,"Avril",29,1946,"R","P","1946-04-29",null,{"$f":"IF(P13=\"\",\"\",DATEDIF(P13,TODAY(),\"y\"))","v":68}]
[127,"Chenevoy","Paulette",127,null,null,null,null,null,null,"Mars",30,1935,"R","P","1935-03-30",null,79]
[136,"Clemence","René",136,null,null,null,null,null,null,"Février",28,1943,"R","P","1943-02-28",null,71]
[259,"Colas","Henri",259,null,null,null,null,null,null,"Janvier",16,1936,"N","P","1936-01-16",null,78]
[21,"Cornuel","Michel",21,null,null,null,null,null,null,"Septembre",5,1943,"R","P","1943-09-05",null,70]
[245,"Danjean","Jean-Claude",245,null,null,null,null,null,null,"Mai",2,1944,"R","P","1944-05-02",null,70]
[225,"Develle","Jacqueline",225,null,null,null,null,null,null,"Juin",18,1956,"R","P","1956-06-18",null,58]
[257,"Ducordaux","Regine",257,null,null,null,null,null,null,"Octobre",31,1953,"N","P","1953-10-31",null,60]
[258,"Ducordaux","Michel",258,null,null,null,null,null,null,"Décembre",9,1950,"N","P","1950-12-09",null,63]
[132,"Dupart","Michel",132,null,null,null,null,null,null,"Mars",13,1965,"R","P","1965-03-13",null,49]
[173,"Gadriot","Daniel",173,null,null,null,null,null,null,"Juillet",1,1950,"R","P","1950-07-01",null,63]
[141,"Gaussens","Didier",141,null,null,null,null,null,null,"Mars",7,1952,"R",null,"1952-03-07",null,62]
[34,"Gautheron","Claude",34,null,null,null,null,null,null,"Février",16,1937,"R","P","1937-02-16",null,77]
[237,"Gay","Fabienne",237,null,null,null,null,null,null,"Janvier",25,1958,"R","P","1958-01-25",null,56]
[255,"Herbert","Daniele",255,null,null,null,null,null,null,"","","","N","P",null,null,""]
[120,"Jacoutot","Jean",120,null,null,null,null,null,null,"Novembre",22,1951,"R","P","1951-11-22",null,62]
[36,"Jan","Louis",36,null,null,null,null,null,null,"Février",11,1923,"MH","MH","1923-02-11",null,91]
[253,"Jardon","Geneviève",253,null,null,null,null,null,null,"Février",21,1950,"R","P","1950-02-21",null,64]
[37,"Lacreuse","Gérard",37,null,null,null,null,null,null,"Octobre",14,1947,"R","Ani","1947-10-14",null,66]
[191,"Lauer","Nathalie",191,null,null,null,null,null,null,"Juin",25,1965,"R","P","1965-06-25",null,48]
[161,"Lerondeau","Michele",161,null,null,null,null,null,null,"Juin",25,1950,"R","P","1950-06-25",null,63]
[158,"Lhuillier","Paul",158,null,null,null,null,null,null,"Septembre",23,1951,"R","P","1951-09-23",null,62]
[204,"Marseille","Huguette",204,null,null,null,null,null,null,"Août",10,1944,"R","P","1944-08-10",null,69]
[125,"Martiny","Jean-Pierre",125,null,null,null,null,null,null,{"$f":"IF((P36)=\"\",\"\",IF(MONTH(P36)=1,\"Janvier\",IF(MONTH(P36)=2,\"Février\",IF(MONTH(P36)=3,\"Mars\",IF(MONTH(P36)=4,\"Avril\",IF(MONTH(P36)=5,\"Mai\",IF(MONTH(P36)=6,\"Juin\",IF(MONTH(P36)=7,\"Juillet\",IF(MONTH(P36)=8,\"Août\",IF(MONTH(P36)=9,\"Septembre\",IF(MONTH(P36)=10,\"Octobre\",IF(MONTH(P36)=11,\"Novembre\",\"Décembre\"))))))))))))","v":"Septembre"},{"$f":"IF(P36=\"\",\"\",DAY(P36))","v":23},1942,"R ","P","1942-09-23",null,71]
[205,"Masi","Marie-Thérèse",205,null,null,null,null,null,null,"Août",17,1942,"R","P","1942-08-17",null,71]
[260,"Merle","Sylvie",260,null,null,null,null,null,null,"Février",22,1965,"N","P","1965-02-22",null,49]
[261,"Merle","Véronique",261,null,null,null,null,null,null,"Septembre",17,1963,"N","P","1963-09-17",null,50]
[169,"Michaudet","Denise",169,null,null,null,null,null,null,"Avril",23,1950,"R","P","1950-04-23",null,64]
[187,"Mielniczuk","Jeannine",187,null,null,null,null,null,null,"Décembre",26,1946,"R","P","1946-12-26",null,67]
[209,"Mielniczuk","Gérard",209,null,null,null,null,null,null,"Janvier",1,1951,"R","P","1951-01-01",null,63]
[44,"Moreux","Richard",44,null,null,null,null,null,null,"Août",21,1949,"R","Ani","1949-08-21",null,64]
[218,"Mutin","Odile",218,null,null,null,null,null,null,"Avril",4,1953,"R","P","1953-04-04",null,61]
[107,"Pamart","Alain",107,null,null,null,null,null,null,"Mai",6,{"$f":"YEAR(P45)","v":1944},"R","P","1944-05-06",null,70]
[48,"Parizot","Eveline",48,null,null,null,null,null,null,"Août",18,1951,"R","P","1951-08-18",null,62]
[251,"Pauthier","Michele",251,null,null,null,null,null,null,"Juillet",26,1948,"R","P","1948-07-26",null,65]
[263,"Perin","Claude",263,null,null,null,null,null,null,"Juin",28,1951,"N","P","1951-06-28",null,62]
[149,"Pouthier","Chantal",149,null,null,null,null,null,null,"Août",17,1948,"R","P","1948-08-17",null,65]
[113,"Renard","Georges",113,null,null,null,null,null,null,"Novembre",23,1936,"R","Ani","1936-11-23",null,77]
[232,"Richard","Aleth",232,null,null,null,null,null,null,"Décembre",10,1944,"R","P","1944-12-10",null,69]
[223,"Roux","Martine",223,null,null,null,null,null,null,"Février",6,1951,"R","P","1951-02-06",null,63]
[220,"Stighezza","René",220,null,null,null,null,null,null,"Octobre",5,1929,"R","P","1929-10-05",null,84]
[61,"Thiebeaux","Chantal",61,null,null,null,null,null,null,"Mai",26,1939,"R","Ani","1939-05-26",null,75]
[238,"Thiebeaux","Jean-Claude",238,null,null,null,null,null,null,"Juillet",4,1960,"R","P","1960-07-04",null,53]
[148,"Vauchet","Georgette",148,null,null,null,null,null,null,"Novembre",21,1948,"R","P","1948-11-21",null,65]
[224,"Verpaux","Gisèle",224,null,null,null,null,null,null,"Mars",28,1945,"R","P","1945-03-28",null,69]
[117,"Winter","Michel",117,null,null,null,null,null,null,"Septembre",15,1934,"R","P","1934-09-15",null,79]
[]
[]
[null,"Total = ",56,"Adhérents"]
[null,"Dont :",10,"Nouveaux "]
[]
[]
[null,null,null,"En Gras : Les membres du bureau",null,"En Bleu Gras : Les Animateurs "]

{"sheet":"2013-2014","index":8,"n_rows":118,"n_cols":17,"rows_kept":118,"cut":false,"hidden":false,"merged":[]}
[]
[null,"Nom","Prénom","N° Carte","Adresse","CP","Ville","Téléphone","Portable","Email","Date","Age","Adhésion","Activité","Cotisation","Animateurs"]
[276,"Agostini","Patrick",276,null,null,null,null,null,null,"1953-06-14",{"$f":"IF(K3=\"\",\"\",DATEDIF(K3,TODAY(),\"y\"))","v":61},"A","Initiation","Oui","Franck"]
[192,"Agostini","Christiane",192,null,null,null,null,null,null,"1952-09-17",{"$f":"IF(K4=\"\",\"\",DATEDIF(K4,TODAY(),\"y\"))","v":61},"R","Initiation","Oui","Franck","Chantal M"]
[272,"Bastien","Odette",272,null,null,null,null,null,null,"1941-10-20",{"$f":"IF(K5=\"\",\"\",DATEDIF(K5,TODAY(),\"y\"))","v":72},"A","Initiation","Oui","Richard J"]
[4,"Beherec","Franck",4,null,null,null,null,null,null,"1967-10-24",{"$f":"IF(K6=\"\",\"\",DATEDIF(K6,TODAY(),\"y\"))","v":46},"R","Animateur","Anim","Franck"]
[287,"Benoit","Christiane",287,null,null,null,null,null,null,"1946-01-19",{"$f":"IF(K7=\"\",\"\",DATEDIF(K7,TODAY(),\"y\"))","v":68},"A","Initiation","Oui"]
[265,"Bidau","Alain",265,null,null,null,null,null,null,"1951-06-19",{"$f":"IF(K8=\"\",\"\",DATEDIF(K8,TODAY(),\"y\"))","v":63},"A","Initiation","Oui","Richard L"]
[228,"Blondot","Marie-Thèrese",228,null,null,null,null,null,null,"1949-05-05",65,"R","Photo","Oui","Chantal M"]
[270,"Bocquenet","Chantal",270,null,null,null,null,null,null,"1955-06-07",59,"A","Initiation","Oui","Richard J"]
[207,"Boisseaux","Jocelyne",207,null,null,null,null,null,null,"1958-02-25",56,"R","Modules + Excel","Oui","Richard J","Georges Excl + Mod + Chantal M"]
[290,"Bourdiau","Patrick",290,null,null,null,null,null,null,"1955-06-03",{"$f":"IF(K12=\"\",\"\",DATEDIF(K12,TODAY(),\"y\"))","v":59},"A","Modules + Excel","Oui"]
[286,"Boullée","François",286,null,null,null,null,null,null,"1952-12-18",61,"A","Initiation","Oui"]
[82,"Carrez","Alain",82,null,null,null,null,null,null,"1947-07-23",66,"R","Animateur","Oui"]
[186,"Chaventon","Yvonne",186,null,null,null,null,null,null,"1946-04-29",68,"R","Modules","Oui"]
[127,"Chenevoy","Paulette",127,null,null,null,null,null,null,"1935-03-30",79,"R","Modules","Oui"]
[136,"Clémence","René",136,null,null,null,null,null,null,"1943-02-28",71,"R","Photo","Oui","Chantal M"]
[268,"Ciron","Yves",268,null,null,null,null,null,null,"1950-04-14",64,"A","Initiation","Oui","Chantal V","Gérard V"]
[264,"Copie","Bernard",264,null,null,null,null,null,null,"1951-01-29",63,"A","Initiation","Oui","Gérard "]
[21,"Cornuel","Michel",21,null,null,null,null,null,null,"1943-09-05",70,"R","Photo","Oui","Chantal M"]
[282,"Damis","Alain",282,null,null,null,null,null,null,"1944-01-03",70,"A","Initiation","Oui","Richard L"]
[245,"Danjean","Jean-Claude",245,null,null,null,null,null,null,"1944-05-02",70,"R","Photo","Oui","Chantal V"]
[274,"Donzel","Nicole",274,null,null,null,null,null,null,"1948-04-21",66,"A","Initiation","Oui","Richard J"]
[86,"Fortin","Marie-Thérèse",86,null,null,null,null,null,null,"1943-05-31",71,"R","Photo","Oui","Chantal V"]
[292,"Gervais","Marie-Françoise",292,null,null,null,null,null,null,"1949-06-27",64,"A","Initiation","Oui","Richard L"]
[34,"Gautheron","Claude",34,null,null,null,null,null,null,"1937-02-16",77,"R","Modules","Oui","Gorges Mod"]
[283,"Goillot","Daniel",283,null,null,null,null,null,null,"1946-07-26",{"$f":"IF(K27=\"\",\"\",DATEDIF(K27,TODAY(),\"y\"))","v":67},"A","Initiation","Oui","Chantal V"]
[271,"Grauet","Marie-Hélène",271,null,null,null,null,null,null,"1941-05-20",{"$f":"IF(K28=\"\",\"\",DATEDIF(K28,TODAY(),\"y\"))","v":73},"A","Initiation","Oui","Franck"]
[255,"Herbert","Daniele",255,null,null,null,null,null,null,"1942-04-12",{"$f":"IF(K29=\"\",\"\",DATEDIF(K29,TODAY(),\"y\"))","v":72},"R","Photo","Oui","Chantal M"]
[120,"Jacoutot","Jean",120,null,null,null,null,null,null,"1951-11-22",{"$f":"IF(K30=\"\",\"\",DATEDIF(K30,TODAY(),\"y\"))","v":62},"R","Perf niv 2","Oui","Richard M"]
[36,"Jan","Louis",36,null,null,null,null,null,null,"1923-02-11",{"$f":"IF(K31=\"\",\"\",DATEDIF(K31,TODAY(),\"y\"))","v":91},"MH","Membre d'Honneur","MH"]
[280,"Jobard","Huguette",280,null,null,null,null,null,null,"1938-07-11",{"$f":"IF(K32=\"\",\"\",DATEDIF(K32,TODAY(),\"y\"))","v":75},"A","Initiation","Oui","Chantal V"]
[37,"Lacreuse","Gérard",37,null,null,null,null,null,null,"1947-10-14",66,"R","Animateur","Anim"]
[273,"Lallemand","Marie-France",273,null,null,null,null,null,null,"1946-12-07",{"$f":"IF(K34=\"\",\"\",DATEDIF(K34,TODAY(),\"y\"))","v":67},"A","Photo","Oui","Richard J"]
[191,"Lauer","Nathalie",191,null,null,null,null,null,null,"1965-06-25",48,"R","Animateur","Anim"]
[285,"Lauer","Patrick",285,null,null,null,null,null,null,"1951-02-08",63,"A","Initiation","Oui","Franck"]
[161,"Lerondeau","Michele",161,null,null,null,null,null,null,"1950-06-25",{"$f":"IF(K37=\"\",\"\",DATEDIF(K37,TODAY(),\"y\"))","v":63},"R","Modules + Excel","Oui","Gorges Mod"]
[158,"Lhuillier","Paul",158,null,null,null,null,null,null,"1951-09-23",62,"R","Photo","Oui"]
[278,"Lossent","Marie-Catherine",278,null,null,null,null,null,null,"1946-07-24",67,"A","Initiation","Oui","Richard L"]
[266,"Magnin","Sylviane",266,null,null,null,null,null,null,"1960-07-23",53,"A","Initiation","Oui","Richard L"]
[267,"Martin","Gabriel",267,null,null,null,null,null,null,"1952-10-11",61,"A","Initiation","Oui","Richard J"]
[125,"Martiny","Jean-Pierre",125,null,null,null,null,null,null,"1942-09-23",71,"R","Perf niv 2","Oui","Gorges Mod"]
[205,"Masi","Marie-Thérèse",205,null,null,null,null,null,null,"1942-08-17",71,"R","Photo + Perf 2","Oui","Richard M"]
[187,"Mielniczuk","Jeannine",187,null,null,null,null,null,null,"1946-12-26",67,"R","Modules","Oui","Chantal M","Richard M"]
[209,"Mielniczuk","Gérard",209,null,null,null,null,null,null,"1951-01-01",63,"R","Modules","Oui","Richard M"]
[289,"Millière","Brigitte",289,null,null,null,null,null,null,"1949-04-08",{"$f":"IF(K46=\"\",\"\",DATEDIF(K46,TODAY(),\"y\"))","v":65},"A","Initiation","Oui","Richard J"]
[44,"Moreux","Richard",44,null,null,null,null,null,null,"1949-08-21",64,"R","Animateur","Anim"]
[218,"Mutin","Odile",218,null,null,null,null,null,null,"1953-04-04",{"$f":"IF(K48=\"\",\"\",DATEDIF(K48,TODAY(),\"y\"))","v":61},"R","Photo","Oui","Chantal V"]
[142,"Nicolas","Monique",142,null,null,null,null,null,null,"1948-03-12",66,"R","Initiation","Oui","Richard J"]
[284,"Noirot","Jean-Claude",284,null,null,null,null,null,null,"1939-07-13",74,"A","Initiation","Oui"]
[107,"Pamart","Alain",107,null,null,null,null,null,null,"1944-05-06",70,"R","Modules","Oui","Chantal M"]
[48,"Parizot","Eveline",48,null,null,null,null,null,null,"1951-08-18",62,"R","Modules","Oui","Chantal M"]
[251,"Pauthier","Michele",251,null,null,null,null,null,null,"1948-07-26",65,"R","Photo","Oui","Chantal V"]
[269,"Perrin","Andrée",269,null,null,null,null,null,null,"1943-03-19",71,"A","Initiation","Oui"]
[291,"Perrin","Jean-Claude",291,null,null,null,null,null,null,"1941-06-01",73,"A","Initiation","Oui"]
[113,"Renard","Georges",113,null,null,null,null,null,null,"1936-11-23",77,"R","Animateur","Anim"]
[232,"Richard","Aleth",232,null,null,null,null,null,null,"1944-12-10",{"$f":"IF(K57=\"\",\"\",DATEDIF(K57,TODAY(),\"y\"))","v":69},"R","Photo + Perf 2","Oui","Richard M","Chantal M"]
[281,"Rius","Conchita",281,null,null,null,null,null,null,"1951-08-21",{"$f":"IF(K58=\"\",\"\",DATEDIF(K58,TODAY(),\"y\"))","v":62},"A","Initiation","Oui","Richard L"]
[223,"Roux","Martine",223,null,null,null,null,null,null,"1951-02-06",{"$f":"IF(K59=\"\",\"\",DATEDIF(K59,TODAY(),\"y\"))","v":63},"R","Photo + Perf 2","Oui","Richard M","Chantal M"]
[279,"Sirugue","Jean",279,null,null,null,null,null,null,"1930-10-21",{"$f":"IF(K60=\"\",\"\",DATEDIF(K60,TODAY(),\"y\"))","v":83},"A","Initiation","Oui","Chantal V"]
[220,"Stighezza","René",220,null,null,null,null,null,null,"1929-10-05",{"$f":"IF(K61=\"\",\"\",DATEDIF(K61,TODAY(),\"y\"))","v":84},"R","Perf niv 2","Oui","Richard M"]
[61,"Thiebeaux","Chantal",61,null,null,null,null,null,null,"1939-05-26",75,"R","Animateur","Anim"]
[277,"Trapet","Edouard",277,null,null,null,null,null,null,"1943-05-16",71,"A","Initiation","Oui","Richard J"]
[148,"Vauchet","Georgette",148,null,null,null,null,null,null,"1948-11-21",65,"R","Perf niv 2","Oui","Richard J","Chantal V"]
[224,"Verpaux","Gisèle",224,null,null,null,null,null,null,"1945-03-28",69,"R","Photo + Perf 2","Oui","Richard M","Chantal M"]
[288,"Veysse","Francis",288,null,null,null,null,null,null,"1949-04-05",65,"A","Photo","Oui","Chantal V","Richard L"]
[]
[]
[]
[]
[]
[]
[null,"Total = ",64,"Adhérents"]
[null,"Dont :",28,"Nouveaux "]
[]
[]
[null,null,null,"En Gras : Les membres du bureau",null,"En Bleu Gras : Les Animateurs "]
[]
[]
[]
[]
[]
[]
[]
[]
[]
[]
[]
[]
[]
[]
[]
[null,"Animateur",null,null,null,"A"]
[null,"Photo",null,null,null,"MH"]
[null,"Initiation",null,null,null,"R"]
[null,"Photo + Perf 2"]
[null,"Modules"]
[null,"Excel"]
[null,"Perf niv 2"]
[null,"Modules + Excel"]
[null,"Photo + Modules"]
[null,"Membre d'Honneur"]
[]
[null,null,null,null,null,null,null,"Oui"]
[null,null,null,null,null,null,null,"Anim"]
[null,null,null,null,null,null,null,"MH"]
[null,null,null,null,null,null,null,"MB"]
[null,null,null,null,null,null,null,"Non"]
[]
[null,null,null,null,null,null,null,null,"Franck"]
[null,null,null,null,null,null,null,null,"Richard L"]
[null,null,null,null,null,null,null,null,"Richard J"]
[null,null,null,null,null,null,null,null,"Richard M"]
[null,null,null,null,null,null,null,null,"Georges Excl"]
[null,null,null,null,null,null,null,null,"Gorges Mod"]
[null,null,null,null,null,null,null,null,"Gérard "]
[null,null,null,null,null,null,null,null,"Chantal M"]
[null,null,null,null,null,null,null,null,"Chantal V"]

{"sheet":"2014-2015","index":9,"n_rows":94,"n_cols":18,"rows_kept":94,"cut":false,"hidden":false,"merged":[[1,17,2,17],[1,15,2,15],[1,16,2,16],[1,10,2,10],[1,14,2,14],[1,11,1,13],[1,0,2,0],[1,1,2,1],[1,2,2,2],[1,3,2,3],[1,4,2,4],[1,5,2,5],[1,6,2,6],[1,7,2,7],[1,8,2,8],[1,9,2,9]]}
[]
[null,"Nom","Prénom","N° Carte","Adresse","CP","Ville","Téléphone","Portable","Email","Date","Date Naiss",null,null,"Age","Adhésion","Activité","Cotisation"]
[null,null,null,null,null,null,null,null,null,null,null,"Mois","Jour","Année"]
[null,null,null,null,null,null,null,null,null,null,"2000-01-10",{"$f":"IF((K4)=\"\",\"\",IF(MONTH(K4)=1,\"Janv\",IF(MONTH(K4)=2,\"Fév\",IF(MONTH(K4)=3,\"Mars\",IF(MONTH(K4)=4,\"Avr\",IF(MONTH(K4)=5,\"Mai\",IF(MONTH(K4)=6,\"Juin\",IF(MONTH(K4)=7,\"Juil\",IF(MONTH(K4)=8,\"Août\",IF(MONTH(K4)=9,\"Sep\",IF(MONTH(K4)=10,\"Oct\",IF(MONTH(K4)=11,\"Nov\",\"Déc\"))))))))))))","v":"Janv"},{"$f":"IF(K4=\"\",\"\",DAY(K4))","v":10},{"$f":"IF(K4=\"\",\"\",YEAR(K4))","v":2000},{"$f":"IF(K4=\"\",\"\",DATEDIF(K4,TODAY(),\"y\"))","v":14}]
[null,null,null,null,null,null,null,null,null,null,null,{"$f":"IF((K5)=\"\",\"\",IF(MONTH(K5)=1,\"Janvier\",IF(MONTH(K5)=2,\"Février\",IF(MONTH(K5)=3,\"Mars\",IF(MONTH(K5)=4,\"Avril\",IF(MONTH(K5)=5,\"Mai\",IF(MONTH(K5)=6,\"Juin\",IF(MONTH(K5)=7,\"Juillet\",IF(MONTH(K5)=8,\"Août\",IF(MONTH(K5)=9,\"Septembre\",IF(MONTH(K5)=10,\"Octobre\",IF(MONTH(K5)=11,\"Novembre\",\"Décembre\"))))))))))))","v":""},{"$f":"IF(K5=\"\",\"\",DAY(K5))","v":""},{"$f":"IF(K5=\"\",\"\",YEAR(K5))","v":""},""]
[null,null,null,null,null,null,null,null,null,null,null,{"$f":"IF((K6)=\"\",\"\",IF(MONTH(K6)=1,\"Janvier\",IF(MONTH(K6)=2,\"Février\",IF(MONTH(K6)=3,\"Mars\",IF(MONTH(K6)=4,\"Avril\",IF(MONTH(K6)=5,\"Mai\",IF(MONTH(K6)=6,\"Juin\",IF(MONTH(K6)=7,\"Juillet\",IF(MONTH(K6)=8,\"Août\",IF(MONTH(K6)=9,\"Septembre\",IF(MONTH(K6)=10,\"Octobre\",IF(MONTH(K6)=11,\"Novembre\",\"Décembre\"))))))))))))","v":""},{"$f":"IF(K6=\"\",\"\",DAY(K6))","v":""},{"$f":"IF(K6=\"\",\"\",YEAR(K6))","v":""},""]
[null,null,null,null,null,null,null,null,null,null,null,{"$f":"IF((K7)=\"\",\"\",IF(MONTH(K7)=1,\"Janvier\",IF(MONTH(K7)=2,\"Février\",IF(MONTH(K7)=3,\"Mars\",IF(MONTH(K7)=4,\"Avril\",IF(MONTH(K7)=5,\"Mai\",IF(MONTH(K7)=6,\"Juin\",IF(MONTH(K7)=7,\"Juillet\",IF(MONTH(K7)=8,\"Août\",IF(MONTH(K7)=9,\"Septembre\",IF(MONTH(K7)=10,\"Octobre\",IF(MONTH(K7)=11,\"Novembre\",\"Décembre\"))))))))))))","v":""},{"$f":"IF(K7=\"\",\"\",DAY(K7))","v":""},{"$f":"IF(K7=\"\",\"\",YEAR(K7))","v":""},""]
[null,null,null,null,null,null,null,null,null,null,null,null,null,null,""]
[null,null,null,null,null,null,null,null,null,null,null,null,null,null,""]
[null,null,null,null,null,null,null,null,null,null,null,null,null,null,""]
[null,null,null,null,null,null,null,null,null,null,null,null,null,null,""]
[null,null,null,null,null,null,null,null,null,null,null,null,null,null,""]
[null,null,null,null,null,null,null,null,null,null,null,null,null,null,""]
[null,null,null,null,null,null,null,null,null,null,null,null,null,null,""]
[null,null,null,null,null,null,null,null,null,null,null,null,null,null,""]
[null,null,null,null,null,null,null,null,null,null,null,null,null,null,""]
[null,null,null,null,null,null,null,null,null,null,null,null,null,null,""]
[null,null,null,null,null,null,null,null,null,null,null,null,null,null,""]
[null,null,null,null,null,null,null,null,null,null,null,null,null,null,""]
[null,null,null,null,null,null,null,null,null,null,null,null,null,null,""]
[null,null,null,null,null,null,null,null,null,null,null,null,null,null,""]
[null,null,null,null,null,null,null,null,null,null,null,null,null,null,""]
[null,null,null,null,null,null,null,null,null,null,null,null,null,null,""]
[null,null,null,null,null,null,null,null,null,null,null,null,null,null,""]
[null,null,null,null,null,null,null,null,null,null,null,null,null,null,""]
[null,null,null,null,null,null,null,null,null,null,null,null,null,null,""]
[null,null,null,null,null,null,null,null,null,null,null,null,null,null,""]
[null,null,null,null,null,null,null,null,null,null,null,null,null,null,""]
[null,null,null,null,null,null,null,null,null,null,null,null,null,null,""]
[null,null,null,null,null,null,null,null,null,null,null,null,null,null,""]
[null,null,null,null,null,null,null,null,null,null,null,null,null,null,""]
[null,null,null,null,null,null,null,null,null,null,null,null,null,null,""]
[null,null,null,null,null,null,null,null,null,null,null,null,null,null,""]
[null,null,null,null,null,null,null,null,null,null,null,null,null,null,""]
[null,null,null,null,null,null,null,null,null,null,null,null,null,null,""]
[null,null,null,null,null,null,null,null,null,null,null,null,null,null,{"$f":"IF(K36=\"\",\"\",DATEDIF(K36,TODAY(),\"y\"))","v":""}]
[null,null,null,null,null,null,null,null,null,null,null,null,null,null,""]
[null,null,null,null,null,null,null,null,null,null,null,null,null,null,""]
[null,null,null,null,null,null,null,null,null,null,null,null,null,null,""]
[null,null,null,null,null,null,null,null,null,null,null,null,null,null,""]
[null,null,null,null,null,null,null,null,null,null,null,null,null,null,""]
[null,null,null,null,null,null,null,null,null,null,null,null,null,null,""]
[null,null,null,null,null,null,null,null,null,null,null,null,null,null,""]
[null,null,null,null,null,null,null,null,null,null,null,null,null,null,""]
[null,null,null,null,null,null,null,null,null,null,null,null,null,null,""]
[null,null,null,null,null,null,null,null,null,null,null,null,null,null,""]
[null,null,null,null,null,null,null,null,null,null,null,null,null,null,""]
[null,null,null,null,null,null,null,null,null,null,null,null,null,null,""]
[null,null,null,null,null,null,null,null,null,null,null,null,null,null,""]
[null,null,null,null,null,null,null,null,null,null,null,null,null,null,""]
[null,null,null,null,null,null,null,null,null,null,null,null,null,null,""]
[null,null,null,null,null,null,null,null,null,null,null,null,null,null,""]
[null,null,null,null,null,null,null,null,null,null,null,null,null,null,""]
[null,null,null,null,null,null,null,null,null,null,null,null,null,null,""]
[null,null,null,null,null,null,null,null,null,null,null,null,null,null,""]
[null,null,null,null,null,null,null,null,null,null,null,null,null,null,""]
[null,null,null,null,null,null,null,null,null,null,null,null,null,null,""]
[null,null,null,null,null,null,null,null,null,null,null,null,null,null,""]
[]
[]
[null,"Total = ",null,"Adhérents"]
[null,"Dont :",null,"Nouveaux "]
[]
[]
[null,null,null,"En Gras : Les membres du bureau",null,"En Bleu Gras : Les Animateurs "]
[]
[]
[]
[]
[]
[]
[]
[]
[]
[]
[]
[]
[]
[]
[null,"Animateur",null,null,null,"A"]
[null,"Photo",null,null,null,"MH"]
[null,"Initiation",null,null,null,"R"]
[null,"Photo + Perf 2"]
[null,"Modules"]
[null,"Excel"]
[null,"Perf niv 2"]
[null,"Modules + Excel"]
[null,"Photo + Modules"]
[null,"Membre d'Honneur"]
[]
[null,null,null,null,null,null,null,"Oui"]
[null,null,null,null,null,null,null,"Anim"]
[null,null,null,null,null,null,null,"MH"]
[null,null,null,null,null,null,null,"MB"]

{"sheet":"2015-2016","index":10,"n_rows":65,"n_cols":18,"rows_kept":65,"cut":false,"hidden":false,"merged":[[1,5,2,5],[1,0,2,0],[1,1,2,1],[1,2,2,2],[1,3,2,3],[1,4,2,4],[1,14,2,14],[1,15,2,15],[1,17,2,17],[1,6,2,6],[1,7,2,7],[1,8,2,8],[1,9,2,9],[1,10,1,12],[1,13,2,13]]}
[]
[null,"Nom","Prénom","N° Carte","Adresse","CP","Ville","Téléphone","Portable","Email","Date Naiss",null,null,"N ou R",null,"Date",null,"Age"]
[null,null,null,null,null,null,null,null,null,null,"Mois","Jour","Année"]
[null,null,null,null,null,null,null,null,null,null,{"$f":"IF((P4)=\"\",\"\",IF(MONTH(P4)=1,\"Janv\",IF(MONTH(P4)=2,\"Fév\",IF(MONTH(P4)=3,\"Mars\",IF(MONTH(P4)=4,\"Avr\",IF(MONTH(P4)=5,\"Mai\",IF(MONTH(P4)=6,\"Juin\",IF(MONTH(P4)=7,\"Juil\",IF(MONTH(P4)=8,\"Août\",IF(MONTH(P4)=9,\"Sep\",IF(MONTH(P4)=10,\"Oct\",IF(MONTH(P4)=11,\"Nov\",\"Déc\"))))))))))))","v":""},{"$f":"IF(P4=\"\",\"\",DAY(P4))","v":""},{"$f":"IF(P4=\"\",\"\",YEAR(P4))","v":""},null,null,null,null,{"$f":"IF(P4=\"\",\"\",DATEDIF(P4,TODAY(),\"y\"))","v":""}]
[null,null,null,null,null,null,null,null,null,null,{"$f":"IF((P5)=\"\",\"\",IF(MONTH(P5)=1,\"Janvier\",IF(MONTH(P5)=2,\"Février\",IF(MONTH(P5)=3,\"Mars\",IF(MONTH(P5)=4,\"Avril\",IF(MONTH(P5)=5,\"Mai\",IF(MONTH(P5)=6,\"Juin\",IF(MONTH(P5)=7,\"Juillet\",IF(MONTH(P5)=8,\"Août\",IF(MONTH(P5)=9,\"Septembre\",IF(MONTH(P5)=10,\"Octobre\",IF(MONTH(P5)=11,\"Novembre\",\"Décembre\"))))))))))))","v":""},"","",null,null,null,null,{"$f":"IF(P5=\"\",\"\",DATEDIF(P5,TODAY(),\"y\"))","v":""}]
[null,null,null,null,null,null,null,null,null,null,{"$f":"IF((P6)=\"\",\"\",IF(MONTH(P6)=1,\"Janvier\",IF(MONTH(P6)=2,\"Février\",IF(MONTH(P6)=3,\"Mars\",IF(MONTH(P6)=4,\"Avril\",IF(MONTH(P6)=5,\"Mai\",IF(MONTH(P6)=6,\"Juin\",IF(MONTH(P6)=7,\"Juillet\",IF(MONTH(P6)=8,\"Août\",IF(MONTH(P6)=9,\"Septembre\",IF(MONTH(P6)=10,\"Octobre\",IF(MONTH(P6)=11,\"Novembre\",\"Décembre\"))))))))))))","v":""},"","",null,null,null,null,""]
[null,null,null,null,null,null,null,null,null,null,"","","",null,null,null,null,""]
[null,null,null,null,null,null,null,null,null,null,null,null,null,null,null,null,null,""]
[null,null,null,null,null,null,null,null,null,null,null,null,null,null,null,null,null,""]
[null,null,null,null,null,null,null,null,null,null,null,null,null,null,null,null,null,""]
[null,null,null,null,null,null,null,null,null,null,null,null,null,null,null,null,null,""]
[null,null,null,null,null,null,null,null,null,null,null,null,null,null,null,null,null,""]
[null,null,null,null,null,null,null,null,null,null,null,null,null,null,null,null,null,""]
[null,null,null,null,null,null,null,null,null,null,null,null,null,null,null,null,null,""]
[null,null,null,null,null,null,null,null,null,null,null,null,null,null,null,null,null,""]
[null,null,null,null,null,null,null,null,null,null,null,null,null,null,null,null,null,""]
[null,null,null,null,null,null,null,null,null,null,null,null,null,null,null,null,null,""]
[null,null,null,null,null,null,null,null,null,null,null,null,null,null,null,null,null,""]
[null,null,null,null,null,null,null,null,null,null,null,null,null,null,null,null,null,""]
[null,null,null,null,null,null,null,null,null,null,null,null,null,null,null,null,null,""]
[null,null,null,null,null,null,null,null,null,null,null,null,null,null,null,null,null,""]
[null,null,null,null,null,null,null,null,null,null,null,null,null,null,null,null,null,""]
[null,null,null,null,null,null,null,null,null,null,null,null,null,null,null,null,null,""]
[null,null,null,null,null,null,null,null,null,null,null,null,null,null,null,null,null,""]
[null,null,null,null,null,null,null,null,null,null,null,null,null,null,null,null,null,""]
[null,null,null,null,null,null,null,null,null,null,null,null,null,null,null,null,null,""]
[null,null,null,null,null,null,null,null,null,null,null,null,null,null,null,null,null,""]
[null,null,null,null,null,null,null,null,null,null,null,null,null,null,null,null,null,""]
[null,null,null,null,null,null,null,null,null,null,null,null,null,null,null,null,null,""]
[null,null,null,null,null,null,null,null,null,null,null,null,null,null,null,null,null,""]
[null,null,null,null,null,null,null,null,null,null,null,null,null,null,null,null,null,""]
[null,null,null,null,null,null,null,null,null,null,null,null,null,null,null,null,null,""]
[null,null,null,null,null,null,null,null,null,null,null,null,null,null,null,null,null,""]
[null,null,null,null,null,null,null,null,null,null,null,null,null,null,null,null,null,""]
[null,null,null,null,null,null,null,null,null,null,null,null,null,null,null,null,null,""]
[null,null,null,null,null,null,null,null,null,null,null,null,null,null,null,null,null,""]
[null,null,null,null,null,null,null,null,null,null,null,null,null,null,null,null,null,""]
[null,null,null,null,null,null,null,null,null,null,null,null,null,null,null,null,null,""]
[null,null,null,null,null,null,null,null,null,null,null,null,null,null,null,null,null,""]
[null,null,null,null,null,null,null,null,null,null,null,null,null,null,null,null,null,""]
[null,null,null,null,null,null,null,null,null,null,null,null,null,null,null,null,null,""]
[null,null,null,null,null,null,null,null,null,null,null,null,null,null,null,null,null,""]
[null,null,null,null,null,null,null,null,null,null,null,null,null,null,null,null,null,""]
[null,null,null,null,null,null,null,null,null,null,null,null,null,null,null,null,null,""]
[null,null,null,null,null,null,null,null,null,null,null,null,null,null,null,null,null,""]
[null,null,null,null,null,null,null,null,null,null,null,null,null,null,null,null,null,""]
[null,null,null,null,null,null,null,null,null,null,null,null,null,null,null,null,null,""]
[null,null,null,null,null,null,null,null,null,null,null,null,null,null,null,null,null,""]
[null,null,null,null,null,null,null,null,null,null,null,null,null,null,null,null,null,""]
[null,null,null,null,null,null,null,null,null,null,null,null,null,null,null,null,null,""]
[null,null,null,null,null,null,null,null,null,null,null,null,null,null,null,null,null,""]
[null,null,null,null,null,null,null,null,null,null,null,null,null,null,null,null,null,""]
[null,null,null,null,null,null,null,null,null,null,null,null,null,null,null,null,null,""]
[null,null,null,null,null,null,null,null,null,null,null,null,null,null,null,null,null,""]
[null,null,null,null,null,null,null,null,null,null,null,null,null,null,null,null,null,""]
[null,null,null,null,null,null,null,null,null,null,null,null,null,null,null,null,null,""]
[null,null,null,null,null,null,null,null,null,null,null,null,null,null,null,null,null,""]
[null,null,null,null,null,null,null,null,null,null,null,null,null,null,null,null,null,""]
[]
[]
[null,"Total = ",null,"Adhérents"]
[null,"Dont :",null,"Nouveaux "]
[]
[]
[null,null,null,"En Gras : Les membres du bureau",null,"En Bleu Gras : Les Animateurs "]

{"sheet":"Total","index":11,"n_rows":286,"n_cols":30,"rows_kept":286,"cut":false,"hidden":false,"merged":[]}
[null,null,null,null,null,null,null,null,null,null,null,null,null,null,null,null,null,null,null,null,null,null,null,null,null,null,null,null,null,{"$f":"\"Total : \"&COUNTA(B:B)-1&\" adhérents\"","v":"Total : 283 adhérents"}]
["N°","Nom","Prénom","N° Carte","Adresse","CP","Ville","Téléphone","Portable","Email","Date naissance","Age","2013-2014",null,null,"Age","Nbr",null,null,null,null,null,null,null,null,null,null,null,null,{"$f":"M2&\" : \"&COUNTA(M:M)-1&\" adhérents\"","v":"2013-2014 : 64 adhérents"}]
[{"$f":"ROW()-2","v":1},"Agostini","Christiane",192,null,null,null,null,null,null,"1952-09-17",{"$f":"IF(K3=\"\",\"\",DATEDIF(K3,TODAY(),\"y\"))","v":61},"R",null,null,90,{"$f":"COUNTIF($L$3:L275,P3)","v":0}]
[{"$f":"ROW()-2","v":2},"Agostini","Patrick",276,null,null,null,null,null,null,"1953-06-16",{"$f":"IF(K4=\"\",\"\",DATEDIF(K4,TODAY(),\"y\"))","v":61},"A"]
[{"$f":"ROW()-2","v":3},"Agostini","Séverine",210,null,null,null,null,null,null,"1975-01-02",{"$f":"IF(K5=\"\",\"\",DATEDIF(K5,TODAY(),\"y\"))","v":39},null,null,null,89,{"$f":"COUNTIF($L$3:L276,P5)","v":0}]
[{"$f":"ROW()-2","v":4},"Alagama","Alex",183,null,null,null,null,null,null,"1960-09-19",{"$f":"IF(K6=\"\",\"\",DATEDIF(K6,TODAY(),\"y\"))","v":53},null,null,null,88,{"$f":"COUNTIF($L$3:L277,P6)","v":0}]
[{"$f":"ROW()-2","v":5},"Amiot","André",126,null,null,null,null,null,null,"1947-01-19",{"$f":"IF(K7=\"\",\"\",DATEDIF(K7,TODAY(),\"y\"))","v":67},null,null,null,87,{"$f":"COUNTIF($L$3:L277,P7)","v":1}]
[{"$f":"ROW()-2","v":6},"Arbassier","Jean-Claude",178,null,null,null,null,null,null,"1954-07-01",{"$f":"IF(K8=\"\",\"\",DATEDIF(K8,TODAY(),\"y\"))","v":59},null,null,null,86,{"$f":"COUNTIF($L$3:L277,P8)","v":1}]
[{"$f":"ROW()-2","v":7},"Assez","Sylvie",75,null,null,null,null,null,null,"",{"$f":"IF(K9=\"\",\"\",DATEDIF(K9,TODAY(),\"y\"))","v":""},null,null,null,85,{"$f":"COUNTIF($L$3:L277,P9)","v":0}]
[{"$f":"ROW()-2","v":8},"Bajotet","Marie-Thérèse",76,null,null,null,null,null,null,"",{"$f":"IF(K10=\"\",\"\",DATEDIF(K10,TODAY(),\"y\"))","v":""},null,null,null,84,{"$f":"COUNTIF($L$3:L277,P10)","v":3}]
[{"$f":"ROW()-2","v":9},"Baland","Monique",155,null,null,null,null,null,null,"1940-06-01",{"$f":"IF(K11=\"\",\"\",DATEDIF(K11,TODAY(),\"y\"))","v":74},null,null,null,83,{"$f":"COUNTIF($L$3:L277,P11)","v":3}]
[{"$f":"ROW()-2","v":10},"Bastien","Odette",272,null,null,null,null,null,null,"1941-10-20",{"$f":"IF(K12=\"\",\"\",DATEDIF(K12,TODAY(),\"y\"))","v":72},"A"]
[{"$f":"ROW()-2","v":11},"Beherec","Franck",4,null,null,null,null,null,null,"1967-10-24",{"$f":"IF(K13=\"\",\"\",DATEDIF(K13,TODAY(),\"y\"))","v":46},"R",null,null,82,{"$f":"COUNTIF($L$3:L277,P13)","v":1}]
[{"$f":"ROW()-2","v":12},"Beliard","Christophe",156,null,null,null,null,null,null,"1972-11-30",{"$f":"IF(K14=\"\",\"\",DATEDIF(K14,TODAY(),\"y\"))","v":41},null,null,null,81,{"$f":"COUNTIF($L$3:L277,P14)","v":1}]
[{"$f":"ROW()-2","v":13},"Belleterre","Christiane",77,null,null,null,null,null,null,"1950-10-14",{"$f":"IF(K15=\"\",\"\",DATEDIF(K15,TODAY(),\"y\"))","v":63},null,null,null,80,{"$f":"COUNTIF($L$3:L277,P15)","v":0}]
[{"$f":"ROW()-2","v":14},"Belot","Anne-Lise",254,null,null,null,null,null,null,"1982-08-19",{"$f":"IF(K16=\"\",\"\",DATEDIF(K16,TODAY(),\"y\"))","v":31},null,null,null,79,{"$f":"COUNTIF($L$3:L277,P16)","v":4}]
[{"$f":"ROW()-2","v":15},"Benoit","Christiane",287,null,null,null,null,null,null,"1946-01-19",{"$f":"IF(K17=\"\",\"\",DATEDIF(K17,TODAY(),\"y\"))","v":68},"A",null,null,78,{"$f":"COUNTIF($L$3:L277,P17)","v":4}]
[{"$f":"ROW()-2","v":16},"Bernier","Martine",256,null,null,null,null,null,null,"1951-01-01",{"$f":"IF(K18=\"\",\"\",DATEDIF(K18,TODAY(),\"y\"))","v":63},null,null,null,77,{"$f":"COUNTIF($L$3:L277,P18)","v":5}]
[{"$f":"ROW()-2","v":17},"Bernigaud","Yvonne",7,null,null,null,null,null,null,"1932-01-24",{"$f":"IF(K19=\"\",\"\",DATEDIF(K19,TODAY(),\"y\"))","v":82},null,null,null,76,{"$f":"COUNTIF($L$3:L277,P19)","v":6}]
[{"$f":"ROW()-2","v":18},"Besson","Marie-France",171,null,null,null,null,null,null,"1956-11-11",{"$f":"IF(K20=\"\",\"\",DATEDIF(K20,TODAY(),\"y\"))","v":57},null,null,null,75,{"$f":"COUNTIF($L$3:L277,P20)","v":3}]
[{"$f":"ROW()-2","v":19},"Bettler","Christian",144,null,null,null,null,null,null,"1954-02-27",{"$f":"IF(K21=\"\",\"\",DATEDIF(K21,TODAY(),\"y\"))","v":60},null,null,null,74,{"$f":"COUNTIF($L$3:L277,P21)","v":2}]
[{"$f":"ROW()-2","v":20},"Beudet","Jean",135,null,null,null,null,null,null,"1938-01-06",{"$f":"IF(K22=\"\",\"\",DATEDIF(K22,TODAY(),\"y\"))","v":76}]
[{"$f":"ROW()-2","v":21},"Bidau","Alain",265,null,null,null,null,null,null,"1951-06-19",{"$f":"IF(K23=\"\",\"\",DATEDIF(K23,TODAY(),\"y\"))","v":63},"A",null,null,73,{"$f":"COUNTIF($L$3:L277,P23)","v":4}]
[{"$f":"ROW()-2","v":22},"Blanc","Gérard",8,null,null,null,null,null,null,"1961-12-12",{"$f":"IF(K24=\"\",\"\",DATEDIF(K24,TODAY(),\"y\"))","v":52},null,null,null,72,{"$f":"COUNTIF($L$3:L277,P24)","v":6}]
[{"$f":"ROW()-2","v":23},"Blondot","Marie-Thèrese",228,null,null,null,null,null,null,"1949-05-04",{"$f":"IF(K25=\"\",\"\",DATEDIF(K25,TODAY(),\"y\"))","v":65},"R"]
[{"$f":"ROW()-2","v":24},"Bocquenet","Chantal",270,null,null,null,null,null,null,"1955-06-07",{"$f":"IF(K26=\"\",\"\",DATEDIF(K26,TODAY(),\"y\"))","v":59},"A",null,null,71,{"$f":"COUNTIF($L$3:L277,P26)","v":12}]
[{"$f":"ROW()-2","v":25},"Boillaud","Jean-Louis",79,null,null,null,null,null,null,"1945-06-06",{"$f":"IF(K27=\"\",\"\",DATEDIF(K27,TODAY(),\"y\"))","v":69},null,null,null,70,{"$f":"COUNTIF($L$3:L277,P27)","v":8}]
[{"$f":"ROW()-2","v":26},"Boisseaux","Jocelyne",207,null,null,null,null,null,null,"1958-02-25",{"$f":"IF(K28=\"\",\"\",DATEDIF(K28,TODAY(),\"y\"))","v":56},"R",null,null,69,{"$f":"COUNTIF($L$3:L277,P28)","v":8}]
[{"$f":"ROW()-2","v":27},"Boudrot","Alain",9,null,null,null,null,null,null,"1965-02-09",{"$f":"IF(K29=\"\",\"\",DATEDIF(K29,TODAY(),\"y\"))","v":49},null,null,null,68,{"$f":"COUNTIF($L$3:L277,P29)","v":4}]
[{"$f":"ROW()-2","v":28},"Bougaud","Catherine",10,null,null,null,null,null,null,"1963-09-13",{"$f":"IF(K30=\"\",\"\",DATEDIF(K30,TODAY(),\"y\"))","v":50},null,null,null,67,{"$f":"COUNTIF($L$3:L277,P30)","v":12}]
[{"$f":"ROW()-2","v":29},"Bougaud","Chantal",193,null,null,null,null,null,null,"1951-12-28",{"$f":"IF(K31=\"\",\"\",DATEDIF(K31,TODAY(),\"y\"))","v":62},null,null,null,66,{"$f":"COUNTIF($L$3:L277,P31)","v":9}]
[{"$f":"ROW()-2","v":30},"Bougaud","Denise",219,null,null,null,null,null,null,"1951-04-04",{"$f":"IF(K32=\"\",\"\",DATEDIF(K32,TODAY(),\"y\"))","v":63},null,null,null,65,{"$f":"COUNTIF($L$3:L278,P32)","v":9}]
[{"$f":"ROW()-2","v":31},"Bougaud ","Martine",221,null,null,null,null,null,null,"1953-07-02",{"$f":"IF(K33=\"\",\"\",DATEDIF(K33,TODAY(),\"y\"))","v":60},null,null,null,64,{"$f":"COUNTIF($L$3:L279,P33)","v":9}]
[{"$f":"ROW()-2","v":32},"Boulardot","Jean-Paul",11,null,null,null,null,null,null,"1957-04-21",{"$f":"IF(K34=\"\",\"\",DATEDIF(K34,TODAY(),\"y\"))","v":57},null,null,null,63,{"$f":"COUNTIF($L$3:L280,P34)","v":13}]
[{"$f":"ROW()-2","v":33},"Boullée","François",286,null,null,null,null,null,null,"1952-12-18",{"$f":"IF(K35=\"\",\"\",DATEDIF(K35,TODAY(),\"y\"))","v":61},"A",null,null,62,{"$f":"COUNTIF($L$3:L281,P35)","v":11}]
[{"$f":"ROW()-2","v":34},"Boulogne","Jean-Marie",133,null,null,null,null,null,null,"1941-06-24",{"$f":"IF(K36=\"\",\"\",DATEDIF(K36,TODAY(),\"y\"))","v":72},null,null,null,61,{"$f":"COUNTIF($L$3:L282,P36)","v":8}]
[{"$f":"ROW()-2","v":35},"Bourdiau","Patrick",290,null,null,null,null,null,null,"1955-06-03",{"$f":"IF(K37=\"\",\"\",DATEDIF(K37,TODAY(),\"y\"))","v":59},"A",null,null,60,{"$f":"COUNTIF($L$3:L283,P37)","v":5}]
[{"$f":"ROW()-2","v":36},"Bourgeon","Isabelle",172,null,null,null,null,null,null,"1964-05-30",{"$f":"IF(K38=\"\",\"\",DATEDIF(K38,TODAY(),\"y\"))","v":50},null,null,null,59,{"$f":"COUNTIF($L$3:L284,P38)","v":6}]
[{"$f":"ROW()-2","v":37},"Bruant ","Gérard",12,null,null,null,null,null,null,"1936-05-21",{"$f":"IF(K39=\"\",\"\",DATEDIF(K39,TODAY(),\"y\"))","v":78},null,null,null,58,{"$f":"COUNTIF($L$3:L285,P39)","v":5}]
[{"$f":"ROW()-2","v":38},"Brubach","Daniel",175,null,null,null,null,null,null,"1943-03-08",{"$f":"IF(K40=\"\",\"\",DATEDIF(K40,TODAY(),\"y\"))","v":71},null,null,null,57,{"$f":"COUNTIF($L$3:L286,P40)","v":8}]
[{"$f":"ROW()-2","v":39},"Brugnot","Claudette",160,null,null,null,null,null,null,"1947-09-20",{"$f":"IF(K41=\"\",\"\",DATEDIF(K41,TODAY(),\"y\"))","v":66},null,null,null,56,{"$f":"COUNTIF($L$3:L287,P41)","v":4}]
[{"$f":"ROW()-2","v":40},"Brun","Ghislaine",154,null,null,null,null,null,null,"1955-01-14",{"$f":"IF(K42=\"\",\"\",DATEDIF(K42,TODAY(),\"y\"))","v":59},null,null,null,55,{"$f":"COUNTIF($L$3:L288,P42)","v":0}]
[{"$f":"ROW()-2","v":41},"Bullier ","Patrick",64,null,null,null,null,null,null,"1953-04-19",{"$f":"IF(K43=\"\",\"\",DATEDIF(K43,TODAY(),\"y\"))","v":61},null,null,null,54,{"$f":"COUNTIF($L$3:L289,P43)","v":3}]
[{"$f":"ROW()-2","v":42},"Bussiere","Monique",80,null,null,null,null,null,null,"1947-07-07",{"$f":"IF(K44=\"\",\"\",DATEDIF(K44,TODAY(),\"y\"))","v":66},null,null,null,53,{"$f":"COUNTIF($L$3:L290,P44)","v":5}]
[{"$f":"ROW()-2","v":43},"Cabus","Bernadette",262,null,null,null,null,null,null,"1950-09-11",{"$f":"IF(K45=\"\",\"\",DATEDIF(K45,TODAY(),\"y\"))","v":63},null,null,null,52,{"$f":"COUNTIF($L$3:L291,P45)","v":2}]
[{"$f":"ROW()-2","v":44},"Capelli","Chantal",81,null,null,null,null,null,null,"1944-08-10",{"$f":"IF(K46=\"\",\"\",DATEDIF(K46,TODAY(),\"y\"))","v":69},null,null,null,51,{"$f":"COUNTIF($L$3:L292,P46)","v":1}]
[{"$f":"ROW()-2","v":45},"Carrez","Alain",82,null,null,null,null,null,null,"1947-07-23",{"$f":"IF(K47=\"\",\"\",DATEDIF(K47,TODAY(),\"y\"))","v":66},"R",null,null,50,{"$f":"COUNTIF($L$3:L293,P47)","v":3}]
[{"$f":"ROW()-2","v":46},"Cattaneo","Nathalie",196,null,null,null,null,null,null,"1967-08-14",{"$f":"IF(K48=\"\",\"\",DATEDIF(K48,TODAY(),\"y\"))","v":46},null,null,null,49,{"$f":"COUNTIF($L$3:L294,P48)","v":5}]
[{"$f":"ROW()-2","v":47},"Cattano","François",13,null,null,null,null,null,null,"",{"$f":"IF(K49=\"\",\"\",DATEDIF(K49,TODAY(),\"y\"))","v":""},null,null,null,48,{"$f":"COUNTIF($L$3:L295,P49)","v":2}]
[{"$f":"ROW()-2","v":48},"Cattano","Michel",14,null,null,null,null,null,null,"",{"$f":"IF(K50=\"\",\"\",DATEDIF(K50,TODAY(),\"y\"))","v":""},null,null,null,47,{"$f":"COUNTIF($L$3:L296,P50)","v":1}]
[{"$f":"ROW()-2","v":49},"Caty","Alain",15,null,null,null,null,null,null,"1936-03-04",{"$f":"IF(K51=\"\",\"\",DATEDIF(K51,TODAY(),\"y\"))","v":78},null,null,null,46,{"$f":"COUNTIF($L$3:L297,P51)","v":3}]
[{"$f":"ROW()-2","v":50},"Caty","Anne-Marie",16,null,null,null,null,null,null,"1938-02-13",{"$f":"IF(K52=\"\",\"\",DATEDIF(K52,TODAY(),\"y\"))","v":76},null,null,null,45,{"$f":"COUNTIF($L$3:L298,P52)","v":1}]
[{"$f":"ROW()-2","v":51},"Chaillon","Marie-Christine",195,null,null,null,null,null,null,"1956-10-05",{"$f":"IF(K53=\"\",\"\",DATEDIF(K53,TODAY(),\"y\"))","v":57},null,null,null,44,{"$f":"COUNTIF($L$3:L299,P53)","v":0}]
[{"$f":"ROW()-2","v":52},"Chapelotte","Nicole",249,null,null,null,null,null,null,"1944-05-30",{"$f":"IF(K54=\"\",\"\",DATEDIF(K54,TODAY(),\"y\"))","v":70},null,null,null,43,{"$f":"COUNTIF($L$3:L300,P54)","v":1}]
[{"$f":"ROW()-2","v":53},"Charmont","Nelly",188,null,null,null,null,null,null,"1940-11-05",{"$f":"IF(K55=\"\",\"\",DATEDIF(K55,TODAY(),\"y\"))","v":73},null,null,null,42,{"$f":"COUNTIF($L$3:L301,P55)","v":1}]
[{"$f":"ROW()-2","v":54},"Chauvot","Madeleine",128,null,null,null,null,null,null,"1949-09-21",{"$f":"IF(K56=\"\",\"\",DATEDIF(K56,TODAY(),\"y\"))","v":64},null,null,null,41,{"$f":"COUNTIF($L$3:L302,P56)","v":1}]
[{"$f":"ROW()-2","v":55},"Chaventon","Emmanuel",3,null,null,null,null,null,null,"",{"$f":"IF(K57=\"\",\"\",DATEDIF(K57,TODAY(),\"y\"))","v":""},null,null,null,40,{"$f":"COUNTIF($L$3:L303,P57)","v":2}]
[{"$f":"ROW()-2","v":56},"Chaventon","Françoise",18,null,null,null,null,null,null,"",{"$f":"IF(K58=\"\",\"\",DATEDIF(K58,TODAY(),\"y\"))","v":""},null,null,null,39,{"$f":"COUNTIF($L$3:L304,P58)","v":1}]
[{"$f":"ROW()-2","v":57},"Chaventon","Gérard",17,null,null,null,null,null,null,"",{"$f":"IF(K59=\"\",\"\",DATEDIF(K59,TODAY(),\"y\"))","v":""},null,null,null,38,{"$f":"COUNTIF($L$3:L305,P59)","v":0}]
[{"$f":"ROW()-2","v":58},"Chaventon","Maurice",185,null,null,null,null,null,null,"1941-05-15",{"$f":"IF(K60=\"\",\"\",DATEDIF(K60,TODAY(),\"y\"))","v":73},null,null,null,37,{"$f":"COUNTIF($L$3:L306,P60)","v":0}]
[{"$f":"ROW()-2","v":59},"Chaventon","Yvonne",186,null,null,null,null,null,null,"1946-04-29",{"$f":"IF(K61=\"\",\"\",DATEDIF(K61,TODAY(),\"y\"))","v":68},"R"]
[{"$f":"ROW()-2","v":60},"Chenevoy","Paulette",127,null,null,null,null,null,null,"1935-03-30",{"$f":"IF(K62=\"\",\"\",DATEDIF(K62,TODAY(),\"y\"))","v":79},"R",null,null,36,{"$f":"COUNTIF($L$3:L307,P62)","v":0}]
[{"$f":"ROW()-2","v":61},"Chevalier","Rachel",83,null,null,null,null,null,null,"",{"$f":"IF(K63=\"\",\"\",DATEDIF(K63,TODAY(),\"y\"))","v":""},null,null,null,35,{"$f":"COUNTIF($L$3:L308,P63)","v":0}]
[{"$f":"ROW()-2","v":62},"Ciron","Yves",268,null,null,null,null,null,null,"1950-04-14",{"$f":"IF(K64=\"\",\"\",DATEDIF(K64,TODAY(),\"y\"))","v":64},"A",null,null,34,{"$f":"COUNTIF($L$3:L309,P64)","v":0}]
[{"$f":"ROW()-2","v":63},"Clemence","Bernard",19,null,null,null,null,null,null,"1942-03-06",{"$f":"IF(K65=\"\",\"\",DATEDIF(K65,TODAY(),\"y\"))","v":72},null,null,null,33,{"$f":"COUNTIF($L$3:L310,P65)","v":0}]
[{"$f":"ROW()-2","v":64},"Clemence","René",136,null,null,null,null,null,null,"1943-02-28",{"$f":"IF(K66=\"\",\"\",DATEDIF(K66,TODAY(),\"y\"))","v":71},"R",null,null,32,{"$f":"COUNTIF($L$3:L311,P66)","v":0}]
[{"$f":"ROW()-2","v":65},"Clémence","Bernadette",244,null,null,null,null,null,null,"1944-10-30",{"$f":"IF(K67=\"\",\"\",DATEDIF(K67,TODAY(),\"y\"))","v":69}]
[{"$f":"ROW()-2","v":66},"Combet","Monique",84,null,null,null,null,null,null,"",{"$f":"IF(K68=\"\",\"\",DATEDIF(K68,TODAY(),\"y\"))","v":""},null,null,null,31,{"$f":"COUNTIF($L$3:L312,P68)","v":1}]
[{"$f":"ROW()-2","v":67},"Constancias","Anne-Marie",65,null,null,null,null,null,null,"1947-09-05",{"$f":"IF(K69=\"\",\"\",DATEDIF(K69,TODAY(),\"y\"))","v":66},null,null,null,30,{"$f":"COUNTIF($L$3:L313,P69)","v":0}]
[{"$f":"ROW()-2","v":68},"Copie","Bernard",264,null,null,null,null,null,null,"1951-01-29",{"$f":"IF(K70=\"\",\"\",DATEDIF(K70,TODAY(),\"y\"))","v":63},"A",null,null,29,{"$f":"COUNTIF($L$3:L314,P70)","v":0}]
[{"$f":"ROW()-2","v":69},"Cornot","Daniel",20,null,null,null,null,null,null,"",{"$f":"IF(K71=\"\",\"\",DATEDIF(K71,TODAY(),\"y\"))","v":""},null,null,null,28,{"$f":"COUNTIF($L$3:L315,P71)","v":1}]
[{"$f":"ROW()-2","v":70},"Cornuel","Michel",21,null,null,null,null,null,null,"1943-09-05",{"$f":"IF(K72=\"\",\"\",DATEDIF(K72,TODAY(),\"y\"))","v":70},"R",null,null,27,{"$f":"COUNTIF($L$3:L316,P72)","v":0}]
[{"$f":"ROW()-2","v":71},"Costanza","Giovanni",250,null,null,null,null,null,null,"1952-07-30",{"$f":"IF(K73=\"\",\"\",DATEDIF(K73,TODAY(),\"y\"))","v":61},null,null,null,26,{"$f":"COUNTIF($L$3:L317,P73)","v":0}]
[{"$f":"ROW()-2","v":72},"Courtot","Paulette",252,null,null,null,null,null,null,"1942-01-28",{"$f":"IF(K74=\"\",\"\",DATEDIF(K74,TODAY(),\"y\"))","v":72},null,null,null,25,{"$f":"COUNTIF($L$3:L318,P74)","v":0}]
[{"$f":"ROW()-2","v":73},"Crotet ","Roger",66,null,null,null,null,null,null,"",{"$f":"IF(K75=\"\",\"\",DATEDIF(K75,TODAY(),\"y\"))","v":""}]
[{"$f":"ROW()-2","v":74},"Curé","Rémy",194,null,null,null,null,null,null,"1956-05-05",{"$f":"IF(K76=\"\",\"\",DATEDIF(K76,TODAY(),\"y\"))","v":58},null,null,null,24,{"$f":"COUNTIF($L$3:L319,P76)","v":1}]
[{"$f":"ROW()-2","v":75},"Cureau","Bernard",22,null,null,null,null,null,null,"1927-04-05",{"$f":"IF(K77=\"\",\"\",DATEDIF(K77,TODAY(),\"y\"))","v":87},null,null,null,23,{"$f":"COUNTIF($L$3:L320,P77)","v":0}]
[{"$f":"ROW()-2","v":76},"Damis","Alain",282,null,null,null,null,null,null,"1944-01-03",{"$f":"IF(K78=\"\",\"\",DATEDIF(K78,TODAY(),\"y\"))","v":70},"A",null,null,22,{"$f":"COUNTIF($L$3:L321,P78)","v":0}]
[{"$f":"ROW()-2","v":77},"Danjean","Jean-Claude",245,null,null,null,null,null,null,"1944-05-02",{"$f":"IF(K79=\"\",\"\",DATEDIF(K79,TODAY(),\"y\"))","v":70},"R",null,null,21,{"$f":"COUNTIF($L$3:L322,P79)","v":0}]
[{"$f":"ROW()-2","v":78},"De Duytsche","Michel",153,null,null,null,null,null,null,"1948-11-21",{"$f":"IF(K80=\"\",\"\",DATEDIF(K80,TODAY(),\"y\"))","v":65},null,null,null,20,{"$f":"COUNTIF($L$3:L323,P80)","v":1}]
[{"$f":"ROW()-2","v":79},"Decosne","Denise",85,null,null,null,null,null,null,"",{"$f":"IF(K81=\"\",\"\",DATEDIF(K81,TODAY(),\"y\"))","v":""},null,null,null,19,{"$f":"COUNTIF($L$3:L324,P81)","v":0}]
[{"$f":"ROW()-2","v":80},"Degrace","Michele",23,null,null,null,null,null,null,"",{"$f":"IF(K82=\"\",\"\",DATEDIF(K82,TODAY(),\"y\"))","v":""},null,null,null,18,{"$f":"COUNTIF($L$3:L325,P82)","v":0}]
[{"$f":"ROW()-2","v":81},"Dehorter","Anne-Marie",170,null,null,null,null,null,null,"1946-03-23",{"$f":"IF(K83=\"\",\"\",DATEDIF(K83,TODAY(),\"y\"))","v":68},null,null,null,17,{"$f":"COUNTIF($L$3:L326,P83)","v":0}]
[{"$f":"ROW()-2","v":82},"Del Gaudio","Anne",24,null,null,null,null,null,null,"",{"$f":"IF(K84=\"\",\"\",DATEDIF(K84,TODAY(),\"y\"))","v":""},null,null,null,16,{"$f":"COUNTIF($L$3:L327,P84)","v":1}]
[{"$f":"ROW()-2","v":83},"Del Gaudio","Isa",25,null,null,null,null,null,null,"",{"$f":"IF(K85=\"\",\"\",DATEDIF(K85,TODAY(),\"y\"))","v":""},null,null,null,15,{"$f":"COUNTIF($L$3:L328,P85)","v":0}]
[{"$f":"ROW()-2","v":84},"Delagrange","Michel",26,null,null,null,null,null,null,"1938-04-18",{"$f":"IF(K86=\"\",\"\",DATEDIF(K86,TODAY(),\"y\"))","v":76},null,null,null,14,{"$f":"COUNTIF($L$3:L329,P86)","v":0}]
[{"$f":"ROW()-2","v":85},"Delgobe","Annie",129,null,null,null,null,null,null,"",{"$f":"IF(K87=\"\",\"\",DATEDIF(K87,TODAY(),\"y\"))","v":""},null,null,null,13,{"$f":"COUNTIF($L$3:L330,P87)","v":1}]
[{"$f":"ROW()-2","v":86},"Demongeot","Isabelle",177,null,null,null,null,null,null,"1974-04-19",{"$f":"IF(K88=\"\",\"\",DATEDIF(K88,TODAY(),\"y\"))","v":40},null,null,null,12,{"$f":"COUNTIF($L$3:L331,P88)","v":0}]
[{"$f":"ROW()-2","v":87},"Dessint","Michel",131,null,null,null,null,null,null,"1934-08-03",{"$f":"IF(K89=\"\",\"\",DATEDIF(K89,TODAY(),\"y\"))","v":79},null,null,null,11,{"$f":"COUNTIF($L$3:L332,P89)","v":0}]
[{"$f":"ROW()-2","v":88},"Develle","Jacqueline",225,null,null,null,null,null,null,"1956-06-18",{"$f":"IF(K90=\"\",\"\",DATEDIF(K90,TODAY(),\"y\"))","v":58}]
[{"$f":"ROW()-2","v":89},"Develle","Jean-Luc",226,null,null,null,null,null,null,"1955-03-06",{"$f":"IF(K91=\"\",\"\",DATEDIF(K91,TODAY(),\"y\"))","v":59}]
[{"$f":"ROW()-2","v":90},"Deville ","Jean Louis",137,null,null,null,null,null,null,"1934-09-04",{"$f":"IF(K92=\"\",\"\",DATEDIF(K92,TODAY(),\"y\"))","v":79}]
[{"$f":"ROW()-2","v":91},"Donnet","Sandrine",66,null,null,null,null,null,null,"",{"$f":"IF(K93=\"\",\"\",DATEDIF(K93,TODAY(),\"y\"))","v":""}]
[{"$f":"ROW()-2","v":92},"Donzel","Nicole",274,null,null,null,null,null,null,"1948-04-21",{"$f":"IF(K94=\"\",\"\",DATEDIF(K94,TODAY(),\"y\"))","v":66},"A"]
[{"$f":"ROW()-2","v":93},"Dromard","Michelle",27,null,null,null,null,null,null,"1938-03-10",{"$f":"IF(K95=\"\",\"\",DATEDIF(K95,TODAY(),\"y\"))","v":76}]
[{"$f":"ROW()-2","v":94},"Dromard","Robert",28,null,null,null,null,null,null,"1937-10-06",{"$f":"IF(K96=\"\",\"\",DATEDIF(K96,TODAY(),\"y\"))","v":76}]
[{"$f":"ROW()-2","v":95},"Drouelle","Denise",67,null,null,null,null,null,null,"1931-03-16",{"$f":"IF(K97=\"\",\"\",DATEDIF(K97,TODAY(),\"y\"))","v":83}]
[{"$f":"ROW()-2","v":96},"Dubroca","Thierry",29,null,null,null,null,null,null,"1951-11-10",{"$f":"IF(K98=\"\",\"\",DATEDIF(K98,TODAY(),\"y\"))","v":62}]
[{"$f":"ROW()-2","v":97},"Dupart","Béatrice",157,null,null,null,null,null,null,"1966-11-29",{"$f":"IF(K99=\"\",\"\",DATEDIF(K99,TODAY(),\"y\"))","v":47}]
[{"$f":"ROW()-2","v":98},"Dupart","Michel",132,null,null,null,null,null,null,"1965-03-13",{"$f":"IF(K100=\"\",\"\",DATEDIF(K100,TODAY(),\"y\"))","v":49}]
[{"$f":"ROW()-2","v":99},"Evrard","Stéphanie",68,null,null,null,null,null,null,"",{"$f":"IF(K101=\"\",\"\",DATEDIF(K101,TODAY(),\"y\"))","v":""}]
[{"$f":"ROW()-2","v":100},"Farion-Variot","Jocelyne",30,null,null,null,null,null,null,"",{"$f":"IF(K102=\"\",\"\",DATEDIF(K102,TODAY(),\"y\"))","v":""}]
[{"$f":"ROW()-2","v":101},"Faure","Robert",2,null,null,null,null,null,null,"1968-04-07",{"$f":"IF(K103=\"\",\"\",DATEDIF(K103,TODAY(),\"y\"))","v":46}]
[{"$f":"ROW()-2","v":102},"Faure","Sylvain",1,null,null,null,null,null,null,"1971-12-20",{"$f":"IF(K104=\"\",\"\",DATEDIF(K104,TODAY(),\"y\"))","v":42}]
[{"$f":"ROW()-2","v":103},"Fevre","Virginie",143,null,null,null,null,null,null,"1964-08-03",{"$f":"IF(K105=\"\",\"\",DATEDIF(K105,TODAY(),\"y\"))","v":49}]
[{"$f":"ROW()-2","v":104},"Fleury","Benjamin",240,null,null,null,null,null,null,"2001-01-21",{"$f":"IF(K106=\"\",\"\",DATEDIF(K106,TODAY(),\"y\"))","v":13}]
[{"$f":"ROW()-2","v":105},"Fleury","Françoise",197,null,null,null,null,null,null,"1961-09-29",{"$f":"IF(K107=\"\",\"\",DATEDIF(K107,TODAY(),\"y\"))","v":52}]
[{"$f":"ROW()-2","v":106},"Forey","Marie-Claude",247,null,null,null,null,null,null,"1951-04-13",{"$f":"IF(K108=\"\",\"\",DATEDIF(K108,TODAY(),\"y\"))","v":63}]
[{"$f":"ROW()-2","v":107},"Forey","Roger",246,null,null,null,null,null,null,"1947-02-15",{"$f":"IF(K109=\"\",\"\",DATEDIF(K109,TODAY(),\"y\"))","v":67}]
[{"$f":"ROW()-2","v":108},"Fortin","Marie-Thérèse",86,null,null,null,null,null,null,"1943-05-31",{"$f":"IF(K110=\"\",\"\",DATEDIF(K110,TODAY(),\"y\"))","v":71},"R"]
[{"$f":"ROW()-2","v":109},"François","Pascal",31,null,null,null,null,null,null,"",{"$f":"IF(K111=\"\",\"\",DATEDIF(K111,TODAY(),\"y\"))","v":""}]
[{"$f":"ROW()-2","v":110},"Freylon","Patrick",87,null,null,null,null,null,null,"",{"$f":"IF(K112=\"\",\"\",DATEDIF(K112,TODAY(),\"y\"))","v":""}]
[{"$f":"ROW()-2","v":111},"Frizot","Colette",236,null,null,null,null,null,null,"1927-07-31",{"$f":"IF(K113=\"\",\"\",DATEDIF(K113,TODAY(),\"y\"))","v":86}]
[{"$f":"ROW()-2","v":112},"Gadriot","Daniel",173,null,null,null,null,null,null,"1950-07-01",{"$f":"IF(K114=\"\",\"\",DATEDIF(K114,TODAY(),\"y\"))","v":63}]
[{"$f":"ROW()-2","v":113},"Gagnepain","Sabine",88,null,null,null,null,null,null,"",{"$f":"IF(K115=\"\",\"\",DATEDIF(K115,TODAY(),\"y\"))","v":""}]
[{"$f":"ROW()-2","v":114},"Ganée","Daniel",32,null,null,null,null,null,null,"1949-12-19",{"$f":"IF(K116=\"\",\"\",DATEDIF(K116,TODAY(),\"y\"))","v":64}]
[{"$f":"ROW()-2","v":115},"Ganée","Véronique",214,null,null,null,null,null,null,"1958-05-10",{"$f":"IF(K117=\"\",\"\",DATEDIF(K117,TODAY(),\"y\"))","v":56}]
[{"$f":"ROW()-2","v":116},"Garaudet ","Martine",139,null,null,null,null,null,null,"1943-08-19",{"$f":"IF(K118=\"\",\"\",DATEDIF(K118,TODAY(),\"y\"))","v":70}]
[{"$f":"ROW()-2","v":117},"Garcia","Jean-Paul",119,null,null,null,null,null,null,"1936-09-18",{"$f":"IF(K119=\"\",\"\",DATEDIF(K119,TODAY(),\"y\"))","v":77}]
[{"$f":"ROW()-2","v":118},"Garnier","Andrée",198,null,null,null,null,null,null,"1935-11-14",{"$f":"IF(K120=\"\",\"\",DATEDIF(K120,TODAY(),\"y\"))","v":78}]
[{"$f":"ROW()-2","v":119},"Gaudez ","Martine",163,null,null,null,null,null,null,"1957-06-09",{"$f":"IF(K121=\"\",\"\",DATEDIF(K121,TODAY(),\"y\"))","v":57}]
[{"$f":"ROW()-2","v":120},"Gaussens","Didier",141,null,null,null,null,null,null,"1952-03-07",{"$f":"IF(K122=\"\",\"\",DATEDIF(K122,TODAY(),\"y\"))","v":62}]
[{"$f":"ROW()-2","v":121},"Gautheron","Christiane",33,null,null,null,null,null,null,"",{"$f":"IF(K123=\"\",\"\",DATEDIF(K123,TODAY(),\"y\"))","v":""}]
[{"$f":"ROW()-2","v":122},"Gautheron","Claude",34,null,null,null,null,null,null,"1937-02-16",{"$f":"IF(K124=\"\",\"\",DATEDIF(K124,TODAY(),\"y\"))","v":77},"R"]
[{"$f":"ROW()-2","v":123},"Gautheron","Roger",159,null,null,null,null,null,null,"1944-06-16",{"$f":"IF(K125=\"\",\"\",DATEDIF(K125,TODAY(),\"y\"))","v":70}]
[{"$f":"ROW()-2","v":124},"Gautheron","Valérie",184,null,null,null,null,null,null,"1965-09-09",{"$f":"IF(K126=\"\",\"\",DATEDIF(K126,TODAY(),\"y\"))","v":48}]
[{"$f":"ROW()-2","v":125},"Gauthier","Françoise",243,null,null,null,null,null,null,"1943-06-10",{"$f":"IF(K127=\"\",\"\",DATEDIF(K127,TODAY(),\"y\"))","v":71}]
[{"$f":"ROW()-2","v":126},"Gay","Fabienne",237,null,null,null,null,null,null,"1958-01-25",{"$f":"IF(K128=\"\",\"\",DATEDIF(K128,TODAY(),\"y\"))","v":56}]
[{"$f":"ROW()-2","v":127},"Gervais","Marie-Françoise",292,null,null,null,null,null,null,"1949-06-27",{"$f":"IF(K129=\"\",\"\",DATEDIF(K129,TODAY(),\"y\"))","v":64},"A"]
[{"$f":"ROW()-2","v":128},"Gestin","Joël",69,null,null,null,null,null,null,"",{"$f":"IF(K130=\"\",\"\",DATEDIF(K130,TODAY(),\"y\"))","v":""}]
[{"$f":"ROW()-2","v":129},"Goillot","Daniel",283,null,null,null,null,null,null,"1946-07-26",{"$f":"IF(K131=\"\",\"\",DATEDIF(K131,TODAY(),\"y\"))","v":67},"A"]
[{"$f":"ROW()-2","v":130},"Gomes - Da silva","Rose",242,null,null,null,null,null,null,"1956-11-18",{"$f":"IF(K132=\"\",\"\",DATEDIF(K132,TODAY(),\"y\"))","v":57}]
[{"$f":"ROW()-2","v":131},"Grauet","Marie-Hélène",271,null,null,null,null,null,null,"1941-05-20",{"$f":"IF(K133=\"\",\"\",DATEDIF(K133,TODAY(),\"y\"))","v":73},"A"]
[{"$f":"ROW()-2","v":132},"Grenot","Claudette",248,null,null,null,null,null,null,"1951-09-30",{"$f":"IF(K134=\"\",\"\",DATEDIF(K134,TODAY(),\"y\"))","v":62}]
[{"$f":"ROW()-2","v":133},"Grivelet","Alain",199,null,null,null,null,null,null,"1948-10-21",{"$f":"IF(K135=\"\",\"\",DATEDIF(K135,TODAY(),\"y\"))","v":65}]
[{"$f":"ROW()-2","v":134},"Grosjean","Denise",123,null,null,null,null,null,null,"1944-12-14",{"$f":"IF(K136=\"\",\"\",DATEDIF(K136,TODAY(),\"y\"))","v":69}]
[{"$f":"ROW()-2","v":135},"Guéritée","Claudine",227,null,null,null,null,null,null,"1951-05-11",{"$f":"IF(K137=\"\",\"\",DATEDIF(K137,TODAY(),\"y\"))","v":63}]
[{"$f":"ROW()-2","v":136},"Guichard","Yvette",200,null,null,null,null,null,null,"1943-03-29",{"$f":"IF(K138=\"\",\"\",DATEDIF(K138,TODAY(),\"y\"))","v":71}]
[{"$f":"ROW()-2","v":137},"Hallvin","Pierre",35,null,null,null,null,null,null,"",{"$f":"IF(K139=\"\",\"\",DATEDIF(K139,TODAY(),\"y\"))","v":""}]
[{"$f":"ROW()-2","v":138},"Heliot","Alexis",89,null,null,null,null,null,null,"",{"$f":"IF(K140=\"\",\"\",DATEDIF(K140,TODAY(),\"y\"))","v":""}]
[{"$f":"ROW()-2","v":139},"Heliot","Marie-Odile",213,null,null,null,null,null,null,"1950-05-21",{"$f":"IF(K141=\"\",\"\",DATEDIF(K141,TODAY(),\"y\"))","v":64}]
[{"$f":"ROW()-2","v":140},"Henriot","Isabelle",201,null,null,null,null,null,null,"1962-12-27",{"$f":"IF(K142=\"\",\"\",DATEDIF(K142,TODAY(),\"y\"))","v":51}]
[{"$f":"ROW()-2","v":141},"Herbert","Daniele",255,null,null,null,null,null,null,"",{"$f":"IF(K143=\"\",\"\",DATEDIF(K143,TODAY(),\"y\"))","v":""},"R"]
[{"$f":"ROW()-2","v":142},"Hory","Patricia",122,null,null,null,null,null,null,"1965-03-19",{"$f":"IF(K144=\"\",\"\",DATEDIF(K144,TODAY(),\"y\"))","v":49}]
[{"$f":"ROW()-2","v":143},"Huguenot","Etienne",91,null,null,null,null,null,null,"",{"$f":"IF(K145=\"\",\"\",DATEDIF(K145,TODAY(),\"y\"))","v":""}]
[{"$f":"ROW()-2","v":144},"Huguenot","Jean-Louis",90,null,null,null,null,null,null,"",{"$f":"IF(K146=\"\",\"\",DATEDIF(K146,TODAY(),\"y\"))","v":""}]
[{"$f":"ROW()-2","v":145},"Huguenot","Robin",92,null,null,null,null,null,null,"",{"$f":"IF(K147=\"\",\"\",DATEDIF(K147,TODAY(),\"y\"))","v":""}]
[{"$f":"ROW()-2","v":146},"Jacotot","Laurence",164,null,null,null,null,null,null,"1959-07-08",{"$f":"IF(K148=\"\",\"\",DATEDIF(K148,TODAY(),\"y\"))","v":54}]
[{"$f":"ROW()-2","v":147},"Jacotot","Louis-Nicolas",130,null,null,null,null,null,null,"1998-04-22",{"$f":"IF(K149=\"\",\"\",DATEDIF(K149,TODAY(),\"y\"))","v":16}]
[{"$f":"ROW()-2","v":148},"Jacoutot","Jean",120,null,null,null,null,null,null,"1951-11-22",{"$f":"IF(K150=\"\",\"\",DATEDIF(K150,TODAY(),\"y\"))","v":62},"R"]
[{"$f":"ROW()-2","v":149},"Jakubzack","Monique",151,null,null,null,null,null,null,"1956-04-27",{"$f":"IF(K151=\"\",\"\",DATEDIF(K151,TODAY(),\"y\"))","v":58}]
[{"$f":"ROW()-2","v":150},"Jamin","Frédéric",6,null,null,null,null,null,null,"",{"$f":"IF(K152=\"\",\"\",DATEDIF(K152,TODAY(),\"y\"))","v":""}]
[{"$f":"ROW()-2","v":151},"Jan","Louis",36,null,null,null,null,null,null,"1923-02-11",{"$f":"IF(K153=\"\",\"\",DATEDIF(K153,TODAY(),\"y\"))","v":91},"MH"]
[{"$f":"ROW()-2","v":152},"Jardon","Geneviève",253,null,null,null,null,null,null,"1950-02-21",{"$f":"IF(K154=\"\",\"\",DATEDIF(K154,TODAY(),\"y\"))","v":64}]
[{"$f":"ROW()-2","v":153},"Jeanniard","Robert",134,null,null,null,null,null,null,"1947-01-28",{"$f":"IF(K155=\"\",\"\",DATEDIF(K155,TODAY(),\"y\"))","v":67}]
[{"$f":"ROW()-2","v":154},"Jeannin","Gérard",93,null,null,null,null,null,null,"",{"$f":"IF(K156=\"\",\"\",DATEDIF(K156,TODAY(),\"y\"))","v":""}]
[{"$f":"ROW()-2","v":155},"Jeannin","Sylvie",94,null,null,null,null,null,null,"",{"$f":"IF(K157=\"\",\"\",DATEDIF(K157,TODAY(),\"y\"))","v":""}]
[{"$f":"ROW()-2","v":156},"Jobard","Huguette",280,null,null,null,null,null,null,"1938-07-11",{"$f":"IF(K158=\"\",\"\",DATEDIF(K158,TODAY(),\"y\"))","v":75},"A"]
[{"$f":"ROW()-2","v":157},"Lacreuse","Gérard",37,null,null,null,null,null,null,"1947-10-14",{"$f":"IF(K159=\"\",\"\",DATEDIF(K159,TODAY(),\"y\"))","v":66},"R"]
[{"$f":"ROW()-2","v":158},"Lahoussine","Marie-France",215,null,null,null,null,null,null,"1953-07-24",{"$f":"IF(K160=\"\",\"\",DATEDIF(K160,TODAY(),\"y\"))","v":60}]
[{"$f":"ROW()-2","v":159},"Lallemand","Marie-France",273,null,null,null,null,null,null,"1946-12-07",{"$f":"IF(K161=\"\",\"\",DATEDIF(K161,TODAY(),\"y\"))","v":67},"A"]
[{"$f":"ROW()-2","v":160},"Lapostolle","François",145,null,null,null,null,null,null,"1937-12-04",{"$f":"IF(K162=\"\",\"\",DATEDIF(K162,TODAY(),\"y\"))","v":76}]
[{"$f":"ROW()-2","v":161},"Lasseigne","Anne",202,null,null,null,null,null,null,"1957-01-11",{"$f":"IF(K163=\"\",\"\",DATEDIF(K163,TODAY(),\"y\"))","v":57}]
[{"$f":"ROW()-2","v":162},"Lauer","Aymeric",190,null,null,null,null,null,null,"1994-05-24",{"$f":"IF(K164=\"\",\"\",DATEDIF(K164,TODAY(),\"y\"))","v":20}]
[{"$f":"ROW()-2","v":163},"Lauer","Nathalie",191,null,null,null,null,null,null,"1965-06-25",{"$f":"IF(K165=\"\",\"\",DATEDIF(K165,TODAY(),\"y\"))","v":48},"R"]
[{"$f":"ROW()-2","v":164},"Lauer","Patrick",285,null,null,null,null,null,null,"1958-02-08",{"$f":"IF(K166=\"\",\"\",DATEDIF(K166,TODAY(),\"y\"))","v":56},"A"]
[{"$f":"ROW()-2","v":165},"Lefevre","Denise",38,null,null,null,null,null,null,"",{"$f":"IF(K167=\"\",\"\",DATEDIF(K167,TODAY(),\"y\"))","v":""}]
[{"$f":"ROW()-2","v":166},"Lefevre","Joelle",39,null,null,null,null,null,null,"",{"$f":"IF(K168=\"\",\"\",DATEDIF(K168,TODAY(),\"y\"))","v":""}]
[{"$f":"ROW()-2","v":167},"Legros ","Lucien",40,null,null,null,null,null,null,"1933-02-16",{"$f":"IF(K169=\"\",\"\",DATEDIF(K169,TODAY(),\"y\"))","v":81}]
[{"$f":"ROW()-2","v":168},"Lerondeau","Michel",239,null,null,null,null,null,null,"1948-05-20",{"$f":"IF(K170=\"\",\"\",DATEDIF(K170,TODAY(),\"y\"))","v":66}]
[{"$f":"ROW()-2","v":169},"Lerondeau","Michele",161,null,null,null,null,null,null,"1950-06-25",{"$f":"IF(K171=\"\",\"\",DATEDIF(K171,TODAY(),\"y\"))","v":63},"R"]
[{"$f":"ROW()-2","v":170},"Leroux","Patrick",95,null,null,null,null,null,null,"1954-01-12",{"$f":"IF(K172=\"\",\"\",DATEDIF(K172,TODAY(),\"y\"))","v":60}]
[{"$f":"ROW()-2","v":171},"Leroy","Claude",96,null,null,null,null,null,null,"",{"$f":"IF(K173=\"\",\"\",DATEDIF(K173,TODAY(),\"y\"))","v":""}]
[{"$f":"ROW()-2","v":172},"Lhermitte","Claudia",203,null,null,null,null,null,null,"",{"$f":"IF(K174=\"\",\"\",DATEDIF(K174,TODAY(),\"y\"))","v":""}]
[{"$f":"ROW()-2","v":173},"Lhuillier","Paul",158,null,null,null,null,null,null,"1951-09-23",{"$f":"IF(K175=\"\",\"\",DATEDIF(K175,TODAY(),\"y\"))","v":62},"R"]
[{"$f":"ROW()-2","v":174},"Linck","Quentin",97,null,null,null,null,null,null,"",{"$f":"IF(K176=\"\",\"\",DATEDIF(K176,TODAY(),\"y\"))","v":""}]
[{"$f":"ROW()-2","v":175},"Lossent","Marie-Catherine",278,null,null,null,null,null,null,"1946-07-24",{"$f":"IF(K177=\"\",\"\",DATEDIF(K177,TODAY(),\"y\"))","v":67},"A"]
[{"$f":"ROW()-2","v":176},"Magnin","Sylviane",266,null,null,null,null,null,null,"1960-07-23",{"$f":"IF(K178=\"\",\"\",DATEDIF(K178,TODAY(),\"y\"))","v":53},"A"]
[{"$f":"ROW()-2","v":177},"Malnoy","Monique",41,null,null,null,null,null,null,"",{"$f":"IF(K179=\"\",\"\",DATEDIF(K179,TODAY(),\"y\"))","v":""}]
[{"$f":"ROW()-2","v":178},"Marchand","Michel",98,null,null,null,null,null,null,"",{"$f":"IF(K180=\"\",\"\",DATEDIF(K180,TODAY(),\"y\"))","v":""}]
[{"$f":"ROW()-2","v":179},"Marguery","Bernard",42,null,null,null,null,null,null,"1930-12-31",{"$f":"IF(K181=\"\",\"\",DATEDIF(K181,TODAY(),\"y\"))","v":83}]
[{"$f":"ROW()-2","v":180},"Marin","Paul",176,null,null,null,null,null,null,"1938-12-01",{"$f":"IF(K182=\"\",\"\",DATEDIF(K182,TODAY(),\"y\"))","v":75}]
[{"$f":"ROW()-2","v":181},"Marseille","Huguette",204,null,null,null,null,null,null,"1944-08-10",{"$f":"IF(K183=\"\",\"\",DATEDIF(K183,TODAY(),\"y\"))","v":69}]
[{"$f":"ROW()-2","v":182},"Martin","Gabriel",267,null,null,null,null,null,null,"1952-10-11",{"$f":"IF(K184=\"\",\"\",DATEDIF(K184,TODAY(),\"y\"))","v":61},"A"]
[{"$f":"ROW()-2","v":183},"Martiny","Jean-Pierre",125,null,null,null,null,null,null,"1942-09-23",{"$f":"IF(K185=\"\",\"\",DATEDIF(K185,TODAY(),\"y\"))","v":71},"R"]
[{"$f":"ROW()-2","v":184},"Masi","Marie-Thérèse",205,null,null,null,null,null,null,"1942-08-17",{"$f":"IF(K186=\"\",\"\",DATEDIF(K186,TODAY(),\"y\"))","v":71},"R"]
[{"$f":"ROW()-2","v":185},"Mathiron","David",99,null,null,null,null,null,null,"",{"$f":"IF(K187=\"\",\"\",DATEDIF(K187,TODAY(),\"y\"))","v":""}]
[{"$f":"ROW()-2","v":186},"Mathiron","Ghislaine",100,null,null,null,null,null,null,"",{"$f":"IF(K188=\"\",\"\",DATEDIF(K188,TODAY(),\"y\"))","v":""}]
[{"$f":"ROW()-2","v":187},"Mathiron","Virginie",101,null,null,null,null,null,null,"",{"$f":"IF(K189=\"\",\"\",DATEDIF(K189,TODAY(),\"y\"))","v":""}]
[{"$f":"ROW()-2","v":188},"Mazue","Nelly",102,null,null,null,null,null,null,"",{"$f":"IF(K190=\"\",\"\",DATEDIF(K190,TODAY(),\"y\"))","v":""}]
[{"$f":"ROW()-2","v":189},"Merle","Sylvie",260,null,null,null,null,null,null,"1965-02-22",{"$f":"IF(K191=\"\",\"\",DATEDIF(K191,TODAY(),\"y\"))","v":49}]
[{"$f":"ROW()-2","v":190},"Merle","Véronique",261,null,null,null,null,null,null,"1963-09-17",{"$f":"IF(K192=\"\",\"\",DATEDIF(K192,TODAY(),\"y\"))","v":50}]
[{"$f":"ROW()-2","v":191},"Michaud","Sylvie",103,null,null,null,null,null,null,"",{"$f":"IF(K193=\"\",\"\",DATEDIF(K193,TODAY(),\"y\"))","v":""}]
[{"$f":"ROW()-2","v":192},"Michaudet","Denise",169,null,null,null,null,null,null,"1950-04-23",{"$f":"IF(K194=\"\",\"\",DATEDIF(K194,TODAY(),\"y\"))","v":64}]
[{"$f":"ROW()-2","v":193},"Midol-Monnet","Thérèse",174,null,null,null,null,null,null,"1942-07-26",{"$f":"IF(K195=\"\",\"\",DATEDIF(K195,TODAY(),\"y\"))","v":71}]
[{"$f":"ROW()-2","v":194},"Mielniczuk","Gérard",209,null,null,null,null,null,null,"1951-01-01",{"$f":"IF(K196=\"\",\"\",DATEDIF(K196,TODAY(),\"y\"))","v":63},"R"]
[{"$f":"ROW()-2","v":195},"Mielniczuk","Jeannine",187,null,null,null,null,null,null,"1946-12-26",{"$f":"IF(K197=\"\",\"\",DATEDIF(K197,TODAY(),\"y\"))","v":67},"R"]
[{"$f":"ROW()-2","v":196},"Mignot","Mireille",162,null,null,null,null,null,null,"1947-01-28",{"$f":"IF(K198=\"\",\"\",DATEDIF(K198,TODAY(),\"y\"))","v":67}]
[{"$f":"ROW()-2","v":197},"Milliere","Christine",212,null,null,null,null,null,null,"1955-08-26",{"$f":"IF(K199=\"\",\"\",DATEDIF(K199,TODAY(),\"y\"))","v":58}]
[{"$f":"ROW()-2","v":198},"Millière","Brigitte",289,null,null,null,null,null,null,"1949-04-08",{"$f":"IF(K200=\"\",\"\",DATEDIF(K200,TODAY(),\"y\"))","v":65},"A"]
[{"$f":"ROW()-2","v":199},"Milliot","Virginie",70,null,null,null,null,null,null,"",{"$f":"IF(K201=\"\",\"\",DATEDIF(K201,TODAY(),\"y\"))","v":""}]
[{"$f":"ROW()-2","v":200},"Moissenet","Michel",182,null,null,null,null,null,null,"1949-11-28",{"$f":"IF(K202=\"\",\"\",DATEDIF(K202,TODAY(),\"y\"))","v":64}]
[{"$f":"ROW()-2","v":201},"Momus","Denise",43,null,null,null,null,null,null,"1930-03-14",{"$f":"IF(K203=\"\",\"\",DATEDIF(K203,TODAY(),\"y\"))","v":84}]
[{"$f":"ROW()-2","v":202},"Monot","Sylvie",121,null,null,null,null,null,null,"1956-10-28",{"$f":"IF(K204=\"\",\"\",DATEDIF(K204,TODAY(),\"y\"))","v":57}]
[{"$f":"ROW()-2","v":203},"Moreux","Richard",44,null,null,null,null,null,null,"1949-08-21",{"$f":"IF(K205=\"\",\"\",DATEDIF(K205,TODAY(),\"y\"))","v":64},"R"]
[{"$f":"ROW()-2","v":204},"Moullet","Danielle",45,null,null,null,null,null,null,"1943-05-11",{"$f":"IF(K206=\"\",\"\",DATEDIF(K206,TODAY(),\"y\"))","v":71}]
[{"$f":"ROW()-2","v":205},"Mourolin","Jean-Claude",104,null,null,null,null,null,null,"",{"$f":"IF(K207=\"\",\"\",DATEDIF(K207,TODAY(),\"y\"))","v":""}]
[{"$f":"ROW()-2","v":206},"Muller ","Christine",46,null,null,null,null,null,null,"",{"$f":"IF(K208=\"\",\"\",DATEDIF(K208,TODAY(),\"y\"))","v":""}]
[{"$f":"ROW()-2","v":207},"Mutin","Odile",218,null,null,null,null,null,null,"1953-04-04",{"$f":"IF(K209=\"\",\"\",DATEDIF(K209,TODAY(),\"y\"))","v":61},"R"]
[{"$f":"ROW()-2","v":208},"Muzeau","Huguette",211,null,null,null,null,null,null,"1947-01-13",{"$f":"IF(K210=\"\",\"\",DATEDIF(K210,TODAY(),\"y\"))","v":67}]
[{"$f":"ROW()-2","v":209},"Nicolas","Jocelyne",206,null,null,null,null,null,null,"1955-06-13",{"$f":"IF(K211=\"\",\"\",DATEDIF(K211,TODAY(),\"y\"))","v":59}]
[{"$f":"ROW()-2","v":210},"Nicolas","Monique",142,null,null,null,null,null,null,"1948-03-12",{"$f":"IF(K212=\"\",\"\",DATEDIF(K212,TODAY(),\"y\"))","v":66},"R"]
[{"$f":"ROW()-2","v":211},"Nikonoff","Jeanne-René",230,null,null,null,null,null,null,"1935-01-12",{"$f":"IF(K213=\"\",\"\",DATEDIF(K213,TODAY(),\"y\"))","v":79}]
[{"$f":"ROW()-2","v":212},"Niollet ","Michele",105,null,null,null,null,null,null,"",{"$f":"IF(K214=\"\",\"\",DATEDIF(K214,TODAY(),\"y\"))","v":""}]
[{"$f":"ROW()-2","v":213},"Noirot","Jean-Claude",284,null,null,null,null,null,null,"1939-07-13",{"$f":"IF(K215=\"\",\"\",DATEDIF(K215,TODAY(),\"y\"))","v":74},"A"]
[{"$f":"ROW()-2","v":214},"Once Duthoit","Marie-France",168,null,null,null,null,null,null,"1947-07-05",{"$f":"IF(K216=\"\",\"\",DATEDIF(K216,TODAY(),\"y\"))","v":66}]
[{"$f":"ROW()-2","v":215},"Orenga","Catherine",106,null,null,null,null,null,null,"",{"$f":"IF(K217=\"\",\"\",DATEDIF(K217,TODAY(),\"y\"))","v":""}]
[{"$f":"ROW()-2","v":216},"Paget","Rose Marie",140,null,null,null,null,null,null,"1952-05-26",{"$f":"IF(K218=\"\",\"\",DATEDIF(K218,TODAY(),\"y\"))","v":62}]
[{"$f":"ROW()-2","v":217},"Pamart","Alain",107,null,null,null,null,null,null,"1944-05-06",{"$f":"IF(K219=\"\",\"\",DATEDIF(K219,TODAY(),\"y\"))","v":70},"R"]
[{"$f":"ROW()-2","v":218},"Papirer","Dominique",47,null,null,null,null,null,null,"1951-04-21",{"$f":"IF(K220=\"\",\"\",DATEDIF(K220,TODAY(),\"y\"))","v":63}]
[{"$f":"ROW()-2","v":219},"Parizot","Evelyne",48,null,null,null,null,null,null,"1951-08-18",{"$f":"IF(K221=\"\",\"\",DATEDIF(K221,TODAY(),\"y\"))","v":62},"R"]
[{"$f":"ROW()-2","v":220},"Parriaux","Françoise",49,null,null,null,null,null,null,"1945-04-14",{"$f":"IF(K222=\"\",\"\",DATEDIF(K222,TODAY(),\"y\"))","v":69}]
[{"$f":"ROW()-2","v":221},"Parriaux","Jean-Marie",50,null,null,null,null,null,null,"1943-10-08",{"$f":"IF(K223=\"\",\"\",DATEDIF(K223,TODAY(),\"y\"))","v":70}]
[{"$f":"ROW()-2","v":222},"Pascanet","Odile",116,null,null,null,null,null,null,"",{"$f":"IF(K224=\"\",\"\",DATEDIF(K224,TODAY(),\"y\"))","v":""}]
[{"$f":"ROW()-2","v":223},"Passemard","Annie",108,null,null,null,null,null,null,"",{"$f":"IF(K225=\"\",\"\",DATEDIF(K225,TODAY(),\"y\"))","v":""}]
[{"$f":"ROW()-2","v":224},"Passemard","Jaqueline",109,null,null,null,null,null,null,"",{"$f":"IF(K226=\"\",\"\",DATEDIF(K226,TODAY(),\"y\"))","v":""}]
[{"$f":"ROW()-2","v":225},"Passemard","Robert",110,null,null,null,null,null,null,"",{"$f":"IF(K227=\"\",\"\",DATEDIF(K227,TODAY(),\"y\"))","v":""}]
[{"$f":"ROW()-2","v":226},"Pasteur","Jean-Claude",241,null,null,null,null,null,null,"1951-09-14",{"$f":"IF(K228=\"\",\"\",DATEDIF(K228,TODAY(),\"y\"))","v":62}]
[{"$f":"ROW()-2","v":227},"Pauthier","Michele",251,null,null,null,null,null,null,"1948-07-26",{"$f":"IF(K229=\"\",\"\",DATEDIF(K229,TODAY(),\"y\"))","v":65},"R"]
[{"$f":"ROW()-2","v":228},"Peillon","Frédérique",167,null,null,null,null,null,null,"",{"$f":"IF(K230=\"\",\"\",DATEDIF(K230,TODAY(),\"y\"))","v":""}]
[{"$f":"ROW()-2","v":229},"Perin","Claude",263,null,null,null,null,null,null,"1951-06-28",{"$f":"IF(K231=\"\",\"\",DATEDIF(K231,TODAY(),\"y\"))","v":62}]
[{"$f":"ROW()-2","v":230},"Perret","Anthony",53,null,null,null,null,null,null,"1989-07-27",{"$f":"IF(K232=\"\",\"\",DATEDIF(K232,TODAY(),\"y\"))","v":24}]
[{"$f":"ROW()-2","v":231},"Perret","Frédéric",52,null,null,null,null,null,null,"1968-10-30",{"$f":"IF(K233=\"\",\"\",DATEDIF(K233,TODAY(),\"y\"))","v":45}]
[{"$f":"ROW()-2","v":232},"Perret","Sophie",51,null,null,null,null,null,null,"1959-07-07",{"$f":"IF(K234=\"\",\"\",DATEDIF(K234,TODAY(),\"y\"))","v":54}]
[{"$f":"ROW()-2","v":233},"Perrigueur","Suzanne",54,null,null,null,null,null,null,"1942-04-01",{"$f":"IF(K235=\"\",\"\",DATEDIF(K235,TODAY(),\"y\"))","v":72}]
[{"$f":"ROW()-2","v":234},"Perrin","Andrée",269,null,null,null,null,null,null,"1943-03-19",{"$f":"IF(K236=\"\",\"\",DATEDIF(K236,TODAY(),\"y\"))","v":71},"A"]
[{"$f":"ROW()-2","v":235},"Perrin","Jean-Claude ",291,null,null,null,null,null,null,"1941-06-01",{"$f":"IF(K237=\"\",\"\",DATEDIF(K237,TODAY(),\"y\"))","v":73},"A"]
[{"$f":"ROW()-2","v":236},"Philippe","Marie-Jeanne",208,null,null,null,null,null,null,"1937-01-13",{"$f":"IF(K238=\"\",\"\",DATEDIF(K238,TODAY(),\"y\"))","v":77}]
[{"$f":"ROW()-2","v":237},"Picard","Adrienne",112,null,null,null,null,null,null,"",{"$f":"IF(K239=\"\",\"\",DATEDIF(K239,TODAY(),\"y\"))","v":""}]
[{"$f":"ROW()-2","v":238},"Picard","Jean",111,null,null,null,null,null,null,"",{"$f":"IF(K240=\"\",\"\",DATEDIF(K240,TODAY(),\"y\"))","v":""}]
[{"$f":"ROW()-2","v":239},"Pierron","Michel",189,null,null,null,null,null,null,"1970-07-21",{"$f":"IF(K241=\"\",\"\",DATEDIF(K241,TODAY(),\"y\"))","v":43}]
[{"$f":"ROW()-2","v":240},"Pilotto","Michele",124,null,null,null,null,null,null,"1947-03-31",{"$f":"IF(K242=\"\",\"\",DATEDIF(K242,TODAY(),\"y\"))","v":67}]
[{"$f":"ROW()-2","v":241},"Poiselet","Isabelle",275,null,null,null,null,null,null,"",{"$f":"IF(K243=\"\",\"\",DATEDIF(K243,TODAY(),\"y\"))","v":""}]
[{"$f":"ROW()-2","v":242},"Poussiere","Jacques",55,null,null,null,null,null,null,"1941-07-21",{"$f":"IF(K244=\"\",\"\",DATEDIF(K244,TODAY(),\"y\"))","v":72}]
[{"$f":"ROW()-2","v":243},"Pouthier","Chantal",149,null,null,null,null,null,null,"1948-08-17",{"$f":"IF(K245=\"\",\"\",DATEDIF(K245,TODAY(),\"y\"))","v":65}]
[{"$f":"ROW()-2","v":244},"Prat","Nicole",147,null,null,null,null,null,null,"1949-06-01",{"$f":"IF(K246=\"\",\"\",DATEDIF(K246,TODAY(),\"y\"))","v":65}]
[{"$f":"ROW()-2","v":245},"Prat","Richard",146,null,null,null,null,null,null,"1947-04-21",{"$f":"IF(K247=\"\",\"\",DATEDIF(K247,TODAY(),\"y\"))","v":67}]
[{"$f":"ROW()-2","v":246},"Pusset ","Raymond",234,null,null,null,null,null,null,"1944-07-30",{"$f":"IF(K248=\"\",\"\",DATEDIF(K248,TODAY(),\"y\"))","v":69}]
[{"$f":"ROW()-2","v":247},"Rassalle","Catherine",71,null,null,null,null,null,null,"1960-04-18",{"$f":"IF(K249=\"\",\"\",DATEDIF(K249,TODAY(),\"y\"))","v":54}]
[{"$f":"ROW()-2","v":248},"Raverot","Marie-Claude",217,null,null,null,null,null,null,"1955-11-16",{"$f":"IF(K250=\"\",\"\",DATEDIF(K250,TODAY(),\"y\"))","v":58}]
[{"$f":"ROW()-2","v":249},"Renard","Georges",113,null,null,null,null,null,null,"1936-11-23",{"$f":"IF(K251=\"\",\"\",DATEDIF(K251,TODAY(),\"y\"))","v":77},"R"]
[{"$f":"ROW()-2","v":250},"Ricamard","Marie-Claude",56,null,null,null,null,null,null,"1943-03-29",{"$f":"IF(K252=\"\",\"\",DATEDIF(K252,TODAY(),\"y\"))","v":71}]
[{"$f":"ROW()-2","v":251},"Richard","Aleth",232,null,null,null,null,null,null,"1944-12-10",{"$f":"IF(K253=\"\",\"\",DATEDIF(K253,TODAY(),\"y\"))","v":69},"R"]
[{"$f":"ROW()-2","v":252},"Richard","Gaëtant",57,null,null,null,null,null,null,"1985-09-20",{"$f":"IF(K254=\"\",\"\",DATEDIF(K254,TODAY(),\"y\"))","v":28}]
[{"$f":"ROW()-2","v":253},"Richard","Pierre",231,null,null,null,null,null,null,"1937-01-15",{"$f":"IF(K255=\"\",\"\",DATEDIF(K255,TODAY(),\"y\"))","v":77}]
[{"$f":"ROW()-2","v":254},"Richetin","Paul",58,null,null,null,null,null,null,"1936-04-17",{"$f":"IF(K256=\"\",\"\",DATEDIF(K256,TODAY(),\"y\"))","v":78}]
[{"$f":"ROW()-2","v":255},"Riffet","Nicole",166,null,null,null,null,null,null,"1953-12-07",{"$f":"IF(K257=\"\",\"\",DATEDIF(K257,TODAY(),\"y\"))","v":60}]
[{"$f":"ROW()-2","v":256},"Rius","Conchita",281,null,null,null,null,null,null,"1951-08-21",{"$f":"IF(K258=\"\",\"\",DATEDIF(K258,TODAY(),\"y\"))","v":62},"A"]
[{"$f":"ROW()-2","v":257},"Robelet ","Jacqueline",72,null,null,null,null,null,null,"1952-10-07",{"$f":"IF(K259=\"\",\"\",DATEDIF(K259,TODAY(),\"y\"))","v":61}]
[{"$f":"ROW()-2","v":258},"Roux","Martine",223,null,null,null,null,null,null,"1951-02-06",{"$f":"IF(K260=\"\",\"\",DATEDIF(K260,TODAY(),\"y\"))","v":63},"R"]
[{"$f":"ROW()-2","v":259},"Royer-Cassard","Martine",150,null,null,null,null,null,null,"1957-05-14",{"$f":"IF(K261=\"\",\"\",DATEDIF(K261,TODAY(),\"y\"))","v":57}]
[{"$f":"ROW()-2","v":260},"Said Oili","Oili Issouf",73,null,null,null,null,null,null,"1973-12-12",{"$f":"IF(K262=\"\",\"\",DATEDIF(K262,TODAY(),\"y\"))","v":40}]
[{"$f":"ROW()-2","v":261},"Saint Felix","Georgette",59,null,null,null,null,null,null,"1929-08-27",{"$f":"IF(K263=\"\",\"\",DATEDIF(K263,TODAY(),\"y\"))","v":84}]
[{"$f":"ROW()-2","v":262},"Sauder","Marie-Odile",114,null,null,null,null,null,null,"",{"$f":"IF(K264=\"\",\"\",DATEDIF(K264,TODAY(),\"y\"))","v":""}]
[{"$f":"ROW()-2","v":263},"Schoutith","Michelle",165,null,null,null,null,null,null,"1945-12-01",{"$f":"IF(K265=\"\",\"\",DATEDIF(K265,TODAY(),\"y\"))","v":68}]
[{"$f":"ROW()-2","v":264},"Seguin","Joelle",115,null,null,null,null,null,null,"",{"$f":"IF(K266=\"\",\"\",DATEDIF(K266,TODAY(),\"y\"))","v":""}]
[{"$f":"ROW()-2","v":265},"Sirugue","Jean",279,null,null,null,null,null,null,"1930-10-21",{"$f":"IF(K267=\"\",\"\",DATEDIF(K267,TODAY(),\"y\"))","v":83},"A"]
[{"$f":"ROW()-2","v":266},"Sohn","Marie-Thérèse",216,null,null,null,null,null,null,"1947-04-17",{"$f":"IF(K268=\"\",\"\",DATEDIF(K268,TODAY(),\"y\"))","v":67}]
[{"$f":"ROW()-2","v":267},"Stighezza","René",220,null,null,null,null,null,null,"1929-10-05",{"$f":"IF(K269=\"\",\"\",DATEDIF(K269,TODAY(),\"y\"))","v":84},"R"]
[{"$f":"ROW()-2","v":268},"Taberlet","Claude",60,null,null,null,null,null,null,"",{"$f":"IF(K270=\"\",\"\",DATEDIF(K270,TODAY(),\"y\"))","v":""}]
[{"$f":"ROW()-2","v":269},"Thiebeaux","Chantal",61,null,null,null,null,null,null,"1939-05-26",{"$f":"IF(K271=\"\",\"\",DATEDIF(K271,TODAY(),\"y\"))","v":75},"R"]
[{"$f":"ROW()-2","v":270},"Thiebeaux","Jean-Claude",238,null,null,null,null,null,null,"1960-07-04",{"$f":"IF(K272=\"\",\"\",DATEDIF(K272,TODAY(),\"y\"))","v":53}]
[{"$f":"ROW()-2","v":271},"Tisserandot","Michele",152,null,null,null,null,null,null,"1948-07-24",{"$f":"IF(K273=\"\",\"\",DATEDIF(K273,TODAY(),\"y\"))","v":65}]
[{"$f":"ROW()-2","v":272},"Trapet","Edouard",277,null,null,null,null,null,null,"1943-05-16",{"$f":"IF(K274=\"\",\"\",DATEDIF(K274,TODAY(),\"y\"))","v":71},"A"]
[{"$f":"ROW()-2","v":273},"Vandel","Isabelle",62,null,null,null,null,null,null,"1960-08-30",{"$f":"IF(K275=\"\",\"\",DATEDIF(K275,TODAY(),\"y\"))","v":53}]
[{"$f":"ROW()-2","v":274},"Vauchet","Georgette",148,null,null,null,null,null,null,"1948-11-21",{"$f":"IF(K276=\"\",\"\",DATEDIF(K276,TODAY(),\"y\"))","v":65},"R"]
[{"$f":"ROW()-2","v":275},"Verne","Martine",74,null,null,null,null,null,null,"",{"$f":"IF(K277=\"\",\"\",DATEDIF(K277,TODAY(),\"y\"))","v":""}]
[{"$f":"ROW()-2","v":276},"Verpaux","Gisèle",224,null,null,null,null,null,null,"1945-03-28",{"$f":"IF(K278=\"\",\"\",DATEDIF(K278,TODAY(),\"y\"))","v":69},"R"]
[{"$f":"ROW()-2","v":277},"Veysse","Francis",288,null,null,null,null,null,null,"1949-04-05",{"$f":"IF(K279=\"\",\"\",DATEDIF(K279,TODAY(),\"y\"))","v":65},"A"]
[{"$f":"ROW()-2","v":278},"Villemin","Janine",138,null,null,null,null,null,null,"",{"$f":"IF(K280=\"\",\"\",DATEDIF(K280,TODAY(),\"y\"))","v":""}]
[{"$f":"ROW()-2","v":279},"Vossaert","Olivier",5,null,null,null,null,null,null,"",{"$f":"IF(K281=\"\",\"\",DATEDIF(K281,TODAY(),\"y\"))","v":""}]
[{"$f":"ROW()-2","v":280},"Vuillemin","Lilyane",180,null,null,null,null,null,null,"1961-05-28",{"$f":"IF(K282=\"\",\"\",DATEDIF(K282,TODAY(),\"y\"))","v":53}]
[{"$f":"ROW()-2","v":281},"Winter","Michel",117,null,null,null,null,null,null,"1934-09-15",{"$f":"IF(K283=\"\",\"\",DATEDIF(K283,TODAY(),\"y\"))","v":79}]
[{"$f":"ROW()-2","v":282},"Winter","Michele",118,null,null,null,null,null,null,"",{"$f":"IF(K284=\"\",\"\",DATEDIF(K284,TODAY(),\"y\"))","v":""}]
[{"$f":"ROW()-2","v":283},"Zobel","Fabienne",63,null,null,null,null,null,null,"",{"$f":"IF(K285=\"\",\"\",DATEDIF(K285,TODAY(),\"y\"))","v":""}]
[{"$f":"ROW()-2","v":284},null,null,null,{"$f":"\"dernier n° carte utilisé : \" &MAX(D:D)","v":"dernier n° carte utilisé : 292"},null,null,null,null,null,"",{"$f":"IF(K286=\"\",\"\",DATEDIF(K286,TODAY(),\"y\"))","v":""}]

{"sheet":"Participation","index":12,"n_rows":313,"n_cols":27,"rows_kept":313,"cut":false,"hidden":false,"merged":[]}
[null,null,null,null,null,null,null,null,null,null,null,null,null,null,null,null,null,null,null,"Nombre"]
["N°","Nom","Prénom","N° Carte",{"$f":"IF(OFFSET(Années,COLUMN()-5,,1)<=Total!$M$2,OFFSET(Années,COLUMN()-5,,1),\"\")","v":"2004-2006"},{"$f":"IF(OFFSET(Années,COLUMN()-5,,1)<=Total!$M$2,OFFSET(Années,COLUMN()-5,,1),\"\")","v":"2006-2007"},{"$f":"IF(OFFSET(Années,COLUMN()-5,,1)<=Total!$M$2,OFFSET(Années,COLUMN()-5,,1),\"\")","v":"2007-2008"},{"$f":"IF(OFFSET(Années,COLUMN()-5,,1)<=Total!$M$2,OFFSET(Années,COLUMN()-5,,1),\"\")","v":"2008-2009"},{"$f":"IF(OFFSET(Années,COLUMN()-5,,1)<=Total!$M$2,OFFSET(Années,COLUMN()-5,,1),\"\")","v":"2009-2010"},{"$f":"IF(OFFSET(Années,COLUMN()-5,,1)<=Total!$M$2,OFFSET(Années,COLUMN()-5,,1),\"\")","v":"2010-2011"},{"$f":"IF(OFFSET(Années,COLUMN()-5,,1)<=Total!$M$2,OFFSET(Années,COLUMN()-5,,1),\"\")","v":"2011-2012"},{"$f":"IF(OFFSET(Années,COLUMN()-5,,1)<=Total!$M$2,OFFSET(Années,COLUMN()-5,,1),\"\")","v":"2012-2013"},{"$f":"IF(OFFSET(Années,COLUMN()-5,,1)<=Total!$M$2,OFFSET(Années,COLUMN()-5,,1),\"\")","v":"2013-2014"},{"$f":"IF(OFFSET(Années,COLUMN()-5,,1)<=Total!$M$2,OFFSET(Années,COLUMN()-5,,1),\"\")","v":""},{"$f":"IF(OFFSET(Années,COLUMN()-5,,1)<=Total!$M$2,OFFSET(Années,COLUMN()-5,,1),\"\")","v":""},{"$f":"IF(OFFSET(Années,COLUMN()-5,,1)<=Total!$M$2,OFFSET(Années,COLUMN()-5,,1),\"\")","v":""},{"$f":"IF(OFFSET(Années,COLUMN()-5,,1)<=Total!$M$2,OFFSET(Années,COLUMN()-5,,1),\"\")","v":""},{"$f":"IF(OFFSET(Années,COLUMN()-5,,1)<=Total!$M$2,OFFSET(Années,COLUMN()-5,,1),\"\")","v":""},{"$f":"IF(OFFSET(Années,COLUMN()-5,,1)<=Total!$M$2,OFFSET(Années,COLUMN()-5,,1),\"\")","v":""},"Participation"]
[{"$f":"Total!A3","v":1},{"$f":"IF($A4>0,Total!B3,\"\")","v":"Agostini"},{"$f":"IF($A4>0,Total!C3,\"\")","v":"Christiane"},{"$f":"IF($A4>0,Total!D3,\"\")","v":192},{"$f":"IFERROR(MATCH($D3,INDIRECT(\"'\"&E$2&\"'!D:D\"),0),\"\")","v":""},{"$f":"IFERROR(MATCH($D3,INDIRECT(\"'\"&F$2&\"'!D:D\"),0),\"\")","v":""},"","","",4,4,4,4,"","","","","","",{"$f":"IF(D3<>\"\",COUNT(E3:S3),\"\")","v":4},null,null,null,null,null,null,"2004-2006"]
[{"$f":"Total!A4","v":2},{"$f":"IF($A5>0,Total!B4,\"\")","v":"Agostini"},{"$f":"IF($A5>0,Total!C4,\"\")","v":"Patrick"},{"$f":"IF($A5>0,Total!D4,\"\")","v":276},{"$f":"IFERROR(MATCH($D4,INDIRECT(\"'\"&E$2&\"'!D:D\"),0),\"\")","v":""},"","","","","","","",3,"","","","","","",{"$f":"IF(D4<>\"\",COUNT(E4:S4),\"\")","v":1},null,null,null,null,null,null,"2006-2007"]
[{"$f":"Total!A5","v":3},{"$f":"IF($A6>0,Total!B5,\"\")","v":"Agostini"},{"$f":"IF($A6>0,Total!C5,\"\")","v":"Séverine"},{"$f":"IF($A6>0,Total!D5,\"\")","v":210},"","","","","",5,"","","","","","","","","",1,null,null,null,null,null,null,"2007-2008"]
[{"$f":"Total!A6","v":4},{"$f":"IF($A7>0,Total!B6,\"\")","v":"Alagama"},{"$f":"IF($A7>0,Total!C6,\"\")","v":"Alex"},{"$f":"IF($A7>0,Total!D6,\"\")","v":183},"","","","",4,"","","","","","","","","","",1,null,null,null,null,null,null,"2008-2009"]
[{"$f":"Total!A7","v":5},{"$f":"IF($A8>0,Total!B7,\"\")","v":"Amiot"},{"$f":"IF($A8>0,Total!C7,\"\")","v":"André"},{"$f":"IF($A8>0,Total!D7,\"\")","v":126},"","",4,"","","","","","","","","","","","",1,null,null,null,null,null,null,"2009-2010"]
[{"$f":"Total!A8","v":6},{"$f":"IF($A9>0,Total!B8,\"\")","v":"Arbassier"},{"$f":"IF($A9>0,Total!C8,\"\")","v":"Jean-Claude"},{"$f":"IF($A9>0,Total!D8,\"\")","v":178},"","","","",5,"","","","","","","","","","",1,null,null,null,null,null,null,"2010-2011"]
[{"$f":"Total!A9","v":7},{"$f":"IF($A10>0,Total!B9,\"\")","v":"Assez"},{"$f":"IF($A10>0,Total!C9,\"\")","v":"Sylvie"},{"$f":"IF($A10>0,Total!D9,\"\")","v":75},4,"","","","","","","","","","","","","","",1,null,null,null,null,null,null,"2011-2012"]
[{"$f":"Total!A10","v":8},{"$f":"IF($A11>0,Total!B10,\"\")","v":"Bajotet"},{"$f":"IF($A11>0,Total!C10,\"\")","v":"Marie-Thérèse"},{"$f":"IF($A11>0,Total!D10,\"\")","v":76},5,"","","","","","","","","","","","","","",1,null,null,null,null,null,null,"2012-2013"]
[{"$f":"Total!A11","v":9},{"$f":"IF($A12>0,Total!B11,\"\")","v":"Baland"},{"$f":"IF($A12>0,Total!C11,\"\")","v":"Monique"},{"$f":"IF($A12>0,Total!D11,\"\")","v":155},"","","",4,6,"","","","","","","","","","",2,null,null,null,null,null,null,"2013-2014"]
[{"$f":"Total!A12","v":10},{"$f":"IF($A13>0,Total!B12,\"\")","v":"Bastien"},{"$f":"IF($A13>0,Total!C12,\"\")","v":"Odette"},{"$f":"IF($A13>0,Total!D12,\"\")","v":272},"","","","","","","","",5,"","","","","","",1,null,null,null,null,null,null,"2014-2015"]
[{"$f":"Total!A13","v":11},{"$f":"IF($A14>0,Total!B13,\"\")","v":"Beherec"},{"$f":"IF($A14>0,Total!C13,\"\")","v":"Franck"},{"$f":"IF($A14>0,Total!D13,\"\")","v":4},6,4,5,5,7,6,5,5,6,"","","","","","",9,null,null,null,null,null,null,"2015-2016"]
[{"$f":"Total!A14","v":12},{"$f":"IF($A15>0,Total!B14,\"\")","v":"Beliard"},{"$f":"IF($A15>0,Total!C14,\"\")","v":"Christophe"},{"$f":"IF($A15>0,Total!D14,\"\")","v":156},"","","",6,"","","","","","","","","","","",1,null,null,null,null,null,null,"2016-2017"]
[{"$f":"Total!A15","v":13},{"$f":"IF($A16>0,Total!B15,\"\")","v":"Belleterre"},{"$f":"IF($A16>0,Total!C15,\"\")","v":"Christiane"},{"$f":"IF($A16>0,Total!D15,\"\")","v":77},7,"","","","","","","","","","","","","","",1,null,null,null,null,null,null,"2017-2018"]
[{"$f":"Total!A16","v":14},{"$f":"IF($A17>0,Total!B16,\"\")","v":"Belot"},{"$f":"IF($A17>0,Total!C16,\"\")","v":"Anne-Lise"},{"$f":"IF($A17>0,Total!D16,\"\")","v":254},"","","","","","","",6,"","","","","","","",1,null,null,null,null,null,null,"2018-2019"]
[{"$f":"Total!A17","v":15},{"$f":"IF($A18>0,Total!B17,\"\")","v":"Benoit"},{"$f":"IF($A18>0,Total!C17,\"\")","v":"Christiane"},{"$f":"IF($A18>0,Total!D17,\"\")","v":287},"","","","","","","","",7,"","","","","","",1,null,null,null,null,null,null,"2019-2020"]
[{"$f":"Total!A18","v":16},{"$f":"IF($A19>0,Total!B18,\"\")","v":"Bernier"},{"$f":"IF($A19>0,Total!C18,\"\")","v":"Martine"},{"$f":"IF($A19>0,Total!D18,\"\")","v":256},"","","","","","","",7,"","","","","","","",1]
[{"$f":"Total!A19","v":17},{"$f":"IF($A20>0,Total!B19,\"\")","v":"Bernigaud"},{"$f":"IF($A20>0,Total!C19,\"\")","v":"Yvonne"},{"$f":"IF($A20>0,Total!D19,\"\")","v":7},8,"","","","","","","","","","","","","","",1]
[{"$f":"Total!A20","v":18},{"$f":"IF($A21>0,Total!B20,\"\")","v":"Besson"},{"$f":"IF($A21>0,Total!C20,\"\")","v":"Marie-France"},{"$f":"IF($A21>0,Total!D20,\"\")","v":171},"","","","",8,"","","","","","","","","","",1]
[{"$f":"Total!A21","v":19},{"$f":"IF($A22>0,Total!B21,\"\")","v":"Bettler"},{"$f":"IF($A22>0,Total!C21,\"\")","v":"Christian"},{"$f":"IF($A22>0,Total!D21,\"\")","v":144},"","","",7,"","","","","","","","","","","",1]
[{"$f":"Total!A22","v":20},{"$f":"IF($A23>0,Total!B22,\"\")","v":"Beudet"},{"$f":"IF($A23>0,Total!C22,\"\")","v":"Jean"},{"$f":"IF($A23>0,Total!D22,\"\")","v":135},"",5,6,8,9,"","","","","","","","","","",4]
[{"$f":"Total!A23","v":21},{"$f":"IF($A24>0,Total!B23,\"\")","v":"Bidau"},{"$f":"IF($A24>0,Total!C23,\"\")","v":"Alain"},{"$f":"IF($A24>0,Total!D23,\"\")","v":265},"","","","","","","","",8,"","","","","","",1]
[{"$f":"Total!A24","v":22},{"$f":"IF($A25>0,Total!B24,\"\")","v":"Blanc"},{"$f":"IF($A25>0,Total!C24,\"\")","v":"Gérard"},{"$f":"IF($A25>0,Total!D24,\"\")","v":8},9,"","","","","","","","","","","","","","",1]
[{"$f":"Total!A25","v":23},{"$f":"IF($A26>0,Total!B25,\"\")","v":"Blondot"},{"$f":"IF($A26>0,Total!C25,\"\")","v":"Marie-Thèrese"},{"$f":"IF($A26>0,Total!D25,\"\")","v":228},"","","","","","",6,8,9,"","","","","","",3]
[{"$f":"Total!A26","v":24},{"$f":"IF($A27>0,Total!B26,\"\")","v":"Bocquenet"},{"$f":"IF($A27>0,Total!C26,\"\")","v":"Chantal"},{"$f":"IF($A27>0,Total!D26,\"\")","v":270},"","","","","","","","",10,"","","","","","",1]
[{"$f":"Total!A27","v":25},{"$f":"IF($A28>0,Total!B27,\"\")","v":"Boillaud"},{"$f":"IF($A28>0,Total!C27,\"\")","v":"Jean-Louis"},{"$f":"IF($A28>0,Total!D27,\"\")","v":79},"",6,7,"","","","","","","","","","","","",2]
[{"$f":"Total!A28","v":26},{"$f":"IF($A29>0,Total!B28,\"\")","v":"Boisseaux"},{"$f":"IF($A29>0,Total!C28,\"\")","v":"Jocelyne"},{"$f":"IF($A29>0,Total!D28,\"\")","v":207},"","","","","",7,7,9,11,"","","","","","",4]
[{"$f":"Total!A29","v":27},{"$f":"IF($A30>0,Total!B29,\"\")","v":"Boudrot"},{"$f":"IF($A30>0,Total!C29,\"\")","v":"Alain"},{"$f":"IF($A30>0,Total!D29,\"\")","v":9},10,"","","","","","","","","","","","","","",1]
[{"$f":"Total!A30","v":28},{"$f":"IF($A31>0,Total!B30,\"\")","v":"Bougaud"},{"$f":"IF($A31>0,Total!C30,\"\")","v":"Catherine"},{"$f":"IF($A31>0,Total!D30,\"\")","v":10},11,"","","","","","","","","","","","","","",1]
[{"$f":"Total!A31","v":29},{"$f":"IF($A32>0,Total!B31,\"\")","v":"Bougaud"},{"$f":"IF($A32>0,Total!C31,\"\")","v":"Chantal"},{"$f":"IF($A32>0,Total!D31,\"\")","v":193},"","","","","",8,8,"","","","","","","","",2]
[{"$f":"Total!A32","v":30},{"$f":"IF($A33>0,Total!B32,\"\")","v":"Bougaud"},{"$f":"IF($A33>0,Total!C32,\"\")","v":"Denise"},{"$f":"IF($A33>0,Total!D32,\"\")","v":219},"","","","","",9,9,"","","","","","","","",2]
[{"$f":"Total!A33","v":31},{"$f":"IF($A34>0,Total!B33,\"\")","v":"Bougaud "},{"$f":"IF($A34>0,Total!C33,\"\")","v":"Martine"},{"$f":"IF($A34>0,Total!D33,\"\")","v":221},"","","","","","",10,"","","","","","","","",1]
[{"$f":"Total!A34","v":32},{"$f":"IF($A35>0,Total!B34,\"\")","v":"Boulardot"},{"$f":"IF($A35>0,Total!C34,\"\")","v":"Jean-Paul"},{"$f":"IF($A35>0,Total!D34,\"\")","v":11},12,"","","","","","","","","","","","","","",1]
[{"$f":"Total!A35","v":33},{"$f":"IF($A36>0,Total!B35,\"\")","v":"Boullée"},{"$f":"IF($A36>0,Total!C35,\"\")","v":"François"},{"$f":"IF($A36>0,Total!D35,\"\")","v":286},{"$f":"IFERROR(MATCH($D35,INDIRECT(\"'\"&E$2&\"'!D:D\"),0),\"\")","v":""},"","","","","","","",13,"","","","","","",1]
[{"$f":"Total!A36","v":34},{"$f":"IF($A37>0,Total!B36,\"\")","v":"Boulogne"},{"$f":"IF($A37>0,Total!C36,\"\")","v":"Jean-Marie"},{"$f":"IF($A37>0,Total!D36,\"\")","v":133},"","",8,9,"","","","","","","","","","","",2]
[{"$f":"Total!A37","v":35},{"$f":"IF($A38>0,Total!B37,\"\")","v":"Bourdiau"},{"$f":"IF($A38>0,Total!C37,\"\")","v":"Patrick"},{"$f":"IF($A38>0,Total!D37,\"\")","v":290},"","","","","","","","",12,"","","","","","",1]
[{"$f":"Total!A38","v":36},{"$f":"IF($A39>0,Total!B38,\"\")","v":"Bourgeon"},{"$f":"IF($A39>0,Total!C38,\"\")","v":"Isabelle"},{"$f":"IF($A39>0,Total!D38,\"\")","v":172},"","","","",10,"","","","","","","","","","",1]
[{"$f":"Total!A39","v":37},{"$f":"IF($A40>0,Total!B39,\"\")","v":"Bruant "},{"$f":"IF($A40>0,Total!C39,\"\")","v":"Gérard"},{"$f":"IF($A40>0,Total!D39,\"\")","v":12},13,"","","","","","","","","","","","","","",1]
[{"$f":"Total!A40","v":38},{"$f":"IF($A41>0,Total!B40,\"\")","v":"Brubach"},{"$f":"IF($A41>0,Total!C40,\"\")","v":"Daniel"},{"$f":"IF($A41>0,Total!D40,\"\")","v":175},"","","","",11,"","","","","","","","","","",1]
[{"$f":"Total!A41","v":39},{"$f":"IF($A42>0,Total!B41,\"\")","v":"Brugnot"},{"$f":"IF($A42>0,Total!C41,\"\")","v":"Claudette"},{"$f":"IF($A42>0,Total!D41,\"\")","v":160},"","","",10,"","","","","","","","","","","",1]
[{"$f":"Total!A42","v":40},{"$f":"IF($A43>0,Total!B42,\"\")","v":"Brun"},{"$f":"IF($A43>0,Total!C42,\"\")","v":"Ghislaine"},{"$f":"IF($A43>0,Total!D42,\"\")","v":154},"","","",11,12,"","","","","","","","","","",2]
[{"$f":"Total!A43","v":41},{"$f":"IF($A44>0,Total!B43,\"\")","v":"Bullier "},{"$f":"IF($A44>0,Total!C43,\"\")","v":"Patrick"},{"$f":"IF($A44>0,Total!D43,\"\")","v":64},14,"","","","","","","","","","","","","","",1]
[{"$f":"Total!A44","v":42},{"$f":"IF($A45>0,Total!B44,\"\")","v":"Bussiere"},{"$f":"IF($A45>0,Total!C44,\"\")","v":"Monique"},{"$f":"IF($A45>0,Total!D44,\"\")","v":80},"",7,9,12,"","","","","","","","","","","",3]
[{"$f":"Total!A45","v":43},{"$f":"IF($A46>0,Total!B45,\"\")","v":"Cabus"},{"$f":"IF($A46>0,Total!C45,\"\")","v":"Bernadette"},{"$f":"IF($A46>0,Total!D45,\"\")","v":262},"","","","","","","",10,"","","","","","","",1]
[{"$f":"Total!A46","v":44},{"$f":"IF($A47>0,Total!B46,\"\")","v":"Capelli"},{"$f":"IF($A47>0,Total!C46,\"\")","v":"Chantal"},{"$f":"IF($A47>0,Total!D46,\"\")","v":81},"",8,10,13,"","","","","","","","","","","",3]
[{"$f":"Total!A47","v":45},{"$f":"IF($A48>0,Total!B47,\"\")","v":"Carrez"},{"$f":"IF($A48>0,Total!C47,\"\")","v":"Alain"},{"$f":"IF($A48>0,Total!D47,\"\")","v":82},"",9,11,14,13,10,11,11,14,"","","","","","",8]
[{"$f":"Total!A48","v":46},{"$f":"IF($A49>0,Total!B48,\"\")","v":"Cattaneo"},{"$f":"IF($A49>0,Total!C48,\"\")","v":"Nathalie"},{"$f":"IF($A49>0,Total!D48,\"\")","v":196},"","","","","",11,12,12,"","","","","","","",3]
[{"$f":"Total!A49","v":47},{"$f":"IF($A50>0,Total!B49,\"\")","v":"Cattano"},{"$f":"IF($A50>0,Total!C49,\"\")","v":"François"},{"$f":"IF($A50>0,Total!D49,\"\")","v":13},16,"","","","","","","","","","","","","","",1]
[{"$f":"Total!A50","v":48},{"$f":"IF($A51>0,Total!B50,\"\")","v":"Cattano"},{"$f":"IF($A51>0,Total!C50,\"\")","v":"Michel"},{"$f":"IF($A51>0,Total!D50,\"\")","v":14},17,"","","","","","","","","","","","","","",1]
[{"$f":"Total!A51","v":49},{"$f":"IF($A52>0,Total!B51,\"\")","v":"Caty"},{"$f":"IF($A52>0,Total!C51,\"\")","v":"Alain"},{"$f":"IF($A52>0,Total!D51,\"\")","v":15},18,"","","","","","","","","","","","","","",1]
[{"$f":"Total!A52","v":50},{"$f":"IF($A53>0,Total!B52,\"\")","v":"Caty"},{"$f":"IF($A53>0,Total!C52,\"\")","v":"Anne-Marie"},{"$f":"IF($A53>0,Total!D52,\"\")","v":16},{"$f":"IFERROR(MATCH($D52,INDIRECT(\"'\"&E$2&\"'!D:D\"),0),\"\")","v":19},10,"","","","","","","","","","","","","",2]
[{"$f":"Total!A53","v":51},{"$f":"IF($A54>0,Total!B53,\"\")","v":"Chaillon"},{"$f":"IF($A54>0,Total!C53,\"\")","v":"Marie-Christine"},{"$f":"IF($A54>0,Total!D53,\"\")","v":195},"","","","","",12,"","","","","","","","","",1]
[{"$f":"Total!A54","v":52},{"$f":"IF($A55>0,Total!B54,\"\")","v":"Chapelotte"},{"$f":"IF($A55>0,Total!C54,\"\")","v":"Nicole"},{"$f":"IF($A55>0,Total!D54,\"\")","v":249},"","","","","","",13,"","","","","","","","",1]
[{"$f":"Total!A55","v":53},{"$f":"IF($A56>0,Total!B55,\"\")","v":"Charmont"},{"$f":"IF($A56>0,Total!C55,\"\")","v":"Nelly"},{"$f":"IF($A56>0,Total!D55,\"\")","v":188},"","","","",14,"","","","","","","","","","",1]
[{"$f":"Total!A56","v":54},{"$f":"IF($A57>0,Total!B56,\"\")","v":"Chauvot"},{"$f":"IF($A57>0,Total!C56,\"\")","v":"Madeleine"},{"$f":"IF($A57>0,Total!D56,\"\")","v":128},"","",12,"","","","","","","","","","","","",1]
[{"$f":"Total!A57","v":55},{"$f":"IF($A58>0,Total!B57,\"\")","v":"Chaventon"},{"$f":"IF($A58>0,Total!C57,\"\")","v":"Emmanuel"},{"$f":"IF($A58>0,Total!D57,\"\")","v":3},20,"","","","","","","","","","","","","","",1]
[{"$f":"Total!A58","v":56},{"$f":"IF($A59>0,Total!B58,\"\")","v":"Chaventon"},{"$f":"IF($A59>0,Total!C58,\"\")","v":"Françoise"},{"$f":"IF($A59>0,Total!D58,\"\")","v":18},21,"","","","","","","","","","","","","","",1]
[{"$f":"Total!A59","v":57},{"$f":"IF($A60>0,Total!B59,\"\")","v":"Chaventon"},{"$f":"IF($A60>0,Total!C59,\"\")","v":"Gérard"},{"$f":"IF($A60>0,Total!D59,\"\")","v":17},22,"","","","","","","","","","","","","","",1]
[{"$f":"Total!A60","v":58},{"$f":"IF($A61>0,Total!B60,\"\")","v":"Chaventon"},{"$f":"IF($A61>0,Total!C60,\"\")","v":"Maurice"},{"$f":"IF($A61>0,Total!D60,\"\")","v":185},"","","","",15,"",14,"","","","","","","","",2]
[{"$f":"Total!A61","v":59},{"$f":"IF($A62>0,Total!B61,\"\")","v":"Chaventon"},{"$f":"IF($A62>0,Total!C61,\"\")","v":"Yvonne"},{"$f":"IF($A62>0,Total!D61,\"\")","v":186},"","","","",16,13,15,13,15,"","","","","","",5]
[{"$f":"Total!A62","v":60},{"$f":"IF($A63>0,Total!B62,\"\")","v":"Chenevoy"},{"$f":"IF($A63>0,Total!C62,\"\")","v":"Paulette"},{"$f":"IF($A63>0,Total!D62,\"\")","v":127},"","",13,15,17,14,16,14,16,"","","","","","",7]
[{"$f":"Total!A63","v":61},{"$f":"IF($A64>0,Total!B63,\"\")","v":"Chevalier"},{"$f":"IF($A64>0,Total!C63,\"\")","v":"Rachel"},{"$f":"IF($A64>0,Total!D63,\"\")","v":83},"",11,"","","","","","","","","","","","","",1]
[{"$f":"Total!A64","v":62},{"$f":"IF($A65>0,Total!B64,\"\")","v":"Ciron"},{"$f":"IF($A65>0,Total!C64,\"\")","v":"Yves"},{"$f":"IF($A65>0,Total!D64,\"\")","v":268},"","","","","","","","",18,"","","","","","",1]
[{"$f":"Total!A65","v":63},{"$f":"IF($A66>0,Total!B65,\"\")","v":"Clemence"},{"$f":"IF($A66>0,Total!C65,\"\")","v":"Bernard"},{"$f":"IF($A66>0,Total!D65,\"\")","v":19},15,"",15,16,"","","","","","","","","","","",3]
[{"$f":"Total!A66","v":64},{"$f":"IF($A67>0,Total!B66,\"\")","v":"Clemence"},{"$f":"IF($A67>0,Total!C66,\"\")","v":"René"},{"$f":"IF($A67>0,Total!D66,\"\")","v":136},"","",16,17,18,15,17,15,17,"","","","","","",7]
[{"$f":"Total!A67","v":65},{"$f":"IF($A68>0,Total!B67,\"\")","v":"Clémence"},{"$f":"IF($A68>0,Total!C67,\"\")","v":"Bernadette"},{"$f":"IF($A68>0,Total!D67,\"\")","v":244},"","","","","","",18,"","","","","","","","",1]
[{"$f":"Total!A68","v":66},{"$f":"IF($A69>0,Total!B68,\"\")","v":"Combet"},{"$f":"IF($A69>0,Total!C68,\"\")","v":"Monique"},{"$f":"IF($A69>0,Total!D68,\"\")","v":84},"",12,"","","","","","","","","","","","","",{"$f":"IF(D68<>\"\",COUNT(E68:S68),\"\")","v":1}]
[{"$f":"Total!A69","v":67},{"$f":"IF($A70>0,Total!B69,\"\")","v":"Constancias"},{"$f":"IF($A70>0,Total!C69,\"\")","v":"Anne-Marie"},{"$f":"IF($A70>0,Total!D69,\"\")","v":65},{"$f":"IFERROR(MATCH($D69,INDIRECT(\"'\"&E$2&\"'!D:D\"),0),\"\")","v":23},"","","","","","","","","","","","","","",1]
[{"$f":"Total!A70","v":68},{"$f":"IF($A71>0,Total!B70,\"\")","v":"Copie"},{"$f":"IF($A71>0,Total!C70,\"\")","v":"Bernard"},{"$f":"IF($A71>0,Total!D70,\"\")","v":264},"","","","","","","","",19,"","","","","","",1]
[{"$f":"Total!A71","v":69},{"$f":"IF($A72>0,Total!B71,\"\")","v":"Cornot"},{"$f":"IF($A72>0,Total!C71,\"\")","v":"Daniel"},{"$f":"IF($A72>0,Total!D71,\"\")","v":20},24,"","","","","","","","","","","","","","",1]
[{"$f":"Total!A72","v":70},{"$f":"IF($A73>0,Total!B72,\"\")","v":"Cornuel"},{"$f":"IF($A73>0,Total!C72,\"\")","v":"Michel"},{"$f":"IF($A73>0,Total!D72,\"\")","v":21},25,"",18,18,19,16,19,17,20,"","","","","","",8]
[{"$f":"Total!A73","v":71},{"$f":"IF($A74>0,Total!B73,\"\")","v":"Costanza"},{"$f":"IF($A74>0,Total!C73,\"\")","v":"Giovanni"},{"$f":"IF($A74>0,Total!D73,\"\")","v":250},"","","","","","",20,"","","","","","","","",1]
[{"$f":"Total!A74","v":72},{"$f":"IF($A75>0,Total!B74,\"\")","v":"Courtot"},{"$f":"IF($A75>0,Total!C74,\"\")","v":"Paulette"},{"$f":"IF($A75>0,Total!D74,\"\")","v":252},"","","","","","",21,"","","","","","","","",1]
[{"$f":"Total!A75","v":73},{"$f":"IF($A76>0,Total!B75,\"\")","v":"Crotet "},{"$f":"IF($A76>0,Total!C75,\"\")","v":"Roger"},{"$f":"IF($A76>0,Total!D75,\"\")","v":66},26,"","","","","","","","","","","","","","",1]
[{"$f":"Total!A76","v":74},{"$f":"IF($A77>0,Total!B76,\"\")","v":"Curé"},{"$f":"IF($A77>0,Total!C76,\"\")","v":"Rémy"},{"$f":"IF($A77>0,Total!D76,\"\")","v":194},"","","","","",17,"","","","","","","","","",1]
[{"$f":"Total!A77","v":75},{"$f":"IF($A78>0,Total!B77,\"\")","v":"Cureau"},{"$f":"IF($A78>0,Total!C77,\"\")","v":"Bernard"},{"$f":"IF($A78>0,Total!D77,\"\")","v":22},27,"","","","","","","","","","","","","","",1]
[{"$f":"Total!A78","v":76},{"$f":"IF($A79>0,Total!B78,\"\")","v":"Damis"},{"$f":"IF($A79>0,Total!C78,\"\")","v":"Alain"},{"$f":"IF($A79>0,Total!D78,\"\")","v":282},"","","","","","","","",21,"","","","","","",1]
[{"$f":"Total!A79","v":77},{"$f":"IF($A80>0,Total!B79,\"\")","v":"Danjean"},{"$f":"IF($A80>0,Total!C79,\"\")","v":"Jean-Claude"},{"$f":"IF($A80>0,Total!D79,\"\")","v":245},"","","","","","",22,18,22,"","","","","","",3]
[{"$f":"Total!A80","v":78},{"$f":"IF($A81>0,Total!B80,\"\")","v":"De Duytsche"},{"$f":"IF($A81>0,Total!C80,\"\")","v":"Michel"},{"$f":"IF($A81>0,Total!D80,\"\")","v":153},"","","",19,"","","","","","","","","","","",1]
[{"$f":"Total!A81","v":79},{"$f":"IF($A82>0,Total!B81,\"\")","v":"Decosne"},{"$f":"IF($A82>0,Total!C81,\"\")","v":"Denise"},{"$f":"IF($A82>0,Total!D81,\"\")","v":85},"",13,"","","","","","","","","","","","","",1]
[{"$f":"Total!A82","v":80},{"$f":"IF($A83>0,Total!B82,\"\")","v":"Degrace"},{"$f":"IF($A83>0,Total!C82,\"\")","v":"Michele"},{"$f":"IF($A83>0,Total!D82,\"\")","v":23},28,"","","","","","","","","","","","","","",1]
[{"$f":"Total!A83","v":81},{"$f":"IF($A84>0,Total!B83,\"\")","v":"Dehorter"},{"$f":"IF($A84>0,Total!C83,\"\")","v":"Anne-Marie"},{"$f":"IF($A84>0,Total!D83,\"\")","v":170},"","","","",20,"","","","","","","","","","",1]
[{"$f":"Total!A84","v":82},{"$f":"IF($A85>0,Total!B84,\"\")","v":"Del Gaudio"},{"$f":"IF($A85>0,Total!C84,\"\")","v":"Anne"},{"$f":"IF($A85>0,Total!D84,\"\")","v":24},29,"","","","","","","","","","","","","","",1]
[{"$f":"Total!A85","v":83},{"$f":"IF($A86>0,Total!B85,\"\")","v":"Del Gaudio"},{"$f":"IF($A86>0,Total!C85,\"\")","v":"Isa"},{"$f":"IF($A86>0,Total!D85,\"\")","v":25},30,"","","","","","","","","","","","","","",1]
[{"$f":"Total!A86","v":84},{"$f":"IF($A87>0,Total!B86,\"\")","v":"Delagrange"},{"$f":"IF($A87>0,Total!C86,\"\")","v":"Michel"},{"$f":"IF($A87>0,Total!D86,\"\")","v":26},{"$f":"IFERROR(MATCH($D86,INDIRECT(\"'\"&E$2&\"'!D:D\"),0),\"\")","v":31},14,20,"","","","","","","","","","","","",3]
[{"$f":"Total!A87","v":85},{"$f":"IF($A88>0,Total!B87,\"\")","v":"Delgobe"},{"$f":"IF($A88>0,Total!C87,\"\")","v":"Annie"},{"$f":"IF($A88>0,Total!D87,\"\")","v":129},"","",19,"","",18,23,"","","","","","","","",3]
[{"$f":"Total!A88","v":86},{"$f":"IF($A89>0,Total!B88,\"\")","v":"Demongeot"},{"$f":"IF($A89>0,Total!C88,\"\")","v":"Isabelle"},{"$f":"IF($A89>0,Total!D88,\"\")","v":177},"","","","",21,"","","","","","","","","","",1]
[{"$f":"Total!A89","v":87},{"$f":"IF($A90>0,Total!B89,\"\")","v":"Dessint"},{"$f":"IF($A90>0,Total!C89,\"\")","v":"Michel"},{"$f":"IF($A90>0,Total!D89,\"\")","v":131},"","",21,20,22,19,"","","","","","","","","",4]
[{"$f":"Total!A90","v":88},{"$f":"IF($A91>0,Total!B90,\"\")","v":"Develle"},{"$f":"IF($A91>0,Total!C90,\"\")","v":"Jacqueline"},{"$f":"IF($A91>0,Total!D90,\"\")","v":225},"","","","","","",24,19,"","","","","","","",2]
[{"$f":"Total!A91","v":89},{"$f":"IF($A92>0,Total!B91,\"\")","v":"Develle"},{"$f":"IF($A92>0,Total!C91,\"\")","v":"Jean-Luc"},{"$f":"IF($A92>0,Total!D91,\"\")","v":226},"","","","","","",25,"","","","","","","","",1]
[{"$f":"Total!A92","v":90},{"$f":"IF($A93>0,Total!B92,\"\")","v":"Deville "},{"$f":"IF($A93>0,Total!C92,\"\")","v":"Jean Louis"},{"$f":"IF($A93>0,Total!D92,\"\")","v":137},"","","",21,"","","","","","","","","","","",1]
[{"$f":"Total!A93","v":91},{"$f":"IF($A94>0,Total!B93,\"\")","v":"Donnet"},{"$f":"IF($A94>0,Total!C93,\"\")","v":"Sandrine"},{"$f":"IF($A94>0,Total!D93,\"\")","v":66},26,"","","","","","","","","","","","","","",1]
[{"$f":"Total!A94","v":92},{"$f":"IF($A95>0,Total!B94,\"\")","v":"Donzel"},{"$f":"IF($A95>0,Total!C94,\"\")","v":"Nicole"},{"$f":"IF($A95>0,Total!D94,\"\")","v":274},"","","","","","","","",23,"","","","","","",1]
[{"$f":"Total!A95","v":93},{"$f":"IF($A96>0,Total!B95,\"\")","v":"Dromard"},{"$f":"IF($A96>0,Total!C95,\"\")","v":"Michelle"},{"$f":"IF($A96>0,Total!D95,\"\")","v":27},33,"","","","","","","","","","","","","","",1]
[{"$f":"Total!A96","v":94},{"$f":"IF($A97>0,Total!B96,\"\")","v":"Dromard"},{"$f":"IF($A97>0,Total!C96,\"\")","v":"Robert"},{"$f":"IF($A97>0,Total!D96,\"\")","v":28},34,"","","","","","","","","","","","","","",1]
[{"$f":"Total!A97","v":95},{"$f":"IF($A98>0,Total!B97,\"\")","v":"Drouelle"},{"$f":"IF($A98>0,Total!C97,\"\")","v":"Denise"},{"$f":"IF($A98>0,Total!D97,\"\")","v":67},35,"","","","","","","","","","","","","","",1]
[{"$f":"Total!A98","v":96},{"$f":"IF($A99>0,Total!B98,\"\")","v":"Dubroca"},{"$f":"IF($A99>0,Total!C98,\"\")","v":"Thierry"},{"$f":"IF($A99>0,Total!D98,\"\")","v":29},36,"","","","","","","","","","","","","","",1]
[{"$f":"Total!A99","v":97},{"$f":"IF($A100>0,Total!B99,\"\")","v":"Dupart"},{"$f":"IF($A100>0,Total!C99,\"\")","v":"Béatrice"},{"$f":"IF($A100>0,Total!D99,\"\")","v":157},"","","",22,23,20,26,"","","","","","","","",4]
[{"$f":"Total!A100","v":98},{"$f":"IF($A101>0,Total!B100,\"\")","v":"Dupart"},{"$f":"IF($A101>0,Total!C100,\"\")","v":"Michel"},{"$f":"IF($A101>0,Total!D100,\"\")","v":132},"","",22,23,24,"",27,22,"","","","","","","",5]
[{"$f":"Total!A101","v":99},{"$f":"IF($A102>0,Total!B101,\"\")","v":"Evrard"},{"$f":"IF($A102>0,Total!C101,\"\")","v":"Stéphanie"},{"$f":"IF($A102>0,Total!D101,\"\")","v":68},37,"","","","","","","","","","","","","","",1]
[{"$f":"Total!A102","v":100},{"$f":"IF($A103>0,Total!B102,\"\")","v":"Farion-Variot"},{"$f":"IF($A103>0,Total!C102,\"\")","v":"Jocelyne"},{"$f":"IF($A103>0,Total!D102,\"\")","v":30},39,"","","","","","","","","","","","","","",1]
[{"$f":"Total!A103","v":101},{"$f":"IF($A104>0,Total!B103,\"\")","v":"Faure"},{"$f":"IF($A104>0,Total!C103,\"\")","v":"Robert"},{"$f":"IF($A104>0,Total!D103,\"\")","v":2},{"$f":"IFERROR(MATCH($D103,INDIRECT(\"'\"&E$2&\"'!D:D\"),0),\"\")","v":40},15,"","","","","","","","","","","","","",2]
[{"$f":"Total!A104","v":102},{"$f":"IF($A105>0,Total!B104,\"\")","v":"Faure"},{"$f":"IF($A105>0,Total!C104,\"\")","v":"Sylvain"},{"$f":"IF($A105>0,Total!D104,\"\")","v":1},41,16,23,24,"","","","","","","","","","","",4]
[{"$f":"Total!A105","v":103},{"$f":"IF($A106>0,Total!B105,\"\")","v":"Fevre"},{"$f":"IF($A106>0,Total!C105,\"\")","v":"Virginie"},{"$f":"IF($A106>0,Total!D105,\"\")","v":143},"","","",25,25,21,"","","","","","","","","",3]
[{"$f":"Total!A106","v":104},{"$f":"IF($A107>0,Total!B106,\"\")","v":"Fleury"},{"$f":"IF($A107>0,Total!C106,\"\")","v":"Benjamin"},{"$f":"IF($A107>0,Total!D106,\"\")","v":240},"","","","","","",29,"","","","","","","","",1]
[{"$f":"Total!A107","v":105},{"$f":"IF($A108>0,Total!B107,\"\")","v":"Fleury"},{"$f":"IF($A108>0,Total!C107,\"\")","v":"Françoise"},{"$f":"IF($A108>0,Total!D107,\"\")","v":197},"","","","","",22,28,"","","","","","","","",2]
[{"$f":"Total!A108","v":106},{"$f":"IF($A109>0,Total!B108,\"\")","v":"Forey"},{"$f":"IF($A109>0,Total!C108,\"\")","v":"Marie-Claude"},{"$f":"IF($A109>0,Total!D108,\"\")","v":247},"","","","","","",31,"","","","","","","","",1]
[{"$f":"Total!A109","v":107},{"$f":"IF($A110>0,Total!B109,\"\")","v":"Forey"},{"$f":"IF($A110>0,Total!C109,\"\")","v":"Roger"},{"$f":"IF($A110>0,Total!D109,\"\")","v":246},"","","","","","",30,"","","","","","","","",1]
[{"$f":"Total!A110","v":108},{"$f":"IF($A111>0,Total!B110,\"\")","v":"Fortin"},{"$f":"IF($A111>0,Total!C110,\"\")","v":"Marie-Thérèse"},{"$f":"IF($A111>0,Total!D110,\"\")","v":86},"",17,24,26,"","","","",24,"","","","","","",4]
[{"$f":"Total!A111","v":109},{"$f":"IF($A112>0,Total!B111,\"\")","v":"François"},{"$f":"IF($A112>0,Total!C111,\"\")","v":"Pascal"},{"$f":"IF($A112>0,Total!D111,\"\")","v":31},42,"","","","","","","","","","","","","","",1]
[{"$f":"Total!A112","v":110},{"$f":"IF($A113>0,Total!B112,\"\")","v":"Freylon"},{"$f":"IF($A113>0,Total!C112,\"\")","v":"Patrick"},{"$f":"IF($A113>0,Total!D112,\"\")","v":87},"",18,"","","","","","","","","","","","","",1]
[{"$f":"Total!A113","v":111},{"$f":"IF($A114>0,Total!B113,\"\")","v":"Frizot"},{"$f":"IF($A114>0,Total!C113,\"\")","v":"Colette"},{"$f":"IF($A114>0,Total!D113,\"\")","v":236},"","","","","","",32,"","","","","","","","",1]
[{"$f":"Total!A114","v":112},{"$f":"IF($A115>0,Total!B114,\"\")","v":"Gadriot"},{"$f":"IF($A115>0,Total!C114,\"\")","v":"Daniel"},{"$f":"IF($A115>0,Total!D114,\"\")","v":173},"","","","",26,23,33,23,"","","","","","","",4]
[{"$f":"Total!A115","v":113},{"$f":"IF($A116>0,Total!B115,\"\")","v":"Gagnepain"},{"$f":"IF($A116>0,Total!C115,\"\")","v":"Sabine"},{"$f":"IF($A116>0,Total!D115,\"\")","v":88},"",19,"","","","","","","","","","","","","",1]
[{"$f":"Total!A116","v":114},{"$f":"IF($A117>0,Total!B116,\"\")","v":"Ganée"},{"$f":"IF($A117>0,Total!C116,\"\")","v":"Daniel"},{"$f":"IF($A117>0,Total!D116,\"\")","v":32},38,"","","","","","","","","","","","","","",1]
[{"$f":"Total!A117","v":115},{"$f":"IF($A118>0,Total!B117,\"\")","v":"Ganée"},{"$f":"IF($A118>0,Total!C117,\"\")","v":"Véronique"},{"$f":"IF($A118>0,Total!D117,\"\")","v":214},"","","","","",24,"","","","","","","","","",1]
[{"$f":"Total!A118","v":116},{"$f":"IF($A119>0,Total!B118,\"\")","v":"Garaudet "},{"$f":"IF($A119>0,Total!C118,\"\")","v":"Martine"},{"$f":"IF($A119>0,Total!D118,\"\")","v":139},"","","",27,27,"","","","","","","","","","",2]
[{"$f":"Total!A119","v":117},{"$f":"IF($A120>0,Total!B119,\"\")","v":"Garcia"},{"$f":"IF($A120>0,Total!C119,\"\")","v":"Jean-Paul"},{"$f":"IF($A120>0,Total!D119,\"\")","v":119},"","",25,28,"","","","","","","","","","","",2]
[{"$f":"Total!A120","v":118},{"$f":"IF($A121>0,Total!B120,\"\")","v":"Garnier"},{"$f":"IF($A121>0,Total!C120,\"\")","v":"Andrée"},{"$f":"IF($A121>0,Total!D120,\"\")","v":198},{"$f":"IFERROR(MATCH($D120,INDIRECT(\"'\"&E$2&\"'!D:D\"),0),\"\")","v":""},"","","","",25,34,"","","","","","","","",2]
[{"$f":"Total!A121","v":119},{"$f":"IF($A122>0,Total!B121,\"\")","v":"Gaudez "},{"$f":"IF($A122>0,Total!C121,\"\")","v":"Martine"},{"$f":"IF($A122>0,Total!D121,\"\")","v":163},"","","",29,"","","","","","","","","","","",1]
[{"$f":"Total!A122","v":120},{"$f":"IF($A123>0,Total!B122,\"\")","v":"Gaussens"},{"$f":"IF($A123>0,Total!C122,\"\")","v":"Didier"},{"$f":"IF($A123>0,Total!D122,\"\")","v":141},"","","",30,28,26,35,24,"","","","","","","",5]
[{"$f":"Total!A123","v":121},{"$f":"IF($A124>0,Total!B123,\"\")","v":"Gautheron"},{"$f":"IF($A124>0,Total!C123,\"\")","v":"Christiane"},{"$f":"IF($A124>0,Total!D123,\"\")","v":33},43,20,"","","","","","","","","","","","","",2]
[{"$f":"Total!A124","v":122},{"$f":"IF($A125>0,Total!B124,\"\")","v":"Gautheron"},{"$f":"IF($A125>0,Total!C124,\"\")","v":"Claude"},{"$f":"IF($A125>0,Total!D124,\"\")","v":34},44,21,26,31,29,27,36,25,26,"","","","","","",9]
[{"$f":"Total!A125","v":123},{"$f":"IF($A126>0,Total!B125,\"\")","v":"Gautheron"},{"$f":"IF($A126>0,Total!C125,\"\")","v":"Roger"},{"$f":"IF($A126>0,Total!D125,\"\")","v":159},"","","",32,"","","","","","","","","","","",1]
[{"$f":"Total!A126","v":124},{"$f":"IF($A127>0,Total!B126,\"\")","v":"Gautheron"},{"$f":"IF($A127>0,Total!C126,\"\")","v":"Valérie"},{"$f":"IF($A127>0,Total!D126,\"\")","v":184},"","","","",30,28,37,"","","","","","","","",3]
[{"$f":"Total!A127","v":125},{"$f":"IF($A128>0,Total!B127,\"\")","v":"Gauthier"},{"$f":"IF($A128>0,Total!C127,\"\")","v":"Françoise"},{"$f":"IF($A128>0,Total!D127,\"\")","v":243},"","","","","","",38,"","","","","","","","",1]
[{"$f":"Total!A128","v":126},{"$f":"IF($A129>0,Total!B128,\"\")","v":"Gay"},{"$f":"IF($A129>0,Total!C128,\"\")","v":"Fabienne"},{"$f":"IF($A129>0,Total!D128,\"\")","v":237},"","","","","","",39,26,"","","","","","","",2]
[{"$f":"Total!A129","v":127},{"$f":"IF($A130>0,Total!B129,\"\")","v":"Gervais"},{"$f":"IF($A130>0,Total!C129,\"\")","v":"Marie-Françoise"},{"$f":"IF($A130>0,Total!D129,\"\")","v":292},"","","","","","","","",25,"","","","","","",1]
[{"$f":"Total!A130","v":128},{"$f":"IF($A131>0,Total!B130,\"\")","v":"Gestin"},{"$f":"IF($A131>0,Total!C130,\"\")","v":"Joël"},{"$f":"IF($A131>0,Total!D130,\"\")","v":69},48,"","","","","","","","","","","","","","",1]
[{"$f":"Total!A131","v":129},{"$f":"IF($A132>0,Total!B131,\"\")","v":"Goillot"},{"$f":"IF($A132>0,Total!C131,\"\")","v":"Daniel"},{"$f":"IF($A132>0,Total!D131,\"\")","v":283},"","","","","","","","",27,"","","","","","",1]
[{"$f":"Total!A132","v":130},{"$f":"IF($A133>0,Total!B132,\"\")","v":"Gomes - Da silva"},{"$f":"IF($A133>0,Total!C132,\"\")","v":"Rose"},{"$f":"IF($A133>0,Total!D132,\"\")","v":242},"","","","","","",40,"","","","","","","","",{"$f":"IF(D132<>\"\",COUNT(E132:S132),\"\")","v":1}]
[{"$f":"Total!A133","v":131},{"$f":"IF($A134>0,Total!B133,\"\")","v":"Grauet"},{"$f":"IF($A134>0,Total!C133,\"\")","v":"Marie-Hélène"},{"$f":"IF($A134>0,Total!D133,\"\")","v":271},"","","","","","","","",28,"","","","","","",1]
[{"$f":"Total!A134","v":132},{"$f":"IF($A135>0,Total!B134,\"\")","v":"Grenot"},{"$f":"IF($A135>0,Total!C134,\"\")","v":"Claudette"},{"$f":"IF($A135>0,Total!D134,\"\")","v":248},"","","","","","",41,"","","","","","","","",1]
[{"$f":"Total!A135","v":133},{"$f":"IF($A136>0,Total!B135,\"\")","v":"Grivelet"},{"$f":"IF($A136>0,Total!C135,\"\")","v":"Alain"},{"$f":"IF($A136>0,Total!D135,\"\")","v":199},"","","","","",29,"","","","","","","","","",1]
[{"$f":"Total!A136","v":134},{"$f":"IF($A137>0,Total!B136,\"\")","v":"Grosjean"},{"$f":"IF($A137>0,Total!C136,\"\")","v":"Denise"},{"$f":"IF($A137>0,Total!D136,\"\")","v":123},"","",27,"","","","","","","","","","","","",1]
[{"$f":"Total!A137","v":135},{"$f":"IF($A138>0,Total!B137,\"\")","v":"Guéritée"},{"$f":"IF($A138>0,Total!C137,\"\")","v":"Claudine"},{"$f":"IF($A138>0,Total!D137,\"\")","v":227},{"$f":"IFERROR(MATCH($D137,INDIRECT(\"'\"&E$2&\"'!D:D\"),0),\"\")","v":""},"","","","","",42,"","","","","","","","",1]
[{"$f":"Total!A138","v":136},{"$f":"IF($A139>0,Total!B138,\"\")","v":"Guichard"},{"$f":"IF($A139>0,Total!C138,\"\")","v":"Yvette"},{"$f":"IF($A139>0,Total!D138,\"\")","v":200},"","","","","",30,43,"","","","","","","","",2]
[{"$f":"Total!A139","v":137},{"$f":"IF($A140>0,Total!B139,\"\")","v":"Hallvin"},{"$f":"IF($A140>0,Total!C139,\"\")","v":"Pierre"},{"$f":"IF($A140>0,Total!D139,\"\")","v":35},45,"","","","","","","","","","","","","","",1]
[{"$f":"Total!A140","v":138},{"$f":"IF($A141>0,Total!B140,\"\")","v":"Heliot"},{"$f":"IF($A141>0,Total!C140,\"\")","v":"Alexis"},{"$f":"IF($A141>0,Total!D140,\"\")","v":89},"",22,"","","","","","","","","","","","","",1]
[{"$f":"Total!A141","v":139},{"$f":"IF($A142>0,Total!B141,\"\")","v":"Heliot"},{"$f":"IF($A142>0,Total!C141,\"\")","v":"Marie-Odile"},{"$f":"IF($A142>0,Total!D141,\"\")","v":213},"","","","","",31,"","","","","","","","","",1]
[{"$f":"Total!A142","v":140},{"$f":"IF($A143>0,Total!B142,\"\")","v":"Henriot"},{"$f":"IF($A143>0,Total!C142,\"\")","v":"Isabelle"},{"$f":"IF($A143>0,Total!D142,\"\")","v":201},"","","","","",32,"","","","","","","","","",1]
[{"$f":"Total!A143","v":141},{"$f":"IF($A144>0,Total!B143,\"\")","v":"Herbert"},{"$f":"IF($A144>0,Total!C143,\"\")","v":"Daniele"},{"$f":"IF($A144>0,Total!D143,\"\")","v":255},"","","","","","","",27,29,"","","","","","",2]
[{"$f":"Total!A144","v":142},{"$f":"IF($A145>0,Total!B144,\"\")","v":"Hory"},{"$f":"IF($A145>0,Total!C144,\"\")","v":"Patricia"},{"$f":"IF($A145>0,Total!D144,\"\")","v":122},"","",28,33,31,"","","","","","","","","","",3]
[{"$f":"Total!A145","v":143},{"$f":"IF($A146>0,Total!B145,\"\")","v":"Huguenot"},{"$f":"IF($A146>0,Total!C145,\"\")","v":"Etienne"},{"$f":"IF($A146>0,Total!D145,\"\")","v":91},"",24,"","","","","","","","","","","","","",1]
[{"$f":"Total!A146","v":144},{"$f":"IF($A147>0,Total!B146,\"\")","v":"Huguenot"},{"$f":"IF($A147>0,Total!C146,\"\")","v":"Jean-Louis"},{"$f":"IF($A147>0,Total!D146,\"\")","v":90},"",23,"","","","","","","","","","","","","",1]
[{"$f":"Total!A147","v":145},{"$f":"IF($A148>0,Total!B147,\"\")","v":"Huguenot"},{"$f":"IF($A148>0,Total!C147,\"\")","v":"Robin"},{"$f":"IF($A148>0,Total!D147,\"\")","v":92},"",25,"","","","","","","","","","","","","",1]
[{"$f":"Total!A148","v":146},{"$f":"IF($A149>0,Total!B148,\"\")","v":"Jacotot"},{"$f":"IF($A149>0,Total!C148,\"\")","v":"Laurence"},{"$f":"IF($A149>0,Total!D148,\"\")","v":164},"","","",35,"","","","","","","","","","","",1]
[{"$f":"Total!A149","v":147},{"$f":"IF($A150>0,Total!B149,\"\")","v":"Jacotot"},{"$f":"IF($A150>0,Total!C149,\"\")","v":"Louis-Nicolas"},{"$f":"IF($A150>0,Total!D149,\"\")","v":130},"","",29,34,32,"","","","","","","","","","",3]
[{"$f":"Total!A150","v":148},{"$f":"IF($A151>0,Total!B150,\"\")","v":"Jacoutot"},{"$f":"IF($A151>0,Total!C150,\"\")","v":"Jean"},{"$f":"IF($A151>0,Total!D150,\"\")","v":120},"","",30,36,33,33,44,28,30,"","","","","","",7]
[{"$f":"Total!A151","v":149},{"$f":"IF($A152>0,Total!B151,\"\")","v":"Jakubzack"},{"$f":"IF($A152>0,Total!C151,\"\")","v":"Monique"},{"$f":"IF($A152>0,Total!D151,\"\")","v":151},"","","",37,"","","","","","","","","","","",1]
[{"$f":"Total!A152","v":150},{"$f":"IF($A153>0,Total!B152,\"\")","v":"Jamin"},{"$f":"IF($A153>0,Total!C152,\"\")","v":"Frédéric"},{"$f":"IF($A153>0,Total!D152,\"\")","v":6},46,"","","","","","","","","","","","","","",1]
[{"$f":"Total!A153","v":151},{"$f":"IF($A154>0,Total!B153,\"\")","v":"Jan"},{"$f":"IF($A154>0,Total!C153,\"\")","v":"Louis"},{"$f":"IF($A154>0,Total!D153,\"\")","v":36},47,26,31,38,34,34,45,29,31,"","","","","","",9]
[{"$f":"Total!A154","v":152},{"$f":"IF($A155>0,Total!B154,\"\")","v":"Jardon"},{"$f":"IF($A155>0,Total!C154,\"\")","v":"Geneviève"},{"$f":"IF($A155>0,Total!D154,\"\")","v":253},{"$f":"IFERROR(MATCH($D154,INDIRECT(\"'\"&E$2&\"'!D:D\"),0),\"\")","v":""},"","","","","",46,30,"","","","","","","",2]
[{"$f":"Total!A155","v":153},{"$f":"IF($A156>0,Total!B155,\"\")","v":"Jeanniard"},{"$f":"IF($A156>0,Total!C155,\"\")","v":"Robert"},{"$f":"IF($A156>0,Total!D155,\"\")","v":134},"","",32,"","","","","","","","","","","","",1]
[{"$f":"Total!A156","v":154},{"$f":"IF($A157>0,Total!B156,\"\")","v":"Jeannin"},{"$f":"IF($A157>0,Total!C156,\"\")","v":"Gérard"},{"$f":"IF($A157>0,Total!D156,\"\")","v":93},"",27,"","","","","","","","","","","","","",1]
[{"$f":"Total!A157","v":155},{"$f":"IF($A158>0,Total!B157,\"\")","v":"Jeannin"},{"$f":"IF($A158>0,Total!C157,\"\")","v":"Sylvie"},{"$f":"IF($A158>0,Total!D157,\"\")","v":94},"",28,"","","","","","","","","","","","","",1]
[{"$f":"Total!A158","v":156},{"$f":"IF($A159>0,Total!B158,\"\")","v":"Jobard"},{"$f":"IF($A159>0,Total!C158,\"\")","v":"Huguette"},{"$f":"IF($A159>0,Total!D158,\"\")","v":280},"","","","","","","","",32,"","","","","","",1]
[{"$f":"Total!A159","v":157},{"$f":"IF($A160>0,Total!B159,\"\")","v":"Lacreuse"},{"$f":"IF($A160>0,Total!C159,\"\")","v":"Gérard"},{"$f":"IF($A160>0,Total!D159,\"\")","v":37},49,29,33,39,35,35,47,31,33,"","","","","","",9]
[{"$f":"Total!A160","v":158},{"$f":"IF($A161>0,Total!B160,\"\")","v":"Lahoussine"},{"$f":"IF($A161>0,Total!C160,\"\")","v":"Marie-France"},{"$f":"IF($A161>0,Total!D160,\"\")","v":215},"","","","","",36,"","","","","","","","","",1]
[{"$f":"Total!A161","v":159},{"$f":"IF($A162>0,Total!B161,\"\")","v":"Lallemand"},{"$f":"IF($A162>0,Total!C161,\"\")","v":"Marie-France"},{"$f":"IF($A162>0,Total!D161,\"\")","v":273},"","","","","","","","",34,"","","","","","",1]
[{"$f":"Total!A162","v":160},{"$f":"IF($A163>0,Total!B162,\"\")","v":"Lapostolle"},{"$f":"IF($A163>0,Total!C162,\"\")","v":"François"},{"$f":"IF($A163>0,Total!D162,\"\")","v":145},"","","",40,36,"","","","","","","","","","",2]
[{"$f":"Total!A163","v":161},{"$f":"IF($A164>0,Total!B163,\"\")","v":"Lasseigne"},{"$f":"IF($A164>0,Total!C163,\"\")","v":"Anne"},{"$f":"IF($A164>0,Total!D163,\"\")","v":202},"","","","","",37,"","","","","","","","","",1]
[{"$f":"Total!A164","v":162},{"$f":"IF($A165>0,Total!B164,\"\")","v":"Lauer"},{"$f":"IF($A165>0,Total!C164,\"\")","v":"Aymeric"},{"$f":"IF($A165>0,Total!D164,\"\")","v":190},"","","","","",38,"","","","","","","","","",1]
[{"$f":"Total!A165","v":163},{"$f":"IF($A166>0,Total!B165,\"\")","v":"Lauer"},{"$f":"IF($A166>0,Total!C165,\"\")","v":"Nathalie"},{"$f":"IF($A166>0,Total!D165,\"\")","v":191},"","","","","",39,48,32,35,"","","","","","",4]
[{"$f":"Total!A166","v":164},{"$f":"IF($A167>0,Total!B166,\"\")","v":"Lauer"},{"$f":"IF($A167>0,Total!C166,\"\")","v":"Patrick"},{"$f":"IF($A167>0,Total!D166,\"\")","v":285},"","","","","","","","",36,"","","","","","",1]
[{"$f":"Total!A167","v":165},{"$f":"IF($A168>0,Total!B167,\"\")","v":"Lefevre"},{"$f":"IF($A168>0,Total!C167,\"\")","v":"Denise"},{"$f":"IF($A168>0,Total!D167,\"\")","v":38},50,"","","","","","","","","","","","","","",1]
[{"$f":"Total!A168","v":166},{"$f":"IF($A169>0,Total!B168,\"\")","v":"Lefevre"},{"$f":"IF($A169>0,Total!C168,\"\")","v":"Joelle"},{"$f":"IF($A169>0,Total!D168,\"\")","v":39},51,"","","","","","","","","","","","","","",1]
[{"$f":"Total!A169","v":167},{"$f":"IF($A170>0,Total!B169,\"\")","v":"Legros "},{"$f":"IF($A170>0,Total!C169,\"\")","v":"Lucien"},{"$f":"IF($A170>0,Total!D169,\"\")","v":40},"",30,34,41,37,"",49,"","","","","","","","",5]
[{"$f":"Total!A170","v":168},{"$f":"IF($A171>0,Total!B170,\"\")","v":"Lerondeau"},{"$f":"IF($A171>0,Total!C170,\"\")","v":"Michel"},{"$f":"IF($A171>0,Total!D170,\"\")","v":239},"","","","","","",51,"","","","","","","","",1]
[{"$f":"Total!A171","v":169},{"$f":"IF($A172>0,Total!B171,\"\")","v":"Lerondeau"},{"$f":"IF($A172>0,Total!C171,\"\")","v":"Michele"},{"$f":"IF($A172>0,Total!D171,\"\")","v":161},{"$f":"IFERROR(MATCH($D171,INDIRECT(\"'\"&E$2&\"'!D:D\"),0),\"\")","v":""},"","",42,38,"",50,33,37,"","","","","","",5]
[{"$f":"Total!A172","v":170},{"$f":"IF($A173>0,Total!B172,\"\")","v":"Leroux"},{"$f":"IF($A173>0,Total!C172,\"\")","v":"Patrick"},{"$f":"IF($A173>0,Total!D172,\"\")","v":95},"",31,"",43,39,"","","","","","","","","","",3]
[{"$f":"Total!A173","v":171},{"$f":"IF($A174>0,Total!B173,\"\")","v":"Leroy"},{"$f":"IF($A174>0,Total!C173,\"\")","v":"Claude"},{"$f":"IF($A174>0,Total!D173,\"\")","v":96},"",32,"","","","","","","","","","","","","",1]
[{"$f":"Total!A174","v":172},{"$f":"IF($A175>0,Total!B174,\"\")","v":"Lhermitte"},{"$f":"IF($A175>0,Total!C174,\"\")","v":"Claudia"},{"$f":"IF($A175>0,Total!D174,\"\")","v":203},"","","","","","","","","","","","","","","",0]
[{"$f":"Total!A175","v":173},{"$f":"IF($A176>0,Total!B175,\"\")","v":"Lhuillier"},{"$f":"IF($A176>0,Total!C175,\"\")","v":"Paul"},{"$f":"IF($A176>0,Total!D175,\"\")","v":158},"","","",44,40,41,52,34,38,"","","","","","",6]
[{"$f":"Total!A176","v":174},{"$f":"IF($A177>0,Total!B176,\"\")","v":"Linck"},{"$f":"IF($A177>0,Total!C176,\"\")","v":"Quentin"},{"$f":"IF($A177>0,Total!D176,\"\")","v":97},"",33,"","","","","","","","","","","","","",1]
[{"$f":"Total!A177","v":175},{"$f":"IF($A178>0,Total!B177,\"\")","v":"Lossent"},{"$f":"IF($A178>0,Total!C177,\"\")","v":"Marie-Catherine"},{"$f":"IF($A178>0,Total!D177,\"\")","v":278},"","","","","","","","",39,"","","","","","",1]
[{"$f":"Total!A178","v":176},{"$f":"IF($A179>0,Total!B178,\"\")","v":"Magnin"},{"$f":"IF($A179>0,Total!C178,\"\")","v":"Sylviane"},{"$f":"IF($A179>0,Total!D178,\"\")","v":266},"","","","","","","","",40,"","","","","","",1]
[{"$f":"Total!A179","v":177},{"$f":"IF($A180>0,Total!B179,\"\")","v":"Malnoy"},{"$f":"IF($A180>0,Total!C179,\"\")","v":"Monique"},{"$f":"IF($A180>0,Total!D179,\"\")","v":41},52,"","","","","","","","","","","","","","",1]
[{"$f":"Total!A180","v":178},{"$f":"IF($A181>0,Total!B180,\"\")","v":"Marchand"},{"$f":"IF($A181>0,Total!C180,\"\")","v":"Michel"},{"$f":"IF($A181>0,Total!D180,\"\")","v":98},"",34,"","","","","","","","","","","","","",1]
[{"$f":"Total!A181","v":179},{"$f":"IF($A182>0,Total!B181,\"\")","v":"Marguery"},{"$f":"IF($A182>0,Total!C181,\"\")","v":"Bernard"},{"$f":"IF($A182>0,Total!D181,\"\")","v":42},53,35,"","","","","","","","","","","","","",2]
[{"$f":"Total!A182","v":180},{"$f":"IF($A183>0,Total!B182,\"\")","v":"Marin"},{"$f":"IF($A183>0,Total!C182,\"\")","v":"Paul"},{"$f":"IF($A183>0,Total!D182,\"\")","v":176},"","","","",41,"","","","","","","","","","",1]
[{"$f":"Total!A183","v":181},{"$f":"IF($A184>0,Total!B183,\"\")","v":"Marseille"},{"$f":"IF($A184>0,Total!C183,\"\")","v":"Huguette"},{"$f":"IF($A184>0,Total!D183,\"\")","v":204},"","","","","",42,53,35,"","","","","","","",3]
[{"$f":"Total!A184","v":182},{"$f":"IF($A185>0,Total!B184,\"\")","v":"Martin"},{"$f":"IF($A185>0,Total!C184,\"\")","v":"Gabriel"},{"$f":"IF($A185>0,Total!D184,\"\")","v":267},"","","","","","","","",41,"","","","","","",1]
[{"$f":"Total!A185","v":183},{"$f":"IF($A186>0,Total!B185,\"\")","v":"Martiny"},{"$f":"IF($A186>0,Total!C185,\"\")","v":"Jean-Pierre"},{"$f":"IF($A186>0,Total!D185,\"\")","v":125},"","",35,45,42,43,"",36,42,"","","","","","",6]
[{"$f":"Total!A186","v":184},{"$f":"IF($A187>0,Total!B186,\"\")","v":"Masi"},{"$f":"IF($A187>0,Total!C186,\"\")","v":"Marie-Thérèse"},{"$f":"IF($A187>0,Total!D186,\"\")","v":205},"","","","","",44,54,37,43,"","","","","","",4]
[{"$f":"Total!A187","v":185},{"$f":"IF($A188>0,Total!B187,\"\")","v":"Mathiron"},{"$f":"IF($A188>0,Total!C187,\"\")","v":"David"},{"$f":"IF($A188>0,Total!D187,\"\")","v":99},"",36,"","","","","","","","","","","","","",1]
[{"$f":"Total!A188","v":186},{"$f":"IF($A189>0,Total!B188,\"\")","v":"Mathiron"},{"$f":"IF($A189>0,Total!C188,\"\")","v":"Ghislaine"},{"$f":"IF($A189>0,Total!D188,\"\")","v":100},{"$f":"IFERROR(MATCH($D188,INDIRECT(\"'\"&E$2&\"'!D:D\"),0),\"\")","v":""},37,"","","","","","","","","","","","","",1]
[{"$f":"Total!A189","v":187},{"$f":"IF($A190>0,Total!B189,\"\")","v":"Mathiron"},{"$f":"IF($A190>0,Total!C189,\"\")","v":"Virginie"},{"$f":"IF($A190>0,Total!D189,\"\")","v":101},"",38,"","","","","","","","","","","","","",1]
[{"$f":"Total!A190","v":188},{"$f":"IF($A191>0,Total!B190,\"\")","v":"Mazue"},{"$f":"IF($A191>0,Total!C190,\"\")","v":"Nelly"},{"$f":"IF($A191>0,Total!D190,\"\")","v":102},"",39,"","","","","","","","","","","","","",1]
[{"$f":"Total!A191","v":189},{"$f":"IF($A192>0,Total!B191,\"\")","v":"Merle"},{"$f":"IF($A192>0,Total!C191,\"\")","v":"Sylvie"},{"$f":"IF($A192>0,Total!D191,\"\")","v":260},"","","","","","","",38,"","","","","","","",1]
[{"$f":"Total!A192","v":190},{"$f":"IF($A193>0,Total!B192,\"\")","v":"Merle"},{"$f":"IF($A193>0,Total!C192,\"\")","v":"Véronique"},{"$f":"IF($A193>0,Total!D192,\"\")","v":261},"","","","","","","",39,"","","","","","","",1]
[{"$f":"Total!A193","v":191},{"$f":"IF($A194>0,Total!B193,\"\")","v":"Michaud"},{"$f":"IF($A194>0,Total!C193,\"\")","v":"Sylvie"},{"$f":"IF($A194>0,Total!D193,\"\")","v":103},"",40,"",46,"","","","","","","","","","","",2]
[{"$f":"Total!A194","v":192},{"$f":"IF($A195>0,Total!B194,\"\")","v":"Michaudet"},{"$f":"IF($A195>0,Total!C194,\"\")","v":"Denise"},{"$f":"IF($A195>0,Total!D194,\"\")","v":169},"","","","",43,45,55,40,"","","","","","","",4]
[{"$f":"Total!A195","v":193},{"$f":"IF($A196>0,Total!B195,\"\")","v":"Midol-Monnet"},{"$f":"IF($A196>0,Total!C195,\"\")","v":"Thérèse"},{"$f":"IF($A196>0,Total!D195,\"\")","v":174},"","","","",44,"","","","","","","","","","",1]
[{"$f":"Total!A196","v":194},{"$f":"IF($A197>0,Total!B196,\"\")","v":"Mielniczuk"},{"$f":"IF($A197>0,Total!C196,\"\")","v":"Gérard"},{"$f":"IF($A197>0,Total!D196,\"\")","v":209},"","","","","",47,57,42,45,"","","","","","",{"$f":"IF(D196<>\"\",COUNT(E196:S196),\"\")","v":4}]
[{"$f":"Total!A197","v":195},{"$f":"IF($A198>0,Total!B197,\"\")","v":"Mielniczuk"},{"$f":"IF($A198>0,Total!C197,\"\")","v":"Jeannine"},{"$f":"IF($A198>0,Total!D197,\"\")","v":187},"","","","",45,46,56,41,44,"","","","","","",5]
[{"$f":"Total!A198","v":196},{"$f":"IF($A199>0,Total!B198,\"\")","v":"Mignot"},{"$f":"IF($A199>0,Total!C198,\"\")","v":"Mireille"},{"$f":"IF($A199>0,Total!D198,\"\")","v":162},"","","",47,"","","","","","","","","","","",1]
[{"$f":"Total!A199","v":197},{"$f":"IF($A200>0,Total!B199,\"\")","v":"Milliere"},{"$f":"IF($A200>0,Total!C199,\"\")","v":"Christine"},{"$f":"IF($A200>0,Total!D199,\"\")","v":212},"","","","","",48,58,"","","","","","","","",2]
[{"$f":"Total!A200","v":198},{"$f":"IF($A201>0,Total!B200,\"\")","v":"Millière"},{"$f":"IF($A201>0,Total!C200,\"\")","v":"Brigitte"},{"$f":"IF($A201>0,Total!D200,\"\")","v":289},"","","","","","","","",46,"","","","","","",1]
[{"$f":"Total!A201","v":199},{"$f":"IF($A202>0,Total!B201,\"\")","v":"Milliot"},{"$f":"IF($A202>0,Total!C201,\"\")","v":"Virginie"},{"$f":"IF($A202>0,Total!D201,\"\")","v":70},"",41,"","","","","","","","","","","","","",1]
[{"$f":"Total!A202","v":200},{"$f":"IF($A203>0,Total!B202,\"\")","v":"Moissenet"},{"$f":"IF($A203>0,Total!C202,\"\")","v":"Michel"},{"$f":"IF($A203>0,Total!D202,\"\")","v":182},"","","","",46,"","","","","","","","","","",1]
[{"$f":"Total!A203","v":201},{"$f":"IF($A204>0,Total!B203,\"\")","v":"Momus"},{"$f":"IF($A204>0,Total!C203,\"\")","v":"Denise"},{"$f":"IF($A204>0,Total!D203,\"\")","v":43},54,"","","","","","","","","","","","","","",1]
[{"$f":"Total!A204","v":202},{"$f":"IF($A205>0,Total!B204,\"\")","v":"Monot"},{"$f":"IF($A205>0,Total!C204,\"\")","v":"Sylvie"},{"$f":"IF($A205>0,Total!D204,\"\")","v":121},"","",36,48,47,49,"","","","","","","","","",4]
[{"$f":"Total!A205","v":203},{"$f":"IF($A206>0,Total!B205,\"\")","v":"Moreux"},{"$f":"IF($A206>0,Total!C205,\"\")","v":"Richard"},{"$f":"IF($A206>0,Total!D205,\"\")","v":44},{"$f":"IFERROR(MATCH($D205,INDIRECT(\"'\"&E$2&\"'!D:D\"),0),\"\")","v":55},42,37,49,48,50,59,43,47,"","","","","","",9]
[{"$f":"Total!A206","v":204},{"$f":"IF($A207>0,Total!B206,\"\")","v":"Moullet"},{"$f":"IF($A207>0,Total!C206,\"\")","v":"Danielle"},{"$f":"IF($A207>0,Total!D206,\"\")","v":45},56,"","","","","","","","","","","","","","",1]
[{"$f":"Total!A207","v":205},{"$f":"IF($A208>0,Total!B207,\"\")","v":"Mourolin"},{"$f":"IF($A208>0,Total!C207,\"\")","v":"Jean-Claude"},{"$f":"IF($A208>0,Total!D207,\"\")","v":104},"",43,"","","","","","","","","","","","","",1]
[{"$f":"Total!A208","v":206},{"$f":"IF($A209>0,Total!B208,\"\")","v":"Muller "},{"$f":"IF($A209>0,Total!C208,\"\")","v":"Christine"},{"$f":"IF($A209>0,Total!D208,\"\")","v":46},57,44,"","","","","","","","","","","","","",2]
[{"$f":"Total!A209","v":207},{"$f":"IF($A210>0,Total!B209,\"\")","v":"Mutin"},{"$f":"IF($A210>0,Total!C209,\"\")","v":"Odile"},{"$f":"IF($A210>0,Total!D209,\"\")","v":218},"","","","","",51,60,44,48,"","","","","","",4]
[{"$f":"Total!A210","v":208},{"$f":"IF($A211>0,Total!B210,\"\")","v":"Muzeau"},{"$f":"IF($A211>0,Total!C210,\"\")","v":"Huguette"},{"$f":"IF($A211>0,Total!D210,\"\")","v":211},"","","","","",52,61,"","","","","","","","",2]
[{"$f":"Total!A211","v":209},{"$f":"IF($A212>0,Total!B211,\"\")","v":"Nicolas"},{"$f":"IF($A212>0,Total!C211,\"\")","v":"Jocelyne"},{"$f":"IF($A212>0,Total!D211,\"\")","v":206},"","","","","",53,"","","","","","","","","",1]
[{"$f":"Total!A212","v":210},{"$f":"IF($A213>0,Total!B212,\"\")","v":"Nicolas"},{"$f":"IF($A213>0,Total!C212,\"\")","v":"Monique"},{"$f":"IF($A213>0,Total!D212,\"\")","v":142},"","","",50,49,"","","",49,"","","","","","",3]
[{"$f":"Total!A213","v":211},{"$f":"IF($A214>0,Total!B213,\"\")","v":"Nikonoff"},{"$f":"IF($A214>0,Total!C213,\"\")","v":"Jeanne-René"},{"$f":"IF($A214>0,Total!D213,\"\")","v":230},"","","","","","",62,"","","","","","","","",1]
[{"$f":"Total!A214","v":212},{"$f":"IF($A215>0,Total!B214,\"\")","v":"Niollet "},{"$f":"IF($A215>0,Total!C214,\"\")","v":"Michele"},{"$f":"IF($A215>0,Total!D214,\"\")","v":105},"",45,"","","","","","","","","","","","","",1]
[{"$f":"Total!A215","v":213},{"$f":"IF($A216>0,Total!B215,\"\")","v":"Noirot"},{"$f":"IF($A216>0,Total!C215,\"\")","v":"Jean-Claude"},{"$f":"IF($A216>0,Total!D215,\"\")","v":284},"","","","","","","","",50,"","","","","","",1]
[{"$f":"Total!A216","v":214},{"$f":"IF($A217>0,Total!B216,\"\")","v":"Once Duthoit"},{"$f":"IF($A217>0,Total!C216,\"\")","v":"Marie-France"},{"$f":"IF($A217>0,Total!D216,\"\")","v":168},"","","","",50,"","","","","","","","","","",1]
[{"$f":"Total!A217","v":215},{"$f":"IF($A218>0,Total!B217,\"\")","v":"Orenga"},{"$f":"IF($A218>0,Total!C217,\"\")","v":"Catherine"},{"$f":"IF($A218>0,Total!D217,\"\")","v":106},"",46,"","","","","","","","","","","","","",1]
[{"$f":"Total!A218","v":216},{"$f":"IF($A219>0,Total!B218,\"\")","v":"Paget"},{"$f":"IF($A219>0,Total!C218,\"\")","v":"Rose Marie"},{"$f":"IF($A219>0,Total!D218,\"\")","v":140},"","","",51,"","","","","","","","","","","",1]
[{"$f":"Total!A219","v":217},{"$f":"IF($A220>0,Total!B219,\"\")","v":"Pamart"},{"$f":"IF($A220>0,Total!C219,\"\")","v":"Alain"},{"$f":"IF($A220>0,Total!D219,\"\")","v":107},"","",38,52,51,54,"",45,51,"","","","","","",6]
[{"$f":"Total!A220","v":218},{"$f":"IF($A221>0,Total!B220,\"\")","v":"Papirer"},{"$f":"IF($A221>0,Total!C220,\"\")","v":"Dominique"},{"$f":"IF($A221>0,Total!D220,\"\")","v":47},58,"","","","","","","","","","","","","","",1]
[{"$f":"Total!A221","v":219},{"$f":"IF($A222>0,Total!B221,\"\")","v":"Parizot"},{"$f":"IF($A222>0,Total!C221,\"\")","v":"Evelyne"},{"$f":"IF($A222>0,Total!D221,\"\")","v":48},61,"",39,53,"","","",46,52,"","","","","","",5]
[{"$f":"Total!A222","v":220},{"$f":"IF($A223>0,Total!B222,\"\")","v":"Parriaux"},{"$f":"IF($A223>0,Total!C222,\"\")","v":"Françoise"},{"$f":"IF($A223>0,Total!D222,\"\")","v":49},{"$f":"IFERROR(MATCH($D222,INDIRECT(\"'\"&E$2&\"'!D:D\"),0),\"\")","v":59},"","","","","","","","","","","","","","",1]
[{"$f":"Total!A223","v":221},{"$f":"IF($A224>0,Total!B223,\"\")","v":"Parriaux"},{"$f":"IF($A224>0,Total!C223,\"\")","v":"Jean-Marie"},{"$f":"IF($A224>0,Total!D223,\"\")","v":50},60,"","","","","","","","","","","","","","",1]
[{"$f":"Total!A224","v":222},{"$f":"IF($A225>0,Total!B224,\"\")","v":"Pascanet"},{"$f":"IF($A225>0,Total!C224,\"\")","v":"Odile"},{"$f":"IF($A225>0,Total!D224,\"\")","v":116},"","","","","","","","","","","","","","","",0]
[{"$f":"Total!A225","v":223},{"$f":"IF($A226>0,Total!B225,\"\")","v":"Passemard"},{"$f":"IF($A226>0,Total!C225,\"\")","v":"Annie"},{"$f":"IF($A226>0,Total!D225,\"\")","v":108},"",47,"","","","","","","","","","","","","",1]
[{"$f":"Total!A226","v":224},{"$f":"IF($A227>0,Total!B226,\"\")","v":"Passemard"},{"$f":"IF($A227>0,Total!C226,\"\")","v":"Jaqueline"},{"$f":"IF($A227>0,Total!D226,\"\")","v":109},"",48,"","","","","","","","","","","","","",1]
[{"$f":"Total!A227","v":225},{"$f":"IF($A228>0,Total!B227,\"\")","v":"Passemard"},{"$f":"IF($A228>0,Total!C227,\"\")","v":"Robert"},{"$f":"IF($A228>0,Total!D227,\"\")","v":110},"",49,"","","","","","","","","","","","","",1]
[{"$f":"Total!A228","v":226},{"$f":"IF($A229>0,Total!B228,\"\")","v":"Pasteur"},{"$f":"IF($A229>0,Total!C228,\"\")","v":"Jean-Claude"},{"$f":"IF($A229>0,Total!D228,\"\")","v":241},"","","","","","",64,"","","","","","","","",1]
[{"$f":"Total!A229","v":227},{"$f":"IF($A230>0,Total!B229,\"\")","v":"Pauthier"},{"$f":"IF($A230>0,Total!C229,\"\")","v":"Michele"},{"$f":"IF($A230>0,Total!D229,\"\")","v":251},"","","","","","",65,47,53,"","","","","","",3]
[{"$f":"Total!A230","v":228},{"$f":"IF($A231>0,Total!B230,\"\")","v":"Peillon"},{"$f":"IF($A231>0,Total!C230,\"\")","v":"Frédérique"},{"$f":"IF($A231>0,Total!D230,\"\")","v":167},"","","","",53,"","","","","","","","","","",{"$f":"IF(D230<>\"\",COUNT(E230:S230),\"\")","v":1}]
[{"$f":"Total!A231","v":229},{"$f":"IF($A232>0,Total!B231,\"\")","v":"Perin"},{"$f":"IF($A232>0,Total!C231,\"\")","v":"Claude"},{"$f":"IF($A232>0,Total!D231,\"\")","v":263},"","","","","","","",48,"","","","","","","",{"$f":"IF(D231<>\"\",COUNT(E231:S231),\"\")","v":1}]
[{"$f":"Total!A232","v":230},{"$f":"IF($A233>0,Total!B232,\"\")","v":"Perret"},{"$f":"IF($A233>0,Total!C232,\"\")","v":"Anthony"},{"$f":"IF($A233>0,Total!D232,\"\")","v":53},65,"","","","","","","","","","","","","","",1]
[{"$f":"Total!A233","v":231},{"$f":"IF($A234>0,Total!B233,\"\")","v":"Perret"},{"$f":"IF($A234>0,Total!C233,\"\")","v":"Frédéric"},{"$f":"IF($A234>0,Total!D233,\"\")","v":52},64,"","","","","","","","","","","","","","",1]
[{"$f":"Total!A234","v":232},{"$f":"IF($A235>0,Total!B234,\"\")","v":"Perret"},{"$f":"IF($A235>0,Total!C234,\"\")","v":"Sophie"},{"$f":"IF($A235>0,Total!D234,\"\")","v":51},63,"","","","","","","","","","","","","","",1]
[{"$f":"Total!A235","v":233},{"$f":"IF($A236>0,Total!B235,\"\")","v":"Perrigueur"},{"$f":"IF($A236>0,Total!C235,\"\")","v":"Suzanne"},{"$f":"IF($A236>0,Total!D235,\"\")","v":54},62,50,44,54,"","","","","","","","","","","",4]
[{"$f":"Total!A236","v":234},{"$f":"IF($A237>0,Total!B236,\"\")","v":"Perrin"},{"$f":"IF($A237>0,Total!C236,\"\")","v":"Andrée"},{"$f":"IF($A237>0,Total!D236,\"\")","v":269},"","","","","","","","",54,"","","","","","",1]
[{"$f":"Total!A237","v":235},{"$f":"IF($A238>0,Total!B237,\"\")","v":"Perrin"},{"$f":"IF($A238>0,Total!C237,\"\")","v":"Jean-Claude "},{"$f":"IF($A238>0,Total!D237,\"\")","v":291},"","","","","","","","",55,"","","","","","",1]
[{"$f":"Total!A238","v":236},{"$f":"IF($A239>0,Total!B238,\"\")","v":"Philippe"},{"$f":"IF($A239>0,Total!C238,\"\")","v":"Marie-Jeanne"},{"$f":"IF($A239>0,Total!D238,\"\")","v":208},"","","","","",56,"","","","","","","","","",1]
[{"$f":"Total!A239","v":237},{"$f":"IF($A240>0,Total!B239,\"\")","v":"Picard"},{"$f":"IF($A240>0,Total!C239,\"\")","v":"Adrienne"},{"$f":"IF($A240>0,Total!D239,\"\")","v":112},{"$f":"IFERROR(MATCH($D239,INDIRECT(\"'\"&E$2&\"'!D:D\"),0),\"\")","v":""},52,"","","","","","","","","","","","","",1]
[{"$f":"Total!A240","v":238},{"$f":"IF($A241>0,Total!B240,\"\")","v":"Picard"},{"$f":"IF($A241>0,Total!C240,\"\")","v":"Jean"},{"$f":"IF($A241>0,Total!D240,\"\")","v":111},"",51,"","","","","","","","","","","","","",1]
[{"$f":"Total!A241","v":239},{"$f":"IF($A242>0,Total!B241,\"\")","v":"Pierron"},{"$f":"IF($A242>0,Total!C241,\"\")","v":"Michel"},{"$f":"IF($A242>0,Total!D241,\"\")","v":189},"","","","","",57,"","","","","","","","","",1]
[{"$f":"Total!A242","v":240},{"$f":"IF($A243>0,Total!B242,\"\")","v":"Pilotto"},{"$f":"IF($A243>0,Total!C242,\"\")","v":"Michele"},{"$f":"IF($A243>0,Total!D242,\"\")","v":124},"","",45,"","","","","","","","","","","","",1]
[{"$f":"Total!A243","v":241},{"$f":"IF($A244>0,Total!B243,\"\")","v":"Poiselet"},{"$f":"IF($A244>0,Total!C243,\"\")","v":"Isabelle"},{"$f":"IF($A244>0,Total!D243,\"\")","v":275},"","","","","","","","","","","","","","","",0]
[{"$f":"Total!A244","v":242},{"$f":"IF($A245>0,Total!B244,\"\")","v":"Poussiere"},{"$f":"IF($A245>0,Total!C244,\"\")","v":"Jacques"},{"$f":"IF($A245>0,Total!D244,\"\")","v":55},66,"","","","","","","","","","","","","","",1]
[{"$f":"Total!A245","v":243},{"$f":"IF($A246>0,Total!B245,\"\")","v":"Pouthier"},{"$f":"IF($A246>0,Total!C245,\"\")","v":"Chantal"},{"$f":"IF($A246>0,Total!D245,\"\")","v":149},"","","",55,54,58,66,49,"","","","","","","",5]
[{"$f":"Total!A246","v":244},{"$f":"IF($A247>0,Total!B246,\"\")","v":"Prat"},{"$f":"IF($A247>0,Total!C246,\"\")","v":"Nicole"},{"$f":"IF($A247>0,Total!D246,\"\")","v":147},"","","",57,"","","","","","","","","","","",1]
[{"$f":"Total!A247","v":245},{"$f":"IF($A248>0,Total!B247,\"\")","v":"Prat"},{"$f":"IF($A248>0,Total!C247,\"\")","v":"Richard"},{"$f":"IF($A248>0,Total!D247,\"\")","v":146},"","","",56,"","","","","","","","","","","",1]
[{"$f":"Total!A248","v":246},{"$f":"IF($A249>0,Total!B248,\"\")","v":"Pusset "},{"$f":"IF($A249>0,Total!C248,\"\")","v":"Raymond"},{"$f":"IF($A249>0,Total!D248,\"\")","v":234},"","","","","","",67,"","","","","","","","",1]
[{"$f":"Total!A249","v":247},{"$f":"IF($A250>0,Total!B249,\"\")","v":"Rassalle"},{"$f":"IF($A250>0,Total!C249,\"\")","v":"Catherine"},{"$f":"IF($A250>0,Total!D249,\"\")","v":71},67,"","","","","","","","","","","","","","",1]
[{"$f":"Total!A250","v":248},{"$f":"IF($A251>0,Total!B250,\"\")","v":"Raverot"},{"$f":"IF($A251>0,Total!C250,\"\")","v":"Marie-Claude"},{"$f":"IF($A251>0,Total!D250,\"\")","v":217},"","","","","",59,68,"","","","","","","","",2]
[{"$f":"Total!A251","v":249},{"$f":"IF($A252>0,Total!B251,\"\")","v":"Renard"},{"$f":"IF($A252>0,Total!C251,\"\")","v":"Georges"},{"$f":"IF($A252>0,Total!D251,\"\")","v":113},"","",46,"",55,60,69,50,56,"","","","","","",6]
[{"$f":"Total!A252","v":250},{"$f":"IF($A253>0,Total!B252,\"\")","v":"Ricamard"},{"$f":"IF($A253>0,Total!C252,\"\")","v":"Marie-Claude"},{"$f":"IF($A253>0,Total!D252,\"\")","v":56},68,"","","","","","","","","","","","","","",1]
[{"$f":"Total!A253","v":251},{"$f":"IF($A254>0,Total!B253,\"\")","v":"Richard"},{"$f":"IF($A254>0,Total!C253,\"\")","v":"Aleth"},{"$f":"IF($A254>0,Total!D253,\"\")","v":232},"","","","","","",71,51,57,"","","","","","",3]
[{"$f":"Total!A254","v":252},{"$f":"IF($A255>0,Total!B254,\"\")","v":"Richard"},{"$f":"IF($A255>0,Total!C254,\"\")","v":"Gaëtant"},{"$f":"IF($A255>0,Total!D254,\"\")","v":57},69,"","","","","","","","","","","","","","",1]
[{"$f":"Total!A255","v":253},{"$f":"IF($A256>0,Total!B255,\"\")","v":"Richard"},{"$f":"IF($A256>0,Total!C255,\"\")","v":"Pierre"},{"$f":"IF($A256>0,Total!D255,\"\")","v":231},"","","","","","",70,"","","","","","","","",1]
[{"$f":"Total!A256","v":254},{"$f":"IF($A257>0,Total!B256,\"\")","v":"Richetin"},{"$f":"IF($A257>0,Total!C256,\"\")","v":"Paul"},{"$f":"IF($A257>0,Total!D256,\"\")","v":58},{"$f":"IFERROR(MATCH($D256,INDIRECT(\"'\"&E$2&\"'!D:D\"),0),\"\")","v":70},53,47,58,"","","","","","","","","","","",4]
[{"$f":"Total!A257","v":255},{"$f":"IF($A258>0,Total!B257,\"\")","v":"Riffet"},{"$f":"IF($A258>0,Total!C257,\"\")","v":"Nicole"},{"$f":"IF($A258>0,Total!D257,\"\")","v":166},"","","","",56,61,"","","","","","","","","",2]
[{"$f":"Total!A258","v":256},{"$f":"IF($A259>0,Total!B258,\"\")","v":"Rius"},{"$f":"IF($A259>0,Total!C258,\"\")","v":"Conchita"},{"$f":"IF($A259>0,Total!D258,\"\")","v":281},"","","","","","","","",58,"","","","","","",1]
[{"$f":"Total!A259","v":257},{"$f":"IF($A260>0,Total!B259,\"\")","v":"Robelet "},{"$f":"IF($A260>0,Total!C259,\"\")","v":"Jacqueline"},{"$f":"IF($A260>0,Total!D259,\"\")","v":72},71,"","","","","","","","","","","","","","",1]
[{"$f":"Total!A260","v":258},{"$f":"IF($A261>0,Total!B260,\"\")","v":"Roux"},{"$f":"IF($A261>0,Total!C260,\"\")","v":"Martine"},{"$f":"IF($A261>0,Total!D260,\"\")","v":223},"","","","","","",72,52,59,"","","","","","",3]
[{"$f":"Total!A261","v":259},{"$f":"IF($A262>0,Total!B261,\"\")","v":"Royer-Cassard"},{"$f":"IF($A262>0,Total!C261,\"\")","v":"Martine"},{"$f":"IF($A262>0,Total!D261,\"\")","v":150},"","","",59,"","","","","","","","","","","",1]
[{"$f":"Total!A262","v":260},{"$f":"IF($A263>0,Total!B262,\"\")","v":"Said Oili"},{"$f":"IF($A263>0,Total!C262,\"\")","v":"Oili Issouf"},{"$f":"IF($A263>0,Total!D262,\"\")","v":73},72,"","","","","","","","","","","","","","",1]
[{"$f":"Total!A263","v":261},{"$f":"IF($A264>0,Total!B263,\"\")","v":"Saint Felix"},{"$f":"IF($A264>0,Total!C263,\"\")","v":"Georgette"},{"$f":"IF($A264>0,Total!D263,\"\")","v":59},73,"","","","","",73,"","","","","","","","",2]
[{"$f":"Total!A264","v":262},{"$f":"IF($A265>0,Total!B264,\"\")","v":"Sauder"},{"$f":"IF($A265>0,Total!C264,\"\")","v":"Marie-Odile"},{"$f":"IF($A265>0,Total!D264,\"\")","v":114},"",54,"","","","","","","","","","","","","",1]
[{"$f":"Total!A265","v":263},{"$f":"IF($A266>0,Total!B265,\"\")","v":"Schoutith"},{"$f":"IF($A266>0,Total!C265,\"\")","v":"Michelle"},{"$f":"IF($A266>0,Total!D265,\"\")","v":165},"","","","",57,"","","","","","","","","","",1]
[{"$f":"Total!A266","v":264},{"$f":"IF($A267>0,Total!B266,\"\")","v":"Seguin"},{"$f":"IF($A267>0,Total!C266,\"\")","v":"Joelle"},{"$f":"IF($A267>0,Total!D266,\"\")","v":115},"",55,"","","","","","","","","","","","","",1]
[{"$f":"Total!A267","v":265},{"$f":"IF($A268>0,Total!B267,\"\")","v":"Sirugue"},{"$f":"IF($A268>0,Total!C267,\"\")","v":"Jean"},{"$f":"IF($A268>0,Total!D267,\"\")","v":279},"","","","","","","","",60,"","","","","","",1]
[{"$f":"Total!A268","v":266},{"$f":"IF($A269>0,Total!B268,\"\")","v":"Sohn"},{"$f":"IF($A269>0,Total!C268,\"\")","v":"Marie-Thérèse"},{"$f":"IF($A269>0,Total!D268,\"\")","v":216},"","","","","",62,"","","","","","","","","",1]
[{"$f":"Total!A269","v":267},{"$f":"IF($A270>0,Total!B269,\"\")","v":"Stighezza"},{"$f":"IF($A270>0,Total!C269,\"\")","v":"René"},{"$f":"IF($A270>0,Total!D269,\"\")","v":220},"","","","","",63,74,53,61,"","","","","","",4]
[{"$f":"Total!A270","v":268},{"$f":"IF($A271>0,Total!B270,\"\")","v":"Taberlet"},{"$f":"IF($A271>0,Total!C270,\"\")","v":"Claude"},{"$f":"IF($A271>0,Total!D270,\"\")","v":60},74,"","","","","","","","","","","","","","",1]
[{"$f":"Total!A271","v":269},{"$f":"IF($A272>0,Total!B271,\"\")","v":"Thiebeaux"},{"$f":"IF($A272>0,Total!C271,\"\")","v":"Chantal"},{"$f":"IF($A272>0,Total!D271,\"\")","v":61},75,56,48,60,58,64,75,54,62,"","","","","","",9]
[{"$f":"Total!A272","v":270},{"$f":"IF($A273>0,Total!B272,\"\")","v":"Thiebeaux"},{"$f":"IF($A273>0,Total!C272,\"\")","v":"Jean-Claude"},{"$f":"IF($A273>0,Total!D272,\"\")","v":238},"","","","","","",76,55,"","","","","","","",2]
[{"$f":"Total!A273","v":271},{"$f":"IF($A274>0,Total!B273,\"\")","v":"Tisserandot"},{"$f":"IF($A274>0,Total!C273,\"\")","v":"Michele"},{"$f":"IF($A274>0,Total!D273,\"\")","v":152},{"$f":"IFERROR(MATCH($D273,INDIRECT(\"'\"&E$2&\"'!D:D\"),0),\"\")","v":""},"","",61,"","","","","","","","","","","",1]
[{"$f":"Total!A274","v":272},{"$f":"IF($A275>0,Total!B274,\"\")","v":"Trapet"},{"$f":"IF($A275>0,Total!C274,\"\")","v":"Edouard"},{"$f":"IF($A275>0,Total!D274,\"\")","v":277},"","","","","","","","",63,"","","","","","",1]
[{"$f":"Total!A275","v":273},{"$f":"IF($A276>0,Total!B275,\"\")","v":"Vandel"},{"$f":"IF($A276>0,Total!C275,\"\")","v":"Isabelle"},{"$f":"IF($A276>0,Total!D275,\"\")","v":62},76,"","","","","","","","","","","","","","",1]
[{"$f":"Total!A276","v":274},{"$f":"IF($A277>0,Total!B276,\"\")","v":"Vauchet"},{"$f":"IF($A277>0,Total!C276,\"\")","v":"Georgette"},{"$f":"IF($A277>0,Total!D276,\"\")","v":148},"","","",62,59,65,77,56,64,"","","","","","",6]
[{"$f":"Total!A277","v":275},{"$f":"IF($A278>0,Total!B277,\"\")","v":"Verne"},{"$f":"IF($A278>0,Total!C277,\"\")","v":"Martine"},{"$f":"IF($A278>0,Total!D277,\"\")","v":74},77,"","","","","","","","","","","","","","",1]
[{"$f":"Total!A278","v":276},{"$f":"IF($A279>0,Total!B278,\"\")","v":"Verpaux"},{"$f":"IF($A279>0,Total!C278,\"\")","v":"Gisèle"},{"$f":"IF($A279>0,Total!D278,\"\")","v":224},"","","","","","",78,57,65,"","","","","","",3]
[{"$f":"Total!A279","v":277},{"$f":"IF($A280>0,Total!B279,\"\")","v":"Veysse"},{"$f":"IF($A280>0,Total!C279,\"\")","v":"Francis"},{"$f":"IF($A280>0,Total!D279,\"\")","v":288},"","","","","","","","",66,"","","","","","",1]
[{"$f":"Total!A280","v":278},{"$f":"IF($A281>0,Total!B280,\"\")","v":"Villemin"},{"$f":"IF($A281>0,Total!C280,\"\")","v":"Janine"},{"$f":"IF($A281>0,Total!D280,\"\")","v":138},"","","",63,60,"","","","","","","","","","",2]
[{"$f":"Total!A281","v":279},{"$f":"IF($A282>0,Total!B281,\"\")","v":"Vossaert"},{"$f":"IF($A282>0,Total!C281,\"\")","v":"Olivier"},{"$f":"IF($A282>0,Total!D281,\"\")","v":5},78,"","","","","","","","","","","","","","",1]
[{"$f":"Total!A282","v":280},{"$f":"IF($A283>0,Total!B282,\"\")","v":"Vuillemin"},{"$f":"IF($A283>0,Total!C282,\"\")","v":"Lilyane"},{"$f":"IF($A283>0,Total!D282,\"\")","v":180},"","","","",61,"","","","","","","","","","",1]
[{"$f":"Total!A283","v":281},{"$f":"IF($A284>0,Total!B283,\"\")","v":"Winter"},{"$f":"IF($A284>0,Total!C283,\"\")","v":"Michel"},{"$f":"IF($A284>0,Total!D283,\"\")","v":117},"",57,49,64,62,66,79,58,"","","","","","","",7]
[{"$f":"Total!A284","v":282},{"$f":"IF($A285>0,Total!B284,\"\")","v":"Winter"},{"$f":"IF($A285>0,Total!C284,\"\")","v":"Michele"},{"$f":"IF($A285>0,Total!D284,\"\")","v":118},"",58,"","","","","","","","","","","","","",1]
[{"$f":"Total!A285","v":283},{"$f":"IF($A286>0,Total!B285,\"\")","v":"Zobel"},{"$f":"IF($A286>0,Total!C285,\"\")","v":"Fabienne"},{"$f":"IF($A286>0,Total!D285,\"\")","v":63},79,"","","","","","","","","","","","","","",1]
[{"$f":"Total!A286","v":284},{"$f":"IF($A287>0,Total!B286,\"\")","v":""},{"$f":"IF($A287>0,Total!C286,\"\")","v":""},{"$f":"IF($A287>0,Total!D286,\"\")","v":""},"","","","","","","","","","","","","","","",""]
[{"$f":"Total!A287","v":0},{"$f":"IF($A288>0,Total!B287,\"\")","v":""},{"$f":"IF($A288>0,Total!C287,\"\")","v":""},{"$f":"IF($A288>0,Total!D287,\"\")","v":""},"","","","","","","","","","","","","","","",""]
[{"$f":"Total!A288","v":0},{"$f":"IF($A289>0,Total!B288,\"\")","v":""},{"$f":"IF($A289>0,Total!C288,\"\")","v":""},{"$f":"IF($A289>0,Total!D288,\"\")","v":""},"","","","","","","","","","","","","","","",""]
[{"$f":"Total!A289","v":0},{"$f":"IF($A290>0,Total!B289,\"\")","v":""},{"$f":"IF($A290>0,Total!C289,\"\")","v":""},{"$f":"IF($A290>0,Total!D289,\"\")","v":""},"","","","","","","","","","","","","","","",""]
[{"$f":"Total!A290","v":0},{"$f":"IF($A291>0,Total!B290,\"\")","v":""},{"$f":"IF($A291>0,Total!C290,\"\")","v":""},{"$f":"IF($A291>0,Total!D290,\"\")","v":""},{"$f":"IFERROR(MATCH($D290,INDIRECT(\"'\"&E$2&\"'!D:D\"),0),\"\")","v":""},"","","","","","","","","","","","","","",""]
[{"$f":"Total!A291","v":0},{"$f":"IF($A292>0,Total!B291,\"\")","v":""},{"$f":"IF($A292>0,Total!C291,\"\")","v":""},{"$f":"IF($A292>0,Total!D291,\"\")","v":""},"","","","","","","","","","","","","","","",""]
[{"$f":"Total!A292","v":0},{"$f":"IF($A293>0,Total!B292,\"\")","v":""},{"$f":"IF($A293>0,Total!C292,\"\")","v":""},{"$f":"IF($A293>0,Total!D292,\"\")","v":""},"","","","","","","","","","","","","","","",""]
[{"$f":"Total!A293","v":0},{"$f":"IF($A294>0,Total!B293,\"\")","v":""},{"$f":"IF($A294>0,Total!C293,\"\")","v":""},{"$f":"IF($A294>0,Total!D293,\"\")","v":""},"","","","","","","","","","","","","","","",""]
[{"$f":"Total!A294","v":0},{"$f":"IF($A295>0,Total!B294,\"\")","v":""},{"$f":"IF($A295>0,Total!C294,\"\")","v":""},{"$f":"IF($A295>0,Total!D294,\"\")","v":""},"","","","","","","","","","","","","","","",""]
[{"$f":"Total!A295","v":0},{"$f":"IF($A296>0,Total!B295,\"\")","v":""},{"$f":"IF($A296>0,Total!C295,\"\")","v":""},{"$f":"IF($A296>0,Total!D295,\"\")","v":""},"","","","","","","","","","","","","","","",{"$f":"IF(D295<>\"\",COUNT(E295:S295),\"\")","v":""}]
[{"$f":"Total!A296","v":0},{"$f":"IF($A297>0,Total!B296,\"\")","v":""},{"$f":"IF($A297>0,Total!C296,\"\")","v":""},{"$f":"IF($A297>0,Total!D296,\"\")","v":""},"","","","","","","","","","","","","","","",""]
[{"$f":"Total!A297","v":0},{"$f":"IF($A298>0,Total!B297,\"\")","v":""},{"$f":"IF($A298>0,Total!C297,\"\")","v":""},{"$f":"IF($A298>0,Total!D297,\"\")","v":""},"","","","","","","","","","","","","","","",""]
[{"$f":"Total!A298","v":0},{"$f":"IF($A299>0,Total!B298,\"\")","v":""},{"$f":"IF($A299>0,Total!C298,\"\")","v":""},{"$f":"IF($A299>0,Total!D298,\"\")","v":""},"","","","","","","","","","","","","","","",""]
[{"$f":"Total!A299","v":0},{"$f":"IF($A300>0,Total!B299,\"\")","v":""},{"$f":"IF($A300>0,Total!C299,\"\")","v":""},{"$f":"IF($A300>0,Total!D299,\"\")","v":""},"","","","","","","","","","","","","","","",""]
[{"$f":"Total!A300","v":0},{"$f":"IF($A301>0,Total!B300,\"\")","v":""},{"$f":"IF($A301>0,Total!C300,\"\")","v":""},{"$f":"IF($A301>0,Total!D300,\"\")","v":""},"","","","","","","","","","","","","","","",""]
[{"$f":"Total!A301","v":0},{"$f":"IF($A302>0,Total!B301,\"\")","v":""},{"$f":"IF($A302>0,Total!C301,\"\")","v":""},{"$f":"IF($A302>0,Total!D301,\"\")","v":""},"","","","","","","","","","","","","","","",""]
[{"$f":"Total!A302","v":0},{"$f":"IF($A303>0,Total!B302,\"\")","v":""},{"$f":"IF($A303>0,Total!C302,\"\")","v":""},{"$f":"IF($A303>0,Total!D302,\"\")","v":""},"","","","","","","","","","","","","","","",{"$f":"IF(D302<>\"\",COUNT(E302:S302),\"\")","v":""}]
[{"$f":"Total!A303","v":0},{"$f":"IF($A304>0,Total!B303,\"\")","v":""},{"$f":"IF($A304>0,Total!C303,\"\")","v":""},{"$f":"IF($A304>0,Total!D303,\"\")","v":""},"","","","","","","","","","","","","","","",{"$f":"IF(D303<>\"\",COUNT(E303:S303),\"\")","v":""}]
[{"$f":"Total!A304","v":0},{"$f":"IF($A305>0,Total!B304,\"\")","v":""},{"$f":"IF($A305>0,Total!C304,\"\")","v":""},{"$f":"IF($A305>0,Total!D304,\"\")","v":""},"","","","","","","","","","","","","","","",""]
[{"$f":"Total!A305","v":0},{"$f":"IF($A306>0,Total!B305,\"\")","v":""},{"$f":"IF($A306>0,Total!C305,\"\")","v":""},{"$f":"IF($A306>0,Total!D305,\"\")","v":""},"","","","","","","","","","","","","","","",""]
[{"$f":"Total!A306","v":0},{"$f":"IF($A307>0,Total!B306,\"\")","v":""},{"$f":"IF($A307>0,Total!C306,\"\")","v":""},{"$f":"IF($A307>0,Total!D306,\"\")","v":""},"","","","","","","","","","","","","","","",""]
[{"$f":"Total!A307","v":0},{"$f":"IF($A308>0,Total!B307,\"\")","v":""},{"$f":"IF($A308>0,Total!C307,\"\")","v":""},{"$f":"IF($A308>0,Total!D307,\"\")","v":""},{"$f":"IFERROR(MATCH($D307,INDIRECT(\"'\"&E$2&\"'!D:D\"),0),\"\")","v":""},"","","","","","","","","","","","","","",""]
[{"$f":"Total!A308","v":0},{"$f":"IF($A309>0,Total!B308,\"\")","v":""},{"$f":"IF($A309>0,Total!C308,\"\")","v":""},{"$f":"IF($A309>0,Total!D308,\"\")","v":""},"","","","","","","","","","","","","","","",""]
[{"$f":"Total!A309","v":0},{"$f":"IF($A310>0,Total!B309,\"\")","v":""},{"$f":"IF($A310>0,Total!C309,\"\")","v":""},{"$f":"IF($A310>0,Total!D309,\"\")","v":""},"","","","","","","","","","","","","","","",""]
[{"$f":"Total!A310","v":0},{"$f":"IF($A311>0,Total!B310,\"\")","v":""},{"$f":"IF($A311>0,Total!C310,\"\")","v":""},{"$f":"IF($A311>0,Total!D310,\"\")","v":""},"","","","","","","","","","","","","","","",""]
[{"$f":"Total!A311","v":0},{"$f":"IF($A312>0,Total!B311,\"\")","v":""},{"$f":"IF($A312>0,Total!C311,\"\")","v":""},{"$f":"IF($A312>0,Total!D311,\"\")","v":""},"","","","","","","","","","","","","","","",""]
[{"$f":"Total!A312","v":0},{"$f":"IF($A313>0,Total!B312,\"\")","v":""},{"$f":"IF($A313>0,Total!C312,\"\")","v":""},{"$f":"IF($A313>0,Total!D312,\"\")","v":""},"","","","","","","","","","","","","","","",""]
[null,{"$f":"IF($A314>0,Total!B313,\"\")","v":""},{"$f":"IF($A314>0,Total!C313,\"\")","v":""},{"$f":"IF($A314>0,Total!D313,\"\")","v":""},"","","","","","","","","","","","","","","",""]