{"text_format":"1","workbook":"xlsx","n_sheets":2,"sheets":["BdD","EDIT"],"not_rendered":{"charts":0,"images":0,"macros":0,"external_links":0,"defined_names":1,"comments":0,"pivot_tables":0},"unopened":[],"bounds":{"document_bytes":16777216,"sheet_cells":100000,"rows_first":2000,"rows_last":500,"rows_between":2000,"halvings":0,"cell_chars":16384,"cell_head_chars":4096},"cells_cut":0,"cells_raw":0,"read":"whole","date_system":"1900"}

{"sheet":"BdD","index":0,"n_rows":65,"n_cols":12,"rows_kept":65,"cut":false,"hidden":false,"merged":[]}
["Nom","Info_1","Info_2","Info_3","Info_4","Info_5","Info_6","Info_7","Info_8",null,"Codage","Liste ref"]
["Marcel","Limoges","Blanc","Charente","Juillet","Q","Séquoïa","AA_43",43,null,{"$f":"IF(EDIT!$A$1=\"\",\"\",IF(EDIT!$A$1=A2,MAX($K$1:K1)+1,\"\"))","v":""},"Roger"]
["Paul","Montpellier","Marron","Calvados","Mai","O","Tremble","AA_47",63,null,{"$f":"IF(EDIT!$A$1=\"\",\"\",IF(EDIT!$A$1=A3,MAX($K$1:K2)+1,\"\"))","v":""},"Paul"]
["Paul","Marseille","Azur","Aube","Août","l","Peuplier","AA_34",1,null,{"$f":"IF(EDIT!$A$1=\"\",\"\",IF(EDIT!$A$1=A4,MAX($K$1:K3)+1,\"\"))","v":""},"Marcel"]
["Gilles","Bézier","Indigo","Aube","Mai","G","Pin","AA_64",42,null,{"$f":"IF(EDIT!$A$1=\"\",\"\",IF(EDIT!$A$1=A5,MAX($K$1:K4)+1,\"\"))","v":""},"André"]
["Lucas","Nice","Chrome","Ain","Décembre","W","If","AA_06",4,null,{"$f":"IF(EDIT!$A$1=\"\",\"\",IF(EDIT!$A$1=A6,MAX($K$1:K5)+1,\"\"))","v":""},"Kevin"]
["Roger","Paris","Beige","Alpes De Haute Provence","Avril","D","Frêne","AA_10",56,null,{"$f":"IF(EDIT!$A$1=\"\",\"\",IF(EDIT!$A$1=A7,MAX($K$1:K6)+1,\"\"))","v":1},"Simone"]
["Marcel","Perpignan","Noir","Cantal","Février","X","Sycomore","AA_56",62,null,{"$f":"IF(EDIT!$A$1=\"\",\"\",IF(EDIT!$A$1=A8,MAX($K$1:K7)+1,\"\"))","v":""},"Léa"]
["André","Rennes","Bleu Ciel","Dordogne","Février","A","Chêne","AA_54",47,null,{"$f":"IF(EDIT!$A$1=\"\",\"\",IF(EDIT!$A$1=A9,MAX($K$1:K8)+1,\"\"))","v":""},"Lucas"]
["Paul","Angoulème","Brun","Ain","Mars","Y","Tuyas","AA_45",12,null,{"$f":"IF(EDIT!$A$1=\"\",\"\",IF(EDIT!$A$1=A10,MAX($K$1:K9)+1,\"\"))","v":""},"Eric"]
["Simone","Narbonne","Jaune","Charente Maritime","Août","P","Baobab","AA_39",52,null,{"$f":"IF(EDIT!$A$1=\"\",\"\",IF(EDIT!$A$1=A11,MAX($K$1:K10)+1,\"\"))","v":""},"Gilles"]
["Eric","Pau","Beige","Ardennes","Juillet","M","Erable","AA_53",36,null,{"$f":"IF(EDIT!$A$1=\"\",\"\",IF(EDIT!$A$1=A12,MAX($K$1:K11)+1,\"\"))","v":""}]
["Lucas","Soisson","Bleu Roi","Ariege","Janvier","H","Mélèze","AA_55",9,null,{"$f":"IF(EDIT!$A$1=\"\",\"\",IF(EDIT!$A$1=A13,MAX($K$1:K12)+1,\"\"))","v":""}]
["Eric","Paris","Indigo","Corse","Octobre","F","Sorbier","AA_48",30,null,{"$f":"IF(EDIT!$A$1=\"\",\"\",IF(EDIT!$A$1=A14,MAX($K$1:K13)+1,\"\"))","v":""}]
["Simone","Bézier","Cyan","Charente Maritime","Janvier","S","Palmier","AA_36",50,null,{"$f":"IF(EDIT!$A$1=\"\",\"\",IF(EDIT!$A$1=A15,MAX($K$1:K14)+1,\"\"))","v":""}]
["Kevin","Marseille","Noir","Aisne","Octobre","K","Olivier","AA_35",26,null,{"$f":"IF(EDIT!$A$1=\"\",\"\",IF(EDIT!$A$1=A16,MAX($K$1:K15)+1,\"\"))","v":""}]
["André","Lyon","Bleu Roi","Aude","Janvier","l","Peuplier","AA_11",34,null,{"$f":"IF(EDIT!$A$1=\"\",\"\",IF(EDIT!$A$1=A17,MAX($K$1:K16)+1,\"\"))","v":""}]
["Lucas","Chaumont","Bleu Ciel","Cher","Novembre","H","Mélèze","AA_07",54,null,{"$f":"IF(EDIT!$A$1=\"\",\"\",IF(EDIT!$A$1=A18,MAX($K$1:K17)+1,\"\"))","v":""}]
["Eric","Toulouse","Turquoise","Alpes Maritimes","Septembre","Y","Tuyas","AA_31",57,null,{"$f":"IF(EDIT!$A$1=\"\",\"\",IF(EDIT!$A$1=A19,MAX($K$1:K18)+1,\"\"))","v":""}]
["Lucas","Biarritz","Isabelle","Cantal","Octobre","O","Tremble","AA_27",23,null,{"$f":"IF(EDIT!$A$1=\"\",\"\",IF(EDIT!$A$1=A20,MAX($K$1:K19)+1,\"\"))","v":""}]
{"$rows_left_out":46}
{"sheet":"EDIT","index":1,"n_rows":50,"n_cols":9,"rows_kept":50,"cut":false,"hidden":false,"merged":[]}
["Roger","<<< Sélectionner le nom"]
["INFO_1","INFO_2","INFO_3","INFO_4","INFO_5","INFO_6","INFO_7","INFO_8"]
[{"$f":"IF(ROW()-2<=MAX(BdD!$K:$K),INDEX(BdD!B:B,MATCH(ROW()-2,BdD!$K:$K,0)),\"\")","v":"Paris"},{"$f":"IF(ROW()-2<=MAX(BdD!$K:$K),INDEX(BdD!C:C,MATCH(ROW()-2,BdD!$K:$K,0)),\"\")","v":"Beige"},{"$f":"IF(ROW()-2<=MAX(BdD!$K:$K),INDEX(BdD!D:D,MATCH(ROW()-2,BdD!$K:$K,0)),\"\")","v":"Alpes De Haute Provence"},{"$f":"IF(ROW()-2<=MAX(BdD!$K:$K),INDEX(BdD!E:E,MATCH(ROW()-2,BdD!$K:$K,0)),\"\")","v":"Avril"},{"$f":"IF(ROW()-2<=MAX(BdD!$K:$K),INDEX(BdD!F:F,MATCH(ROW()-2,BdD!$K:$K,0)),\"\")","v":"D"},{"$f":"IF(ROW()-2<=MAX(BdD!$K:$K),INDEX(BdD!G:G,MATCH(ROW()-2,BdD!$K:$K,0)),\"\")","v":"Frêne"},{"$f":"IF(ROW()-2<=MAX(BdD!$K:$K),INDEX(BdD!H:H,MATCH(ROW()-2,BdD!$K:$K,0)),\"\")","v":"AA_10"},{"$f":"IF(ROW()-2<=MAX(BdD!$K:$K),INDEX(BdD!I:I,MATCH(ROW()-2,BdD!$K:$K,0)),\"\")","v":56}]
[{"$f":"IF(ROW()-2<=MAX(BdD!$K:$K),INDEX(BdD!B:B,MATCH(ROW()-2,BdD!$K:$K,0)),\"\")","v":"Pau"},{"$f":"IF(ROW()-2<=MAX(BdD!$K:$K),INDEX(BdD!C:C,MATCH(ROW()-2,BdD!$K:$K,0)),\"\")","v":"Jaune"},{"$f":"IF(ROW()-2<=MAX(BdD!$K:$K),INDEX(BdD!D:D,MATCH(ROW()-2,BdD!$K:$K,0)),\"\")","v":"Bouches Du Rhone"},{"$f":"IF(ROW()-2<=MAX(BdD!$K:$K),INDEX(BdD!E:E,MATCH(ROW()-2,BdD!$K:$K,0)),\"\")","v":"Février"},{"$f":"IF(ROW()-2<=MAX(BdD!$K:$K),INDEX(BdD!F:F,MATCH(ROW()-2,BdD!$K:$K,0)),\"\")","v":"C"},{"$f":"IF(ROW()-2<=MAX(BdD!$K:$K),INDEX(BdD!G:G,MATCH(ROW()-2,BdD!$K:$K,0)),\"\")","v":"Bouleau"},{"$f":"IF(ROW()-2<=MAX(BdD!$K:$K),INDEX(BdD!H:H,MATCH(ROW()-2,BdD!$K:$K,0)),\"\")","v":"AA_58"},{"$f":"IF(ROW()-2<=MAX(BdD!$K:$K),INDEX(BdD!I:I,MATCH(ROW()-2,BdD!$K:$K,0)),\"\")","v":24}]
[{"$f":"IF(ROW()-2<=MAX(BdD!$K:$K),INDEX(BdD!B:B,MATCH(ROW()-2,BdD!$K:$K,0)),\"\")","v":"Nantes"},{"$f":"IF(ROW()-2<=MAX(BdD!$K:$K),INDEX(BdD!C:C,MATCH(ROW()-2,BdD!$K:$K,0)),\"\")","v":"Argent"},{"$f":"IF(ROW()-2<=MAX(BdD!$K:$K),INDEX(BdD!D:D,MATCH(ROW()-2,BdD!$K:$K,0)),\"\")","v":"Corse"},{"$f":"IF(ROW()-2<=MAX(BdD!$K:$K),INDEX(BdD!E:E,MATCH(ROW()-2,BdD!$K:$K,0)),\"\")","v":"Décembre"},{"$f":"IF(ROW()-2<=MAX(BdD!$K:$K),INDEX(BdD!F:F,MATCH(ROW()-2,BdD!$K:$K,0)),\"\")","v":"I"},{"$f":"IF(ROW()-2<=MAX(BdD!$K:$K),INDEX(BdD!G:G,MATCH(ROW()-2,BdD!$K:$K,0)),\"\")","v":"Epicéa"},{"$f":"IF(ROW()-2<=MAX(BdD!$K:$K),INDEX(BdD!H:H,MATCH(ROW()-2,BdD!$K:$K,0)),\"\")","v":"AA_62"},{"$f":"IF(ROW()-2<=MAX(BdD!$K:$K),INDEX(BdD!I:I,MATCH(ROW()-2,BdD!$K:$K,0)),\"\")","v":39}]
[{"$f":"IF(ROW()-2<=MAX(BdD!$K:$K),INDEX(BdD!B:B,MATCH(ROW()-2,BdD!$K:$K,0)),\"\")","v":"Toulouse"},{"$f":"IF(ROW()-2<=MAX(BdD!$K:$K),INDEX(BdD!C:C,MATCH(ROW()-2,BdD!$K:$K,0)),\"\")","v":"Saumon"},{"$f":"IF(ROW()-2<=MAX(BdD!$K:$K),INDEX(BdD!D:D,MATCH(ROW()-2,BdD!$K:$K,0)),\"\")","v":"Ardeche"},{"$f":"IF(ROW()-2<=MAX(BdD!$K:$K),INDEX(BdD!E:E,MATCH(ROW()-2,BdD!$K:$K,0)),\"\")","v":"Mars"},{"$f":"IF(ROW()-2<=MAX(BdD!$K:$K),INDEX(BdD!F:F,MATCH(ROW()-2,BdD!$K:$K,0)),\"\")","v":"A"},{"$f":"IF(ROW()-2<=MAX(BdD!$K:$K),INDEX(BdD!G:G,MATCH(ROW()-2,BdD!$K:$K,0)),\"\")","v":"Chêne"},{"$f":"IF(ROW()-2<=MAX(BdD!$K:$K),INDEX(BdD!H:H,MATCH(ROW()-2,BdD!$K:$K,0)),\"\")","v":"AA_51"},{"$f":"IF(ROW()-2<=MAX(BdD!$K:$K),INDEX(BdD!I:I,MATCH(ROW()-2,BdD!$K:$K,0)),\"\")","v":21},"Voir le codage en colonne K de BdD"]
[{"$f":"IF(ROW()-2<=MAX(BdD!$K:$K),INDEX(BdD!B:B,MATCH(ROW()-2,BdD!$K:$K,0)),\"\")","v":"Nantes"},{"$f":"IF(ROW()-2<=MAX(BdD!$K:$K),INDEX(BdD!C:C,MATCH(ROW()-2,BdD!$K:$K,0)),\"\")","v":"Magenta"},{"$f":"IF(ROW()-2<=MAX(BdD!$K:$K),INDEX(BdD!D:D,MATCH(ROW()-2,BdD!$K:$K,0)),\"\")","v":"Aisne"},{"$f":"IF(ROW()-2<=MAX(BdD!$K:$K),INDEX(BdD!E:E,MATCH(ROW()-2,BdD!$K:$K,0)),\"\")","v":"Avril"},{"$f":"IF(ROW()-2<=MAX(BdD!$K:$K),INDEX(BdD!F:F,MATCH(ROW()-2,BdD!$K:$K,0)),\"\")","v":"I"},{"$f":"IF(ROW()-2<=MAX(BdD!$K:$K),INDEX(BdD!G:G,MATCH(ROW()-2,BdD!$K:$K,0)),\"\")","v":"Epicéa"},{"$f":"IF(ROW()-2<=MAX(BdD!$K:$K),INDEX(BdD!H:H,MATCH(ROW()-2,BdD!$K:$K,0)),\"\")","v":"AA_26"},{"$f":"IF(ROW()-2<=MAX(BdD!$K:$K),INDEX(BdD!I:I,MATCH(ROW()-2,BdD!$K:$K,0)),\"\")","v":33},"La liste de ref est nommée Ref pour validation en A1"]
[{"$f":"IF(ROW()-2<=MAX(BdD!$K:$K),INDEX(BdD!B:B,MATCH(ROW()-2,BdD!$K:$K,0)),\"\")","v":"Grasse"},{"$f":"IF(ROW()-2<=MAX(BdD!$K:$K),INDEX(BdD!C:C,MATCH(ROW()-2,BdD!$K:$K,0)),\"\")","v":"Noir"},{"$f":"IF(ROW()-2<=MAX(BdD!$K:$K),INDEX(BdD!D:D,MATCH(ROW()-2,BdD!$K:$K,0)),\"\")","v":"Cher"},{"$f":"IF(ROW()-2<=MAX(BdD!$K:$K),INDEX(BdD!E:E,MATCH(ROW()-2,BdD!$K:$K,0)),\"\")","v":"Avril"},{"$f":"IF(ROW()-2<=MAX(BdD!$K:$K),INDEX(BdD!F:F,MATCH(ROW()-2,BdD!$K:$K,0)),\"\")","v":"C"},{"$f":"IF(ROW()-2<=MAX(BdD!$K:$K),INDEX(BdD!G:G,MATCH(ROW()-2,BdD!$K:$K,0)),\"\")","v":"Bouleau"},{"$f":"IF(ROW()-2<=MAX(BdD!$K:$K),INDEX(BdD!H:H,MATCH(ROW()-2,BdD!$K:$K,0)),\"\")","v":"AA_16"},{"$f":"IF(ROW()-2<=MAX(BdD!$K:$K),INDEX(BdD!I:I,MATCH(ROW()-2,BdD!$K:$K,0)),\"\")","v":8}]
[{"$f":"IF(ROW()-2<=MAX(BdD!$K:$K),INDEX(BdD!B:B,MATCH(ROW()-2,BdD!$K:$K,0)),\"\")","v":"Toulouse"},{"$f":"IF(ROW()-2<=MAX(BdD!$K:$K),INDEX(BdD!C:C,MATCH(ROW()-2,BdD!$K:$K,0)),\"\")","v":"Isabelle"},{"$f":"IF(ROW()-2<=MAX(BdD!$K:$K),INDEX(BdD!D:D,MATCH(ROW()-2,BdD!$K:$K,0)),\"\")","v":"Alpes De Haute Provence"},{"$f":"IF(ROW()-2<=MAX(BdD!$K:$K),INDEX(BdD!E:E,MATCH(ROW()-2,BdD!$K:$K,0)),\"\")","v":"Août"},{"$f":"IF(ROW()-2<=MAX(BdD!$K:$K),INDEX(BdD!F:F,MATCH(ROW()-2,BdD!$K:$K,0)),\"\")","v":"F"},{"$f":"IF(ROW()-2<=MAX(BdD!$K:$K),INDEX(BdD!G:G,MATCH(ROW()-2,BdD!$K:$K,0)),\"\")","v":"Sorbier"},{"$f":"IF(ROW()-2<=MAX(BdD!$K:$K),INDEX(BdD!H:H,MATCH(ROW()-2,BdD!$K:$K,0)),\"\")","v":"AA_59"},{"$f":"IF(ROW()-2<=MAX(BdD!$K:$K),INDEX(BdD!I:I,MATCH(ROW()-2,BdD!$K:$K,0)),\"\")","v":13}]
[{"$f":"IF(ROW()-2<=MAX(BdD!$K:$K),INDEX(BdD!B:B,MATCH(ROW()-2,BdD!$K:$K,0)),\"\")","v":""},{"$f":"IF(ROW()-2<=MAX(BdD!$K:$K),INDEX(BdD!C:C,MATCH(ROW()-2,BdD!$K:$K,0)),\"\")","v":""},{"$f":"IF(ROW()-2<=MAX(BdD!$K:$K),INDEX(BdD!D:D,MATCH(ROW()-2,BdD!$K:$K,0)),\"\")","v":""},{"$f":"IF(ROW()-2<=MAX(BdD!$K:$K),INDEX(BdD!E:E,MATCH(ROW()-2,BdD!$K:$K,0)),\"\")","v":""},{"$f":"IF(ROW()-2<=MAX(BdD!$K:$K),INDEX(BdD!F:F,MATCH(ROW()-2,BdD!$K:$K,0)),\"\")","v":""},{"$f":"IF(ROW()-2<=MAX(BdD!$K:$K),INDEX(BdD!G:G,MATCH(ROW()-2,BdD!$K:$K,0)),\"\")","v":""},{"$f":"IF(ROW()-2<=MAX(BdD!$K:$K),INDEX(BdD!H:H,MATCH(ROW()-2,BdD!$K:$K,0)),\"\")","v":""},{"$f":"IF(ROW()-2<=MAX(BdD!$K:$K),INDEX(BdD!I:I,MATCH(ROW()-2,BdD!$K:$K,0)),\"\")","v":""}]
[{"$f":"IF(ROW()-2<=MAX(BdD!$K:$K),INDEX(BdD!B:B,MATCH(ROW()-2,BdD!$K:$K,0)),\"\")","v":""},{"$f":"IF(ROW()-2<=MAX(BdD!$K:$K),INDEX(BdD!C:C,MATCH(ROW()-2,BdD!$K:$K,0)),\"\")","v":""},{"$f":"IF(ROW()-2<=MAX(BdD!$K:$K),INDEX(BdD!D:D,MATCH(ROW()-2,BdD!$K:$K,0)),\"\")","v":""},{"$f":"IF(ROW()-2<=MAX(BdD!$K:$K),INDEX(BdD!E:E,MATCH(ROW()-2,BdD!$K:$K,0)),\"\")","v":""},{"$f":"IF(ROW()-2<=MAX(BdD!$K:$K),INDEX(BdD!F:F,MATCH(ROW()-2,BdD!$K:$K,0)),\"\")","v":""},{"$f":"IF(ROW()-2<=MAX(BdD!$K:$K),INDEX(BdD!G:G,MATCH(ROW()-2,BdD!$K:$K,0)),\"\")","v":""},{"$f":"IF(ROW()-2<=MAX(BdD!$K:$K),INDEX(BdD!H:H,MATCH(ROW()-2,BdD!$K:$K,0)),\"\")","v":""},{"$f":"IF(ROW()-2<=MAX(BdD!$K:$K),INDEX(BdD!I:I,MATCH(ROW()-2,BdD!$K:$K,0)),\"\")","v":""}]
[{"$f":"IF(ROW()-2<=MAX(BdD!$K:$K),INDEX(BdD!B:B,MATCH(ROW()-2,BdD!$K:$K,0)),\"\")","v":""},{"$f":"IF(ROW()-2<=MAX(BdD!$K:$K),INDEX(BdD!C:C,MATCH(ROW()-2,BdD!$K:$K,0)),\"\")","v":""},{"$f":"IF(ROW()-2<=MAX(BdD!$K:$K),INDEX(BdD!D:D,MATCH(ROW()-2,BdD!$K:$K,0)),\"\")","v":""},{"$f":"IF(ROW()-2<=MAX(BdD!$K:$K),INDEX(BdD!E:E,MATCH(ROW()-2,BdD!$K:$K,0)),\"\")","v":""},{"$f":"IF(ROW()-2<=MAX(BdD!$K:$K),INDEX(BdD!F:F,MATCH(ROW()-2,BdD!$K:$K,0)),\"\")","v":""},{"$f":"IF(ROW()-2<=MAX(BdD!$K:$K),INDEX(BdD!G:G,MATCH(ROW()-2,BdD!$K:$K,0)),\"\")","v":""},{"$f":"IF(ROW()-2<=MAX(BdD!$K:$K),INDEX(BdD!H:H,MATCH(ROW()-2,BdD!$K:$K,0)),\"\")","v":""},{"$f":"IF(ROW()-2<=MAX(BdD!$K:$K),INDEX(BdD!I:I,MATCH(ROW()-2,BdD!$K:$K,0)),\"\")","v":""}]
[{"$f":"IF(ROW()-2<=MAX(BdD!$K:$K),INDEX(BdD!B:B,MATCH(ROW()-2,BdD!$K:$K,0)),\"\")","v":""},{"$f":"IF(ROW()-2<=MAX(BdD!$K:$K),INDEX(BdD!C:C,MATCH(ROW()-2,BdD!$K:$K,0)),\"\")","v":""},{"$f":"IF(ROW()-2<=MAX(BdD!$K:$K),INDEX(BdD!D:D,MATCH(ROW()-2,BdD!$K:$K,0)),\"\")","v":""},{"$f":"IF(ROW()-2<=MAX(BdD!$K:$K),INDEX(BdD!E:E,MATCH(ROW()-2,BdD!$K:$K,0)),\"\")","v":""},{"$f":"IF(ROW()-2<=MAX(BdD!$K:$K),INDEX(BdD!F:F,MATCH(ROW()-2,BdD!$K:$K,0)),\"\")","v":""},{"$f":"IF(ROW()-2<=MAX(BdD!$K:$K),INDEX(BdD!G:G,MATCH(ROW()-2,BdD!$K:$K,0)),\"\")","v":""},{"$f":"IF(ROW()-2<=MAX(BdD!$K:$K),INDEX(BdD!H:H,MATCH(ROW()-2,BdD!$K:$K,0)),\"\")","v":""},{"$f":"IF(ROW()-2<=MAX(BdD!$K:$K),INDEX(BdD!I:I,MATCH(ROW()-2,BdD!$K:$K,0)),\"\")","v":""}]
[{"$f":"IF(ROW()-2<=MAX(BdD!$K:$K),INDEX(BdD!B:B,MATCH(ROW()-2,BdD!$K:$K,0)),\"\")","v":""},{"$f":"IF(ROW()-2<=MAX(BdD!$K:$K),INDEX(BdD!C:C,MATCH(ROW()-2,BdD!$K:$K,0)),\"\")","v":""},{"$f":"IF(ROW()-2<=MAX(BdD!$K:$K),INDEX(BdD!D:D,MATCH(ROW()-2,BdD!$K:$K,0)),\"\")","v":""},{"$f":"IF(ROW()-2<=MAX(BdD!$K:$K),INDEX(BdD!E:E,MATCH(ROW()-2,BdD!$K:$K,0)),\"\")","v":""},{"$f":"IF(ROW()-2<=MAX(BdD!$K:$K),INDEX(BdD!F:F,MATCH(ROW()-2,BdD!$K:$K,0)),\"\")","v":""},{"$f":"IF(ROW()-2<=MAX(BdD!$K:$K),INDEX(BdD!G:G,MATCH(ROW()-2,BdD!$K:$K,0)),\"\")","v":""},{"$f":"IF(ROW()-2<=MAX(BdD!$K:$K),INDEX(BdD!H:H,MATCH(ROW()-2,BdD!$K:$K,0)),\"\")","v":""},{"$f":"IF(ROW()-2<=MAX(BdD!$K:$K),INDEX(BdD!I:I,MATCH(ROW()-2,BdD!$K:$K,0)),\"\")","v":""}]
[{"$f":"IF(ROW()-2<=MAX(BdD!$K:$K),INDEX(BdD!B:B,MATCH(ROW()-2,BdD!$K:$K,0)),\"\")","v":""},{"$f":"IF(ROW()-2<=MAX(BdD!$K:$K),INDEX(BdD!C:C,MATCH(ROW()-2,BdD!$K:$K,0)),\"\")","v":""},{"$f":"IF(ROW()-2<=MAX(BdD!$K:$K),INDEX(BdD!D:D,MATCH(ROW()-2,BdD!$K:$K,0)),\"\")","v":""},{"$f":"IF(ROW()-2<=MAX(BdD!$K:$K),INDEX(BdD!E:E,MATCH(ROW()-2,BdD!$K:$K,0)),\"\")","v":""},{"$f":"IF(ROW()-2<=MAX(BdD!$K:$K),INDEX(BdD!F:F,MATCH(ROW()-2,BdD!$K:$K,0)),\"\")","v":""},{"$f":"IF(ROW()-2<=MAX(BdD!$K:$K),INDEX(BdD!G:G,MATCH(ROW()-2,BdD!$K:$K,0)),\"\")","v":""},{"$f":"IF(ROW()-2<=MAX(BdD!$K:$K),INDEX(BdD!H:H,MATCH(ROW()-2,BdD!$K:$K,0)),\"\")","v":""},{"$f":"IF(ROW()-2<=MAX(BdD!$K:$K),INDEX(BdD!I:I,MATCH(ROW()-2,BdD!$K:$K,0)),\"\")","v":""}]
[{"$f":"IF(ROW()-2<=MAX(BdD!$K:$K),INDEX(BdD!B:B,MATCH(ROW()-2,BdD!$K:$K,0)),\"\")","v":""},{"$f":"IF(ROW()-2<=MAX(BdD!$K:$K),INDEX(BdD!C:C,MATCH(ROW()-2,BdD!$K:$K,0)),\"\")","v":""},{"$f":"IF(ROW()-2<=MAX(BdD!$K:$K),INDEX(BdD!D:D,MATCH(ROW()-2,BdD!$K:$K,0)),\"\")","v":""},{"$f":"IF(ROW()-2<=MAX(BdD!$K:$K),INDEX(BdD!E:E,MATCH(ROW()-2,BdD!$K:$K,0)),\"\")","v":""},{"$f":"IF(ROW()-2<=MAX(BdD!$K:$K),INDEX(BdD!F:F,MATCH(ROW()-2,BdD!$K:$K,0)),\"\")","v":""},{"$f":"IF(ROW()-2<=MAX(BdD!$K:$K),INDEX(BdD!G:G,MATCH(ROW()-2,BdD!$K:$K,0)),\"\")","v":""},{"$f":"IF(ROW()-2<=MAX(BdD!$K:$K),INDEX(BdD!H:H,MATCH(ROW()-2,BdD!$K:$K,0)),\"\")","v":""},{"$f":"IF(ROW()-2<=MAX(BdD!$K:$K),INDEX(BdD!I:I,MATCH(ROW()-2,BdD!$K:$K,0)),\"\")","v":""}]
[{"$f":"IF(ROW()-2<=MAX(BdD!$K:$K),INDEX(BdD!B:B,MATCH(ROW()-2,BdD!$K:$K,0)),\"\")","v":""},{"$f":"IF(ROW()-2<=MAX(BdD!$K:$K),INDEX(BdD!C:C,MATCH(ROW()-2,BdD!$K:$K,0)),\"\")","v":""},{"$f":"IF(ROW()-2<=MAX(BdD!$K:$K),INDEX(BdD!D:D,MATCH(ROW()-2,BdD!$K:$K,0)),\"\")","v":""},{"$f":"IF(ROW()-2<=MAX(BdD!$K:$K),INDEX(BdD!E:E,MATCH(ROW()-2,BdD!$K:$K,0)),\"\")","v":""},{"$f":"IF(ROW()-2<=MAX(BdD!$K:$K),INDEX(BdD!F:F,MATCH(ROW()-2,BdD!$K:$K,0)),\"\")","v":""},{"$f":"IF(ROW()-2<=MAX(BdD!$K:$K),INDEX(BdD!G:G,MATCH(ROW()-2,BdD!$K:$K,0)),\"\")","v":""},{"$f":"IF(ROW()-2<=MAX(BdD!$K:$K),INDEX(BdD!H:H,MATCH(ROW()-2,BdD!$K:$K,0)),\"\")","v":""},{"$f":"IF(ROW()-2<=MAX(BdD!$K:$K),INDEX(BdD!I:I,MATCH(ROW()-2,BdD!$K:$K,0)),\"\")","v":""}]
[{"$f":"IF(ROW()-2<=MAX(BdD!$K:$K),INDEX(BdD!B:B,MATCH(ROW()-2,BdD!$K:$K,0)),\"\")","v":""},{"$f":"IF(ROW()-2<=MAX(BdD!$K:$K),INDEX(BdD!C:C,MATCH(ROW()-2,BdD!$K:$K,0)),\"\")","v":""},{"$f":"IF(ROW()-2<=MAX(BdD!$K:$K),INDEX(BdD!D:D,MATCH(ROW()-2,BdD!$K:$K,0)),\"\")","v":""},{"$f":"IF(ROW()-2<=MAX(BdD!$K:$K),INDEX(BdD!E:E,MATCH(ROW()-2,BdD!$K:$K,0)),\"\")","v":""},{"$f":"IF(ROW()-2<=MAX(BdD!$K:$K),INDEX(BdD!F:F,MATCH(ROW()-2,BdD!$K:$K,0)),\"\")","v":""},{"$f":"IF(ROW()-2<=MAX(BdD!$K:$K),INDEX(BdD!G:G,MATCH(ROW()-2,BdD!$K:$K,0)),\"\")","v":""},{"$f":"IF(ROW()-2<=MAX(BdD!$K:$K),INDEX(BdD!H:H,MATCH(ROW()-2,BdD!$K:$K,0)),\"\")","v":""},{"$f":"IF(ROW()-2<=MAX(BdD!$K:$K),INDEX(BdD!I:I,MATCH(ROW()-2,BdD!$K:$K,0)),\"\")","v":""}]
[{"$f":"IF(ROW()-2<=MAX(BdD!$K:$K),INDEX(BdD!B:B,MATCH(ROW()-2,BdD!$K:$K,0)),\"\")","v":""},{"$f":"IF(ROW()-2<=MAX(BdD!$K:$K),INDEX(BdD!C:C,MATCH(ROW()-2,BdD!$K:$K,0)),\"\")","v":""},{"$f":"IF(ROW()-2<=MAX(BdD!$K:$K),INDEX(BdD!D:D,MATCH(ROW()-2,BdD!$K:$K,0)),\"\")","v":""},{"$f":"IF(ROW()-2<=MAX(BdD!$K:$K),INDEX(BdD!E:E,MATCH(ROW()-2,BdD!$K:$K,0)),\"\")","v":""},{"$f":"IF(ROW()-2<=MAX(BdD!$K:$K),INDEX(BdD!F:F,MATCH(ROW()-2,BdD!$K:$K,0)),\"\")","v":""},{"$f":"IF(ROW()-2<=MAX(BdD!$K:$K),INDEX(BdD!G:G,MATCH(ROW()-2,BdD!$K:$K,0)),\"\")","v":""},{"$f":"IF(ROW()-2<=MAX(BdD!$K:$K),INDEX(BdD!H:H,MATCH(ROW()-2,BdD!$K:$K,0)),\"\")","v":""},{"$f":"IF(ROW()-2<=MAX(BdD!$K:$K),INDEX(BdD!I:I,MATCH(ROW()-2,BdD!$K:$K,0)),\"\")","v":""}]
[{"$f":"IF(ROW()-2<=MAX(BdD!$K:$K),INDEX(BdD!B:B,MATCH(ROW()-2,BdD!$K:$K,0)),\"\")","v":""},{"$f":"IF(ROW()-2<=MAX(BdD!$K:$K),INDEX(BdD!C:C,MATCH(ROW()-2,BdD!$K:$K,0)),\"\")","v":""},{"$f":"IF(ROW()-2<=MAX(BdD!$K:$K),INDEX(BdD!D:D,MATCH(ROW()-2,BdD!$K:$K,0)),\"\")","v":""},{"$f":"IF(ROW()-2<=MAX(BdD!$K:$K),INDEX(BdD!E:E,MATCH(ROW()-2,BdD!$K:$K,0)),\"\")","v":""},{"$f":"IF(ROW()-2<=MAX(BdD!$K:$K),INDEX(BdD!F:F,MATCH(ROW()-2,BdD!$K:$K,0)),\"\")","v":""},{"$f":"IF(ROW()-2<=MAX(BdD!$K:$K),INDEX(BdD!G:G,MATCH(ROW()-2,BdD!$K:$K,0)),\"\")","v":""},{"$f":"IF(ROW()-2<=MAX(BdD!$K:$K),INDEX(BdD!H:H,MATCH(ROW()-2,BdD!$K:$K,0)),\"\")","v":""},{"$f":"IF(ROW()-2<=MAX(BdD!$K:$K),INDEX(BdD!I:I,MATCH(ROW()-2,BdD!$K:$K,0)),\"\")","v":""}]
{"$rows_left_out":30}