{"text_format":"1","workbook":"xlsx","n_sheets":3,"sheets":["S49","S50","S51"],"not_rendered":{"charts":0,"images":0,"macros":1,"external_links":0,"defined_names":12,"comments":0,"pivot_tables":0},"unopened":[],"bounds":{"document_bytes":16777216,"sheet_cells":100000,"rows_first":2000,"rows_last":500,"rows_between":2000,"halvings":0,"cell_chars":16384,"cell_head_chars":4096},"cells_cut":0,"cells_raw":0,"read":"whole","date_system":"1900"}

{"sheet":"S49","index":0,"n_rows":105,"n_cols":133,"rows_kept":105,"cut":false,"hidden":false,"merged":[[9,128,9,129],[9,131,9,132],[9,110,9,111],[9,113,9,114],[9,116,9,117],[9,119,9,120],[9,122,9,123],[9,125,9,126],[9,92,9,93],[9,95,9,96],[9,98,9,99],[9,101,9,102],[9,104,9,105],[9,107,9,108],[9,74,9,75],[9,77,9,78],[9,80,9,81],[9,83,9,84],[9,86,9,87],[9,89,9,90],[9,56,9,57],[9,59,9,60],[9,62,9,63],[9,65,9,66],[9,68,9,69],[9,71,9,72],[9,38,9,39],[9,41,9,42],[9,44,9,45],[9,47,9,48],[9,50,9,51],[9,53,9,54],[8,109,8,120],[8,121,8,132],[9,14,9,15],[9,17,9,18],[9,20,9,21],[9,23,9,24],[9,26,9,27],[9,29,9,30],[9,32,9,33],[9,35,9,36],[8,37,8,48],[8,49,8,60],[8,61,8,72],[8,73,8,84],[8,85,8,96],[8,97,8,108],[7,119,7,120],[7,122,7,123],[7,125,7,126],[7,128,7,129],[7,131,7,132],[8,0,9,0],[8,1,9,1],[8,2,9,2],[8,13,8,24],[8,25,8,36],[7,101,7,102],[7,104,7,105],[7,107,7,108],[7,110,7,111],[7,113,7,114],[7,116,7,117],[7,83,7,84],[7,86,7,87],[7,89,7,90],[7,92,7,93],[7,95,7,96],[7,98,7,99],[7,65,7,66],[7,68,7,69],[7,71,7,72],[7,74,7,75],[7,77,7,78],[7,80,7,81],[7,47,7,48],[7,50,7,51],[7,53,7,54],[7,56,7,57],[7,59,7,60],[7,62,7,63],[7,29,7,30],[7,32,7,33],[7,35,7,36],[7,38,7,39],[7,41,7,42],[7,44,7,45],[6,122,6,123],[6,125,6,126],[6,128,6,129],[6,131,6,132],[7,3,7,12],[7,14,7,15],[7,17,7,18],[7,20,7,21],[7,23,7,24],[7,26,7,27],[6,104,6,105],[6,107,6,108],[6,110,6,111],[6,113,6,114],[6,116,6,117],[6,119,6,120],[6,86,6,87],[6,89,6,90],[6,92,6,93],[6,95,6,96],[6,98,6,99],[6,101,6,102],[6,68,6,69],[6,71,6,72],[6,74,6,75],[6,77,6,78],[6,80,6,81],[6,83,6,84],[6,50,6,51],[6,53,6,54],[6,56,6,57],[6,59,6,60],[6,62,6,63],[6,65,6,66],[6,32,6,33],[6,35,6,36],[6,38,6,39],[6,41,6,42],[6,44,6,45],[6,47,6,48],[5,122,5,123],[5,125,5,126],[5,128,5,129],[5,131,5,132],[6,14,6,15],[6,17,6,18],[6,20,6,21],[6,23,6,24],[6,26,6,27],[6,29,6,30],[5,104,5,105],[5,107,5,108],[5,110,5,111],[5,113,5,114],[5,116,5,117],[5,119,5,120],[5,86,5,87],[5,89,5,90],[5,92,5,93],[5,95,5,96],[5,98,5,99],[5,101,5,102],[5,68,5,69],[5,71,5,72],[5,74,5,75],[5,77,5,78],[5,80,5,81],[5,83,5,84],[5,50,5,51],[5,53,5,54],[5,56,5,57],[5,59,5,60],[5,62,5,63],[5,65,5,66],[5,32,5,33],[5,35,5,36],[5,38,5,39],[5,41,5,42],[5,44,5,45],[5,47,5,48],[5,14,5,15],[5,17,5,18],[5,20,5,21],[5,23,5,24],[5,26,5,27],[5,29,5,30],[4,116,4,117],[4,119,4,120],[4,122,4,123],[4,125,4,126],[4,128,4,129],[4,131,4,132],[4,98,4,99],[4,101,4,102],[4,104,4,105],[4,107,4,108],[4,110,4,111],[4,113,4,114],[4,80,4,81],[4,83,4,84],[4,86,4,87],[4,89,4,90],[4,92,4,93],[4,95,4,96],[4,62,4,63],[4,65,4,66],[4,68,4,69],[4,71,4,72],[4,74,4,75],[4,77,4,78],[4,44,4,45],[4,47,4,48],[4,50,4,51],[4,53,4,54],[4,56,4,57],[4,59,4,60],[4,26,4,27],[4,29,4,30],[4,32,4,33],[4,35,4,36],[4,38,4,39],[4,41,4,42],[2,109,2,111],[2,112,2,120],[2,121,2,123],[2,124,2,132],[4,0,5,1],[4,2,5,2],[4,14,4,15],[4,17,4,18],[4,20,4,21],[4,23,4,24],[2,73,2,75],[2,76,2,84],[2,85,2,87],[2,88,2,96],[2,97,2,99],[2,100,2,108],[2,37,2,39],[2,40,2,48],[2,49,2,51],[2,52,2,60],[2,61,2,63],[2,64,2,72],[2,1,3,1],[2,2,3,3],[2,13,2,15],[2,16,2,24],[2,25,2,27],[2,28,2,36]]}
["http://forum.excel-pratique.com/excel/planning-production-tri-complexe-t58192.html"]
[]
[null,"ANNEE",2014,null,null,null,null,null,null,null,null,null,null,"SEMAINE EN COURS",null,null,"SEMAINES A VENIR",null,null,null,null,null,null,null,null,"SEMAINE EN COURS",null,null,"SEMAINES A VENIR",null,null,null,null,null,null,null,null,"SEMAINE EN COURS",null,null,"SEMAINES A VENIR",null,null,null,null,null,null,null,null,"SEMAINE EN COURS",null,null,"SEMAINES A VENIR",null,null,null,null,null,null,null,null,"SEMAINE EN COURS",null,null,"SEMAINES A VENIR",null,null,null,null,null,null,null,null,"SEMAINE EN COURS",null,null,"SEMAINES A VENIR",null,null,null,null,null,null,null,null,"SEMAINE EN COURS",null,null,"SEMAINES A VENIR",null,null,null,null,null,null,null,null,"SEMAINE EN COURS",null,null,"SEMAINES A VENIR",null,null,null,null,null,null,null,null,"SEMAINE EN COURS",null,null,"SEMAINES A VENIR",null,null,null,null,null,null,null,null,"SEMAINE EN COURS",null,null,"SEMAINES A VENIR"]
[null,null,null,null,null,null,null,null,null,null,null,null,null,"Semaine n°",{"$f":"$C$5","v":49},null,"Semaine n°",{"$f":"$C$5+1","v":50},null,"Semaine n°",{"$f":"$C$5+2","v":51},null,"Semaine n°",{"$f":"$C$5+3","v":52},null,"Semaine n°",{"$f":"$C$5","v":49},null,"Semaine n°",{"$f":"$C$5+1","v":50},null,"Semaine n°",{"$f":"$C$5+2","v":51},null,"Semaine n°",{"$f":"$C$5+3","v":52},null,"Semaine n°",{"$f":"$C$5","v":49},null,"Semaine n°",{"$f":"$C$5+1","v":50},null,"Semaine n°",{"$f":"$C$5+2","v":51},null,"Semaine n°",{"$f":"$C$5+3","v":52},null,"Semaine n°",{"$f":"$C$5","v":49},null,"Semaine n°",{"$f":"$C$5+1","v":50},null,"Semaine n°",{"$f":"$C$5+2","v":51},null,"Semaine n°",{"$f":"$C$5+3","v":52},null,"Semaine n°",{"$f":"$C$5","v":49},null,"Semaine n°",{"$f":"$C$5+1","v":50},null,"Semaine n°",{"$f":"$C$5+2","v":51},null,"Semaine n°",{"$f":"$C$5+3","v":52},null,"Semaine n°",{"$f":"$C$5","v":49},null,"Semaine n°",{"$f":"$C$5+1","v":50},null,"Semaine n°",{"$f":"$C$5+2","v":51},null,"Semaine n°",{"$f":"$C$5+3","v":52},null,"Semaine n°",{"$f":"$C$5","v":49},null,"Semaine n°",{"$f":"$C$5+1","v":50},null,"Semaine n°",{"$f":"$C$5+2","v":51},null,"Semaine n°",{"$f":"$C$5+3","v":52},null,"Semaine n°",{"$f":"$C$5","v":49},null,"Semaine n°",{"$f":"$C$5+1","v":50},null,"Semaine n°",{"$f":"$C$5+2","v":51},null,"Semaine n°",{"$f":"$C$5+3","v":52},null,"Semaine n°",{"$f":"$C$5","v":49},null,"Semaine n°",{"$f":"$C$5+1","v":50},null,"Semaine n°",{"$f":"$C$5+2","v":51},null,"Semaine n°",{"$f":"$C$5+3","v":52},null,"Semaine n°",{"$f":"$C$5","v":49},null,"Semaine n°",{"$f":"$C$5+1","v":50},null,"Semaine n°",{"$f":"$C$5+2","v":51},null,"Semaine n°",{"$f":"$C$5+3","v":52}]
["Planning prévisionnel - Semaine n°",null,49,null,null,null,null,null,null,null,"Congés",null,null,null,null,null,null,null,null,null,null,null,"Lu+ Ma+ Me+ Ve",4]
[null,null,null,null,null,null,null,null,null,null,"Fériés",null,null,null,null,null,null,null,null,null,null,null,"Jeudi",1]
[null,null,null,null,null,null,null,null,null,null,"Divers"]
[null,"PREVISION PAR SEMAINE",null,"Projeteurs",null,null,null,null,null,null,null,null,null,"Nombre de jours =",{"$f":"SUM(P10:P105)+O7+O5","v":3.5},null,"Nombre de jours =",{"$f":"SUM(S10:S105)+R7+R5","v":1.5},null,"Nombre de jours =",{"$f":"SUM(V9:V105)+U7+U5","v":0},null,"Nombre de jours =",{"$f":"SUM(Y10:Y105)+X7+X5","v":4},null,"Nombre de jours =",{"$f":"SUM(AB10:AB105)+AA7+AA5","v":0},null,"Nombre de jours =",{"$f":"SUM(AE10:AE105)+AD7+AD5","v":0},null,"Nombre de jours =",{"$f":"SUM(AH10:AH105)+AG7+AG5","v":0},null,"Nombre de jours =",{"$f":"SUM(AK10:AK105)+AJ7+AJ5","v":0},null,"Nombre de jours =",{"$f":"SUM(AN10:AN105)+AM7+AM5","v":0},null,"Nombre de jours =",{"$f":"SUM(AQ10:AQ105)+AP7+AP5","v":0},null,"Nombre de jours =",{"$f":"SUM(AT10:AT105)+AS7+AS5","v":0},null,"Nombre de jours =",{"$f":"SUM(AW10:AW105)+AV7+AV5","v":0},null,"Nombre de jours =",{"$f":"SUM(AZ10:AZ105)+AY7+AY5","v":0},null,"Nombre de jours =",{"$f":"SUM(BC10:BC105)+BB7+BB5","v":0},null,"Nombre de jours =",{"$f":"SUM(BF10:BF105)+BE7+BE5","v":0},null,"Nombre de jours =",{"$f":"SUM(BI10:BI105)+BH7+BH5","v":0},null,"Nombre de jours =",{"$f":"SUM(BL10:BL105)+BK7+BK5","v":0},null,"Nombre de jours =",{"$f":"SUM(BO10:BO105)+BN7+BN5","v":0},null,"Nombre de jours =",{"$f":"SUM(BR10:BR105)+BQ7+BQ5","v":0},null,"Nombre de jours =",{"$f":"SUM(BU10:BU105)+BT7+BT5","v":0},null,"Nombre de jours =",{"$f":"SUM(BX10:BX105)+BW7+BW5","v":0},null,"Nombre de jours =",{"$f":"SUM(CA10:CA105)+BZ7+BZ5","v":0},null,"Nombre de jours =",{"$f":"SUM(CD10:CD105)+CC7+CC5","v":0},null,"Nombre de jours =",{"$f":"SUM(CG10:CG105)+CF7+CF5","v":0},null,"Nombre de jours =",{"$f":"SUM(CJ10:CJ105)+CI7+CI5","v":0},null,"Nombre de jours =",{"$f":"SUM(CM10:CM105)+CL7+CL5","v":0},null,"Nombre de jours =",{"$f":"SUM(CP10:CP105)+CO7+CO5","v":0},null,"Nombre de jours =",{"$f":"SUM(CS10:CS105)+CR7+CR5","v":0},null,"Nombre de jours =",{"$f":"SUM(CV10:CV105)+CU7+CU5","v":0},null,"Nombre de jours =",{"$f":"SUM(CY10:CY105)+CX7+CX5","v":0},null,"Nombre de jours =",{"$f":"SUM(DB10:DB105)+DA7+DA5","v":0},null,"Nombre de jours =",{"$f":"SUM(DE10:DE105)+DD7+DD5","v":0},null,"Nombre de jours =",{"$f":"SUM(DH10:DH105)+DG7+DG5","v":0},null,"Nombre de jours =",{"$f":"SUM(DK10:DK105)+DJ7+DJ5","v":0},null,"Nombre de jours =",{"$f":"SUM(DN10:DN105)+DM7+DM5","v":0},null,"Nombre de jours =",{"$f":"SUM(DQ10:DQ105)+DP7+DP5","v":0},null,"Nombre de jours =",{"$f":"SUM(DT10:DT105)+DS7+DS5","v":0},null,"Nombre de jours =",{"$f":"SUM(DW10:DW105)+DV7+DV5","v":0},null,"Nombre de jours =",{"$f":"SUM(DZ10:DZ105)+DY7+DY5","v":0},null,"Nombre de jours =",{"$f":"SUM(EC10:EC105)+EB7+EB5","v":0}]
["Numéro d'affaire","Affaires","PHASE","P1","P2","P3","P4","P5","P6","P7","P8","P9","P10","NOM Prénom",null,null,null,null,null,null,null,null,null,null,null,"NOM Prénom",null,null,null,null,null,null,null,null,null,null,null,"NOM Prénom",null,null,null,null,null,null,null,null,null,null,null,"NOM Prénom",null,null,null,null,null,null,null,null,null,null,null,"NOM Prénom",null,null,null,null,null,null,null,null,null,null,null,"NOM Prénom",null,null,null,null,null,null,null,null,null,null,null,"NOM Prénom",null,null,null,null,null,null,null,null,null,null,null,"NOM Prénom",null,null,null,null,null,null,null,null,null,null,null,"NOM Prénom",null,null,null,null,null,null,null,null,null,null,null,"NOM Prénom"]
[null,null,null,null,null,null,null,null,null,null,null,null,null,"Tâche","Durée",null,"Tâche","Durée",null,"Tâche","Durée",null,"Tâche","Durée",null,"Tâche","Durée",null,"Tâche","Durée",null,"Tâche","Durée",null,"Tâche","Durée",null,"Tâche","Durée",null,"Tâche","Durée",null,"Tâche","Durée",null,"Tâche","Durée",null,"Tâche","Durée",null,"Tâche","Durée",null,"Tâche","Durée",null,"Tâche","Durée",null,"Tâche","Durée",null,"Tâche","Durée",null,"Tâche","Durée",null,"Tâche","Durée",null,"Tâche","Durée",null,"Tâche","Durée",null,"Tâche","Durée",null,"Tâche","Durée",null,"Tâche","Durée",null,"Tâche","Durée",null,"Tâche","Durée",null,"Tâche","Durée",null,"Tâche","Durée",null,"Tâche","Durée",null,"Tâche","Durée",null,"Tâche","Durée",null,"Tâche","Durée",null,"Tâche","Durée",null,"Tâche","Durée",null,"Tâche","Durée",null,"Tâche","Durée",null,"Tâche","Durée",null,"Tâche","Durée",null,"Tâche","Durée"]
[null,null,null,{"$f":"IF(D13=\"\",\"\",D13)","v":"P1"},"","P3","","","","","","",""]
[null,null,null,{"$f":"IF(D13=\"\",\"\",D13)","v":"P1"},"","P3","","","","","","","","Coffrage",1,null,"Armature",1.5]
["10/020","Nom affaire","EXE","P1",null,"P3",null,null,null,null,null,null,null,"Synthèse",1]
[null,null,null,{"$f":"IF(D13=\"\",\"\",D13)","v":"P1"},"","P3","","","","","","",""]
[null,"Temps passé en jour =",null,{"$f":"IF(D13=\"\",\"\",D13)","v":"P1"},"","P3","","","","","","","","Nbr de jour","=",{"$f":"IF(SUM(O11:O14)=0,\"\",SUM(O11:O14))","v":2},"Nbr de jour","=",{"$f":"IF(SUM(R11:R14)=0,\"\",SUM(R11:R14))","v":1.5},"Nbr de jour","=",{"$f":"IF(SUM(U11:U14)=0,\"\",SUM(U11:U14))","v":""},"Nbr de jour","=",{"$f":"IF(SUM(X11:X14)=0,\"\",SUM(X11:X14))","v":""},"Nbr de jour","=",{"$f":"IF(SUM(AA11:AA14)=0,\"\",SUM(AA11:AA14))","v":""},"Nbr de jour","=",{"$f":"IF(SUM(AD11:AD14)=0,\"\",SUM(AD11:AD14))","v":""},"Nbr de jour","=",{"$f":"IF(SUM(AG11:AG14)=0,\"\",SUM(AG11:AG14))","v":""},"Nbr de jour","=",{"$f":"IF(SUM(AJ11:AJ14)=0,\"\",SUM(AJ11:AJ14))","v":""},"Nbr de jour","=",{"$f":"IF(SUM(AM11:AM14)=0,\"\",SUM(AM11:AM14))","v":""},"Nbr de jour","=",{"$f":"IF(SUM(AP11:AP14)=0,\"\",SUM(AP11:AP14))","v":""},"Nbr de jour","=",{"$f":"IF(SUM(AS11:AS14)=0,\"\",SUM(AS11:AS14))","v":""},"Nbr de jour","=",{"$f":"IF(SUM(AV11:AV14)=0,\"\",SUM(AV11:AV14))","v":""},"Nbr de jour","=",{"$f":"IF(SUM(AY11:AY14)=0,\"\",SUM(AY11:AY14))","v":""},"Nbr de jour","=",{"$f":"IF(SUM(BB11:BB14)=0,\"\",SUM(BB11:BB14))","v":""},"Nbr de jour","=",{"$f":"IF(SUM(BE11:BE14)=0,\"\",SUM(BE11:BE14))","v":""},"Nbr de jour","=",{"$f":"IF(SUM(BH11:BH14)=0,\"\",SUM(BH11:BH14))","v":""},"Nbr de jour","=",{"$f":"IF(SUM(BK11:BK14)=0,\"\",SUM(BK11:BK14))","v":""},"Nbr de jour","=",{"$f":"IF(SUM(BN11:BN14)=0,\"\",SUM(BN11:BN14))","v":""},"Nbr de jour","=",{"$f":"IF(SUM(BQ11:BQ14)=0,\"\",SUM(BQ11:BQ14))","v":""},"Nbr de jour","=",{"$f":"IF(SUM(BT11:BT14)=0,\"\",SUM(BT11:BT14))","v":""},"Nbr de jour","=",{"$f":"IF(SUM(BW11:BW14)=0,\"\",SUM(BW11:BW14))","v":""},"Nbr de jour","=",{"$f":"IF(SUM(BZ11:BZ14)=0,\"\",SUM(BZ11:BZ14))","v":""},"Nbr de jour","=",{"$f":"IF(SUM(CC11:CC14)=0,\"\",SUM(CC11:CC14))","v":""},"Nbr de jour","=",{"$f":"IF(SUM(CF11:CF14)=0,\"\",SUM(CF11:CF14))","v":""},"Nbr de jour","=",{"$f":"IF(SUM(CI11:CI14)=0,\"\",SUM(CI11:CI14))","v":""},"Nbr de jour","=",{"$f":"IF(SUM(CL11:CL14)=0,\"\",SUM(CL11:CL14))","v":""},"Nbr de jour","=",{"$f":"IF(SUM(CO11:CO14)=0,\"\",SUM(CO11:CO14))","v":""},"Nbr de jour","=",{"$f":"IF(SUM(CR11:CR14)=0,\"\",SUM(CR11:CR14))","v":""},"Nbr de jour","=",{"$f":"IF(SUM(CU11:CU14)=0,\"\",SUM(CU11:CU14))","v":""},"Nbr de jour","=",{"$f":"IF(SUM(CX11:CX14)=0,\"\",SUM(CX11:CX14))","v":""},"Nbr de jour","=",{"$f":"IF(SUM(DA11:DA14)=0,\"\",SUM(DA11:DA14))","v":""},"Nbr de jour","=",{"$f":"IF(SUM(DD11:DD14)=0,\"\",SUM(DD11:DD14))","v":""},"Nbr de jour","=",{"$f":"IF(SUM(DG11:DG14)=0,\"\",SUM(DG11:DG14))","v":""},"Nbr de jour","=",{"$f":"IF(SUM(DJ11:DJ14)=0,\"\",SUM(DJ11:DJ14))","v":""},"Nbr de jour","=",{"$f":"IF(SUM(DM11:DM14)=0,\"\",SUM(DM11:DM14))","v":""},"Nbr de jour","=",{"$f":"IF(SUM(DP11:DP14)=0,\"\",SUM(DP11:DP14))","v":""},"Nbr de jour","=",{"$f":"IF(SUM(DS11:DS14)=0,\"\",SUM(DS11:DS14))","v":""},"Nbr de jour","=",{"$f":"IF(SUM(DV11:DV14)=0,\"\",SUM(DV11:DV14))","v":""},"Nbr de jour","=",{"$f":"IF(SUM(DY11:DY14)=0,\"\",SUM(DY11:DY14))","v":""},"Nbr de jour","=",{"$f":"IF(SUM(EB11:EB14)=0,\"\",SUM(EB11:EB14))","v":""}]
[null,null,null,{"$f":"IF(D18=\"\",\"\",D18)","v":""},"","P3","","","","","","",""]
[null,null,null,{"$f":"IF(D18=\"\",\"\",D18)","v":""},"","P3","","","","","","",""]
["14/054","Nom affaire","EXE",null,null,"P3"]
[null,null,null,{"$f":"IF(D18=\"\",\"\",D18)","v":""},"","P3","","","","","","",""]
[null,"Temps passé en jour =",null,{"$f":"IF(D18=\"\",\"\",D18)","v":""},"","P3","","","","","","","","Nbr de jour","=",{"$f":"IF(SUM(O16:O19)=0,\"\",SUM(O16:O19))","v":""},"Nbr de jour","=",{"$f":"IF(SUM(R16:R19)=0,\"\",SUM(R16:R19))","v":""},"Nbr de jour","=",{"$f":"IF(SUM(U16:U19)=0,\"\",SUM(U16:U19))","v":""},"Nbr de jour","=",{"$f":"IF(SUM(X16:X19)=0,\"\",SUM(X16:X19))","v":""},"Nbr de jour","=",{"$f":"IF(SUM(AA16:AA19)=0,\"\",SUM(AA16:AA19))","v":""},"Nbr de jour","=",{"$f":"IF(SUM(AD16:AD19)=0,\"\",SUM(AD16:AD19))","v":""},"Nbr de jour","=",{"$f":"IF(SUM(AG16:AG19)=0,\"\",SUM(AG16:AG19))","v":""},"Nbr de jour","=",{"$f":"IF(SUM(AJ16:AJ19)=0,\"\",SUM(AJ16:AJ19))","v":""},"Nbr de jour","=",{"$f":"IF(SUM(AM16:AM19)=0,\"\",SUM(AM16:AM19))","v":""},"Nbr de jour","=",{"$f":"IF(SUM(AP16:AP19)=0,\"\",SUM(AP16:AP19))","v":""},"Nbr de jour","=",{"$f":"IF(SUM(AS16:AS19)=0,\"\",SUM(AS16:AS19))","v":""},"Nbr de jour","=",{"$f":"IF(SUM(AV16:AV19)=0,\"\",SUM(AV16:AV19))","v":""},"Nbr de jour","=",{"$f":"IF(SUM(AY16:AY19)=0,\"\",SUM(AY16:AY19))","v":""},"Nbr de jour","=",{"$f":"IF(SUM(BB16:BB19)=0,\"\",SUM(BB16:BB19))","v":""},"Nbr de jour","=",{"$f":"IF(SUM(BE16:BE19)=0,\"\",SUM(BE16:BE19))","v":""},"Nbr de jour","=",{"$f":"IF(SUM(BH16:BH19)=0,\"\",SUM(BH16:BH19))","v":""},"Nbr de jour","=",{"$f":"IF(SUM(BK16:BK19)=0,\"\",SUM(BK16:BK19))","v":""},"Nbr de jour","=",{"$f":"IF(SUM(BN16:BN19)=0,\"\",SUM(BN16:BN19))","v":""},"Nbr de jour","=",{"$f":"IF(SUM(BQ16:BQ19)=0,\"\",SUM(BQ16:BQ19))","v":""},"Nbr de jour","=",{"$f":"IF(SUM(BT16:BT19)=0,\"\",SUM(BT16:BT19))","v":""},"Nbr de jour","=",{"$f":"IF(SUM(BW16:BW19)=0,\"\",SUM(BW16:BW19))","v":""},"Nbr de jour","=",{"$f":"IF(SUM(BZ16:BZ19)=0,\"\",SUM(BZ16:BZ19))","v":""},"Nbr de jour","=",{"$f":"IF(SUM(CC16:CC19)=0,\"\",SUM(CC16:CC19))","v":""},"Nbr de jour","=",{"$f":"IF(SUM(CF16:CF19)=0,\"\",SUM(CF16:CF19))","v":""},"Nbr de jour","=",{"$f":"IF(SUM(CI16:CI19)=0,\"\",SUM(CI16:CI19))","v":""},"Nbr de jour","=",{"$f":"IF(SUM(CL16:CL19)=0,\"\",SUM(CL16:CL19))","v":""},"Nbr de jour","=",{"$f":"IF(SUM(CO16:CO19)=0,\"\",SUM(CO16:CO19))","v":""},"Nbr de jour","=",{"$f":"IF(SUM(CR16:CR19)=0,\"\",SUM(CR16:CR19))","v":""},"Nbr de jour","=",{"$f":"IF(SUM(CU16:CU19)=0,\"\",SUM(CU16:CU19))","v":""},"Nbr de jour","=",{"$f":"IF(SUM(CX16:CX19)=0,\"\",SUM(CX16:CX19))","v":""},"Nbr de jour","=",{"$f":"IF(SUM(DA16:DA19)=0,\"\",SUM(DA16:DA19))","v":""},"Nbr de jour","=",{"$f":"IF(SUM(DD16:DD19)=0,\"\",SUM(DD16:DD19))","v":""},"Nbr de jour","=",{"$f":"IF(SUM(DG16:DG19)=0,\"\",SUM(DG16:DG19))","v":""},"Nbr de jour","=",{"$f":"IF(SUM(DJ16:DJ19)=0,\"\",SUM(DJ16:DJ19))","v":""},"Nbr de jour","=",{"$f":"IF(SUM(DM16:DM19)=0,\"\",SUM(DM16:DM19))","v":""},"Nbr de jour","=",{"$f":"IF(SUM(DP16:DP19)=0,\"\",SUM(DP16:DP19))","v":""},"Nbr de jour","=",{"$f":"IF(SUM(DS16:DS19)=0,\"\",SUM(DS16:DS19))","v":""},"Nbr de jour","=",{"$f":"IF(SUM(DV16:DV19)=0,\"\",SUM(DV16:DV19))","v":""},"Nbr de jour","=",{"$f":"IF(SUM(DY16:DY19)=0,\"\",SUM(DY16:DY19))","v":""},"Nbr de jour","=",{"$f":"IF(SUM(EB16:EB19)=0,\"\",SUM(EB16:EB19))","v":""}]
[null,null,null,{"$f":"IF(D23=\"\",\"\",D23)","v":"P1"},"","","","","","","","",""]
[null,null,null,{"$f":"IF(D23=\"\",\"\",D23)","v":"P1"},"","","","","","","","","","Réunion ",0.5]
["13/022","Nom affaire","DET","P1",null,null,null,null,null,null,null,null,null,"Plan AVP",1]
[null,null,null,{"$f":"IF(D23=\"\",\"\",D23)","v":"P1"},"","","","","","","","",""]
[null,"Temps passé en jour =",null,{"$f":"IF(D23=\"\",\"\",D23)","v":"P1"},"","","","","","","","","","Nbr de jour","=",{"$f":"IF(SUM(O21:O24)=0,\"\",SUM(O21:O24))","v":1.5},"Nbr de jour","=",{"$f":"IF(SUM(R21:R24)=0,\"\",SUM(R21:R24))","v":""},"Nbr de jour","=",{"$f":"IF(SUM(U21:U24)=0,\"\",SUM(U21:U24))","v":""},"Nbr de jour","=",{"$f":"IF(SUM(X21:X24)=0,\"\",SUM(X21:X24))","v":""},"Nbr de jour","=",{"$f":"IF(SUM(AA21:AA24)=0,\"\",SUM(AA21:AA24))","v":""},"Nbr de jour","=",{"$f":"IF(SUM(AD21:AD24)=0,\"\",SUM(AD21:AD24))","v":""},"Nbr de jour","=",{"$f":"IF(SUM(AG21:AG24)=0,\"\",SUM(AG21:AG24))","v":""},"Nbr de jour","=",{"$f":"IF(SUM(AJ21:AJ24)=0,\"\",SUM(AJ21:AJ24))","v":""},"Nbr de jour","=",{"$f":"IF(SUM(AM21:AM24)=0,\"\",SUM(AM21:AM24))","v":""},"Nbr de jour","=",{"$f":"IF(SUM(AP21:AP24)=0,\"\",SUM(AP21:AP24))","v":""},"Nbr de jour","=",{"$f":"IF(SUM(AS21:AS24)=0,\"\",SUM(AS21:AS24))","v":""},"Nbr de jour","=",{"$f":"IF(SUM(AV21:AV24)=0,\"\",SUM(AV21:AV24))","v":""},"Nbr de jour","=",{"$f":"IF(SUM(AY21:AY24)=0,\"\",SUM(AY21:AY24))","v":""},"Nbr de jour","=",{"$f":"IF(SUM(BB21:BB24)=0,\"\",SUM(BB21:BB24))","v":""},"Nbr de jour","=",{"$f":"IF(SUM(BE21:BE24)=0,\"\",SUM(BE21:BE24))","v":""},"Nbr de jour","=",{"$f":"IF(SUM(BH21:BH24)=0,\"\",SUM(BH21:BH24))","v":""},"Nbr de jour","=",{"$f":"IF(SUM(BK21:BK24)=0,\"\",SUM(BK21:BK24))","v":""},"Nbr de jour","=",{"$f":"IF(SUM(BN21:BN24)=0,\"\",SUM(BN21:BN24))","v":""},"Nbr de jour","=",{"$f":"IF(SUM(BQ21:BQ24)=0,\"\",SUM(BQ21:BQ24))","v":""},"Nbr de jour","=",{"$f":"IF(SUM(BT21:BT24)=0,\"\",SUM(BT21:BT24))","v":""},"Nbr de jour","=",{"$f":"IF(SUM(BW21:BW24)=0,\"\",SUM(BW21:BW24))","v":""},"Nbr de jour","=",{"$f":"IF(SUM(BZ21:BZ24)=0,\"\",SUM(BZ21:BZ24))","v":""},"Nbr de jour","=",{"$f":"IF(SUM(CC21:CC24)=0,\"\",SUM(CC21:CC24))","v":""},"Nbr de jour","=",{"$f":"IF(SUM(CF21:CF24)=0,\"\",SUM(CF21:CF24))","v":""},"Nbr de jour","=",{"$f":"IF(SUM(CI21:CI24)=0,\"\",SUM(CI21:CI24))","v":""},"Nbr de jour","=",{"$f":"IF(SUM(CL21:CL24)=0,\"\",SUM(CL21:CL24))","v":""},"Nbr de jour","=",{"$f":"IF(SUM(CO21:CO24)=0,\"\",SUM(CO21:CO24))","v":""},"Nbr de jour","=",{"$f":"IF(SUM(CR21:CR24)=0,\"\",SUM(CR21:CR24))","v":""},"Nbr de jour","=",{"$f":"IF(SUM(CU21:CU24)=0,\"\",SUM(CU21:CU24))","v":""},"Nbr de jour","=",{"$f":"IF(SUM(CX21:CX24)=0,\"\",SUM(CX21:CX24))","v":""},"Nbr de jour","=",{"$f":"IF(SUM(DA21:DA24)=0,\"\",SUM(DA21:DA24))","v":""},"Nbr de jour","=",{"$f":"IF(SUM(DD21:DD24)=0,\"\",SUM(DD21:DD24))","v":""},"Nbr de jour","=",{"$f":"IF(SUM(DG21:DG24)=0,\"\",SUM(DG21:DG24))","v":""},"Nbr de jour","=",{"$f":"IF(SUM(DJ21:DJ24)=0,\"\",SUM(DJ21:DJ24))","v":""},"Nbr de jour","=",{"$f":"IF(SUM(DM21:DM24)=0,\"\",SUM(DM21:DM24))","v":""},"Nbr de jour","=",{"$f":"IF(SUM(DP21:DP24)=0,\"\",SUM(DP21:DP24))","v":""},"Nbr de jour","=",{"$f":"IF(SUM(DS21:DS24)=0,\"\",SUM(DS21:DS24))","v":""},"Nbr de jour","=",{"$f":"IF(SUM(DV21:DV24)=0,\"\",SUM(DV21:DV24))","v":""},"Nbr de jour","=",{"$f":"IF(SUM(DY21:DY24)=0,\"\",SUM(DY21:DY24))","v":""},"Nbr de jour","=",{"$f":"IF(SUM(EB21:EB24)=0,\"\",SUM(EB21:EB24))","v":""}]
[null,null,null,{"$f":"IF(D28=\"\",\"\",D28)","v":""},"","","","","","","","","P10"]
[null,null,null,{"$f":"IF(D28=\"\",\"\",D28)","v":""},"","","","","","","","","P10"]
["Numéro 01","Nom affaire","AVP",null,null,null,null,null,null,null,null,null,"P10"]
[null,null,null,{"$f":"IF(D28=\"\",\"\",D28)","v":""},"","","","","","","","","P10"]
[null,"Temps passé en jour =",null,{"$f":"IF(D28=\"\",\"\",D28)","v":""},"","","","","","","","","P10","Nbr de jour","=",{"$f":"IF(SUM(O26:O29)=0,\"\",SUM(O26:O29))","v":""},"Nbr de jour","=",{"$f":"IF(SUM(R26:R29)=0,\"\",SUM(R26:R29))","v":""},"Nbr de jour","=",{"$f":"IF(SUM(U26:U29)=0,\"\",SUM(U26:U29))","v":""},"Nbr de jour","=",{"$f":"IF(SUM(X26:X29)=0,\"\",SUM(X26:X29))","v":""},"Nbr de jour","=",{"$f":"IF(SUM(AA26:AA29)=0,\"\",SUM(AA26:AA29))","v":""},"Nbr de jour","=",{"$f":"IF(SUM(AD26:AD29)=0,\"\",SUM(AD26:AD29))","v":""},"Nbr de jour","=",{"$f":"IF(SUM(AG26:AG29)=0,\"\",SUM(AG26:AG29))","v":""},"Nbr de jour","=",{"$f":"IF(SUM(AJ26:AJ29)=0,\"\",SUM(AJ26:AJ29))","v":""},"Nbr de jour","=",{"$f":"IF(SUM(AM26:AM29)=0,\"\",SUM(AM26:AM29))","v":""},"Nbr de jour","=",{"$f":"IF(SUM(AP26:AP29)=0,\"\",SUM(AP26:AP29))","v":""},"Nbr de jour","=",{"$f":"IF(SUM(AS26:AS29)=0,\"\",SUM(AS26:AS29))","v":""},"Nbr de jour","=",{"$f":"IF(SUM(AV26:AV29)=0,\"\",SUM(AV26:AV29))","v":""},"Nbr de jour","=",{"$f":"IF(SUM(AY26:AY29)=0,\"\",SUM(AY26:AY29))","v":""},"Nbr de jour","=",{"$f":"IF(SUM(BB26:BB29)=0,\"\",SUM(BB26:BB29))","v":""},"Nbr de jour","=",{"$f":"IF(SUM(BE26:BE29)=0,\"\",SUM(BE26:BE29))","v":""},"Nbr de jour","=",{"$f":"IF(SUM(BH26:BH29)=0,\"\",SUM(BH26:BH29))","v":""},"Nbr de jour","=",{"$f":"IF(SUM(BK26:BK29)=0,\"\",SUM(BK26:BK29))","v":""},"Nbr de jour","=",{"$f":"IF(SUM(BN26:BN29)=0,\"\",SUM(BN26:BN29))","v":""},"Nbr de jour","=",{"$f":"IF(SUM(BQ26:BQ29)=0,\"\",SUM(BQ26:BQ29))","v":""},"Nbr de jour","=",{"$f":"IF(SUM(BT26:BT29)=0,\"\",SUM(BT26:BT29))","v":""},"Nbr de jour","=",{"$f":"IF(SUM(BW26:BW29)=0,\"\",SUM(BW26:BW29))","v":""},"Nbr de jour","=",{"$f":"IF(SUM(BZ26:BZ29)=0,\"\",SUM(BZ26:BZ29))","v":""},"Nbr de jour","=",{"$f":"IF(SUM(CC26:CC29)=0,\"\",SUM(CC26:CC29))","v":""},"Nbr de jour","=",{"$f":"IF(SUM(CF26:CF29)=0,\"\",SUM(CF26:CF29))","v":""},"Nbr de jour","=",{"$f":"IF(SUM(CI26:CI29)=0,\"\",SUM(CI26:CI29))","v":""},"Nbr de jour","=",{"$f":"IF(SUM(CL26:CL29)=0,\"\",SUM(CL26:CL29))","v":""},"Nbr de jour","=",{"$f":"IF(SUM(CO26:CO29)=0,\"\",SUM(CO26:CO29))","v":""},"Nbr de jour","=",{"$f":"IF(SUM(CR26:CR29)=0,\"\",SUM(CR26:CR29))","v":""},"Nbr de jour","=",{"$f":"IF(SUM(CU26:CU29)=0,\"\",SUM(CU26:CU29))","v":""},"Nbr de jour","=",{"$f":"IF(SUM(CX26:CX29)=0,\"\",SUM(CX26:CX29))","v":""},"Nbr de jour","=",{"$f":"IF(SUM(DA26:DA29)=0,\"\",SUM(DA26:DA29))","v":""},"Nbr de jour","=",{"$f":"IF(SUM(DD26:DD29)=0,\"\",SUM(DD26:DD29))","v":""},"Nbr de jour","=",{"$f":"IF(SUM(DG26:DG29)=0,\"\",SUM(DG26:DG29))","v":""},"Nbr de jour","=",{"$f":"IF(SUM(DJ26:DJ29)=0,\"\",SUM(DJ26:DJ29))","v":""},"Nbr de jour","=",{"$f":"IF(SUM(DM26:DM29)=0,\"\",SUM(DM26:DM29))","v":""},"Nbr de jour","=",{"$f":"IF(SUM(DP26:DP29)=0,\"\",SUM(DP26:DP29))","v":""},"Nbr de jour","=",{"$f":"IF(SUM(DS26:DS29)=0,\"\",SUM(DS26:DS29))","v":""},"Nbr de jour","=",{"$f":"IF(SUM(DV26:DV29)=0,\"\",SUM(DV26:DV29))","v":""},"Nbr de jour","=",{"$f":"IF(SUM(DY26:DY29)=0,\"\",SUM(DY26:DY29))","v":""},"Nbr de jour","=",{"$f":"IF(SUM(EB26:EB29)=0,\"\",SUM(EB26:EB29))","v":""}]
[null,null,null,{"$f":"IF(D33=\"\",\"\",D33)","v":""},"","P3","","","","","","",""]
[null,null,null,{"$f":"IF(D33=\"\",\"\",D33)","v":""},"","P3","","","","","","",""]
["Numéro 02","Nom affaire","AVP",null,null,"P3"]
[null,null,null,{"$f":"IF(D33=\"\",\"\",D33)","v":""},"","P3","","","","","","",""]
[null,"Temps passé en jour =",null,{"$f":"IF(D33=\"\",\"\",D33)","v":""},"","P3","","","","","","","","Nbr de jour","=",{"$f":"IF(SUM(O31:O34)=0,\"\",SUM(O31:O34))","v":""},"Nbr de jour","=",{"$f":"IF(SUM(R31:R34)=0,\"\",SUM(R31:R34))","v":""},"Nbr de jour","=",{"$f":"IF(SUM(U31:U34)=0,\"\",SUM(U31:U34))","v":""},"Nbr de jour","=",{"$f":"IF(SUM(X31:X34)=0,\"\",SUM(X31:X34))","v":""},"Nbr de jour","=",{"$f":"IF(SUM(AA31:AA34)=0,\"\",SUM(AA31:AA34))","v":""},"Nbr de jour","=",{"$f":"IF(SUM(AD31:AD34)=0,\"\",SUM(AD31:AD34))","v":""},"Nbr de jour","=",{"$f":"IF(SUM(AG31:AG34)=0,\"\",SUM(AG31:AG34))","v":""},"Nbr de jour","=",{"$f":"IF(SUM(AJ31:AJ34)=0,\"\",SUM(AJ31:AJ34))","v":""},"Nbr de jour","=",{"$f":"IF(SUM(AM31:AM34)=0,\"\",SUM(AM31:AM34))","v":""},"Nbr de jour","=",{"$f":"IF(SUM(AP31:AP34)=0,\"\",SUM(AP31:AP34))","v":""},"Nbr de jour","=",{"$f":"IF(SUM(AS31:AS34)=0,\"\",SUM(AS31:AS34))","v":""},"Nbr de jour","=",{"$f":"IF(SUM(AV31:AV34)=0,\"\",SUM(AV31:AV34))","v":""},"Nbr de jour","=",{"$f":"IF(SUM(AY31:AY34)=0,\"\",SUM(AY31:AY34))","v":""},"Nbr de jour","=",{"$f":"IF(SUM(BB31:BB34)=0,\"\",SUM(BB31:BB34))","v":""},"Nbr de jour","=",{"$f":"IF(SUM(BE31:BE34)=0,\"\",SUM(BE31:BE34))","v":""},"Nbr de jour","=",{"$f":"IF(SUM(BH31:BH34)=0,\"\",SUM(BH31:BH34))","v":""},"Nbr de jour","=",{"$f":"IF(SUM(BK31:BK34)=0,\"\",SUM(BK31:BK34))","v":""},"Nbr de jour","=",{"$f":"IF(SUM(BN31:BN34)=0,\"\",SUM(BN31:BN34))","v":""},"Nbr de jour","=",{"$f":"IF(SUM(BQ31:BQ34)=0,\"\",SUM(BQ31:BQ34))","v":""},"Nbr de jour","=",{"$f":"IF(SUM(BT31:BT34)=0,\"\",SUM(BT31:BT34))","v":""},"Nbr de jour","=",{"$f":"IF(SUM(BW31:BW34)=0,\"\",SUM(BW31:BW34))","v":""},"Nbr de jour","=",{"$f":"IF(SUM(BZ31:BZ34)=0,\"\",SUM(BZ31:BZ34))","v":""},"Nbr de jour","=",{"$f":"IF(SUM(CC31:CC34)=0,\"\",SUM(CC31:CC34))","v":""},"Nbr de jour","=",{"$f":"IF(SUM(CF31:CF34)=0,\"\",SUM(CF31:CF34))","v":""},"Nbr de jour","=",{"$f":"IF(SUM(CI31:CI34)=0,\"\",SUM(CI31:CI34))","v":""},"Nbr de jour","=",{"$f":"IF(SUM(CL31:CL34)=0,\"\",SUM(CL31:CL34))","v":""},"Nbr de jour","=",{"$f":"IF(SUM(CO31:CO34)=0,\"\",SUM(CO31:CO34))","v":""},"Nbr de jour","=",{"$f":"IF(SUM(CR31:CR34)=0,\"\",SUM(CR31:CR34))","v":""},"Nbr de jour","=",{"$f":"IF(SUM(CU31:CU34)=0,\"\",SUM(CU31:CU34))","v":""},"Nbr de jour","=",{"$f":"IF(SUM(CX31:CX34)=0,\"\",SUM(CX31:CX34))","v":""},"Nbr de jour","=",{"$f":"IF(SUM(DA31:DA34)=0,\"\",SUM(DA31:DA34))","v":""},"Nbr de jour","=",{"$f":"IF(SUM(DD31:DD34)=0,\"\",SUM(DD31:DD34))","v":""},"Nbr de jour","=",{"$f":"IF(SUM(DG31:DG34)=0,\"\",SUM(DG31:DG34))","v":""},"Nbr de jour","=",{"$f":"IF(SUM(DJ31:DJ34)=0,\"\",SUM(DJ31:DJ34))","v":""},"Nbr de jour","=",{"$f":"IF(SUM(DM31:DM34)=0,\"\",SUM(DM31:DM34))","v":""},"Nbr de jour","=",{"$f":"IF(SUM(DP31:DP34)=0,\"\",SUM(DP31:DP34))","v":""},"Nbr de jour","=",{"$f":"IF(SUM(DS31:DS34)=0,\"\",SUM(DS31:DS34))","v":""},"Nbr de jour","=",{"$f":"IF(SUM(DV31:DV34)=0,\"\",SUM(DV31:DV34))","v":""},"Nbr de jour","=",{"$f":"IF(SUM(DY31:DY34)=0,\"\",SUM(DY31:DY34))","v":""},"Nbr de jour","=",{"$f":"IF(SUM(EB31:EB34)=0,\"\",SUM(EB31:EB34))","v":""}]
[null,null,null,{"$f":"IF(D38=\"\",\"\",D38)","v":"P1"},"","P3","","","P6","","","",""]
[null,null,null,{"$f":"IF(D38=\"\",\"\",D38)","v":"P1"},"","P3","","","P6","","","",""]
["Numéro 03","Nom affaire","DET","P1",null,"P3",null,null,"P6"]
[null,null,null,{"$f":"IF(D38=\"\",\"\",D38)","v":"P1"},"","P3","","","P6","","","",""]
[null,"Temps passé en jour =",null,{"$f":"IF(D38=\"\",\"\",D38)","v":"P1"},"","P3","","","P6","","","","","Nbr de jour","=",{"$f":"IF(SUM(O36:O39)=0,\"\",SUM(O36:O39))","v":""},"Nbr de jour","=",{"$f":"IF(SUM(R36:R39)=0,\"\",SUM(R36:R39))","v":""},"Nbr de jour","=",{"$f":"IF(SUM(U36:U39)=0,\"\",SUM(U36:U39))","v":""},"Nbr de jour","=",{"$f":"IF(SUM(X36:X39)=0,\"\",SUM(X36:X39))","v":""},"Nbr de jour","=",{"$f":"IF(SUM(AA36:AA39)=0,\"\",SUM(AA36:AA39))","v":""},"Nbr de jour","=",{"$f":"IF(SUM(AD36:AD39)=0,\"\",SUM(AD36:AD39))","v":""},"Nbr de jour","=",{"$f":"IF(SUM(AG36:AG39)=0,\"\",SUM(AG36:AG39))","v":""},"Nbr de jour","=",{"$f":"IF(SUM(AJ36:AJ39)=0,\"\",SUM(AJ36:AJ39))","v":""},"Nbr de jour","=",{"$f":"IF(SUM(AM36:AM39)=0,\"\",SUM(AM36:AM39))","v":""},"Nbr de jour","=",{"$f":"IF(SUM(AP36:AP39)=0,\"\",SUM(AP36:AP39))","v":""},"Nbr de jour","=",{"$f":"IF(SUM(AS36:AS39)=0,\"\",SUM(AS36:AS39))","v":""},"Nbr de jour","=",{"$f":"IF(SUM(AV36:AV39)=0,\"\",SUM(AV36:AV39))","v":""},"Nbr de jour","=",{"$f":"IF(SUM(AY36:AY39)=0,\"\",SUM(AY36:AY39))","v":""},"Nbr de jour","=",{"$f":"IF(SUM(BB36:BB39)=0,\"\",SUM(BB36:BB39))","v":""},"Nbr de jour","=",{"$f":"IF(SUM(BE36:BE39)=0,\"\",SUM(BE36:BE39))","v":""},"Nbr de jour","=",{"$f":"IF(SUM(BH36:BH39)=0,\"\",SUM(BH36:BH39))","v":""},"Nbr de jour","=",{"$f":"IF(SUM(BK36:BK39)=0,\"\",SUM(BK36:BK39))","v":""},"Nbr de jour","=",{"$f":"IF(SUM(BN36:BN39)=0,\"\",SUM(BN36:BN39))","v":""},"Nbr de jour","=",{"$f":"IF(SUM(BQ36:BQ39)=0,\"\",SUM(BQ36:BQ39))","v":""},"Nbr de jour","=",{"$f":"IF(SUM(BT36:BT39)=0,\"\",SUM(BT36:BT39))","v":""},"Nbr de jour","=",{"$f":"IF(SUM(BW36:BW39)=0,\"\",SUM(BW36:BW39))","v":""},"Nbr de jour","=",{"$f":"IF(SUM(BZ36:BZ39)=0,\"\",SUM(BZ36:BZ39))","v":""},"Nbr de jour","=",{"$f":"IF(SUM(CC36:CC39)=0,\"\",SUM(CC36:CC39))","v":""},"Nbr de jour","=",{"$f":"IF(SUM(CF36:CF39)=0,\"\",SUM(CF36:CF39))","v":""},"Nbr de jour","=",{"$f":"IF(SUM(CI36:CI39)=0,\"\",SUM(CI36:CI39))","v":""},"Nbr de jour","=",{"$f":"IF(SUM(CL36:CL39)=0,\"\",SUM(CL36:CL39))","v":""},"Nbr de jour","=",{"$f":"IF(SUM(CO36:CO39)=0,\"\",SUM(CO36:CO39))","v":""},"Nbr de jour","=",{"$f":"IF(SUM(CR36:CR39)=0,\"\",SUM(CR36:CR39))","v":""},"Nbr de jour","=",{"$f":"IF(SUM(CU36:CU39)=0,\"\",SUM(CU36:CU39))","v":""},"Nbr de jour","=",{"$f":"IF(SUM(CX36:CX39)=0,\"\",SUM(CX36:CX39))","v":""},"Nbr de jour","=",{"$f":"IF(SUM(DA36:DA39)=0,\"\",SUM(DA36:DA39))","v":""},"Nbr de jour","=",{"$f":"IF(SUM(DD36:DD39)=0,\"\",SUM(DD36:DD39))","v":""},"Nbr de jour","=",{"$f":"IF(SUM(DG36:DG39)=0,\"\",SUM(DG36:DG39))","v":""},"Nbr de jour","=",{"$f":"IF(SUM(DJ36:DJ39)=0,\"\",SUM(DJ36:DJ39))","v":""},"Nbr de jour","=",{"$f":"IF(SUM(DM36:DM39)=0,\"\",SUM(DM36:DM39))","v":""},"Nbr de jour","=",{"$f":"IF(SUM(DP36:DP39)=0,\"\",SUM(DP36:DP39))","v":""},"Nbr de jour","=",{"$f":"IF(SUM(DS36:DS39)=0,\"\",SUM(DS36:DS39))","v":""},"Nbr de jour","=",{"$f":"IF(SUM(DV36:DV39)=0,\"\",SUM(DV36:DV39))","v":""},"Nbr de jour","=",{"$f":"IF(SUM(DY36:DY39)=0,\"\",SUM(DY36:DY39))","v":""},"Nbr de jour","=",{"$f":"IF(SUM(EB36:EB39)=0,\"\",SUM(EB36:EB39))","v":""}]
[null,null,null,{"$f":"IF(D43=\"\",\"\",D43)","v":"P1"},"","","","","","","","",""]
[null,null,null,{"$f":"IF(D43=\"\",\"\",D43)","v":"P1"},"","","","","","","","",""]
["Numéro 04","Nom affaire","DET","P1"]
[null,null,null,{"$f":"IF(D43=\"\",\"\",D43)","v":"P1"},"","","","","","","","",""]
[null,"Temps passé en jour =",null,{"$f":"IF(D43=\"\",\"\",D43)","v":"P1"},"","","","","","","","","","Nbr de jour","=",{"$f":"IF(SUM(O41:O44)=0,\"\",SUM(O41:O44))","v":""},"Nbr de jour","=",{"$f":"IF(SUM(R41:R44)=0,\"\",SUM(R41:R44))","v":""},"Nbr de jour","=",{"$f":"IF(SUM(U41:U44)=0,\"\",SUM(U41:U44))","v":""},"Nbr de jour","=",{"$f":"IF(SUM(X41:X44)=0,\"\",SUM(X41:X44))","v":""},"Nbr de jour","=",{"$f":"IF(SUM(AA41:AA44)=0,\"\",SUM(AA41:AA44))","v":""},"Nbr de jour","=",{"$f":"IF(SUM(AD41:AD44)=0,\"\",SUM(AD41:AD44))","v":""},"Nbr de jour","=",{"$f":"IF(SUM(AG41:AG44)=0,\"\",SUM(AG41:AG44))","v":""},"Nbr de jour","=",{"$f":"IF(SUM(AJ41:AJ44)=0,\"\",SUM(AJ41:AJ44))","v":""},"Nbr de jour","=",{"$f":"IF(SUM(AM41:AM44)=0,\"\",SUM(AM41:AM44))","v":""},"Nbr de jour","=",{"$f":"IF(SUM(AP41:AP44)=0,\"\",SUM(AP41:AP44))","v":""},"Nbr de jour","=",{"$f":"IF(SUM(AS41:AS44)=0,\"\",SUM(AS41:AS44))","v":""},"Nbr de jour","=",{"$f":"IF(SUM(AV41:AV44)=0,\"\",SUM(AV41:AV44))","v":""},"Nbr de jour","=",{"$f":"IF(SUM(AY41:AY44)=0,\"\",SUM(AY41:AY44))","v":""},"Nbr de jour","=",{"$f":"IF(SUM(BB41:BB44)=0,\"\",SUM(BB41:BB44))","v":""},"Nbr de jour","=",{"$f":"IF(SUM(BE41:BE44)=0,\"\",SUM(BE41:BE44))","v":""},"Nbr de jour","=",{"$f":"IF(SUM(BH41:BH44)=0,\"\",SUM(BH41:BH44))","v":""},"Nbr de jour","=",{"$f":"IF(SUM(BK41:BK44)=0,\"\",SUM(BK41:BK44))","v":""},"Nbr de jour","=",{"$f":"IF(SUM(BN41:BN44)=0,\"\",SUM(BN41:BN44))","v":""},"Nbr de jour","=",{"$f":"IF(SUM(BQ41:BQ44)=0,\"\",SUM(BQ41:BQ44))","v":""},"Nbr de jour","=",{"$f":"IF(SUM(BT41:BT44)=0,\"\",SUM(BT41:BT44))","v":""},"Nbr de jour","=",{"$f":"IF(SUM(BW41:BW44)=0,\"\",SUM(BW41:BW44))","v":""},"Nbr de jour","=",{"$f":"IF(SUM(BZ41:BZ44)=0,\"\",SUM(BZ41:BZ44))","v":""},"Nbr de jour","=",{"$f":"IF(SUM(CC41:CC44)=0,\"\",SUM(CC41:CC44))","v":""},"Nbr de jour","=",{"$f":"IF(SUM(CF41:CF44)=0,\"\",SUM(CF41:CF44))","v":""},"Nbr de jour","=",{"$f":"IF(SUM(CI41:CI44)=0,\"\",SUM(CI41:CI44))","v":""},"Nbr de jour","=",{"$f":"IF(SUM(CL41:CL44)=0,\"\",SUM(CL41:CL44))","v":""},"Nbr de jour","=",{"$f":"IF(SUM(CO41:CO44)=0,\"\",SUM(CO41:CO44))","v":""},"Nbr de jour","=",{"$f":"IF(SUM(CR41:CR44)=0,\"\",SUM(CR41:CR44))","v":""},"Nbr de jour","=",{"$f":"IF(SUM(CU41:CU44)=0,\"\",SUM(CU41:CU44))","v":""},"Nbr de jour","=",{"$f":"IF(SUM(CX41:CX44)=0,\"\",SUM(CX41:CX44))","v":""},"Nbr de jour","=",{"$f":"IF(SUM(DA41:DA44)=0,\"\",SUM(DA41:DA44))","v":""},"Nbr de jour","=",{"$f":"IF(SUM(DD41:DD44)=0,\"\",SUM(DD41:DD44))","v":""},"Nbr de jour","=",{"$f":"IF(SUM(DG41:DG44)=0,\"\",SUM(DG41:DG44))","v":""},"Nbr de jour","=",{"$f":"IF(SUM(DJ41:DJ44)=0,\"\",SUM(DJ41:DJ44))","v":""},"Nbr de jour","=",{"$f":"IF(SUM(DM41:DM44)=0,\"\",SUM(DM41:DM44))","v":""},"Nbr de jour","=",{"$f":"IF(SUM(DP41:DP44)=0,\"\",SUM(DP41:DP44))","v":""},"Nbr de jour","=",{"$f":"IF(SUM(DS41:DS44)=0,\"\",SUM(DS41:DS44))","v":""},"Nbr de jour","=",{"$f":"IF(SUM(DV41:DV44)=0,\"\",SUM(DV41:DV44))","v":""},"Nbr de jour","=",{"$f":"IF(SUM(DY41:DY44)=0,\"\",SUM(DY41:DY44))","v":""},"Nbr de jour","=",{"$f":"IF(SUM(EB41:EB44)=0,\"\",SUM(EB41:EB44))","v":""}]
[null,null,null,{"$f":"IF(D48=\"\",\"\",D48)","v":""},"","","","P5","","","","",""]
[null,null,null,{"$f":"IF(D48=\"\",\"\",D48)","v":""},"","","","P5","","","","",""]
["Numéro 05","Nom affaire","DET",null,null,null,null,"P5"]
[null,null,null,{"$f":"IF(D48=\"\",\"\",D48)","v":""},"","","","P5","","","","",""]
[null,"Temps passé en jour =",null,{"$f":"IF(D48=\"\",\"\",D48)","v":""},"","","","P5","","","","","","Nbr de jour","=",{"$f":"IF(SUM(O46:O49)=0,\"\",SUM(O46:O49))","v":""},"Nbr de jour","=",{"$f":"IF(SUM(R46:R49)=0,\"\",SUM(R46:R49))","v":""},"Nbr de jour","=",{"$f":"IF(SUM(U46:U49)=0,\"\",SUM(U46:U49))","v":""},"Nbr de jour","=",{"$f":"IF(SUM(X46:X49)=0,\"\",SUM(X46:X49))","v":""},"Nbr de jour","=",{"$f":"IF(SUM(AA46:AA49)=0,\"\",SUM(AA46:AA49))","v":""},"Nbr de jour","=",{"$f":"IF(SUM(AD46:AD49)=0,\"\",SUM(AD46:AD49))","v":""},"Nbr de jour","=",{"$f":"IF(SUM(AG46:AG49)=0,\"\",SUM(AG46:AG49))","v":""},"Nbr de jour","=",{"$f":"IF(SUM(AJ46:AJ49)=0,\"\",SUM(AJ46:AJ49))","v":""},"Nbr de jour","=",{"$f":"IF(SUM(AM46:AM49)=0,\"\",SUM(AM46:AM49))","v":""},"Nbr de jour","=",{"$f":"IF(SUM(AP46:AP49)=0,\"\",SUM(AP46:AP49))","v":""},"Nbr de jour","=",{"$f":"IF(SUM(AS46:AS49)=0,\"\",SUM(AS46:AS49))","v":""},"Nbr de jour","=",{"$f":"IF(SUM(AV46:AV49)=0,\"\",SUM(AV46:AV49))","v":""},"Nbr de jour","=",{"$f":"IF(SUM(AY46:AY49)=0,\"\",SUM(AY46:AY49))","v":""},"Nbr de jour","=",{"$f":"IF(SUM(BB46:BB49)=0,\"\",SUM(BB46:BB49))","v":""},"Nbr de jour","=",{"$f":"IF(SUM(BE46:BE49)=0,\"\",SUM(BE46:BE49))","v":""},"Nbr de jour","=",{"$f":"IF(SUM(BH46:BH49)=0,\"\",SUM(BH46:BH49))","v":""},"Nbr de jour","=",{"$f":"IF(SUM(BK46:BK49)=0,\"\",SUM(BK46:BK49))","v":""},"Nbr de jour","=",{"$f":"IF(SUM(BN46:BN49)=0,\"\",SUM(BN46:BN49))","v":""},"Nbr de jour","=",{"$f":"IF(SUM(BQ46:BQ49)=0,\"\",SUM(BQ46:BQ49))","v":""},"Nbr de jour","=",{"$f":"IF(SUM(BT46:BT49)=0,\"\",SUM(BT46:BT49))","v":""},"Nbr de jour","=",{"$f":"IF(SUM(BW46:BW49)=0,\"\",SUM(BW46:BW49))","v":""},"Nbr de jour","=",{"$f":"IF(SUM(BZ46:BZ49)=0,\"\",SUM(BZ46:BZ49))","v":""},"Nbr de jour","=",{"$f":"IF(SUM(CC46:CC49)=0,\"\",SUM(CC46:CC49))","v":""},"Nbr de jour","=",{"$f":"IF(SUM(CF46:CF49)=0,\"\",SUM(CF46:CF49))","v":""},"Nbr de jour","=",{"$f":"IF(SUM(CI46:CI49)=0,\"\",SUM(CI46:CI49))","v":""},"Nbr de jour","=",{"$f":"IF(SUM(CL46:CL49)=0,\"\",SUM(CL46:CL49))","v":""},"Nbr de jour","=",{"$f":"IF(SUM(CO46:CO49)=0,\"\",SUM(CO46:CO49))","v":""},"Nbr de jour","=",{"$f":"IF(SUM(CR46:CR49)=0,\"\",SUM(CR46:CR49))","v":""},"Nbr de jour","=",{"$f":"IF(SUM(CU46:CU49)=0,\"\",SUM(CU46:CU49))","v":""},"Nbr de jour","=",{"$f":"IF(SUM(CX46:CX49)=0,\"\",SUM(CX46:CX49))","v":""},"Nbr de jour","=",{"$f":"IF(SUM(DA46:DA49)=0,\"\",SUM(DA46:DA49))","v":""},"Nbr de jour","=",{"$f":"IF(SUM(DD46:DD49)=0,\"\",SUM(DD46:DD49))","v":""},"Nbr de jour","=",{"$f":"IF(SUM(DG46:DG49)=0,\"\",SUM(DG46:DG49))","v":""},"Nbr de jour","=",{"$f":"IF(SUM(DJ46:DJ49)=0,\"\",SUM(DJ46:DJ49))","v":""},"Nbr de jour","=",{"$f":"IF(SUM(DM46:DM49)=0,\"\",SUM(DM46:DM49))","v":""},"Nbr de jour","=",{"$f":"IF(SUM(DP46:DP49)=0,\"\",SUM(DP46:DP49))","v":""},"Nbr de jour","=",{"$f":"IF(SUM(DS46:DS49)=0,\"\",SUM(DS46:DS49))","v":""},"Nbr de jour","=",{"$f":"IF(SUM(DV46:DV49)=0,\"\",SUM(DV46:DV49))","v":""},"Nbr de jour","=",{"$f":"IF(SUM(DY46:DY49)=0,\"\",SUM(DY46:DY49))","v":""},"Nbr de jour","=",{"$f":"IF(SUM(EB46:EB49)=0,\"\",SUM(EB46:EB49))","v":""}]
[null,null,null,{"$f":"IF(D53=\"\",\"\",D53)","v":""},"","","P4","","","","","",""]
[null,null,null,{"$f":"IF(D53=\"\",\"\",D53)","v":""},"","","P4","","","","","",""]
["Numéro 06","Nom affaire","EXE",null,null,null,"P4"]
[null,null,null,{"$f":"IF(D53=\"\",\"\",D53)","v":""},"","","P4","","","","","",""]
[null,"Temps passé en jour =",null,{"$f":"IF(D53=\"\",\"\",D53)","v":""},"","","P4","","","","","","","Nbr de jour","=",{"$f":"IF(SUM(O51:O54)=0,\"\",SUM(O51:O54))","v":""},"Nbr de jour","=",{"$f":"IF(SUM(R51:R54)=0,\"\",SUM(R51:R54))","v":""},"Nbr de jour","=",{"$f":"IF(SUM(U51:U54)=0,\"\",SUM(U51:U54))","v":""},"Nbr de jour","=",{"$f":"IF(SUM(X51:X54)=0,\"\",SUM(X51:X54))","v":""},"Nbr de jour","=",{"$f":"IF(SUM(AA51:AA54)=0,\"\",SUM(AA51:AA54))","v":""},"Nbr de jour","=",{"$f":"IF(SUM(AD51:AD54)=0,\"\",SUM(AD51:AD54))","v":""},"Nbr de jour","=",{"$f":"IF(SUM(AG51:AG54)=0,\"\",SUM(AG51:AG54))","v":""},"Nbr de jour","=",{"$f":"IF(SUM(AJ51:AJ54)=0,\"\",SUM(AJ51:AJ54))","v":""},"Nbr de jour","=",{"$f":"IF(SUM(AM51:AM54)=0,\"\",SUM(AM51:AM54))","v":""},"Nbr de jour","=",{"$f":"IF(SUM(AP51:AP54)=0,\"\",SUM(AP51:AP54))","v":""},"Nbr de jour","=",{"$f":"IF(SUM(AS51:AS54)=0,\"\",SUM(AS51:AS54))","v":""},"Nbr de jour","=",{"$f":"IF(SUM(AV51:AV54)=0,\"\",SUM(AV51:AV54))","v":""},"Nbr de jour","=",{"$f":"IF(SUM(AY51:AY54)=0,\"\",SUM(AY51:AY54))","v":""},"Nbr de jour","=",{"$f":"IF(SUM(BB51:BB54)=0,\"\",SUM(BB51:BB54))","v":""},"Nbr de jour","=",{"$f":"IF(SUM(BE51:BE54)=0,\"\",SUM(BE51:BE54))","v":""},"Nbr de jour","=",{"$f":"IF(SUM(BH51:BH54)=0,\"\",SUM(BH51:BH54))","v":""},"Nbr de jour","=",{"$f":"IF(SUM(BK51:BK54)=0,\"\",SUM(BK51:BK54))","v":""},"Nbr de jour","=",{"$f":"IF(SUM(BN51:BN54)=0,\"\",SUM(BN51:BN54))","v":""},"Nbr de jour","=",{"$f":"IF(SUM(BQ51:BQ54)=0,\"\",SUM(BQ51:BQ54))","v":""},"Nbr de jour","=",{"$f":"IF(SUM(BT51:BT54)=0,\"\",SUM(BT51:BT54))","v":""},"Nbr de jour","=",{"$f":"IF(SUM(BW51:BW54)=0,\"\",SUM(BW51:BW54))","v":""},"Nbr de jour","=",{"$f":"IF(SUM(BZ51:BZ54)=0,\"\",SUM(BZ51:BZ54))","v":""},"Nbr de jour","=",{"$f":"IF(SUM(CC51:CC54)=0,\"\",SUM(CC51:CC54))","v":""},"Nbr de jour","=",{"$f":"IF(SUM(CF51:CF54)=0,\"\",SUM(CF51:CF54))","v":""},"Nbr de jour","=",{"$f":"IF(SUM(CI51:CI54)=0,\"\",SUM(CI51:CI54))","v":""},"Nbr de jour","=",{"$f":"IF(SUM(CL51:CL54)=0,\"\",SUM(CL51:CL54))","v":""},"Nbr de jour","=",{"$f":"IF(SUM(CO51:CO54)=0,\"\",SUM(CO51:CO54))","v":""},"Nbr de jour","=",{"$f":"IF(SUM(CR51:CR54)=0,\"\",SUM(CR51:CR54))","v":""},"Nbr de jour","=",{"$f":"IF(SUM(CU51:CU54)=0,\"\",SUM(CU51:CU54))","v":""},"Nbr de jour","=",{"$f":"IF(SUM(CX51:CX54)=0,\"\",SUM(CX51:CX54))","v":""},"Nbr de jour","=",{"$f":"IF(SUM(DA51:DA54)=0,\"\",SUM(DA51:DA54))","v":""},"Nbr de jour","=",{"$f":"IF(SUM(DD51:DD54)=0,\"\",SUM(DD51:DD54))","v":""},"Nbr de jour","=",{"$f":"IF(SUM(DG51:DG54)=0,\"\",SUM(DG51:DG54))","v":""},"Nbr de jour","=",{"$f":"IF(SUM(DJ51:DJ54)=0,\"\",SUM(DJ51:DJ54))","v":""},"Nbr de jour","=",{"$f":"IF(SUM(DM51:DM54)=0,\"\",SUM(DM51:DM54))","v":""},"Nbr de jour","=",{"$f":"IF(SUM(DP51:DP54)=0,\"\",SUM(DP51:DP54))","v":""},"Nbr de jour","=",{"$f":"IF(SUM(DS51:DS54)=0,\"\",SUM(DS51:DS54))","v":""},"Nbr de jour","=",{"$f":"IF(SUM(DV51:DV54)=0,\"\",SUM(DV51:DV54))","v":""},"Nbr de jour","=",{"$f":"IF(SUM(DY51:DY54)=0,\"\",SUM(DY51:DY54))","v":""},"Nbr de jour","=",{"$f":"IF(SUM(EB51:EB54)=0,\"\",SUM(EB51:EB54))","v":""}]
[null,null,null,{"$f":"IF(D58=\"\",\"\",D58)","v":""},"","","","","","P7","","",""]
[null,null,null,{"$f":"IF(D58=\"\",\"\",D58)","v":""},"","","","","","P7","","",""]
["Numéro 07","Nom affaire","EXE",null,null,null,null,null,null,"P7"]
[null,null,null,{"$f":"IF(D58=\"\",\"\",D58)","v":""},"","","","","","P7","","",""]
[null,"Temps passé en jour =",null,{"$f":"IF(D58=\"\",\"\",D58)","v":""},"","","","","","P7","","","","Nbr de jour","=",{"$f":"IF(SUM(O56:O59)=0,\"\",SUM(O56:O59))","v":""},"Nbr de jour","=",{"$f":"IF(SUM(R56:R59)=0,\"\",SUM(R56:R59))","v":""},"Nbr de jour","=",{"$f":"IF(SUM(U56:U59)=0,\"\",SUM(U56:U59))","v":""},"Nbr de jour","=",{"$f":"IF(SUM(X56:X59)=0,\"\",SUM(X56:X59))","v":""},"Nbr de jour","=",{"$f":"IF(SUM(AA56:AA59)=0,\"\",SUM(AA56:AA59))","v":""},"Nbr de jour","=",{"$f":"IF(SUM(AD56:AD59)=0,\"\",SUM(AD56:AD59))","v":""},"Nbr de jour","=",{"$f":"IF(SUM(AG56:AG59)=0,\"\",SUM(AG56:AG59))","v":""},"Nbr de jour","=",{"$f":"IF(SUM(AJ56:AJ59)=0,\"\",SUM(AJ56:AJ59))","v":""},"Nbr de jour","=",{"$f":"IF(SUM(AM56:AM59)=0,\"\",SUM(AM56:AM59))","v":""},"Nbr de jour","=",{"$f":"IF(SUM(AP56:AP59)=0,\"\",SUM(AP56:AP59))","v":""},"Nbr de jour","=",{"$f":"IF(SUM(AS56:AS59)=0,\"\",SUM(AS56:AS59))","v":""},"Nbr de jour","=",{"$f":"IF(SUM(AV56:AV59)=0,\"\",SUM(AV56:AV59))","v":""},"Nbr de jour","=",{"$f":"IF(SUM(AY56:AY59)=0,\"\",SUM(AY56:AY59))","v":""},"Nbr de jour","=",{"$f":"IF(SUM(BB56:BB59)=0,\"\",SUM(BB56:BB59))","v":""},"Nbr de jour","=",{"$f":"IF(SUM(BE56:BE59)=0,\"\",SUM(BE56:BE59))","v":""},"Nbr de jour","=",{"$f":"IF(SUM(BH56:BH59)=0,\"\",SUM(BH56:BH59))","v":""},"Nbr de jour","=",{"$f":"IF(SUM(BK56:BK59)=0,\"\",SUM(BK56:BK59))","v":""},"Nbr de jour","=",{"$f":"IF(SUM(BN56:BN59)=0,\"\",SUM(BN56:BN59))","v":""},"Nbr de jour","=",{"$f":"IF(SUM(BQ56:BQ59)=0,\"\",SUM(BQ56:BQ59))","v":""},"Nbr de jour","=",{"$f":"IF(SUM(BT56:BT59)=0,\"\",SUM(BT56:BT59))","v":""},"Nbr de jour","=",{"$f":"IF(SUM(BW56:BW59)=0,\"\",SUM(BW56:BW59))","v":""},"Nbr de jour","=",{"$f":"IF(SUM(BZ56:BZ59)=0,\"\",SUM(BZ56:BZ59))","v":""},"Nbr de jour","=",{"$f":"IF(SUM(CC56:CC59)=0,\"\",SUM(CC56:CC59))","v":""},"Nbr de jour","=",{"$f":"IF(SUM(CF56:CF59)=0,\"\",SUM(CF56:CF59))","v":""},"Nbr de jour","=",{"$f":"IF(SUM(CI56:CI59)=0,\"\",SUM(CI56:CI59))","v":""},"Nbr de jour","=",{"$f":"IF(SUM(CL56:CL59)=0,\"\",SUM(CL56:CL59))","v":""},"Nbr de jour","=",{"$f":"IF(SUM(CO56:CO59)=0,\"\",SUM(CO56:CO59))","v":""},"Nbr de jour","=",{"$f":"IF(SUM(CR56:CR59)=0,\"\",SUM(CR56:CR59))","v":""},"Nbr de jour","=",{"$f":"IF(SUM(CU56:CU59)=0,\"\",SUM(CU56:CU59))","v":""},"Nbr de jour","=",{"$f":"IF(SUM(CX56:CX59)=0,\"\",SUM(CX56:CX59))","v":""},"Nbr de jour","=",{"$f":"IF(SUM(DA56:DA59)=0,\"\",SUM(DA56:DA59))","v":""},"Nbr de jour","=",{"$f":"IF(SUM(DD56:DD59)=0,\"\",SUM(DD56:DD59))","v":""},"Nbr de jour","=",{"$f":"IF(SUM(DG56:DG59)=0,\"\",SUM(DG56:DG59))","v":""},"Nbr de jour","=",{"$f":"IF(SUM(DJ56:DJ59)=0,\"\",SUM(DJ56:DJ59))","v":""},"Nbr de jour","=",{"$f":"IF(SUM(DM56:DM59)=0,\"\",SUM(DM56:DM59))","v":""},"Nbr de jour","=",{"$f":"IF(SUM(DP56:DP59)=0,\"\",SUM(DP56:DP59))","v":""},"Nbr de jour","=",{"$f":"IF(SUM(DS56:DS59)=0,\"\",SUM(DS56:DS59))","v":""},"Nbr de jour","=",{"$f":"IF(SUM(DV56:DV59)=0,\"\",SUM(DV56:DV59))","v":""},"Nbr de jour","=",{"$f":"IF(SUM(DY56:DY59)=0,\"\",SUM(DY56:DY59))","v":""},"Nbr de jour","=",{"$f":"IF(SUM(EB56:EB59)=0,\"\",SUM(EB56:EB59))","v":""}]
[null,null,null,{"$f":"IF(D63=\"\",\"\",D63)","v":"P1"},"","","","","","","","",""]
[null,null,null,{"$f":"IF(D63=\"\",\"\",D63)","v":"P1"},"","","","","","","","",""]
["Numéro 08","Nom affaire","EXE","P1"]
[null,null,null,{"$f":"IF(D63=\"\",\"\",D63)","v":"P1"},"","","","","","","","",""]
[null,"Temps passé en jour =",null,{"$f":"IF(D63=\"\",\"\",D63)","v":"P1"},"","","","","","","","","","Nbr de jour","=",{"$f":"IF(SUM(O61:O64)=0,\"\",SUM(O61:O64))","v":""},"Nbr de jour","=",{"$f":"IF(SUM(R61:R64)=0,\"\",SUM(R61:R64))","v":""},"Nbr de jour","=",{"$f":"IF(SUM(U61:U64)=0,\"\",SUM(U61:U64))","v":""},"Nbr de jour","=",{"$f":"IF(SUM(X61:X64)=0,\"\",SUM(X61:X64))","v":""},"Nbr de jour","=",{"$f":"IF(SUM(AA61:AA64)=0,\"\",SUM(AA61:AA64))","v":""},"Nbr de jour","=",{"$f":"IF(SUM(AD61:AD64)=0,\"\",SUM(AD61:AD64))","v":""},"Nbr de jour","=",{"$f":"IF(SUM(AG61:AG64)=0,\"\",SUM(AG61:AG64))","v":""},"Nbr de jour","=",{"$f":"IF(SUM(AJ61:AJ64)=0,\"\",SUM(AJ61:AJ64))","v":""},"Nbr de jour","=",{"$f":"IF(SUM(AM61:AM64)=0,\"\",SUM(AM61:AM64))","v":""},"Nbr de jour","=",{"$f":"IF(SUM(AP61:AP64)=0,\"\",SUM(AP61:AP64))","v":""},"Nbr de jour","=",{"$f":"IF(SUM(AS61:AS64)=0,\"\",SUM(AS61:AS64))","v":""},"Nbr de jour","=",{"$f":"IF(SUM(AV61:AV64)=0,\"\",SUM(AV61:AV64))","v":""},"Nbr de jour","=",{"$f":"IF(SUM(AY61:AY64)=0,\"\",SUM(AY61:AY64))","v":""},"Nbr de jour","=",{"$f":"IF(SUM(BB61:BB64)=0,\"\",SUM(BB61:BB64))","v":""},"Nbr de jour","=",{"$f":"IF(SUM(BE61:BE64)=0,\"\",SUM(BE61:BE64))","v":""},"Nbr de jour","=",{"$f":"IF(SUM(BH61:BH64)=0,\"\",SUM(BH61:BH64))","v":""},"Nbr de jour","=",{"$f":"IF(SUM(BK61:BK64)=0,\"\",SUM(BK61:BK64))","v":""},"Nbr de jour","=",{"$f":"IF(SUM(BN61:BN64)=0,\"\",SUM(BN61:BN64))","v":""},"Nbr de jour","=",{"$f":"IF(SUM(BQ61:BQ64)=0,\"\",SUM(BQ61:BQ64))","v":""},"Nbr de jour","=",{"$f":"IF(SUM(BT61:BT64)=0,\"\",SUM(BT61:BT64))","v":""},"Nbr de jour","=",{"$f":"IF(SUM(BW61:BW64)=0,\"\",SUM(BW61:BW64))","v":""},"Nbr de jour","=",{"$f":"IF(SUM(BZ61:BZ64)=0,\"\",SUM(BZ61:BZ64))","v":""},"Nbr de jour","=",{"$f":"IF(SUM(CC61:CC64)=0,\"\",SUM(CC61:CC64))","v":""},"Nbr de jour","=",{"$f":"IF(SUM(CF61:CF64)=0,\"\",SUM(CF61:CF64))","v":""},"Nbr de jour","=",{"$f":"IF(SUM(CI61:CI64)=0,\"\",SUM(CI61:CI64))","v":""},"Nbr de jour","=",{"$f":"IF(SUM(CL61:CL64)=0,\"\",SUM(CL61:CL64))","v":""},"Nbr de jour","=",{"$f":"IF(SUM(CO61:CO64)=0,\"\",SUM(CO61:CO64))","v":""},"Nbr de jour","=",{"$f":"IF(SUM(CR61:CR64)=0,\"\",SUM(CR61:CR64))","v":""},"Nbr de jour","=",{"$f":"IF(SUM(CU61:CU64)=0,\"\",SUM(CU61:CU64))","v":""},"Nbr de jour","=",{"$f":"IF(SUM(CX61:CX64)=0,\"\",SUM(CX61:CX64))","v":""},"Nbr de jour","=",{"$f":"IF(SUM(DA61:DA64)=0,\"\",SUM(DA61:DA64))","v":""},"Nbr de jour","=",{"$f":"IF(SUM(DD61:DD64)=0,\"\",SUM(DD61:DD64))","v":""},"Nbr de jour","=",{"$f":"IF(SUM(DG61:DG64)=0,\"\",SUM(DG61:DG64))","v":""},"Nbr de jour","=",{"$f":"IF(SUM(DJ61:DJ64)=0,\"\",SUM(DJ61:DJ64))","v":""},"Nbr de jour","=",{"$f":"IF(SUM(DM61:DM64)=0,\"\",SUM(DM61:DM64))","v":""},"Nbr de jour","=",{"$f":"IF(SUM(DP61:DP64)=0,\"\",SUM(DP61:DP64))","v":""},"Nbr de jour","=",{"$f":"IF(SUM(DS61:DS64)=0,\"\",SUM(DS61:DS64))","v":""},"Nbr de jour","=",{"$f":"IF(SUM(DV61:DV64)=0,\"\",SUM(DV61:DV64))","v":""},"Nbr de jour","=",{"$f":"IF(SUM(DY61:DY64)=0,\"\",SUM(DY61:DY64))","v":""},"Nbr de jour","=",{"$f":"IF(SUM(EB61:EB64)=0,\"\",SUM(EB61:EB64))","v":""}]
[null,null,null,{"$f":"IF(D68=\"\",\"\",D68)","v":""},"","P3","","","","","","",""]
[null,null,null,{"$f":"IF(D68=\"\",\"\",D68)","v":""},"","P3","","","","","","",""]
["Numéro 09","Nom affaire","DCE",null,null,"P3"]
[null,null,null,{"$f":"IF(D68=\"\",\"\",D68)","v":""},"","P3","","","","","","",""]
[null,"Temps passé en jour =",null,{"$f":"IF(D68=\"\",\"\",D68)","v":""},"","P3","","","","","","","","Nbr de jour","=",{"$f":"IF(SUM(O66:O69)=0,\"\",SUM(O66:O69))","v":""},"Nbr de jour","=",{"$f":"IF(SUM(R66:R69)=0,\"\",SUM(R66:R69))","v":""},"Nbr de jour","=",{"$f":"IF(SUM(U66:U69)=0,\"\",SUM(U66:U69))","v":""},"Nbr de jour","=",{"$f":"IF(SUM(X66:X69)=0,\"\",SUM(X66:X69))","v":""},"Nbr de jour","=",{"$f":"IF(SUM(AA66:AA69)=0,\"\",SUM(AA66:AA69))","v":""},"Nbr de jour","=",{"$f":"IF(SUM(AD66:AD69)=0,\"\",SUM(AD66:AD69))","v":""},"Nbr de jour","=",{"$f":"IF(SUM(AG66:AG69)=0,\"\",SUM(AG66:AG69))","v":""},"Nbr de jour","=",{"$f":"IF(SUM(AJ66:AJ69)=0,\"\",SUM(AJ66:AJ69))","v":""},"Nbr de jour","=",{"$f":"IF(SUM(AM66:AM69)=0,\"\",SUM(AM66:AM69))","v":""},"Nbr de jour","=",{"$f":"IF(SUM(AP66:AP69)=0,\"\",SUM(AP66:AP69))","v":""},"Nbr de jour","=",{"$f":"IF(SUM(AS66:AS69)=0,\"\",SUM(AS66:AS69))","v":""},"Nbr de jour","=",{"$f":"IF(SUM(AV66:AV69)=0,\"\",SUM(AV66:AV69))","v":""},"Nbr de jour","=",{"$f":"IF(SUM(AY66:AY69)=0,\"\",SUM(AY66:AY69))","v":""},"Nbr de jour","=",{"$f":"IF(SUM(BB66:BB69)=0,\"\",SUM(BB66:BB69))","v":""},"Nbr de jour","=",{"$f":"IF(SUM(BE66:BE69)=0,\"\",SUM(BE66:BE69))","v":""},"Nbr de jour","=",{"$f":"IF(SUM(BH66:BH69)=0,\"\",SUM(BH66:BH69))","v":""},"Nbr de jour","=",{"$f":"IF(SUM(BK66:BK69)=0,\"\",SUM(BK66:BK69))","v":""},"Nbr de jour","=",{"$f":"IF(SUM(BN66:BN69)=0,\"\",SUM(BN66:BN69))","v":""},"Nbr de jour","=",{"$f":"IF(SUM(BQ66:BQ69)=0,\"\",SUM(BQ66:BQ69))","v":""},"Nbr de jour","=",{"$f":"IF(SUM(BT66:BT69)=0,\"\",SUM(BT66:BT69))","v":""},"Nbr de jour","=",{"$f":"IF(SUM(BW66:BW69)=0,\"\",SUM(BW66:BW69))","v":""},"Nbr de jour","=",{"$f":"IF(SUM(BZ66:BZ69)=0,\"\",SUM(BZ66:BZ69))","v":""},"Nbr de jour","=",{"$f":"IF(SUM(CC66:CC69)=0,\"\",SUM(CC66:CC69))","v":""},"Nbr de jour","=",{"$f":"IF(SUM(CF66:CF69)=0,\"\",SUM(CF66:CF69))","v":""},"Nbr de jour","=",{"$f":"IF(SUM(CI66:CI69)=0,\"\",SUM(CI66:CI69))","v":""},"Nbr de jour","=",{"$f":"IF(SUM(CL66:CL69)=0,\"\",SUM(CL66:CL69))","v":""},"Nbr de jour","=",{"$f":"IF(SUM(CO66:CO69)=0,\"\",SUM(CO66:CO69))","v":""},"Nbr de jour","=",{"$f":"IF(SUM(CR66:CR69)=0,\"\",SUM(CR66:CR69))","v":""},"Nbr de jour","=",{"$f":"IF(SUM(CU66:CU69)=0,\"\",SUM(CU66:CU69))","v":""},"Nbr de jour","=",{"$f":"IF(SUM(CX66:CX69)=0,\"\",SUM(CX66:CX69))","v":""},"Nbr de jour","=",{"$f":"IF(SUM(DA66:DA69)=0,\"\",SUM(DA66:DA69))","v":""},"Nbr de jour","=",{"$f":"IF(SUM(DD66:DD69)=0,\"\",SUM(DD66:DD69))","v":""},"Nbr de jour","=",{"$f":"IF(SUM(DG66:DG69)=0,\"\",SUM(DG66:DG69))","v":""},"Nbr de jour","=",{"$f":"IF(SUM(DJ66:DJ69)=0,\"\",SUM(DJ66:DJ69))","v":""},"Nbr de jour","=",{"$f":"IF(SUM(DM66:DM69)=0,\"\",SUM(DM66:DM69))","v":""},"Nbr de jour","=",{"$f":"IF(SUM(DP66:DP69)=0,\"\",SUM(DP66:DP69))","v":""},"Nbr de jour","=",{"$f":"IF(SUM(DS66:DS69)=0,\"\",SUM(DS66:DS69))","v":""},"Nbr de jour","=",{"$f":"IF(SUM(DV66:DV69)=0,\"\",SUM(DV66:DV69))","v":""},"Nbr de jour","=",{"$f":"IF(SUM(DY66:DY69)=0,\"\",SUM(DY66:DY69))","v":""},"Nbr de jour","=",{"$f":"IF(SUM(EB66:EB69)=0,\"\",SUM(EB66:EB69))","v":""}]
[null,null,null,{"$f":"IF(D73=\"\",\"\",D73)","v":""},"","P3","","","","","","",""]
[null,null,null,{"$f":"IF(D73=\"\",\"\",D73)","v":""},"","P3","","","","","","",""]
["Numéro 10","Nom affaire","DCE",null,null,"P3"]
[null,null,null,{"$f":"IF(D73=\"\",\"\",D73)","v":""},"","P3","","","","","","",""]
[null,"Temps passé en jour =",null,{"$f":"IF(D73=\"\",\"\",D73)","v":""},"","P3","","","","","","","","Nbr de jour","=",{"$f":"IF(SUM(O71:O74)=0,\"\",SUM(O71:O74))","v":""},"Nbr de jour","=",{"$f":"IF(SUM(R71:R74)=0,\"\",SUM(R71:R74))","v":""},"Nbr de jour","=",{"$f":"IF(SUM(U71:U74)=0,\"\",SUM(U71:U74))","v":""},"Nbr de jour","=",{"$f":"IF(SUM(X71:X74)=0,\"\",SUM(X71:X74))","v":""},"Nbr de jour","=",{"$f":"IF(SUM(AA71:AA74)=0,\"\",SUM(AA71:AA74))","v":""},"Nbr de jour","=",{"$f":"IF(SUM(AD71:AD74)=0,\"\",SUM(AD71:AD74))","v":""},"Nbr de jour","=",{"$f":"IF(SUM(AG71:AG74)=0,\"\",SUM(AG71:AG74))","v":""},"Nbr de jour","=",{"$f":"IF(SUM(AJ71:AJ74)=0,\"\",SUM(AJ71:AJ74))","v":""},"Nbr de jour","=",{"$f":"IF(SUM(AM71:AM74)=0,\"\",SUM(AM71:AM74))","v":""},"Nbr de jour","=",{"$f":"IF(SUM(AP71:AP74)=0,\"\",SUM(AP71:AP74))","v":""},"Nbr de jour","=",{"$f":"IF(SUM(AS71:AS74)=0,\"\",SUM(AS71:AS74))","v":""},"Nbr de jour","=",{"$f":"IF(SUM(AV71:AV74)=0,\"\",SUM(AV71:AV74))","v":""},"Nbr de jour","=",{"$f":"IF(SUM(AY71:AY74)=0,\"\",SUM(AY71:AY74))","v":""},"Nbr de jour","=",{"$f":"IF(SUM(BB71:BB74)=0,\"\",SUM(BB71:BB74))","v":""},"Nbr de jour","=",{"$f":"IF(SUM(BE71:BE74)=0,\"\",SUM(BE71:BE74))","v":""},"Nbr de jour","=",{"$f":"IF(SUM(BH71:BH74)=0,\"\",SUM(BH71:BH74))","v":""},"Nbr de jour","=",{"$f":"IF(SUM(BK71:BK74)=0,\"\",SUM(BK71:BK74))","v":""},"Nbr de jour","=",{"$f":"IF(SUM(BN71:BN74)=0,\"\",SUM(BN71:BN74))","v":""},"Nbr de jour","=",{"$f":"IF(SUM(BQ71:BQ74)=0,\"\",SUM(BQ71:BQ74))","v":""},"Nbr de jour","=",{"$f":"IF(SUM(BT71:BT74)=0,\"\",SUM(BT71:BT74))","v":""},"Nbr de jour","=",{"$f":"IF(SUM(BW71:BW74)=0,\"\",SUM(BW71:BW74))","v":""},"Nbr de jour","=",{"$f":"IF(SUM(BZ71:BZ74)=0,\"\",SUM(BZ71:BZ74))","v":""},"Nbr de jour","=",{"$f":"IF(SUM(CC71:CC74)=0,\"\",SUM(CC71:CC74))","v":""},"Nbr de jour","=",{"$f":"IF(SUM(CF71:CF74)=0,\"\",SUM(CF71:CF74))","v":""},"Nbr de jour","=",{"$f":"IF(SUM(CI71:CI74)=0,\"\",SUM(CI71:CI74))","v":""},"Nbr de jour","=",{"$f":"IF(SUM(CL71:CL74)=0,\"\",SUM(CL71:CL74))","v":""},"Nbr de jour","=",{"$f":"IF(SUM(CO71:CO74)=0,\"\",SUM(CO71:CO74))","v":""},"Nbr de jour","=",{"$f":"IF(SUM(CR71:CR74)=0,\"\",SUM(CR71:CR74))","v":""},"Nbr de jour","=",{"$f":"IF(SUM(CU71:CU74)=0,\"\",SUM(CU71:CU74))","v":""},"Nbr de jour","=",{"$f":"IF(SUM(CX71:CX74)=0,\"\",SUM(CX71:CX74))","v":""},"Nbr de jour","=",{"$f":"IF(SUM(DA71:DA74)=0,\"\",SUM(DA71:DA74))","v":""},"Nbr de jour","=",{"$f":"IF(SUM(DD71:DD74)=0,\"\",SUM(DD71:DD74))","v":""},"Nbr de jour","=",{"$f":"IF(SUM(DG71:DG74)=0,\"\",SUM(DG71:DG74))","v":""},"Nbr de jour","=",{"$f":"IF(SUM(DJ71:DJ74)=0,\"\",SUM(DJ71:DJ74))","v":""},"Nbr de jour","=",{"$f":"IF(SUM(DM71:DM74)=0,\"\",SUM(DM71:DM74))","v":""},"Nbr de jour","=",{"$f":"IF(SUM(DP71:DP74)=0,\"\",SUM(DP71:DP74))","v":""},"Nbr de jour","=",{"$f":"IF(SUM(DS71:DS74)=0,\"\",SUM(DS71:DS74))","v":""},"Nbr de jour","=",{"$f":"IF(SUM(DV71:DV74)=0,\"\",SUM(DV71:DV74))","v":""},"Nbr de jour","=",{"$f":"IF(SUM(DY71:DY74)=0,\"\",SUM(DY71:DY74))","v":""},"Nbr de jour","=",{"$f":"IF(SUM(EB71:EB74)=0,\"\",SUM(EB71:EB74))","v":""}]
[null,null,null,{"$f":"IF(D78=\"\",\"\",D78)","v":""},"","P3","","","","","","",""]
[null,null,null,{"$f":"IF(D78=\"\",\"\",D78)","v":""},"","P3","","","","","","",""]
["Numéro 11","Nom affaire","EXE",null,null,"P3"]
[null,null,null,{"$f":"IF(D78=\"\",\"\",D78)","v":""},"","P3","","","","","","",""]
[null,"Temps passé en jour =",null,{"$f":"IF(D78=\"\",\"\",D78)","v":""},"","P3","","","","","","","","Nbr de jour","=",{"$f":"IF(SUM(O76:O79)=0,\"\",SUM(O76:O79))","v":""},"Nbr de jour","=",{"$f":"IF(SUM(R76:R79)=0,\"\",SUM(R76:R79))","v":""},"Nbr de jour","=",{"$f":"IF(SUM(U76:U79)=0,\"\",SUM(U76:U79))","v":""},"Nbr de jour","=",{"$f":"IF(SUM(X76:X79)=0,\"\",SUM(X76:X79))","v":""},"Nbr de jour","=",{"$f":"IF(SUM(AA76:AA79)=0,\"\",SUM(AA76:AA79))","v":""},"Nbr de jour","=",{"$f":"IF(SUM(AD76:AD79)=0,\"\",SUM(AD76:AD79))","v":""},"Nbr de jour","=",{"$f":"IF(SUM(AG76:AG79)=0,\"\",SUM(AG76:AG79))","v":""},"Nbr de jour","=",{"$f":"IF(SUM(AJ76:AJ79)=0,\"\",SUM(AJ76:AJ79))","v":""},"Nbr de jour","=",{"$f":"IF(SUM(AM76:AM79)=0,\"\",SUM(AM76:AM79))","v":""},"Nbr de jour","=",{"$f":"IF(SUM(AP76:AP79)=0,\"\",SUM(AP76:AP79))","v":""},"Nbr de jour","=",{"$f":"IF(SUM(AS76:AS79)=0,\"\",SUM(AS76:AS79))","v":""},"Nbr de jour","=",{"$f":"IF(SUM(AV76:AV79)=0,\"\",SUM(AV76:AV79))","v":""},"Nbr de jour","=",{"$f":"IF(SUM(AY76:AY79)=0,\"\",SUM(AY76:AY79))","v":""},"Nbr de jour","=",{"$f":"IF(SUM(BB76:BB79)=0,\"\",SUM(BB76:BB79))","v":""},"Nbr de jour","=",{"$f":"IF(SUM(BE76:BE79)=0,\"\",SUM(BE76:BE79))","v":""},"Nbr de jour","=",{"$f":"IF(SUM(BH76:BH79)=0,\"\",SUM(BH76:BH79))","v":""},"Nbr de jour","=",{"$f":"IF(SUM(BK76:BK79)=0,\"\",SUM(BK76:BK79))","v":""},"Nbr de jour","=",{"$f":"IF(SUM(BN76:BN79)=0,\"\",SUM(BN76:BN79))","v":""},"Nbr de jour","=",{"$f":"IF(SUM(BQ76:BQ79)=0,\"\",SUM(BQ76:BQ79))","v":""},"Nbr de jour","=",{"$f":"IF(SUM(BT76:BT79)=0,\"\",SUM(BT76:BT79))","v":""},"Nbr de jour","=",{"$f":"IF(SUM(BW76:BW79)=0,\"\",SUM(BW76:BW79))","v":""},"Nbr de jour","=",{"$f":"IF(SUM(BZ76:BZ79)=0,\"\",SUM(BZ76:BZ79))","v":""},"Nbr de jour","=",{"$f":"IF(SUM(CC76:CC79)=0,\"\",SUM(CC76:CC79))","v":""},"Nbr de jour","=",{"$f":"IF(SUM(CF76:CF79)=0,\"\",SUM(CF76:CF79))","v":""},"Nbr de jour","=",{"$f":"IF(SUM(CI76:CI79)=0,\"\",SUM(CI76:CI79))","v":""},"Nbr de jour","=",{"$f":"IF(SUM(CL76:CL79)=0,\"\",SUM(CL76:CL79))","v":""},"Nbr de jour","=",{"$f":"IF(SUM(CO76:CO79)=0,\"\",SUM(CO76:CO79))","v":""},"Nbr de jour","=",{"$f":"IF(SUM(CR76:CR79)=0,\"\",SUM(CR76:CR79))","v":""},"Nbr de jour","=",{"$f":"IF(SUM(CU76:CU79)=0,\"\",SUM(CU76:CU79))","v":""},"Nbr de jour","=",{"$f":"IF(SUM(CX76:CX79)=0,\"\",SUM(CX76:CX79))","v":""},"Nbr de jour","=",{"$f":"IF(SUM(DA76:DA79)=0,\"\",SUM(DA76:DA79))","v":""},"Nbr de jour","=",{"$f":"IF(SUM(DD76:DD79)=0,\"\",SUM(DD76:DD79))","v":""},"Nbr de jour","=",{"$f":"IF(SUM(DG76:DG79)=0,\"\",SUM(DG76:DG79))","v":""},"Nbr de jour","=",{"$f":"IF(SUM(DJ76:DJ79)=0,\"\",SUM(DJ76:DJ79))","v":""},"Nbr de jour","=",{"$f":"IF(SUM(DM76:DM79)=0,\"\",SUM(DM76:DM79))","v":""},"Nbr de jour","=",{"$f":"IF(SUM(DP76:DP79)=0,\"\",SUM(DP76:DP79))","v":""},"Nbr de jour","=",{"$f":"IF(SUM(DS76:DS79)=0,\"\",SUM(DS76:DS79))","v":""},"Nbr de jour","=",{"$f":"IF(SUM(DV76:DV79)=0,\"\",SUM(DV76:DV79))","v":""},"Nbr de jour","=",{"$f":"IF(SUM(DY76:DY79)=0,\"\",SUM(DY76:DY79))","v":""},"Nbr de jour","=",{"$f":"IF(SUM(EB76:EB79)=0,\"\",SUM(EB76:EB79))","v":""}]
[null,null,null,{"$f":"IF(D83=\"\",\"\",D83)","v":""},"","P3","","","","","","",""]
[null,null,null,{"$f":"IF(D83=\"\",\"\",D83)","v":""},"","P3","","","","","","",""]
["Numéro 12","Nom affaire","EXE",null,null,"P3"]
[null,null,null,{"$f":"IF(D83=\"\",\"\",D83)","v":""},"","P3","","","","","","",""]
[null,"Temps passé en jour =",null,{"$f":"IF(D83=\"\",\"\",D83)","v":""},"","P3","","","","","","","","Nbr de jour","=",{"$f":"IF(SUM(O81:O84)=0,\"\",SUM(O81:O84))","v":""},"Nbr de jour","=",{"$f":"IF(SUM(R81:R84)=0,\"\",SUM(R81:R84))","v":""},"Nbr de jour","=",{"$f":"IF(SUM(U81:U84)=0,\"\",SUM(U81:U84))","v":""},"Nbr de jour","=",{"$f":"IF(SUM(X81:X84)=0,\"\",SUM(X81:X84))","v":""},"Nbr de jour","=",{"$f":"IF(SUM(AA81:AA84)=0,\"\",SUM(AA81:AA84))","v":""},"Nbr de jour","=",{"$f":"IF(SUM(AD81:AD84)=0,\"\",SUM(AD81:AD84))","v":""},"Nbr de jour","=",{"$f":"IF(SUM(AG81:AG84)=0,\"\",SUM(AG81:AG84))","v":""},"Nbr de jour","=",{"$f":"IF(SUM(AJ81:AJ84)=0,\"\",SUM(AJ81:AJ84))","v":""},"Nbr de jour","=",{"$f":"IF(SUM(AM81:AM84)=0,\"\",SUM(AM81:AM84))","v":""},"Nbr de jour","=",{"$f":"IF(SUM(AP81:AP84)=0,\"\",SUM(AP81:AP84))","v":""},"Nbr de jour","=",{"$f":"IF(SUM(AS81:AS84)=0,\"\",SUM(AS81:AS84))","v":""},"Nbr de jour","=",{"$f":"IF(SUM(AV81:AV84)=0,\"\",SUM(AV81:AV84))","v":""},"Nbr de jour","=",{"$f":"IF(SUM(AY81:AY84)=0,\"\",SUM(AY81:AY84))","v":""},"Nbr de jour","=",{"$f":"IF(SUM(BB81:BB84)=0,\"\",SUM(BB81:BB84))","v":""},"Nbr de jour","=",{"$f":"IF(SUM(BE81:BE84)=0,\"\",SUM(BE81:BE84))","v":""},"Nbr de jour","=",{"$f":"IF(SUM(BH81:BH84)=0,\"\",SUM(BH81:BH84))","v":""},"Nbr de jour","=",{"$f":"IF(SUM(BK81:BK84)=0,\"\",SUM(BK81:BK84))","v":""},"Nbr de jour","=",{"$f":"IF(SUM(BN81:BN84)=0,\"\",SUM(BN81:BN84))","v":""},"Nbr de jour","=",{"$f":"IF(SUM(BQ81:BQ84)=0,\"\",SUM(BQ81:BQ84))","v":""},"Nbr de jour","=",{"$f":"IF(SUM(BT81:BT84)=0,\"\",SUM(BT81:BT84))","v":""},"Nbr de jour","=",{"$f":"IF(SUM(BW81:BW84)=0,\"\",SUM(BW81:BW84))","v":""},"Nbr de jour","=",{"$f":"IF(SUM(BZ81:BZ84)=0,\"\",SUM(BZ81:BZ84))","v":""},"Nbr de jour","=",{"$f":"IF(SUM(CC81:CC84)=0,\"\",SUM(CC81:CC84))","v":""},"Nbr de jour","=",{"$f":"IF(SUM(CF81:CF84)=0,\"\",SUM(CF81:CF84))","v":""},"Nbr de jour","=",{"$f":"IF(SUM(CI81:CI84)=0,\"\",SUM(CI81:CI84))","v":""},"Nbr de jour","=",{"$f":"IF(SUM(CL81:CL84)=0,\"\",SUM(CL81:CL84))","v":""},"Nbr de jour","=",{"$f":"IF(SUM(CO81:CO84)=0,\"\",SUM(CO81:CO84))","v":""},"Nbr de jour","=",{"$f":"IF(SUM(CR81:CR84)=0,\"\",SUM(CR81:CR84))","v":""},"Nbr de jour","=",{"$f":"IF(SUM(CU81:CU84)=0,\"\",SUM(CU81:CU84))","v":""},"Nbr de jour","=",{"$f":"IF(SUM(CX81:CX84)=0,\"\",SUM(CX81:CX84))","v":""},"Nbr de jour","=",{"$f":"IF(SUM(DA81:DA84)=0,\"\",SUM(DA81:DA84))","v":""},"Nbr de jour","=",{"$f":"IF(SUM(DD81:DD84)=0,\"\",SUM(DD81:DD84))","v":""},"Nbr de jour","=",{"$f":"IF(SUM(DG81:DG84)=0,\"\",SUM(DG81:DG84))","v":""},"Nbr de jour","=",{"$f":"IF(SUM(DJ81:DJ84)=0,\"\",SUM(DJ81:DJ84))","v":""},"Nbr de jour","=",{"$f":"IF(SUM(DM81:DM84)=0,\"\",SUM(DM81:DM84))","v":""},"Nbr de jour","=",{"$f":"IF(SUM(DP81:DP84)=0,\"\",SUM(DP81:DP84))","v":""},"Nbr de jour","=",{"$f":"IF(SUM(DS81:DS84)=0,\"\",SUM(DS81:DS84))","v":""},"Nbr de jour","=",{"$f":"IF(SUM(DV81:DV84)=0,\"\",SUM(DV81:DV84))","v":""},"Nbr de jour","=",{"$f":"IF(SUM(DY81:DY84)=0,\"\",SUM(DY81:DY84))","v":""},"Nbr de jour","=",{"$f":"IF(SUM(EB81:EB84)=0,\"\",SUM(EB81:EB84))","v":""}]
[null,null,null,{"$f":"IF(D88=\"\",\"\",D88)","v":""},"","P3","","","","","","",""]
[null,null,null,{"$f":"IF(D88=\"\",\"\",D88)","v":""},"","P3","","","","","","",""]
["Numéro 13","Nom affaire","DCE",null,null,"P3"]
[null,null,null,{"$f":"IF(D88=\"\",\"\",D88)","v":""},"","P3","","","","","","",""]
[null,"Temps passé en jour =",null,{"$f":"IF(D88=\"\",\"\",D88)","v":""},"","P3","","","","","","","","Nbr de jour","=",{"$f":"IF(SUM(O86:O89)=0,\"\",SUM(O86:O89))","v":""},"Nbr de jour","=",{"$f":"IF(SUM(R86:R89)=0,\"\",SUM(R86:R89))","v":""},"Nbr de jour","=",{"$f":"IF(SUM(U86:U89)=0,\"\",SUM(U86:U89))","v":""},"Nbr de jour","=",{"$f":"IF(SUM(X86:X89)=0,\"\",SUM(X86:X89))","v":""},"Nbr de jour","=",{"$f":"IF(SUM(AA86:AA89)=0,\"\",SUM(AA86:AA89))","v":""},"Nbr de jour","=",{"$f":"IF(SUM(AD86:AD89)=0,\"\",SUM(AD86:AD89))","v":""},"Nbr de jour","=",{"$f":"IF(SUM(AG86:AG89)=0,\"\",SUM(AG86:AG89))","v":""},"Nbr de jour","=",{"$f":"IF(SUM(AJ86:AJ89)=0,\"\",SUM(AJ86:AJ89))","v":""},"Nbr de jour","=",{"$f":"IF(SUM(AM86:AM89)=0,\"\",SUM(AM86:AM89))","v":""},"Nbr de jour","=",{"$f":"IF(SUM(AP86:AP89)=0,\"\",SUM(AP86:AP89))","v":""},"Nbr de jour","=",{"$f":"IF(SUM(AS86:AS89)=0,\"\",SUM(AS86:AS89))","v":""},"Nbr de jour","=",{"$f":"IF(SUM(AV86:AV89)=0,\"\",SUM(AV86:AV89))","v":""},"Nbr de jour","=",{"$f":"IF(SUM(AY86:AY89)=0,\"\",SUM(AY86:AY89))","v":""},"Nbr de jour","=",{"$f":"IF(SUM(BB86:BB89)=0,\"\",SUM(BB86:BB89))","v":""},"Nbr de jour","=",{"$f":"IF(SUM(BE86:BE89)=0,\"\",SUM(BE86:BE89))","v":""},"Nbr de jour","=",{"$f":"IF(SUM(BH86:BH89)=0,\"\",SUM(BH86:BH89))","v":""},"Nbr de jour","=",{"$f":"IF(SUM(BK86:BK89)=0,\"\",SUM(BK86:BK89))","v":""},"Nbr de jour","=",{"$f":"IF(SUM(BN86:BN89)=0,\"\",SUM(BN86:BN89))","v":""},"Nbr de jour","=",{"$f":"IF(SUM(BQ86:BQ89)=0,\"\",SUM(BQ86:BQ89))","v":""},"Nbr de jour","=",{"$f":"IF(SUM(BT86:BT89)=0,\"\",SUM(BT86:BT89))","v":""},"Nbr de jour","=",{"$f":"IF(SUM(BW86:BW89)=0,\"\",SUM(BW86:BW89))","v":""},"Nbr de jour","=",{"$f":"IF(SUM(BZ86:BZ89)=0,\"\",SUM(BZ86:BZ89))","v":""},"Nbr de jour","=",{"$f":"IF(SUM(CC86:CC89)=0,\"\",SUM(CC86:CC89))","v":""},"Nbr de jour","=",{"$f":"IF(SUM(CF86:CF89)=0,\"\",SUM(CF86:CF89))","v":""},"Nbr de jour","=",{"$f":"IF(SUM(CI86:CI89)=0,\"\",SUM(CI86:CI89))","v":""},"Nbr de jour","=",{"$f":"IF(SUM(CL86:CL89)=0,\"\",SUM(CL86:CL89))","v":""},"Nbr de jour","=",{"$f":"IF(SUM(CO86:CO89)=0,\"\",SUM(CO86:CO89))","v":""},"Nbr de jour","=",{"$f":"IF(SUM(CR86:CR89)=0,\"\",SUM(CR86:CR89))","v":""},"Nbr de jour","=",{"$f":"IF(SUM(CU86:CU89)=0,\"\",SUM(CU86:CU89))","v":""},"Nbr de jour","=",{"$f":"IF(SUM(CX86:CX89)=0,\"\",SUM(CX86:CX89))","v":""},"Nbr de jour","=",{"$f":"IF(SUM(DA86:DA89)=0,\"\",SUM(DA86:DA89))","v":""},"Nbr de jour","=",{"$f":"IF(SUM(DD86:DD89)=0,\"\",SUM(DD86:DD89))","v":""},"Nbr de jour","=",{"$f":"IF(SUM(DG86:DG89)=0,\"\",SUM(DG86:DG89))","v":""},"Nbr de jour","=",{"$f":"IF(SUM(DJ86:DJ89)=0,\"\",SUM(DJ86:DJ89))","v":""},"Nbr de jour","=",{"$f":"IF(SUM(DM86:DM89)=0,\"\",SUM(DM86:DM89))","v":""},"Nbr de jour","=",{"$f":"IF(SUM(DP86:DP89)=0,\"\",SUM(DP86:DP89))","v":""},"Nbr de jour","=",{"$f":"IF(SUM(DS86:DS89)=0,\"\",SUM(DS86:DS89))","v":""},"Nbr de jour","=",{"$f":"IF(SUM(DV86:DV89)=0,\"\",SUM(DV86:DV89))","v":""},"Nbr de jour","=",{"$f":"IF(SUM(DY86:DY89)=0,\"\",SUM(DY86:DY89))","v":""},"Nbr de jour","=",{"$f":"IF(SUM(EB86:EB89)=0,\"\",SUM(EB86:EB89))","v":""}]
[null,null,null,{"$f":"IF(D93=\"\",\"\",D93)","v":""},"","P3","","P5","","","","",""]
[null,null,null,{"$f":"IF(D93=\"\",\"\",D93)","v":""},"","P3","","P5","","","","",""]
["Numéro 14","Nom affaire","DCE",null,null,"P3",null,"P5"]
[null,null,null,{"$f":"IF(D93=\"\",\"\",D93)","v":""},"","P3","","P5","","","","",""]
[null,"Temps passé en jour =",null,{"$f":"IF(D93=\"\",\"\",D93)","v":""},"","P3","","P5","","","","","","Nbr de jour","=",{"$f":"IF(SUM(O91:O94)=0,\"\",SUM(O91:O94))","v":""},"Nbr de jour","=",{"$f":"IF(SUM(R91:R94)=0,\"\",SUM(R91:R94))","v":""},"Nbr de jour","=",{"$f":"IF(SUM(U91:U94)=0,\"\",SUM(U91:U94))","v":""},"Nbr de jour","=",{"$f":"IF(SUM(X91:X94)=0,\"\",SUM(X91:X94))","v":""},"Nbr de jour","=",{"$f":"IF(SUM(AA91:AA94)=0,\"\",SUM(AA91:AA94))","v":""},"Nbr de jour","=",{"$f":"IF(SUM(AD91:AD94)=0,\"\",SUM(AD91:AD94))","v":""},"Nbr de jour","=",{"$f":"IF(SUM(AG91:AG94)=0,\"\",SUM(AG91:AG94))","v":""},"Nbr de jour","=",{"$f":"IF(SUM(AJ91:AJ94)=0,\"\",SUM(AJ91:AJ94))","v":""},"Nbr de jour","=",{"$f":"IF(SUM(AM91:AM94)=0,\"\",SUM(AM91:AM94))","v":""},"Nbr de jour","=",{"$f":"IF(SUM(AP91:AP94)=0,\"\",SUM(AP91:AP94))","v":""},"Nbr de jour","=",{"$f":"IF(SUM(AS91:AS94)=0,\"\",SUM(AS91:AS94))","v":""},"Nbr de jour","=",{"$f":"IF(SUM(AV91:AV94)=0,\"\",SUM(AV91:AV94))","v":""},"Nbr de jour","=",{"$f":"IF(SUM(AY91:AY94)=0,\"\",SUM(AY91:AY94))","v":""},"Nbr de jour","=",{"$f":"IF(SUM(BB91:BB94)=0,\"\",SUM(BB91:BB94))","v":""},"Nbr de jour","=",{"$f":"IF(SUM(BE91:BE94)=0,\"\",SUM(BE91:BE94))","v":""},"Nbr de jour","=",{"$f":"IF(SUM(BH91:BH94)=0,\"\",SUM(BH91:BH94))","v":""},"Nbr de jour","=",{"$f":"IF(SUM(BK91:BK94)=0,\"\",SUM(BK91:BK94))","v":""},"Nbr de jour","=",{"$f":"IF(SUM(BN91:BN94)=0,\"\",SUM(BN91:BN94))","v":""},"Nbr de jour","=",{"$f":"IF(SUM(BQ91:BQ94)=0,\"\",SUM(BQ91:BQ94))","v":""},"Nbr de jour","=",{"$f":"IF(SUM(BT91:BT94)=0,\"\",SUM(BT91:BT94))","v":""},"Nbr de jour","=",{"$f":"IF(SUM(BW91:BW94)=0,\"\",SUM(BW91:BW94))","v":""},"Nbr de jour","=",{"$f":"IF(SUM(BZ91:BZ94)=0,\"\",SUM(BZ91:BZ94))","v":""},"Nbr de jour","=",{"$f":"IF(SUM(CC91:CC94)=0,\"\",SUM(CC91:CC94))","v":""},"Nbr de jour","=",{"$f":"IF(SUM(CF91:CF94)=0,\"\",SUM(CF91:CF94))","v":""},"Nbr de jour","=",{"$f":"IF(SUM(CI91:CI94)=0,\"\",SUM(CI91:CI94))","v":""},"Nbr de jour","=",{"$f":"IF(SUM(CL91:CL94)=0,\"\",SUM(CL91:CL94))","v":""},"Nbr de jour","=",{"$f":"IF(SUM(CO91:CO94)=0,\"\",SUM(CO91:CO94))","v":""},"Nbr de jour","=",{"$f":"IF(SUM(CR91:CR94)=0,\"\",SUM(CR91:CR94))","v":""},"Nbr de jour","=",{"$f":"IF(SUM(CU91:CU94)=0,\"\",SUM(CU91:CU94))","v":""},"Nbr de jour","=",{"$f":"IF(SUM(CX91:CX94)=0,\"\",SUM(CX91:CX94))","v":""},"Nbr de jour","=",{"$f":"IF(SUM(DA91:DA94)=0,\"\",SUM(DA91:DA94))","v":""},"Nbr de jour","=",{"$f":"IF(SUM(DD91:DD94)=0,\"\",SUM(DD91:DD94))","v":""},"Nbr de jour","=",{"$f":"IF(SUM(DG91:DG94)=0,\"\",SUM(DG91:DG94))","v":""},"Nbr de jour","=",{"$f":"IF(SUM(DJ91:DJ94)=0,\"\",SUM(DJ91:DJ94))","v":""},"Nbr de jour","=",{"$f":"IF(SUM(DM91:DM94)=0,\"\",SUM(DM91:DM94))","v":""},"Nbr de jour","=",{"$f":"IF(SUM(DP91:DP94)=0,\"\",SUM(DP91:DP94))","v":""},"Nbr de jour","=",{"$f":"IF(SUM(DS91:DS94)=0,\"\",SUM(DS91:DS94))","v":""},"Nbr de jour","=",{"$f":"IF(SUM(DV91:DV94)=0,\"\",SUM(DV91:DV94))","v":""},"Nbr de jour","=",{"$f":"IF(SUM(DY91:DY94)=0,\"\",SUM(DY91:DY94))","v":""},"Nbr de jour","=",{"$f":"IF(SUM(EB91:EB94)=0,\"\",SUM(EB91:EB94))","v":""}]
[null,null,null,{"$f":"IF(D98=\"\",\"\",D98)","v":"P1"},"","P3","","","","","","",""]
[null,null,null,{"$f":"IF(D98=\"\",\"\",D98)","v":"P1"},"","P3","","","","","","",""]
["Numéro 15","Nom affaire","EXE","P1",null,"P3"]
[null,null,null,{"$f":"IF(D98=\"\",\"\",D98)","v":"P1"},"","P3","","","","","","",""]
[null,"Temps passé en jour =",null,{"$f":"IF(D98=\"\",\"\",D98)","v":"P1"},"","P3","","","","","","","","Nbr de jour","=",{"$f":"IF(SUM(O96:O99)=0,\"\",SUM(O96:O99))","v":""},"Nbr de jour","=",{"$f":"IF(SUM(R96:R99)=0,\"\",SUM(R96:R99))","v":""},"Nbr de jour","=",{"$f":"IF(SUM(U96:U99)=0,\"\",SUM(U96:U99))","v":""},"Nbr de jour","=",{"$f":"IF(SUM(X96:X99)=0,\"\",SUM(X96:X99))","v":""},"Nbr de jour","=",{"$f":"IF(SUM(AA96:AA99)=0,\"\",SUM(AA96:AA99))","v":""},"Nbr de jour","=",{"$f":"IF(SUM(AD96:AD99)=0,\"\",SUM(AD96:AD99))","v":""},"Nbr de jour","=",{"$f":"IF(SUM(AG96:AG99)=0,\"\",SUM(AG96:AG99))","v":""},"Nbr de jour","=",{"$f":"IF(SUM(AJ96:AJ99)=0,\"\",SUM(AJ96:AJ99))","v":""},"Nbr de jour","=",{"$f":"IF(SUM(AM96:AM99)=0,\"\",SUM(AM96:AM99))","v":""},"Nbr de jour","=",{"$f":"IF(SUM(AP96:AP99)=0,\"\",SUM(AP96:AP99))","v":""},"Nbr de jour","=",{"$f":"IF(SUM(AS96:AS99)=0,\"\",SUM(AS96:AS99))","v":""},"Nbr de jour","=",{"$f":"IF(SUM(AV96:AV99)=0,\"\",SUM(AV96:AV99))","v":""},"Nbr de jour","=",{"$f":"IF(SUM(AY96:AY99)=0,\"\",SUM(AY96:AY99))","v":""},"Nbr de jour","=",{"$f":"IF(SUM(BB96:BB99)=0,\"\",SUM(BB96:BB99))","v":""},"Nbr de jour","=",{"$f":"IF(SUM(BE96:BE99)=0,\"\",SUM(BE96:BE99))","v":""},"Nbr de jour","=",{"$f":"IF(SUM(BH96:BH99)=0,\"\",SUM(BH96:BH99))","v":""},"Nbr de jour","=",{"$f":"IF(SUM(BK96:BK99)=0,\"\",SUM(BK96:BK99))","v":""},"Nbr de jour","=",{"$f":"IF(SUM(BN96:BN99)=0,\"\",SUM(BN96:BN99))","v":""},"Nbr de jour","=",{"$f":"IF(SUM(BQ96:BQ99)=0,\"\",SUM(BQ96:BQ99))","v":""},"Nbr de jour","=",{"$f":"IF(SUM(BT96:BT99)=0,\"\",SUM(BT96:BT99))","v":""},"Nbr de jour","=",{"$f":"IF(SUM(BW96:BW99)=0,\"\",SUM(BW96:BW99))","v":""},"Nbr de jour","=",{"$f":"IF(SUM(BZ96:BZ99)=0,\"\",SUM(BZ96:BZ99))","v":""},"Nbr de jour","=",{"$f":"IF(SUM(CC96:CC99)=0,\"\",SUM(CC96:CC99))","v":""},"Nbr de jour","=",{"$f":"IF(SUM(CF96:CF99)=0,\"\",SUM(CF96:CF99))","v":""},"Nbr de jour","=",{"$f":"IF(SUM(CI96:CI99)=0,\"\",SUM(CI96:CI99))","v":""},"Nbr de jour","=",{"$f":"IF(SUM(CL96:CL99)=0,\"\",SUM(CL96:CL99))","v":""},"Nbr de jour","=",{"$f":"IF(SUM(CO96:CO99)=0,\"\",SUM(CO96:CO99))","v":""},"Nbr de jour","=",{"$f":"IF(SUM(CR96:CR99)=0,\"\",SUM(CR96:CR99))","v":""},"Nbr de jour","=",{"$f":"IF(SUM(CU96:CU99)=0,\"\",SUM(CU96:CU99))","v":""},"Nbr de jour","=",{"$f":"IF(SUM(CX96:CX99)=0,\"\",SUM(CX96:CX99))","v":""},"Nbr de jour","=",{"$f":"IF(SUM(DA96:DA99)=0,\"\",SUM(DA96:DA99))","v":""},"Nbr de jour","=",{"$f":"IF(SUM(DD96:DD99)=0,\"\",SUM(DD96:DD99))","v":""},"Nbr de jour","=",{"$f":"IF(SUM(DG96:DG99)=0,\"\",SUM(DG96:DG99))","v":""},"Nbr de jour","=",{"$f":"IF(SUM(DJ96:DJ99)=0,\"\",SUM(DJ96:DJ99))","v":""},"Nbr de jour","=",{"$f":"IF(SUM(DM96:DM99)=0,\"\",SUM(DM96:DM99))","v":""},"Nbr de jour","=",{"$f":"IF(SUM(DP96:DP99)=0,\"\",SUM(DP96:DP99))","v":""},"Nbr de jour","=",{"$f":"IF(SUM(DS96:DS99)=0,\"\",SUM(DS96:DS99))","v":""},"Nbr de jour","=",{"$f":"IF(SUM(DV96:DV99)=0,\"\",SUM(DV96:DV99))","v":""},"Nbr de jour","=",{"$f":"IF(SUM(DY96:DY99)=0,\"\",SUM(DY96:DY99))","v":""},"Nbr de jour","=",{"$f":"IF(SUM(EB96:EB99)=0,\"\",SUM(EB96:EB99))","v":""}]
[null,null,null,{"$f":"IF(D103=\"\",\"\",D103)","v":""},"","","","","P6","","","P9",""]
[null,null,null,{"$f":"IF(D103=\"\",\"\",D103)","v":""},"","","","","P6","","","P9",""]
["Numéro 16","Nom affaire","EXE",null,null,null,null,null,"P6",null,null,"P9"]
[null,null,null,{"$f":"IF(D103=\"\",\"\",D103)","v":""},"","","","","P6","","","P9",""]
[null,"Temps passé en jour =",null,{"$f":"IF(D103=\"\",\"\",D103)","v":""},"","","","","P6","","","P9","","Nbr de jour","=",{"$f":"IF(SUM(O101:O104)=0,\"\",SUM(O101:O104))","v":""},"Nbr de jour","=",{"$f":"IF(SUM(R101:R104)=0,\"\",SUM(R101:R104))","v":""},"Nbr de jour","=",{"$f":"IF(SUM(U101:U104)=0,\"\",SUM(U101:U104))","v":""},"Nbr de jour","=",{"$f":"IF(SUM(X101:X104)=0,\"\",SUM(X101:X104))","v":""},"Nbr de jour","=",{"$f":"IF(SUM(AA101:AA104)=0,\"\",SUM(AA101:AA104))","v":""},"Nbr de jour","=",{"$f":"IF(SUM(AD101:AD104)=0,\"\",SUM(AD101:AD104))","v":""},"Nbr de jour","=",{"$f":"IF(SUM(AG101:AG104)=0,\"\",SUM(AG101:AG104))","v":""},"Nbr de jour","=",{"$f":"IF(SUM(AJ101:AJ104)=0,\"\",SUM(AJ101:AJ104))","v":""},"Nbr de jour","=",{"$f":"IF(SUM(AM101:AM104)=0,\"\",SUM(AM101:AM104))","v":""},"Nbr de jour","=",{"$f":"IF(SUM(AP101:AP104)=0,\"\",SUM(AP101:AP104))","v":""},"Nbr de jour","=",{"$f":"IF(SUM(AS101:AS104)=0,\"\",SUM(AS101:AS104))","v":""},"Nbr de jour","=",{"$f":"IF(SUM(AV101:AV104)=0,\"\",SUM(AV101:AV104))","v":""},"Nbr de jour","=",{"$f":"IF(SUM(AY101:AY104)=0,\"\",SUM(AY101:AY104))","v":""},"Nbr de jour","=",{"$f":"IF(SUM(BB101:BB104)=0,\"\",SUM(BB101:BB104))","v":""},"Nbr de jour","=",{"$f":"IF(SUM(BE101:BE104)=0,\"\",SUM(BE101:BE104))","v":""},"Nbr de jour","=",{"$f":"IF(SUM(BH101:BH104)=0,\"\",SUM(BH101:BH104))","v":""},"Nbr de jour","=",{"$f":"IF(SUM(BK101:BK104)=0,\"\",SUM(BK101:BK104))","v":""},"Nbr de jour","=",{"$f":"IF(SUM(BN101:BN104)=0,\"\",SUM(BN101:BN104))","v":""},"Nbr de jour","=",{"$f":"IF(SUM(BQ101:BQ104)=0,\"\",SUM(BQ101:BQ104))","v":""},"Nbr de jour","=",{"$f":"IF(SUM(BT101:BT104)=0,\"\",SUM(BT101:BT104))","v":""},"Nbr de jour","=",{"$f":"IF(SUM(BW101:BW104)=0,\"\",SUM(BW101:BW104))","v":""},"Nbr de jour","=",{"$f":"IF(SUM(BZ101:BZ104)=0,\"\",SUM(BZ101:BZ104))","v":""},"Nbr de jour","=",{"$f":"IF(SUM(CC101:CC104)=0,\"\",SUM(CC101:CC104))","v":""},"Nbr de jour","=",{"$f":"IF(SUM(CF101:CF104)=0,\"\",SUM(CF101:CF104))","v":""},"Nbr de jour","=",{"$f":"IF(SUM(CI101:CI104)=0,\"\",SUM(CI101:CI104))","v":""},"Nbr de jour","=",{"$f":"IF(SUM(CL101:CL104)=0,\"\",SUM(CL101:CL104))","v":""},"Nbr de jour","=",{"$f":"IF(SUM(CO101:CO104)=0,\"\",SUM(CO101:CO104))","v":""},"Nbr de jour","=",{"$f":"IF(SUM(CR101:CR104)=0,\"\",SUM(CR101:CR104))","v":""},"Nbr de jour","=",{"$f":"IF(SUM(CU101:CU104)=0,\"\",SUM(CU101:CU104))","v":""},"Nbr de jour","=",{"$f":"IF(SUM(CX101:CX104)=0,\"\",SUM(CX101:CX104))","v":""},"Nbr de jour","=",{"$f":"IF(SUM(DA101:DA104)=0,\"\",SUM(DA101:DA104))","v":""},"Nbr de jour","=",{"$f":"IF(SUM(DD101:DD104)=0,\"\",SUM(DD101:DD104))","v":""},"Nbr de jour","=",{"$f":"IF(SUM(DG101:DG104)=0,\"\",SUM(DG101:DG104))","v":""},"Nbr de jour","=",{"$f":"IF(SUM(DJ101:DJ104)=0,\"\",SUM(DJ101:DJ104))","v":""},"Nbr de jour","=",{"$f":"IF(SUM(DM101:DM104)=0,\"\",SUM(DM101:DM104))","v":""},"Nbr de jour","=",{"$f":"IF(SUM(DP101:DP104)=0,\"\",SUM(DP101:DP104))","v":""},"Nbr de jour","=",{"$f":"IF(SUM(DS101:DS104)=0,\"\",SUM(DS101:DS104))","v":""},"Nbr de jour","=",{"$f":"IF(SUM(DV101:DV104)=0,\"\",SUM(DV101:DV104))","v":""},"Nbr de jour","=",{"$f":"IF(SUM(DY101:DY104)=0,\"\",SUM(DY101:DY104))","v":""},"Nbr de jour","=",{"$f":"IF(SUM(EB101:EB104)=0,\"\",SUM(EB101:EB104))","v":""}]

{"sheet":"S50","index":1,"n_rows":105,"n_cols":133,"rows_kept":105,"cut":false,"hidden":false,"merged":[[9,128,9,129],[9,131,9,132],[9,110,9,111],[9,113,9,114],[9,116,9,117],[9,119,9,120],[9,122,9,123],[9,125,9,126],[9,92,9,93],[9,95,9,96],[9,98,9,99],[9,101,9,102],[9,104,9,105],[9,107,9,108],[9,74,9,75],[9,77,9,78],[9,80,9,81],[9,83,9,84],[9,86,9,87],[9,89,9,90],[9,56,9,57],[9,59,9,60],[9,62,9,63],[9,65,9,66],[9,68,9,69],[9,71,9,72],[9,38,9,39],[9,41,9,42],[9,44,9,45],[9,47,9,48],[9,50,9,51],[9,53,9,54],[8,109,8,120],[8,121,8,132],[9,14,9,15],[9,17,9,18],[9,20,9,21],[9,23,9,24],[9,26,9,27],[9,29,9,30],[9,32,9,33],[9,35,9,36],[8,37,8,48],[8,49,8,60],[8,61,8,72],[8,73,8,84],[8,85,8,96],[8,97,8,108],[7,119,7,120],[7,122,7,123],[7,125,7,126],[7,128,7,129],[7,131,7,132],[8,0,9,0],[8,1,9,1],[8,2,9,2],[8,13,8,24],[8,25,8,36],[7,101,7,102],[7,104,7,105],[7,107,7,108],[7,110,7,111],[7,113,7,114],[7,116,7,117],[7,83,7,84],[7,86,7,87],[7,89,7,90],[7,92,7,93],[7,95,7,96],[7,98,7,99],[7,65,7,66],[7,68,7,69],[7,71,7,72],[7,74,7,75],[7,77,7,78],[7,80,7,81],[7,47,7,48],[7,50,7,51],[7,53,7,54],[7,56,7,57],[7,59,7,60],[7,62,7,63],[7,29,7,30],[7,32,7,33],[7,35,7,36],[7,38,7,39],[7,41,7,42],[7,44,7,45],[6,122,6,123],[6,125,6,126],[6,128,6,129],[6,131,6,132],[7,3,7,12],[7,14,7,15],[7,17,7,18],[7,20,7,21],[7,23,7,24],[7,26,7,27],[6,104,6,105],[6,107,6,108],[6,110,6,111],[6,113,6,114],[6,116,6,117],[6,119,6,120],[6,86,6,87],[6,89,6,90],[6,92,6,93],[6,95,6,96],[6,98,6,99],[6,101,6,102],[6,68,6,69],[6,71,6,72],[6,74,6,75],[6,77,6,78],[6,80,6,81],[6,83,6,84],[6,50,6,51],[6,53,6,54],[6,56,6,57],[6,59,6,60],[6,62,6,63],[6,65,6,66],[6,32,6,33],[6,35,6,36],[6,38,6,39],[6,41,6,42],[6,44,6,45],[6,47,6,48],[5,122,5,123],[5,125,5,126],[5,128,5,129],[5,131,5,132],[6,14,6,15],[6,17,6,18],[6,20,6,21],[6,23,6,24],[6,26,6,27],[6,29,6,30],[5,104,5,105],[5,107,5,108],[5,110,5,111],[5,113,5,114],[5,116,5,117],[5,119,5,120],[5,86,5,87],[5,89,5,90],[5,92,5,93],[5,95,5,96],[5,98,5,99],[5,101,5,102],[5,68,5,69],[5,71,5,72],[5,74,5,75],[5,77,5,78],[5,80,5,81],[5,83,5,84],[5,50,5,51],[5,53,5,54],[5,56,5,57],[5,59,5,60],[5,62,5,63],[5,65,5,66],[5,32,5,33],[5,35,5,36],[5,38,5,39],[5,41,5,42],[5,44,5,45],[5,47,5,48],[5,14,5,15],[5,17,5,18],[5,20,5,21],[5,23,5,24],[5,26,5,27],[5,29,5,30],[4,116,4,117],[4,119,4,120],[4,122,4,123],[4,125,4,126],[4,128,4,129],[4,131,4,132],[4,98,4,99],[4,101,4,102],[4,104,4,105],[4,107,4,108],[4,110,4,111],[4,113,4,114],[4,80,4,81],[4,83,4,84],[4,86,4,87],[4,89,4,90],[4,92,4,93],[4,95,4,96],[4,62,4,63],[4,65,4,66],[4,68,4,69],[4,71,4,72],[4,74,4,75],[4,77,4,78],[4,44,4,45],[4,47,4,48],[4,50,4,51],[4,53,4,54],[4,56,4,57],[4,59,4,60],[4,26,4,27],[4,29,4,30],[4,32,4,33],[4,35,4,36],[4,38,4,39],[4,41,4,42],[2,109,2,111],[2,112,2,120],[2,121,2,123],[2,124,2,132],[4,0,5,1],[4,2,5,2],[4,14,4,15],[4,17,4,18],[4,20,4,21],[4,23,4,24],[2,73,2,75],[2,76,2,84],[2,85,2,87],[2,88,2,96],[2,97,2,99],[2,100,2,108],[2,37,2,39],[2,40,2,48],[2,49,2,51],[2,52,2,60],[2,61,2,63],[2,64,2,72],[2,1,3,1],[2,2,3,3],[2,13,2,15],[2,16,2,24],[2,25,2,27],[2,28,2,36]]}
["http://forum.excel-pratique.com/excel/planning-production-tri-complexe-t58192.html"]
[]
[null,"ANNEE",2014,null,null,null,null,null,null,null,null,null,null,"SEMAINE EN COURS",null,null,"SEMAINES A VENIR",null,null,null,null,null,null,null,null,"SEMAINE EN COURS",null,null,"SEMAINES A VENIR",null,null,null,null,null,null,null,null,"SEMAINE EN COURS",null,null,"SEMAINES A VENIR",null,null,null,null,null,null,null,null,"SEMAINE EN COURS",null,null,"SEMAINES A VENIR",null,null,null,null,null,null,null,null,"SEMAINE EN COURS",null,null,"SEMAINES A VENIR",null,null,null,null,null,null,null,null,"SEMAINE EN COURS",null,null,"SEMAINES A VENIR",null,null,null,null,null,null,null,null,"SEMAINE EN COURS",null,null,"SEMAINES A VENIR",null,null,null,null,null,null,null,null,"SEMAINE EN COURS",null,null,"SEMAINES A VENIR",null,null,null,null,null,null,null,null,"SEMAINE EN COURS",null,null,"SEMAINES A VENIR",null,null,null,null,null,null,null,null,"SEMAINE EN COURS",null,null,"SEMAINES A VENIR"]
[null,null,null,null,null,null,null,null,null,null,null,null,null,"Semaine n°",{"$f":"$C$5","v":49},null,"Semaine n°",{"$f":"$C$5+1","v":50},null,"Semaine n°",{"$f":"$C$5+2","v":51},null,"Semaine n°",{"$f":"$C$5+3","v":52},null,"Semaine n°",{"$f":"$C$5","v":49},null,"Semaine n°",{"$f":"$C$5+1","v":50},null,"Semaine n°",{"$f":"$C$5+2","v":51},null,"Semaine n°",{"$f":"$C$5+3","v":52},null,"Semaine n°",{"$f":"$C$5","v":49},null,"Semaine n°",{"$f":"$C$5+1","v":50},null,"Semaine n°",{"$f":"$C$5+2","v":51},null,"Semaine n°",{"$f":"$C$5+3","v":52},null,"Semaine n°",{"$f":"$C$5","v":49},null,"Semaine n°",{"$f":"$C$5+1","v":50},null,"Semaine n°",{"$f":"$C$5+2","v":51},null,"Semaine n°",{"$f":"$C$5+3","v":52},null,"Semaine n°",{"$f":"$C$5","v":49},null,"Semaine n°",{"$f":"$C$5+1","v":50},null,"Semaine n°",{"$f":"$C$5+2","v":51},null,"Semaine n°",{"$f":"$C$5+3","v":52},null,"Semaine n°",{"$f":"$C$5","v":49},null,"Semaine n°",{"$f":"$C$5+1","v":50},null,"Semaine n°",{"$f":"$C$5+2","v":51},null,"Semaine n°",{"$f":"$C$5+3","v":52},null,"Semaine n°",{"$f":"$C$5","v":49},null,"Semaine n°",{"$f":"$C$5+1","v":50},null,"Semaine n°",{"$f":"$C$5+2","v":51},null,"Semaine n°",{"$f":"$C$5+3","v":52},null,"Semaine n°",{"$f":"$C$5","v":49},null,"Semaine n°",{"$f":"$C$5+1","v":50},null,"Semaine n°",{"$f":"$C$5+2","v":51},null,"Semaine n°",{"$f":"$C$5+3","v":52},null,"Semaine n°",{"$f":"$C$5","v":49},null,"Semaine n°",{"$f":"$C$5+1","v":50},null,"Semaine n°",{"$f":"$C$5+2","v":51},null,"Semaine n°",{"$f":"$C$5+3","v":52},null,"Semaine n°",{"$f":"$C$5","v":49},null,"Semaine n°",{"$f":"$C$5+1","v":50},null,"Semaine n°",{"$f":"$C$5+2","v":51},null,"Semaine n°",{"$f":"$C$5+3","v":52}]
["Planning prévisionnel - Semaine n°",null,49,null,null,null,null,null,null,null,"Congés",null,null,null,null,null,null,null,null,null,null,null,"Lu+ Ma+ Me+ Ve",4]
[null,null,null,null,null,null,null,null,null,null,"Fériés",null,null,null,null,null,null,null,null,null,null,null,"Jeudi",1]
[null,null,null,null,null,null,null,null,null,null,"Divers"]
[null,"PREVISION PAR SEMAINE",null,"Projeteurs",null,null,null,null,null,null,null,null,null,"Nombre de jours =",{"$f":"SUM(P10:P105)+O7+O5","v":3.5},null,"Nombre de jours =",{"$f":"SUM(S10:S105)+R7+R5","v":1.5},null,"Nombre de jours =",{"$f":"SUM(V9:V105)+U7+U5","v":0},null,"Nombre de jours =",{"$f":"SUM(Y10:Y105)+X7+X5","v":4},null,"Nombre de jours =",{"$f":"SUM(AB10:AB105)+AA7+AA5","v":0},null,"Nombre de jours =",{"$f":"SUM(AE10:AE105)+AD7+AD5","v":0},null,"Nombre de jours =",{"$f":"SUM(AH10:AH105)+AG7+AG5","v":0},null,"Nombre de jours =",{"$f":"SUM(AK10:AK105)+AJ7+AJ5","v":0},null,"Nombre de jours =",{"$f":"SUM(AN10:AN105)+AM7+AM5","v":0},null,"Nombre de jours =",{"$f":"SUM(AQ10:AQ105)+AP7+AP5","v":0},null,"Nombre de jours =",{"$f":"SUM(AT10:AT105)+AS7+AS5","v":0},null,"Nombre de jours =",{"$f":"SUM(AW10:AW105)+AV7+AV5","v":0},null,"Nombre de jours =",{"$f":"SUM(AZ10:AZ105)+AY7+AY5","v":0},null,"Nombre de jours =",{"$f":"SUM(BC10:BC105)+BB7+BB5","v":0},null,"Nombre de jours =",{"$f":"SUM(BF10:BF105)+BE7+BE5","v":0},null,"Nombre de jours =",{"$f":"SUM(BI10:BI105)+BH7+BH5","v":0},null,"Nombre de jours =",{"$f":"SUM(BL10:BL105)+BK7+BK5","v":0},null,"Nombre de jours =",{"$f":"SUM(BO10:BO105)+BN7+BN5","v":0},null,"Nombre de jours =",{"$f":"SUM(BR10:BR105)+BQ7+BQ5","v":0},null,"Nombre de jours =",{"$f":"SUM(BU10:BU105)+BT7+BT5","v":0},null,"Nombre de jours =",{"$f":"SUM(BX10:BX105)+BW7+BW5","v":0},null,"Nombre de jours =",{"$f":"SUM(CA10:CA105)+BZ7+BZ5","v":0},null,"Nombre de jours =",{"$f":"SUM(CD10:CD105)+CC7+CC5","v":0},null,"Nombre de jours =",{"$f":"SUM(CG10:CG105)+CF7+CF5","v":0},null,"Nombre de jours =",{"$f":"SUM(CJ10:CJ105)+CI7+CI5","v":0},null,"Nombre de jours =",{"$f":"SUM(CM10:CM105)+CL7+CL5","v":0},null,"Nombre de jours =",{"$f":"SUM(CP10:CP105)+CO7+CO5","v":0},null,"Nombre de jours =",{"$f":"SUM(CS10:CS105)+CR7+CR5","v":0},null,"Nombre de jours =",{"$f":"SUM(CV10:CV105)+CU7+CU5","v":0},null,"Nombre de jours =",{"$f":"SUM(CY10:CY105)+CX7+CX5","v":0},null,"Nombre de jours =",{"$f":"SUM(DB10:DB105)+DA7+DA5","v":0},null,"Nombre de jours =",{"$f":"SUM(DE10:DE105)+DD7+DD5","v":0},null,"Nombre de jours =",{"$f":"SUM(DH10:DH105)+DG7+DG5","v":0},null,"Nombre de jours =",{"$f":"SUM(DK10:DK105)+DJ7+DJ5","v":0},null,"Nombre de jours =",{"$f":"SUM(DN10:DN105)+DM7+DM5","v":0},null,"Nombre de jours =",{"$f":"SUM(DQ10:DQ105)+DP7+DP5","v":0},null,"Nombre de jours =",{"$f":"SUM(DT10:DT105)+DS7+DS5","v":0},null,"Nombre de jours =",{"$f":"SUM(DW10:DW105)+DV7+DV5","v":0},null,"Nombre de jours =",{"$f":"SUM(DZ10:DZ105)+DY7+DY5","v":0},null,"Nombre de jours =",{"$f":"SUM(EC10:EC105)+EB7+EB5","v":0}]
["Numéro d'affaire","Affaires","PHASE","P1","P2","P3","P4","P5","P6","P7","P8","P9","P10","NOM Prénom",null,null,null,null,null,null,null,null,null,null,null,"NOM Prénom",null,null,null,null,null,null,null,null,null,null,null,"NOM Prénom",null,null,null,null,null,null,null,null,null,null,null,"NOM Prénom",null,null,null,null,null,null,null,null,null,null,null,"NOM Prénom",null,null,null,null,null,null,null,null,null,null,null,"NOM Prénom",null,null,null,null,null,null,null,null,null,null,null,"NOM Prénom",null,null,null,null,null,null,null,null,null,null,null,"NOM Prénom",null,null,null,null,null,null,null,null,null,null,null,"NOM Prénom",null,null,null,null,null,null,null,null,null,null,null,"NOM Prénom"]
[null,null,null,null,null,null,null,null,null,null,null,null,null,"Tâche","Durée",null,"Tâche","Durée",null,"Tâche","Durée",null,"Tâche","Durée",null,"Tâche","Durée",null,"Tâche","Durée",null,"Tâche","Durée",null,"Tâche","Durée",null,"Tâche","Durée",null,"Tâche","Durée",null,"Tâche","Durée",null,"Tâche","Durée",null,"Tâche","Durée",null,"Tâche","Durée",null,"Tâche","Durée",null,"Tâche","Durée",null,"Tâche","Durée",null,"Tâche","Durée",null,"Tâche","Durée",null,"Tâche","Durée",null,"Tâche","Durée",null,"Tâche","Durée",null,"Tâche","Durée",null,"Tâche","Durée",null,"Tâche","Durée",null,"Tâche","Durée",null,"Tâche","Durée",null,"Tâche","Durée",null,"Tâche","Durée",null,"Tâche","Durée",null,"Tâche","Durée",null,"Tâche","Durée",null,"Tâche","Durée",null,"Tâche","Durée",null,"Tâche","Durée",null,"Tâche","Durée",null,"Tâche","Durée",null,"Tâche","Durée",null,"Tâche","Durée",null,"Tâche","Durée"]
[null,null,null,{"$f":"IF(D13=\"\",\"\",D13)","v":"P1"},"","P3","","","","","","",""]
[null,null,null,{"$f":"IF(D13=\"\",\"\",D13)","v":"P1"},"","P3","","","","","","","","Coffrage",1,null,"Armature",1.5]
["10/020","Nom affaire","EXE","P1",null,"P3",null,null,null,null,null,null,null,"Synthèse",1]
[null,null,null,{"$f":"IF(D13=\"\",\"\",D13)","v":"P1"},"","P3","","","","","","",""]
[null,"Temps passé en jour =",null,{"$f":"IF(D13=\"\",\"\",D13)","v":"P1"},"","P3","","","","","","","","Nbr de jour","=",{"$f":"IF(SUM(O11:O14)=0,\"\",SUM(O11:O14))","v":2},"Nbr de jour","=",{"$f":"IF(SUM(R11:R14)=0,\"\",SUM(R11:R14))","v":1.5},"Nbr de jour","=",{"$f":"IF(SUM(U11:U14)=0,\"\",SUM(U11:U14))","v":""},"Nbr de jour","=",{"$f":"IF(SUM(X11:X14)=0,\"\",SUM(X11:X14))","v":""},"Nbr de jour","=",{"$f":"IF(SUM(AA11:AA14)=0,\"\",SUM(AA11:AA14))","v":""},"Nbr de jour","=",{"$f":"IF(SUM(AD11:AD14)=0,\"\",SUM(AD11:AD14))","v":""},"Nbr de jour","=",{"$f":"IF(SUM(AG11:AG14)=0,\"\",SUM(AG11:AG14))","v":""},"Nbr de jour","=",{"$f":"IF(SUM(AJ11:AJ14)=0,\"\",SUM(AJ11:AJ14))","v":""},"Nbr de jour","=",{"$f":"IF(SUM(AM11:AM14)=0,\"\",SUM(AM11:AM14))","v":""},"Nbr de jour","=",{"$f":"IF(SUM(AP11:AP14)=0,\"\",SUM(AP11:AP14))","v":""},"Nbr de jour","=",{"$f":"IF(SUM(AS11:AS14)=0,\"\",SUM(AS11:AS14))","v":""},"Nbr de jour","=",{"$f":"IF(SUM(AV11:AV14)=0,\"\",SUM(AV11:AV14))","v":""},"Nbr de jour","=",{"$f":"IF(SUM(AY11:AY14)=0,\"\",SUM(AY11:AY14))","v":""},"Nbr de jour","=",{"$f":"IF(SUM(BB11:BB14)=0,\"\",SUM(BB11:BB14))","v":""},"Nbr de jour","=",{"$f":"IF(SUM(BE11:BE14)=0,\"\",SUM(BE11:BE14))","v":""},"Nbr de jour","=",{"$f":"IF(SUM(BH11:BH14)=0,\"\",SUM(BH11:BH14))","v":""},"Nbr de jour","=",{"$f":"IF(SUM(BK11:BK14)=0,\"\",SUM(BK11:BK14))","v":""},"Nbr de jour","=",{"$f":"IF(SUM(BN11:BN14)=0,\"\",SUM(BN11:BN14))","v":""},"Nbr de jour","=",{"$f":"IF(SUM(BQ11:BQ14)=0,\"\",SUM(BQ11:BQ14))","v":""},"Nbr de jour","=",{"$f":"IF(SUM(BT11:BT14)=0,\"\",SUM(BT11:BT14))","v":""},"Nbr de jour","=",{"$f":"IF(SUM(BW11:BW14)=0,\"\",SUM(BW11:BW14))","v":""},"Nbr de jour","=",{"$f":"IF(SUM(BZ11:BZ14)=0,\"\",SUM(BZ11:BZ14))","v":""},"Nbr de jour","=",{"$f":"IF(SUM(CC11:CC14)=0,\"\",SUM(CC11:CC14))","v":""},"Nbr de jour","=",{"$f":"IF(SUM(CF11:CF14)=0,\"\",SUM(CF11:CF14))","v":""},"Nbr de jour","=",{"$f":"IF(SUM(CI11:CI14)=0,\"\",SUM(CI11:CI14))","v":""},"Nbr de jour","=",{"$f":"IF(SUM(CL11:CL14)=0,\"\",SUM(CL11:CL14))","v":""},"Nbr de jour","=",{"$f":"IF(SUM(CO11:CO14)=0,\"\",SUM(CO11:CO14))","v":""},"Nbr de jour","=",{"$f":"IF(SUM(CR11:CR14)=0,\"\",SUM(CR11:CR14))","v":""},"Nbr de jour","=",{"$f":"IF(SUM(CU11:CU14)=0,\"\",SUM(CU11:CU14))","v":""},"Nbr de jour","=",{"$f":"IF(SUM(CX11:CX14)=0,\"\",SUM(CX11:CX14))","v":""},"Nbr de jour","=",{"$f":"IF(SUM(DA11:DA14)=0,\"\",SUM(DA11:DA14))","v":""},"Nbr de jour","=",{"$f":"IF(SUM(DD11:DD14)=0,\"\",SUM(DD11:DD14))","v":""},"Nbr de jour","=",{"$f":"IF(SUM(DG11:DG14)=0,\"\",SUM(DG11:DG14))","v":""},"Nbr de jour","=",{"$f":"IF(SUM(DJ11:DJ14)=0,\"\",SUM(DJ11:DJ14))","v":""},"Nbr de jour","=",{"$f":"IF(SUM(DM11:DM14)=0,\"\",SUM(DM11:DM14))","v":""},"Nbr de jour","=",{"$f":"IF(SUM(DP11:DP14)=0,\"\",SUM(DP11:DP14))","v":""},"Nbr de jour","=",{"$f":"IF(SUM(DS11:DS14)=0,\"\",SUM(DS11:DS14))","v":""},"Nbr de jour","=",{"$f":"IF(SUM(DV11:DV14)=0,\"\",SUM(DV11:DV14))","v":""},"Nbr de jour","=",{"$f":"IF(SUM(DY11:DY14)=0,\"\",SUM(DY11:DY14))","v":""},"Nbr de jour","=",{"$f":"IF(SUM(EB11:EB14)=0,\"\",SUM(EB11:EB14))","v":""}]
[null,null,null,{"$f":"IF(D18=\"\",\"\",D18)","v":""},"","P3","","","","","","",""]
[null,null,null,{"$f":"IF(D18=\"\",\"\",D18)","v":""},"","P3","","","","","","",""]
["14/054","Nom affaire","EXE",null,null,"P3"]
[null,null,null,{"$f":"IF(D18=\"\",\"\",D18)","v":""},"","P3","","","","","","",""]
[null,"Temps passé en jour =",null,{"$f":"IF(D18=\"\",\"\",D18)","v":""},"","P3","","","","","","","","Nbr de jour","=",{"$f":"IF(SUM(O16:O19)=0,\"\",SUM(O16:O19))","v":""},"Nbr de jour","=",{"$f":"IF(SUM(R16:R19)=0,\"\",SUM(R16:R19))","v":""},"Nbr de jour","=",{"$f":"IF(SUM(U16:U19)=0,\"\",SUM(U16:U19))","v":""},"Nbr de jour","=",{"$f":"IF(SUM(X16:X19)=0,\"\",SUM(X16:X19))","v":""},"Nbr de jour","=",{"$f":"IF(SUM(AA16:AA19)=0,\"\",SUM(AA16:AA19))","v":""},"Nbr de jour","=",{"$f":"IF(SUM(AD16:AD19)=0,\"\",SUM(AD16:AD19))","v":""},"Nbr de jour","=",{"$f":"IF(SUM(AG16:AG19)=0,\"\",SUM(AG16:AG19))","v":""},"Nbr de jour","=",{"$f":"IF(SUM(AJ16:AJ19)=0,\"\",SUM(AJ16:AJ19))","v":""},"Nbr de jour","=",{"$f":"IF(SUM(AM16:AM19)=0,\"\",SUM(AM16:AM19))","v":""},"Nbr de jour","=",{"$f":"IF(SUM(AP16:AP19)=0,\"\",SUM(AP16:AP19))","v":""},"Nbr de jour","=",{"$f":"IF(SUM(AS16:AS19)=0,\"\",SUM(AS16:AS19))","v":""},"Nbr de jour","=",{"$f":"IF(SUM(AV16:AV19)=0,\"\",SUM(AV16:AV19))","v":""},"Nbr de jour","=",{"$f":"IF(SUM(AY16:AY19)=0,\"\",SUM(AY16:AY19))","v":""},"Nbr de jour","=",{"$f":"IF(SUM(BB16:BB19)=0,\"\",SUM(BB16:BB19))","v":""},"Nbr de jour","=",{"$f":"IF(SUM(BE16:BE19)=0,\"\",SUM(BE16:BE19))","v":""},"Nbr de jour","=",{"$f":"IF(SUM(BH16:BH19)=0,\"\",SUM(BH16:BH19))","v":""},"Nbr de jour","=",{"$f":"IF(SUM(BK16:BK19)=0,\"\",SUM(BK16:BK19))","v":""},"Nbr de jour","=",{"$f":"IF(SUM(BN16:BN19)=0,\"\",SUM(BN16:BN19))","v":""},"Nbr de jour","=",{"$f":"IF(SUM(BQ16:BQ19)=0,\"\",SUM(BQ16:BQ19))","v":""},"Nbr de jour","=",{"$f":"IF(SUM(BT16:BT19)=0,\"\",SUM(BT16:BT19))","v":""},"Nbr de jour","=",{"$f":"IF(SUM(BW16:BW19)=0,\"\",SUM(BW16:BW19))","v":""},"Nbr de jour","=",{"$f":"IF(SUM(BZ16:BZ19)=0,\"\",SUM(BZ16:BZ19))","v":""},"Nbr de jour","=",{"$f":"IF(SUM(CC16:CC19)=0,\"\",SUM(CC16:CC19))","v":""},"Nbr de jour","=",{"$f":"IF(SUM(CF16:CF19)=0,\"\",SUM(CF16:CF19))","v":""},"Nbr de jour","=",{"$f":"IF(SUM(CI16:CI19)=0,\"\",SUM(CI16:CI19))","v":""},"Nbr de jour","=",{"$f":"IF(SUM(CL16:CL19)=0,\"\",SUM(CL16:CL19))","v":""},"Nbr de jour","=",{"$f":"IF(SUM(CO16:CO19)=0,\"\",SUM(CO16:CO19))","v":""},"Nbr de jour","=",{"$f":"IF(SUM(CR16:CR19)=0,\"\",SUM(CR16:CR19))","v":""},"Nbr de jour","=",{"$f":"IF(SUM(CU16:CU19)=0,\"\",SUM(CU16:CU19))","v":""},"Nbr de jour","=",{"$f":"IF(SUM(CX16:CX19)=0,\"\",SUM(CX16:CX19))","v":""},"Nbr de jour","=",{"$f":"IF(SUM(DA16:DA19)=0,\"\",SUM(DA16:DA19))","v":""},"Nbr de jour","=",{"$f":"IF(SUM(DD16:DD19)=0,\"\",SUM(DD16:DD19))","v":""},"Nbr de jour","=",{"$f":"IF(SUM(DG16:DG19)=0,\"\",SUM(DG16:DG19))","v":""},"Nbr de jour","=",{"$f":"IF(SUM(DJ16:DJ19)=0,\"\",SUM(DJ16:DJ19))","v":""},"Nbr de jour","=",{"$f":"IF(SUM(DM16:DM19)=0,\"\",SUM(DM16:DM19))","v":""},"Nbr de jour","=",{"$f":"IF(SUM(DP16:DP19)=0,\"\",SUM(DP16:DP19))","v":""},"Nbr de jour","=",{"$f":"IF(SUM(DS16:DS19)=0,\"\",SUM(DS16:DS19))","v":""},"Nbr de jour","=",{"$f":"IF(SUM(DV16:DV19)=0,\"\",SUM(DV16:DV19))","v":""},"Nbr de jour","=",{"$f":"IF(SUM(DY16:DY19)=0,\"\",SUM(DY16:DY19))","v":""},"Nbr de jour","=",{"$f":"IF(SUM(EB16:EB19)=0,\"\",SUM(EB16:EB19))","v":""}]
[null,null,null,{"$f":"IF(D23=\"\",\"\",D23)","v":"P1"},"","","","","","","","",""]
[null,null,null,{"$f":"IF(D23=\"\",\"\",D23)","v":"P1"},"","","","","","","","","","Réunion ",0.5]
["13/022","Nom affaire","DET","P1",null,null,null,null,null,null,null,null,null,"Plan AVP",1]
[null,null,null,{"$f":"IF(D23=\"\",\"\",D23)","v":"P1"},"","","","","","","","",""]
[null,"Temps passé en jour =",null,{"$f":"IF(D23=\"\",\"\",D23)","v":"P1"},"","","","","","","","","","Nbr de jour","=",{"$f":"IF(SUM(O21:O24)=0,\"\",SUM(O21:O24))","v":1.5},"Nbr de jour","=",{"$f":"IF(SUM(R21:R24)=0,\"\",SUM(R21:R24))","v":""},"Nbr de jour","=",{"$f":"IF(SUM(U21:U24)=0,\"\",SUM(U21:U24))","v":""},"Nbr de jour","=",{"$f":"IF(SUM(X21:X24)=0,\"\",SUM(X21:X24))","v":""},"Nbr de jour","=",{"$f":"IF(SUM(AA21:AA24)=0,\"\",SUM(AA21:AA24))","v":""},"Nbr de jour","=",{"$f":"IF(SUM(AD21:AD24)=0,\"\",SUM(AD21:AD24))","v":""},"Nbr de jour","=",{"$f":"IF(SUM(AG21:AG24)=0,\"\",SUM(AG21:AG24))","v":""},"Nbr de jour","=",{"$f":"IF(SUM(AJ21:AJ24)=0,\"\",SUM(AJ21:AJ24))","v":""},"Nbr de jour","=",{"$f":"IF(SUM(AM21:AM24)=0,\"\",SUM(AM21:AM24))","v":""},"Nbr de jour","=",{"$f":"IF(SUM(AP21:AP24)=0,\"\",SUM(AP21:AP24))","v":""},"Nbr de jour","=",{"$f":"IF(SUM(AS21:AS24)=0,\"\",SUM(AS21:AS24))","v":""},"Nbr de jour","=",{"$f":"IF(SUM(AV21:AV24)=0,\"\",SUM(AV21:AV24))","v":""},"Nbr de jour","=",{"$f":"IF(SUM(AY21:AY24)=0,\"\",SUM(AY21:AY24))","v":""},"Nbr de jour","=",{"$f":"IF(SUM(BB21:BB24)=0,\"\",SUM(BB21:BB24))","v":""},"Nbr de jour","=",{"$f":"IF(SUM(BE21:BE24)=0,\"\",SUM(BE21:BE24))","v":""},"Nbr de jour","=",{"$f":"IF(SUM(BH21:BH24)=0,\"\",SUM(BH21:BH24))","v":""},"Nbr de jour","=",{"$f":"IF(SUM(BK21:BK24)=0,\"\",SUM(BK21:BK24))","v":""},"Nbr de jour","=",{"$f":"IF(SUM(BN21:BN24)=0,\"\",SUM(BN21:BN24))","v":""},"Nbr de jour","=",{"$f":"IF(SUM(BQ21:BQ24)=0,\"\",SUM(BQ21:BQ24))","v":""},"Nbr de jour","=",{"$f":"IF(SUM(BT21:BT24)=0,\"\",SUM(BT21:BT24))","v":""},"Nbr de jour","=",{"$f":"IF(SUM(BW21:BW24)=0,\"\",SUM(BW21:BW24))","v":""},"Nbr de jour","=",{"$f":"IF(SUM(BZ21:BZ24)=0,\"\",SUM(BZ21:BZ24))","v":""},"Nbr de jour","=",{"$f":"IF(SUM(CC21:CC24)=0,\"\",SUM(CC21:CC24))","v":""},"Nbr de jour","=",{"$f":"IF(SUM(CF21:CF24)=0,\"\",SUM(CF21:CF24))","v":""},"Nbr de jour","=",{"$f":"IF(SUM(CI21:CI24)=0,\"\",SUM(CI21:CI24))","v":""},"Nbr de jour","=",{"$f":"IF(SUM(CL21:CL24)=0,\"\",SUM(CL21:CL24))","v":""},"Nbr de jour","=",{"$f":"IF(SUM(CO21:CO24)=0,\"\",SUM(CO21:CO24))","v":""},"Nbr de jour","=",{"$f":"IF(SUM(CR21:CR24)=0,\"\",SUM(CR21:CR24))","v":""},"Nbr de jour","=",{"$f":"IF(SUM(CU21:CU24)=0,\"\",SUM(CU21:CU24))","v":""},"Nbr de jour","=",{"$f":"IF(SUM(CX21:CX24)=0,\"\",SUM(CX21:CX24))","v":""},"Nbr de jour","=",{"$f":"IF(SUM(DA21:DA24)=0,\"\",SUM(DA21:DA24))","v":""},"Nbr de jour","=",{"$f":"IF(SUM(DD21:DD24)=0,\"\",SUM(DD21:DD24))","v":""},"Nbr de jour","=",{"$f":"IF(SUM(DG21:DG24)=0,\"\",SUM(DG21:DG24))","v":""},"Nbr de jour","=",{"$f":"IF(SUM(DJ21:DJ24)=0,\"\",SUM(DJ21:DJ24))","v":""},"Nbr de jour","=",{"$f":"IF(SUM(DM21:DM24)=0,\"\",SUM(DM21:DM24))","v":""},"Nbr de jour","=",{"$f":"IF(SUM(DP21:DP24)=0,\"\",SUM(DP21:DP24))","v":""},"Nbr de jour","=",{"$f":"IF(SUM(DS21:DS24)=0,\"\",SUM(DS21:DS24))","v":""},"Nbr de jour","=",{"$f":"IF(SUM(DV21:DV24)=0,\"\",SUM(DV21:DV24))","v":""},"Nbr de jour","=",{"$f":"IF(SUM(DY21:DY24)=0,\"\",SUM(DY21:DY24))","v":""},"Nbr de jour","=",{"$f":"IF(SUM(EB21:EB24)=0,\"\",SUM(EB21:EB24))","v":""}]
[null,null,null,{"$f":"IF(D28=\"\",\"\",D28)","v":""},"","","","","","","","","P10"]
[null,null,null,{"$f":"IF(D28=\"\",\"\",D28)","v":""},"","","","","","","","","P10"]
["Numéro 01","Nom affaire","AVP",null,null,null,null,null,null,null,null,null,"P10"]
[null,null,null,{"$f":"IF(D28=\"\",\"\",D28)","v":""},"","","","","","","","","P10"]
[null,"Temps passé en jour =",null,{"$f":"IF(D28=\"\",\"\",D28)","v":""},"","","","","","","","","P10","Nbr de jour","=",{"$f":"IF(SUM(O26:O29)=0,\"\",SUM(O26:O29))","v":""},"Nbr de jour","=",{"$f":"IF(SUM(R26:R29)=0,\"\",SUM(R26:R29))","v":""},"Nbr de jour","=",{"$f":"IF(SUM(U26:U29)=0,\"\",SUM(U26:U29))","v":""},"Nbr de jour","=",{"$f":"IF(SUM(X26:X29)=0,\"\",SUM(X26:X29))","v":""},"Nbr de jour","=",{"$f":"IF(SUM(AA26:AA29)=0,\"\",SUM(AA26:AA29))","v":""},"Nbr de jour","=",{"$f":"IF(SUM(AD26:AD29)=0,\"\",SUM(AD26:AD29))","v":""},"Nbr de jour","=",{"$f":"IF(SUM(AG26:AG29)=0,\"\",SUM(AG26:AG29))","v":""},"Nbr de jour","=",{"$f":"IF(SUM(AJ26:AJ29)=0,\"\",SUM(AJ26:AJ29))","v":""},"Nbr de jour","=",{"$f":"IF(SUM(AM26:AM29)=0,\"\",SUM(AM26:AM29))","v":""},"Nbr de jour","=",{"$f":"IF(SUM(AP26:AP29)=0,\"\",SUM(AP26:AP29))","v":""},"Nbr de jour","=",{"$f":"IF(SUM(AS26:AS29)=0,\"\",SUM(AS26:AS29))","v":""},"Nbr de jour","=",{"$f":"IF(SUM(AV26:AV29)=0,\"\",SUM(AV26:AV29))","v":""},"Nbr de jour","=",{"$f":"IF(SUM(AY26:AY29)=0,\"\",SUM(AY26:AY29))","v":""},"Nbr de jour","=",{"$f":"IF(SUM(BB26:BB29)=0,\"\",SUM(BB26:BB29))","v":""},"Nbr de jour","=",{"$f":"IF(SUM(BE26:BE29)=0,\"\",SUM(BE26:BE29))","v":""},"Nbr de jour","=",{"$f":"IF(SUM(BH26:BH29)=0,\"\",SUM(BH26:BH29))","v":""},"Nbr de jour","=",{"$f":"IF(SUM(BK26:BK29)=0,\"\",SUM(BK26:BK29))","v":""},"Nbr de jour","=",{"$f":"IF(SUM(BN26:BN29)=0,\"\",SUM(BN26:BN29))","v":""},"Nbr de jour","=",{"$f":"IF(SUM(BQ26:BQ29)=0,\"\",SUM(BQ26:BQ29))","v":""},"Nbr de jour","=",{"$f":"IF(SUM(BT26:BT29)=0,\"\",SUM(BT26:BT29))","v":""},"Nbr de jour","=",{"$f":"IF(SUM(BW26:BW29)=0,\"\",SUM(BW26:BW29))","v":""},"Nbr de jour","=",{"$f":"IF(SUM(BZ26:BZ29)=0,\"\",SUM(BZ26:BZ29))","v":""},"Nbr de jour","=",{"$f":"IF(SUM(CC26:CC29)=0,\"\",SUM(CC26:CC29))","v":""},"Nbr de jour","=",{"$f":"IF(SUM(CF26:CF29)=0,\"\",SUM(CF26:CF29))","v":""},"Nbr de jour","=",{"$f":"IF(SUM(CI26:CI29)=0,\"\",SUM(CI26:CI29))","v":""},"Nbr de jour","=",{"$f":"IF(SUM(CL26:CL29)=0,\"\",SUM(CL26:CL29))","v":""},"Nbr de jour","=",{"$f":"IF(SUM(CO26:CO29)=0,\"\",SUM(CO26:CO29))","v":""},"Nbr de jour","=",{"$f":"IF(SUM(CR26:CR29)=0,\"\",SUM(CR26:CR29))","v":""},"Nbr de jour","=",{"$f":"IF(SUM(CU26:CU29)=0,\"\",SUM(CU26:CU29))","v":""},"Nbr de jour","=",{"$f":"IF(SUM(CX26:CX29)=0,\"\",SUM(CX26:CX29))","v":""},"Nbr de jour","=",{"$f":"IF(SUM(DA26:DA29)=0,\"\",SUM(DA26:DA29))","v":""},"Nbr de jour","=",{"$f":"IF(SUM(DD26:DD29)=0,\"\",SUM(DD26:DD29))","v":""},"Nbr de jour","=",{"$f":"IF(SUM(DG26:DG29)=0,\"\",SUM(DG26:DG29))","v":""},"Nbr de jour","=",{"$f":"IF(SUM(DJ26:DJ29)=0,\"\",SUM(DJ26:DJ29))","v":""},"Nbr de jour","=",{"$f":"IF(SUM(DM26:DM29)=0,\"\",SUM(DM26:DM29))","v":""},"Nbr de jour","=",{"$f":"IF(SUM(DP26:DP29)=0,\"\",SUM(DP26:DP29))","v":""},"Nbr de jour","=",{"$f":"IF(SUM(DS26:DS29)=0,\"\",SUM(DS26:DS29))","v":""},"Nbr de jour","=",{"$f":"IF(SUM(DV26:DV29)=0,\"\",SUM(DV26:DV29))","v":""},"Nbr de jour","=",{"$f":"IF(SUM(DY26:DY29)=0,\"\",SUM(DY26:DY29))","v":""},"Nbr de jour","=",{"$f":"IF(SUM(EB26:EB29)=0,\"\",SUM(EB26:EB29))","v":""}]
[null,null,null,{"$f":"IF(D33=\"\",\"\",D33)","v":""},"","P3","","","","","","",""]
[null,null,null,{"$f":"IF(D33=\"\",\"\",D33)","v":""},"","P3","","","","","","",""]
["Numéro 02","Nom affaire","AVP",null,null,"P3"]
[null,null,null,{"$f":"IF(D33=\"\",\"\",D33)","v":""},"","P3","","","","","","",""]
[null,"Temps passé en jour =",null,{"$f":"IF(D33=\"\",\"\",D33)","v":""},"","P3","","","","","","","","Nbr de jour","=",{"$f":"IF(SUM(O31:O34)=0,\"\",SUM(O31:O34))","v":""},"Nbr de jour","=",{"$f":"IF(SUM(R31:R34)=0,\"\",SUM(R31:R34))","v":""},"Nbr de jour","=",{"$f":"IF(SUM(U31:U34)=0,\"\",SUM(U31:U34))","v":""},"Nbr de jour","=",{"$f":"IF(SUM(X31:X34)=0,\"\",SUM(X31:X34))","v":""},"Nbr de jour","=",{"$f":"IF(SUM(AA31:AA34)=0,\"\",SUM(AA31:AA34))","v":""},"Nbr de jour","=",{"$f":"IF(SUM(AD31:AD34)=0,\"\",SUM(AD31:AD34))","v":""},"Nbr de jour","=",{"$f":"IF(SUM(AG31:AG34)=0,\"\",SUM(AG31:AG34))","v":""},"Nbr de jour","=",{"$f":"IF(SUM(AJ31:AJ34)=0,\"\",SUM(AJ31:AJ34))","v":""},"Nbr de jour","=",{"$f":"IF(SUM(AM31:AM34)=0,\"\",SUM(AM31:AM34))","v":""},"Nbr de jour","=",{"$f":"IF(SUM(AP31:AP34)=0,\"\",SUM(AP31:AP34))","v":""},"Nbr de jour","=",{"$f":"IF(SUM(AS31:AS34)=0,\"\",SUM(AS31:AS34))","v":""},"Nbr de jour","=",{"$f":"IF(SUM(AV31:AV34)=0,\"\",SUM(AV31:AV34))","v":""},"Nbr de jour","=",{"$f":"IF(SUM(AY31:AY34)=0,\"\",SUM(AY31:AY34))","v":""},"Nbr de jour","=",{"$f":"IF(SUM(BB31:BB34)=0,\"\",SUM(BB31:BB34))","v":""},"Nbr de jour","=",{"$f":"IF(SUM(BE31:BE34)=0,\"\",SUM(BE31:BE34))","v":""},"Nbr de jour","=",{"$f":"IF(SUM(BH31:BH34)=0,\"\",SUM(BH31:BH34))","v":""},"Nbr de jour","=",{"$f":"IF(SUM(BK31:BK34)=0,\"\",SUM(BK31:BK34))","v":""},"Nbr de jour","=",{"$f":"IF(SUM(BN31:BN34)=0,\"\",SUM(BN31:BN34))","v":""},"Nbr de jour","=",{"$f":"IF(SUM(BQ31:BQ34)=0,\"\",SUM(BQ31:BQ34))","v":""},"Nbr de jour","=",{"$f":"IF(SUM(BT31:BT34)=0,\"\",SUM(BT31:BT34))","v":""},"Nbr de jour","=",{"$f":"IF(SUM(BW31:BW34)=0,\"\",SUM(BW31:BW34))","v":""},"Nbr de jour","=",{"$f":"IF(SUM(BZ31:BZ34)=0,\"\",SUM(BZ31:BZ34))","v":""},"Nbr de jour","=",{"$f":"IF(SUM(CC31:CC34)=0,\"\",SUM(CC31:CC34))","v":""},"Nbr de jour","=",{"$f":"IF(SUM(CF31:CF34)=0,\"\",SUM(CF31:CF34))","v":""},"Nbr de jour","=",{"$f":"IF(SUM(CI31:CI34)=0,\"\",SUM(CI31:CI34))","v":""},"Nbr de jour","=",{"$f":"IF(SUM(CL31:CL34)=0,\"\",SUM(CL31:CL34))","v":""},"Nbr de jour","=",{"$f":"IF(SUM(CO31:CO34)=0,\"\",SUM(CO31:CO34))","v":""},"Nbr de jour","=",{"$f":"IF(SUM(CR31:CR34)=0,\"\",SUM(CR31:CR34))","v":""},"Nbr de jour","=",{"$f":"IF(SUM(CU31:CU34)=0,\"\",SUM(CU31:CU34))","v":""},"Nbr de jour","=",{"$f":"IF(SUM(CX31:CX34)=0,\"\",SUM(CX31:CX34))","v":""},"Nbr de jour","=",{"$f":"IF(SUM(DA31:DA34)=0,\"\",SUM(DA31:DA34))","v":""},"Nbr de jour","=",{"$f":"IF(SUM(DD31:DD34)=0,\"\",SUM(DD31:DD34))","v":""},"Nbr de jour","=",{"$f":"IF(SUM(DG31:DG34)=0,\"\",SUM(DG31:DG34))","v":""},"Nbr de jour","=",{"$f":"IF(SUM(DJ31:DJ34)=0,\"\",SUM(DJ31:DJ34))","v":""},"Nbr de jour","=",{"$f":"IF(SUM(DM31:DM34)=0,\"\",SUM(DM31:DM34))","v":""},"Nbr de jour","=",{"$f":"IF(SUM(DP31:DP34)=0,\"\",SUM(DP31:DP34))","v":""},"Nbr de jour","=",{"$f":"IF(SUM(DS31:DS34)=0,\"\",SUM(DS31:DS34))","v":""},"Nbr de jour","=",{"$f":"IF(SUM(DV31:DV34)=0,\"\",SUM(DV31:DV34))","v":""},"Nbr de jour","=",{"$f":"IF(SUM(DY31:DY34)=0,\"\",SUM(DY31:DY34))","v":""},"Nbr de jour","=",{"$f":"IF(SUM(EB31:EB34)=0,\"\",SUM(EB31:EB34))","v":""}]
[null,null,null,{"$f":"IF(D38=\"\",\"\",D38)","v":"P1"},"","P3","","","P6","","","",""]
[null,null,null,{"$f":"IF(D38=\"\",\"\",D38)","v":"P1"},"","P3","","","P6","","","",""]
["Numéro 03","Nom affaire","DET","P1",null,"P3",null,null,"P6"]
[null,null,null,{"$f":"IF(D38=\"\",\"\",D38)","v":"P1"},"","P3","","","P6","","","",""]
[null,"Temps passé en jour =",null,{"$f":"IF(D38=\"\",\"\",D38)","v":"P1"},"","P3","","","P6","","","","","Nbr de jour","=",{"$f":"IF(SUM(O36:O39)=0,\"\",SUM(O36:O39))","v":""},"Nbr de jour","=",{"$f":"IF(SUM(R36:R39)=0,\"\",SUM(R36:R39))","v":""},"Nbr de jour","=",{"$f":"IF(SUM(U36:U39)=0,\"\",SUM(U36:U39))","v":""},"Nbr de jour","=",{"$f":"IF(SUM(X36:X39)=0,\"\",SUM(X36:X39))","v":""},"Nbr de jour","=",{"$f":"IF(SUM(AA36:AA39)=0,\"\",SUM(AA36:AA39))","v":""},"Nbr de jour","=",{"$f":"IF(SUM(AD36:AD39)=0,\"\",SUM(AD36:AD39))","v":""},"Nbr de jour","=",{"$f":"IF(SUM(AG36:AG39)=0,\"\",SUM(AG36:AG39))","v":""},"Nbr de jour","=",{"$f":"IF(SUM(AJ36:AJ39)=0,\"\",SUM(AJ36:AJ39))","v":""},"Nbr de jour","=",{"$f":"IF(SUM(AM36:AM39)=0,\"\",SUM(AM36:AM39))","v":""},"Nbr de jour","=",{"$f":"IF(SUM(AP36:AP39)=0,\"\",SUM(AP36:AP39))","v":""},"Nbr de jour","=",{"$f":"IF(SUM(AS36:AS39)=0,\"\",SUM(AS36:AS39))","v":""},"Nbr de jour","=",{"$f":"IF(SUM(AV36:AV39)=0,\"\",SUM(AV36:AV39))","v":""},"Nbr de jour","=",{"$f":"IF(SUM(AY36:AY39)=0,\"\",SUM(AY36:AY39))","v":""},"Nbr de jour","=",{"$f":"IF(SUM(BB36:BB39)=0,\"\",SUM(BB36:BB39))","v":""},"Nbr de jour","=",{"$f":"IF(SUM(BE36:BE39)=0,\"\",SUM(BE36:BE39))","v":""},"Nbr de jour","=",{"$f":"IF(SUM(BH36:BH39)=0,\"\",SUM(BH36:BH39))","v":""},"Nbr de jour","=",{"$f":"IF(SUM(BK36:BK39)=0,\"\",SUM(BK36:BK39))","v":""},"Nbr de jour","=",{"$f":"IF(SUM(BN36:BN39)=0,\"\",SUM(BN36:BN39))","v":""},"Nbr de jour","=",{"$f":"IF(SUM(BQ36:BQ39)=0,\"\",SUM(BQ36:BQ39))","v":""},"Nbr de jour","=",{"$f":"IF(SUM(BT36:BT39)=0,\"\",SUM(BT36:BT39))","v":""},"Nbr de jour","=",{"$f":"IF(SUM(BW36:BW39)=0,\"\",SUM(BW36:BW39))","v":""},"Nbr de jour","=",{"$f":"IF(SUM(BZ36:BZ39)=0,\"\",SUM(BZ36:BZ39))","v":""},"Nbr de jour","=",{"$f":"IF(SUM(CC36:CC39)=0,\"\",SUM(CC36:CC39))","v":""},"Nbr de jour","=",{"$f":"IF(SUM(CF36:CF39)=0,\"\",SUM(CF36:CF39))","v":""},"Nbr de jour","=",{"$f":"IF(SUM(CI36:CI39)=0,\"\",SUM(CI36:CI39))","v":""},"Nbr de jour","=",{"$f":"IF(SUM(CL36:CL39)=0,\"\",SUM(CL36:CL39))","v":""},"Nbr de jour","=",{"$f":"IF(SUM(CO36:CO39)=0,\"\",SUM(CO36:CO39))","v":""},"Nbr de jour","=",{"$f":"IF(SUM(CR36:CR39)=0,\"\",SUM(CR36:CR39))","v":""},"Nbr de jour","=",{"$f":"IF(SUM(CU36:CU39)=0,\"\",SUM(CU36:CU39))","v":""},"Nbr de jour","=",{"$f":"IF(SUM(CX36:CX39)=0,\"\",SUM(CX36:CX39))","v":""},"Nbr de jour","=",{"$f":"IF(SUM(DA36:DA39)=0,\"\",SUM(DA36:DA39))","v":""},"Nbr de jour","=",{"$f":"IF(SUM(DD36:DD39)=0,\"\",SUM(DD36:DD39))","v":""},"Nbr de jour","=",{"$f":"IF(SUM(DG36:DG39)=0,\"\",SUM(DG36:DG39))","v":""},"Nbr de jour","=",{"$f":"IF(SUM(DJ36:DJ39)=0,\"\",SUM(DJ36:DJ39))","v":""},"Nbr de jour","=",{"$f":"IF(SUM(DM36:DM39)=0,\"\",SUM(DM36:DM39))","v":""},"Nbr de jour","=",{"$f":"IF(SUM(DP36:DP39)=0,\"\",SUM(DP36:DP39))","v":""},"Nbr de jour","=",{"$f":"IF(SUM(DS36:DS39)=0,\"\",SUM(DS36:DS39))","v":""},"Nbr de jour","=",{"$f":"IF(SUM(DV36:DV39)=0,\"\",SUM(DV36:DV39))","v":""},"Nbr de jour","=",{"$f":"IF(SUM(DY36:DY39)=0,\"\",SUM(DY36:DY39))","v":""},"Nbr de jour","=",{"$f":"IF(SUM(EB36:EB39)=0,\"\",SUM(EB36:EB39))","v":""}]
[null,null,null,{"$f":"IF(D43=\"\",\"\",D43)","v":"P1"},"","","","","","","","",""]
[null,null,null,{"$f":"IF(D43=\"\",\"\",D43)","v":"P1"},"","","","","","","","",""]
["Numéro 04","Nom affaire","DET","P1"]
[null,null,null,{"$f":"IF(D43=\"\",\"\",D43)","v":"P1"},"","","","","","","","",""]
[null,"Temps passé en jour =",null,{"$f":"IF(D43=\"\",\"\",D43)","v":"P1"},"","","","","","","","","","Nbr de jour","=",{"$f":"IF(SUM(O41:O44)=0,\"\",SUM(O41:O44))","v":""},"Nbr de jour","=",{"$f":"IF(SUM(R41:R44)=0,\"\",SUM(R41:R44))","v":""},"Nbr de jour","=",{"$f":"IF(SUM(U41:U44)=0,\"\",SUM(U41:U44))","v":""},"Nbr de jour","=",{"$f":"IF(SUM(X41:X44)=0,\"\",SUM(X41:X44))","v":""},"Nbr de jour","=",{"$f":"IF(SUM(AA41:AA44)=0,\"\",SUM(AA41:AA44))","v":""},"Nbr de jour","=",{"$f":"IF(SUM(AD41:AD44)=0,\"\",SUM(AD41:AD44))","v":""},"Nbr de jour","=",{"$f":"IF(SUM(AG41:AG44)=0,\"\",SUM(AG41:AG44))","v":""},"Nbr de jour","=",{"$f":"IF(SUM(AJ41:AJ44)=0,\"\",SUM(AJ41:AJ44))","v":""},"Nbr de jour","=",{"$f":"IF(SUM(AM41:AM44)=0,\"\",SUM(AM41:AM44))","v":""},"Nbr de jour","=",{"$f":"IF(SUM(AP41:AP44)=0,\"\",SUM(AP41:AP44))","v":""},"Nbr de jour","=",{"$f":"IF(SUM(AS41:AS44)=0,\"\",SUM(AS41:AS44))","v":""},"Nbr de jour","=",{"$f":"IF(SUM(AV41:AV44)=0,\"\",SUM(AV41:AV44))","v":""},"Nbr de jour","=",{"$f":"IF(SUM(AY41:AY44)=0,\"\",SUM(AY41:AY44))","v":""},"Nbr de jour","=",{"$f":"IF(SUM(BB41:BB44)=0,\"\",SUM(BB41:BB44))","v":""},"Nbr de jour","=",{"$f":"IF(SUM(BE41:BE44)=0,\"\",SUM(BE41:BE44))","v":""},"Nbr de jour","=",{"$f":"IF(SUM(BH41:BH44)=0,\"\",SUM(BH41:BH44))","v":""},"Nbr de jour","=",{"$f":"IF(SUM(BK41:BK44)=0,\"\",SUM(BK41:BK44))","v":""},"Nbr de jour","=",{"$f":"IF(SUM(BN41:BN44)=0,\"\",SUM(BN41:BN44))","v":""},"Nbr de jour","=",{"$f":"IF(SUM(BQ41:BQ44)=0,\"\",SUM(BQ41:BQ44))","v":""},"Nbr de jour","=",{"$f":"IF(SUM(BT41:BT44)=0,\"\",SUM(BT41:BT44))","v":""},"Nbr de jour","=",{"$f":"IF(SUM(BW41:BW44)=0,\"\",SUM(BW41:BW44))","v":""},"Nbr de jour","=",{"$f":"IF(SUM(BZ41:BZ44)=0,\"\",SUM(BZ41:BZ44))","v":""},"Nbr de jour","=",{"$f":"IF(SUM(CC41:CC44)=0,\"\",SUM(CC41:CC44))","v":""},"Nbr de jour","=",{"$f":"IF(SUM(CF41:CF44)=0,\"\",SUM(CF41:CF44))","v":""},"Nbr de jour","=",{"$f":"IF(SUM(CI41:CI44)=0,\"\",SUM(CI41:CI44))","v":""},"Nbr de jour","=",{"$f":"IF(SUM(CL41:CL44)=0,\"\",SUM(CL41:CL44))","v":""},"Nbr de jour","=",{"$f":"IF(SUM(CO41:CO44)=0,\"\",SUM(CO41:CO44))","v":""},"Nbr de jour","=",{"$f":"IF(SUM(CR41:CR44)=0,\"\",SUM(CR41:CR44))","v":""},"Nbr de jour","=",{"$f":"IF(SUM(CU41:CU44)=0,\"\",SUM(CU41:CU44))","v":""},"Nbr de jour","=",{"$f":"IF(SUM(CX41:CX44)=0,\"\",SUM(CX41:CX44))","v":""},"Nbr de jour","=",{"$f":"IF(SUM(DA41:DA44)=0,\"\",SUM(DA41:DA44))","v":""},"Nbr de jour","=",{"$f":"IF(SUM(DD41:DD44)=0,\"\",SUM(DD41:DD44))","v":""},"Nbr de jour","=",{"$f":"IF(SUM(DG41:DG44)=0,\"\",SUM(DG41:DG44))","v":""},"Nbr de jour","=",{"$f":"IF(SUM(DJ41:DJ44)=0,\"\",SUM(DJ41:DJ44))","v":""},"Nbr de jour","=",{"$f":"IF(SUM(DM41:DM44)=0,\"\",SUM(DM41:DM44))","v":""},"Nbr de jour","=",{"$f":"IF(SUM(DP41:DP44)=0,\"\",SUM(DP41:DP44))","v":""},"Nbr de jour","=",{"$f":"IF(SUM(DS41:DS44)=0,\"\",SUM(DS41:DS44))","v":""},"Nbr de jour","=",{"$f":"IF(SUM(DV41:DV44)=0,\"\",SUM(DV41:DV44))","v":""},"Nbr de jour","=",{"$f":"IF(SUM(DY41:DY44)=0,\"\",SUM(DY41:DY44))","v":""},"Nbr de jour","=",{"$f":"IF(SUM(EB41:EB44)=0,\"\",SUM(EB41:EB44))","v":""}]
[null,null,null,{"$f":"IF(D48=\"\",\"\",D48)","v":""},"","","","P5","","","","",""]
[null,null,null,{"$f":"IF(D48=\"\",\"\",D48)","v":""},"","","","P5","","","","",""]
["Numéro 05","Nom affaire","DET",null,null,null,null,"P5"]
[null,null,null,{"$f":"IF(D48=\"\",\"\",D48)","v":""},"","","","P5","","","","",""]
[null,"Temps passé en jour =",null,{"$f":"IF(D48=\"\",\"\",D48)","v":""},"","","","P5","","","","","","Nbr de jour","=",{"$f":"IF(SUM(O46:O49)=0,\"\",SUM(O46:O49))","v":""},"Nbr de jour","=",{"$f":"IF(SUM(R46:R49)=0,\"\",SUM(R46:R49))","v":""},"Nbr de jour","=",{"$f":"IF(SUM(U46:U49)=0,\"\",SUM(U46:U49))","v":""},"Nbr de jour","=",{"$f":"IF(SUM(X46:X49)=0,\"\",SUM(X46:X49))","v":""},"Nbr de jour","=",{"$f":"IF(SUM(AA46:AA49)=0,\"\",SUM(AA46:AA49))","v":""},"Nbr de jour","=",{"$f":"IF(SUM(AD46:AD49)=0,\"\",SUM(AD46:AD49))","v":""},"Nbr de jour","=",{"$f":"IF(SUM(AG46:AG49)=0,\"\",SUM(AG46:AG49))","v":""},"Nbr de jour","=",{"$f":"IF(SUM(AJ46:AJ49)=0,\"\",SUM(AJ46:AJ49))","v":""},"Nbr de jour","=",{"$f":"IF(SUM(AM46:AM49)=0,\"\",SUM(AM46:AM49))","v":""},"Nbr de jour","=",{"$f":"IF(SUM(AP46:AP49)=0,\"\",SUM(AP46:AP49))","v":""},"Nbr de jour","=",{"$f":"IF(SUM(AS46:AS49)=0,\"\",SUM(AS46:AS49))","v":""},"Nbr de jour","=",{"$f":"IF(SUM(AV46:AV49)=0,\"\",SUM(AV46:AV49))","v":""},"Nbr de jour","=",{"$f":"IF(SUM(AY46:AY49)=0,\"\",SUM(AY46:AY49))","v":""},"Nbr de jour","=",{"$f":"IF(SUM(BB46:BB49)=0,\"\",SUM(BB46:BB49))","v":""},"Nbr de jour","=",{"$f":"IF(SUM(BE46:BE49)=0,\"\",SUM(BE46:BE49))","v":""},"Nbr de jour","=",{"$f":"IF(SUM(BH46:BH49)=0,\"\",SUM(BH46:BH49))","v":""},"Nbr de jour","=",{"$f":"IF(SUM(BK46:BK49)=0,\"\",SUM(BK46:BK49))","v":""},"Nbr de jour","=",{"$f":"IF(SUM(BN46:BN49)=0,\"\",SUM(BN46:BN49))","v":""},"Nbr de jour","=",{"$f":"IF(SUM(BQ46:BQ49)=0,\"\",SUM(BQ46:BQ49))","v":""},"Nbr de jour","=",{"$f":"IF(SUM(BT46:BT49)=0,\"\",SUM(BT46:BT49))","v":""},"Nbr de jour","=",{"$f":"IF(SUM(BW46:BW49)=0,\"\",SUM(BW46:BW49))","v":""},"Nbr de jour","=",{"$f":"IF(SUM(BZ46:BZ49)=0,\"\",SUM(BZ46:BZ49))","v":""},"Nbr de jour","=",{"$f":"IF(SUM(CC46:CC49)=0,\"\",SUM(CC46:CC49))","v":""},"Nbr de jour","=",{"$f":"IF(SUM(CF46:CF49)=0,\"\",SUM(CF46:CF49))","v":""},"Nbr de jour","=",{"$f":"IF(SUM(CI46:CI49)=0,\"\",SUM(CI46:CI49))","v":""},"Nbr de jour","=",{"$f":"IF(SUM(CL46:CL49)=0,\"\",SUM(CL46:CL49))","v":""},"Nbr de jour","=",{"$f":"IF(SUM(CO46:CO49)=0,\"\",SUM(CO46:CO49))","v":""},"Nbr de jour","=",{"$f":"IF(SUM(CR46:CR49)=0,\"\",SUM(CR46:CR49))","v":""},"Nbr de jour","=",{"$f":"IF(SUM(CU46:CU49)=0,\"\",SUM(CU46:CU49))","v":""},"Nbr de jour","=",{"$f":"IF(SUM(CX46:CX49)=0,\"\",SUM(CX46:CX49))","v":""},"Nbr de jour","=",{"$f":"IF(SUM(DA46:DA49)=0,\"\",SUM(DA46:DA49))","v":""},"Nbr de jour","=",{"$f":"IF(SUM(DD46:DD49)=0,\"\",SUM(DD46:DD49))","v":""},"Nbr de jour","=",{"$f":"IF(SUM(DG46:DG49)=0,\"\",SUM(DG46:DG49))","v":""},"Nbr de jour","=",{"$f":"IF(SUM(DJ46:DJ49)=0,\"\",SUM(DJ46:DJ49))","v":""},"Nbr de jour","=",{"$f":"IF(SUM(DM46:DM49)=0,\"\",SUM(DM46:DM49))","v":""},"Nbr de jour","=",{"$f":"IF(SUM(DP46:DP49)=0,\"\",SUM(DP46:DP49))","v":""},"Nbr de jour","=",{"$f":"IF(SUM(DS46:DS49)=0,\"\",SUM(DS46:DS49))","v":""},"Nbr de jour","=",{"$f":"IF(SUM(DV46:DV49)=0,\"\",SUM(DV46:DV49))","v":""},"Nbr de jour","=",{"$f":"IF(SUM(DY46:DY49)=0,\"\",SUM(DY46:DY49))","v":""},"Nbr de jour","=",{"$f":"IF(SUM(EB46:EB49)=0,\"\",SUM(EB46:EB49))","v":""}]
[null,null,null,{"$f":"IF(D53=\"\",\"\",D53)","v":""},"","","P4","","","","","",""]
[null,null,null,{"$f":"IF(D53=\"\",\"\",D53)","v":""},"","","P4","","","","","",""]
["Numéro 06","Nom affaire","EXE",null,null,null,"P4"]
[null,null,null,{"$f":"IF(D53=\"\",\"\",D53)","v":""},"","","P4","","","","","",""]
[null,"Temps passé en jour =",null,{"$f":"IF(D53=\"\",\"\",D53)","v":""},"","","P4","","","","","","","Nbr de jour","=",{"$f":"IF(SUM(O51:O54)=0,\"\",SUM(O51:O54))","v":""},"Nbr de jour","=",{"$f":"IF(SUM(R51:R54)=0,\"\",SUM(R51:R54))","v":""},"Nbr de jour","=",{"$f":"IF(SUM(U51:U54)=0,\"\",SUM(U51:U54))","v":""},"Nbr de jour","=",{"$f":"IF(SUM(X51:X54)=0,\"\",SUM(X51:X54))","v":""},"Nbr de jour","=",{"$f":"IF(SUM(AA51:AA54)=0,\"\",SUM(AA51:AA54))","v":""},"Nbr de jour","=",{"$f":"IF(SUM(AD51:AD54)=0,\"\",SUM(AD51:AD54))","v":""},"Nbr de jour","=",{"$f":"IF(SUM(AG51:AG54)=0,\"\",SUM(AG51:AG54))","v":""},"Nbr de jour","=",{"$f":"IF(SUM(AJ51:AJ54)=0,\"\",SUM(AJ51:AJ54))","v":""},"Nbr de jour","=",{"$f":"IF(SUM(AM51:AM54)=0,\"\",SUM(AM51:AM54))","v":""},"Nbr de jour","=",{"$f":"IF(SUM(AP51:AP54)=0,\"\",SUM(AP51:AP54))","v":""},"Nbr de jour","=",{"$f":"IF(SUM(AS51:AS54)=0,\"\",SUM(AS51:AS54))","v":""},"Nbr de jour","=",{"$f":"IF(SUM(AV51:AV54)=0,\"\",SUM(AV51:AV54))","v":""},"Nbr de jour","=",{"$f":"IF(SUM(AY51:AY54)=0,\"\",SUM(AY51:AY54))","v":""},"Nbr de jour","=",{"$f":"IF(SUM(BB51:BB54)=0,\"\",SUM(BB51:BB54))","v":""},"Nbr de jour","=",{"$f":"IF(SUM(BE51:BE54)=0,\"\",SUM(BE51:BE54))","v":""},"Nbr de jour","=",{"$f":"IF(SUM(BH51:BH54)=0,\"\",SUM(BH51:BH54))","v":""},"Nbr de jour","=",{"$f":"IF(SUM(BK51:BK54)=0,\"\",SUM(BK51:BK54))","v":""},"Nbr de jour","=",{"$f":"IF(SUM(BN51:BN54)=0,\"\",SUM(BN51:BN54))","v":""},"Nbr de jour","=",{"$f":"IF(SUM(BQ51:BQ54)=0,\"\",SUM(BQ51:BQ54))","v":""},"Nbr de jour","=",{"$f":"IF(SUM(BT51:BT54)=0,\"\",SUM(BT51:BT54))","v":""},"Nbr de jour","=",{"$f":"IF(SUM(BW51:BW54)=0,\"\",SUM(BW51:BW54))","v":""},"Nbr de jour","=",{"$f":"IF(SUM(BZ51:BZ54)=0,\"\",SUM(BZ51:BZ54))","v":""},"Nbr de jour","=",{"$f":"IF(SUM(CC51:CC54)=0,\"\",SUM(CC51:CC54))","v":""},"Nbr de jour","=",{"$f":"IF(SUM(CF51:CF54)=0,\"\",SUM(CF51:CF54))","v":""},"Nbr de jour","=",{"$f":"IF(SUM(CI51:CI54)=0,\"\",SUM(CI51:CI54))","v":""},"Nbr de jour","=",{"$f":"IF(SUM(CL51:CL54)=0,\"\",SUM(CL51:CL54))","v":""},"Nbr de jour","=",{"$f":"IF(SUM(CO51:CO54)=0,\"\",SUM(CO51:CO54))","v":""},"Nbr de jour","=",{"$f":"IF(SUM(CR51:CR54)=0,\"\",SUM(CR51:CR54))","v":""},"Nbr de jour","=",{"$f":"IF(SUM(CU51:CU54)=0,\"\",SUM(CU51:CU54))","v":""},"Nbr de jour","=",{"$f":"IF(SUM(CX51:CX54)=0,\"\",SUM(CX51:CX54))","v":""},"Nbr de jour","=",{"$f":"IF(SUM(DA51:DA54)=0,\"\",SUM(DA51:DA54))","v":""},"Nbr de jour","=",{"$f":"IF(SUM(DD51:DD54)=0,\"\",SUM(DD51:DD54))","v":""},"Nbr de jour","=",{"$f":"IF(SUM(DG51:DG54)=0,\"\",SUM(DG51:DG54))","v":""},"Nbr de jour","=",{"$f":"IF(SUM(DJ51:DJ54)=0,\"\",SUM(DJ51:DJ54))","v":""},"Nbr de jour","=",{"$f":"IF(SUM(DM51:DM54)=0,\"\",SUM(DM51:DM54))","v":""},"Nbr de jour","=",{"$f":"IF(SUM(DP51:DP54)=0,\"\",SUM(DP51:DP54))","v":""},"Nbr de jour","=",{"$f":"IF(SUM(DS51:DS54)=0,\"\",SUM(DS51:DS54))","v":""},"Nbr de jour","=",{"$f":"IF(SUM(DV51:DV54)=0,\"\",SUM(DV51:DV54))","v":""},"Nbr de jour","=",{"$f":"IF(SUM(DY51:DY54)=0,\"\",SUM(DY51:DY54))","v":""},"Nbr de jour","=",{"$f":"IF(SUM(EB51:EB54)=0,\"\",SUM(EB51:EB54))","v":""}]
[null,null,null,{"$f":"IF(D58=\"\",\"\",D58)","v":""},"","","","","","P7","","",""]
[null,null,null,{"$f":"IF(D58=\"\",\"\",D58)","v":""},"","","","","","P7","","",""]
["Numéro 07","Nom affaire","EXE",null,null,null,null,null,null,"P7"]
[null,null,null,{"$f":"IF(D58=\"\",\"\",D58)","v":""},"","","","","","P7","","",""]
[null,"Temps passé en jour =",null,{"$f":"IF(D58=\"\",\"\",D58)","v":""},"","","","","","P7","","","","Nbr de jour","=",{"$f":"IF(SUM(O56:O59)=0,\"\",SUM(O56:O59))","v":""},"Nbr de jour","=",{"$f":"IF(SUM(R56:R59)=0,\"\",SUM(R56:R59))","v":""},"Nbr de jour","=",{"$f":"IF(SUM(U56:U59)=0,\"\",SUM(U56:U59))","v":""},"Nbr de jour","=",{"$f":"IF(SUM(X56:X59)=0,\"\",SUM(X56:X59))","v":""},"Nbr de jour","=",{"$f":"IF(SUM(AA56:AA59)=0,\"\",SUM(AA56:AA59))","v":""},"Nbr de jour","=",{"$f":"IF(SUM(AD56:AD59)=0,\"\",SUM(AD56:AD59))","v":""},"Nbr de jour","=",{"$f":"IF(SUM(AG56:AG59)=0,\"\",SUM(AG56:AG59))","v":""},"Nbr de jour","=",{"$f":"IF(SUM(AJ56:AJ59)=0,\"\",SUM(AJ56:AJ59))","v":""},"Nbr de jour","=",{"$f":"IF(SUM(AM56:AM59)=0,\"\",SUM(AM56:AM59))","v":""},"Nbr de jour","=",{"$f":"IF(SUM(AP56:AP59)=0,\"\",SUM(AP56:AP59))","v":""},"Nbr de jour","=",{"$f":"IF(SUM(AS56:AS59)=0,\"\",SUM(AS56:AS59))","v":""},"Nbr de jour","=",{"$f":"IF(SUM(AV56:AV59)=0,\"\",SUM(AV56:AV59))","v":""},"Nbr de jour","=",{"$f":"IF(SUM(AY56:AY59)=0,\"\",SUM(AY56:AY59))","v":""},"Nbr de jour","=",{"$f":"IF(SUM(BB56:BB59)=0,\"\",SUM(BB56:BB59))","v":""},"Nbr de jour","=",{"$f":"IF(SUM(BE56:BE59)=0,\"\",SUM(BE56:BE59))","v":""},"Nbr de jour","=",{"$f":"IF(SUM(BH56:BH59)=0,\"\",SUM(BH56:BH59))","v":""},"Nbr de jour","=",{"$f":"IF(SUM(BK56:BK59)=0,\"\",SUM(BK56:BK59))","v":""},"Nbr de jour","=",{"$f":"IF(SUM(BN56:BN59)=0,\"\",SUM(BN56:BN59))","v":""},"Nbr de jour","=",{"$f":"IF(SUM(BQ56:BQ59)=0,\"\",SUM(BQ56:BQ59))","v":""},"Nbr de jour","=",{"$f":"IF(SUM(BT56:BT59)=0,\"\",SUM(BT56:BT59))","v":""},"Nbr de jour","=",{"$f":"IF(SUM(BW56:BW59)=0,\"\",SUM(BW56:BW59))","v":""},"Nbr de jour","=",{"$f":"IF(SUM(BZ56:BZ59)=0,\"\",SUM(BZ56:BZ59))","v":""},"Nbr de jour","=",{"$f":"IF(SUM(CC56:CC59)=0,\"\",SUM(CC56:CC59))","v":""},"Nbr de jour","=",{"$f":"IF(SUM(CF56:CF59)=0,\"\",SUM(CF56:CF59))","v":""},"Nbr de jour","=",{"$f":"IF(SUM(CI56:CI59)=0,\"\",SUM(CI56:CI59))","v":""},"Nbr de jour","=",{"$f":"IF(SUM(CL56:CL59)=0,\"\",SUM(CL56:CL59))","v":""},"Nbr de jour","=",{"$f":"IF(SUM(CO56:CO59)=0,\"\",SUM(CO56:CO59))","v":""},"Nbr de jour","=",{"$f":"IF(SUM(CR56:CR59)=0,\"\",SUM(CR56:CR59))","v":""},"Nbr de jour","=",{"$f":"IF(SUM(CU56:CU59)=0,\"\",SUM(CU56:CU59))","v":""},"Nbr de jour","=",{"$f":"IF(SUM(CX56:CX59)=0,\"\",SUM(CX56:CX59))","v":""},"Nbr de jour","=",{"$f":"IF(SUM(DA56:DA59)=0,\"\",SUM(DA56:DA59))","v":""},"Nbr de jour","=",{"$f":"IF(SUM(DD56:DD59)=0,\"\",SUM(DD56:DD59))","v":""},"Nbr de jour","=",{"$f":"IF(SUM(DG56:DG59)=0,\"\",SUM(DG56:DG59))","v":""},"Nbr de jour","=",{"$f":"IF(SUM(DJ56:DJ59)=0,\"\",SUM(DJ56:DJ59))","v":""},"Nbr de jour","=",{"$f":"IF(SUM(DM56:DM59)=0,\"\",SUM(DM56:DM59))","v":""},"Nbr de jour","=",{"$f":"IF(SUM(DP56:DP59)=0,\"\",SUM(DP56:DP59))","v":""},"Nbr de jour","=",{"$f":"IF(SUM(DS56:DS59)=0,\"\",SUM(DS56:DS59))","v":""},"Nbr de jour","=",{"$f":"IF(SUM(DV56:DV59)=0,\"\",SUM(DV56:DV59))","v":""},"Nbr de jour","=",{"$f":"IF(SUM(DY56:DY59)=0,\"\",SUM(DY56:DY59))","v":""},"Nbr de jour","=",{"$f":"IF(SUM(EB56:EB59)=0,\"\",SUM(EB56:EB59))","v":""}]
[null,null,null,{"$f":"IF(D63=\"\",\"\",D63)","v":"P1"},"","","","","","","","",""]
[null,null,null,{"$f":"IF(D63=\"\",\"\",D63)","v":"P1"},"","","","","","","","",""]
["Numéro 08","Nom affaire","EXE","P1"]
[null,null,null,{"$f":"IF(D63=\"\",\"\",D63)","v":"P1"},"","","","","","","","",""]
[null,"Temps passé en jour =",null,{"$f":"IF(D63=\"\",\"\",D63)","v":"P1"},"","","","","","","","","","Nbr de jour","=",{"$f":"IF(SUM(O61:O64)=0,\"\",SUM(O61:O64))","v":""},"Nbr de jour","=",{"$f":"IF(SUM(R61:R64)=0,\"\",SUM(R61:R64))","v":""},"Nbr de jour","=",{"$f":"IF(SUM(U61:U64)=0,\"\",SUM(U61:U64))","v":""},"Nbr de jour","=",{"$f":"IF(SUM(X61:X64)=0,\"\",SUM(X61:X64))","v":""},"Nbr de jour","=",{"$f":"IF(SUM(AA61:AA64)=0,\"\",SUM(AA61:AA64))","v":""},"Nbr de jour","=",{"$f":"IF(SUM(AD61:AD64)=0,\"\",SUM(AD61:AD64))","v":""},"Nbr de jour","=",{"$f":"IF(SUM(AG61:AG64)=0,\"\",SUM(AG61:AG64))","v":""},"Nbr de jour","=",{"$f":"IF(SUM(AJ61:AJ64)=0,\"\",SUM(AJ61:AJ64))","v":""},"Nbr de jour","=",{"$f":"IF(SUM(AM61:AM64)=0,\"\",SUM(AM61:AM64))","v":""},"Nbr de jour","=",{"$f":"IF(SUM(AP61:AP64)=0,\"\",SUM(AP61:AP64))","v":""},"Nbr de jour","=",{"$f":"IF(SUM(AS61:AS64)=0,\"\",SUM(AS61:AS64))","v":""},"Nbr de jour","=",{"$f":"IF(SUM(AV61:AV64)=0,\"\",SUM(AV61:AV64))","v":""},"Nbr de jour","=",{"$f":"IF(SUM(AY61:AY64)=0,\"\",SUM(AY61:AY64))","v":""},"Nbr de jour","=",{"$f":"IF(SUM(BB61:BB64)=0,\"\",SUM(BB61:BB64))","v":""},"Nbr de jour","=",{"$f":"IF(SUM(BE61:BE64)=0,\"\",SUM(BE61:BE64))","v":""},"Nbr de jour","=",{"$f":"IF(SUM(BH61:BH64)=0,\"\",SUM(BH61:BH64))","v":""},"Nbr de jour","=",{"$f":"IF(SUM(BK61:BK64)=0,\"\",SUM(BK61:BK64))","v":""},"Nbr de jour","=",{"$f":"IF(SUM(BN61:BN64)=0,\"\",SUM(BN61:BN64))","v":""},"Nbr de jour","=",{"$f":"IF(SUM(BQ61:BQ64)=0,\"\",SUM(BQ61:BQ64))","v":""},"Nbr de jour","=",{"$f":"IF(SUM(BT61:BT64)=0,\"\",SUM(BT61:BT64))","v":""},"Nbr de jour","=",{"$f":"IF(SUM(BW61:BW64)=0,\"\",SUM(BW61:BW64))","v":""},"Nbr de jour","=",{"$f":"IF(SUM(BZ61:BZ64)=0,\"\",SUM(BZ61:BZ64))","v":""},"Nbr de jour","=",{"$f":"IF(SUM(CC61:CC64)=0,\"\",SUM(CC61:CC64))","v":""},"Nbr de jour","=",{"$f":"IF(SUM(CF61:CF64)=0,\"\",SUM(CF61:CF64))","v":""},"Nbr de jour","=",{"$f":"IF(SUM(CI61:CI64)=0,\"\",SUM(CI61:CI64))","v":""},"Nbr de jour","=",{"$f":"IF(SUM(CL61:CL64)=0,\"\",SUM(CL61:CL64))","v":""},"Nbr de jour","=",{"$f":"IF(SUM(CO61:CO64)=0,\"\",SUM(CO61:CO64))","v":""},"Nbr de jour","=",{"$f":"IF(SUM(CR61:CR64)=0,\"\",SUM(CR61:CR64))","v":""},"Nbr de jour","=",{"$f":"IF(SUM(CU61:CU64)=0,\"\",SUM(CU61:CU64))","v":""},"Nbr de jour","=",{"$f":"IF(SUM(CX61:CX64)=0,\"\",SUM(CX61:CX64))","v":""},"Nbr de jour","=",{"$f":"IF(SUM(DA61:DA64)=0,\"\",SUM(DA61:DA64))","v":""},"Nbr de jour","=",{"$f":"IF(SUM(DD61:DD64)=0,\"\",SUM(DD61:DD64))","v":""},"Nbr de jour","=",{"$f":"IF(SUM(DG61:DG64)=0,\"\",SUM(DG61:DG64))","v":""},"Nbr de jour","=",{"$f":"IF(SUM(DJ61:DJ64)=0,\"\",SUM(DJ61:DJ64))","v":""},"Nbr de jour","=",{"$f":"IF(SUM(DM61:DM64)=0,\"\",SUM(DM61:DM64))","v":""},"Nbr de jour","=",{"$f":"IF(SUM(DP61:DP64)=0,\"\",SUM(DP61:DP64))","v":""},"Nbr de jour","=",{"$f":"IF(SUM(DS61:DS64)=0,\"\",SUM(DS61:DS64))","v":""},"Nbr de jour","=",{"$f":"IF(SUM(DV61:DV64)=0,\"\",SUM(DV61:DV64))","v":""},"Nbr de jour","=",{"$f":"IF(SUM(DY61:DY64)=0,\"\",SUM(DY61:DY64))","v":""},"Nbr de jour","=",{"$f":"IF(SUM(EB61:EB64)=0,\"\",SUM(EB61:EB64))","v":""}]
[null,null,null,{"$f":"IF(D68=\"\",\"\",D68)","v":""},"","P3","","","","","","",""]
[null,null,null,{"$f":"IF(D68=\"\",\"\",D68)","v":""},"","P3","","","","","","",""]
["Numéro 09","Nom affaire","DCE",null,null,"P3"]
[null,null,null,{"$f":"IF(D68=\"\",\"\",D68)","v":""},"","P3","","","","","","",""]
[null,"Temps passé en jour =",null,{"$f":"IF(D68=\"\",\"\",D68)","v":""},"","P3","","","","","","","","Nbr de jour","=",{"$f":"IF(SUM(O66:O69)=0,\"\",SUM(O66:O69))","v":""},"Nbr de jour","=",{"$f":"IF(SUM(R66:R69)=0,\"\",SUM(R66:R69))","v":""},"Nbr de jour","=",{"$f":"IF(SUM(U66:U69)=0,\"\",SUM(U66:U69))","v":""},"Nbr de jour","=",{"$f":"IF(SUM(X66:X69)=0,\"\",SUM(X66:X69))","v":""},"Nbr de jour","=",{"$f":"IF(SUM(AA66:AA69)=0,\"\",SUM(AA66:AA69))","v":""},"Nbr de jour","=",{"$f":"IF(SUM(AD66:AD69)=0,\"\",SUM(AD66:AD69))","v":""},"Nbr de jour","=",{"$f":"IF(SUM(AG66:AG69)=0,\"\",SUM(AG66:AG69))","v":""},"Nbr de jour","=",{"$f":"IF(SUM(AJ66:AJ69)=0,\"\",SUM(AJ66:AJ69))","v":""},"Nbr de jour","=",{"$f":"IF(SUM(AM66:AM69)=0,\"\",SUM(AM66:AM69))","v":""},"Nbr de jour","=",{"$f":"IF(SUM(AP66:AP69)=0,\"\",SUM(AP66:AP69))","v":""},"Nbr de jour","=",{"$f":"IF(SUM(AS66:AS69)=0,\"\",SUM(AS66:AS69))","v":""},"Nbr de jour","=",{"$f":"IF(SUM(AV66:AV69)=0,\"\",SUM(AV66:AV69))","v":""},"Nbr de jour","=",{"$f":"IF(SUM(AY66:AY69)=0,\"\",SUM(AY66:AY69))","v":""},"Nbr de jour","=",{"$f":"IF(SUM(BB66:BB69)=0,\"\",SUM(BB66:BB69))","v":""},"Nbr de jour","=",{"$f":"IF(SUM(BE66:BE69)=0,\"\",SUM(BE66:BE69))","v":""},"Nbr de jour","=",{"$f":"IF(SUM(BH66:BH69)=0,\"\",SUM(BH66:BH69))","v":""},"Nbr de jour","=",{"$f":"IF(SUM(BK66:BK69)=0,\"\",SUM(BK66:BK69))","v":""},"Nbr de jour","=",{"$f":"IF(SUM(BN66:BN69)=0,\"\",SUM(BN66:BN69))","v":""},"Nbr de jour","=",{"$f":"IF(SUM(BQ66:BQ69)=0,\"\",SUM(BQ66:BQ69))","v":""},"Nbr de jour","=",{"$f":"IF(SUM(BT66:BT69)=0,\"\",SUM(BT66:BT69))","v":""},"Nbr de jour","=",{"$f":"IF(SUM(BW66:BW69)=0,\"\",SUM(BW66:BW69))","v":""},"Nbr de jour","=",{"$f":"IF(SUM(BZ66:BZ69)=0,\"\",SUM(BZ66:BZ69))","v":""},"Nbr de jour","=",{"$f":"IF(SUM(CC66:CC69)=0,\"\",SUM(CC66:CC69))","v":""},"Nbr de jour","=",{"$f":"IF(SUM(CF66:CF69)=0,\"\",SUM(CF66:CF69))","v":""},"Nbr de jour","=",{"$f":"IF(SUM(CI66:CI69)=0,\"\",SUM(CI66:CI69))","v":""},"Nbr de jour","=",{"$f":"IF(SUM(CL66:CL69)=0,\"\",SUM(CL66:CL69))","v":""},"Nbr de jour","=",{"$f":"IF(SUM(CO66:CO69)=0,\"\",SUM(CO66:CO69))","v":""},"Nbr de jour","=",{"$f":"IF(SUM(CR66:CR69)=0,\"\",SUM(CR66:CR69))","v":""},"Nbr de jour","=",{"$f":"IF(SUM(CU66:CU69)=0,\"\",SUM(CU66:CU69))","v":""},"Nbr de jour","=",{"$f":"IF(SUM(CX66:CX69)=0,\"\",SUM(CX66:CX69))","v":""},"Nbr de jour","=",{"$f":"IF(SUM(DA66:DA69)=0,\"\",SUM(DA66:DA69))","v":""},"Nbr de jour","=",{"$f":"IF(SUM(DD66:DD69)=0,\"\",SUM(DD66:DD69))","v":""},"Nbr de jour","=",{"$f":"IF(SUM(DG66:DG69)=0,\"\",SUM(DG66:DG69))","v":""},"Nbr de jour","=",{"$f":"IF(SUM(DJ66:DJ69)=0,\"\",SUM(DJ66:DJ69))","v":""},"Nbr de jour","=",{"$f":"IF(SUM(DM66:DM69)=0,\"\",SUM(DM66:DM69))","v":""},"Nbr de jour","=",{"$f":"IF(SUM(DP66:DP69)=0,\"\",SUM(DP66:DP69))","v":""},"Nbr de jour","=",{"$f":"IF(SUM(DS66:DS69)=0,\"\",SUM(DS66:DS69))","v":""},"Nbr de jour","=",{"$f":"IF(SUM(DV66:DV69)=0,\"\",SUM(DV66:DV69))","v":""},"Nbr de jour","=",{"$f":"IF(SUM(DY66:DY69)=0,\"\",SUM(DY66:DY69))","v":""},"Nbr de jour","=",{"$f":"IF(SUM(EB66:EB69)=0,\"\",SUM(EB66:EB69))","v":""}]
[null,null,null,{"$f":"IF(D73=\"\",\"\",D73)","v":""},"","P3","","","","","","",""]
[null,null,null,{"$f":"IF(D73=\"\",\"\",D73)","v":""},"","P3","","","","","","",""]
["Numéro 10","Nom affaire","DCE",null,null,"P3"]
[null,null,null,{"$f":"IF(D73=\"\",\"\",D73)","v":""},"","P3","","","","","","",""]
[null,"Temps passé en jour =",null,{"$f":"IF(D73=\"\",\"\",D73)","v":""},"","P3","","","","","","","","Nbr de jour","=",{"$f":"IF(SUM(O71:O74)=0,\"\",SUM(O71:O74))","v":""},"Nbr de jour","=",{"$f":"IF(SUM(R71:R74)=0,\"\",SUM(R71:R74))","v":""},"Nbr de jour","=",{"$f":"IF(SUM(U71:U74)=0,\"\",SUM(U71:U74))","v":""},"Nbr de jour","=",{"$f":"IF(SUM(X71:X74)=0,\"\",SUM(X71:X74))","v":""},"Nbr de jour","=",{"$f":"IF(SUM(AA71:AA74)=0,\"\",SUM(AA71:AA74))","v":""},"Nbr de jour","=",{"$f":"IF(SUM(AD71:AD74)=0,\"\",SUM(AD71:AD74))","v":""},"Nbr de jour","=",{"$f":"IF(SUM(AG71:AG74)=0,\"\",SUM(AG71:AG74))","v":""},"Nbr de jour","=",{"$f":"IF(SUM(AJ71:AJ74)=0,\"\",SUM(AJ71:AJ74))","v":""},"Nbr de jour","=",{"$f":"IF(SUM(AM71:AM74)=0,\"\",SUM(AM71:AM74))","v":""},"Nbr de jour","=",{"$f":"IF(SUM(AP71:AP74)=0,\"\",SUM(AP71:AP74))","v":""},"Nbr de jour","=",{"$f":"IF(SUM(AS71:AS74)=0,\"\",SUM(AS71:AS74))","v":""},"Nbr de jour","=",{"$f":"IF(SUM(AV71:AV74)=0,\"\",SUM(AV71:AV74))","v":""},"Nbr de jour","=",{"$f":"IF(SUM(AY71:AY74)=0,\"\",SUM(AY71:AY74))","v":""},"Nbr de jour","=",{"$f":"IF(SUM(BB71:BB74)=0,\"\",SUM(BB71:BB74))","v":""},"Nbr de jour","=",{"$f":"IF(SUM(BE71:BE74)=0,\"\",SUM(BE71:BE74))","v":""},"Nbr de jour","=",{"$f":"IF(SUM(BH71:BH74)=0,\"\",SUM(BH71:BH74))","v":""},"Nbr de jour","=",{"$f":"IF(SUM(BK71:BK74)=0,\"\",SUM(BK71:BK74))","v":""},"Nbr de jour","=",{"$f":"IF(SUM(BN71:BN74)=0,\"\",SUM(BN71:BN74))","v":""},"Nbr de jour","=",{"$f":"IF(SUM(BQ71:BQ74)=0,\"\",SUM(BQ71:BQ74))","v":""},"Nbr de jour","=",{"$f":"IF(SUM(BT71:BT74)=0,\"\",SUM(BT71:BT74))","v":""},"Nbr de jour","=",{"$f":"IF(SUM(BW71:BW74)=0,\"\",SUM(BW71:BW74))","v":""},"Nbr de jour","=",{"$f":"IF(SUM(BZ71:BZ74)=0,\"\",SUM(BZ71:BZ74))","v":""},"Nbr de jour","=",{"$f":"IF(SUM(CC71:CC74)=0,\"\",SUM(CC71:CC74))","v":""},"Nbr de jour","=",{"$f":"IF(SUM(CF71:CF74)=0,\"\",SUM(CF71:CF74))","v":""},"Nbr de jour","=",{"$f":"IF(SUM(CI71:CI74)=0,\"\",SUM(CI71:CI74))","v":""},"Nbr de jour","=",{"$f":"IF(SUM(CL71:CL74)=0,\"\",SUM(CL71:CL74))","v":""},"Nbr de jour","=",{"$f":"IF(SUM(CO71:CO74)=0,\"\",SUM(CO71:CO74))","v":""},"Nbr de jour","=",{"$f":"IF(SUM(CR71:CR74)=0,\"\",SUM(CR71:CR74))","v":""},"Nbr de jour","=",{"$f":"IF(SUM(CU71:CU74)=0,\"\",SUM(CU71:CU74))","v":""},"Nbr de jour","=",{"$f":"IF(SUM(CX71:CX74)=0,\"\",SUM(CX71:CX74))","v":""},"Nbr de jour","=",{"$f":"IF(SUM(DA71:DA74)=0,\"\",SUM(DA71:DA74))","v":""},"Nbr de jour","=",{"$f":"IF(SUM(DD71:DD74)=0,\"\",SUM(DD71:DD74))","v":""},"Nbr de jour","=",{"$f":"IF(SUM(DG71:DG74)=0,\"\",SUM(DG71:DG74))","v":""},"Nbr de jour","=",{"$f":"IF(SUM(DJ71:DJ74)=0,\"\",SUM(DJ71:DJ74))","v":""},"Nbr de jour","=",{"$f":"IF(SUM(DM71:DM74)=0,\"\",SUM(DM71:DM74))","v":""},"Nbr de jour","=",{"$f":"IF(SUM(DP71:DP74)=0,\"\",SUM(DP71:DP74))","v":""},"Nbr de jour","=",{"$f":"IF(SUM(DS71:DS74)=0,\"\",SUM(DS71:DS74))","v":""},"Nbr de jour","=",{"$f":"IF(SUM(DV71:DV74)=0,\"\",SUM(DV71:DV74))","v":""},"Nbr de jour","=",{"$f":"IF(SUM(DY71:DY74)=0,\"\",SUM(DY71:DY74))","v":""},"Nbr de jour","=",{"$f":"IF(SUM(EB71:EB74)=0,\"\",SUM(EB71:EB74))","v":""}]
[null,null,null,{"$f":"IF(D78=\"\",\"\",D78)","v":""},"","P3","","","","","","",""]
[null,null,null,{"$f":"IF(D78=\"\",\"\",D78)","v":""},"","P3","","","","","","",""]
["Numéro 11","Nom affaire","EXE",null,null,"P3"]
[null,null,null,{"$f":"IF(D78=\"\",\"\",D78)","v":""},"","P3","","","","","","",""]
[null,"Temps passé en jour =",null,{"$f":"IF(D78=\"\",\"\",D78)","v":""},"","P3","","","","","","","","Nbr de jour","=",{"$f":"IF(SUM(O76:O79)=0,\"\",SUM(O76:O79))","v":""},"Nbr de jour","=",{"$f":"IF(SUM(R76:R79)=0,\"\",SUM(R76:R79))","v":""},"Nbr de jour","=",{"$f":"IF(SUM(U76:U79)=0,\"\",SUM(U76:U79))","v":""},"Nbr de jour","=",{"$f":"IF(SUM(X76:X79)=0,\"\",SUM(X76:X79))","v":""},"Nbr de jour","=",{"$f":"IF(SUM(AA76:AA79)=0,\"\",SUM(AA76:AA79))","v":""},"Nbr de jour","=",{"$f":"IF(SUM(AD76:AD79)=0,\"\",SUM(AD76:AD79))","v":""},"Nbr de jour","=",{"$f":"IF(SUM(AG76:AG79)=0,\"\",SUM(AG76:AG79))","v":""},"Nbr de jour","=",{"$f":"IF(SUM(AJ76:AJ79)=0,\"\",SUM(AJ76:AJ79))","v":""},"Nbr de jour","=",{"$f":"IF(SUM(AM76:AM79)=0,\"\",SUM(AM76:AM79))","v":""},"Nbr de jour","=",{"$f":"IF(SUM(AP76:AP79)=0,\"\",SUM(AP76:AP79))","v":""},"Nbr de jour","=",{"$f":"IF(SUM(AS76:AS79)=0,\"\",SUM(AS76:AS79))","v":""},"Nbr de jour","=",{"$f":"IF(SUM(AV76:AV79)=0,\"\",SUM(AV76:AV79))","v":""},"Nbr de jour","=",{"$f":"IF(SUM(AY76:AY79)=0,\"\",SUM(AY76:AY79))","v":""},"Nbr de jour","=",{"$f":"IF(SUM(BB76:BB79)=0,\"\",SUM(BB76:BB79))","v":""},"Nbr de jour","=",{"$f":"IF(SUM(BE76:BE79)=0,\"\",SUM(BE76:BE79))","v":""},"Nbr de jour","=",{"$f":"IF(SUM(BH76:BH79)=0,\"\",SUM(BH76:BH79))","v":""},"Nbr de jour","=",{"$f":"IF(SUM(BK76:BK79)=0,\"\",SUM(BK76:BK79))","v":""},"Nbr de jour","=",{"$f":"IF(SUM(BN76:BN79)=0,\"\",SUM(BN76:BN79))","v":""},"Nbr de jour","=",{"$f":"IF(SUM(BQ76:BQ79)=0,\"\",SUM(BQ76:BQ79))","v":""},"Nbr de jour","=",{"$f":"IF(SUM(BT76:BT79)=0,\"\",SUM(BT76:BT79))","v":""},"Nbr de jour","=",{"$f":"IF(SUM(BW76:BW79)=0,\"\",SUM(BW76:BW79))","v":""},"Nbr de jour","=",{"$f":"IF(SUM(BZ76:BZ79)=0,\"\",SUM(BZ76:BZ79))","v":""},"Nbr de jour","=",{"$f":"IF(SUM(CC76:CC79)=0,\"\",SUM(CC76:CC79))","v":""},"Nbr de jour","=",{"$f":"IF(SUM(CF76:CF79)=0,\"\",SUM(CF76:CF79))","v":""},"Nbr de jour","=",{"$f":"IF(SUM(CI76:CI79)=0,\"\",SUM(CI76:CI79))","v":""},"Nbr de jour","=",{"$f":"IF(SUM(CL76:CL79)=0,\"\",SUM(CL76:CL79))","v":""},"Nbr de jour","=",{"$f":"IF(SUM(CO76:CO79)=0,\"\",SUM(CO76:CO79))","v":""},"Nbr de jour","=",{"$f":"IF(SUM(CR76:CR79)=0,\"\",SUM(CR76:CR79))","v":""},"Nbr de jour","=",{"$f":"IF(SUM(CU76:CU79)=0,\"\",SUM(CU76:CU79))","v":""},"Nbr de jour","=",{"$f":"IF(SUM(CX76:CX79)=0,\"\",SUM(CX76:CX79))","v":""},"Nbr de jour","=",{"$f":"IF(SUM(DA76:DA79)=0,\"\",SUM(DA76:DA79))","v":""},"Nbr de jour","=",{"$f":"IF(SUM(DD76:DD79)=0,\"\",SUM(DD76:DD79))","v":""},"Nbr de jour","=",{"$f":"IF(SUM(DG76:DG79)=0,\"\",SUM(DG76:DG79))","v":""},"Nbr de jour","=",{"$f":"IF(SUM(DJ76:DJ79)=0,\"\",SUM(DJ76:DJ79))","v":""},"Nbr de jour","=",{"$f":"IF(SUM(DM76:DM79)=0,\"\",SUM(DM76:DM79))","v":""},"Nbr de jour","=",{"$f":"IF(SUM(DP76:DP79)=0,\"\",SUM(DP76:DP79))","v":""},"Nbr de jour","=",{"$f":"IF(SUM(DS76:DS79)=0,\"\",SUM(DS76:DS79))","v":""},"Nbr de jour","=",{"$f":"IF(SUM(DV76:DV79)=0,\"\",SUM(DV76:DV79))","v":""},"Nbr de jour","=",{"$f":"IF(SUM(DY76:DY79)=0,\"\",SUM(DY76:DY79))","v":""},"Nbr de jour","=",{"$f":"IF(SUM(EB76:EB79)=0,\"\",SUM(EB76:EB79))","v":""}]
[null,null,null,{"$f":"IF(D83=\"\",\"\",D83)","v":""},"","P3","","","","","","",""]
[null,null,null,{"$f":"IF(D83=\"\",\"\",D83)","v":""},"","P3","","","","","","",""]
["Numéro 12","Nom affaire","EXE",null,null,"P3"]
[null,null,null,{"$f":"IF(D83=\"\",\"\",D83)","v":""},"","P3","","","","","","",""]
[null,"Temps passé en jour =",null,{"$f":"IF(D83=\"\",\"\",D83)","v":""},"","P3","","","","","","","","Nbr de jour","=",{"$f":"IF(SUM(O81:O84)=0,\"\",SUM(O81:O84))","v":""},"Nbr de jour","=",{"$f":"IF(SUM(R81:R84)=0,\"\",SUM(R81:R84))","v":""},"Nbr de jour","=",{"$f":"IF(SUM(U81:U84)=0,\"\",SUM(U81:U84))","v":""},"Nbr de jour","=",{"$f":"IF(SUM(X81:X84)=0,\"\",SUM(X81:X84))","v":""},"Nbr de jour","=",{"$f":"IF(SUM(AA81:AA84)=0,\"\",SUM(AA81:AA84))","v":""},"Nbr de jour","=",{"$f":"IF(SUM(AD81:AD84)=0,\"\",SUM(AD81:AD84))","v":""},"Nbr de jour","=",{"$f":"IF(SUM(AG81:AG84)=0,\"\",SUM(AG81:AG84))","v":""},"Nbr de jour","=",{"$f":"IF(SUM(AJ81:AJ84)=0,\"\",SUM(AJ81:AJ84))","v":""},"Nbr de jour","=",{"$f":"IF(SUM(AM81:AM84)=0,\"\",SUM(AM81:AM84))","v":""},"Nbr de jour","=",{"$f":"IF(SUM(AP81:AP84)=0,\"\",SUM(AP81:AP84))","v":""},"Nbr de jour","=",{"$f":"IF(SUM(AS81:AS84)=0,\"\",SUM(AS81:AS84))","v":""},"Nbr de jour","=",{"$f":"IF(SUM(AV81:AV84)=0,\"\",SUM(AV81:AV84))","v":""},"Nbr de jour","=",{"$f":"IF(SUM(AY81:AY84)=0,\"\",SUM(AY81:AY84))","v":""},"Nbr de jour","=",{"$f":"IF(SUM(BB81:BB84)=0,\"\",SUM(BB81:BB84))","v":""},"Nbr de jour","=",{"$f":"IF(SUM(BE81:BE84)=0,\"\",SUM(BE81:BE84))","v":""},"Nbr de jour","=",{"$f":"IF(SUM(BH81:BH84)=0,\"\",SUM(BH81:BH84))","v":""},"Nbr de jour","=",{"$f":"IF(SUM(BK81:BK84)=0,\"\",SUM(BK81:BK84))","v":""},"Nbr de jour","=",{"$f":"IF(SUM(BN81:BN84)=0,\"\",SUM(BN81:BN84))","v":""},"Nbr de jour","=",{"$f":"IF(SUM(BQ81:BQ84)=0,\"\",SUM(BQ81:BQ84))","v":""},"Nbr de jour","=",{"$f":"IF(SUM(BT81:BT84)=0,\"\",SUM(BT81:BT84))","v":""},"Nbr de jour","=",{"$f":"IF(SUM(BW81:BW84)=0,\"\",SUM(BW81:BW84))","v":""},"Nbr de jour","=",{"$f":"IF(SUM(BZ81:BZ84)=0,\"\",SUM(BZ81:BZ84))","v":""},"Nbr de jour","=",{"$f":"IF(SUM(CC81:CC84)=0,\"\",SUM(CC81:CC84))","v":""},"Nbr de jour","=",{"$f":"IF(SUM(CF81:CF84)=0,\"\",SUM(CF81:CF84))","v":""},"Nbr de jour","=",{"$f":"IF(SUM(CI81:CI84)=0,\"\",SUM(CI81:CI84))","v":""},"Nbr de jour","=",{"$f":"IF(SUM(CL81:CL84)=0,\"\",SUM(CL81:CL84))","v":""},"Nbr de jour","=",{"$f":"IF(SUM(CO81:CO84)=0,\"\",SUM(CO81:CO84))","v":""},"Nbr de jour","=",{"$f":"IF(SUM(CR81:CR84)=0,\"\",SUM(CR81:CR84))","v":""},"Nbr de jour","=",{"$f":"IF(SUM(CU81:CU84)=0,\"\",SUM(CU81:CU84))","v":""},"Nbr de jour","=",{"$f":"IF(SUM(CX81:CX84)=0,\"\",SUM(CX81:CX84))","v":""},"Nbr de jour","=",{"$f":"IF(SUM(DA81:DA84)=0,\"\",SUM(DA81:DA84))","v":""},"Nbr de jour","=",{"$f":"IF(SUM(DD81:DD84)=0,\"\",SUM(DD81:DD84))","v":""},"Nbr de jour","=",{"$f":"IF(SUM(DG81:DG84)=0,\"\",SUM(DG81:DG84))","v":""},"Nbr de jour","=",{"$f":"IF(SUM(DJ81:DJ84)=0,\"\",SUM(DJ81:DJ84))","v":""},"Nbr de jour","=",{"$f":"IF(SUM(DM81:DM84)=0,\"\",SUM(DM81:DM84))","v":""},"Nbr de jour","=",{"$f":"IF(SUM(DP81:DP84)=0,\"\",SUM(DP81:DP84))","v":""},"Nbr de jour","=",{"$f":"IF(SUM(DS81:DS84)=0,\"\",SUM(DS81:DS84))","v":""},"Nbr de jour","=",{"$f":"IF(SUM(DV81:DV84)=0,\"\",SUM(DV81:DV84))","v":""},"Nbr de jour","=",{"$f":"IF(SUM(DY81:DY84)=0,\"\",SUM(DY81:DY84))","v":""},"Nbr de jour","=",{"$f":"IF(SUM(EB81:EB84)=0,\"\",SUM(EB81:EB84))","v":""}]
[null,null,null,{"$f":"IF(D88=\"\",\"\",D88)","v":""},"","P3","","","","","","",""]
[null,null,null,{"$f":"IF(D88=\"\",\"\",D88)","v":""},"","P3","","","","","","",""]
["Numéro 13","Nom affaire","DCE",null,null,"P3"]
[null,null,null,{"$f":"IF(D88=\"\",\"\",D88)","v":""},"","P3","","","","","","",""]
[null,"Temps passé en jour =",null,{"$f":"IF(D88=\"\",\"\",D88)","v":""},"","P3","","","","","","","","Nbr de jour","=",{"$f":"IF(SUM(O86:O89)=0,\"\",SUM(O86:O89))","v":""},"Nbr de jour","=",{"$f":"IF(SUM(R86:R89)=0,\"\",SUM(R86:R89))","v":""},"Nbr de jour","=",{"$f":"IF(SUM(U86:U89)=0,\"\",SUM(U86:U89))","v":""},"Nbr de jour","=",{"$f":"IF(SUM(X86:X89)=0,\"\",SUM(X86:X89))","v":""},"Nbr de jour","=",{"$f":"IF(SUM(AA86:AA89)=0,\"\",SUM(AA86:AA89))","v":""},"Nbr de jour","=",{"$f":"IF(SUM(AD86:AD89)=0,\"\",SUM(AD86:AD89))","v":""},"Nbr de jour","=",{"$f":"IF(SUM(AG86:AG89)=0,\"\",SUM(AG86:AG89))","v":""},"Nbr de jour","=",{"$f":"IF(SUM(AJ86:AJ89)=0,\"\",SUM(AJ86:AJ89))","v":""},"Nbr de jour","=",{"$f":"IF(SUM(AM86:AM89)=0,\"\",SUM(AM86:AM89))","v":""},"Nbr de jour","=",{"$f":"IF(SUM(AP86:AP89)=0,\"\",SUM(AP86:AP89))","v":""},"Nbr de jour","=",{"$f":"IF(SUM(AS86:AS89)=0,\"\",SUM(AS86:AS89))","v":""},"Nbr de jour","=",{"$f":"IF(SUM(AV86:AV89)=0,\"\",SUM(AV86:AV89))","v":""},"Nbr de jour","=",{"$f":"IF(SUM(AY86:AY89)=0,\"\",SUM(AY86:AY89))","v":""},"Nbr de jour","=",{"$f":"IF(SUM(BB86:BB89)=0,\"\",SUM(BB86:BB89))","v":""},"Nbr de jour","=",{"$f":"IF(SUM(BE86:BE89)=0,\"\",SUM(BE86:BE89))","v":""},"Nbr de jour","=",{"$f":"IF(SUM(BH86:BH89)=0,\"\",SUM(BH86:BH89))","v":""},"Nbr de jour","=",{"$f":"IF(SUM(BK86:BK89)=0,\"\",SUM(BK86:BK89))","v":""},"Nbr de jour","=",{"$f":"IF(SUM(BN86:BN89)=0,\"\",SUM(BN86:BN89))","v":""},"Nbr de jour","=",{"$f":"IF(SUM(BQ86:BQ89)=0,\"\",SUM(BQ86:BQ89))","v":""},"Nbr de jour","=",{"$f":"IF(SUM(BT86:BT89)=0,\"\",SUM(BT86:BT89))","v":""},"Nbr de jour","=",{"$f":"IF(SUM(BW86:BW89)=0,\"\",SUM(BW86:BW89))","v":""},"Nbr de jour","=",{"$f":"IF(SUM(BZ86:BZ89)=0,\"\",SUM(BZ86:BZ89))","v":""},"Nbr de jour","=",{"$f":"IF(SUM(CC86:CC89)=0,\"\",SUM(CC86:CC89))","v":""},"Nbr de jour","=",{"$f":"IF(SUM(CF86:CF89)=0,\"\",SUM(CF86:CF89))","v":""},"Nbr de jour","=",{"$f":"IF(SUM(CI86:CI89)=0,\"\",SUM(CI86:CI89))","v":""},"Nbr de jour","=",{"$f":"IF(SUM(CL86:CL89)=0,\"\",SUM(CL86:CL89))","v":""},"Nbr de jour","=",{"$f":"IF(SUM(CO86:CO89)=0,\"\",SUM(CO86:CO89))","v":""},"Nbr de jour","=",{"$f":"IF(SUM(CR86:CR89)=0,\"\",SUM(CR86:CR89))","v":""},"Nbr de jour","=",{"$f":"IF(SUM(CU86:CU89)=0,\"\",SUM(CU86:CU89))","v":""},"Nbr de jour","=",{"$f":"IF(SUM(CX86:CX89)=0,\"\",SUM(CX86:CX89))","v":""},"Nbr de jour","=",{"$f":"IF(SUM(DA86:DA89)=0,\"\",SUM(DA86:DA89))","v":""},"Nbr de jour","=",{"$f":"IF(SUM(DD86:DD89)=0,\"\",SUM(DD86:DD89))","v":""},"Nbr de jour","=",{"$f":"IF(SUM(DG86:DG89)=0,\"\",SUM(DG86:DG89))","v":""},"Nbr de jour","=",{"$f":"IF(SUM(DJ86:DJ89)=0,\"\",SUM(DJ86:DJ89))","v":""},"Nbr de jour","=",{"$f":"IF(SUM(DM86:DM89)=0,\"\",SUM(DM86:DM89))","v":""},"Nbr de jour","=",{"$f":"IF(SUM(DP86:DP89)=0,\"\",SUM(DP86:DP89))","v":""},"Nbr de jour","=",{"$f":"IF(SUM(DS86:DS89)=0,\"\",SUM(DS86:DS89))","v":""},"Nbr de jour","=",{"$f":"IF(SUM(DV86:DV89)=0,\"\",SUM(DV86:DV89))","v":""},"Nbr de jour","=",{"$f":"IF(SUM(DY86:DY89)=0,\"\",SUM(DY86:DY89))","v":""},"Nbr de jour","=",{"$f":"IF(SUM(EB86:EB89)=0,\"\",SUM(EB86:EB89))","v":""}]
[null,null,null,{"$f":"IF(D93=\"\",\"\",D93)","v":""},"","P3","","P5","","","","",""]
[null,null,null,{"$f":"IF(D93=\"\",\"\",D93)","v":""},"","P3","","P5","","","","",""]
["Numéro 14","Nom affaire","DCE",null,null,"P3",null,"P5"]
[null,null,null,{"$f":"IF(D93=\"\",\"\",D93)","v":""},"","P3","","P5","","","","",""]
[null,"Temps passé en jour =",null,{"$f":"IF(D93=\"\",\"\",D93)","v":""},"","P3","","P5","","","","","","Nbr de jour","=",{"$f":"IF(SUM(O91:O94)=0,\"\",SUM(O91:O94))","v":""},"Nbr de jour","=",{"$f":"IF(SUM(R91:R94)=0,\"\",SUM(R91:R94))","v":""},"Nbr de jour","=",{"$f":"IF(SUM(U91:U94)=0,\"\",SUM(U91:U94))","v":""},"Nbr de jour","=",{"$f":"IF(SUM(X91:X94)=0,\"\",SUM(X91:X94))","v":""},"Nbr de jour","=",{"$f":"IF(SUM(AA91:AA94)=0,\"\",SUM(AA91:AA94))","v":""},"Nbr de jour","=",{"$f":"IF(SUM(AD91:AD94)=0,\"\",SUM(AD91:AD94))","v":""},"Nbr de jour","=",{"$f":"IF(SUM(AG91:AG94)=0,\"\",SUM(AG91:AG94))","v":""},"Nbr de jour","=",{"$f":"IF(SUM(AJ91:AJ94)=0,\"\",SUM(AJ91:AJ94))","v":""},"Nbr de jour","=",{"$f":"IF(SUM(AM91:AM94)=0,\"\",SUM(AM91:AM94))","v":""},"Nbr de jour","=",{"$f":"IF(SUM(AP91:AP94)=0,\"\",SUM(AP91:AP94))","v":""},"Nbr de jour","=",{"$f":"IF(SUM(AS91:AS94)=0,\"\",SUM(AS91:AS94))","v":""},"Nbr de jour","=",{"$f":"IF(SUM(AV91:AV94)=0,\"\",SUM(AV91:AV94))","v":""},"Nbr de jour","=",{"$f":"IF(SUM(AY91:AY94)=0,\"\",SUM(AY91:AY94))","v":""},"Nbr de jour","=",{"$f":"IF(SUM(BB91:BB94)=0,\"\",SUM(BB91:BB94))","v":""},"Nbr de jour","=",{"$f":"IF(SUM(BE91:BE94)=0,\"\",SUM(BE91:BE94))","v":""},"Nbr de jour","=",{"$f":"IF(SUM(BH91:BH94)=0,\"\",SUM(BH91:BH94))","v":""},"Nbr de jour","=",{"$f":"IF(SUM(BK91:BK94)=0,\"\",SUM(BK91:BK94))","v":""},"Nbr de jour","=",{"$f":"IF(SUM(BN91:BN94)=0,\"\",SUM(BN91:BN94))","v":""},"Nbr de jour","=",{"$f":"IF(SUM(BQ91:BQ94)=0,\"\",SUM(BQ91:BQ94))","v":""},"Nbr de jour","=",{"$f":"IF(SUM(BT91:BT94)=0,\"\",SUM(BT91:BT94))","v":""},"Nbr de jour","=",{"$f":"IF(SUM(BW91:BW94)=0,\"\",SUM(BW91:BW94))","v":""},"Nbr de jour","=",{"$f":"IF(SUM(BZ91:BZ94)=0,\"\",SUM(BZ91:BZ94))","v":""},"Nbr de jour","=",{"$f":"IF(SUM(CC91:CC94)=0,\"\",SUM(CC91:CC94))","v":""},"Nbr de jour","=",{"$f":"IF(SUM(CF91:CF94)=0,\"\",SUM(CF91:CF94))","v":""},"Nbr de jour","=",{"$f":"IF(SUM(CI91:CI94)=0,\"\",SUM(CI91:CI94))","v":""},"Nbr de jour","=",{"$f":"IF(SUM(CL91:CL94)=0,\"\",SUM(CL91:CL94))","v":""},"Nbr de jour","=",{"$f":"IF(SUM(CO91:CO94)=0,\"\",SUM(CO91:CO94))","v":""},"Nbr de jour","=",{"$f":"IF(SUM(CR91:CR94)=0,\"\",SUM(CR91:CR94))","v":""},"Nbr de jour","=",{"$f":"IF(SUM(CU91:CU94)=0,\"\",SUM(CU91:CU94))","v":""},"Nbr de jour","=",{"$f":"IF(SUM(CX91:CX94)=0,\"\",SUM(CX91:CX94))","v":""},"Nbr de jour","=",{"$f":"IF(SUM(DA91:DA94)=0,\"\",SUM(DA91:DA94))","v":""},"Nbr de jour","=",{"$f":"IF(SUM(DD91:DD94)=0,\"\",SUM(DD91:DD94))","v":""},"Nbr de jour","=",{"$f":"IF(SUM(DG91:DG94)=0,\"\",SUM(DG91:DG94))","v":""},"Nbr de jour","=",{"$f":"IF(SUM(DJ91:DJ94)=0,\"\",SUM(DJ91:DJ94))","v":""},"Nbr de jour","=",{"$f":"IF(SUM(DM91:DM94)=0,\"\",SUM(DM91:DM94))","v":""},"Nbr de jour","=",{"$f":"IF(SUM(DP91:DP94)=0,\"\",SUM(DP91:DP94))","v":""},"Nbr de jour","=",{"$f":"IF(SUM(DS91:DS94)=0,\"\",SUM(DS91:DS94))","v":""},"Nbr de jour","=",{"$f":"IF(SUM(DV91:DV94)=0,\"\",SUM(DV91:DV94))","v":""},"Nbr de jour","=",{"$f":"IF(SUM(DY91:DY94)=0,\"\",SUM(DY91:DY94))","v":""},"Nbr de jour","=",{"$f":"IF(SUM(EB91:EB94)=0,\"\",SUM(EB91:EB94))","v":""}]
[null,null,null,{"$f":"IF(D98=\"\",\"\",D98)","v":"P1"},"","P3","","","","","","",""]
[null,null,null,{"$f":"IF(D98=\"\",\"\",D98)","v":"P1"},"","P3","","","","","","",""]
["Numéro 15","Nom affaire","EXE","P1",null,"P3"]
[null,null,null,{"$f":"IF(D98=\"\",\"\",D98)","v":"P1"},"","P3","","","","","","",""]
[null,"Temps passé en jour =",null,{"$f":"IF(D98=\"\",\"\",D98)","v":"P1"},"","P3","","","","","","","","Nbr de jour","=",{"$f":"IF(SUM(O96:O99)=0,\"\",SUM(O96:O99))","v":""},"Nbr de jour","=",{"$f":"IF(SUM(R96:R99)=0,\"\",SUM(R96:R99))","v":""},"Nbr de jour","=",{"$f":"IF(SUM(U96:U99)=0,\"\",SUM(U96:U99))","v":""},"Nbr de jour","=",{"$f":"IF(SUM(X96:X99)=0,\"\",SUM(X96:X99))","v":""},"Nbr de jour","=",{"$f":"IF(SUM(AA96:AA99)=0,\"\",SUM(AA96:AA99))","v":""},"Nbr de jour","=",{"$f":"IF(SUM(AD96:AD99)=0,\"\",SUM(AD96:AD99))","v":""},"Nbr de jour","=",{"$f":"IF(SUM(AG96:AG99)=0,\"\",SUM(AG96:AG99))","v":""},"Nbr de jour","=",{"$f":"IF(SUM(AJ96:AJ99)=0,\"\",SUM(AJ96:AJ99))","v":""},"Nbr de jour","=",{"$f":"IF(SUM(AM96:AM99)=0,\"\",SUM(AM96:AM99))","v":""},"Nbr de jour","=",{"$f":"IF(SUM(AP96:AP99)=0,\"\",SUM(AP96:AP99))","v":""},"Nbr de jour","=",{"$f":"IF(SUM(AS96:AS99)=0,\"\",SUM(AS96:AS99))","v":""},"Nbr de jour","=",{"$f":"IF(SUM(AV96:AV99)=0,\"\",SUM(AV96:AV99))","v":""},"Nbr de jour","=",{"$f":"IF(SUM(AY96:AY99)=0,\"\",SUM(AY96:AY99))","v":""},"Nbr de jour","=",{"$f":"IF(SUM(BB96:BB99)=0,\"\",SUM(BB96:BB99))","v":""},"Nbr de jour","=",{"$f":"IF(SUM(BE96:BE99)=0,\"\",SUM(BE96:BE99))","v":""},"Nbr de jour","=",{"$f":"IF(SUM(BH96:BH99)=0,\"\",SUM(BH96:BH99))","v":""},"Nbr de jour","=",{"$f":"IF(SUM(BK96:BK99)=0,\"\",SUM(BK96:BK99))","v":""},"Nbr de jour","=",{"$f":"IF(SUM(BN96:BN99)=0,\"\",SUM(BN96:BN99))","v":""},"Nbr de jour","=",{"$f":"IF(SUM(BQ96:BQ99)=0,\"\",SUM(BQ96:BQ99))","v":""},"Nbr de jour","=",{"$f":"IF(SUM(BT96:BT99)=0,\"\",SUM(BT96:BT99))","v":""},"Nbr de jour","=",{"$f":"IF(SUM(BW96:BW99)=0,\"\",SUM(BW96:BW99))","v":""},"Nbr de jour","=",{"$f":"IF(SUM(BZ96:BZ99)=0,\"\",SUM(BZ96:BZ99))","v":""},"Nbr de jour","=",{"$f":"IF(SUM(CC96:CC99)=0,\"\",SUM(CC96:CC99))","v":""},"Nbr de jour","=",{"$f":"IF(SUM(CF96:CF99)=0,\"\",SUM(CF96:CF99))","v":""},"Nbr de jour","=",{"$f":"IF(SUM(CI96:CI99)=0,\"\",SUM(CI96:CI99))","v":""},"Nbr de jour","=",{"$f":"IF(SUM(CL96:CL99)=0,\"\",SUM(CL96:CL99))","v":""},"Nbr de jour","=",{"$f":"IF(SUM(CO96:CO99)=0,\"\",SUM(CO96:CO99))","v":""},"Nbr de jour","=",{"$f":"IF(SUM(CR96:CR99)=0,\"\",SUM(CR96:CR99))","v":""},"Nbr de jour","=",{"$f":"IF(SUM(CU96:CU99)=0,\"\",SUM(CU96:CU99))","v":""},"Nbr de jour","=",{"$f":"IF(SUM(CX96:CX99)=0,\"\",SUM(CX96:CX99))","v":""},"Nbr de jour","=",{"$f":"IF(SUM(DA96:DA99)=0,\"\",SUM(DA96:DA99))","v":""},"Nbr de jour","=",{"$f":"IF(SUM(DD96:DD99)=0,\"\",SUM(DD96:DD99))","v":""},"Nbr de jour","=",{"$f":"IF(SUM(DG96:DG99)=0,\"\",SUM(DG96:DG99))","v":""},"Nbr de jour","=",{"$f":"IF(SUM(DJ96:DJ99)=0,\"\",SUM(DJ96:DJ99))","v":""},"Nbr de jour","=",{"$f":"IF(SUM(DM96:DM99)=0,\"\",SUM(DM96:DM99))","v":""},"Nbr de jour","=",{"$f":"IF(SUM(DP96:DP99)=0,\"\",SUM(DP96:DP99))","v":""},"Nbr de jour","=",{"$f":"IF(SUM(DS96:DS99)=0,\"\",SUM(DS96:DS99))","v":""},"Nbr de jour","=",{"$f":"IF(SUM(DV96:DV99)=0,\"\",SUM(DV96:DV99))","v":""},"Nbr de jour","=",{"$f":"IF(SUM(DY96:DY99)=0,\"\",SUM(DY96:DY99))","v":""},"Nbr de jour","=",{"$f":"IF(SUM(EB96:EB99)=0,\"\",SUM(EB96:EB99))","v":""}]
[null,null,null,{"$f":"IF(D103=\"\",\"\",D103)","v":""},"","","","","P6","","","P9",""]
[null,null,null,{"$f":"IF(D103=\"\",\"\",D103)","v":""},"","","","","P6","","","P9",""]
["Numéro 16","Nom affaire","EXE",null,null,null,null,null,"P6",null,null,"P9"]
[null,null,null,{"$f":"IF(D103=\"\",\"\",D103)","v":""},"","","","","P6","","","P9",""]
[null,"Temps passé en jour =",null,{"$f":"IF(D103=\"\",\"\",D103)","v":""},"","","","","P6","","","P9","","Nbr de jour","=",{"$f":"IF(SUM(O101:O104)=0,\"\",SUM(O101:O104))","v":""},"Nbr de jour","=",{"$f":"IF(SUM(R101:R104)=0,\"\",SUM(R101:R104))","v":""},"Nbr de jour","=",{"$f":"IF(SUM(U101:U104)=0,\"\",SUM(U101:U104))","v":""},"Nbr de jour","=",{"$f":"IF(SUM(X101:X104)=0,\"\",SUM(X101:X104))","v":""},"Nbr de jour","=",{"$f":"IF(SUM(AA101:AA104)=0,\"\",SUM(AA101:AA104))","v":""},"Nbr de jour","=",{"$f":"IF(SUM(AD101:AD104)=0,\"\",SUM(AD101:AD104))","v":""},"Nbr de jour","=",{"$f":"IF(SUM(AG101:AG104)=0,\"\",SUM(AG101:AG104))","v":""},"Nbr de jour","=",{"$f":"IF(SUM(AJ101:AJ104)=0,\"\",SUM(AJ101:AJ104))","v":""},"Nbr de jour","=",{"$f":"IF(SUM(AM101:AM104)=0,\"\",SUM(AM101:AM104))","v":""},"Nbr de jour","=",{"$f":"IF(SUM(AP101:AP104)=0,\"\",SUM(AP101:AP104))","v":""},"Nbr de jour","=",{"$f":"IF(SUM(AS101:AS104)=0,\"\",SUM(AS101:AS104))","v":""},"Nbr de jour","=",{"$f":"IF(SUM(AV101:AV104)=0,\"\",SUM(AV101:AV104))","v":""},"Nbr de jour","=",{"$f":"IF(SUM(AY101:AY104)=0,\"\",SUM(AY101:AY104))","v":""},"Nbr de jour","=",{"$f":"IF(SUM(BB101:BB104)=0,\"\",SUM(BB101:BB104))","v":""},"Nbr de jour","=",{"$f":"IF(SUM(BE101:BE104)=0,\"\",SUM(BE101:BE104))","v":""},"Nbr de jour","=",{"$f":"IF(SUM(BH101:BH104)=0,\"\",SUM(BH101:BH104))","v":""},"Nbr de jour","=",{"$f":"IF(SUM(BK101:BK104)=0,\"\",SUM(BK101:BK104))","v":""},"Nbr de jour","=",{"$f":"IF(SUM(BN101:BN104)=0,\"\",SUM(BN101:BN104))","v":""},"Nbr de jour","=",{"$f":"IF(SUM(BQ101:BQ104)=0,\"\",SUM(BQ101:BQ104))","v":""},"Nbr de jour","=",{"$f":"IF(SUM(BT101:BT104)=0,\"\",SUM(BT101:BT104))","v":""},"Nbr de jour","=",{"$f":"IF(SUM(BW101:BW104)=0,\"\",SUM(BW101:BW104))","v":""},"Nbr de jour","=",{"$f":"IF(SUM(BZ101:BZ104)=0,\"\",SUM(BZ101:BZ104))","v":""},"Nbr de jour","=",{"$f":"IF(SUM(CC101:CC104)=0,\"\",SUM(CC101:CC104))","v":""},"Nbr de jour","=",{"$f":"IF(SUM(CF101:CF104)=0,\"\",SUM(CF101:CF104))","v":""},"Nbr de jour","=",{"$f":"IF(SUM(CI101:CI104)=0,\"\",SUM(CI101:CI104))","v":""},"Nbr de jour","=",{"$f":"IF(SUM(CL101:CL104)=0,\"\",SUM(CL101:CL104))","v":""},"Nbr de jour","=",{"$f":"IF(SUM(CO101:CO104)=0,\"\",SUM(CO101:CO104))","v":""},"Nbr de jour","=",{"$f":"IF(SUM(CR101:CR104)=0,\"\",SUM(CR101:CR104))","v":""},"Nbr de jour","=",{"$f":"IF(SUM(CU101:CU104)=0,\"\",SUM(CU101:CU104))","v":""},"Nbr de jour","=",{"$f":"IF(SUM(CX101:CX104)=0,\"\",SUM(CX101:CX104))","v":""},"Nbr de jour","=",{"$f":"IF(SUM(DA101:DA104)=0,\"\",SUM(DA101:DA104))","v":""},"Nbr de jour","=",{"$f":"IF(SUM(DD101:DD104)=0,\"\",SUM(DD101:DD104))","v":""},"Nbr de jour","=",{"$f":"IF(SUM(DG101:DG104)=0,\"\",SUM(DG101:DG104))","v":""},"Nbr de jour","=",{"$f":"IF(SUM(DJ101:DJ104)=0,\"\",SUM(DJ101:DJ104))","v":""},"Nbr de jour","=",{"$f":"IF(SUM(DM101:DM104)=0,\"\",SUM(DM101:DM104))","v":""},"Nbr de jour","=",{"$f":"IF(SUM(DP101:DP104)=0,\"\",SUM(DP101:DP104))","v":""},"Nbr de jour","=",{"$f":"IF(SUM(DS101:DS104)=0,\"\",SUM(DS101:DS104))","v":""},"Nbr de jour","=",{"$f":"IF(SUM(DV101:DV104)=0,\"\",SUM(DV101:DV104))","v":""},"Nbr de jour","=",{"$f":"IF(SUM(DY101:DY104)=0,\"\",SUM(DY101:DY104))","v":""},"Nbr de jour","=",{"$f":"IF(SUM(EB101:EB104)=0,\"\",SUM(EB101:EB104))","v":""}]

{"sheet":"S51","index":2,"n_rows":105,"n_cols":133,"rows_kept":105,"cut":false,"hidden":false,"merged":[[9,29,9,30],[9,32,9,33],[9,35,9,36],[9,95,9,96],[2,1,3,1],[2,2,3,3],[5,23,5,24],[6,23,6,24],[2,25,2,27],[2,28,2,36],[4,26,4,27],[4,29,4,30],[4,32,4,33],[4,35,4,36],[8,25,8,36],[6,29,6,30],[6,32,6,33],[6,35,6,36],[7,26,7,27],[7,29,7,30],[7,32,7,33],[7,35,7,36],[8,0,9,0],[8,1,9,1],[8,2,9,2],[9,14,9,15],[9,17,9,18],[9,20,9,21],[9,23,9,24],[4,14,4,15],[4,2,5,2],[8,13,8,24],[7,14,7,15],[7,17,7,18],[7,20,7,21],[7,23,7,24],[4,0,5,1],[2,13,2,15],[2,16,2,24],[4,17,4,18],[4,20,4,21],[6,20,6,21],[4,23,4,24],[6,14,6,15],[5,14,5,15],[5,17,5,18],[5,20,5,21],[6,17,6,18],[2,40,2,48],[4,38,4,39],[4,41,4,42],[4,44,4,45],[4,47,4,48],[6,50,6,51],[6,53,6,54],[6,41,6,42],[6,44,6,45],[6,47,6,48],[2,49,2,51],[2,52,2,60],[6,38,6,39],[2,37,2,39],[4,50,4,51],[4,53,4,54],[5,53,5,54],[9,71,9,72],[9,74,9,75],[7,62,7,63],[8,61,8,72],[8,73,8,84],[4,56,4,57],[4,59,4,60],[7,56,7,57],[7,59,7,60],[9,50,9,51],[9,53,9,54],[9,56,9,57],[9,59,9,60],[9,62,9,63],[9,65,9,66],[9,68,9,69],[9,83,9,84],[2,61,2,63],[2,64,2,72],[6,56,6,57],[6,59,6,60],[6,62,6,63],[6,65,6,66],[6,68,6,69],[6,71,6,72],[4,62,4,63],[4,65,4,66],[4,68,4,69],[4,71,4,72],[5,56,5,57],[5,59,5,60],[5,62,5,63],[5,65,5,66],[5,68,5,69],[5,71,5,72],[2,76,2,84],[4,74,4,75],[4,77,4,78],[4,83,4,84],[6,83,6,84],[7,74,7,75],[7,77,7,78],[7,83,7,84],[7,80,7,81],[4,80,4,81],[6,77,6,78],[6,80,6,81],[6,74,6,75],[2,73,2,75],[5,83,5,84],[5,74,5,75],[5,77,5,78],[5,80,5,81],[2,85,2,87],[2,88,2,96],[4,86,4,87],[4,89,4,90],[4,92,4,93],[4,95,4,96],[6,86,6,87],[6,89,6,90],[6,92,6,93],[6,95,6,96],[5,86,5,87],[2,97,2,99],[6,98,6,99],[8,97,8,108],[9,98,9,99],[9,101,9,102],[9,104,9,105],[9,107,9,108],[4,119,4,120],[6,101,6,102],[6,104,6,105],[6,107,6,108],[7,98,7,99],[7,101,7,102],[7,104,7,105],[7,107,7,108],[2,100,2,108],[4,98,4,99],[4,101,4,102],[4,104,4,105],[4,107,4,108],[5,116,5,117],[5,119,5,120],[2,121,2,123],[2,124,2,132],[4,122,4,123],[4,125,4,126],[4,128,4,129],[4,131,4,132],[8,109,8,120],[9,110,9,111],[9,113,9,114],[9,116,9,117],[9,119,9,120],[6,110,6,111],[6,113,6,114],[6,116,6,117],[6,119,6,120],[7,110,7,111],[7,113,7,114],[7,116,7,117],[7,119,7,120],[2,109,2,111],[2,112,2,120],[4,110,4,111],[4,113,4,114],[4,116,4,117],[6,131,6,132],[6,128,6,129],[6,125,6,126],[6,122,6,123],[7,3,7,12],[8,121,8,132],[9,122,9,123],[9,125,9,126],[9,128,9,129],[9,131,9,132],[7,122,7,123],[7,125,7,126],[7,128,7,129],[7,38,7,39],[7,41,7,42],[7,44,7,45],[7,47,7,48],[6,26,6,27],[9,38,9,39],[9,41,9,42],[9,44,9,45],[9,47,9,48],[8,37,8,48],[9,26,9,27],[7,131,7,132],[9,77,9,78],[9,80,9,81],[8,49,8,60],[7,65,7,66],[7,68,7,69],[7,71,7,72],[7,50,7,51],[7,53,7,54],[7,86,7,87],[7,89,7,90],[7,92,7,93],[7,95,7,96],[8,85,8,96],[9,86,9,87],[9,89,9,90],[9,92,9,93],[5,26,5,27],[5,29,5,30],[5,32,5,33],[5,35,5,36],[5,38,5,39],[5,41,5,42],[5,44,5,45],[5,47,5,48],[5,50,5,51],[5,122,5,123],[5,125,5,126],[5,128,5,129],[5,131,5,132],[5,89,5,90],[5,92,5,93],[5,95,5,96],[5,98,5,99],[5,101,5,102],[5,104,5,105],[5,107,5,108],[5,110,5,111],[5,113,5,114]]}
["http://forum.excel-pratique.com/excel/planning-production-tri-complexe-t58192.html"]
[]
[null,"ANNEE",2014,null,null,null,null,null,null,null,null,null,null,"SEMAINE EN COURS",null,null,"SEMAINES A VENIR",null,null,null,null,null,null,null,null,"SEMAINE EN COURS",null,null,"SEMAINES A VENIR",null,null,null,null,null,null,null,null,"SEMAINE EN COURS",null,null,"SEMAINES A VENIR",null,null,null,null,null,null,null,null,"SEMAINE EN COURS",null,null,"SEMAINES A VENIR",null,null,null,null,null,null,null,null,"SEMAINE EN COURS",null,null,"SEMAINES A VENIR",null,null,null,null,null,null,null,null,"SEMAINE EN COURS",null,null,"SEMAINES A VENIR",null,null,null,null,null,null,null,null,"SEMAINE EN COURS",null,null,"SEMAINES A VENIR",null,null,null,null,null,null,null,null,"SEMAINE EN COURS",null,null,"SEMAINES A VENIR",null,null,null,null,null,null,null,null,"SEMAINE EN COURS",null,null,"SEMAINES A VENIR",null,null,null,null,null,null,null,null,"SEMAINE EN COURS",null,null,"SEMAINES A VENIR"]
[null,null,null,null,null,null,null,null,null,null,null,null,null,"Semaine n°",{"$f":"$C$5","v":49},null,"Semaine n°",{"$f":"$C$5+1","v":50},null,"Semaine n°",{"$f":"$C$5+2","v":51},null,"Semaine n°",{"$f":"$C$5+3","v":52},null,"Semaine n°",{"$f":"$C$5","v":49},null,"Semaine n°",{"$f":"$C$5+1","v":50},null,"Semaine n°",{"$f":"$C$5+2","v":51},null,"Semaine n°",{"$f":"$C$5+3","v":52},null,"Semaine n°",{"$f":"$C$5","v":49},null,"Semaine n°",{"$f":"$C$5+1","v":50},null,"Semaine n°",{"$f":"$C$5+2","v":51},null,"Semaine n°",{"$f":"$C$5+3","v":52},null,"Semaine n°",{"$f":"$C$5","v":49},null,"Semaine n°",{"$f":"$C$5+1","v":50},null,"Semaine n°",{"$f":"$C$5+2","v":51},null,"Semaine n°",{"$f":"$C$5+3","v":52},null,"Semaine n°",{"$f":"$C$5","v":49},null,"Semaine n°",{"$f":"$C$5+1","v":50},null,"Semaine n°",{"$f":"$C$5+2","v":51},null,"Semaine n°",{"$f":"$C$5+3","v":52},null,"Semaine n°",{"$f":"$C$5","v":49},null,"Semaine n°",{"$f":"$C$5+1","v":50},null,"Semaine n°",{"$f":"$C$5+2","v":51},null,"Semaine n°",{"$f":"$C$5+3","v":52},null,"Semaine n°",{"$f":"$C$5","v":49},null,"Semaine n°",{"$f":"$C$5+1","v":50},null,"Semaine n°",{"$f":"$C$5+2","v":51},null,"Semaine n°",{"$f":"$C$5+3","v":52},null,"Semaine n°",{"$f":"$C$5","v":49},null,"Semaine n°",{"$f":"$C$5+1","v":50},null,"Semaine n°",{"$f":"$C$5+2","v":51},null,"Semaine n°",{"$f":"$C$5+3","v":52},null,"Semaine n°",{"$f":"$C$5","v":49},null,"Semaine n°",{"$f":"$C$5+1","v":50},null,"Semaine n°",{"$f":"$C$5+2","v":51},null,"Semaine n°",{"$f":"$C$5+3","v":52},null,"Semaine n°",{"$f":"$C$5","v":49},null,"Semaine n°",{"$f":"$C$5+1","v":50},null,"Semaine n°",{"$f":"$C$5+2","v":51},null,"Semaine n°",{"$f":"$C$5+3","v":52}]
["Planning prévisionnel - Semaine n°",null,49,null,null,null,null,null,null,null,"Congés",null,null,null,null,null,null,null,null,null,null,null,"Lu+ Ma+ Me+ Ve",4]
[null,null,null,null,null,null,null,null,null,null,"Fériés",null,null,null,null,null,null,null,null,null,null,null,"Jeudi",1]
[null,null,null,null,null,null,null,null,null,null,"Divers"]
[null,"PREVISION PAR SEMAINE",null,"Projeteurs",null,null,null,null,null,null,null,null,null,"Nombre de jours =",{"$f":"SUM(P10:P105)+O7+O5","v":3.5},null,"Nombre de jours =",{"$f":"SUM(S10:S105)+R7+R5","v":1.5},null,"Nombre de jours =",{"$f":"SUM(V9:V105)+U7+U5","v":0},null,"Nombre de jours =",{"$f":"SUM(Y10:Y105)+X7+X5","v":4},null,"Nombre de jours =",{"$f":"SUM(AB10:AB105)+AA7+AA5","v":0},null,"Nombre de jours =",{"$f":"SUM(AE10:AE105)+AD7+AD5","v":0},null,"Nombre de jours =",{"$f":"SUM(AH10:AH105)+AG7+AG5","v":0},null,"Nombre de jours =",{"$f":"SUM(AK10:AK105)+AJ7+AJ5","v":0},null,"Nombre de jours =",{"$f":"SUM(AN10:AN105)+AM7+AM5","v":0},null,"Nombre de jours =",{"$f":"SUM(AQ10:AQ105)+AP7+AP5","v":0},null,"Nombre de jours =",{"$f":"SUM(AT10:AT105)+AS7+AS5","v":0},null,"Nombre de jours =",{"$f":"SUM(AW10:AW105)+AV7+AV5","v":0},null,"Nombre de jours =",{"$f":"SUM(AZ10:AZ105)+AY7+AY5","v":0},null,"Nombre de jours =",{"$f":"SUM(BC10:BC105)+BB7+BB5","v":0},null,"Nombre de jours =",{"$f":"SUM(BF10:BF105)+BE7+BE5","v":0},null,"Nombre de jours =",{"$f":"SUM(BI10:BI105)+BH7+BH5","v":0},null,"Nombre de jours =",{"$f":"SUM(BL10:BL105)+BK7+BK5","v":0},null,"Nombre de jours =",{"$f":"SUM(BO10:BO105)+BN7+BN5","v":0},null,"Nombre de jours =",{"$f":"SUM(BR10:BR105)+BQ7+BQ5","v":0},null,"Nombre de jours =",{"$f":"SUM(BU10:BU105)+BT7+BT5","v":0},null,"Nombre de jours =",{"$f":"SUM(BX10:BX105)+BW7+BW5","v":0},null,"Nombre de jours =",{"$f":"SUM(CA10:CA105)+BZ7+BZ5","v":0},null,"Nombre de jours =",{"$f":"SUM(CD10:CD105)+CC7+CC5","v":0},null,"Nombre de jours =",{"$f":"SUM(CG10:CG105)+CF7+CF5","v":0},null,"Nombre de jours =",{"$f":"SUM(CJ10:CJ105)+CI7+CI5","v":0},null,"Nombre de jours =",{"$f":"SUM(CM10:CM105)+CL7+CL5","v":0},null,"Nombre de jours =",{"$f":"SUM(CP10:CP105)+CO7+CO5","v":0},null,"Nombre de jours =",{"$f":"SUM(CS10:CS105)+CR7+CR5","v":0},null,"Nombre de jours =",{"$f":"SUM(CV10:CV105)+CU7+CU5","v":0},null,"Nombre de jours =",{"$f":"SUM(CY10:CY105)+CX7+CX5","v":0},null,"Nombre de jours =",{"$f":"SUM(DB10:DB105)+DA7+DA5","v":0},null,"Nombre de jours =",{"$f":"SUM(DE10:DE105)+DD7+DD5","v":0},null,"Nombre de jours =",{"$f":"SUM(DH10:DH105)+DG7+DG5","v":0},null,"Nombre de jours =",{"$f":"SUM(DK10:DK105)+DJ7+DJ5","v":0},null,"Nombre de jours =",{"$f":"SUM(DN10:DN105)+DM7+DM5","v":0},null,"Nombre de jours =",{"$f":"SUM(DQ10:DQ105)+DP7+DP5","v":0},null,"Nombre de jours =",{"$f":"SUM(DT10:DT105)+DS7+DS5","v":0},null,"Nombre de jours =",{"$f":"SUM(DW10:DW105)+DV7+DV5","v":0},null,"Nombre de jours =",{"$f":"SUM(DZ10:DZ105)+DY7+DY5","v":0},null,"Nombre de jours =",{"$f":"SUM(EC10:EC105)+EB7+EB5","v":0}]
["Numéro d'affaire","Affaires","PHASE","P1","P2","P3","P4","P5","P6","P7","P8","P9","P10","NOM Prénom",null,null,null,null,null,null,null,null,null,null,null,"NOM Prénom",null,null,null,null,null,null,null,null,null,null,null,"NOM Prénom",null,null,null,null,null,null,null,null,null,null,null,"NOM Prénom",null,null,null,null,null,null,null,null,null,null,null,"NOM Prénom",null,null,null,null,null,null,null,null,null,null,null,"NOM Prénom",null,null,null,null,null,null,null,null,null,null,null,"NOM Prénom",null,null,null,null,null,null,null,null,null,null,null,"NOM Prénom",null,null,null,null,null,null,null,null,null,null,null,"NOM Prénom",null,null,null,null,null,null,null,null,null,null,null,"NOM Prénom"]
[null,null,null,null,null,null,null,null,null,null,null,null,null,"Tâche","Durée",null,"Tâche","Durée",null,"Tâche","Durée",null,"Tâche","Durée",null,"Tâche","Durée",null,"Tâche","Durée",null,"Tâche","Durée",null,"Tâche","Durée",null,"Tâche","Durée",null,"Tâche","Durée",null,"Tâche","Durée",null,"Tâche","Durée",null,"Tâche","Durée",null,"Tâche","Durée",null,"Tâche","Durée",null,"Tâche","Durée",null,"Tâche","Durée",null,"Tâche","Durée",null,"Tâche","Durée",null,"Tâche","Durée",null,"Tâche","Durée",null,"Tâche","Durée",null,"Tâche","Durée",null,"Tâche","Durée",null,"Tâche","Durée",null,"Tâche","Durée",null,"Tâche","Durée",null,"Tâche","Durée",null,"Tâche","Durée",null,"Tâche","Durée",null,"Tâche","Durée",null,"Tâche","Durée",null,"Tâche","Durée",null,"Tâche","Durée",null,"Tâche","Durée",null,"Tâche","Durée",null,"Tâche","Durée",null,"Tâche","Durée",null,"Tâche","Durée",null,"Tâche","Durée"]
[null,null,null,{"$f":"IF(D13=\"\",\"\",D13)","v":"P1"},"","P3","","","","","","",""]
[null,null,null,{"$f":"IF(D13=\"\",\"\",D13)","v":"P1"},"","P3","","","","","","","","Coffrage",1,null,"Armature",1.5]
["10/020","Nom affaire","EXE","P1",null,"P3",null,null,null,null,null,null,null,"Synthèse",1]
[null,null,null,{"$f":"IF(D13=\"\",\"\",D13)","v":"P1"},"","P3","","","","","","",""]
[null,"Temps passé en jour =",null,{"$f":"IF(D13=\"\",\"\",D13)","v":"P1"},"","P3","","","","","","","","Nbr de jour","=",{"$f":"IF(SUM(O11:O14)=0,\"\",SUM(O11:O14))","v":2},"Nbr de jour","=",{"$f":"IF(SUM(R11:R14)=0,\"\",SUM(R11:R14))","v":1.5},"Nbr de jour","=",{"$f":"IF(SUM(U11:U14)=0,\"\",SUM(U11:U14))","v":""},"Nbr de jour","=",{"$f":"IF(SUM(X11:X14)=0,\"\",SUM(X11:X14))","v":""},"Nbr de jour","=",{"$f":"IF(SUM(AA11:AA14)=0,\"\",SUM(AA11:AA14))","v":""},"Nbr de jour","=",{"$f":"IF(SUM(AD11:AD14)=0,\"\",SUM(AD11:AD14))","v":""},"Nbr de jour","=",{"$f":"IF(SUM(AG11:AG14)=0,\"\",SUM(AG11:AG14))","v":""},"Nbr de jour","=",{"$f":"IF(SUM(AJ11:AJ14)=0,\"\",SUM(AJ11:AJ14))","v":""},"Nbr de jour","=",{"$f":"IF(SUM(AM11:AM14)=0,\"\",SUM(AM11:AM14))","v":""},"Nbr de jour","=",{"$f":"IF(SUM(AP11:AP14)=0,\"\",SUM(AP11:AP14))","v":""},"Nbr de jour","=",{"$f":"IF(SUM(AS11:AS14)=0,\"\",SUM(AS11:AS14))","v":""},"Nbr de jour","=",{"$f":"IF(SUM(AV11:AV14)=0,\"\",SUM(AV11:AV14))","v":""},"Nbr de jour","=",{"$f":"IF(SUM(AY11:AY14)=0,\"\",SUM(AY11:AY14))","v":""},"Nbr de jour","=",{"$f":"IF(SUM(BB11:BB14)=0,\"\",SUM(BB11:BB14))","v":""},"Nbr de jour","=",{"$f":"IF(SUM(BE11:BE14)=0,\"\",SUM(BE11:BE14))","v":""},"Nbr de jour","=",{"$f":"IF(SUM(BH11:BH14)=0,\"\",SUM(BH11:BH14))","v":""},"Nbr de jour","=",{"$f":"IF(SUM(BK11:BK14)=0,\"\",SUM(BK11:BK14))","v":""},"Nbr de jour","=",{"$f":"IF(SUM(BN11:BN14)=0,\"\",SUM(BN11:BN14))","v":""},"Nbr de jour","=",{"$f":"IF(SUM(BQ11:BQ14)=0,\"\",SUM(BQ11:BQ14))","v":""},"Nbr de jour","=",{"$f":"IF(SUM(BT11:BT14)=0,\"\",SUM(BT11:BT14))","v":""},"Nbr de jour","=",{"$f":"IF(SUM(BW11:BW14)=0,\"\",SUM(BW11:BW14))","v":""},"Nbr de jour","=",{"$f":"IF(SUM(BZ11:BZ14)=0,\"\",SUM(BZ11:BZ14))","v":""},"Nbr de jour","=",{"$f":"IF(SUM(CC11:CC14)=0,\"\",SUM(CC11:CC14))","v":""},"Nbr de jour","=",{"$f":"IF(SUM(CF11:CF14)=0,\"\",SUM(CF11:CF14))","v":""},"Nbr de jour","=",{"$f":"IF(SUM(CI11:CI14)=0,\"\",SUM(CI11:CI14))","v":""},"Nbr de jour","=",{"$f":"IF(SUM(CL11:CL14)=0,\"\",SUM(CL11:CL14))","v":""},"Nbr de jour","=",{"$f":"IF(SUM(CO11:CO14)=0,\"\",SUM(CO11:CO14))","v":""},"Nbr de jour","=",{"$f":"IF(SUM(CR11:CR14)=0,\"\",SUM(CR11:CR14))","v":""},"Nbr de jour","=",{"$f":"IF(SUM(CU11:CU14)=0,\"\",SUM(CU11:CU14))","v":""},"Nbr de jour","=",{"$f":"IF(SUM(CX11:CX14)=0,\"\",SUM(CX11:CX14))","v":""},"Nbr de jour","=",{"$f":"IF(SUM(DA11:DA14)=0,\"\",SUM(DA11:DA14))","v":""},"Nbr de jour","=",{"$f":"IF(SUM(DD11:DD14)=0,\"\",SUM(DD11:DD14))","v":""},"Nbr de jour","=",{"$f":"IF(SUM(DG11:DG14)=0,\"\",SUM(DG11:DG14))","v":""},"Nbr de jour","=",{"$f":"IF(SUM(DJ11:DJ14)=0,\"\",SUM(DJ11:DJ14))","v":""},"Nbr de jour","=",{"$f":"IF(SUM(DM11:DM14)=0,\"\",SUM(DM11:DM14))","v":""},"Nbr de jour","=",{"$f":"IF(SUM(DP11:DP14)=0,\"\",SUM(DP11:DP14))","v":""},"Nbr de jour","=",{"$f":"IF(SUM(DS11:DS14)=0,\"\",SUM(DS11:DS14))","v":""},"Nbr de jour","=",{"$f":"IF(SUM(DV11:DV14)=0,\"\",SUM(DV11:DV14))","v":""},"Nbr de jour","=",{"$f":"IF(SUM(DY11:DY14)=0,\"\",SUM(DY11:DY14))","v":""},"Nbr de jour","=",{"$f":"IF(SUM(EB11:EB14)=0,\"\",SUM(EB11:EB14))","v":""}]
[null,null,null,{"$f":"IF(D18=\"\",\"\",D18)","v":""},"","P3","","","","","","",""]
[null,null,null,{"$f":"IF(D18=\"\",\"\",D18)","v":""},"","P3","","","","","","",""]
["14/054","Nom affaire","EXE",null,null,"P3"]
[null,null,null,{"$f":"IF(D18=\"\",\"\",D18)","v":""},"","P3","","","","","","",""]
[null,"Temps passé en jour =",null,{"$f":"IF(D18=\"\",\"\",D18)","v":""},"","P3","","","","","","","","Nbr de jour","=",{"$f":"IF(SUM(O16:O19)=0,\"\",SUM(O16:O19))","v":""},"Nbr de jour","=",{"$f":"IF(SUM(R16:R19)=0,\"\",SUM(R16:R19))","v":""},"Nbr de jour","=",{"$f":"IF(SUM(U16:U19)=0,\"\",SUM(U16:U19))","v":""},"Nbr de jour","=",{"$f":"IF(SUM(X16:X19)=0,\"\",SUM(X16:X19))","v":""},"Nbr de jour","=",{"$f":"IF(SUM(AA16:AA19)=0,\"\",SUM(AA16:AA19))","v":""},"Nbr de jour","=",{"$f":"IF(SUM(AD16:AD19)=0,\"\",SUM(AD16:AD19))","v":""},"Nbr de jour","=",{"$f":"IF(SUM(AG16:AG19)=0,\"\",SUM(AG16:AG19))","v":""},"Nbr de jour","=",{"$f":"IF(SUM(AJ16:AJ19)=0,\"\",SUM(AJ16:AJ19))","v":""},"Nbr de jour","=",{"$f":"IF(SUM(AM16:AM19)=0,\"\",SUM(AM16:AM19))","v":""},"Nbr de jour","=",{"$f":"IF(SUM(AP16:AP19)=0,\"\",SUM(AP16:AP19))","v":""},"Nbr de jour","=",{"$f":"IF(SUM(AS16:AS19)=0,\"\",SUM(AS16:AS19))","v":""},"Nbr de jour","=",{"$f":"IF(SUM(AV16:AV19)=0,\"\",SUM(AV16:AV19))","v":""},"Nbr de jour","=",{"$f":"IF(SUM(AY16:AY19)=0,\"\",SUM(AY16:AY19))","v":""},"Nbr de jour","=",{"$f":"IF(SUM(BB16:BB19)=0,\"\",SUM(BB16:BB19))","v":""},"Nbr de jour","=",{"$f":"IF(SUM(BE16:BE19)=0,\"\",SUM(BE16:BE19))","v":""},"Nbr de jour","=",{"$f":"IF(SUM(BH16:BH19)=0,\"\",SUM(BH16:BH19))","v":""},"Nbr de jour","=",{"$f":"IF(SUM(BK16:BK19)=0,\"\",SUM(BK16:BK19))","v":""},"Nbr de jour","=",{"$f":"IF(SUM(BN16:BN19)=0,\"\",SUM(BN16:BN19))","v":""},"Nbr de jour","=",{"$f":"IF(SUM(BQ16:BQ19)=0,\"\",SUM(BQ16:BQ19))","v":""},"Nbr de jour","=",{"$f":"IF(SUM(BT16:BT19)=0,\"\",SUM(BT16:BT19))","v":""},"Nbr de jour","=",{"$f":"IF(SUM(BW16:BW19)=0,\"\",SUM(BW16:BW19))","v":""},"Nbr de jour","=",{"$f":"IF(SUM(BZ16:BZ19)=0,\"\",SUM(BZ16:BZ19))","v":""},"Nbr de jour","=",{"$f":"IF(SUM(CC16:CC19)=0,\"\",SUM(CC16:CC19))","v":""},"Nbr de jour","=",{"$f":"IF(SUM(CF16:CF19)=0,\"\",SUM(CF16:CF19))","v":""},"Nbr de jour","=",{"$f":"IF(SUM(CI16:CI19)=0,\"\",SUM(CI16:CI19))","v":""},"Nbr de jour","=",{"$f":"IF(SUM(CL16:CL19)=0,\"\",SUM(CL16:CL19))","v":""},"Nbr de jour","=",{"$f":"IF(SUM(CO16:CO19)=0,\"\",SUM(CO16:CO19))","v":""},"Nbr de jour","=",{"$f":"IF(SUM(CR16:CR19)=0,\"\",SUM(CR16:CR19))","v":""},"Nbr de jour","=",{"$f":"IF(SUM(CU16:CU19)=0,\"\",SUM(CU16:CU19))","v":""},"Nbr de jour","=",{"$f":"IF(SUM(CX16:CX19)=0,\"\",SUM(CX16:CX19))","v":""},"Nbr de jour","=",{"$f":"IF(SUM(DA16:DA19)=0,\"\",SUM(DA16:DA19))","v":""},"Nbr de jour","=",{"$f":"IF(SUM(DD16:DD19)=0,\"\",SUM(DD16:DD19))","v":""},"Nbr de jour","=",{"$f":"IF(SUM(DG16:DG19)=0,\"\",SUM(DG16:DG19))","v":""},"Nbr de jour","=",{"$f":"IF(SUM(DJ16:DJ19)=0,\"\",SUM(DJ16:DJ19))","v":""},"Nbr de jour","=",{"$f":"IF(SUM(DM16:DM19)=0,\"\",SUM(DM16:DM19))","v":""},"Nbr de jour","=",{"$f":"IF(SUM(DP16:DP19)=0,\"\",SUM(DP16:DP19))","v":""},"Nbr de jour","=",{"$f":"IF(SUM(DS16:DS19)=0,\"\",SUM(DS16:DS19))","v":""},"Nbr de jour","=",{"$f":"IF(SUM(DV16:DV19)=0,\"\",SUM(DV16:DV19))","v":""},"Nbr de jour","=",{"$f":"IF(SUM(DY16:DY19)=0,\"\",SUM(DY16:DY19))","v":""},"Nbr de jour","=",{"$f":"IF(SUM(EB16:EB19)=0,\"\",SUM(EB16:EB19))","v":""}]
[null,null,null,{"$f":"IF(D23=\"\",\"\",D23)","v":"P1"},"","","","","","","","",""]
[null,null,null,{"$f":"IF(D23=\"\",\"\",D23)","v":"P1"},"","","","","","","","","","Réunion ",0.5]
["13/022","Nom affaire","DET","P1",null,null,null,null,null,null,null,null,null,"Plan AVP",1]
[null,null,null,{"$f":"IF(D23=\"\",\"\",D23)","v":"P1"},"","","","","","","","",""]
[null,"Temps passé en jour =",null,{"$f":"IF(D23=\"\",\"\",D23)","v":"P1"},"","","","","","","","","","Nbr de jour","=",{"$f":"IF(SUM(O21:O24)=0,\"\",SUM(O21:O24))","v":1.5},"Nbr de jour","=",{"$f":"IF(SUM(R21:R24)=0,\"\",SUM(R21:R24))","v":""},"Nbr de jour","=",{"$f":"IF(SUM(U21:U24)=0,\"\",SUM(U21:U24))","v":""},"Nbr de jour","=",{"$f":"IF(SUM(X21:X24)=0,\"\",SUM(X21:X24))","v":""},"Nbr de jour","=",{"$f":"IF(SUM(AA21:AA24)=0,\"\",SUM(AA21:AA24))","v":""},"Nbr de jour","=",{"$f":"IF(SUM(AD21:AD24)=0,\"\",SUM(AD21:AD24))","v":""},"Nbr de jour","=",{"$f":"IF(SUM(AG21:AG24)=0,\"\",SUM(AG21:AG24))","v":""},"Nbr de jour","=",{"$f":"IF(SUM(AJ21:AJ24)=0,\"\",SUM(AJ21:AJ24))","v":""},"Nbr de jour","=",{"$f":"IF(SUM(AM21:AM24)=0,\"\",SUM(AM21:AM24))","v":""},"Nbr de jour","=",{"$f":"IF(SUM(AP21:AP24)=0,\"\",SUM(AP21:AP24))","v":""},"Nbr de jour","=",{"$f":"IF(SUM(AS21:AS24)=0,\"\",SUM(AS21:AS24))","v":""},"Nbr de jour","=",{"$f":"IF(SUM(AV21:AV24)=0,\"\",SUM(AV21:AV24))","v":""},"Nbr de jour","=",{"$f":"IF(SUM(AY21:AY24)=0,\"\",SUM(AY21:AY24))","v":""},"Nbr de jour","=",{"$f":"IF(SUM(BB21:BB24)=0,\"\",SUM(BB21:BB24))","v":""},"Nbr de jour","=",{"$f":"IF(SUM(BE21:BE24)=0,\"\",SUM(BE21:BE24))","v":""},"Nbr de jour","=",{"$f":"IF(SUM(BH21:BH24)=0,\"\",SUM(BH21:BH24))","v":""},"Nbr de jour","=",{"$f":"IF(SUM(BK21:BK24)=0,\"\",SUM(BK21:BK24))","v":""},"Nbr de jour","=",{"$f":"IF(SUM(BN21:BN24)=0,\"\",SUM(BN21:BN24))","v":""},"Nbr de jour","=",{"$f":"IF(SUM(BQ21:BQ24)=0,\"\",SUM(BQ21:BQ24))","v":""},"Nbr de jour","=",{"$f":"IF(SUM(BT21:BT24)=0,\"\",SUM(BT21:BT24))","v":""},"Nbr de jour","=",{"$f":"IF(SUM(BW21:BW24)=0,\"\",SUM(BW21:BW24))","v":""},"Nbr de jour","=",{"$f":"IF(SUM(BZ21:BZ24)=0,\"\",SUM(BZ21:BZ24))","v":""},"Nbr de jour","=",{"$f":"IF(SUM(CC21:CC24)=0,\"\",SUM(CC21:CC24))","v":""},"Nbr de jour","=",{"$f":"IF(SUM(CF21:CF24)=0,\"\",SUM(CF21:CF24))","v":""},"Nbr de jour","=",{"$f":"IF(SUM(CI21:CI24)=0,\"\",SUM(CI21:CI24))","v":""},"Nbr de jour","=",{"$f":"IF(SUM(CL21:CL24)=0,\"\",SUM(CL21:CL24))","v":""},"Nbr de jour","=",{"$f":"IF(SUM(CO21:CO24)=0,\"\",SUM(CO21:CO24))","v":""},"Nbr de jour","=",{"$f":"IF(SUM(CR21:CR24)=0,\"\",SUM(CR21:CR24))","v":""},"Nbr de jour","=",{"$f":"IF(SUM(CU21:CU24)=0,\"\",SUM(CU21:CU24))","v":""},"Nbr de jour","=",{"$f":"IF(SUM(CX21:CX24)=0,\"\",SUM(CX21:CX24))","v":""},"Nbr de jour","=",{"$f":"IF(SUM(DA21:DA24)=0,\"\",SUM(DA21:DA24))","v":""},"Nbr de jour","=",{"$f":"IF(SUM(DD21:DD24)=0,\"\",SUM(DD21:DD24))","v":""},"Nbr de jour","=",{"$f":"IF(SUM(DG21:DG24)=0,\"\",SUM(DG21:DG24))","v":""},"Nbr de jour","=",{"$f":"IF(SUM(DJ21:DJ24)=0,\"\",SUM(DJ21:DJ24))","v":""},"Nbr de jour","=",{"$f":"IF(SUM(DM21:DM24)=0,\"\",SUM(DM21:DM24))","v":""},"Nbr de jour","=",{"$f":"IF(SUM(DP21:DP24)=0,\"\",SUM(DP21:DP24))","v":""},"Nbr de jour","=",{"$f":"IF(SUM(DS21:DS24)=0,\"\",SUM(DS21:DS24))","v":""},"Nbr de jour","=",{"$f":"IF(SUM(DV21:DV24)=0,\"\",SUM(DV21:DV24))","v":""},"Nbr de jour","=",{"$f":"IF(SUM(DY21:DY24)=0,\"\",SUM(DY21:DY24))","v":""},"Nbr de jour","=",{"$f":"IF(SUM(EB21:EB24)=0,\"\",SUM(EB21:EB24))","v":""}]
[null,null,null,{"$f":"IF(D28=\"\",\"\",D28)","v":""},"","","","","","","","","P10"]
[null,null,null,{"$f":"IF(D28=\"\",\"\",D28)","v":""},"","","","","","","","","P10"]
["Numéro 01","Nom affaire","AVP",null,null,null,null,null,null,null,null,null,"P10"]
[null,null,null,{"$f":"IF(D28=\"\",\"\",D28)","v":""},"","","","","","","","","P10"]
[null,"Temps passé en jour =",null,{"$f":"IF(D28=\"\",\"\",D28)","v":""},"","","","","","","","","P10","Nbr de jour","=",{"$f":"IF(SUM(O26:O29)=0,\"\",SUM(O26:O29))","v":""},"Nbr de jour","=",{"$f":"IF(SUM(R26:R29)=0,\"\",SUM(R26:R29))","v":""},"Nbr de jour","=",{"$f":"IF(SUM(U26:U29)=0,\"\",SUM(U26:U29))","v":""},"Nbr de jour","=",{"$f":"IF(SUM(X26:X29)=0,\"\",SUM(X26:X29))","v":""},"Nbr de jour","=",{"$f":"IF(SUM(AA26:AA29)=0,\"\",SUM(AA26:AA29))","v":""},"Nbr de jour","=",{"$f":"IF(SUM(AD26:AD29)=0,\"\",SUM(AD26:AD29))","v":""},"Nbr de jour","=",{"$f":"IF(SUM(AG26:AG29)=0,\"\",SUM(AG26:AG29))","v":""},"Nbr de jour","=",{"$f":"IF(SUM(AJ26:AJ29)=0,\"\",SUM(AJ26:AJ29))","v":""},"Nbr de jour","=",{"$f":"IF(SUM(AM26:AM29)=0,\"\",SUM(AM26:AM29))","v":""},"Nbr de jour","=",{"$f":"IF(SUM(AP26:AP29)=0,\"\",SUM(AP26:AP29))","v":""},"Nbr de jour","=",{"$f":"IF(SUM(AS26:AS29)=0,\"\",SUM(AS26:AS29))","v":""},"Nbr de jour","=",{"$f":"IF(SUM(AV26:AV29)=0,\"\",SUM(AV26:AV29))","v":""},"Nbr de jour","=",{"$f":"IF(SUM(AY26:AY29)=0,\"\",SUM(AY26:AY29))","v":""},"Nbr de jour","=",{"$f":"IF(SUM(BB26:BB29)=0,\"\",SUM(BB26:BB29))","v":""},"Nbr de jour","=",{"$f":"IF(SUM(BE26:BE29)=0,\"\",SUM(BE26:BE29))","v":""},"Nbr de jour","=",{"$f":"IF(SUM(BH26:BH29)=0,\"\",SUM(BH26:BH29))","v":""},"Nbr de jour","=",{"$f":"IF(SUM(BK26:BK29)=0,\"\",SUM(BK26:BK29))","v":""},"Nbr de jour","=",{"$f":"IF(SUM(BN26:BN29)=0,\"\",SUM(BN26:BN29))","v":""},"Nbr de jour","=",{"$f":"IF(SUM(BQ26:BQ29)=0,\"\",SUM(BQ26:BQ29))","v":""},"Nbr de jour","=",{"$f":"IF(SUM(BT26:BT29)=0,\"\",SUM(BT26:BT29))","v":""},"Nbr de jour","=",{"$f":"IF(SUM(BW26:BW29)=0,\"\",SUM(BW26:BW29))","v":""},"Nbr de jour","=",{"$f":"IF(SUM(BZ26:BZ29)=0,\"\",SUM(BZ26:BZ29))","v":""},"Nbr de jour","=",{"$f":"IF(SUM(CC26:CC29)=0,\"\",SUM(CC26:CC29))","v":""},"Nbr de jour","=",{"$f":"IF(SUM(CF26:CF29)=0,\"\",SUM(CF26:CF29))","v":""},"Nbr de jour","=",{"$f":"IF(SUM(CI26:CI29)=0,\"\",SUM(CI26:CI29))","v":""},"Nbr de jour","=",{"$f":"IF(SUM(CL26:CL29)=0,\"\",SUM(CL26:CL29))","v":""},"Nbr de jour","=",{"$f":"IF(SUM(CO26:CO29)=0,\"\",SUM(CO26:CO29))","v":""},"Nbr de jour","=",{"$f":"IF(SUM(CR26:CR29)=0,\"\",SUM(CR26:CR29))","v":""},"Nbr de jour","=",{"$f":"IF(SUM(CU26:CU29)=0,\"\",SUM(CU26:CU29))","v":""},"Nbr de jour","=",{"$f":"IF(SUM(CX26:CX29)=0,\"\",SUM(CX26:CX29))","v":""},"Nbr de jour","=",{"$f":"IF(SUM(DA26:DA29)=0,\"\",SUM(DA26:DA29))","v":""},"Nbr de jour","=",{"$f":"IF(SUM(DD26:DD29)=0,\"\",SUM(DD26:DD29))","v":""},"Nbr de jour","=",{"$f":"IF(SUM(DG26:DG29)=0,\"\",SUM(DG26:DG29))","v":""},"Nbr de jour","=",{"$f":"IF(SUM(DJ26:DJ29)=0,\"\",SUM(DJ26:DJ29))","v":""},"Nbr de jour","=",{"$f":"IF(SUM(DM26:DM29)=0,\"\",SUM(DM26:DM29))","v":""},"Nbr de jour","=",{"$f":"IF(SUM(DP26:DP29)=0,\"\",SUM(DP26:DP29))","v":""},"Nbr de jour","=",{"$f":"IF(SUM(DS26:DS29)=0,\"\",SUM(DS26:DS29))","v":""},"Nbr de jour","=",{"$f":"IF(SUM(DV26:DV29)=0,\"\",SUM(DV26:DV29))","v":""},"Nbr de jour","=",{"$f":"IF(SUM(DY26:DY29)=0,\"\",SUM(DY26:DY29))","v":""},"Nbr de jour","=",{"$f":"IF(SUM(EB26:EB29)=0,\"\",SUM(EB26:EB29))","v":""}]
[null,null,null,{"$f":"IF(D33=\"\",\"\",D33)","v":""},"","P3","","","","","","",""]
[null,null,null,{"$f":"IF(D33=\"\",\"\",D33)","v":""},"","P3","","","","","","",""]
["Numéro 02","Nom affaire","AVP",null,null,"P3"]
[null,null,null,{"$f":"IF(D33=\"\",\"\",D33)","v":""},"","P3","","","","","","",""]
[null,"Temps passé en jour =",null,{"$f":"IF(D33=\"\",\"\",D33)","v":""},"","P3","","","","","","","","Nbr de jour","=",{"$f":"IF(SUM(O31:O34)=0,\"\",SUM(O31:O34))","v":""},"Nbr de jour","=",{"$f":"IF(SUM(R31:R34)=0,\"\",SUM(R31:R34))","v":""},"Nbr de jour","=",{"$f":"IF(SUM(U31:U34)=0,\"\",SUM(U31:U34))","v":""},"Nbr de jour","=",{"$f":"IF(SUM(X31:X34)=0,\"\",SUM(X31:X34))","v":""},"Nbr de jour","=",{"$f":"IF(SUM(AA31:AA34)=0,\"\",SUM(AA31:AA34))","v":""},"Nbr de jour","=",{"$f":"IF(SUM(AD31:AD34)=0,\"\",SUM(AD31:AD34))","v":""},"Nbr de jour","=",{"$f":"IF(SUM(AG31:AG34)=0,\"\",SUM(AG31:AG34))","v":""},"Nbr de jour","=",{"$f":"IF(SUM(AJ31:AJ34)=0,\"\",SUM(AJ31:AJ34))","v":""},"Nbr de jour","=",{"$f":"IF(SUM(AM31:AM34)=0,\"\",SUM(AM31:AM34))","v":""},"Nbr de jour","=",{"$f":"IF(SUM(AP31:AP34)=0,\"\",SUM(AP31:AP34))","v":""},"Nbr de jour","=",{"$f":"IF(SUM(AS31:AS34)=0,\"\",SUM(AS31:AS34))","v":""},"Nbr de jour","=",{"$f":"IF(SUM(AV31:AV34)=0,\"\",SUM(AV31:AV34))","v":""},"Nbr de jour","=",{"$f":"IF(SUM(AY31:AY34)=0,\"\",SUM(AY31:AY34))","v":""},"Nbr de jour","=",{"$f":"IF(SUM(BB31:BB34)=0,\"\",SUM(BB31:BB34))","v":""},"Nbr de jour","=",{"$f":"IF(SUM(BE31:BE34)=0,\"\",SUM(BE31:BE34))","v":""},"Nbr de jour","=",{"$f":"IF(SUM(BH31:BH34)=0,\"\",SUM(BH31:BH34))","v":""},"Nbr de jour","=",{"$f":"IF(SUM(BK31:BK34)=0,\"\",SUM(BK31:BK34))","v":""},"Nbr de jour","=",{"$f":"IF(SUM(BN31:BN34)=0,\"\",SUM(BN31:BN34))","v":""},"Nbr de jour","=",{"$f":"IF(SUM(BQ31:BQ34)=0,\"\",SUM(BQ31:BQ34))","v":""},"Nbr de jour","=",{"$f":"IF(SUM(BT31:BT34)=0,\"\",SUM(BT31:BT34))","v":""},"Nbr de jour","=",{"$f":"IF(SUM(BW31:BW34)=0,\"\",SUM(BW31:BW34))","v":""},"Nbr de jour","=",{"$f":"IF(SUM(BZ31:BZ34)=0,\"\",SUM(BZ31:BZ34))","v":""},"Nbr de jour","=",{"$f":"IF(SUM(CC31:CC34)=0,\"\",SUM(CC31:CC34))","v":""},"Nbr de jour","=",{"$f":"IF(SUM(CF31:CF34)=0,\"\",SUM(CF31:CF34))","v":""},"Nbr de jour","=",{"$f":"IF(SUM(CI31:CI34)=0,\"\",SUM(CI31:CI34))","v":""},"Nbr de jour","=",{"$f":"IF(SUM(CL31:CL34)=0,\"\",SUM(CL31:CL34))","v":""},"Nbr de jour","=",{"$f":"IF(SUM(CO31:CO34)=0,\"\",SUM(CO31:CO34))","v":""},"Nbr de jour","=",{"$f":"IF(SUM(CR31:CR34)=0,\"\",SUM(CR31:CR34))","v":""},"Nbr de jour","=",{"$f":"IF(SUM(CU31:CU34)=0,\"\",SUM(CU31:CU34))","v":""},"Nbr de jour","=",{"$f":"IF(SUM(CX31:CX34)=0,\"\",SUM(CX31:CX34))","v":""},"Nbr de jour","=",{"$f":"IF(SUM(DA31:DA34)=0,\"\",SUM(DA31:DA34))","v":""},"Nbr de jour","=",{"$f":"IF(SUM(DD31:DD34)=0,\"\",SUM(DD31:DD34))","v":""},"Nbr de jour","=",{"$f":"IF(SUM(DG31:DG34)=0,\"\",SUM(DG31:DG34))","v":""},"Nbr de jour","=",{"$f":"IF(SUM(DJ31:DJ34)=0,\"\",SUM(DJ31:DJ34))","v":""},"Nbr de jour","=",{"$f":"IF(SUM(DM31:DM34)=0,\"\",SUM(DM31:DM34))","v":""},"Nbr de jour","=",{"$f":"IF(SUM(DP31:DP34)=0,\"\",SUM(DP31:DP34))","v":""},"Nbr de jour","=",{"$f":"IF(SUM(DS31:DS34)=0,\"\",SUM(DS31:DS34))","v":""},"Nbr de jour","=",{"$f":"IF(SUM(DV31:DV34)=0,\"\",SUM(DV31:DV34))","v":""},"Nbr de jour","=",{"$f":"IF(SUM(DY31:DY34)=0,\"\",SUM(DY31:DY34))","v":""},"Nbr de jour","=",{"$f":"IF(SUM(EB31:EB34)=0,\"\",SUM(EB31:EB34))","v":""}]
[null,null,null,{"$f":"IF(D38=\"\",\"\",D38)","v":"P1"},"","P3","","","P6","","","",""]
[null,null,null,{"$f":"IF(D38=\"\",\"\",D38)","v":"P1"},"","P3","","","P6","","","",""]
["Numéro 03","Nom affaire","DET","P1",null,"P3",null,null,"P6"]
[null,null,null,{"$f":"IF(D38=\"\",\"\",D38)","v":"P1"},"","P3","","","P6","","","",""]
[null,"Temps passé en jour =",null,{"$f":"IF(D38=\"\",\"\",D38)","v":"P1"},"","P3","","","P6","","","","","Nbr de jour","=",{"$f":"IF(SUM(O36:O39)=0,\"\",SUM(O36:O39))","v":""},"Nbr de jour","=",{"$f":"IF(SUM(R36:R39)=0,\"\",SUM(R36:R39))","v":""},"Nbr de jour","=",{"$f":"IF(SUM(U36:U39)=0,\"\",SUM(U36:U39))","v":""},"Nbr de jour","=",{"$f":"IF(SUM(X36:X39)=0,\"\",SUM(X36:X39))","v":""},"Nbr de jour","=",{"$f":"IF(SUM(AA36:AA39)=0,\"\",SUM(AA36:AA39))","v":""},"Nbr de jour","=",{"$f":"IF(SUM(AD36:AD39)=0,\"\",SUM(AD36:AD39))","v":""},"Nbr de jour","=",{"$f":"IF(SUM(AG36:AG39)=0,\"\",SUM(AG36:AG39))","v":""},"Nbr de jour","=",{"$f":"IF(SUM(AJ36:AJ39)=0,\"\",SUM(AJ36:AJ39))","v":""},"Nbr de jour","=",{"$f":"IF(SUM(AM36:AM39)=0,\"\",SUM(AM36:AM39))","v":""},"Nbr de jour","=",{"$f":"IF(SUM(AP36:AP39)=0,\"\",SUM(AP36:AP39))","v":""},"Nbr de jour","=",{"$f":"IF(SUM(AS36:AS39)=0,\"\",SUM(AS36:AS39))","v":""},"Nbr de jour","=",{"$f":"IF(SUM(AV36:AV39)=0,\"\",SUM(AV36:AV39))","v":""},"Nbr de jour","=",{"$f":"IF(SUM(AY36:AY39)=0,\"\",SUM(AY36:AY39))","v":""},"Nbr de jour","=",{"$f":"IF(SUM(BB36:BB39)=0,\"\",SUM(BB36:BB39))","v":""},"Nbr de jour","=",{"$f":"IF(SUM(BE36:BE39)=0,\"\",SUM(BE36:BE39))","v":""},"Nbr de jour","=",{"$f":"IF(SUM(BH36:BH39)=0,\"\",SUM(BH36:BH39))","v":""},"Nbr de jour","=",{"$f":"IF(SUM(BK36:BK39)=0,\"\",SUM(BK36:BK39))","v":""},"Nbr de jour","=",{"$f":"IF(SUM(BN36:BN39)=0,\"\",SUM(BN36:BN39))","v":""},"Nbr de jour","=",{"$f":"IF(SUM(BQ36:BQ39)=0,\"\",SUM(BQ36:BQ39))","v":""},"Nbr de jour","=",{"$f":"IF(SUM(BT36:BT39)=0,\"\",SUM(BT36:BT39))","v":""},"Nbr de jour","=",{"$f":"IF(SUM(BW36:BW39)=0,\"\",SUM(BW36:BW39))","v":""},"Nbr de jour","=",{"$f":"IF(SUM(BZ36:BZ39)=0,\"\",SUM(BZ36:BZ39))","v":""},"Nbr de jour","=",{"$f":"IF(SUM(CC36:CC39)=0,\"\",SUM(CC36:CC39))","v":""},"Nbr de jour","=",{"$f":"IF(SUM(CF36:CF39)=0,\"\",SUM(CF36:CF39))","v":""},"Nbr de jour","=",{"$f":"IF(SUM(CI36:CI39)=0,\"\",SUM(CI36:CI39))","v":""},"Nbr de jour","=",{"$f":"IF(SUM(CL36:CL39)=0,\"\",SUM(CL36:CL39))","v":""},"Nbr de jour","=",{"$f":"IF(SUM(CO36:CO39)=0,\"\",SUM(CO36:CO39))","v":""},"Nbr de jour","=",{"$f":"IF(SUM(CR36:CR39)=0,\"\",SUM(CR36:CR39))","v":""},"Nbr de jour","=",{"$f":"IF(SUM(CU36:CU39)=0,\"\",SUM(CU36:CU39))","v":""},"Nbr de jour","=",{"$f":"IF(SUM(CX36:CX39)=0,\"\",SUM(CX36:CX39))","v":""},"Nbr de jour","=",{"$f":"IF(SUM(DA36:DA39)=0,\"\",SUM(DA36:DA39))","v":""},"Nbr de jour","=",{"$f":"IF(SUM(DD36:DD39)=0,\"\",SUM(DD36:DD39))","v":""},"Nbr de jour","=",{"$f":"IF(SUM(DG36:DG39)=0,\"\",SUM(DG36:DG39))","v":""},"Nbr de jour","=",{"$f":"IF(SUM(DJ36:DJ39)=0,\"\",SUM(DJ36:DJ39))","v":""},"Nbr de jour","=",{"$f":"IF(SUM(DM36:DM39)=0,\"\",SUM(DM36:DM39))","v":""},"Nbr de jour","=",{"$f":"IF(SUM(DP36:DP39)=0,\"\",SUM(DP36:DP39))","v":""},"Nbr de jour","=",{"$f":"IF(SUM(DS36:DS39)=0,\"\",SUM(DS36:DS39))","v":""},"Nbr de jour","=",{"$f":"IF(SUM(DV36:DV39)=0,\"\",SUM(DV36:DV39))","v":""},"Nbr de jour","=",{"$f":"IF(SUM(DY36:DY39)=0,\"\",SUM(DY36:DY39))","v":""},"Nbr de jour","=",{"$f":"IF(SUM(EB36:EB39)=0,\"\",SUM(EB36:EB39))","v":""}]
[null,null,null,{"$f":"IF(D43=\"\",\"\",D43)","v":"P1"},"","","","","","","","",""]
[null,null,null,{"$f":"IF(D43=\"\",\"\",D43)","v":"P1"},"","","","","","","","",""]
["Numéro 04","Nom affaire","DET","P1"]
[null,null,null,{"$f":"IF(D43=\"\",\"\",D43)","v":"P1"},"","","","","","","","",""]
[null,"Temps passé en jour =",null,{"$f":"IF(D43=\"\",\"\",D43)","v":"P1"},"","","","","","","","","","Nbr de jour","=",{"$f":"IF(SUM(O41:O44)=0,\"\",SUM(O41:O44))","v":""},"Nbr de jour","=",{"$f":"IF(SUM(R41:R44)=0,\"\",SUM(R41:R44))","v":""},"Nbr de jour","=",{"$f":"IF(SUM(U41:U44)=0,\"\",SUM(U41:U44))","v":""},"Nbr de jour","=",{"$f":"IF(SUM(X41:X44)=0,\"\",SUM(X41:X44))","v":""},"Nbr de jour","=",{"$f":"IF(SUM(AA41:AA44)=0,\"\",SUM(AA41:AA44))","v":""},"Nbr de jour","=",{"$f":"IF(SUM(AD41:AD44)=0,\"\",SUM(AD41:AD44))","v":""},"Nbr de jour","=",{"$f":"IF(SUM(AG41:AG44)=0,\"\",SUM(AG41:AG44))","v":""},"Nbr de jour","=",{"$f":"IF(SUM(AJ41:AJ44)=0,\"\",SUM(AJ41:AJ44))","v":""},"Nbr de jour","=",{"$f":"IF(SUM(AM41:AM44)=0,\"\",SUM(AM41:AM44))","v":""},"Nbr de jour","=",{"$f":"IF(SUM(AP41:AP44)=0,\"\",SUM(AP41:AP44))","v":""},"Nbr de jour","=",{"$f":"IF(SUM(AS41:AS44)=0,\"\",SUM(AS41:AS44))","v":""},"Nbr de jour","=",{"$f":"IF(SUM(AV41:AV44)=0,\"\",SUM(AV41:AV44))","v":""},"Nbr de jour","=",{"$f":"IF(SUM(AY41:AY44)=0,\"\",SUM(AY41:AY44))","v":""},"Nbr de jour","=",{"$f":"IF(SUM(BB41:BB44)=0,\"\",SUM(BB41:BB44))","v":""},"Nbr de jour","=",{"$f":"IF(SUM(BE41:BE44)=0,\"\",SUM(BE41:BE44))","v":""},"Nbr de jour","=",{"$f":"IF(SUM(BH41:BH44)=0,\"\",SUM(BH41:BH44))","v":""},"Nbr de jour","=",{"$f":"IF(SUM(BK41:BK44)=0,\"\",SUM(BK41:BK44))","v":""},"Nbr de jour","=",{"$f":"IF(SUM(BN41:BN44)=0,\"\",SUM(BN41:BN44))","v":""},"Nbr de jour","=",{"$f":"IF(SUM(BQ41:BQ44)=0,\"\",SUM(BQ41:BQ44))","v":""},"Nbr de jour","=",{"$f":"IF(SUM(BT41:BT44)=0,\"\",SUM(BT41:BT44))","v":""},"Nbr de jour","=",{"$f":"IF(SUM(BW41:BW44)=0,\"\",SUM(BW41:BW44))","v":""},"Nbr de jour","=",{"$f":"IF(SUM(BZ41:BZ44)=0,\"\",SUM(BZ41:BZ44))","v":""},"Nbr de jour","=",{"$f":"IF(SUM(CC41:CC44)=0,\"\",SUM(CC41:CC44))","v":""},"Nbr de jour","=",{"$f":"IF(SUM(CF41:CF44)=0,\"\",SUM(CF41:CF44))","v":""},"Nbr de jour","=",{"$f":"IF(SUM(CI41:CI44)=0,\"\",SUM(CI41:CI44))","v":""},"Nbr de jour","=",{"$f":"IF(SUM(CL41:CL44)=0,\"\",SUM(CL41:CL44))","v":""},"Nbr de jour","=",{"$f":"IF(SUM(CO41:CO44)=0,\"\",SUM(CO41:CO44))","v":""},"Nbr de jour","=",{"$f":"IF(SUM(CR41:CR44)=0,\"\",SUM(CR41:CR44))","v":""},"Nbr de jour","=",{"$f":"IF(SUM(CU41:CU44)=0,\"\",SUM(CU41:CU44))","v":""},"Nbr de jour","=",{"$f":"IF(SUM(CX41:CX44)=0,\"\",SUM(CX41:CX44))","v":""},"Nbr de jour","=",{"$f":"IF(SUM(DA41:DA44)=0,\"\",SUM(DA41:DA44))","v":""},"Nbr de jour","=",{"$f":"IF(SUM(DD41:DD44)=0,\"\",SUM(DD41:DD44))","v":""},"Nbr de jour","=",{"$f":"IF(SUM(DG41:DG44)=0,\"\",SUM(DG41:DG44))","v":""},"Nbr de jour","=",{"$f":"IF(SUM(DJ41:DJ44)=0,\"\",SUM(DJ41:DJ44))","v":""},"Nbr de jour","=",{"$f":"IF(SUM(DM41:DM44)=0,\"\",SUM(DM41:DM44))","v":""},"Nbr de jour","=",{"$f":"IF(SUM(DP41:DP44)=0,\"\",SUM(DP41:DP44))","v":""},"Nbr de jour","=",{"$f":"IF(SUM(DS41:DS44)=0,\"\",SUM(DS41:DS44))","v":""},"Nbr de jour","=",{"$f":"IF(SUM(DV41:DV44)=0,\"\",SUM(DV41:DV44))","v":""},"Nbr de jour","=",{"$f":"IF(SUM(DY41:DY44)=0,\"\",SUM(DY41:DY44))","v":""},"Nbr de jour","=",{"$f":"IF(SUM(EB41:EB44)=0,\"\",SUM(EB41:EB44))","v":""}]
[null,null,null,{"$f":"IF(D48=\"\",\"\",D48)","v":""},"","","","P5","","","","",""]
[null,null,null,{"$f":"IF(D48=\"\",\"\",D48)","v":""},"","","","P5","","","","",""]
["Numéro 05","Nom affaire","DET",null,null,null,null,"P5"]
[null,null,null,{"$f":"IF(D48=\"\",\"\",D48)","v":""},"","","","P5","","","","",""]
[null,"Temps passé en jour =",null,{"$f":"IF(D48=\"\",\"\",D48)","v":""},"","","","P5","","","","","","Nbr de jour","=",{"$f":"IF(SUM(O46:O49)=0,\"\",SUM(O46:O49))","v":""},"Nbr de jour","=",{"$f":"IF(SUM(R46:R49)=0,\"\",SUM(R46:R49))","v":""},"Nbr de jour","=",{"$f":"IF(SUM(U46:U49)=0,\"\",SUM(U46:U49))","v":""},"Nbr de jour","=",{"$f":"IF(SUM(X46:X49)=0,\"\",SUM(X46:X49))","v":""},"Nbr de jour","=",{"$f":"IF(SUM(AA46:AA49)=0,\"\",SUM(AA46:AA49))","v":""},"Nbr de jour","=",{"$f":"IF(SUM(AD46:AD49)=0,\"\",SUM(AD46:AD49))","v":""},"Nbr de jour","=",{"$f":"IF(SUM(AG46:AG49)=0,\"\",SUM(AG46:AG49))","v":""},"Nbr de jour","=",{"$f":"IF(SUM(AJ46:AJ49)=0,\"\",SUM(AJ46:AJ49))","v":""},"Nbr de jour","=",{"$f":"IF(SUM(AM46:AM49)=0,\"\",SUM(AM46:AM49))","v":""},"Nbr de jour","=",{"$f":"IF(SUM(AP46:AP49)=0,\"\",SUM(AP46:AP49))","v":""},"Nbr de jour","=",{"$f":"IF(SUM(AS46:AS49)=0,\"\",SUM(AS46:AS49))","v":""},"Nbr de jour","=",{"$f":"IF(SUM(AV46:AV49)=0,\"\",SUM(AV46:AV49))","v":""},"Nbr de jour","=",{"$f":"IF(SUM(AY46:AY49)=0,\"\",SUM(AY46:AY49))","v":""},"Nbr de jour","=",{"$f":"IF(SUM(BB46:BB49)=0,\"\",SUM(BB46:BB49))","v":""},"Nbr de jour","=",{"$f":"IF(SUM(BE46:BE49)=0,\"\",SUM(BE46:BE49))","v":""},"Nbr de jour","=",{"$f":"IF(SUM(BH46:BH49)=0,\"\",SUM(BH46:BH49))","v":""},"Nbr de jour","=",{"$f":"IF(SUM(BK46:BK49)=0,\"\",SUM(BK46:BK49))","v":""},"Nbr de jour","=",{"$f":"IF(SUM(BN46:BN49)=0,\"\",SUM(BN46:BN49))","v":""},"Nbr de jour","=",{"$f":"IF(SUM(BQ46:BQ49)=0,\"\",SUM(BQ46:BQ49))","v":""},"Nbr de jour","=",{"$f":"IF(SUM(BT46:BT49)=0,\"\",SUM(BT46:BT49))","v":""},"Nbr de jour","=",{"$f":"IF(SUM(BW46:BW49)=0,\"\",SUM(BW46:BW49))","v":""},"Nbr de jour","=",{"$f":"IF(SUM(BZ46:BZ49)=0,\"\",SUM(BZ46:BZ49))","v":""},"Nbr de jour","=",{"$f":"IF(SUM(CC46:CC49)=0,\"\",SUM(CC46:CC49))","v":""},"Nbr de jour","=",{"$f":"IF(SUM(CF46:CF49)=0,\"\",SUM(CF46:CF49))","v":""},"Nbr de jour","=",{"$f":"IF(SUM(CI46:CI49)=0,\"\",SUM(CI46:CI49))","v":""},"Nbr de jour","=",{"$f":"IF(SUM(CL46:CL49)=0,\"\",SUM(CL46:CL49))","v":""},"Nbr de jour","=",{"$f":"IF(SUM(CO46:CO49)=0,\"\",SUM(CO46:CO49))","v":""},"Nbr de jour","=",{"$f":"IF(SUM(CR46:CR49)=0,\"\",SUM(CR46:CR49))","v":""},"Nbr de jour","=",{"$f":"IF(SUM(CU46:CU49)=0,\"\",SUM(CU46:CU49))","v":""},"Nbr de jour","=",{"$f":"IF(SUM(CX46:CX49)=0,\"\",SUM(CX46:CX49))","v":""},"Nbr de jour","=",{"$f":"IF(SUM(DA46:DA49)=0,\"\",SUM(DA46:DA49))","v":""},"Nbr de jour","=",{"$f":"IF(SUM(DD46:DD49)=0,\"\",SUM(DD46:DD49))","v":""},"Nbr de jour","=",{"$f":"IF(SUM(DG46:DG49)=0,\"\",SUM(DG46:DG49))","v":""},"Nbr de jour","=",{"$f":"IF(SUM(DJ46:DJ49)=0,\"\",SUM(DJ46:DJ49))","v":""},"Nbr de jour","=",{"$f":"IF(SUM(DM46:DM49)=0,\"\",SUM(DM46:DM49))","v":""},"Nbr de jour","=",{"$f":"IF(SUM(DP46:DP49)=0,\"\",SUM(DP46:DP49))","v":""},"Nbr de jour","=",{"$f":"IF(SUM(DS46:DS49)=0,\"\",SUM(DS46:DS49))","v":""},"Nbr de jour","=",{"$f":"IF(SUM(DV46:DV49)=0,\"\",SUM(DV46:DV49))","v":""},"Nbr de jour","=",{"$f":"IF(SUM(DY46:DY49)=0,\"\",SUM(DY46:DY49))","v":""},"Nbr de jour","=",{"$f":"IF(SUM(EB46:EB49)=0,\"\",SUM(EB46:EB49))","v":""}]
[null,null,null,{"$f":"IF(D53=\"\",\"\",D53)","v":""},"","","P4","","","","","",""]
[null,null,null,{"$f":"IF(D53=\"\",\"\",D53)","v":""},"","","P4","","","","","",""]
["Numéro 06","Nom affaire","EXE",null,null,null,"P4"]
[null,null,null,{"$f":"IF(D53=\"\",\"\",D53)","v":""},"","","P4","","","","","",""]
[null,"Temps passé en jour =",null,{"$f":"IF(D53=\"\",\"\",D53)","v":""},"","","P4","","","","","","","Nbr de jour","=",{"$f":"IF(SUM(O51:O54)=0,\"\",SUM(O51:O54))","v":""},"Nbr de jour","=",{"$f":"IF(SUM(R51:R54)=0,\"\",SUM(R51:R54))","v":""},"Nbr de jour","=",{"$f":"IF(SUM(U51:U54)=0,\"\",SUM(U51:U54))","v":""},"Nbr de jour","=",{"$f":"IF(SUM(X51:X54)=0,\"\",SUM(X51:X54))","v":""},"Nbr de jour","=",{"$f":"IF(SUM(AA51:AA54)=0,\"\",SUM(AA51:AA54))","v":""},"Nbr de jour","=",{"$f":"IF(SUM(AD51:AD54)=0,\"\",SUM(AD51:AD54))","v":""},"Nbr de jour","=",{"$f":"IF(SUM(AG51:AG54)=0,\"\",SUM(AG51:AG54))","v":""},"Nbr de jour","=",{"$f":"IF(SUM(AJ51:AJ54)=0,\"\",SUM(AJ51:AJ54))","v":""},"Nbr de jour","=",{"$f":"IF(SUM(AM51:AM54)=0,\"\",SUM(AM51:AM54))","v":""},"Nbr de jour","=",{"$f":"IF(SUM(AP51:AP54)=0,\"\",SUM(AP51:AP54))","v":""},"Nbr de jour","=",{"$f":"IF(SUM(AS51:AS54)=0,\"\",SUM(AS51:AS54))","v":""},"Nbr de jour","=",{"$f":"IF(SUM(AV51:AV54)=0,\"\",SUM(AV51:AV54))","v":""},"Nbr de jour","=",{"$f":"IF(SUM(AY51:AY54)=0,\"\",SUM(AY51:AY54))","v":""},"Nbr de jour","=",{"$f":"IF(SUM(BB51:BB54)=0,\"\",SUM(BB51:BB54))","v":""},"Nbr de jour","=",{"$f":"IF(SUM(BE51:BE54)=0,\"\",SUM(BE51:BE54))","v":""},"Nbr de jour","=",{"$f":"IF(SUM(BH51:BH54)=0,\"\",SUM(BH51:BH54))","v":""},"Nbr de jour","=",{"$f":"IF(SUM(BK51:BK54)=0,\"\",SUM(BK51:BK54))","v":""},"Nbr de jour","=",{"$f":"IF(SUM(BN51:BN54)=0,\"\",SUM(BN51:BN54))","v":""},"Nbr de jour","=",{"$f":"IF(SUM(BQ51:BQ54)=0,\"\",SUM(BQ51:BQ54))","v":""},"Nbr de jour","=",{"$f":"IF(SUM(BT51:BT54)=0,\"\",SUM(BT51:BT54))","v":""},"Nbr de jour","=",{"$f":"IF(SUM(BW51:BW54)=0,\"\",SUM(BW51:BW54))","v":""},"Nbr de jour","=",{"$f":"IF(SUM(BZ51:BZ54)=0,\"\",SUM(BZ51:BZ54))","v":""},"Nbr de jour","=",{"$f":"IF(SUM(CC51:CC54)=0,\"\",SUM(CC51:CC54))","v":""},"Nbr de jour","=",{"$f":"IF(SUM(CF51:CF54)=0,\"\",SUM(CF51:CF54))","v":""},"Nbr de jour","=",{"$f":"IF(SUM(CI51:CI54)=0,\"\",SUM(CI51:CI54))","v":""},"Nbr de jour","=",{"$f":"IF(SUM(CL51:CL54)=0,\"\",SUM(CL51:CL54))","v":""},"Nbr de jour","=",{"$f":"IF(SUM(CO51:CO54)=0,\"\",SUM(CO51:CO54))","v":""},"Nbr de jour","=",{"$f":"IF(SUM(CR51:CR54)=0,\"\",SUM(CR51:CR54))","v":""},"Nbr de jour","=",{"$f":"IF(SUM(CU51:CU54)=0,\"\",SUM(CU51:CU54))","v":""},"Nbr de jour","=",{"$f":"IF(SUM(CX51:CX54)=0,\"\",SUM(CX51:CX54))","v":""},"Nbr de jour","=",{"$f":"IF(SUM(DA51:DA54)=0,\"\",SUM(DA51:DA54))","v":""},"Nbr de jour","=",{"$f":"IF(SUM(DD51:DD54)=0,\"\",SUM(DD51:DD54))","v":""},"Nbr de jour","=",{"$f":"IF(SUM(DG51:DG54)=0,\"\",SUM(DG51:DG54))","v":""},"Nbr de jour","=",{"$f":"IF(SUM(DJ51:DJ54)=0,\"\",SUM(DJ51:DJ54))","v":""},"Nbr de jour","=",{"$f":"IF(SUM(DM51:DM54)=0,\"\",SUM(DM51:DM54))","v":""},"Nbr de jour","=",{"$f":"IF(SUM(DP51:DP54)=0,\"\",SUM(DP51:DP54))","v":""},"Nbr de jour","=",{"$f":"IF(SUM(DS51:DS54)=0,\"\",SUM(DS51:DS54))","v":""},"Nbr de jour","=",{"$f":"IF(SUM(DV51:DV54)=0,\"\",SUM(DV51:DV54))","v":""},"Nbr de jour","=",{"$f":"IF(SUM(DY51:DY54)=0,\"\",SUM(DY51:DY54))","v":""},"Nbr de jour","=",{"$f":"IF(SUM(EB51:EB54)=0,\"\",SUM(EB51:EB54))","v":""}]
[null,null,null,{"$f":"IF(D58=\"\",\"\",D58)","v":""},"","","","","","P7","","",""]
[null,null,null,{"$f":"IF(D58=\"\",\"\",D58)","v":""},"","","","","","P7","","",""]
["Numéro 07","Nom affaire","EXE",null,null,null,null,null,null,"P7"]
[null,null,null,{"$f":"IF(D58=\"\",\"\",D58)","v":""},"","","","","","P7","","",""]
[null,"Temps passé en jour =",null,{"$f":"IF(D58=\"\",\"\",D58)","v":""},"","","","","","P7","","","","Nbr de jour","=",{"$f":"IF(SUM(O56:O59)=0,\"\",SUM(O56:O59))","v":""},"Nbr de jour","=",{"$f":"IF(SUM(R56:R59)=0,\"\",SUM(R56:R59))","v":""},"Nbr de jour","=",{"$f":"IF(SUM(U56:U59)=0,\"\",SUM(U56:U59))","v":""},"Nbr de jour","=",{"$f":"IF(SUM(X56:X59)=0,\"\",SUM(X56:X59))","v":""},"Nbr de jour","=",{"$f":"IF(SUM(AA56:AA59)=0,\"\",SUM(AA56:AA59))","v":""},"Nbr de jour","=",{"$f":"IF(SUM(AD56:AD59)=0,\"\",SUM(AD56:AD59))","v":""},"Nbr de jour","=",{"$f":"IF(SUM(AG56:AG59)=0,\"\",SUM(AG56:AG59))","v":""},"Nbr de jour","=",{"$f":"IF(SUM(AJ56:AJ59)=0,\"\",SUM(AJ56:AJ59))","v":""},"Nbr de jour","=",{"$f":"IF(SUM(AM56:AM59)=0,\"\",SUM(AM56:AM59))","v":""},"Nbr de jour","=",{"$f":"IF(SUM(AP56:AP59)=0,\"\",SUM(AP56:AP59))","v":""},"Nbr de jour","=",{"$f":"IF(SUM(AS56:AS59)=0,\"\",SUM(AS56:AS59))","v":""},"Nbr de jour","=",{"$f":"IF(SUM(AV56:AV59)=0,\"\",SUM(AV56:AV59))","v":""},"Nbr de jour","=",{"$f":"IF(SUM(AY56:AY59)=0,\"\",SUM(AY56:AY59))","v":""},"Nbr de jour","=",{"$f":"IF(SUM(BB56:BB59)=0,\"\",SUM(BB56:BB59))","v":""},"Nbr de jour","=",{"$f":"IF(SUM(BE56:BE59)=0,\"\",SUM(BE56:BE59))","v":""},"Nbr de jour","=",{"$f":"IF(SUM(BH56:BH59)=0,\"\",SUM(BH56:BH59))","v":""},"Nbr de jour","=",{"$f":"IF(SUM(BK56:BK59)=0,\"\",SUM(BK56:BK59))","v":""},"Nbr de jour","=",{"$f":"IF(SUM(BN56:BN59)=0,\"\",SUM(BN56:BN59))","v":""},"Nbr de jour","=",{"$f":"IF(SUM(BQ56:BQ59)=0,\"\",SUM(BQ56:BQ59))","v":""},"Nbr de jour","=",{"$f":"IF(SUM(BT56:BT59)=0,\"\",SUM(BT56:BT59))","v":""},"Nbr de jour","=",{"$f":"IF(SUM(BW56:BW59)=0,\"\",SUM(BW56:BW59))","v":""},"Nbr de jour","=",{"$f":"IF(SUM(BZ56:BZ59)=0,\"\",SUM(BZ56:BZ59))","v":""},"Nbr de jour","=",{"$f":"IF(SUM(CC56:CC59)=0,\"\",SUM(CC56:CC59))","v":""},"Nbr de jour","=",{"$f":"IF(SUM(CF56:CF59)=0,\"\",SUM(CF56:CF59))","v":""},"Nbr de jour","=",{"$f":"IF(SUM(CI56:CI59)=0,\"\",SUM(CI56:CI59))","v":""},"Nbr de jour","=",{"$f":"IF(SUM(CL56:CL59)=0,\"\",SUM(CL56:CL59))","v":""},"Nbr de jour","=",{"$f":"IF(SUM(CO56:CO59)=0,\"\",SUM(CO56:CO59))","v":""},"Nbr de jour","=",{"$f":"IF(SUM(CR56:CR59)=0,\"\",SUM(CR56:CR59))","v":""},"Nbr de jour","=",{"$f":"IF(SUM(CU56:CU59)=0,\"\",SUM(CU56:CU59))","v":""},"Nbr de jour","=",{"$f":"IF(SUM(CX56:CX59)=0,\"\",SUM(CX56:CX59))","v":""},"Nbr de jour","=",{"$f":"IF(SUM(DA56:DA59)=0,\"\",SUM(DA56:DA59))","v":""},"Nbr de jour","=",{"$f":"IF(SUM(DD56:DD59)=0,\"\",SUM(DD56:DD59))","v":""},"Nbr de jour","=",{"$f":"IF(SUM(DG56:DG59)=0,\"\",SUM(DG56:DG59))","v":""},"Nbr de jour","=",{"$f":"IF(SUM(DJ56:DJ59)=0,\"\",SUM(DJ56:DJ59))","v":""},"Nbr de jour","=",{"$f":"IF(SUM(DM56:DM59)=0,\"\",SUM(DM56:DM59))","v":""},"Nbr de jour","=",{"$f":"IF(SUM(DP56:DP59)=0,\"\",SUM(DP56:DP59))","v":""},"Nbr de jour","=",{"$f":"IF(SUM(DS56:DS59)=0,\"\",SUM(DS56:DS59))","v":""},"Nbr de jour","=",{"$f":"IF(SUM(DV56:DV59)=0,\"\",SUM(DV56:DV59))","v":""},"Nbr de jour","=",{"$f":"IF(SUM(DY56:DY59)=0,\"\",SUM(DY56:DY59))","v":""},"Nbr de jour","=",{"$f":"IF(SUM(EB56:EB59)=0,\"\",SUM(EB56:EB59))","v":""}]
[null,null,null,{"$f":"IF(D63=\"\",\"\",D63)","v":"P1"},"","","","","","","","",""]
[null,null,null,{"$f":"IF(D63=\"\",\"\",D63)","v":"P1"},"","","","","","","","",""]
["Numéro 08","Nom affaire","EXE","P1"]
[null,null,null,{"$f":"IF(D63=\"\",\"\",D63)","v":"P1"},"","","","","","","","",""]
[null,"Temps passé en jour =",null,{"$f":"IF(D63=\"\",\"\",D63)","v":"P1"},"","","","","","","","","","Nbr de jour","=",{"$f":"IF(SUM(O61:O64)=0,\"\",SUM(O61:O64))","v":""},"Nbr de jour","=",{"$f":"IF(SUM(R61:R64)=0,\"\",SUM(R61:R64))","v":""},"Nbr de jour","=",{"$f":"IF(SUM(U61:U64)=0,\"\",SUM(U61:U64))","v":""},"Nbr de jour","=",{"$f":"IF(SUM(X61:X64)=0,\"\",SUM(X61:X64))","v":""},"Nbr de jour","=",{"$f":"IF(SUM(AA61:AA64)=0,\"\",SUM(AA61:AA64))","v":""},"Nbr de jour","=",{"$f":"IF(SUM(AD61:AD64)=0,\"\",SUM(AD61:AD64))","v":""},"Nbr de jour","=",{"$f":"IF(SUM(AG61:AG64)=0,\"\",SUM(AG61:AG64))","v":""},"Nbr de jour","=",{"$f":"IF(SUM(AJ61:AJ64)=0,\"\",SUM(AJ61:AJ64))","v":""},"Nbr de jour","=",{"$f":"IF(SUM(AM61:AM64)=0,\"\",SUM(AM61:AM64))","v":""},"Nbr de jour","=",{"$f":"IF(SUM(AP61:AP64)=0,\"\",SUM(AP61:AP64))","v":""},"Nbr de jour","=",{"$f":"IF(SUM(AS61:AS64)=0,\"\",SUM(AS61:AS64))","v":""},"Nbr de jour","=",{"$f":"IF(SUM(AV61:AV64)=0,\"\",SUM(AV61:AV64))","v":""},"Nbr de jour","=",{"$f":"IF(SUM(AY61:AY64)=0,\"\",SUM(AY61:AY64))","v":""},"Nbr de jour","=",{"$f":"IF(SUM(BB61:BB64)=0,\"\",SUM(BB61:BB64))","v":""},"Nbr de jour","=",{"$f":"IF(SUM(BE61:BE64)=0,\"\",SUM(BE61:BE64))","v":""},"Nbr de jour","=",{"$f":"IF(SUM(BH61:BH64)=0,\"\",SUM(BH61:BH64))","v":""},"Nbr de jour","=",{"$f":"IF(SUM(BK61:BK64)=0,\"\",SUM(BK61:BK64))","v":""},"Nbr de jour","=",{"$f":"IF(SUM(BN61:BN64)=0,\"\",SUM(BN61:BN64))","v":""},"Nbr de jour","=",{"$f":"IF(SUM(BQ61:BQ64)=0,\"\",SUM(BQ61:BQ64))","v":""},"Nbr de jour","=",{"$f":"IF(SUM(BT61:BT64)=0,\"\",SUM(BT61:BT64))","v":""},"Nbr de jour","=",{"$f":"IF(SUM(BW61:BW64)=0,\"\",SUM(BW61:BW64))","v":""},"Nbr de jour","=",{"$f":"IF(SUM(BZ61:BZ64)=0,\"\",SUM(BZ61:BZ64))","v":""},"Nbr de jour","=",{"$f":"IF(SUM(CC61:CC64)=0,\"\",SUM(CC61:CC64))","v":""},"Nbr de jour","=",{"$f":"IF(SUM(CF61:CF64)=0,\"\",SUM(CF61:CF64))","v":""},"Nbr de jour","=",{"$f":"IF(SUM(CI61:CI64)=0,\"\",SUM(CI61:CI64))","v":""},"Nbr de jour","=",{"$f":"IF(SUM(CL61:CL64)=0,\"\",SUM(CL61:CL64))","v":""},"Nbr de jour","=",{"$f":"IF(SUM(CO61:CO64)=0,\"\",SUM(CO61:CO64))","v":""},"Nbr de jour","=",{"$f":"IF(SUM(CR61:CR64)=0,\"\",SUM(CR61:CR64))","v":""},"Nbr de jour","=",{"$f":"IF(SUM(CU61:CU64)=0,\"\",SUM(CU61:CU64))","v":""},"Nbr de jour","=",{"$f":"IF(SUM(CX61:CX64)=0,\"\",SUM(CX61:CX64))","v":""},"Nbr de jour","=",{"$f":"IF(SUM(DA61:DA64)=0,\"\",SUM(DA61:DA64))","v":""},"Nbr de jour","=",{"$f":"IF(SUM(DD61:DD64)=0,\"\",SUM(DD61:DD64))","v":""},"Nbr de jour","=",{"$f":"IF(SUM(DG61:DG64)=0,\"\",SUM(DG61:DG64))","v":""},"Nbr de jour","=",{"$f":"IF(SUM(DJ61:DJ64)=0,\"\",SUM(DJ61:DJ64))","v":""},"Nbr de jour","=",{"$f":"IF(SUM(DM61:DM64)=0,\"\",SUM(DM61:DM64))","v":""},"Nbr de jour","=",{"$f":"IF(SUM(DP61:DP64)=0,\"\",SUM(DP61:DP64))","v":""},"Nbr de jour","=",{"$f":"IF(SUM(DS61:DS64)=0,\"\",SUM(DS61:DS64))","v":""},"Nbr de jour","=",{"$f":"IF(SUM(DV61:DV64)=0,\"\",SUM(DV61:DV64))","v":""},"Nbr de jour","=",{"$f":"IF(SUM(DY61:DY64)=0,\"\",SUM(DY61:DY64))","v":""},"Nbr de jour","=",{"$f":"IF(SUM(EB61:EB64)=0,\"\",SUM(EB61:EB64))","v":""}]
[null,null,null,{"$f":"IF(D68=\"\",\"\",D68)","v":""},"","P3","","","","","","",""]
[null,null,null,{"$f":"IF(D68=\"\",\"\",D68)","v":""},"","P3","","","","","","",""]
["Numéro 09","Nom affaire","DCE",null,null,"P3"]
[null,null,null,{"$f":"IF(D68=\"\",\"\",D68)","v":""},"","P3","","","","","","",""]
[null,"Temps passé en jour =",null,{"$f":"IF(D68=\"\",\"\",D68)","v":""},"","P3","","","","","","","","Nbr de jour","=",{"$f":"IF(SUM(O66:O69)=0,\"\",SUM(O66:O69))","v":""},"Nbr de jour","=",{"$f":"IF(SUM(R66:R69)=0,\"\",SUM(R66:R69))","v":""},"Nbr de jour","=",{"$f":"IF(SUM(U66:U69)=0,\"\",SUM(U66:U69))","v":""},"Nbr de jour","=",{"$f":"IF(SUM(X66:X69)=0,\"\",SUM(X66:X69))","v":""},"Nbr de jour","=",{"$f":"IF(SUM(AA66:AA69)=0,\"\",SUM(AA66:AA69))","v":""},"Nbr de jour","=",{"$f":"IF(SUM(AD66:AD69)=0,\"\",SUM(AD66:AD69))","v":""},"Nbr de jour","=",{"$f":"IF(SUM(AG66:AG69)=0,\"\",SUM(AG66:AG69))","v":""},"Nbr de jour","=",{"$f":"IF(SUM(AJ66:AJ69)=0,\"\",SUM(AJ66:AJ69))","v":""},"Nbr de jour","=",{"$f":"IF(SUM(AM66:AM69)=0,\"\",SUM(AM66:AM69))","v":""},"Nbr de jour","=",{"$f":"IF(SUM(AP66:AP69)=0,\"\",SUM(AP66:AP69))","v":""},"Nbr de jour","=",{"$f":"IF(SUM(AS66:AS69)=0,\"\",SUM(AS66:AS69))","v":""},"Nbr de jour","=",{"$f":"IF(SUM(AV66:AV69)=0,\"\",SUM(AV66:AV69))","v":""},"Nbr de jour","=",{"$f":"IF(SUM(AY66:AY69)=0,\"\",SUM(AY66:AY69))","v":""},"Nbr de jour","=",{"$f":"IF(SUM(BB66:BB69)=0,\"\",SUM(BB66:BB69))","v":""},"Nbr de jour","=",{"$f":"IF(SUM(BE66:BE69)=0,\"\",SUM(BE66:BE69))","v":""},"Nbr de jour","=",{"$f":"IF(SUM(BH66:BH69)=0,\"\",SUM(BH66:BH69))","v":""},"Nbr de jour","=",{"$f":"IF(SUM(BK66:BK69)=0,\"\",SUM(BK66:BK69))","v":""},"Nbr de jour","=",{"$f":"IF(SUM(BN66:BN69)=0,\"\",SUM(BN66:BN69))","v":""},"Nbr de jour","=",{"$f":"IF(SUM(BQ66:BQ69)=0,\"\",SUM(BQ66:BQ69))","v":""},"Nbr de jour","=",{"$f":"IF(SUM(BT66:BT69)=0,\"\",SUM(BT66:BT69))","v":""},"Nbr de jour","=",{"$f":"IF(SUM(BW66:BW69)=0,\"\",SUM(BW66:BW69))","v":""},"Nbr de jour","=",{"$f":"IF(SUM(BZ66:BZ69)=0,\"\",SUM(BZ66:BZ69))","v":""},"Nbr de jour","=",{"$f":"IF(SUM(CC66:CC69)=0,\"\",SUM(CC66:CC69))","v":""},"Nbr de jour","=",{"$f":"IF(SUM(CF66:CF69)=0,\"\",SUM(CF66:CF69))","v":""},"Nbr de jour","=",{"$f":"IF(SUM(CI66:CI69)=0,\"\",SUM(CI66:CI69))","v":""},"Nbr de jour","=",{"$f":"IF(SUM(CL66:CL69)=0,\"\",SUM(CL66:CL69))","v":""},"Nbr de jour","=",{"$f":"IF(SUM(CO66:CO69)=0,\"\",SUM(CO66:CO69))","v":""},"Nbr de jour","=",{"$f":"IF(SUM(CR66:CR69)=0,\"\",SUM(CR66:CR69))","v":""},"Nbr de jour","=",{"$f":"IF(SUM(CU66:CU69)=0,\"\",SUM(CU66:CU69))","v":""},"Nbr de jour","=",{"$f":"IF(SUM(CX66:CX69)=0,\"\",SUM(CX66:CX69))","v":""},"Nbr de jour","=",{"$f":"IF(SUM(DA66:DA69)=0,\"\",SUM(DA66:DA69))","v":""},"Nbr de jour","=",{"$f":"IF(SUM(DD66:DD69)=0,\"\",SUM(DD66:DD69))","v":""},"Nbr de jour","=",{"$f":"IF(SUM(DG66:DG69)=0,\"\",SUM(DG66:DG69))","v":""},"Nbr de jour","=",{"$f":"IF(SUM(DJ66:DJ69)=0,\"\",SUM(DJ66:DJ69))","v":""},"Nbr de jour","=",{"$f":"IF(SUM(DM66:DM69)=0,\"\",SUM(DM66:DM69))","v":""},"Nbr de jour","=",{"$f":"IF(SUM(DP66:DP69)=0,\"\",SUM(DP66:DP69))","v":""},"Nbr de jour","=",{"$f":"IF(SUM(DS66:DS69)=0,\"\",SUM(DS66:DS69))","v":""},"Nbr de jour","=",{"$f":"IF(SUM(DV66:DV69)=0,\"\",SUM(DV66:DV69))","v":""},"Nbr de jour","=",{"$f":"IF(SUM(DY66:DY69)=0,\"\",SUM(DY66:DY69))","v":""},"Nbr de jour","=",{"$f":"IF(SUM(EB66:EB69)=0,\"\",SUM(EB66:EB69))","v":""}]
[null,null,null,{"$f":"IF(D73=\"\",\"\",D73)","v":""},"","P3","","","","","","",""]
[null,null,null,{"$f":"IF(D73=\"\",\"\",D73)","v":""},"","P3","","","","","","",""]
["Numéro 10","Nom affaire","DCE",null,null,"P3"]
[null,null,null,{"$f":"IF(D73=\"\",\"\",D73)","v":""},"","P3","","","","","","",""]
[null,"Temps passé en jour =",null,{"$f":"IF(D73=\"\",\"\",D73)","v":""},"","P3","","","","","","","","Nbr de jour","=",{"$f":"IF(SUM(O71:O74)=0,\"\",SUM(O71:O74))","v":""},"Nbr de jour","=",{"$f":"IF(SUM(R71:R74)=0,\"\",SUM(R71:R74))","v":""},"Nbr de jour","=",{"$f":"IF(SUM(U71:U74)=0,\"\",SUM(U71:U74))","v":""},"Nbr de jour","=",{"$f":"IF(SUM(X71:X74)=0,\"\",SUM(X71:X74))","v":""},"Nbr de jour","=",{"$f":"IF(SUM(AA71:AA74)=0,\"\",SUM(AA71:AA74))","v":""},"Nbr de jour","=",{"$f":"IF(SUM(AD71:AD74)=0,\"\",SUM(AD71:AD74))","v":""},"Nbr de jour","=",{"$f":"IF(SUM(AG71:AG74)=0,\"\",SUM(AG71:AG74))","v":""},"Nbr de jour","=",{"$f":"IF(SUM(AJ71:AJ74)=0,\"\",SUM(AJ71:AJ74))","v":""},"Nbr de jour","=",{"$f":"IF(SUM(AM71:AM74)=0,\"\",SUM(AM71:AM74))","v":""},"Nbr de jour","=",{"$f":"IF(SUM(AP71:AP74)=0,\"\",SUM(AP71:AP74))","v":""},"Nbr de jour","=",{"$f":"IF(SUM(AS71:AS74)=0,\"\",SUM(AS71:AS74))","v":""},"Nbr de jour","=",{"$f":"IF(SUM(AV71:AV74)=0,\"\",SUM(AV71:AV74))","v":""},"Nbr de jour","=",{"$f":"IF(SUM(AY71:AY74)=0,\"\",SUM(AY71:AY74))","v":""},"Nbr de jour","=",{"$f":"IF(SUM(BB71:BB74)=0,\"\",SUM(BB71:BB74))","v":""},"Nbr de jour","=",{"$f":"IF(SUM(BE71:BE74)=0,\"\",SUM(BE71:BE74))","v":""},"Nbr de jour","=",{"$f":"IF(SUM(BH71:BH74)=0,\"\",SUM(BH71:BH74))","v":""},"Nbr de jour","=",{"$f":"IF(SUM(BK71:BK74)=0,\"\",SUM(BK71:BK74))","v":""},"Nbr de jour","=",{"$f":"IF(SUM(BN71:BN74)=0,\"\",SUM(BN71:BN74))","v":""},"Nbr de jour","=",{"$f":"IF(SUM(BQ71:BQ74)=0,\"\",SUM(BQ71:BQ74))","v":""},"Nbr de jour","=",{"$f":"IF(SUM(BT71:BT74)=0,\"\",SUM(BT71:BT74))","v":""},"Nbr de jour","=",{"$f":"IF(SUM(BW71:BW74)=0,\"\",SUM(BW71:BW74))","v":""},"Nbr de jour","=",{"$f":"IF(SUM(BZ71:BZ74)=0,\"\",SUM(BZ71:BZ74))","v":""},"Nbr de jour","=",{"$f":"IF(SUM(CC71:CC74)=0,\"\",SUM(CC71:CC74))","v":""},"Nbr de jour","=",{"$f":"IF(SUM(CF71:CF74)=0,\"\",SUM(CF71:CF74))","v":""},"Nbr de jour","=",{"$f":"IF(SUM(CI71:CI74)=0,\"\",SUM(CI71:CI74))","v":""},"Nbr de jour","=",{"$f":"IF(SUM(CL71:CL74)=0,\"\",SUM(CL71:CL74))","v":""},"Nbr de jour","=",{"$f":"IF(SUM(CO71:CO74)=0,\"\",SUM(CO71:CO74))","v":""},"Nbr de jour","=",{"$f":"IF(SUM(CR71:CR74)=0,\"\",SUM(CR71:CR74))","v":""},"Nbr de jour","=",{"$f":"IF(SUM(CU71:CU74)=0,\"\",SUM(CU71:CU74))","v":""},"Nbr de jour","=",{"$f":"IF(SUM(CX71:CX74)=0,\"\",SUM(CX71:CX74))","v":""},"Nbr de jour","=",{"$f":"IF(SUM(DA71:DA74)=0,\"\",SUM(DA71:DA74))","v":""},"Nbr de jour","=",{"$f":"IF(SUM(DD71:DD74)=0,\"\",SUM(DD71:DD74))","v":""},"Nbr de jour","=",{"$f":"IF(SUM(DG71:DG74)=0,\"\",SUM(DG71:DG74))","v":""},"Nbr de jour","=",{"$f":"IF(SUM(DJ71:DJ74)=0,\"\",SUM(DJ71:DJ74))","v":""},"Nbr de jour","=",{"$f":"IF(SUM(DM71:DM74)=0,\"\",SUM(DM71:DM74))","v":""},"Nbr de jour","=",{"$f":"IF(SUM(DP71:DP74)=0,\"\",SUM(DP71:DP74))","v":""},"Nbr de jour","=",{"$f":"IF(SUM(DS71:DS74)=0,\"\",SUM(DS71:DS74))","v":""},"Nbr de jour","=",{"$f":"IF(SUM(DV71:DV74)=0,\"\",SUM(DV71:DV74))","v":""},"Nbr de jour","=",{"$f":"IF(SUM(DY71:DY74)=0,\"\",SUM(DY71:DY74))","v":""},"Nbr de jour","=",{"$f":"IF(SUM(EB71:EB74)=0,\"\",SUM(EB71:EB74))","v":""}]
[null,null,null,{"$f":"IF(D78=\"\",\"\",D78)","v":""},"","P3","","","","","","",""]
[null,null,null,{"$f":"IF(D78=\"\",\"\",D78)","v":""},"","P3","","","","","","",""]
["Numéro 11","Nom affaire","EXE",null,null,"P3"]
[null,null,null,{"$f":"IF(D78=\"\",\"\",D78)","v":""},"","P3","","","","","","",""]
[null,"Temps passé en jour =",null,{"$f":"IF(D78=\"\",\"\",D78)","v":""},"","P3","","","","","","","","Nbr de jour","=",{"$f":"IF(SUM(O76:O79)=0,\"\",SUM(O76:O79))","v":""},"Nbr de jour","=",{"$f":"IF(SUM(R76:R79)=0,\"\",SUM(R76:R79))","v":""},"Nbr de jour","=",{"$f":"IF(SUM(U76:U79)=0,\"\",SUM(U76:U79))","v":""},"Nbr de jour","=",{"$f":"IF(SUM(X76:X79)=0,\"\",SUM(X76:X79))","v":""},"Nbr de jour","=",{"$f":"IF(SUM(AA76:AA79)=0,\"\",SUM(AA76:AA79))","v":""},"Nbr de jour","=",{"$f":"IF(SUM(AD76:AD79)=0,\"\",SUM(AD76:AD79))","v":""},"Nbr de jour","=",{"$f":"IF(SUM(AG76:AG79)=0,\"\",SUM(AG76:AG79))","v":""},"Nbr de jour","=",{"$f":"IF(SUM(AJ76:AJ79)=0,\"\",SUM(AJ76:AJ79))","v":""},"Nbr de jour","=",{"$f":"IF(SUM(AM76:AM79)=0,\"\",SUM(AM76:AM79))","v":""},"Nbr de jour","=",{"$f":"IF(SUM(AP76:AP79)=0,\"\",SUM(AP76:AP79))","v":""},"Nbr de jour","=",{"$f":"IF(SUM(AS76:AS79)=0,\"\",SUM(AS76:AS79))","v":""},"Nbr de jour","=",{"$f":"IF(SUM(AV76:AV79)=0,\"\",SUM(AV76:AV79))","v":""},"Nbr de jour","=",{"$f":"IF(SUM(AY76:AY79)=0,\"\",SUM(AY76:AY79))","v":""},"Nbr de jour","=",{"$f":"IF(SUM(BB76:BB79)=0,\"\",SUM(BB76:BB79))","v":""},"Nbr de jour","=",{"$f":"IF(SUM(BE76:BE79)=0,\"\",SUM(BE76:BE79))","v":""},"Nbr de jour","=",{"$f":"IF(SUM(BH76:BH79)=0,\"\",SUM(BH76:BH79))","v":""},"Nbr de jour","=",{"$f":"IF(SUM(BK76:BK79)=0,\"\",SUM(BK76:BK79))","v":""},"Nbr de jour","=",{"$f":"IF(SUM(BN76:BN79)=0,\"\",SUM(BN76:BN79))","v":""},"Nbr de jour","=",{"$f":"IF(SUM(BQ76:BQ79)=0,\"\",SUM(BQ76:BQ79))","v":""},"Nbr de jour","=",{"$f":"IF(SUM(BT76:BT79)=0,\"\",SUM(BT76:BT79))","v":""},"Nbr de jour","=",{"$f":"IF(SUM(BW76:BW79)=0,\"\",SUM(BW76:BW79))","v":""},"Nbr de jour","=",{"$f":"IF(SUM(BZ76:BZ79)=0,\"\",SUM(BZ76:BZ79))","v":""},"Nbr de jour","=",{"$f":"IF(SUM(CC76:CC79)=0,\"\",SUM(CC76:CC79))","v":""},"Nbr de jour","=",{"$f":"IF(SUM(CF76:CF79)=0,\"\",SUM(CF76:CF79))","v":""},"Nbr de jour","=",{"$f":"IF(SUM(CI76:CI79)=0,\"\",SUM(CI76:CI79))","v":""},"Nbr de jour","=",{"$f":"IF(SUM(CL76:CL79)=0,\"\",SUM(CL76:CL79))","v":""},"Nbr de jour","=",{"$f":"IF(SUM(CO76:CO79)=0,\"\",SUM(CO76:CO79))","v":""},"Nbr de jour","=",{"$f":"IF(SUM(CR76:CR79)=0,\"\",SUM(CR76:CR79))","v":""},"Nbr de jour","=",{"$f":"IF(SUM(CU76:CU79)=0,\"\",SUM(CU76:CU79))","v":""},"Nbr de jour","=",{"$f":"IF(SUM(CX76:CX79)=0,\"\",SUM(CX76:CX79))","v":""},"Nbr de jour","=",{"$f":"IF(SUM(DA76:DA79)=0,\"\",SUM(DA76:DA79))","v":""},"Nbr de jour","=",{"$f":"IF(SUM(DD76:DD79)=0,\"\",SUM(DD76:DD79))","v":""},"Nbr de jour","=",{"$f":"IF(SUM(DG76:DG79)=0,\"\",SUM(DG76:DG79))","v":""},"Nbr de jour","=",{"$f":"IF(SUM(DJ76:DJ79)=0,\"\",SUM(DJ76:DJ79))","v":""},"Nbr de jour","=",{"$f":"IF(SUM(DM76:DM79)=0,\"\",SUM(DM76:DM79))","v":""},"Nbr de jour","=",{"$f":"IF(SUM(DP76:DP79)=0,\"\",SUM(DP76:DP79))","v":""},"Nbr de jour","=",{"$f":"IF(SUM(DS76:DS79)=0,\"\",SUM(DS76:DS79))","v":""},"Nbr de jour","=",{"$f":"IF(SUM(DV76:DV79)=0,\"\",SUM(DV76:DV79))","v":""},"Nbr de jour","=",{"$f":"IF(SUM(DY76:DY79)=0,\"\",SUM(DY76:DY79))","v":""},"Nbr de jour","=",{"$f":"IF(SUM(EB76:EB79)=0,\"\",SUM(EB76:EB79))","v":""}]
[null,null,null,{"$f":"IF(D83=\"\",\"\",D83)","v":""},"","P3","","","","","","",""]
[null,null,null,{"$f":"IF(D83=\"\",\"\",D83)","v":""},"","P3","","","","","","",""]
["Numéro 12","Nom affaire","EXE",null,null,"P3"]
[null,null,null,{"$f":"IF(D83=\"\",\"\",D83)","v":""},"","P3","","","","","","",""]
[null,"Temps passé en jour =",null,{"$f":"IF(D83=\"\",\"\",D83)","v":""},"","P3","","","","","","","","Nbr de jour","=",{"$f":"IF(SUM(O81:O84)=0,\"\",SUM(O81:O84))","v":""},"Nbr de jour","=",{"$f":"IF(SUM(R81:R84)=0,\"\",SUM(R81:R84))","v":""},"Nbr de jour","=",{"$f":"IF(SUM(U81:U84)=0,\"\",SUM(U81:U84))","v":""},"Nbr de jour","=",{"$f":"IF(SUM(X81:X84)=0,\"\",SUM(X81:X84))","v":""},"Nbr de jour","=",{"$f":"IF(SUM(AA81:AA84)=0,\"\",SUM(AA81:AA84))","v":""},"Nbr de jour","=",{"$f":"IF(SUM(AD81:AD84)=0,\"\",SUM(AD81:AD84))","v":""},"Nbr de jour","=",{"$f":"IF(SUM(AG81:AG84)=0,\"\",SUM(AG81:AG84))","v":""},"Nbr de jour","=",{"$f":"IF(SUM(AJ81:AJ84)=0,\"\",SUM(AJ81:AJ84))","v":""},"Nbr de jour","=",{"$f":"IF(SUM(AM81:AM84)=0,\"\",SUM(AM81:AM84))","v":""},"Nbr de jour","=",{"$f":"IF(SUM(AP81:AP84)=0,\"\",SUM(AP81:AP84))","v":""},"Nbr de jour","=",{"$f":"IF(SUM(AS81:AS84)=0,\"\",SUM(AS81:AS84))","v":""},"Nbr de jour","=",{"$f":"IF(SUM(AV81:AV84)=0,\"\",SUM(AV81:AV84))","v":""},"Nbr de jour","=",{"$f":"IF(SUM(AY81:AY84)=0,\"\",SUM(AY81:AY84))","v":""},"Nbr de jour","=",{"$f":"IF(SUM(BB81:BB84)=0,\"\",SUM(BB81:BB84))","v":""},"Nbr de jour","=",{"$f":"IF(SUM(BE81:BE84)=0,\"\",SUM(BE81:BE84))","v":""},"Nbr de jour","=",{"$f":"IF(SUM(BH81:BH84)=0,\"\",SUM(BH81:BH84))","v":""},"Nbr de jour","=",{"$f":"IF(SUM(BK81:BK84)=0,\"\",SUM(BK81:BK84))","v":""},"Nbr de jour","=",{"$f":"IF(SUM(BN81:BN84)=0,\"\",SUM(BN81:BN84))","v":""},"Nbr de jour","=",{"$f":"IF(SUM(BQ81:BQ84)=0,\"\",SUM(BQ81:BQ84))","v":""},"Nbr de jour","=",{"$f":"IF(SUM(BT81:BT84)=0,\"\",SUM(BT81:BT84))","v":""},"Nbr de jour","=",{"$f":"IF(SUM(BW81:BW84)=0,\"\",SUM(BW81:BW84))","v":""},"Nbr de jour","=",{"$f":"IF(SUM(BZ81:BZ84)=0,\"\",SUM(BZ81:BZ84))","v":""},"Nbr de jour","=",{"$f":"IF(SUM(CC81:CC84)=0,\"\",SUM(CC81:CC84))","v":""},"Nbr de jour","=",{"$f":"IF(SUM(CF81:CF84)=0,\"\",SUM(CF81:CF84))","v":""},"Nbr de jour","=",{"$f":"IF(SUM(CI81:CI84)=0,\"\",SUM(CI81:CI84))","v":""},"Nbr de jour","=",{"$f":"IF(SUM(CL81:CL84)=0,\"\",SUM(CL81:CL84))","v":""},"Nbr de jour","=",{"$f":"IF(SUM(CO81:CO84)=0,\"\",SUM(CO81:CO84))","v":""},"Nbr de jour","=",{"$f":"IF(SUM(CR81:CR84)=0,\"\",SUM(CR81:CR84))","v":""},"Nbr de jour","=",{"$f":"IF(SUM(CU81:CU84)=0,\"\",SUM(CU81:CU84))","v":""},"Nbr de jour","=",{"$f":"IF(SUM(CX81:CX84)=0,\"\",SUM(CX81:CX84))","v":""},"Nbr de jour","=",{"$f":"IF(SUM(DA81:DA84)=0,\"\",SUM(DA81:DA84))","v":""},"Nbr de jour","=",{"$f":"IF(SUM(DD81:DD84)=0,\"\",SUM(DD81:DD84))","v":""},"Nbr de jour","=",{"$f":"IF(SUM(DG81:DG84)=0,\"\",SUM(DG81:DG84))","v":""},"Nbr de jour","=",{"$f":"IF(SUM(DJ81:DJ84)=0,\"\",SUM(DJ81:DJ84))","v":""},"Nbr de jour","=",{"$f":"IF(SUM(DM81:DM84)=0,\"\",SUM(DM81:DM84))","v":""},"Nbr de jour","=",{"$f":"IF(SUM(DP81:DP84)=0,\"\",SUM(DP81:DP84))","v":""},"Nbr de jour","=",{"$f":"IF(SUM(DS81:DS84)=0,\"\",SUM(DS81:DS84))","v":""},"Nbr de jour","=",{"$f":"IF(SUM(DV81:DV84)=0,\"\",SUM(DV81:DV84))","v":""},"Nbr de jour","=",{"$f":"IF(SUM(DY81:DY84)=0,\"\",SUM(DY81:DY84))","v":""},"Nbr de jour","=",{"$f":"IF(SUM(EB81:EB84)=0,\"\",SUM(EB81:EB84))","v":""}]
[null,null,null,{"$f":"IF(D88=\"\",\"\",D88)","v":""},"","P3","","","","","","",""]
[null,null,null,{"$f":"IF(D88=\"\",\"\",D88)","v":""},"","P3","","","","","","",""]
["Numéro 13","Nom affaire","DCE",null,null,"P3"]
[null,null,null,{"$f":"IF(D88=\"\",\"\",D88)","v":""},"","P3","","","","","","",""]
[null,"Temps passé en jour =",null,{"$f":"IF(D88=\"\",\"\",D88)","v":""},"","P3","","","","","","","","Nbr de jour","=",{"$f":"IF(SUM(O86:O89)=0,\"\",SUM(O86:O89))","v":""},"Nbr de jour","=",{"$f":"IF(SUM(R86:R89)=0,\"\",SUM(R86:R89))","v":""},"Nbr de jour","=",{"$f":"IF(SUM(U86:U89)=0,\"\",SUM(U86:U89))","v":""},"Nbr de jour","=",{"$f":"IF(SUM(X86:X89)=0,\"\",SUM(X86:X89))","v":""},"Nbr de jour","=",{"$f":"IF(SUM(AA86:AA89)=0,\"\",SUM(AA86:AA89))","v":""},"Nbr de jour","=",{"$f":"IF(SUM(AD86:AD89)=0,\"\",SUM(AD86:AD89))","v":""},"Nbr de jour","=",{"$f":"IF(SUM(AG86:AG89)=0,\"\",SUM(AG86:AG89))","v":""},"Nbr de jour","=",{"$f":"IF(SUM(AJ86:AJ89)=0,\"\",SUM(AJ86:AJ89))","v":""},"Nbr de jour","=",{"$f":"IF(SUM(AM86:AM89)=0,\"\",SUM(AM86:AM89))","v":""},"Nbr de jour","=",{"$f":"IF(SUM(AP86:AP89)=0,\"\",SUM(AP86:AP89))","v":""},"Nbr de jour","=",{"$f":"IF(SUM(AS86:AS89)=0,\"\",SUM(AS86:AS89))","v":""},"Nbr de jour","=",{"$f":"IF(SUM(AV86:AV89)=0,\"\",SUM(AV86:AV89))","v":""},"Nbr de jour","=",{"$f":"IF(SUM(AY86:AY89)=0,\"\",SUM(AY86:AY89))","v":""},"Nbr de jour","=",{"$f":"IF(SUM(BB86:BB89)=0,\"\",SUM(BB86:BB89))","v":""},"Nbr de jour","=",{"$f":"IF(SUM(BE86:BE89)=0,\"\",SUM(BE86:BE89))","v":""},"Nbr de jour","=",{"$f":"IF(SUM(BH86:BH89)=0,\"\",SUM(BH86:BH89))","v":""},"Nbr de jour","=",{"$f":"IF(SUM(BK86:BK89)=0,\"\",SUM(BK86:BK89))","v":""},"Nbr de jour","=",{"$f":"IF(SUM(BN86:BN89)=0,\"\",SUM(BN86:BN89))","v":""},"Nbr de jour","=",{"$f":"IF(SUM(BQ86:BQ89)=0,\"\",SUM(BQ86:BQ89))","v":""},"Nbr de jour","=",{"$f":"IF(SUM(BT86:BT89)=0,\"\",SUM(BT86:BT89))","v":""},"Nbr de jour","=",{"$f":"IF(SUM(BW86:BW89)=0,\"\",SUM(BW86:BW89))","v":""},"Nbr de jour","=",{"$f":"IF(SUM(BZ86:BZ89)=0,\"\",SUM(BZ86:BZ89))","v":""},"Nbr de jour","=",{"$f":"IF(SUM(CC86:CC89)=0,\"\",SUM(CC86:CC89))","v":""},"Nbr de jour","=",{"$f":"IF(SUM(CF86:CF89)=0,\"\",SUM(CF86:CF89))","v":""},"Nbr de jour","=",{"$f":"IF(SUM(CI86:CI89)=0,\"\",SUM(CI86:CI89))","v":""},"Nbr de jour","=",{"$f":"IF(SUM(CL86:CL89)=0,\"\",SUM(CL86:CL89))","v":""},"Nbr de jour","=",{"$f":"IF(SUM(CO86:CO89)=0,\"\",SUM(CO86:CO89))","v":""},"Nbr de jour","=",{"$f":"IF(SUM(CR86:CR89)=0,\"\",SUM(CR86:CR89))","v":""},"Nbr de jour","=",{"$f":"IF(SUM(CU86:CU89)=0,\"\",SUM(CU86:CU89))","v":""},"Nbr de jour","=",{"$f":"IF(SUM(CX86:CX89)=0,\"\",SUM(CX86:CX89))","v":""},"Nbr de jour","=",{"$f":"IF(SUM(DA86:DA89)=0,\"\",SUM(DA86:DA89))","v":""},"Nbr de jour","=",{"$f":"IF(SUM(DD86:DD89)=0,\"\",SUM(DD86:DD89))","v":""},"Nbr de jour","=",{"$f":"IF(SUM(DG86:DG89)=0,\"\",SUM(DG86:DG89))","v":""},"Nbr de jour","=",{"$f":"IF(SUM(DJ86:DJ89)=0,\"\",SUM(DJ86:DJ89))","v":""},"Nbr de jour","=",{"$f":"IF(SUM(DM86:DM89)=0,\"\",SUM(DM86:DM89))","v":""},"Nbr de jour","=",{"$f":"IF(SUM(DP86:DP89)=0,\"\",SUM(DP86:DP89))","v":""},"Nbr de jour","=",{"$f":"IF(SUM(DS86:DS89)=0,\"\",SUM(DS86:DS89))","v":""},"Nbr de jour","=",{"$f":"IF(SUM(DV86:DV89)=0,\"\",SUM(DV86:DV89))","v":""},"Nbr de jour","=",{"$f":"IF(SUM(DY86:DY89)=0,\"\",SUM(DY86:DY89))","v":""},"Nbr de jour","=",{"$f":"IF(SUM(EB86:EB89)=0,\"\",SUM(EB86:EB89))","v":""}]
[null,null,null,{"$f":"IF(D93=\"\",\"\",D93)","v":""},"","P3","","P5","","","","",""]
[null,null,null,{"$f":"IF(D93=\"\",\"\",D93)","v":""},"","P3","","P5","","","","",""]
["Numéro 14","Nom affaire","DCE",null,null,"P3",null,"P5"]
[null,null,null,{"$f":"IF(D93=\"\",\"\",D93)","v":""},"","P3","","P5","","","","",""]
[null,"Temps passé en jour =",null,{"$f":"IF(D93=\"\",\"\",D93)","v":""},"","P3","","P5","","","","","","Nbr de jour","=",{"$f":"IF(SUM(O91:O94)=0,\"\",SUM(O91:O94))","v":""},"Nbr de jour","=",{"$f":"IF(SUM(R91:R94)=0,\"\",SUM(R91:R94))","v":""},"Nbr de jour","=",{"$f":"IF(SUM(U91:U94)=0,\"\",SUM(U91:U94))","v":""},"Nbr de jour","=",{"$f":"IF(SUM(X91:X94)=0,\"\",SUM(X91:X94))","v":""},"Nbr de jour","=",{"$f":"IF(SUM(AA91:AA94)=0,\"\",SUM(AA91:AA94))","v":""},"Nbr de jour","=",{"$f":"IF(SUM(AD91:AD94)=0,\"\",SUM(AD91:AD94))","v":""},"Nbr de jour","=",{"$f":"IF(SUM(AG91:AG94)=0,\"\",SUM(AG91:AG94))","v":""},"Nbr de jour","=",{"$f":"IF(SUM(AJ91:AJ94)=0,\"\",SUM(AJ91:AJ94))","v":""},"Nbr de jour","=",{"$f":"IF(SUM(AM91:AM94)=0,\"\",SUM(AM91:AM94))","v":""},"Nbr de jour","=",{"$f":"IF(SUM(AP91:AP94)=0,\"\",SUM(AP91:AP94))","v":""},"Nbr de jour","=",{"$f":"IF(SUM(AS91:AS94)=0,\"\",SUM(AS91:AS94))","v":""},"Nbr de jour","=",{"$f":"IF(SUM(AV91:AV94)=0,\"\",SUM(AV91:AV94))","v":""},"Nbr de jour","=",{"$f":"IF(SUM(AY91:AY94)=0,\"\",SUM(AY91:AY94))","v":""},"Nbr de jour","=",{"$f":"IF(SUM(BB91:BB94)=0,\"\",SUM(BB91:BB94))","v":""},"Nbr de jour","=",{"$f":"IF(SUM(BE91:BE94)=0,\"\",SUM(BE91:BE94))","v":""},"Nbr de jour","=",{"$f":"IF(SUM(BH91:BH94)=0,\"\",SUM(BH91:BH94))","v":""},"Nbr de jour","=",{"$f":"IF(SUM(BK91:BK94)=0,\"\",SUM(BK91:BK94))","v":""},"Nbr de jour","=",{"$f":"IF(SUM(BN91:BN94)=0,\"\",SUM(BN91:BN94))","v":""},"Nbr de jour","=",{"$f":"IF(SUM(BQ91:BQ94)=0,\"\",SUM(BQ91:BQ94))","v":""},"Nbr de jour","=",{"$f":"IF(SUM(BT91:BT94)=0,\"\",SUM(BT91:BT94))","v":""},"Nbr de jour","=",{"$f":"IF(SUM(BW91:BW94)=0,\"\",SUM(BW91:BW94))","v":""},"Nbr de jour","=",{"$f":"IF(SUM(BZ91:BZ94)=0,\"\",SUM(BZ91:BZ94))","v":""},"Nbr de jour","=",{"$f":"IF(SUM(CC91:CC94)=0,\"\",SUM(CC91:CC94))","v":""},"Nbr de jour","=",{"$f":"IF(SUM(CF91:CF94)=0,\"\",SUM(CF91:CF94))","v":""},"Nbr de jour","=",{"$f":"IF(SUM(CI91:CI94)=0,\"\",SUM(CI91:CI94))","v":""},"Nbr de jour","=",{"$f":"IF(SUM(CL91:CL94)=0,\"\",SUM(CL91:CL94))","v":""},"Nbr de jour","=",{"$f":"IF(SUM(CO91:CO94)=0,\"\",SUM(CO91:CO94))","v":""},"Nbr de jour","=",{"$f":"IF(SUM(CR91:CR94)=0,\"\",SUM(CR91:CR94))","v":""},"Nbr de jour","=",{"$f":"IF(SUM(CU91:CU94)=0,\"\",SUM(CU91:CU94))","v":""},"Nbr de jour","=",{"$f":"IF(SUM(CX91:CX94)=0,\"\",SUM(CX91:CX94))","v":""},"Nbr de jour","=",{"$f":"IF(SUM(DA91:DA94)=0,\"\",SUM(DA91:DA94))","v":""},"Nbr de jour","=",{"$f":"IF(SUM(DD91:DD94)=0,\"\",SUM(DD91:DD94))","v":""},"Nbr de jour","=",{"$f":"IF(SUM(DG91:DG94)=0,\"\",SUM(DG91:DG94))","v":""},"Nbr de jour","=",{"$f":"IF(SUM(DJ91:DJ94)=0,\"\",SUM(DJ91:DJ94))","v":""},"Nbr de jour","=",{"$f":"IF(SUM(DM91:DM94)=0,\"\",SUM(DM91:DM94))","v":""},"Nbr de jour","=",{"$f":"IF(SUM(DP91:DP94)=0,\"\",SUM(DP91:DP94))","v":""},"Nbr de jour","=",{"$f":"IF(SUM(DS91:DS94)=0,\"\",SUM(DS91:DS94))","v":""},"Nbr de jour","=",{"$f":"IF(SUM(DV91:DV94)=0,\"\",SUM(DV91:DV94))","v":""},"Nbr de jour","=",{"$f":"IF(SUM(DY91:DY94)=0,\"\",SUM(DY91:DY94))","v":""},"Nbr de jour","=",{"$f":"IF(SUM(EB91:EB94)=0,\"\",SUM(EB91:EB94))","v":""}]
[null,null,null,{"$f":"IF(D98=\"\",\"\",D98)","v":"P1"},"","P3","","","","","","",""]
[null,null,null,{"$f":"IF(D98=\"\",\"\",D98)","v":"P1"},"","P3","","","","","","",""]
["Numéro 15","Nom affaire","EXE","P1",null,"P3"]
[null,null,null,{"$f":"IF(D98=\"\",\"\",D98)","v":"P1"},"","P3","","","","","","",""]
[null,"Temps passé en jour =",null,{"$f":"IF(D98=\"\",\"\",D98)","v":"P1"},"","P3","","","","","","","","Nbr de jour","=",{"$f":"IF(SUM(O96:O99)=0,\"\",SUM(O96:O99))","v":""},"Nbr de jour","=",{"$f":"IF(SUM(R96:R99)=0,\"\",SUM(R96:R99))","v":""},"Nbr de jour","=",{"$f":"IF(SUM(U96:U99)=0,\"\",SUM(U96:U99))","v":""},"Nbr de jour","=",{"$f":"IF(SUM(X96:X99)=0,\"\",SUM(X96:X99))","v":""},"Nbr de jour","=",{"$f":"IF(SUM(AA96:AA99)=0,\"\",SUM(AA96:AA99))","v":""},"Nbr de jour","=",{"$f":"IF(SUM(AD96:AD99)=0,\"\",SUM(AD96:AD99))","v":""},"Nbr de jour","=",{"$f":"IF(SUM(AG96:AG99)=0,\"\",SUM(AG96:AG99))","v":""},"Nbr de jour","=",{"$f":"IF(SUM(AJ96:AJ99)=0,\"\",SUM(AJ96:AJ99))","v":""},"Nbr de jour","=",{"$f":"IF(SUM(AM96:AM99)=0,\"\",SUM(AM96:AM99))","v":""},"Nbr de jour","=",{"$f":"IF(SUM(AP96:AP99)=0,\"\",SUM(AP96:AP99))","v":""},"Nbr de jour","=",{"$f":"IF(SUM(AS96:AS99)=0,\"\",SUM(AS96:AS99))","v":""},"Nbr de jour","=",{"$f":"IF(SUM(AV96:AV99)=0,\"\",SUM(AV96:AV99))","v":""},"Nbr de jour","=",{"$f":"IF(SUM(AY96:AY99)=0,\"\",SUM(AY96:AY99))","v":""},"Nbr de jour","=",{"$f":"IF(SUM(BB96:BB99)=0,\"\",SUM(BB96:BB99))","v":""},"Nbr de jour","=",{"$f":"IF(SUM(BE96:BE99)=0,\"\",SUM(BE96:BE99))","v":""},"Nbr de jour","=",{"$f":"IF(SUM(BH96:BH99)=0,\"\",SUM(BH96:BH99))","v":""},"Nbr de jour","=",{"$f":"IF(SUM(BK96:BK99)=0,\"\",SUM(BK96:BK99))","v":""},"Nbr de jour","=",{"$f":"IF(SUM(BN96:BN99)=0,\"\",SUM(BN96:BN99))","v":""},"Nbr de jour","=",{"$f":"IF(SUM(BQ96:BQ99)=0,\"\",SUM(BQ96:BQ99))","v":""},"Nbr de jour","=",{"$f":"IF(SUM(BT96:BT99)=0,\"\",SUM(BT96:BT99))","v":""},"Nbr de jour","=",{"$f":"IF(SUM(BW96:BW99)=0,\"\",SUM(BW96:BW99))","v":""},"Nbr de jour","=",{"$f":"IF(SUM(BZ96:BZ99)=0,\"\",SUM(BZ96:BZ99))","v":""},"Nbr de jour","=",{"$f":"IF(SUM(CC96:CC99)=0,\"\",SUM(CC96:CC99))","v":""},"Nbr de jour","=",{"$f":"IF(SUM(CF96:CF99)=0,\"\",SUM(CF96:CF99))","v":""},"Nbr de jour","=",{"$f":"IF(SUM(CI96:CI99)=0,\"\",SUM(CI96:CI99))","v":""},"Nbr de jour","=",{"$f":"IF(SUM(CL96:CL99)=0,\"\",SUM(CL96:CL99))","v":""},"Nbr de jour","=",{"$f":"IF(SUM(CO96:CO99)=0,\"\",SUM(CO96:CO99))","v":""},"Nbr de jour","=",{"$f":"IF(SUM(CR96:CR99)=0,\"\",SUM(CR96:CR99))","v":""},"Nbr de jour","=",{"$f":"IF(SUM(CU96:CU99)=0,\"\",SUM(CU96:CU99))","v":""},"Nbr de jour","=",{"$f":"IF(SUM(CX96:CX99)=0,\"\",SUM(CX96:CX99))","v":""},"Nbr de jour","=",{"$f":"IF(SUM(DA96:DA99)=0,\"\",SUM(DA96:DA99))","v":""},"Nbr de jour","=",{"$f":"IF(SUM(DD96:DD99)=0,\"\",SUM(DD96:DD99))","v":""},"Nbr de jour","=",{"$f":"IF(SUM(DG96:DG99)=0,\"\",SUM(DG96:DG99))","v":""},"Nbr de jour","=",{"$f":"IF(SUM(DJ96:DJ99)=0,\"\",SUM(DJ96:DJ99))","v":""},"Nbr de jour","=",{"$f":"IF(SUM(DM96:DM99)=0,\"\",SUM(DM96:DM99))","v":""},"Nbr de jour","=",{"$f":"IF(SUM(DP96:DP99)=0,\"\",SUM(DP96:DP99))","v":""},"Nbr de jour","=",{"$f":"IF(SUM(DS96:DS99)=0,\"\",SUM(DS96:DS99))","v":""},"Nbr de jour","=",{"$f":"IF(SUM(DV96:DV99)=0,\"\",SUM(DV96:DV99))","v":""},"Nbr de jour","=",{"$f":"IF(SUM(DY96:DY99)=0,\"\",SUM(DY96:DY99))","v":""},"Nbr de jour","=",{"$f":"IF(SUM(EB96:EB99)=0,\"\",SUM(EB96:EB99))","v":""}]
[null,null,null,{"$f":"IF(D103=\"\",\"\",D103)","v":""},"","","","","P6","","","P9",""]
[null,null,null,{"$f":"IF(D103=\"\",\"\",D103)","v":""},"","","","","P6","","","P9",""]
["Numéro 16","Nom affaire","EXE",null,null,null,null,null,"P6",null,null,"P9"]
[null,null,null,{"$f":"IF(D103=\"\",\"\",D103)","v":""},"","","","","P6","","","P9",""]
[null,"Temps passé en jour =",null,{"$f":"IF(D103=\"\",\"\",D103)","v":""},"","","","","P6","","","P9","","Nbr de jour","=",{"$f":"IF(SUM(O101:O104)=0,\"\",SUM(O101:O104))","v":""},"Nbr de jour","=",{"$f":"IF(SUM(R101:R104)=0,\"\",SUM(R101:R104))","v":""},"Nbr de jour","=",{"$f":"IF(SUM(U101:U104)=0,\"\",SUM(U101:U104))","v":""},"Nbr de jour","=",{"$f":"IF(SUM(X101:X104)=0,\"\",SUM(X101:X104))","v":""},"Nbr de jour","=",{"$f":"IF(SUM(AA101:AA104)=0,\"\",SUM(AA101:AA104))","v":""},"Nbr de jour","=",{"$f":"IF(SUM(AD101:AD104)=0,\"\",SUM(AD101:AD104))","v":""},"Nbr de jour","=",{"$f":"IF(SUM(AG101:AG104)=0,\"\",SUM(AG101:AG104))","v":""},"Nbr de jour","=",{"$f":"IF(SUM(AJ101:AJ104)=0,\"\",SUM(AJ101:AJ104))","v":""},"Nbr de jour","=",{"$f":"IF(SUM(AM101:AM104)=0,\"\",SUM(AM101:AM104))","v":""},"Nbr de jour","=",{"$f":"IF(SUM(AP101:AP104)=0,\"\",SUM(AP101:AP104))","v":""},"Nbr de jour","=",{"$f":"IF(SUM(AS101:AS104)=0,\"\",SUM(AS101:AS104))","v":""},"Nbr de jour","=",{"$f":"IF(SUM(AV101:AV104)=0,\"\",SUM(AV101:AV104))","v":""},"Nbr de jour","=",{"$f":"IF(SUM(AY101:AY104)=0,\"\",SUM(AY101:AY104))","v":""},"Nbr de jour","=",{"$f":"IF(SUM(BB101:BB104)=0,\"\",SUM(BB101:BB104))","v":""},"Nbr de jour","=",{"$f":"IF(SUM(BE101:BE104)=0,\"\",SUM(BE101:BE104))","v":""},"Nbr de jour","=",{"$f":"IF(SUM(BH101:BH104)=0,\"\",SUM(BH101:BH104))","v":""},"Nbr de jour","=",{"$f":"IF(SUM(BK101:BK104)=0,\"\",SUM(BK101:BK104))","v":""},"Nbr de jour","=",{"$f":"IF(SUM(BN101:BN104)=0,\"\",SUM(BN101:BN104))","v":""},"Nbr de jour","=",{"$f":"IF(SUM(BQ101:BQ104)=0,\"\",SUM(BQ101:BQ104))","v":""},"Nbr de jour","=",{"$f":"IF(SUM(BT101:BT104)=0,\"\",SUM(BT101:BT104))","v":""},"Nbr de jour","=",{"$f":"IF(SUM(BW101:BW104)=0,\"\",SUM(BW101:BW104))","v":""},"Nbr de jour","=",{"$f":"IF(SUM(BZ101:BZ104)=0,\"\",SUM(BZ101:BZ104))","v":""},"Nbr de jour","=",{"$f":"IF(SUM(CC101:CC104)=0,\"\",SUM(CC101:CC104))","v":""},"Nbr de jour","=",{"$f":"IF(SUM(CF101:CF104)=0,\"\",SUM(CF101:CF104))","v":""},"Nbr de jour","=",{"$f":"IF(SUM(CI101:CI104)=0,\"\",SUM(CI101:CI104))","v":""},"Nbr de jour","=",{"$f":"IF(SUM(CL101:CL104)=0,\"\",SUM(CL101:CL104))","v":""},"Nbr de jour","=",{"$f":"IF(SUM(CO101:CO104)=0,\"\",SUM(CO101:CO104))","v":""},"Nbr de jour","=",{"$f":"IF(SUM(CR101:CR104)=0,\"\",SUM(CR101:CR104))","v":""},"Nbr de jour","=",{"$f":"IF(SUM(CU101:CU104)=0,\"\",SUM(CU101:CU104))","v":""},"Nbr de jour","=",{"$f":"IF(SUM(CX101:CX104)=0,\"\",SUM(CX101:CX104))","v":""},"Nbr de jour","=",{"$f":"IF(SUM(DA101:DA104)=0,\"\",SUM(DA101:DA104))","v":""},"Nbr de jour","=",{"$f":"IF(SUM(DD101:DD104)=0,\"\",SUM(DD101:DD104))","v":""},"Nbr de jour","=",{"$f":"IF(SUM(DG101:DG104)=0,\"\",SUM(DG101:DG104))","v":""},"Nbr de jour","=",{"$f":"IF(SUM(DJ101:DJ104)=0,\"\",SUM(DJ101:DJ104))","v":""},"Nbr de jour","=",{"$f":"IF(SUM(DM101:DM104)=0,\"\",SUM(DM101:DM104))","v":""},"Nbr de jour","=",{"$f":"IF(SUM(DP101:DP104)=0,\"\",SUM(DP101:DP104))","v":""},"Nbr de jour","=",{"$f":"IF(SUM(DS101:DS104)=0,\"\",SUM(DS101:DS104))","v":""},"Nbr de jour","=",{"$f":"IF(SUM(DV101:DV104)=0,\"\",SUM(DV101:DV104))","v":""},"Nbr de jour","=",{"$f":"IF(SUM(DY101:DY104)=0,\"\",SUM(DY101:DY104))","v":""},"Nbr de jour","=",{"$f":"IF(SUM(EB101:EB104)=0,\"\",SUM(EB101:EB104))","v":""}]