{"text_format":"1","workbook":"xlsx","n_sheets":5,"sheets":["Stock","Sortie","Entrée","listes","Mode d'emploi"],"not_rendered":{"charts":0,"images":0,"macros":0,"external_links":0,"defined_names":12,"comments":3,"pivot_tables":0},"unopened":[],"bounds":{"document_bytes":16777216,"sheet_cells":100000,"rows_first":2000,"rows_last":500,"rows_between":2000,"halvings":0,"cell_chars":16384,"cell_head_chars":4096},"cells_cut":0,"cells_raw":0,"read":"whole","date_system":"1900"}

{"sheet":"Stock","index":0,"n_rows":176,"n_cols":11,"rows_kept":176,"cut":false,"hidden":false,"merged":[[1,0,1,10]]}
[]
["Etat du stock"]
[]
["Référence","Famille","Désignation","Taille","Achat\nHT","Prix\nVente","Modification\ninventaire","Stock\nActuel","Stock\nLimite","Etat","Commandé "]
["159951","Ciseaux","Fiskars universel","21cm",6.86,20.5,0,{"$f":"IF($A5<>0,G5+SUMPRODUCT((T_entrée[Référence]=$A5)*T_entrée[Quantité])-SUMPRODUCT((T_sortie[Référence]=$A5)*T_sortie[Quantité]),0)","v":1},null,{"$f":"IF(H5<I5,\"à Cder \"&T_stock[[#This Row],[Stock\nLimite]]-T_stock[[#This Row],[Stock\nActuel]],\"\")","v":""}]
["18","Bouton","Rond fushia fille",15,0.23,0.8,0,{"$f":"IF($A6<>0,G6+SUMPRODUCT((T_entrée[Référence]=$A6)*T_entrée[Quantité])-SUMPRODUCT((T_sortie[Référence]=$A6)*T_sortie[Quantité]),0)","v":30},null,{"$f":"IF(H6<I6,\"à Cder \"&T_stock[[#This Row],[Stock\nLimite]]-T_stock[[#This Row],[Stock\nActuel]],\"\")","v":""}]
["20","Bouton","Rond turquoise Kidz",15,0.23,0.8,0,{"$f":"IF($A7<>0,G7+SUMPRODUCT((T_entrée[Référence]=$A7)*T_entrée[Quantité])-SUMPRODUCT((T_sortie[Référence]=$A7)*T_sortie[Quantité]),0)","v":20},null,{"$f":"IF(H7<I7,\"à Cder \"&T_stock[[#This Row],[Stock\nLimite]]-T_stock[[#This Row],[Stock\nActuel]],\"\")","v":""}]
["201036","Bouton","Cœur marron et beige",15,0.23,0.8,0,{"$f":"IF($A8<>0,G8+SUMPRODUCT((T_entrée[Référence]=$A8)*T_entrée[Quantité])-SUMPRODUCT((T_sortie[Référence]=$A8)*T_sortie[Quantité]),0)","v":30},null,{"$f":"IF(H8<I8,\"à Cder \"&T_stock[[#This Row],[Stock\nLimite]]-T_stock[[#This Row],[Stock\nActuel]],\"\")","v":""}]
["211068","Bouton","Rond jaune smiley",15,0.23,0.8,0,{"$f":"IF($A9<>0,G9+SUMPRODUCT((T_entrée[Référence]=$A9)*T_entrée[Quantité])-SUMPRODUCT((T_sortie[Référence]=$A9)*T_sortie[Quantité]),0)","v":30},null,{"$f":"IF(H9<I9,\"à Cder \"&T_stock[[#This Row],[Stock\nLimite]]-T_stock[[#This Row],[Stock\nActuel]],\"\")","v":""}]
["211424","Bouton","Cœur bois",15,0.3,1,0,{"$f":"IF($A10<>0,G10+SUMPRODUCT((T_entrée[Référence]=$A10)*T_entrée[Quantité])-SUMPRODUCT((T_sortie[Référence]=$A10)*T_sortie[Quantité]),0)","v":20},null,{"$f":"IF(H10<I10,\"à Cder \"&T_stock[[#This Row],[Stock\nLimite]]-T_stock[[#This Row],[Stock\nActuel]],\"\")","v":""}]
["211572","Bouton","Voiture rouge et blanc",20,0.3,1,0,{"$f":"IF($A11<>0,G11+SUMPRODUCT((T_entrée[Référence]=$A11)*T_entrée[Quantité])-SUMPRODUCT((T_sortie[Référence]=$A11)*T_sortie[Quantité]),0)","v":30},null,{"$f":"IF(H11<I11,\"à Cder \"&T_stock[[#This Row],[Stock\nLimite]]-T_stock[[#This Row],[Stock\nActuel]],\"\")","v":""}]
["230123","Bouton","Petite fleur Blanc nacré",11,0.3,1,0,{"$f":"IF($A12<>0,G12+SUMPRODUCT((T_entrée[Référence]=$A12)*T_entrée[Quantité])-SUMPRODUCT((T_sortie[Référence]=$A12)*T_sortie[Quantité]),0)","v":40},null,{"$f":"IF(H12<I12,\"à Cder \"&T_stock[[#This Row],[Stock\nLimite]]-T_stock[[#This Row],[Stock\nActuel]],\"\")","v":""}]
["230612","Bouton","Petit cœur métal",14,0.3,1,0,{"$f":"IF($A13<>0,G13+SUMPRODUCT((T_entrée[Référence]=$A13)*T_entrée[Quantité])-SUMPRODUCT((T_sortie[Référence]=$A13)*T_sortie[Quantité]),0)","v":20},null,{"$f":"IF(H13<I13,\"à Cder \"&T_stock[[#This Row],[Stock\nLimite]]-T_stock[[#This Row],[Stock\nActuel]],\"\")","v":""}]
["230912","Bouton","Rond rose gravé",15,0.3,1,0,{"$f":"IF($A14<>0,G14+SUMPRODUCT((T_entrée[Référence]=$A14)*T_entrée[Quantité])-SUMPRODUCT((T_sortie[Référence]=$A14)*T_sortie[Quantité]),0)","v":20},null,{"$f":"IF(H14<I14,\"à Cder \"&T_stock[[#This Row],[Stock\nLimite]]-T_stock[[#This Row],[Stock\nActuel]],\"\")","v":""}]
["230916","Bouton","Rond rose bord gravé",15,0.3,1,0,{"$f":"IF($A15<>0,G15+SUMPRODUCT((T_entrée[Référence]=$A15)*T_entrée[Quantité])-SUMPRODUCT((T_sortie[Référence]=$A15)*T_sortie[Quantité]),0)","v":40},null,{"$f":"IF(H15<I15,\"à Cder \"&T_stock[[#This Row],[Stock\nLimite]]-T_stock[[#This Row],[Stock\nActuel]],\"\")","v":""}]
["231260","Bouton","Rond gris marbré",20,0.3,1,0,{"$f":"IF($A16<>0,G16+SUMPRODUCT((T_entrée[Référence]=$A16)*T_entrée[Quantité])-SUMPRODUCT((T_sortie[Référence]=$A16)*T_sortie[Quantité]),0)","v":30},null,{"$f":"IF(H16<I16,\"à Cder \"&T_stock[[#This Row],[Stock\nLimite]]-T_stock[[#This Row],[Stock\nActuel]],\"\")","v":""}]
["231379","Bouton","Voiture bleu et blanc",20,0.3,1,0,{"$f":"IF($A17<>0,G17+SUMPRODUCT((T_entrée[Référence]=$A17)*T_entrée[Quantité])-SUMPRODUCT((T_sortie[Référence]=$A17)*T_sortie[Quantité]),0)","v":30},null,{"$f":"IF(H17<I17,\"à Cder \"&T_stock[[#This Row],[Stock\nLimite]]-T_stock[[#This Row],[Stock\nActuel]],\"\")","v":""}]
["23464","Bouton","Bateau bleu",18,0.34,1.2,0,{"$f":"IF($A18<>0,G18+SUMPRODUCT((T_entrée[Référence]=$A18)*T_entrée[Quantité])-SUMPRODUCT((T_sortie[Référence]=$A18)*T_sortie[Quantité]),0)","v":20},null,{"$f":"IF(H18<I18,\"à Cder \"&T_stock[[#This Row],[Stock\nLimite]]-T_stock[[#This Row],[Stock\nActuel]],\"\")","v":""}]
["240926","Bouton","Rond bleu lune",18,0.34,1.2,0,{"$f":"IF($A19<>0,G19+SUMPRODUCT((T_entrée[Référence]=$A19)*T_entrée[Quantité])-SUMPRODUCT((T_sortie[Référence]=$A19)*T_sortie[Quantité]),0)","v":20},null,{"$f":"IF(H19<I19,\"à Cder \"&T_stock[[#This Row],[Stock\nLimite]]-T_stock[[#This Row],[Stock\nActuel]],\"\")","v":""}]
["250654","Bouton","Petit rond gris clair et foncé",18,0.34,1.2,0,{"$f":"IF($A20<>0,G20+SUMPRODUCT((T_entrée[Référence]=$A20)*T_entrée[Quantité])-SUMPRODUCT((T_sortie[Référence]=$A20)*T_sortie[Quantité]),0)","v":26},null,{"$f":"IF(H20<I20,\"à Cder \"&T_stock[[#This Row],[Stock\nLimite]]-T_stock[[#This Row],[Stock\nActuel]],\"\")","v":""}]
["250753","Bouton","Carré beige rainure",18,0.34,1.2,0,{"$f":"IF($A21<>0,G21+SUMPRODUCT((T_entrée[Référence]=$A21)*T_entrée[Quantité])-SUMPRODUCT((T_sortie[Référence]=$A21)*T_sortie[Quantité]),0)","v":20},null,{"$f":"IF(H21<I21,\"à Cder \"&T_stock[[#This Row],[Stock\nLimite]]-T_stock[[#This Row],[Stock\nActuel]],\"\")","v":""}]
["251144","Bouton","Rond rose tâcheté",20,0.34,1.2,0,{"$f":"IF($A22<>0,G22+SUMPRODUCT((T_entrée[Référence]=$A22)*T_entrée[Quantité])-SUMPRODUCT((T_sortie[Référence]=$A22)*T_sortie[Quantité]),0)","v":20},null,{"$f":"IF(H22<I22,\"à Cder \"&T_stock[[#This Row],[Stock\nLimite]]-T_stock[[#This Row],[Stock\nActuel]],\"\")","v":""}]
["251224","Bouton","Coccinelle jaune",15,0.34,1.2,0,{"$f":"IF($A23<>0,G23+SUMPRODUCT((T_entrée[Référence]=$A23)*T_entrée[Quantité])-SUMPRODUCT((T_sortie[Référence]=$A23)*T_sortie[Quantité]),0)","v":30},null,{"$f":"IF(H23<I23,\"à Cder \"&T_stock[[#This Row],[Stock\nLimite]]-T_stock[[#This Row],[Stock\nActuel]],\"\")","v":""}]
["251320","Bouton","Grand rond gris clair et foncé",23,0.45,1.6,0,{"$f":"IF($A24<>0,G24+SUMPRODUCT((T_entrée[Référence]=$A24)*T_entrée[Quantité])-SUMPRODUCT((T_sortie[Référence]=$A24)*T_sortie[Quantité]),0)","v":20},null,{"$f":"IF(H24<I24,\"à Cder \"&T_stock[[#This Row],[Stock\nLimite]]-T_stock[[#This Row],[Stock\nActuel]],\"\")","v":""}]
["280439","Bouton","Carré gris rainure",23,0.45,1.6,0,{"$f":"IF($A25<>0,G25+SUMPRODUCT((T_entrée[Référence]=$A25)*T_entrée[Quantité])-SUMPRODUCT((T_sortie[Référence]=$A25)*T_sortie[Quantité]),0)","v":12},null,{"$f":"IF(H25<I25,\"à Cder \"&T_stock[[#This Row],[Stock\nLimite]]-T_stock[[#This Row],[Stock\nActuel]],\"\")","v":""}]
["280578","Bouton","Cœur x3 métal",18,0.45,1.6,0,{"$f":"IF($A26<>0,G26+SUMPRODUCT((T_entrée[Référence]=$A26)*T_entrée[Quantité])-SUMPRODUCT((T_sortie[Référence]=$A26)*T_sortie[Quantité]),0)","v":20},null,{"$f":"IF(H26<I26,\"à Cder \"&T_stock[[#This Row],[Stock\nLimite]]-T_stock[[#This Row],[Stock\nActuel]],\"\")","v":""}]
["282101","Mercerie","Mètre ruban","junior",1.27,4.5,0,{"$f":"IF($A27<>0,G27+SUMPRODUCT((T_entrée[Référence]=$A27)*T_entrée[Quantité])-SUMPRODUCT((T_sortie[Référence]=$A27)*T_sortie[Quantité]),0)","v":1},null,{"$f":"IF(H27<I27,\"à Cder \"&T_stock[[#This Row],[Stock\nLimite]]-T_stock[[#This Row],[Stock\nActuel]],\"\")","v":""}]
["282201","Mercerie","Mètre automatic","maxi",2.4500000000000002,6.4,0,{"$f":"IF($A28<>0,G28+SUMPRODUCT((T_entrée[Référence]=$A28)*T_entrée[Quantité])-SUMPRODUCT((T_sortie[Référence]=$A28)*T_sortie[Quantité]),0)","v":1},null,{"$f":"IF(H28<I28,\"à Cder \"&T_stock[[#This Row],[Stock\nLimite]]-T_stock[[#This Row],[Stock\nActuel]],\"\")","v":""}]
["282209","Mercerie","Mètre automatic","mini",2.2000000000000002,5.6,0,{"$f":"IF($A29<>0,G29+SUMPRODUCT((T_entrée[Référence]=$A29)*T_entrée[Quantité])-SUMPRODUCT((T_sortie[Référence]=$A29)*T_sortie[Quantité]),0)","v":1},null,{"$f":"IF(H29<I29,\"à Cder \"&T_stock[[#This Row],[Stock\nLimite]]-T_stock[[#This Row],[Stock\nActuel]],\"\")","v":""}]
["290472","Bouton","Grand cœur métal",18,0.45,1.6,0,{"$f":"IF($A30<>0,G30+SUMPRODUCT((T_entrée[Référence]=$A30)*T_entrée[Quantité])-SUMPRODUCT((T_sortie[Référence]=$A30)*T_sortie[Quantité]),0)","v":20},null,{"$f":"IF(H30<I30,\"à Cder \"&T_stock[[#This Row],[Stock\nLimite]]-T_stock[[#This Row],[Stock\nActuel]],\"\")","v":""}]
["290663","Bouton","Ovale noir",25,0.45,1.6,0,{"$f":"IF($A31<>0,G31+SUMPRODUCT((T_entrée[Référence]=$A31)*T_entrée[Quantité])-SUMPRODUCT((T_sortie[Référence]=$A31)*T_sortie[Quantité]),0)","v":16},null,{"$f":"IF(H31<I31,\"à Cder \"&T_stock[[#This Row],[Stock\nLimite]]-T_stock[[#This Row],[Stock\nActuel]],\"\")","v":""}]
["300436","Bouton","Rond noir rainures blanches",23,0.45,1.6,0,{"$f":"IF($A32<>0,G32+SUMPRODUCT((T_entrée[Référence]=$A32)*T_entrée[Quantité])-SUMPRODUCT((T_sortie[Référence]=$A32)*T_sortie[Quantité]),0)","v":16},null,{"$f":"IF(H32<I32,\"à Cder \"&T_stock[[#This Row],[Stock\nLimite]]-T_stock[[#This Row],[Stock\nActuel]],\"\")","v":""}]
["300498","Bouton","Noir gravé ancre",25,0.45,1.6,0,{"$f":"IF($A33<>0,G33+SUMPRODUCT((T_entrée[Référence]=$A33)*T_entrée[Quantité])-SUMPRODUCT((T_sortie[Référence]=$A33)*T_sortie[Quantité]),0)","v":12},null,{"$f":"IF(H33<I33,\"à Cder \"&T_stock[[#This Row],[Stock\nLimite]]-T_stock[[#This Row],[Stock\nActuel]],\"\")","v":""}]
["300779","Bouton","Rond doré et noir ",15,0.51,1.8,0,{"$f":"IF($A34<>0,G34+SUMPRODUCT((T_entrée[Référence]=$A34)*T_entrée[Quantité])-SUMPRODUCT((T_sortie[Référence]=$A34)*T_sortie[Quantité]),0)","v":20},null,{"$f":"IF(H34<I34,\"à Cder \"&T_stock[[#This Row],[Stock\nLimite]]-T_stock[[#This Row],[Stock\nActuel]],\"\")","v":""}]
["300831","Bouton","Grand rond violet",25,0.51,1.8,0,{"$f":"IF($A35<>0,G35+SUMPRODUCT((T_entrée[Référence]=$A35)*T_entrée[Quantité])-SUMPRODUCT((T_sortie[Référence]=$A35)*T_sortie[Quantité]),0)","v":12},null,{"$f":"IF(H35<I35,\"à Cder \"&T_stock[[#This Row],[Stock\nLimite]]-T_stock[[#This Row],[Stock\nActuel]],\"\")","v":""}]
["3016","Bouton","Grand rond gris et noir",25,0.51,1.8,0,{"$f":"IF($A36<>0,G36+SUMPRODUCT((T_entrée[Référence]=$A36)*T_entrée[Quantité])-SUMPRODUCT((T_sortie[Référence]=$A36)*T_sortie[Quantité]),0)","v":12},null,{"$f":"IF(H36<I36,\"à Cder \"&T_stock[[#This Row],[Stock\nLimite]]-T_stock[[#This Row],[Stock\nActuel]],\"\")","v":""}]
["31","Bouton","Très grand métal cœur",23,0.51,1.8,0,{"$f":"IF($A37<>0,G37+SUMPRODUCT((T_entrée[Référence]=$A37)*T_entrée[Quantité])-SUMPRODUCT((T_sortie[Référence]=$A37)*T_sortie[Quantité]),0)","v":20},null,{"$f":"IF(H37<I37,\"à Cder \"&T_stock[[#This Row],[Stock\nLimite]]-T_stock[[#This Row],[Stock\nActuel]],\"\")","v":""}]
["319","Motif","Drapeau anglais",null,1.1000000000000001,3.9,0,{"$f":"IF($A38<>0,G38+SUMPRODUCT((T_entrée[Référence]=$A38)*T_entrée[Quantité])-SUMPRODUCT((T_sortie[Référence]=$A38)*T_sortie[Quantité]),0)","v":5},null,{"$f":"IF(H38<I38,\"à Cder \"&T_stock[[#This Row],[Stock\nLimite]]-T_stock[[#This Row],[Stock\nActuel]],\"\")","v":""}]
["32003","Motif","Ecusson fleur lys",null,1.1000000000000001,3.9,0,{"$f":"IF($A39<>0,G39+SUMPRODUCT((T_entrée[Référence]=$A39)*T_entrée[Quantité])-SUMPRODUCT((T_sortie[Référence]=$A39)*T_sortie[Quantité]),0)","v":5},null,{"$f":"IF(H39<I39,\"à Cder \"&T_stock[[#This Row],[Stock\nLimite]]-T_stock[[#This Row],[Stock\nActuel]],\"\")","v":""}]
["320170","Motif","Drapeau français",null,1.1000000000000001,3.9,0,{"$f":"IF($A40<>0,G40+SUMPRODUCT((T_entrée[Référence]=$A40)*T_entrée[Quantité])-SUMPRODUCT((T_sortie[Référence]=$A40)*T_sortie[Quantité]),0)","v":5},null,{"$f":"IF(H40<I40,\"à Cder \"&T_stock[[#This Row],[Stock\nLimite]]-T_stock[[#This Row],[Stock\nActuel]],\"\")","v":""}]
["321111","Ciseaux","A broder","7cm",6.34,15,0,{"$f":"IF($A41<>0,G41+SUMPRODUCT((T_entrée[Référence]=$A41)*T_entrée[Quantité])-SUMPRODUCT((T_sortie[Référence]=$A41)*T_sortie[Quantité]),0)","v":3},null,{"$f":"IF(H41<I41,\"à Cder \"&T_stock[[#This Row],[Stock\nLimite]]-T_stock[[#This Row],[Stock\nActuel]],\"\")","v":""}]
["327","Motif","Cœur paillette noir",null,1.1000000000000001,3.9,0,{"$f":"IF($A42<>0,G42+SUMPRODUCT((T_entrée[Référence]=$A42)*T_entrée[Quantité])-SUMPRODUCT((T_sortie[Référence]=$A42)*T_sortie[Quantité]),0)","v":10},null,{"$f":"IF(H42<I42,\"à Cder \"&T_stock[[#This Row],[Stock\nLimite]]-T_stock[[#This Row],[Stock\nActuel]],\"\")","v":""}]
["327","Motif","Poupées russes",null,1.94,6.5,0,{"$f":"IF($A43<>0,G43+SUMPRODUCT((T_entrée[Référence]=$A43)*T_entrée[Quantité])-SUMPRODUCT((T_sortie[Référence]=$A43)*T_sortie[Quantité]),0)","v":10},null,{"$f":"IF(H43<I43,\"à Cder \"&T_stock[[#This Row],[Stock\nLimite]]-T_stock[[#This Row],[Stock\nActuel]],\"\")","v":""}]
["32713411","Ciseaux","Lingère","11cm",3.43,10.3,0,{"$f":"IF($A44<>0,G44+SUMPRODUCT((T_entrée[Référence]=$A44)*T_entrée[Quantité])-SUMPRODUCT((T_sortie[Référence]=$A44)*T_sortie[Quantité]),0)","v":1},null,{"$f":"IF(H44<I44,\"à Cder \"&T_stock[[#This Row],[Stock\nLimite]]-T_stock[[#This Row],[Stock\nActuel]],\"\")","v":""}]
["32713414","Ciseaux","Lingère","14cm",3.66,11,0,{"$f":"IF($A45<>0,G45+SUMPRODUCT((T_entrée[Référence]=$A45)*T_entrée[Quantité])-SUMPRODUCT((T_sortie[Référence]=$A45)*T_sortie[Quantité]),0)","v":1},null,{"$f":"IF(H45<I45,\"à Cder \"&T_stock[[#This Row],[Stock\nLimite]]-T_stock[[#This Row],[Stock\nActuel]],\"\")","v":""}]
["33030","Motif","Cœur tweed",null,1.94,6.5,0,{"$f":"IF($A46<>0,G46+SUMPRODUCT((T_entrée[Référence]=$A46)*T_entrée[Quantité])-SUMPRODUCT((T_sortie[Référence]=$A46)*T_sortie[Quantité]),0)","v":1},null,{"$f":"IF(H46<I46,\"à Cder \"&T_stock[[#This Row],[Stock\nLimite]]-T_stock[[#This Row],[Stock\nActuel]],\"\")","v":""}]
["330302","Motif","Cœur paillette rouge",null,1.94,6.5,0,{"$f":"IF($A47<>0,G47+SUMPRODUCT((T_entrée[Référence]=$A47)*T_entrée[Quantité])-SUMPRODUCT((T_sortie[Référence]=$A47)*T_sortie[Quantité]),0)","v":5},null,{"$f":"IF(H47<I47,\"à Cder \"&T_stock[[#This Row],[Stock\nLimite]]-T_stock[[#This Row],[Stock\nActuel]],\"\")","v":""}]
["334 40 10","Fil","Câblé cheval vert blanc",40,3.58,10.7,0,{"$f":"IF($A48<>0,G48+SUMPRODUCT((T_entrée[Référence]=$A48)*T_entrée[Quantité])-SUMPRODUCT((T_sortie[Référence]=$A48)*T_sortie[Quantité]),0)","v":1},null,{"$f":"IF(H48<I48,\"à Cder \"&T_stock[[#This Row],[Stock\nLimite]]-T_stock[[#This Row],[Stock\nActuel]],\"\")","v":""}]
["334 40 310","Fil","Câblé cheval vert noir",40,3.58,10.7,0,{"$f":"IF($A49<>0,G49+SUMPRODUCT((T_entrée[Référence]=$A49)*T_entrée[Quantité])-SUMPRODUCT((T_sortie[Référence]=$A49)*T_sortie[Quantité]),0)","v":1},null,{"$f":"IF(H49<I49,\"à Cder \"&T_stock[[#This Row],[Stock\nLimite]]-T_stock[[#This Row],[Stock\nActuel]],\"\")","v":""}]
["334 50 10","Fil","Câblé cheval vert blanc",50,3.58,10.7,0,{"$f":"IF($A50<>0,G50+SUMPRODUCT((T_entrée[Référence]=$A50)*T_entrée[Quantité])-SUMPRODUCT((T_sortie[Référence]=$A50)*T_sortie[Quantité]),0)","v":1},null,{"$f":"IF(H50<I50,\"à Cder \"&T_stock[[#This Row],[Stock\nLimite]]-T_stock[[#This Row],[Stock\nActuel]],\"\")","v":""}]
["334 50 310","Fil","Câblé cheval vert noir",50,3.58,10.7,0,{"$f":"IF($A51<>0,G51+SUMPRODUCT((T_entrée[Référence]=$A51)*T_entrée[Quantité])-SUMPRODUCT((T_sortie[Référence]=$A51)*T_sortie[Quantité]),0)","v":1},null,{"$f":"IF(H51<I51,\"à Cder \"&T_stock[[#This Row],[Stock\nLimite]]-T_stock[[#This Row],[Stock\nActuel]],\"\")","v":""}]
["3342","Motif","Fleur rose",null,1.22,4.3,0,{"$f":"IF($A52<>0,G52+SUMPRODUCT((T_entrée[Référence]=$A52)*T_entrée[Quantité])-SUMPRODUCT((T_sortie[Référence]=$A52)*T_sortie[Quantité]),0)","v":5},null,{"$f":"IF(H52<I52,\"à Cder \"&T_stock[[#This Row],[Stock\nLimite]]-T_stock[[#This Row],[Stock\nActuel]],\"\")","v":""}]
["3392","Motif","Tête de mort brillante",null,0.8,2.8,0,{"$f":"IF($A53<>0,G53+SUMPRODUCT((T_entrée[Référence]=$A53)*T_entrée[Quantité])-SUMPRODUCT((T_sortie[Référence]=$A53)*T_sortie[Quantité]),0)","v":5},null,{"$f":"IF(H53<I53,\"à Cder \"&T_stock[[#This Row],[Stock\nLimite]]-T_stock[[#This Row],[Stock\nActuel]],\"\")","v":""}]
["3393","Motif","3 cœurs brillants rouges",null,1.39,4.8,0,{"$f":"IF($A54<>0,G54+SUMPRODUCT((T_entrée[Référence]=$A54)*T_entrée[Quantité])-SUMPRODUCT((T_sortie[Référence]=$A54)*T_sortie[Quantité]),0)","v":5},null,{"$f":"IF(H54<I54,\"à Cder \"&T_stock[[#This Row],[Stock\nLimite]]-T_stock[[#This Row],[Stock\nActuel]],\"\")","v":""}]
["3394","Motif","3 fleurs brillantes roses",null,1.39,4.8,0,{"$f":"IF($A55<>0,G55+SUMPRODUCT((T_entrée[Référence]=$A55)*T_entrée[Quantité])-SUMPRODUCT((T_sortie[Référence]=$A55)*T_sortie[Quantité]),0)","v":8},null,{"$f":"IF(H55<I55,\"à Cder \"&T_stock[[#This Row],[Stock\nLimite]]-T_stock[[#This Row],[Stock\nActuel]],\"\")","v":""}]
["3394","Motif","Danseuse brillante",null,0.98,3.2,0,{"$f":"IF($A56<>0,G56+SUMPRODUCT((T_entrée[Référence]=$A56)*T_entrée[Quantité])-SUMPRODUCT((T_sortie[Référence]=$A56)*T_sortie[Quantité]),0)","v":8},null,{"$f":"IF(H56<I56,\"à Cder \"&T_stock[[#This Row],[Stock\nLimite]]-T_stock[[#This Row],[Stock\nActuel]],\"\")","v":""}]
["3500","Motif","Timbre Tour Eiffel",null,1.01,3.5,0,{"$f":"IF($A57<>0,G57+SUMPRODUCT((T_entrée[Référence]=$A57)*T_entrée[Quantité])-SUMPRODUCT((T_sortie[Référence]=$A57)*T_sortie[Quantité]),0)","v":10},null,{"$f":"IF(H57<I57,\"à Cder \"&T_stock[[#This Row],[Stock\nLimite]]-T_stock[[#This Row],[Stock\nActuel]],\"\")","v":""}]
["3842","Motif","Rond racing",null,0.95,3.2,0,{"$f":"IF($A58<>0,G58+SUMPRODUCT((T_entrée[Référence]=$A58)*T_entrée[Quantité])-SUMPRODUCT((T_sortie[Référence]=$A58)*T_sortie[Quantité]),0)","v":5},null,{"$f":"IF(H58<I58,\"à Cder \"&T_stock[[#This Row],[Stock\nLimite]]-T_stock[[#This Row],[Stock\nActuel]],\"\")","v":""}]
["3855 1","Motif","Chat",null,1.56,5.3,0,{"$f":"IF($A59<>0,G59+SUMPRODUCT((T_entrée[Référence]=$A59)*T_entrée[Quantité])-SUMPRODUCT((T_sortie[Référence]=$A59)*T_sortie[Quantité]),0)","v":5},null,{"$f":"IF(H59<I59,\"à Cder \"&T_stock[[#This Row],[Stock\nLimite]]-T_stock[[#This Row],[Stock\nActuel]],\"\")","v":""}]
["3855 2","A riveter","Œillet noir","5mm",2.95,8.9,0,{"$f":"IF($A60<>0,G60+SUMPRODUCT((T_entrée[Référence]=$A60)*T_entrée[Quantité])-SUMPRODUCT((T_sortie[Référence]=$A60)*T_sortie[Quantité]),0)","v":5},null,{"$f":"IF(H60<I60,\"à Cder \"&T_stock[[#This Row],[Stock\nLimite]]-T_stock[[#This Row],[Stock\nActuel]],\"\")","v":""}]
["3855 3","Fil","Lastex blanc",null,0.85,2.9,0,{"$f":"IF($A61<>0,G61+SUMPRODUCT((T_entrée[Référence]=$A61)*T_entrée[Quantité])-SUMPRODUCT((T_sortie[Référence]=$A61)*T_sortie[Quantité]),0)","v":10},null,{"$f":"IF(H61<I61,\"à Cder \"&T_stock[[#This Row],[Stock\nLimite]]-T_stock[[#This Row],[Stock\nActuel]],\"\")","v":""}]
["3857","Fil","Lastex noir",null,0.85,2.9,0,{"$f":"IF($A62<>0,G62+SUMPRODUCT((T_entrée[Référence]=$A62)*T_entrée[Quantité])-SUMPRODUCT((T_sortie[Référence]=$A62)*T_sortie[Quantité]),0)","v":20},null,{"$f":"IF(H62<I62,\"à Cder \"&T_stock[[#This Row],[Stock\nLimite]]-T_stock[[#This Row],[Stock\nActuel]],\"\")","v":""}]
["3857","Colle","HT2",null,2.82,8.5,0,{"$f":"IF($A63<>0,G63+SUMPRODUCT((T_entrée[Référence]=$A63)*T_entrée[Quantité])-SUMPRODUCT((T_sortie[Référence]=$A63)*T_sortie[Quantité]),0)","v":20},null,{"$f":"IF(H63<I63,\"à Cder \"&T_stock[[#This Row],[Stock\nLimite]]-T_stock[[#This Row],[Stock\nActuel]],\"\")","v":""}]
["3857","A riveter","Œillet argent","8mm",3.95,11.8,0,{"$f":"IF($A64<>0,G64+SUMPRODUCT((T_entrée[Référence]=$A64)*T_entrée[Quantité])-SUMPRODUCT((T_sortie[Référence]=$A64)*T_sortie[Quantité]),0)","v":20},null,{"$f":"IF(H64<I64,\"à Cder \"&T_stock[[#This Row],[Stock\nLimite]]-T_stock[[#This Row],[Stock\nActuel]],\"\")","v":""}]
["3882","Mercerie","Attache bretelle blanche",null,2.6,7.1,0,{"$f":"IF($A65<>0,G65+SUMPRODUCT((T_entrée[Référence]=$A65)*T_entrée[Quantité])-SUMPRODUCT((T_sortie[Référence]=$A65)*T_sortie[Quantité]),0)","v":5},null,{"$f":"IF(H65<I65,\"à Cder \"&T_stock[[#This Row],[Stock\nLimite]]-T_stock[[#This Row],[Stock\nActuel]],\"\")","v":""}]
["403712","Motif","Strass",null,1.92,5.8,0,{"$f":"IF($A66<>0,G66+SUMPRODUCT((T_entrée[Référence]=$A66)*T_entrée[Quantité])-SUMPRODUCT((T_sortie[Référence]=$A66)*T_sortie[Quantité]),0)","v":2},null,{"$f":"IF(H66<I66,\"à Cder \"&T_stock[[#This Row],[Stock\nLimite]]-T_stock[[#This Row],[Stock\nActuel]],\"\")","v":""}]
["42","Mercerie","Craie blanche",null,0.7,2.5,0,{"$f":"IF($A67<>0,G67+SUMPRODUCT((T_entrée[Référence]=$A67)*T_entrée[Quantité])-SUMPRODUCT((T_sortie[Référence]=$A67)*T_sortie[Quantité]),0)","v":10},null,{"$f":"IF(H67<I67,\"à Cder \"&T_stock[[#This Row],[Stock\nLimite]]-T_stock[[#This Row],[Stock\nActuel]],\"\")","v":""}]
["42","Mercerie","Attache bretelle noire",null,2.6,7.1,0,{"$f":"IF($A68<>0,G68+SUMPRODUCT((T_entrée[Référence]=$A68)*T_entrée[Quantité])-SUMPRODUCT((T_sortie[Référence]=$A68)*T_sortie[Quantité]),0)","v":10},null,{"$f":"IF(H68<I68,\"à Cder \"&T_stock[[#This Row],[Stock\nLimite]]-T_stock[[#This Row],[Stock\nActuel]],\"\")","v":""}]
["478","Mercerie","Aimant",null,1.02,3.1,0,{"$f":"IF($A69<>0,G69+SUMPRODUCT((T_entrée[Référence]=$A69)*T_entrée[Quantité])-SUMPRODUCT((T_sortie[Référence]=$A69)*T_sortie[Quantité]),0)","v":5},null,{"$f":"IF(H69<I69,\"à Cder \"&T_stock[[#This Row],[Stock\nLimite]]-T_stock[[#This Row],[Stock\nActuel]],\"\")","v":""}]
["5255","Mercerie","Pelote épingles",null,7.64,18.5,0,{"$f":"IF($A70<>0,G70+SUMPRODUCT((T_entrée[Référence]=$A70)*T_entrée[Quantité])-SUMPRODUCT((T_sortie[Référence]=$A70)*T_sortie[Quantité]),0)","v":1},null,{"$f":"IF(H70<I70,\"à Cder \"&T_stock[[#This Row],[Stock\nLimite]]-T_stock[[#This Row],[Stock\nActuel]],\"\")","v":""}]
["582","Mercerie","Epingles Bohin 100g",4,5.8,16,0,{"$f":"IF($A71<>0,G71+SUMPRODUCT((T_entrée[Référence]=$A71)*T_entrée[Quantité])-SUMPRODUCT((T_sortie[Référence]=$A71)*T_sortie[Quantité]),0)","v":5},null,{"$f":"IF(H71<I71,\"à Cder \"&T_stock[[#This Row],[Stock\nLimite]]-T_stock[[#This Row],[Stock\nActuel]],\"\")","v":""}]
["583","Mercerie","Epingles tête verre","30x0,60",1.76,5.5,0,{"$f":"IF($A72<>0,G72+SUMPRODUCT((T_entrée[Référence]=$A72)*T_entrée[Quantité])-SUMPRODUCT((T_sortie[Référence]=$A72)*T_sortie[Quantité]),0)","v":5},null,{"$f":"IF(H72<I72,\"à Cder \"&T_stock[[#This Row],[Stock\nLimite]]-T_stock[[#This Row],[Stock\nActuel]],\"\")","v":""}]
["610960","Mercerie","Epingles Bohin 50g","?",2.9,8.6999999999999993,0,{"$f":"IF($A73<>0,G73+SUMPRODUCT((T_entrée[Référence]=$A73)*T_entrée[Quantité])-SUMPRODUCT((T_sortie[Référence]=$A73)*T_sortie[Quantité]),0)","v":5},null,{"$f":"IF(H73<I73,\"à Cder \"&T_stock[[#This Row],[Stock\nLimite]]-T_stock[[#This Row],[Stock\nActuel]],\"\")","v":""}]
["611321","Mercerie","Pelote tomate",null,1.61,5.5,0,{"$f":"IF($A74<>0,G74+SUMPRODUCT((T_entrée[Référence]=$A74)*T_entrée[Quantité])-SUMPRODUCT((T_sortie[Référence]=$A74)*T_sortie[Quantité]),0)","v":1},null,{"$f":"IF(H74<I74,\"à Cder \"&T_stock[[#This Row],[Stock\nLimite]]-T_stock[[#This Row],[Stock\nActuel]],\"\")","v":""}]
["611862","Laine","Boîte à laine",null,2.69,8,0,{"$f":"IF($A75<>0,G75+SUMPRODUCT((T_entrée[Référence]=$A75)*T_entrée[Quantité])-SUMPRODUCT((T_sortie[Référence]=$A75)*T_sortie[Quantité]),0)","v":1},null,{"$f":"IF(H75<I75,\"à Cder \"&T_stock[[#This Row],[Stock\nLimite]]-T_stock[[#This Row],[Stock\nActuel]],\"\")","v":""}]
["615151","Mercerie","Fermoir Lucia","grand",3.8,11,0,{"$f":"IF($A76<>0,G76+SUMPRODUCT((T_entrée[Référence]=$A76)*T_entrée[Quantité])-SUMPRODUCT((T_sortie[Référence]=$A76)*T_sortie[Quantité]),0)","v":2},null,{"$f":"IF(H76<I76,\"à Cder \"&T_stock[[#This Row],[Stock\nLimite]]-T_stock[[#This Row],[Stock\nActuel]],\"\")","v":""}]
["615158","Mercerie","Fermoir Emilia","moyen",2.4500000000000002,7.3,0,{"$f":"IF($A77<>0,G77+SUMPRODUCT((T_entrée[Référence]=$A77)*T_entrée[Quantité])-SUMPRODUCT((T_sortie[Référence]=$A77)*T_sortie[Quantité]),0)","v":2},null,{"$f":"IF(H77<I77,\"à Cder \"&T_stock[[#This Row],[Stock\nLimite]]-T_stock[[#This Row],[Stock\nActuel]],\"\")","v":""}]
["615159","Mercerie","Fermoir Julia","petit",2.0499999999999998,6.1,0,{"$f":"IF($A78<>0,G78+SUMPRODUCT((T_entrée[Référence]=$A78)*T_entrée[Quantité])-SUMPRODUCT((T_sortie[Référence]=$A78)*T_sortie[Quantité]),0)","v":2},null,{"$f":"IF(H78<I78,\"à Cder \"&T_stock[[#This Row],[Stock\nLimite]]-T_stock[[#This Row],[Stock\nActuel]],\"\")","v":""}]
["6702431","Outils","Pince plate",null,4.6500000000000004,13.5,0,{"$f":"IF($A79<>0,G79+SUMPRODUCT((T_entrée[Référence]=$A79)*T_entrée[Quantité])-SUMPRODUCT((T_sortie[Référence]=$A79)*T_sortie[Quantité]),0)","v":1},null,{"$f":"IF(H79<I79,\"à Cder \"&T_stock[[#This Row],[Stock\nLimite]]-T_stock[[#This Row],[Stock\nActuel]],\"\")","v":""}]
["6702601","Outils","Pince coupante",null,4.6500000000000004,13.5,0,{"$f":"IF($A80<>0,G80+SUMPRODUCT((T_entrée[Référence]=$A80)*T_entrée[Quantité])-SUMPRODUCT((T_sortie[Référence]=$A80)*T_sortie[Quantité]),0)","v":1},null,{"$f":"IF(H80<I80,\"à Cder \"&T_stock[[#This Row],[Stock\nLimite]]-T_stock[[#This Row],[Stock\nActuel]],\"\")","v":""}]
["923101","Motif","Chouette",null,1.75,5.2,0,{"$f":"IF($A81<>0,G81+SUMPRODUCT((T_entrée[Référence]=$A81)*T_entrée[Quantité])-SUMPRODUCT((T_sortie[Référence]=$A81)*T_sortie[Quantité]),0)","v":1},null,{"$f":"IF(H81<I81,\"à Cder \"&T_stock[[#This Row],[Stock\nLimite]]-T_stock[[#This Row],[Stock\nActuel]],\"\")","v":""}]
["923103","Motif","Papillon",null,1.42,4.2,0,{"$f":"IF($A82<>0,G82+SUMPRODUCT((T_entrée[Référence]=$A82)*T_entrée[Quantité])-SUMPRODUCT((T_sortie[Référence]=$A82)*T_sortie[Quantité]),0)","v":1},null,{"$f":"IF(H82<I82,\"à Cder \"&T_stock[[#This Row],[Stock\nLimite]]-T_stock[[#This Row],[Stock\nActuel]],\"\")","v":""}]
["925156","Motif","Mouton",null,2.0499999999999998,6.1,0,{"$f":"IF($A83<>0,G83+SUMPRODUCT((T_entrée[Référence]=$A83)*T_entrée[Quantité])-SUMPRODUCT((T_sortie[Référence]=$A83)*T_sortie[Quantité]),0)","v":1},null,{"$f":"IF(H83<I83,\"à Cder \"&T_stock[[#This Row],[Stock\nLimite]]-T_stock[[#This Row],[Stock\nActuel]],\"\")","v":""}]
["925157","Motif","Chien",null,2.0499999999999998,6.1,0,{"$f":"IF($A84<>0,G84+SUMPRODUCT((T_entrée[Référence]=$A84)*T_entrée[Quantité])-SUMPRODUCT((T_sortie[Référence]=$A84)*T_sortie[Quantité]),0)","v":1},null,{"$f":"IF(H84<I84,\"à Cder \"&T_stock[[#This Row],[Stock\nLimite]]-T_stock[[#This Row],[Stock\nActuel]],\"\")","v":""}]
["98","Mercerie","Remailleur",null,2.0499999999999998,6.1,0,{"$f":"IF($A85<>0,G85+SUMPRODUCT((T_entrée[Référence]=$A85)*T_entrée[Quantité])-SUMPRODUCT((T_sortie[Référence]=$A85)*T_sortie[Quantité]),0)","v":5},null,{"$f":"IF(H85<I85,\"à Cder \"&T_stock[[#This Row],[Stock\nLimite]]-T_stock[[#This Row],[Stock\nActuel]],\"\")","v":""}]
["98 36210 100","Fil","Fil à bâtir blanc",null,1.31,3.9,0,{"$f":"IF($A86<>0,G86+SUMPRODUCT((T_entrée[Référence]=$A86)*T_entrée[Quantité])-SUMPRODUCT((T_sortie[Référence]=$A86)*T_sortie[Quantité]),0)","v":5},null,{"$f":"IF(H86<I86,\"à Cder \"&T_stock[[#This Row],[Stock\nLimite]]-T_stock[[#This Row],[Stock\nActuel]],\"\")","v":""}]
["98 36210 592","Fil","Fil à bâtir rose",null,1.31,3.9,0,{"$f":"IF($A87<>0,G87+SUMPRODUCT((T_entrée[Référence]=$A87)*T_entrée[Quantité])-SUMPRODUCT((T_sortie[Référence]=$A87)*T_sortie[Quantité]),0)","v":5},null,{"$f":"IF(H87<I87,\"à Cder \"&T_stock[[#This Row],[Stock\nLimite]]-T_stock[[#This Row],[Stock\nActuel]],\"\")","v":""}]
["98 72 100","Fil","St Pierre blanc",null,0.7,2.1,0,{"$f":"IF($A88<>0,G88+SUMPRODUCT((T_entrée[Référence]=$A88)*T_entrée[Quantité])-SUMPRODUCT((T_sortie[Référence]=$A88)*T_sortie[Quantité]),0)","v":5},null,{"$f":"IF(H88<I88,\"à Cder \"&T_stock[[#This Row],[Stock\nLimite]]-T_stock[[#This Row],[Stock\nActuel]],\"\")","v":""}]
["98 72 180","Fil","St Pierre noir",null,0.7,2.1,0,{"$f":"IF($A89<>0,G89+SUMPRODUCT((T_entrée[Référence]=$A89)*T_entrée[Quantité])-SUMPRODUCT((T_sortie[Référence]=$A89)*T_sortie[Quantité]),0)","v":5},null,{"$f":"IF(H89<I89,\"à Cder \"&T_stock[[#This Row],[Stock\nLimite]]-T_stock[[#This Row],[Stock\nActuel]],\"\")","v":""}]
["98 72 648","Fil","St Pierre marine",null,0.7,2.1,0,{"$f":"IF($A90<>0,G90+SUMPRODUCT((T_entrée[Référence]=$A90)*T_entrée[Quantité])-SUMPRODUCT((T_sortie[Référence]=$A90)*T_sortie[Quantité]),0)","v":5},null,{"$f":"IF(H90<I90,\"à Cder \"&T_stock[[#This Row],[Stock\nLimite]]-T_stock[[#This Row],[Stock\nActuel]],\"\")","v":""}]
["98752100","Fil","Fusette blanc","1000m",1.25,6,0,{"$f":"IF($A91<>0,G91+SUMPRODUCT((T_entrée[Référence]=$A91)*T_entrée[Quantité])-SUMPRODUCT((T_sortie[Référence]=$A91)*T_sortie[Quantité]),0)","v":5},null,{"$f":"IF(H91<I91,\"à Cder \"&T_stock[[#This Row],[Stock\nLimite]]-T_stock[[#This Row],[Stock\nActuel]],\"\")","v":""}]
["98752180","Fil","Fusette noir","1000m",1.25,6,0,{"$f":"IF($A92<>0,G92+SUMPRODUCT((T_entrée[Référence]=$A92)*T_entrée[Quantité])-SUMPRODUCT((T_sortie[Référence]=$A92)*T_sortie[Quantité]),0)","v":5},null,{"$f":"IF(H92<I92,\"à Cder \"&T_stock[[#This Row],[Stock\nLimite]]-T_stock[[#This Row],[Stock\nActuel]],\"\")","v":""}]
["00000","Motif","Motifs divers (LEFORT)",null,null,0,0,{"$f":"IF($A93<>0,G93+SUMPRODUCT((T_entrée[Référence]=$A93)*T_entrée[Quantité])-SUMPRODUCT((T_sortie[Référence]=$A93)*T_sortie[Quantité]),0)","v":96},null,{"$f":"IF(H93<I93,\"à Cder \"&T_stock[[#This Row],[Stock\nLimite]]-T_stock[[#This Row],[Stock\nActuel]],\"\")","v":""}]
["148/12","Mercerie","Coude Nigal noir","grand",null,4.8,0,{"$f":"IF($A94<>0,G94+SUMPRODUCT((T_entrée[Référence]=$A94)*T_entrée[Quantité])-SUMPRODUCT((T_sortie[Référence]=$A94)*T_sortie[Quantité]),0)","v":2},null,{"$f":"IF(H94<I94,\"à Cder \"&T_stock[[#This Row],[Stock\nLimite]]-T_stock[[#This Row],[Stock\nActuel]],\"\")","v":""}]
["181/12","Mercerie","Coude Kleiber noir imitation cuir","grand",null,5.5,null,{"$f":"IF($A95<>0,G95+SUMPRODUCT((T_entrée[Référence]=$A95)*T_entrée[Quantité])-SUMPRODUCT((T_sortie[Référence]=$A95)*T_sortie[Quantité]),0)","v":1},null,{"$f":"IF(H95<I95,\"à Cder \"&T_stock[[#This Row],[Stock\nLimite]]-T_stock[[#This Row],[Stock\nActuel]],\"\")","v":""}]
["212/12","Mercerie","Coude Kleiber noir daim","grand",null,6.2,null,{"$f":"IF($A96<>0,G96+SUMPRODUCT((T_entrée[Référence]=$A96)*T_entrée[Quantité])-SUMPRODUCT((T_sortie[Référence]=$A96)*T_sortie[Quantité]),0)","v":0},null,{"$f":"IF(H96<I96,\"à Cder \"&T_stock[[#This Row],[Stock\nLimite]]-T_stock[[#This Row],[Stock\nActuel]],\"\")","v":""}]
["213/12","Mercerie","Coude Kleiber gris daim","grand",null,6.2,null,{"$f":"IF($A97<>0,G97+SUMPRODUCT((T_entrée[Référence]=$A97)*T_entrée[Quantité])-SUMPRODUCT((T_sortie[Référence]=$A97)*T_sortie[Quantité]),0)","v":2},null,{"$f":"IF(H97<I97,\"à Cder \"&T_stock[[#This Row],[Stock\nLimite]]-T_stock[[#This Row],[Stock\nActuel]],\"\")","v":""}]
["165/11","Mercerie","Coude Union Knopf kaki",null,null,4.95,null,{"$f":"IF($A98<>0,G98+SUMPRODUCT((T_entrée[Référence]=$A98)*T_entrée[Quantité])-SUMPRODUCT((T_sortie[Référence]=$A98)*T_sortie[Quantité]),0)","v":1},null,{"$f":"IF(H98<I98,\"à Cder \"&T_stock[[#This Row],[Stock\nLimite]]-T_stock[[#This Row],[Stock\nActuel]],\"\")","v":""}]
["150/12","Mercerie","Coude Pronty kaki",null,null,4.5,null,{"$f":"IF($A99<>0,G99+SUMPRODUCT((T_entrée[Référence]=$A99)*T_entrée[Quantité])-SUMPRODUCT((T_sortie[Référence]=$A99)*T_sortie[Quantité]),0)","v":1},null,{"$f":"IF(H99<I99,\"à Cder \"&T_stock[[#This Row],[Stock\nLimite]]-T_stock[[#This Row],[Stock\nActuel]],\"\")","v":""}]
["149/12","Mercerie","Coude Nigal kaki","grand",null,4.9000000000000004,null,{"$f":"IF($A100<>0,G100+SUMPRODUCT((T_entrée[Référence]=$A100)*T_entrée[Quantité])-SUMPRODUCT((T_sortie[Référence]=$A100)*T_sortie[Quantité]),0)","v":1},null,{"$f":"IF(H100<I100,\"à Cder \"&T_stock[[#This Row],[Stock\nLimite]]-T_stock[[#This Row],[Stock\nActuel]],\"\")","v":""}]
["144/11","Mercerie","Coude Nigal vert sapin","grand",null,4.9000000000000004,null,{"$f":"IF($A101<>0,G101+SUMPRODUCT((T_entrée[Référence]=$A101)*T_entrée[Quantité])-SUMPRODUCT((T_sortie[Référence]=$A101)*T_sortie[Quantité]),0)","v":1},null,{"$f":"IF(H101<I101,\"à Cder \"&T_stock[[#This Row],[Stock\nLimite]]-T_stock[[#This Row],[Stock\nActuel]],\"\")","v":""}]
["182/12","Mercerie","Coude Kleiber marron imitation cuir","grand",null,5.5,null,{"$f":"IF($A102<>0,G102+SUMPRODUCT((T_entrée[Référence]=$A102)*T_entrée[Quantité])-SUMPRODUCT((T_sortie[Référence]=$A102)*T_sortie[Quantité]),0)","v":1},null,{"$f":"IF(H102<I102,\"à Cder \"&T_stock[[#This Row],[Stock\nLimite]]-T_stock[[#This Row],[Stock\nActuel]],\"\")","v":""}]
["183/12","Mercerie","Coude Kleiber marine imitation cuir","grand",null,5.5,null,{"$f":"IF($A103<>0,G103+SUMPRODUCT((T_entrée[Référence]=$A103)*T_entrée[Quantité])-SUMPRODUCT((T_sortie[Référence]=$A103)*T_sortie[Quantité]),0)","v":1},null,{"$f":"IF(H103<I103,\"à Cder \"&T_stock[[#This Row],[Stock\nLimite]]-T_stock[[#This Row],[Stock\nActuel]],\"\")","v":""}]
["151/12","Mercerie","Coude Nigal rouge","grand",null,4.9000000000000004,null,{"$f":"IF($A104<>0,G104+SUMPRODUCT((T_entrée[Référence]=$A104)*T_entrée[Quantité])-SUMPRODUCT((T_sortie[Référence]=$A104)*T_sortie[Quantité]),0)","v":1},null,{"$f":"IF(H104<I104,\"à Cder \"&T_stock[[#This Row],[Stock\nLimite]]-T_stock[[#This Row],[Stock\nActuel]],\"\")","v":""}]
["152/12","Mercerie","Coude Pronty beige",null,null,4.5,null,{"$f":"IF($A105<>0,G105+SUMPRODUCT((T_entrée[Référence]=$A105)*T_entrée[Quantité])-SUMPRODUCT((T_sortie[Référence]=$A105)*T_sortie[Quantité]),0)","v":1},null,{"$f":"IF(H105<I105,\"à Cder \"&T_stock[[#This Row],[Stock\nLimite]]-T_stock[[#This Row],[Stock\nActuel]],\"\")","v":""}]
["130/12","Mercerie","Coude Pic&malice beige","grand",null,3.9,null,{"$f":"IF($A106<>0,G106+SUMPRODUCT((T_entrée[Référence]=$A106)*T_entrée[Quantité])-SUMPRODUCT((T_sortie[Référence]=$A106)*T_sortie[Quantité]),0)","v":1},null,{"$f":"IF(H106<I106,\"à Cder \"&T_stock[[#This Row],[Stock\nLimite]]-T_stock[[#This Row],[Stock\nActuel]],\"\")","v":""}]
["123/11","Mercerie","Thermocollant quick vert foncé",null,null,4.1500000000000004,null,1,null,{"$f":"IF(H107<I107,\"à Cder \"&T_stock[[#This Row],[Stock\nLimite]]-T_stock[[#This Row],[Stock\nActuel]],\"\")","v":""}]
["126/11","Mercerie","Thermocollant quick marron foncé",null,null,4.2,null,1,null,{"$f":"IF(H108<I108,\"à Cder \"&T_stock[[#This Row],[Stock\nLimite]]-T_stock[[#This Row],[Stock\nActuel]],\"\")","v":""}]
["128/11","Mercerie","Thermocollant quick bordeaux",null,null,4.1500000000000004,null,{"$f":"IF($A109<>0,G109+SUMPRODUCT((T_entrée[Référence]=$A109)*T_entrée[Quantité])-SUMPRODUCT((T_sortie[Référence]=$A109)*T_sortie[Quantité]),0)","v":0},null,{"$f":"IF(H109<I109,\"à Cder \"&T_stock[[#This Row],[Stock\nLimite]]-T_stock[[#This Row],[Stock\nActuel]],\"\")","v":""}]
["129/11","Mercerie","Thermocollant quick gris foncé",null,null,4.1500000000000004,null,{"$f":"IF($A110<>0,G110+SUMPRODUCT((T_entrée[Référence]=$A110)*T_entrée[Quantité])-SUMPRODUCT((T_sortie[Référence]=$A110)*T_sortie[Quantité]),0)","v":0},null,{"$f":"IF(H110<I110,\"à Cder \"&T_stock[[#This Row],[Stock\nLimite]]-T_stock[[#This Row],[Stock\nActuel]],\"\")","v":""}]
["134/11","Mercerie","Thermocollant quick ciel jean's",null,null,4.5,null,{"$f":"IF($A111<>0,G111+SUMPRODUCT((T_entrée[Référence]=$A111)*T_entrée[Quantité])-SUMPRODUCT((T_sortie[Référence]=$A111)*T_sortie[Quantité]),0)","v":0},null,{"$f":"IF(H111<I111,\"à Cder \"&T_stock[[#This Row],[Stock\nLimite]]-T_stock[[#This Row],[Stock\nActuel]],\"\")","v":""}]
["135/12","Mercerie","Thermocollant quick jean's",null,null,4.5,null,{"$f":"IF($A112<>0,G112+SUMPRODUCT((T_entrée[Référence]=$A112)*T_entrée[Quantité])-SUMPRODUCT((T_sortie[Référence]=$A112)*T_sortie[Quantité]),0)","v":0},null,{"$f":"IF(H112<I112,\"à Cder \"&T_stock[[#This Row],[Stock\nLimite]]-T_stock[[#This Row],[Stock\nActuel]],\"\")","v":""}]
["132/12","Mercerie","Thermcollant quick marine",null,null,4.2,null,{"$f":"IF($A113<>0,G113+SUMPRODUCT((T_entrée[Référence]=$A113)*T_entrée[Quantité])-SUMPRODUCT((T_sortie[Référence]=$A113)*T_sortie[Quantité]),0)","v":0},null,{"$f":"IF(H113<I113,\"à Cder \"&T_stock[[#This Row],[Stock\nLimite]]-T_stock[[#This Row],[Stock\nActuel]],\"\")","v":""}]
["136/12","Mercerie","Thermocollant quick écru",null,null,4.2,null,{"$f":"IF($A114<>0,G114+SUMPRODUCT((T_entrée[Référence]=$A114)*T_entrée[Quantité])-SUMPRODUCT((T_sortie[Référence]=$A114)*T_sortie[Quantité]),0)","v":1},null,{"$f":"IF(H114<I114,\"à Cder \"&T_stock[[#This Row],[Stock\nLimite]]-T_stock[[#This Row],[Stock\nActuel]],\"\")","v":""}]
["138/12","Mercerie","Thermocollant quick blanc",null,null,4.2,null,{"$f":"IF($A115<>0,G115+SUMPRODUCT((T_entrée[Référence]=$A115)*T_entrée[Quantité])-SUMPRODUCT((T_sortie[Référence]=$A115)*T_sortie[Quantité]),0)","v":1},null,{"$f":"IF(H115<I115,\"à Cder \"&T_stock[[#This Row],[Stock\nLimite]]-T_stock[[#This Row],[Stock\nActuel]],\"\")","v":""}]
["127/12","Mercerie","Thermocollant quick beige",null,null,4.2,null,{"$f":"IF($A116<>0,G116+SUMPRODUCT((T_entrée[Référence]=$A116)*T_entrée[Quantité])-SUMPRODUCT((T_sortie[Référence]=$A116)*T_sortie[Quantité]),0)","v":1},null,{"$f":"IF(H116<I116,\"à Cder \"&T_stock[[#This Row],[Stock\nLimite]]-T_stock[[#This Row],[Stock\nActuel]],\"\")","v":""}]
["133/12","Mercerie","Thermocollant quick gris clair",null,null,4.2,null,{"$f":"IF($A117<>0,G117+SUMPRODUCT((T_entrée[Référence]=$A117)*T_entrée[Quantité])-SUMPRODUCT((T_sortie[Référence]=$A117)*T_sortie[Quantité]),0)","v":1},null,{"$f":"IF(H117<I117,\"à Cder \"&T_stock[[#This Row],[Stock\nLimite]]-T_stock[[#This Row],[Stock\nActuel]],\"\")","v":""}]
["090/12","Mercerie","Aiguilles à main ","1/5",null,3,null,{"$f":"IF($A118<>0,G118+SUMPRODUCT((T_entrée[Référence]=$A118)*T_entrée[Quantité])-SUMPRODUCT((T_sortie[Référence]=$A118)*T_sortie[Quantité]),0)","v":3},null,{"$f":"IF(H118<I118,\"à Cder \"&T_stock[[#This Row],[Stock\nLimite]]-T_stock[[#This Row],[Stock\nActuel]],\"\")","v":""}]
["091/12","Mercerie","Aiguilles à main ","3/9",null,3,null,{"$f":"IF($A119<>0,G119+SUMPRODUCT((T_entrée[Référence]=$A119)*T_entrée[Quantité])-SUMPRODUCT((T_sortie[Référence]=$A119)*T_sortie[Quantité]),0)","v":3},null,{"$f":"IF(H119<I119,\"à Cder \"&T_stock[[#This Row],[Stock\nLimite]]-T_stock[[#This Row],[Stock\nActuel]],\"\")","v":""}]
["093/12","Mercerie","Aiguilles à main ",7,null,3,null,{"$f":"IF($A120<>0,G120+SUMPRODUCT((T_entrée[Référence]=$A120)*T_entrée[Quantité])-SUMPRODUCT((T_sortie[Référence]=$A120)*T_sortie[Quantité]),0)","v":3},null,{"$f":"IF(H120<I120,\"à Cder \"&T_stock[[#This Row],[Stock\nLimite]]-T_stock[[#This Row],[Stock\nActuel]],\"\")","v":""}]
["094/12","Mercerie","Aiguilles à main ","5/10",null,3,null,{"$f":"IF($A121<>0,G121+SUMPRODUCT((T_entrée[Référence]=$A121)*T_entrée[Quantité])-SUMPRODUCT((T_sortie[Référence]=$A121)*T_sortie[Quantité]),0)","v":3},null,{"$f":"IF(H121<I121,\"à Cder \"&T_stock[[#This Row],[Stock\nLimite]]-T_stock[[#This Row],[Stock\nActuel]],\"\")","v":""}]
["245/11","Mercerie","Aiguilles machine",70,null,7.8,null,{"$f":"IF($A122<>0,G122+SUMPRODUCT((T_entrée[Référence]=$A122)*T_entrée[Quantité])-SUMPRODUCT((T_sortie[Référence]=$A122)*T_sortie[Quantité]),0)","v":1},null,{"$f":"IF(H122<I122,\"à Cder \"&T_stock[[#This Row],[Stock\nLimite]]-T_stock[[#This Row],[Stock\nActuel]],\"\")","v":""}]
["250/12","Mercerie","Aiguilles machine","70 80 90",null,8,null,{"$f":"IF($A123<>0,G123+SUMPRODUCT((T_entrée[Référence]=$A123)*T_entrée[Quantité])-SUMPRODUCT((T_sortie[Référence]=$A123)*T_sortie[Quantité]),0)","v":1},null,{"$f":"IF(H123<I123,\"à Cder \"&T_stock[[#This Row],[Stock\nLimite]]-T_stock[[#This Row],[Stock\nActuel]],\"\")","v":""}]
["251/12","Mercerie","Aiguilles machine",80,null,8,null,{"$f":"IF($A124<>0,G124+SUMPRODUCT((T_entrée[Référence]=$A124)*T_entrée[Quantité])-SUMPRODUCT((T_sortie[Référence]=$A124)*T_sortie[Quantité]),0)","v":2},null,{"$f":"IF(H124<I124,\"à Cder \"&T_stock[[#This Row],[Stock\nLimite]]-T_stock[[#This Row],[Stock\nActuel]],\"\")","v":""}]
["082/12","Mercerie","Epingles en acier n°4",null,null,3.2,null,{"$f":"IF($A125<>0,G125+SUMPRODUCT((T_entrée[Référence]=$A125)*T_entrée[Quantité])-SUMPRODUCT((T_sortie[Référence]=$A125)*T_sortie[Quantité]),0)","v":3},null,{"$f":"IF(H125<I125,\"à Cder \"&T_stock[[#This Row],[Stock\nLimite]]-T_stock[[#This Row],[Stock\nActuel]],\"\")","v":""}]
["140/12","Mercerie","Epingles tête verre (Lefort)",null,null,5.5,null,{"$f":"IF($A126<>0,G126+SUMPRODUCT((T_entrée[Référence]=$A126)*T_entrée[Quantité])-SUMPRODUCT((T_sortie[Référence]=$A126)*T_sortie[Quantité]),0)","v":2},null,{"$f":"IF(H126<I126,\"à Cder \"&T_stock[[#This Row],[Stock\nLimite]]-T_stock[[#This Row],[Stock\nActuel]],\"\")","v":""}]
["051/12","Mercerie","Agrafes pantalon x3 argent",null,null,2.2000000000000002,null,{"$f":"IF($A127<>0,G127+SUMPRODUCT((T_entrée[Référence]=$A127)*T_entrée[Quantité])-SUMPRODUCT((T_sortie[Référence]=$A127)*T_sortie[Quantité]),0)","v":2},null,{"$f":"IF(H127<I127,\"à Cder \"&T_stock[[#This Row],[Stock\nLimite]]-T_stock[[#This Row],[Stock\nActuel]],\"\")","v":""}]
["050/12","Mercerie","Agrafes pantalon x3 noir",null,null,2.2000000000000002,null,{"$f":"IF($A128<>0,G128+SUMPRODUCT((T_entrée[Référence]=$A128)*T_entrée[Quantité])-SUMPRODUCT((T_sortie[Référence]=$A128)*T_sortie[Quantité]),0)","v":2},null,{"$f":"IF(H128<I128,\"à Cder \"&T_stock[[#This Row],[Stock\nLimite]]-T_stock[[#This Row],[Stock\nActuel]],\"\")","v":""}]
["081/12","Mercerie","Agrafes à ressort x14 noir",null,null,2.5,null,{"$f":"IF($A129<>0,G129+SUMPRODUCT((T_entrée[Référence]=$A129)*T_entrée[Quantité])-SUMPRODUCT((T_sortie[Référence]=$A129)*T_sortie[Quantité]),0)","v":4},null,{"$f":"IF(H129<I129,\"à Cder \"&T_stock[[#This Row],[Stock\nLimite]]-T_stock[[#This Row],[Stock\nActuel]],\"\")","v":""}]
["080/12","Mercerie","Agrafes à ressort x14 argent",null,null,2.5,null,0,null,{"$f":"IF(H130<I130,\"à Cder \"&T_stock[[#This Row],[Stock\nLimite]]-T_stock[[#This Row],[Stock\nActuel]],\"\")","v":""}]
["099/11","Mercerie","Agrafes à jupe x6 noir",null,null,3.6,null,{"$f":"IF($A131<>0,G131+SUMPRODUCT((T_entrée[Référence]=$A131)*T_entrée[Quantité])-SUMPRODUCT((T_sortie[Référence]=$A131)*T_sortie[Quantité]),0)","v":2},null,{"$f":"IF(H131<I131,\"à Cder \"&T_stock[[#This Row],[Stock\nLimite]]-T_stock[[#This Row],[Stock\nActuel]],\"\")","v":""}]
["080/11","Mercerie","Boutons pression argent divers",null,null,2.8,null,{"$f":"IF($A132<>0,G132+SUMPRODUCT((T_entrée[Référence]=$A132)*T_entrée[Quantité])-SUMPRODUCT((T_sortie[Référence]=$A132)*T_sortie[Quantité]),0)","v":3},null,{"$f":"IF(H132<I132,\"à Cder \"&T_stock[[#This Row],[Stock\nLimite]]-T_stock[[#This Row],[Stock\nActuel]],\"\")","v":""}]
["133/11","Mercerie","Boutons pression Prym x4","17mm",null,4.3,null,0,null,{"$f":"IF(H133<I133,\"à Cder \"&T_stock[[#This Row],[Stock\nLimite]]-T_stock[[#This Row],[Stock\nActuel]],\"\")","v":""}]
["085/12","Mercerie","Boutons pression x6 noir","13mm",null,2.8,null,{"$f":"IF($A134<>0,G134+SUMPRODUCT((T_entrée[Référence]=$A134)*T_entrée[Quantité])-SUMPRODUCT((T_sortie[Référence]=$A134)*T_sortie[Quantité]),0)","v":1},null,{"$f":"IF(H134<I134,\"à Cder \"&T_stock[[#This Row],[Stock\nLimite]]-T_stock[[#This Row],[Stock\nActuel]],\"\")","v":""}]
["084/12","Mercerie","Boutons pression Pic&malice x10","11mm",null,2.6,null,{"$f":"IF($A135<>0,G135+SUMPRODUCT((T_entrée[Référence]=$A135)*T_entrée[Quantité])-SUMPRODUCT((T_sortie[Référence]=$A135)*T_sortie[Quantité]),0)","v":2},null,{"$f":"IF(H135<I135,\"à Cder \"&T_stock[[#This Row],[Stock\nLimite]]-T_stock[[#This Row],[Stock\nActuel]],\"\")","v":""}]
["135/11","Mercerie","Boutons pression Prym x20 noir","9mm",null,4,null,{"$f":"IF($A136<>0,G136+SUMPRODUCT((T_entrée[Référence]=$A136)*T_entrée[Quantité])-SUMPRODUCT((T_sortie[Référence]=$A136)*T_sortie[Quantité]),0)","v":2},null,{"$f":"IF(H136<I136,\"à Cder \"&T_stock[[#This Row],[Stock\nLimite]]-T_stock[[#This Row],[Stock\nActuel]],\"\")","v":""}]
["096/11","Mercerie","Boutons pression Prym x12 noir","7mm",null,3.1,null,{"$f":"IF($A137<>0,G137+SUMPRODUCT((T_entrée[Référence]=$A137)*T_entrée[Quantité])-SUMPRODUCT((T_sortie[Référence]=$A137)*T_sortie[Quantité]),0)","v":2},null,{"$f":"IF(H137<I137,\"à Cder \"&T_stock[[#This Row],[Stock\nLimite]]-T_stock[[#This Row],[Stock\nActuel]],\"\")","v":""}]
["184/10","Mercerie","Bouton magnétique Bohin","18mm",null,6,null,{"$f":"IF($A138<>0,G138+SUMPRODUCT((T_entrée[Référence]=$A138)*T_entrée[Quantité])-SUMPRODUCT((T_sortie[Référence]=$A138)*T_sortie[Quantité]),0)","v":2},null,{"$f":"IF(H138<I138,\"à Cder \"&T_stock[[#This Row],[Stock\nLimite]]-T_stock[[#This Row],[Stock\nActuel]],\"\")","v":""}]
["096/10","Mercerie","Boutons pression Prym x24 noir","7mm",null,3.1,null,{"$f":"IF($A139<>0,G139+SUMPRODUCT((T_entrée[Référence]=$A139)*T_entrée[Quantité])-SUMPRODUCT((T_sortie[Référence]=$A139)*T_sortie[Quantité]),0)","v":1},null,{"$f":"IF(H139<I139,\"à Cder \"&T_stock[[#This Row],[Stock\nLimite]]-T_stock[[#This Row],[Stock\nActuel]],\"\")","v":""}]
["097/10","Mercerie","Boutons pression x18 noir","10mm",null,3.1,null,{"$f":"IF($A140<>0,G140+SUMPRODUCT((T_entrée[Référence]=$A140)*T_entrée[Quantité])-SUMPRODUCT((T_sortie[Référence]=$A140)*T_sortie[Quantité]),0)","v":1},null,{"$f":"IF(H140<I140,\"à Cder \"&T_stock[[#This Row],[Stock\nLimite]]-T_stock[[#This Row],[Stock\nActuel]],\"\")","v":""}]
["101/12","Mercerie","Boutons pression Prym x18 transparent","10mm",null,3.2,null,{"$f":"IF($A141<>0,G141+SUMPRODUCT((T_entrée[Référence]=$A141)*T_entrée[Quantité])-SUMPRODUCT((T_sortie[Référence]=$A141)*T_sortie[Quantité]),0)","v":1},null,{"$f":"IF(H141<I141,\"à Cder \"&T_stock[[#This Row],[Stock\nLimite]]-T_stock[[#This Row],[Stock\nActuel]],\"\")","v":""}]
["096/12","Mercerie","Boutons pression Prym x24 transparent","7mm",null,3.2,null,{"$f":"IF($A142<>0,G142+SUMPRODUCT((T_entrée[Référence]=$A142)*T_entrée[Quantité])-SUMPRODUCT((T_sortie[Référence]=$A142)*T_sortie[Quantité]),0)","v":1},null,{"$f":"IF(H142<I142,\"à Cder \"&T_stock[[#This Row],[Stock\nLimite]]-T_stock[[#This Row],[Stock\nActuel]],\"\")","v":""}]
["158/10","Outils","Ampoule",null,null,4.9000000000000004,null,{"$f":"IF($A143<>0,G143+SUMPRODUCT((T_entrée[Référence]=$A143)*T_entrée[Quantité])-SUMPRODUCT((T_sortie[Référence]=$A143)*T_sortie[Quantité]),0)","v":2},null,{"$f":"IF(H143<I143,\"à Cder \"&T_stock[[#This Row],[Stock\nLimite]]-T_stock[[#This Row],[Stock\nActuel]],\"\")","v":""}]
["158/12","Outils","Roulette à patron",null,null,5.3,null,{"$f":"IF($A144<>0,G144+SUMPRODUCT((T_entrée[Référence]=$A144)*T_entrée[Quantité])-SUMPRODUCT((T_sortie[Référence]=$A144)*T_sortie[Quantité]),0)","v":1},null,{"$f":"IF(H144<I144,\"à Cder \"&T_stock[[#This Row],[Stock\nLimite]]-T_stock[[#This Row],[Stock\nActuel]],\"\")","v":""}]
["196/12","Mercerie","Attache soutien-gorge blanc","petit",null,3.8,null,{"$f":"IF($A145<>0,G145+SUMPRODUCT((T_entrée[Référence]=$A145)*T_entrée[Quantité])-SUMPRODUCT((T_sortie[Référence]=$A145)*T_sortie[Quantité]),0)","v":1},null,{"$f":"IF(H145<I145,\"à Cder \"&T_stock[[#This Row],[Stock\nLimite]]-T_stock[[#This Row],[Stock\nActuel]],\"\")","v":""}]
["196/11","Mercerie","Attache soutien-gorge ivoire","petit",null,3.8,null,{"$f":"IF($A146<>0,G146+SUMPRODUCT((T_entrée[Référence]=$A146)*T_entrée[Quantité])-SUMPRODUCT((T_sortie[Référence]=$A146)*T_sortie[Quantité]),0)","v":1},null,{"$f":"IF(H146<I146,\"à Cder \"&T_stock[[#This Row],[Stock\nLimite]]-T_stock[[#This Row],[Stock\nActuel]],\"\")","v":""}]
["196/10","Mercerie","Attache soutien-gorge noir","petit",null,3.8,null,{"$f":"IF($A147<>0,G147+SUMPRODUCT((T_entrée[Référence]=$A147)*T_entrée[Quantité])-SUMPRODUCT((T_sortie[Référence]=$A147)*T_sortie[Quantité]),0)","v":5},null,{"$f":"IF(H147<I147,\"à Cder \"&T_stock[[#This Row],[Stock\nLimite]]-T_stock[[#This Row],[Stock\nActuel]],\"\")","v":""}]
["123/13","Mercerie","Attache soutien-gorge blanc","moyen",null,4.2,null,{"$f":"IF($A148<>0,G148+SUMPRODUCT((T_entrée[Référence]=$A148)*T_entrée[Quantité])-SUMPRODUCT((T_sortie[Référence]=$A148)*T_sortie[Quantité]),0)","v":1},null,{"$f":"IF(H148<I148,\"à Cder \"&T_stock[[#This Row],[Stock\nLimite]]-T_stock[[#This Row],[Stock\nActuel]],\"\")","v":""}]
["123/14","Mercerie","Attache soutien-gorge ivoire","moyen",null,4.2,null,{"$f":"IF($A149<>0,G149+SUMPRODUCT((T_entrée[Référence]=$A149)*T_entrée[Quantité])-SUMPRODUCT((T_sortie[Référence]=$A149)*T_sortie[Quantité]),0)","v":3},null,{"$f":"IF(H149<I149,\"à Cder \"&T_stock[[#This Row],[Stock\nLimite]]-T_stock[[#This Row],[Stock\nActuel]],\"\")","v":""}]
["123/15","Mercerie","Attache soutien-gorge noir","moyen",null,4.2,null,{"$f":"IF($A150<>0,G150+SUMPRODUCT((T_entrée[Référence]=$A150)*T_entrée[Quantité])-SUMPRODUCT((T_sortie[Référence]=$A150)*T_sortie[Quantité]),0)","v":2},null,{"$f":"IF(H150<I150,\"à Cder \"&T_stock[[#This Row],[Stock\nLimite]]-T_stock[[#This Row],[Stock\nActuel]],\"\")","v":""}]
["124/13","Mercerie","Attache soutien-gorge blanc","grand",null,4.8,null,{"$f":"IF($A151<>0,G151+SUMPRODUCT((T_entrée[Référence]=$A151)*T_entrée[Quantité])-SUMPRODUCT((T_sortie[Référence]=$A151)*T_sortie[Quantité]),0)","v":1},null,{"$f":"IF(H151<I151,\"à Cder \"&T_stock[[#This Row],[Stock\nLimite]]-T_stock[[#This Row],[Stock\nActuel]],\"\")","v":""}]
["124/14","Mercerie","Attache soutien-gorge ivoire","grand",null,4.8,null,{"$f":"IF($A152<>0,G152+SUMPRODUCT((T_entrée[Référence]=$A152)*T_entrée[Quantité])-SUMPRODUCT((T_sortie[Référence]=$A152)*T_sortie[Quantité]),0)","v":1},null,{"$f":"IF(H152<I152,\"à Cder \"&T_stock[[#This Row],[Stock\nLimite]]-T_stock[[#This Row],[Stock\nActuel]],\"\")","v":""}]
["124/15","Mercerie","Attache soutien-gorge noir","grand",null,4.8,null,{"$f":"IF($A153<>0,G153+SUMPRODUCT((T_entrée[Référence]=$A153)*T_entrée[Quantité])-SUMPRODUCT((T_sortie[Référence]=$A153)*T_sortie[Quantité]),0)","v":1},null,{"$f":"IF(H153<I153,\"à Cder \"&T_stock[[#This Row],[Stock\nLimite]]-T_stock[[#This Row],[Stock\nActuel]],\"\")","v":""}]
["190/12","Mercerie","Bord manche marine foncé",null,null,5.9,null,{"$f":"IF($A154<>0,G154+SUMPRODUCT((T_entrée[Référence]=$A154)*T_entrée[Quantité])-SUMPRODUCT((T_sortie[Référence]=$A154)*T_sortie[Quantité]),0)","v":1},null,{"$f":"IF(H154<I154,\"à Cder \"&T_stock[[#This Row],[Stock\nLimite]]-T_stock[[#This Row],[Stock\nActuel]],\"\")","v":""}]
["190/13","Mercerie","Bord manche marine clair",null,null,5.9,null,{"$f":"IF($A155<>0,G155+SUMPRODUCT((T_entrée[Référence]=$A155)*T_entrée[Quantité])-SUMPRODUCT((T_sortie[Référence]=$A155)*T_sortie[Quantité]),0)","v":1},null,{"$f":"IF(H155<I155,\"à Cder \"&T_stock[[#This Row],[Stock\nLimite]]-T_stock[[#This Row],[Stock\nActuel]],\"\")","v":""}]
["190/14","Mercerie","Bord manche marron",null,null,5.9,null,{"$f":"IF($A156<>0,G156+SUMPRODUCT((T_entrée[Référence]=$A156)*T_entrée[Quantité])-SUMPRODUCT((T_sortie[Référence]=$A156)*T_sortie[Quantité]),0)","v":1},null,{"$f":"IF(H156<I156,\"à Cder \"&T_stock[[#This Row],[Stock\nLimite]]-T_stock[[#This Row],[Stock\nActuel]],\"\")","v":""}]
["190/15","Mercerie","Bord manche gris clair",null,null,6.2,null,{"$f":"IF($A157<>0,G157+SUMPRODUCT((T_entrée[Référence]=$A157)*T_entrée[Quantité])-SUMPRODUCT((T_sortie[Référence]=$A157)*T_sortie[Quantité]),0)","v":1},null,{"$f":"IF(H157<I157,\"à Cder \"&T_stock[[#This Row],[Stock\nLimite]]-T_stock[[#This Row],[Stock\nActuel]],\"\")","v":""}]
["190/16","Mercerie","Bord manche écru",null,null,6.2,null,{"$f":"IF($A158<>0,G158+SUMPRODUCT((T_entrée[Référence]=$A158)*T_entrée[Quantité])-SUMPRODUCT((T_sortie[Référence]=$A158)*T_sortie[Quantité]),0)","v":1},null,{"$f":"IF(H158<I158,\"à Cder \"&T_stock[[#This Row],[Stock\nLimite]]-T_stock[[#This Row],[Stock\nActuel]],\"\")","v":""}]
["293/12","Mercerie","Bord bas blanc",null,null,7.8,null,{"$f":"IF($A159<>0,G159+SUMPRODUCT((T_entrée[Référence]=$A159)*T_entrée[Quantité])-SUMPRODUCT((T_sortie[Référence]=$A159)*T_sortie[Quantité]),0)","v":1},null,{"$f":"IF(H159<I159,\"à Cder \"&T_stock[[#This Row],[Stock\nLimite]]-T_stock[[#This Row],[Stock\nActuel]],\"\")","v":""}]
["171/12","Laine","Bobinettes pour tricot","petit",null,5.5,null,{"$f":"IF($A160<>0,G160+SUMPRODUCT((T_entrée[Référence]=$A160)*T_entrée[Quantité])-SUMPRODUCT((T_sortie[Référence]=$A160)*T_sortie[Quantité]),0)","v":2},null,{"$f":"IF(H160<I160,\"à Cder \"&T_stock[[#This Row],[Stock\nLimite]]-T_stock[[#This Row],[Stock\nActuel]],\"\")","v":""}]
["171/13","Laine","Bobinettes pour tricot","moyen",null,5.5,null,{"$f":"IF($A161<>0,G161+SUMPRODUCT((T_entrée[Référence]=$A161)*T_entrée[Quantité])-SUMPRODUCT((T_sortie[Référence]=$A161)*T_sortie[Quantité]),0)","v":1},null,{"$f":"IF(H161<I161,\"à Cder \"&T_stock[[#This Row],[Stock\nLimite]]-T_stock[[#This Row],[Stock\nActuel]],\"\")","v":""}]
["074/12","Laine","Aiguilles à tricoter 2,5mm","30cm",null,3,null,{"$f":"IF($A162<>0,G162+SUMPRODUCT((T_entrée[Référence]=$A162)*T_entrée[Quantité])-SUMPRODUCT((T_sortie[Référence]=$A162)*T_sortie[Quantité]),0)","v":3},null,{"$f":"IF(H162<I162,\"à Cder \"&T_stock[[#This Row],[Stock\nLimite]]-T_stock[[#This Row],[Stock\nActuel]],\"\")","v":""}]
["100/12","Laine","Aiguilles à tricoter 3mm","30cm",null,3.4,null,{"$f":"IF($A163<>0,G163+SUMPRODUCT((T_entrée[Référence]=$A163)*T_entrée[Quantité])-SUMPRODUCT((T_sortie[Référence]=$A163)*T_sortie[Quantité]),0)","v":3},null,{"$f":"IF(H163<I163,\"à Cder \"&T_stock[[#This Row],[Stock\nLimite]]-T_stock[[#This Row],[Stock\nActuel]],\"\")","v":""}]
["100/13","Laine"," Aiguilles à tricoter 3,5mm","30cm",null,3.5,null,{"$f":"IF($A164<>0,G164+SUMPRODUCT((T_entrée[Référence]=$A164)*T_entrée[Quantité])-SUMPRODUCT((T_sortie[Référence]=$A164)*T_sortie[Quantité]),0)","v":3},null,{"$f":"IF(H164<I164,\"à Cder \"&T_stock[[#This Row],[Stock\nLimite]]-T_stock[[#This Row],[Stock\nActuel]],\"\")","v":""}]
["131/14","Laine","Aiguilles à tricoter 4mm","30cm",null,4.2,null,{"$f":"IF($A165<>0,G165+SUMPRODUCT((T_entrée[Référence]=$A165)*T_entrée[Quantité])-SUMPRODUCT((T_sortie[Référence]=$A165)*T_sortie[Quantité]),0)","v":3},null,{"$f":"IF(H165<I165,\"à Cder \"&T_stock[[#This Row],[Stock\nLimite]]-T_stock[[#This Row],[Stock\nActuel]],\"\")","v":""}]
["17 80","Mercerie","Baleine soutien-gorge",80,null,13.5,null,{"$f":"IF($A166<>0,G166+SUMPRODUCT((T_entrée[Référence]=$A166)*T_entrée[Quantité])-SUMPRODUCT((T_sortie[Référence]=$A166)*T_sortie[Quantité]),0)","v":0},null,{"$f":"IF(H166<I166,\"à Cder \"&T_stock[[#This Row],[Stock\nLimite]]-T_stock[[#This Row],[Stock\nActuel]],\"\")","v":""}]
["17 90","Mercerie","Baleine soutien-gorge",90,null,13.5,null,{"$f":"IF($A167<>0,G167+SUMPRODUCT((T_entrée[Référence]=$A167)*T_entrée[Quantité])-SUMPRODUCT((T_sortie[Référence]=$A167)*T_sortie[Quantité]),0)","v":0},null,{"$f":"IF(H167<I167,\"à Cder \"&T_stock[[#This Row],[Stock\nLimite]]-T_stock[[#This Row],[Stock\nActuel]],\"\")","v":""}]
["17 85","Mercerie","Baleine soutien-gorge",85,null,13.5,null,{"$f":"IF($A168<>0,G168+SUMPRODUCT((T_entrée[Référence]=$A168)*T_entrée[Quantité])-SUMPRODUCT((T_sortie[Référence]=$A168)*T_sortie[Quantité]),0)","v":0},null,{"$f":"IF(H168<I168,\"à Cder \"&T_stock[[#This Row],[Stock\nLimite]]-T_stock[[#This Row],[Stock\nActuel]],\"\")","v":""}]
["17 105","Mercerie","Baleine soutien-gorge",105,null,13.5,null,{"$f":"IF($A169<>0,G169+SUMPRODUCT((T_entrée[Référence]=$A169)*T_entrée[Quantité])-SUMPRODUCT((T_sortie[Référence]=$A169)*T_sortie[Quantité]),0)","v":0},null,{"$f":"IF(H169<I169,\"à Cder \"&T_stock[[#This Row],[Stock\nLimite]]-T_stock[[#This Row],[Stock\nActuel]],\"\")","v":""}]
["17 110","Mercerie","Baleine soutien-gorge",110,null,13.5,null,{"$f":"IF($A170<>0,G170+SUMPRODUCT((T_entrée[Référence]=$A170)*T_entrée[Quantité])-SUMPRODUCT((T_sortie[Référence]=$A170)*T_sortie[Quantité]),0)","v":0},null,{"$f":"IF(H170<I170,\"à Cder \"&T_stock[[#This Row],[Stock\nLimite]]-T_stock[[#This Row],[Stock\nActuel]],\"\")","v":""}]
["17 115","Mercerie","Baleine soutien-gorge",115,null,13.5,null,{"$f":"IF($A171<>0,G171+SUMPRODUCT((T_entrée[Référence]=$A171)*T_entrée[Quantité])-SUMPRODUCT((T_sortie[Référence]=$A171)*T_sortie[Quantité]),0)","v":0},null,{"$f":"IF(H171<I171,\"à Cder \"&T_stock[[#This Row],[Stock\nLimite]]-T_stock[[#This Row],[Stock\nActuel]],\"\")","v":""}]
["372/11","Mercerie","Ampliforme mousse x2 n°290",40,null,12.4,null,{"$f":"IF($A172<>0,G172+SUMPRODUCT((T_entrée[Référence]=$A172)*T_entrée[Quantité])-SUMPRODUCT((T_sortie[Référence]=$A172)*T_sortie[Quantité]),0)","v":0},null,{"$f":"IF(H172<I172,\"à Cder \"&T_stock[[#This Row],[Stock\nLimite]]-T_stock[[#This Row],[Stock\nActuel]],\"\")","v":""}]
["372/12","Mercerie","Ampliforme mousse x2 n°290",42,null,12.4,null,{"$f":"IF($A173<>0,G173+SUMPRODUCT((T_entrée[Référence]=$A173)*T_entrée[Quantité])-SUMPRODUCT((T_sortie[Référence]=$A173)*T_sortie[Quantité]),0)","v":0},null,{"$f":"IF(H173<I173,\"à Cder \"&T_stock[[#This Row],[Stock\nLimite]]-T_stock[[#This Row],[Stock\nActuel]],\"\")","v":""}]
["277/12","Mercerie","Ampliforme mousse x2 n°291",1,null,8.5,null,{"$f":"IF($A174<>0,G174+SUMPRODUCT((T_entrée[Référence]=$A174)*T_entrée[Quantité])-SUMPRODUCT((T_sortie[Référence]=$A174)*T_sortie[Quantité]),0)","v":0},null,{"$f":"IF(H174<I174,\"à Cder \"&T_stock[[#This Row],[Stock\nLimite]]-T_stock[[#This Row],[Stock\nActuel]],\"\")","v":""}]
["255/11","Mercerie","Ampliforme mousse x2 n°242",null,null,null,null,{"$f":"IF($A175<>0,G175+SUMPRODUCT((T_entrée[Référence]=$A175)*T_entrée[Quantité])-SUMPRODUCT((T_sortie[Référence]=$A175)*T_sortie[Quantité]),0)","v":0},null,{"$f":"IF(H175<I175,\"à Cder \"&T_stock[[#This Row],[Stock\nLimite]]-T_stock[[#This Row],[Stock\nActuel]],\"\")","v":""}]
[null,"Total",{"$f":"SUBTOTAL(103,[Désignation])","v":171},null,null,null,null,{"$f":"SUBTOTAL(109,[Stock\nActuel])","v":1141}]

{"sheet":"Sortie","index":1,"n_rows":11,"n_cols":10,"rows_kept":11,"cut":false,"hidden":false,"merged":[[1,0,1,9]]}
[]
["Sortie du stock"]
[]
["N°","Référence","Désignation","Taille","Prix Vente","Quantité","Date","Prix Total","Paiement","Remise"]
[{"$f":"IF(ISNUMBER(A4),A4+1,1)","v":1},3394,{"$f":"IF(B5<>\"\",VLOOKUP(B5,T_entrée[],4,FALSE),\"\")","v":{"$error":"#N/A"}},{"$f":"IF(B5<>\"\",VLOOKUP(B5,T_entrée[],5,FALSE),\"\")","v":{"$error":"#N/A"}},{"$f":"IF(B5<>\"\",VLOOKUP(B5,T_entrée[],7,FALSE),\"\")","v":{"$error":"#N/A"}},2,null,{"$f":"IF(COUNT(E5:F5)=2,E5*F5,0)","v":0}]
[2,3016,{"$f":"IF(B6<>\"\",VLOOKUP(B6,T_entrée[],4,FALSE),\"\")","v":{"$error":"#N/A"}},{"$f":"IF(B6<>\"\",VLOOKUP(B6,T_entrée[],5,FALSE),\"\")","v":{"$error":"#N/A"}},{"$f":"IF(B6<>\"\",VLOOKUP(B6,T_entrée[],7,FALSE),\"\")","v":{"$error":"#N/A"}},5,null,0]
[3,"290663",{"$f":"IF(B7<>\"\",VLOOKUP(B7,T_entrée[],4,FALSE),\"\")","v":"Ovale noir"},{"$f":"IF(B7<>\"\",VLOOKUP(B7,T_entrée[],5,FALSE),\"\")","v":25},{"$f":"IF(B7<>\"\",VLOOKUP(B7,T_entrée[],7,FALSE),\"\")","v":1.6},4,null,6.4]
[4,"250654",{"$f":"IF(B8<>\"\",VLOOKUP(B8,T_entrée[],4,FALSE),\"\")","v":"Petit rond gris clair et foncé"},{"$f":"IF(B8<>\"\",VLOOKUP(B8,T_entrée[],5,FALSE),\"\")","v":18},{"$f":"IF(B8<>\"\",VLOOKUP(B8,T_entrée[],7,FALSE),\"\")","v":1.2},4,null,4.8]
[5,"17 80",{"$f":"IF(B9<>\"\",VLOOKUP(B9,T_entrée[],4,FALSE),\"\")","v":{"$error":"#N/A"}},{"$f":"IF(B9<>\"\",VLOOKUP(B9,T_entrée[],5,FALSE),\"\")","v":{"$error":"#N/A"}},{"$f":"IF(B9<>\"\",VLOOKUP(B9,T_entrée[],7,FALSE),\"\")","v":{"$error":"#N/A"}},null,null,0]
[6,"17 105",{"$f":"IF(B10<>\"\",VLOOKUP(B10,T_entrée[],4,FALSE),\"\")","v":{"$error":"#N/A"}},{"$f":"IF(B10<>\"\",VLOOKUP(B10,T_entrée[],5,FALSE),\"\")","v":{"$error":"#N/A"}},{"$f":"IF(B10<>\"\",VLOOKUP(B10,T_entrée[],7,FALSE),\"\")","v":{"$error":"#N/A"}},null,null,0]
["Total",null,"nombres",{"$f":"SUBTOTAL(103,[Taille])","v":6},"quantités",{"$f":"SUBTOTAL(109,[Quantité])","v":15}]

{"sheet":"Entrée","index":2,"n_rows":159,"n_cols":9,"rows_kept":159,"cut":false,"hidden":false,"merged":[[1,0,1,7]]}
[]
["Entrée de stock"]
[]
["Référence","Fournisseur","Famille","Désignation","Taille","Achat HT","Prix Vente","Quantité","Date"]
["201036","AGD",{"$f":"IF($A5<>\"\",VLOOKUP($A5,T_stock[],COLUMN()-1,FALSE),\"\")","v":"Bouton"},{"$f":"IF($A5<>\"\",VLOOKUP($A5,T_stock[],COLUMN()-1,FALSE),\"\")","v":"Cœur marron et beige"},{"$f":"IF($A5<>\"\",VLOOKUP($A5,T_stock[],COLUMN()-1,FALSE),\"\")","v":15},{"$f":"IF($A5<>\"\",VLOOKUP($A5,T_stock[],COLUMN()-1,FALSE),\"\")","v":0.23},{"$f":"IF($A5<>\"\",VLOOKUP($A5,T_stock[],COLUMN()-1,FALSE),\"\")","v":0.8},30,"2013-03-20"]
["18","AGD",{"$f":"IF($A6<>\"\",VLOOKUP($A6,T_stock[],COLUMN()-1,FALSE),\"\")","v":"Bouton"},{"$f":"IF($A6<>\"\",VLOOKUP($A6,T_stock[],COLUMN()-1,FALSE),\"\")","v":"Rond fushia fille"},{"$f":"IF($A6<>\"\",VLOOKUP($A6,T_stock[],COLUMN()-1,FALSE),\"\")","v":15},{"$f":"IF($A6<>\"\",VLOOKUP($A6,T_stock[],COLUMN()-1,FALSE),\"\")","v":0.23},{"$f":"IF($A6<>\"\",VLOOKUP($A6,T_stock[],COLUMN()-1,FALSE),\"\")","v":0.8},30,"2013-03-20"]
["20","AGD",{"$f":"IF($A7<>\"\",VLOOKUP($A7,T_stock[],COLUMN()-1,FALSE),\"\")","v":"Bouton"},{"$f":"IF($A7<>\"\",VLOOKUP($A7,T_stock[],COLUMN()-1,FALSE),\"\")","v":"Rond turquoise Kidz"},{"$f":"IF($A7<>\"\",VLOOKUP($A7,T_stock[],COLUMN()-1,FALSE),\"\")","v":15},{"$f":"IF($A7<>\"\",VLOOKUP($A7,T_stock[],COLUMN()-1,FALSE),\"\")","v":0.23},{"$f":"IF($A7<>\"\",VLOOKUP($A7,T_stock[],COLUMN()-1,FALSE),\"\")","v":0.8},20,"2013-03-20"]
["211068","AGD",{"$f":"IF($A8<>\"\",VLOOKUP($A8,T_stock[],COLUMN()-1,FALSE),\"\")","v":"Bouton"},{"$f":"IF($A8<>\"\",VLOOKUP($A8,T_stock[],COLUMN()-1,FALSE),\"\")","v":"Rond jaune smiley"},{"$f":"IF($A8<>\"\",VLOOKUP($A8,T_stock[],COLUMN()-1,FALSE),\"\")","v":15},{"$f":"IF($A8<>\"\",VLOOKUP($A8,T_stock[],COLUMN()-1,FALSE),\"\")","v":0.23},{"$f":"IF($A8<>\"\",VLOOKUP($A8,T_stock[],COLUMN()-1,FALSE),\"\")","v":0.8},30,"2013-03-20"]
["211424","AGD",{"$f":"IF($A9<>\"\",VLOOKUP($A9,T_stock[],COLUMN()-1,FALSE),\"\")","v":"Bouton"},{"$f":"IF($A9<>\"\",VLOOKUP($A9,T_stock[],COLUMN()-1,FALSE),\"\")","v":"Cœur bois"},{"$f":"IF($A9<>\"\",VLOOKUP($A9,T_stock[],COLUMN()-1,FALSE),\"\")","v":15},{"$f":"IF($A9<>\"\",VLOOKUP($A9,T_stock[],COLUMN()-1,FALSE),\"\")","v":0.3},{"$f":"IF($A9<>\"\",VLOOKUP($A9,T_stock[],COLUMN()-1,FALSE),\"\")","v":1},20,"2013-03-20"]
["211572","AGD",{"$f":"IF($A10<>\"\",VLOOKUP($A10,T_stock[],COLUMN()-1,FALSE),\"\")","v":"Bouton"},{"$f":"IF($A10<>\"\",VLOOKUP($A10,T_stock[],COLUMN()-1,FALSE),\"\")","v":"Voiture rouge et blanc"},{"$f":"IF($A10<>\"\",VLOOKUP($A10,T_stock[],COLUMN()-1,FALSE),\"\")","v":20},{"$f":"IF($A10<>\"\",VLOOKUP($A10,T_stock[],COLUMN()-1,FALSE),\"\")","v":0.3},{"$f":"IF($A10<>\"\",VLOOKUP($A10,T_stock[],COLUMN()-1,FALSE),\"\")","v":1},30,"2013-03-20"]
["230123","AGD",{"$f":"IF($A11<>\"\",VLOOKUP($A11,T_stock[],COLUMN()-1,FALSE),\"\")","v":"Bouton"},{"$f":"IF($A11<>\"\",VLOOKUP($A11,T_stock[],COLUMN()-1,FALSE),\"\")","v":"Petite fleur Blanc nacré"},{"$f":"IF($A11<>\"\",VLOOKUP($A11,T_stock[],COLUMN()-1,FALSE),\"\")","v":11},{"$f":"IF($A11<>\"\",VLOOKUP($A11,T_stock[],COLUMN()-1,FALSE),\"\")","v":0.3},{"$f":"IF($A11<>\"\",VLOOKUP($A11,T_stock[],COLUMN()-1,FALSE),\"\")","v":1},40,"2013-03-20"]
["230612","AGD",{"$f":"IF($A12<>\"\",VLOOKUP($A12,T_stock[],COLUMN()-1,FALSE),\"\")","v":"Bouton"},{"$f":"IF($A12<>\"\",VLOOKUP($A12,T_stock[],COLUMN()-1,FALSE),\"\")","v":"Petit cœur métal"},{"$f":"IF($A12<>\"\",VLOOKUP($A12,T_stock[],COLUMN()-1,FALSE),\"\")","v":14},{"$f":"IF($A12<>\"\",VLOOKUP($A12,T_stock[],COLUMN()-1,FALSE),\"\")","v":0.3},{"$f":"IF($A12<>\"\",VLOOKUP($A12,T_stock[],COLUMN()-1,FALSE),\"\")","v":1},20,"2013-03-20"]
["230912","AGD",{"$f":"IF($A13<>\"\",VLOOKUP($A13,T_stock[],COLUMN()-1,FALSE),\"\")","v":"Bouton"},{"$f":"IF($A13<>\"\",VLOOKUP($A13,T_stock[],COLUMN()-1,FALSE),\"\")","v":"Rond rose gravé"},{"$f":"IF($A13<>\"\",VLOOKUP($A13,T_stock[],COLUMN()-1,FALSE),\"\")","v":15},{"$f":"IF($A13<>\"\",VLOOKUP($A13,T_stock[],COLUMN()-1,FALSE),\"\")","v":0.3},{"$f":"IF($A13<>\"\",VLOOKUP($A13,T_stock[],COLUMN()-1,FALSE),\"\")","v":1},20,"2013-03-20"]
["230916","AGD",{"$f":"IF($A14<>\"\",VLOOKUP($A14,T_stock[],COLUMN()-1,FALSE),\"\")","v":"Bouton"},{"$f":"IF($A14<>\"\",VLOOKUP($A14,T_stock[],COLUMN()-1,FALSE),\"\")","v":"Rond rose bord gravé"},{"$f":"IF($A14<>\"\",VLOOKUP($A14,T_stock[],COLUMN()-1,FALSE),\"\")","v":15},{"$f":"IF($A14<>\"\",VLOOKUP($A14,T_stock[],COLUMN()-1,FALSE),\"\")","v":0.3},{"$f":"IF($A14<>\"\",VLOOKUP($A14,T_stock[],COLUMN()-1,FALSE),\"\")","v":1},40,"2013-03-20"]
["231260","AGD",{"$f":"IF($A15<>\"\",VLOOKUP($A15,T_stock[],COLUMN()-1,FALSE),\"\")","v":"Bouton"},{"$f":"IF($A15<>\"\",VLOOKUP($A15,T_stock[],COLUMN()-1,FALSE),\"\")","v":"Rond gris marbré"},{"$f":"IF($A15<>\"\",VLOOKUP($A15,T_stock[],COLUMN()-1,FALSE),\"\")","v":20},{"$f":"IF($A15<>\"\",VLOOKUP($A15,T_stock[],COLUMN()-1,FALSE),\"\")","v":0.3},{"$f":"IF($A15<>\"\",VLOOKUP($A15,T_stock[],COLUMN()-1,FALSE),\"\")","v":1},30,"2013-03-20"]
["231379","AGD",{"$f":"IF($A16<>\"\",VLOOKUP($A16,T_stock[],COLUMN()-1,FALSE),\"\")","v":"Bouton"},{"$f":"IF($A16<>\"\",VLOOKUP($A16,T_stock[],COLUMN()-1,FALSE),\"\")","v":"Voiture bleu et blanc"},{"$f":"IF($A16<>\"\",VLOOKUP($A16,T_stock[],COLUMN()-1,FALSE),\"\")","v":20},{"$f":"IF($A16<>\"\",VLOOKUP($A16,T_stock[],COLUMN()-1,FALSE),\"\")","v":0.3},{"$f":"IF($A16<>\"\",VLOOKUP($A16,T_stock[],COLUMN()-1,FALSE),\"\")","v":1},30,"2013-03-20"]
["23464","AGD",{"$f":"IF($A17<>\"\",VLOOKUP($A17,T_stock[],COLUMN()-1,FALSE),\"\")","v":"Bouton"},{"$f":"IF($A17<>\"\",VLOOKUP($A17,T_stock[],COLUMN()-1,FALSE),\"\")","v":"Bateau bleu"},{"$f":"IF($A17<>\"\",VLOOKUP($A17,T_stock[],COLUMN()-1,FALSE),\"\")","v":18},{"$f":"IF($A17<>\"\",VLOOKUP($A17,T_stock[],COLUMN()-1,FALSE),\"\")","v":0.34},{"$f":"IF($A17<>\"\",VLOOKUP($A17,T_stock[],COLUMN()-1,FALSE),\"\")","v":1.2},20,"2013-03-20"]
["240926","AGD",{"$f":"IF($A18<>\"\",VLOOKUP($A18,T_stock[],COLUMN()-1,FALSE),\"\")","v":"Bouton"},{"$f":"IF($A18<>\"\",VLOOKUP($A18,T_stock[],COLUMN()-1,FALSE),\"\")","v":"Rond bleu lune"},{"$f":"IF($A18<>\"\",VLOOKUP($A18,T_stock[],COLUMN()-1,FALSE),\"\")","v":18},{"$f":"IF($A18<>\"\",VLOOKUP($A18,T_stock[],COLUMN()-1,FALSE),\"\")","v":0.34},{"$f":"IF($A18<>\"\",VLOOKUP($A18,T_stock[],COLUMN()-1,FALSE),\"\")","v":1.2},20,"2013-03-20"]
["250654","AGD",{"$f":"IF($A19<>\"\",VLOOKUP($A19,T_stock[],COLUMN()-1,FALSE),\"\")","v":"Bouton"},{"$f":"IF($A19<>\"\",VLOOKUP($A19,T_stock[],COLUMN()-1,FALSE),\"\")","v":"Petit rond gris clair et foncé"},{"$f":"IF($A19<>\"\",VLOOKUP($A19,T_stock[],COLUMN()-1,FALSE),\"\")","v":18},{"$f":"IF($A19<>\"\",VLOOKUP($A19,T_stock[],COLUMN()-1,FALSE),\"\")","v":0.34},{"$f":"IF($A19<>\"\",VLOOKUP($A19,T_stock[],COLUMN()-1,FALSE),\"\")","v":1.2},30,"2013-03-20"]
["250753","AGD",{"$f":"IF($A20<>\"\",VLOOKUP($A20,T_stock[],COLUMN()-1,FALSE),\"\")","v":"Bouton"},{"$f":"IF($A20<>\"\",VLOOKUP($A20,T_stock[],COLUMN()-1,FALSE),\"\")","v":"Carré beige rainure"},{"$f":"IF($A20<>\"\",VLOOKUP($A20,T_stock[],COLUMN()-1,FALSE),\"\")","v":18},{"$f":"IF($A20<>\"\",VLOOKUP($A20,T_stock[],COLUMN()-1,FALSE),\"\")","v":0.34},{"$f":"IF($A20<>\"\",VLOOKUP($A20,T_stock[],COLUMN()-1,FALSE),\"\")","v":1.2},20,"2013-03-20"]
["251144","AGD",{"$f":"IF($A21<>\"\",VLOOKUP($A21,T_stock[],COLUMN()-1,FALSE),\"\")","v":"Bouton"},{"$f":"IF($A21<>\"\",VLOOKUP($A21,T_stock[],COLUMN()-1,FALSE),\"\")","v":"Rond rose tâcheté"},{"$f":"IF($A21<>\"\",VLOOKUP($A21,T_stock[],COLUMN()-1,FALSE),\"\")","v":20},{"$f":"IF($A21<>\"\",VLOOKUP($A21,T_stock[],COLUMN()-1,FALSE),\"\")","v":0.34},{"$f":"IF($A21<>\"\",VLOOKUP($A21,T_stock[],COLUMN()-1,FALSE),\"\")","v":1.2},20,"2013-03-20"]
["251224","AGD",{"$f":"IF($A22<>\"\",VLOOKUP($A22,T_stock[],COLUMN()-1,FALSE),\"\")","v":"Bouton"},{"$f":"IF($A22<>\"\",VLOOKUP($A22,T_stock[],COLUMN()-1,FALSE),\"\")","v":"Coccinelle jaune"},{"$f":"IF($A22<>\"\",VLOOKUP($A22,T_stock[],COLUMN()-1,FALSE),\"\")","v":15},{"$f":"IF($A22<>\"\",VLOOKUP($A22,T_stock[],COLUMN()-1,FALSE),\"\")","v":0.34},{"$f":"IF($A22<>\"\",VLOOKUP($A22,T_stock[],COLUMN()-1,FALSE),\"\")","v":1.2},30,"2013-03-20"]
["251320","AGD",{"$f":"IF($A23<>\"\",VLOOKUP($A23,T_stock[],COLUMN()-1,FALSE),\"\")","v":"Bouton"},{"$f":"IF($A23<>\"\",VLOOKUP($A23,T_stock[],COLUMN()-1,FALSE),\"\")","v":"Grand rond gris clair et foncé"},{"$f":"IF($A23<>\"\",VLOOKUP($A23,T_stock[],COLUMN()-1,FALSE),\"\")","v":23},{"$f":"IF($A23<>\"\",VLOOKUP($A23,T_stock[],COLUMN()-1,FALSE),\"\")","v":0.45},{"$f":"IF($A23<>\"\",VLOOKUP($A23,T_stock[],COLUMN()-1,FALSE),\"\")","v":1.6},20,"2013-03-20"]
["280439","AGD",{"$f":"IF($A24<>\"\",VLOOKUP($A24,T_stock[],COLUMN()-1,FALSE),\"\")","v":"Bouton"},{"$f":"IF($A24<>\"\",VLOOKUP($A24,T_stock[],COLUMN()-1,FALSE),\"\")","v":"Carré gris rainure"},{"$f":"IF($A24<>\"\",VLOOKUP($A24,T_stock[],COLUMN()-1,FALSE),\"\")","v":23},{"$f":"IF($A24<>\"\",VLOOKUP($A24,T_stock[],COLUMN()-1,FALSE),\"\")","v":0.45},{"$f":"IF($A24<>\"\",VLOOKUP($A24,T_stock[],COLUMN()-1,FALSE),\"\")","v":1.6},12,"2013-03-20"]
["280578","AGD",{"$f":"IF($A25<>\"\",VLOOKUP($A25,T_stock[],COLUMN()-1,FALSE),\"\")","v":"Bouton"},{"$f":"IF($A25<>\"\",VLOOKUP($A25,T_stock[],COLUMN()-1,FALSE),\"\")","v":"Cœur x3 métal"},{"$f":"IF($A25<>\"\",VLOOKUP($A25,T_stock[],COLUMN()-1,FALSE),\"\")","v":18},{"$f":"IF($A25<>\"\",VLOOKUP($A25,T_stock[],COLUMN()-1,FALSE),\"\")","v":0.45},{"$f":"IF($A25<>\"\",VLOOKUP($A25,T_stock[],COLUMN()-1,FALSE),\"\")","v":1.6},20,"2013-03-20"]
["290472","AGD",{"$f":"IF($A26<>\"\",VLOOKUP($A26,T_stock[],COLUMN()-1,FALSE),\"\")","v":"Bouton"},{"$f":"IF($A26<>\"\",VLOOKUP($A26,T_stock[],COLUMN()-1,FALSE),\"\")","v":"Grand cœur métal"},{"$f":"IF($A26<>\"\",VLOOKUP($A26,T_stock[],COLUMN()-1,FALSE),\"\")","v":18},{"$f":"IF($A26<>\"\",VLOOKUP($A26,T_stock[],COLUMN()-1,FALSE),\"\")","v":0.45},{"$f":"IF($A26<>\"\",VLOOKUP($A26,T_stock[],COLUMN()-1,FALSE),\"\")","v":1.6},20,"2013-03-20"]
["290663","AGD",{"$f":"IF($A27<>\"\",VLOOKUP($A27,T_stock[],COLUMN()-1,FALSE),\"\")","v":"Bouton"},{"$f":"IF($A27<>\"\",VLOOKUP($A27,T_stock[],COLUMN()-1,FALSE),\"\")","v":"Ovale noir"},{"$f":"IF($A27<>\"\",VLOOKUP($A27,T_stock[],COLUMN()-1,FALSE),\"\")","v":25},{"$f":"IF($A27<>\"\",VLOOKUP($A27,T_stock[],COLUMN()-1,FALSE),\"\")","v":0.45},{"$f":"IF($A27<>\"\",VLOOKUP($A27,T_stock[],COLUMN()-1,FALSE),\"\")","v":1.6},20,"2013-03-20"]
["300436","AGD",{"$f":"IF($A28<>\"\",VLOOKUP($A28,T_stock[],COLUMN()-1,FALSE),\"\")","v":"Bouton"},{"$f":"IF($A28<>\"\",VLOOKUP($A28,T_stock[],COLUMN()-1,FALSE),\"\")","v":"Rond noir rainures blanches"},{"$f":"IF($A28<>\"\",VLOOKUP($A28,T_stock[],COLUMN()-1,FALSE),\"\")","v":23},{"$f":"IF($A28<>\"\",VLOOKUP($A28,T_stock[],COLUMN()-1,FALSE),\"\")","v":0.45},{"$f":"IF($A28<>\"\",VLOOKUP($A28,T_stock[],COLUMN()-1,FALSE),\"\")","v":1.6},16,"2013-03-20"]
["300498","AGD",{"$f":"IF($A29<>\"\",VLOOKUP($A29,T_stock[],COLUMN()-1,FALSE),\"\")","v":"Bouton"},{"$f":"IF($A29<>\"\",VLOOKUP($A29,T_stock[],COLUMN()-1,FALSE),\"\")","v":"Noir gravé ancre"},{"$f":"IF($A29<>\"\",VLOOKUP($A29,T_stock[],COLUMN()-1,FALSE),\"\")","v":25},{"$f":"IF($A29<>\"\",VLOOKUP($A29,T_stock[],COLUMN()-1,FALSE),\"\")","v":0.45},{"$f":"IF($A29<>\"\",VLOOKUP($A29,T_stock[],COLUMN()-1,FALSE),\"\")","v":1.6},12,"2013-03-20"]
["300779","AGD",{"$f":"IF($A30<>\"\",VLOOKUP($A30,T_stock[],COLUMN()-1,FALSE),\"\")","v":"Bouton"},{"$f":"IF($A30<>\"\",VLOOKUP($A30,T_stock[],COLUMN()-1,FALSE),\"\")","v":"Rond doré et noir "},{"$f":"IF($A30<>\"\",VLOOKUP($A30,T_stock[],COLUMN()-1,FALSE),\"\")","v":15},{"$f":"IF($A30<>\"\",VLOOKUP($A30,T_stock[],COLUMN()-1,FALSE),\"\")","v":0.51},{"$f":"IF($A30<>\"\",VLOOKUP($A30,T_stock[],COLUMN()-1,FALSE),\"\")","v":1.8},20,"2013-03-20"]
["300831","AGD",{"$f":"IF($A31<>\"\",VLOOKUP($A31,T_stock[],COLUMN()-1,FALSE),\"\")","v":"Bouton"},{"$f":"IF($A31<>\"\",VLOOKUP($A31,T_stock[],COLUMN()-1,FALSE),\"\")","v":"Grand rond violet"},{"$f":"IF($A31<>\"\",VLOOKUP($A31,T_stock[],COLUMN()-1,FALSE),\"\")","v":25},{"$f":"IF($A31<>\"\",VLOOKUP($A31,T_stock[],COLUMN()-1,FALSE),\"\")","v":0.51},{"$f":"IF($A31<>\"\",VLOOKUP($A31,T_stock[],COLUMN()-1,FALSE),\"\")","v":1.8},12,"2013-03-20"]
["3016","AGD",{"$f":"IF($A32<>\"\",VLOOKUP($A32,T_stock[],COLUMN()-1,FALSE),\"\")","v":"Bouton"},{"$f":"IF($A32<>\"\",VLOOKUP($A32,T_stock[],COLUMN()-1,FALSE),\"\")","v":"Grand rond gris et noir"},{"$f":"IF($A32<>\"\",VLOOKUP($A32,T_stock[],COLUMN()-1,FALSE),\"\")","v":25},{"$f":"IF($A32<>\"\",VLOOKUP($A32,T_stock[],COLUMN()-1,FALSE),\"\")","v":0.51},{"$f":"IF($A32<>\"\",VLOOKUP($A32,T_stock[],COLUMN()-1,FALSE),\"\")","v":1.8},12,"2013-03-20"]
["31","AGD",{"$f":"IF($A33<>\"\",VLOOKUP($A33,T_stock[],COLUMN()-1,FALSE),\"\")","v":"Bouton"},{"$f":"IF($A33<>\"\",VLOOKUP($A33,T_stock[],COLUMN()-1,FALSE),\"\")","v":"Très grand métal cœur"},{"$f":"IF($A33<>\"\",VLOOKUP($A33,T_stock[],COLUMN()-1,FALSE),\"\")","v":23},{"$f":"IF($A33<>\"\",VLOOKUP($A33,T_stock[],COLUMN()-1,FALSE),\"\")","v":0.51},{"$f":"IF($A33<>\"\",VLOOKUP($A33,T_stock[],COLUMN()-1,FALSE),\"\")","v":1.8},20,"2013-03-20"]
["319","PARITYS",{"$f":"IF($A34<>\"\",VLOOKUP($A34,T_stock[],COLUMN()-1,FALSE),\"\")","v":"Motif"},{"$f":"IF($A34<>\"\",VLOOKUP($A34,T_stock[],COLUMN()-1,FALSE),\"\")","v":"Drapeau anglais"},{"$f":"IF($A34<>\"\",VLOOKUP($A34,T_stock[],COLUMN()-1,FALSE),\"\")","v":0},{"$f":"IF($A34<>\"\",VLOOKUP($A34,T_stock[],COLUMN()-1,FALSE),\"\")","v":1.1000000000000001},{"$f":"IF($A34<>\"\",VLOOKUP($A34,T_stock[],COLUMN()-1,FALSE),\"\")","v":3.9},5,"2013-03-20"]
["32003","PARITYS",{"$f":"IF($A35<>\"\",VLOOKUP($A35,T_stock[],COLUMN()-1,FALSE),\"\")","v":"Motif"},{"$f":"IF($A35<>\"\",VLOOKUP($A35,T_stock[],COLUMN()-1,FALSE),\"\")","v":"Ecusson fleur lys"},{"$f":"IF($A35<>\"\",VLOOKUP($A35,T_stock[],COLUMN()-1,FALSE),\"\")","v":0},{"$f":"IF($A35<>\"\",VLOOKUP($A35,T_stock[],COLUMN()-1,FALSE),\"\")","v":1.1000000000000001},{"$f":"IF($A35<>\"\",VLOOKUP($A35,T_stock[],COLUMN()-1,FALSE),\"\")","v":3.9},5,"2013-03-20"]
["320170","PARITYS",{"$f":"IF($A36<>\"\",VLOOKUP($A36,T_stock[],COLUMN()-1,FALSE),\"\")","v":"Motif"},{"$f":"IF($A36<>\"\",VLOOKUP($A36,T_stock[],COLUMN()-1,FALSE),\"\")","v":"Drapeau français"},{"$f":"IF($A36<>\"\",VLOOKUP($A36,T_stock[],COLUMN()-1,FALSE),\"\")","v":0},{"$f":"IF($A36<>\"\",VLOOKUP($A36,T_stock[],COLUMN()-1,FALSE),\"\")","v":1.1000000000000001},{"$f":"IF($A36<>\"\",VLOOKUP($A36,T_stock[],COLUMN()-1,FALSE),\"\")","v":3.9},5,"2013-03-20"]
["327","PARITYS",{"$f":"IF($A37<>\"\",VLOOKUP($A37,T_stock[],COLUMN()-1,FALSE),\"\")","v":"Motif"},{"$f":"IF($A37<>\"\",VLOOKUP($A37,T_stock[],COLUMN()-1,FALSE),\"\")","v":"Cœur paillette noir"},{"$f":"IF($A37<>\"\",VLOOKUP($A37,T_stock[],COLUMN()-1,FALSE),\"\")","v":0},{"$f":"IF($A37<>\"\",VLOOKUP($A37,T_stock[],COLUMN()-1,FALSE),\"\")","v":1.1000000000000001},{"$f":"IF($A37<>\"\",VLOOKUP($A37,T_stock[],COLUMN()-1,FALSE),\"\")","v":3.9},5,"2013-03-20"]
["327","PARITYS",{"$f":"IF($A38<>\"\",VLOOKUP($A38,T_stock[],COLUMN()-1,FALSE),\"\")","v":"Motif"},{"$f":"IF($A38<>\"\",VLOOKUP($A38,T_stock[],COLUMN()-1,FALSE),\"\")","v":"Cœur paillette noir"},{"$f":"IF($A38<>\"\",VLOOKUP($A38,T_stock[],COLUMN()-1,FALSE),\"\")","v":0},{"$f":"IF($A38<>\"\",VLOOKUP($A38,T_stock[],COLUMN()-1,FALSE),\"\")","v":1.1000000000000001},{"$f":"IF($A38<>\"\",VLOOKUP($A38,T_stock[],COLUMN()-1,FALSE),\"\")","v":3.9},5,"2013-03-20"]
["33030","PARITYS",{"$f":"IF($A39<>\"\",VLOOKUP($A39,T_stock[],COLUMN()-1,FALSE),\"\")","v":"Motif"},{"$f":"IF($A39<>\"\",VLOOKUP($A39,T_stock[],COLUMN()-1,FALSE),\"\")","v":"Cœur tweed"},{"$f":"IF($A39<>\"\",VLOOKUP($A39,T_stock[],COLUMN()-1,FALSE),\"\")","v":0},{"$f":"IF($A39<>\"\",VLOOKUP($A39,T_stock[],COLUMN()-1,FALSE),\"\")","v":1.94},{"$f":"IF($A39<>\"\",VLOOKUP($A39,T_stock[],COLUMN()-1,FALSE),\"\")","v":6.5},1,"2013-03-20"]
["330302","PARITYS",{"$f":"IF($A40<>\"\",VLOOKUP($A40,T_stock[],COLUMN()-1,FALSE),\"\")","v":"Motif"},{"$f":"IF($A40<>\"\",VLOOKUP($A40,T_stock[],COLUMN()-1,FALSE),\"\")","v":"Cœur paillette rouge"},{"$f":"IF($A40<>\"\",VLOOKUP($A40,T_stock[],COLUMN()-1,FALSE),\"\")","v":0},{"$f":"IF($A40<>\"\",VLOOKUP($A40,T_stock[],COLUMN()-1,FALSE),\"\")","v":1.94},{"$f":"IF($A40<>\"\",VLOOKUP($A40,T_stock[],COLUMN()-1,FALSE),\"\")","v":6.5},5,"2013-03-20"]
["3342","PARITYS",{"$f":"IF($A41<>\"\",VLOOKUP($A41,T_stock[],COLUMN()-1,FALSE),\"\")","v":"Motif"},{"$f":"IF($A41<>\"\",VLOOKUP($A41,T_stock[],COLUMN()-1,FALSE),\"\")","v":"Fleur rose"},{"$f":"IF($A41<>\"\",VLOOKUP($A41,T_stock[],COLUMN()-1,FALSE),\"\")","v":0},{"$f":"IF($A41<>\"\",VLOOKUP($A41,T_stock[],COLUMN()-1,FALSE),\"\")","v":1.22},{"$f":"IF($A41<>\"\",VLOOKUP($A41,T_stock[],COLUMN()-1,FALSE),\"\")","v":4.3},5,"2013-03-20"]
["3392","PARITYS",{"$f":"IF($A42<>\"\",VLOOKUP($A42,T_stock[],COLUMN()-1,FALSE),\"\")","v":"Motif"},{"$f":"IF($A42<>\"\",VLOOKUP($A42,T_stock[],COLUMN()-1,FALSE),\"\")","v":"Tête de mort brillante"},{"$f":"IF($A42<>\"\",VLOOKUP($A42,T_stock[],COLUMN()-1,FALSE),\"\")","v":0},{"$f":"IF($A42<>\"\",VLOOKUP($A42,T_stock[],COLUMN()-1,FALSE),\"\")","v":0.8},{"$f":"IF($A42<>\"\",VLOOKUP($A42,T_stock[],COLUMN()-1,FALSE),\"\")","v":2.8},5,"2013-03-20"]
["3393","PARITYS",{"$f":"IF($A43<>\"\",VLOOKUP($A43,T_stock[],COLUMN()-1,FALSE),\"\")","v":"Motif"},{"$f":"IF($A43<>\"\",VLOOKUP($A43,T_stock[],COLUMN()-1,FALSE),\"\")","v":"3 cœurs brillants rouges"},{"$f":"IF($A43<>\"\",VLOOKUP($A43,T_stock[],COLUMN()-1,FALSE),\"\")","v":0},{"$f":"IF($A43<>\"\",VLOOKUP($A43,T_stock[],COLUMN()-1,FALSE),\"\")","v":1.39},{"$f":"IF($A43<>\"\",VLOOKUP($A43,T_stock[],COLUMN()-1,FALSE),\"\")","v":4.8},5,"2013-03-20"]
["3394","PARITYS",{"$f":"IF($A44<>\"\",VLOOKUP($A44,T_stock[],COLUMN()-1,FALSE),\"\")","v":"Motif"},{"$f":"IF($A44<>\"\",VLOOKUP($A44,T_stock[],COLUMN()-1,FALSE),\"\")","v":"3 fleurs brillantes roses"},{"$f":"IF($A44<>\"\",VLOOKUP($A44,T_stock[],COLUMN()-1,FALSE),\"\")","v":0},{"$f":"IF($A44<>\"\",VLOOKUP($A44,T_stock[],COLUMN()-1,FALSE),\"\")","v":1.39},{"$f":"IF($A44<>\"\",VLOOKUP($A44,T_stock[],COLUMN()-1,FALSE),\"\")","v":4.8},3,"2013-03-20"]
["3394","PARITYS",{"$f":"IF($A45<>\"\",VLOOKUP($A45,T_stock[],COLUMN()-1,FALSE),\"\")","v":"Motif"},{"$f":"IF($A45<>\"\",VLOOKUP($A45,T_stock[],COLUMN()-1,FALSE),\"\")","v":"3 fleurs brillantes roses"},{"$f":"IF($A45<>\"\",VLOOKUP($A45,T_stock[],COLUMN()-1,FALSE),\"\")","v":0},{"$f":"IF($A45<>\"\",VLOOKUP($A45,T_stock[],COLUMN()-1,FALSE),\"\")","v":1.39},{"$f":"IF($A45<>\"\",VLOOKUP($A45,T_stock[],COLUMN()-1,FALSE),\"\")","v":4.8},5,"2013-03-20"]
["3500","PARITYS",{"$f":"IF($A46<>\"\",VLOOKUP($A46,T_stock[],COLUMN()-1,FALSE),\"\")","v":"Motif"},{"$f":"IF($A46<>\"\",VLOOKUP($A46,T_stock[],COLUMN()-1,FALSE),\"\")","v":"Timbre Tour Eiffel"},{"$f":"IF($A46<>\"\",VLOOKUP($A46,T_stock[],COLUMN()-1,FALSE),\"\")","v":0},{"$f":"IF($A46<>\"\",VLOOKUP($A46,T_stock[],COLUMN()-1,FALSE),\"\")","v":1.01},{"$f":"IF($A46<>\"\",VLOOKUP($A46,T_stock[],COLUMN()-1,FALSE),\"\")","v":3.5},10,"2013-03-20"]
["3842","PARITYS",{"$f":"IF($A47<>\"\",VLOOKUP($A47,T_stock[],COLUMN()-1,FALSE),\"\")","v":"Motif"},{"$f":"IF($A47<>\"\",VLOOKUP($A47,T_stock[],COLUMN()-1,FALSE),\"\")","v":"Rond racing"},{"$f":"IF($A47<>\"\",VLOOKUP($A47,T_stock[],COLUMN()-1,FALSE),\"\")","v":0},{"$f":"IF($A47<>\"\",VLOOKUP($A47,T_stock[],COLUMN()-1,FALSE),\"\")","v":0.95},{"$f":"IF($A47<>\"\",VLOOKUP($A47,T_stock[],COLUMN()-1,FALSE),\"\")","v":3.2},5,"2013-03-20"]
["3855 1","PARITYS",{"$f":"IF($A48<>\"\",VLOOKUP($A48,T_stock[],COLUMN()-1,FALSE),\"\")","v":"Motif"},{"$f":"IF($A48<>\"\",VLOOKUP($A48,T_stock[],COLUMN()-1,FALSE),\"\")","v":"Chat"},{"$f":"IF($A48<>\"\",VLOOKUP($A48,T_stock[],COLUMN()-1,FALSE),\"\")","v":0},{"$f":"IF($A48<>\"\",VLOOKUP($A48,T_stock[],COLUMN()-1,FALSE),\"\")","v":1.56},{"$f":"IF($A48<>\"\",VLOOKUP($A48,T_stock[],COLUMN()-1,FALSE),\"\")","v":5.3},5,"2013-03-20"]
["3855 2","PARITYS",{"$f":"IF($A49<>\"\",VLOOKUP($A49,T_stock[],COLUMN()-1,FALSE),\"\")","v":"A riveter"},{"$f":"IF($A49<>\"\",VLOOKUP($A49,T_stock[],COLUMN()-1,FALSE),\"\")","v":"Œillet noir"},{"$f":"IF($A49<>\"\",VLOOKUP($A49,T_stock[],COLUMN()-1,FALSE),\"\")","v":"5mm"},{"$f":"IF($A49<>\"\",VLOOKUP($A49,T_stock[],COLUMN()-1,FALSE),\"\")","v":2.95},{"$f":"IF($A49<>\"\",VLOOKUP($A49,T_stock[],COLUMN()-1,FALSE),\"\")","v":8.9},5,"2013-03-20"]
["3855 3","PARITYS",{"$f":"IF($A50<>\"\",VLOOKUP($A50,T_stock[],COLUMN()-1,FALSE),\"\")","v":"Fil"},{"$f":"IF($A50<>\"\",VLOOKUP($A50,T_stock[],COLUMN()-1,FALSE),\"\")","v":"Lastex blanc"},{"$f":"IF($A50<>\"\",VLOOKUP($A50,T_stock[],COLUMN()-1,FALSE),\"\")","v":0},{"$f":"IF($A50<>\"\",VLOOKUP($A50,T_stock[],COLUMN()-1,FALSE),\"\")","v":0.85},{"$f":"IF($A50<>\"\",VLOOKUP($A50,T_stock[],COLUMN()-1,FALSE),\"\")","v":2.9},10,"2013-03-20"]
["3857","PARITYS",{"$f":"IF($A51<>\"\",VLOOKUP($A51,T_stock[],COLUMN()-1,FALSE),\"\")","v":"Fil"},{"$f":"IF($A51<>\"\",VLOOKUP($A51,T_stock[],COLUMN()-1,FALSE),\"\")","v":"Lastex noir"},{"$f":"IF($A51<>\"\",VLOOKUP($A51,T_stock[],COLUMN()-1,FALSE),\"\")","v":0},{"$f":"IF($A51<>\"\",VLOOKUP($A51,T_stock[],COLUMN()-1,FALSE),\"\")","v":0.85},{"$f":"IF($A51<>\"\",VLOOKUP($A51,T_stock[],COLUMN()-1,FALSE),\"\")","v":2.9},10,"2013-03-20"]
["3857","PARITYS",{"$f":"IF($A52<>\"\",VLOOKUP($A52,T_stock[],COLUMN()-1,FALSE),\"\")","v":"Fil"},{"$f":"IF($A52<>\"\",VLOOKUP($A52,T_stock[],COLUMN()-1,FALSE),\"\")","v":"Lastex noir"},{"$f":"IF($A52<>\"\",VLOOKUP($A52,T_stock[],COLUMN()-1,FALSE),\"\")","v":0},{"$f":"IF($A52<>\"\",VLOOKUP($A52,T_stock[],COLUMN()-1,FALSE),\"\")","v":0.85},{"$f":"IF($A52<>\"\",VLOOKUP($A52,T_stock[],COLUMN()-1,FALSE),\"\")","v":2.9},5,"2013-03-20"]
["3857","PARITYS",{"$f":"IF($A53<>\"\",VLOOKUP($A53,T_stock[],COLUMN()-1,FALSE),\"\")","v":"Fil"},{"$f":"IF($A53<>\"\",VLOOKUP($A53,T_stock[],COLUMN()-1,FALSE),\"\")","v":"Lastex noir"},{"$f":"IF($A53<>\"\",VLOOKUP($A53,T_stock[],COLUMN()-1,FALSE),\"\")","v":0},{"$f":"IF($A53<>\"\",VLOOKUP($A53,T_stock[],COLUMN()-1,FALSE),\"\")","v":0.85},{"$f":"IF($A53<>\"\",VLOOKUP($A53,T_stock[],COLUMN()-1,FALSE),\"\")","v":2.9},5,"2013-03-20"]
["3882","PARITYS",{"$f":"IF($A54<>\"\",VLOOKUP($A54,T_stock[],COLUMN()-1,FALSE),\"\")","v":"Mercerie"},{"$f":"IF($A54<>\"\",VLOOKUP($A54,T_stock[],COLUMN()-1,FALSE),\"\")","v":"Attache bretelle blanche"},{"$f":"IF($A54<>\"\",VLOOKUP($A54,T_stock[],COLUMN()-1,FALSE),\"\")","v":0},{"$f":"IF($A54<>\"\",VLOOKUP($A54,T_stock[],COLUMN()-1,FALSE),\"\")","v":2.6},{"$f":"IF($A54<>\"\",VLOOKUP($A54,T_stock[],COLUMN()-1,FALSE),\"\")","v":7.1},5,"2013-03-20"]
["42","PARITYS",{"$f":"IF($A55<>\"\",VLOOKUP($A55,T_stock[],COLUMN()-1,FALSE),\"\")","v":"Mercerie"},{"$f":"IF($A55<>\"\",VLOOKUP($A55,T_stock[],COLUMN()-1,FALSE),\"\")","v":"Craie blanche"},{"$f":"IF($A55<>\"\",VLOOKUP($A55,T_stock[],COLUMN()-1,FALSE),\"\")","v":0},{"$f":"IF($A55<>\"\",VLOOKUP($A55,T_stock[],COLUMN()-1,FALSE),\"\")","v":0.7},{"$f":"IF($A55<>\"\",VLOOKUP($A55,T_stock[],COLUMN()-1,FALSE),\"\")","v":2.5},5,"2013-03-20"]
["42","PARITYS",{"$f":"IF($A56<>\"\",VLOOKUP($A56,T_stock[],COLUMN()-1,FALSE),\"\")","v":"Mercerie"},{"$f":"IF($A56<>\"\",VLOOKUP($A56,T_stock[],COLUMN()-1,FALSE),\"\")","v":"Craie blanche"},{"$f":"IF($A56<>\"\",VLOOKUP($A56,T_stock[],COLUMN()-1,FALSE),\"\")","v":0},{"$f":"IF($A56<>\"\",VLOOKUP($A56,T_stock[],COLUMN()-1,FALSE),\"\")","v":0.7},{"$f":"IF($A56<>\"\",VLOOKUP($A56,T_stock[],COLUMN()-1,FALSE),\"\")","v":2.5},5,"2013-03-20"]
["478","PARITYS",{"$f":"IF($A57<>\"\",VLOOKUP($A57,T_stock[],COLUMN()-1,FALSE),\"\")","v":"Mercerie"},{"$f":"IF($A57<>\"\",VLOOKUP($A57,T_stock[],COLUMN()-1,FALSE),\"\")","v":"Aimant"},{"$f":"IF($A57<>\"\",VLOOKUP($A57,T_stock[],COLUMN()-1,FALSE),\"\")","v":0},{"$f":"IF($A57<>\"\",VLOOKUP($A57,T_stock[],COLUMN()-1,FALSE),\"\")","v":1.02},{"$f":"IF($A57<>\"\",VLOOKUP($A57,T_stock[],COLUMN()-1,FALSE),\"\")","v":3.1},5,"2013-03-20"]
["5255","PARITYS",{"$f":"IF($A58<>\"\",VLOOKUP($A58,T_stock[],COLUMN()-1,FALSE),\"\")","v":"Mercerie"},{"$f":"IF($A58<>\"\",VLOOKUP($A58,T_stock[],COLUMN()-1,FALSE),\"\")","v":"Pelote épingles"},{"$f":"IF($A58<>\"\",VLOOKUP($A58,T_stock[],COLUMN()-1,FALSE),\"\")","v":0},{"$f":"IF($A58<>\"\",VLOOKUP($A58,T_stock[],COLUMN()-1,FALSE),\"\")","v":7.64},{"$f":"IF($A58<>\"\",VLOOKUP($A58,T_stock[],COLUMN()-1,FALSE),\"\")","v":18.5},1,"2013-03-20"]
["582","PARITYS",{"$f":"IF($A59<>\"\",VLOOKUP($A59,T_stock[],COLUMN()-1,FALSE),\"\")","v":"Mercerie"},{"$f":"IF($A59<>\"\",VLOOKUP($A59,T_stock[],COLUMN()-1,FALSE),\"\")","v":"Epingles Bohin 100g"},{"$f":"IF($A59<>\"\",VLOOKUP($A59,T_stock[],COLUMN()-1,FALSE),\"\")","v":4},{"$f":"IF($A59<>\"\",VLOOKUP($A59,T_stock[],COLUMN()-1,FALSE),\"\")","v":5.8},{"$f":"IF($A59<>\"\",VLOOKUP($A59,T_stock[],COLUMN()-1,FALSE),\"\")","v":16},5,"2013-03-20"]
["583","PARITYS",{"$f":"IF($A60<>\"\",VLOOKUP($A60,T_stock[],COLUMN()-1,FALSE),\"\")","v":"Mercerie"},{"$f":"IF($A60<>\"\",VLOOKUP($A60,T_stock[],COLUMN()-1,FALSE),\"\")","v":"Epingles tête verre"},{"$f":"IF($A60<>\"\",VLOOKUP($A60,T_stock[],COLUMN()-1,FALSE),\"\")","v":"30x0,60"},{"$f":"IF($A60<>\"\",VLOOKUP($A60,T_stock[],COLUMN()-1,FALSE),\"\")","v":1.76},{"$f":"IF($A60<>\"\",VLOOKUP($A60,T_stock[],COLUMN()-1,FALSE),\"\")","v":5.5},5,"2013-03-20"]
["610960","PARITYS",{"$f":"IF($A61<>\"\",VLOOKUP($A61,T_stock[],COLUMN()-1,FALSE),\"\")","v":"Mercerie"},{"$f":"IF($A61<>\"\",VLOOKUP($A61,T_stock[],COLUMN()-1,FALSE),\"\")","v":"Epingles Bohin 50g"},"30x0,60",{"$f":"IF($A61<>\"\",VLOOKUP($A61,T_stock[],COLUMN()-1,FALSE),\"\")","v":2.9},{"$f":"IF($A61<>\"\",VLOOKUP($A61,T_stock[],COLUMN()-1,FALSE),\"\")","v":8.6999999999999993},5,"2013-03-20"]
["98","PARITYS",{"$f":"IF($A62<>\"\",VLOOKUP($A62,T_stock[],COLUMN()-1,FALSE),\"\")","v":"Mercerie"},{"$f":"IF($A62<>\"\",VLOOKUP($A62,T_stock[],COLUMN()-1,FALSE),\"\")","v":"Remailleur"},{"$f":"IF($A62<>\"\",VLOOKUP($A62,T_stock[],COLUMN()-1,FALSE),\"\")","v":0},{"$f":"IF($A62<>\"\",VLOOKUP($A62,T_stock[],COLUMN()-1,FALSE),\"\")","v":2.0499999999999998},{"$f":"IF($A62<>\"\",VLOOKUP($A62,T_stock[],COLUMN()-1,FALSE),\"\")","v":6.1},5,"2013-03-20"]
["98 72 648","AGD",{"$f":"IF($A63<>\"\",VLOOKUP($A63,T_stock[],COLUMN()-1,FALSE),\"\")","v":"Fil"},{"$f":"IF($A63<>\"\",VLOOKUP($A63,T_stock[],COLUMN()-1,FALSE),\"\")","v":"St Pierre marine"},{"$f":"IF($A63<>\"\",VLOOKUP($A63,T_stock[],COLUMN()-1,FALSE),\"\")","v":0},{"$f":"IF($A63<>\"\",VLOOKUP($A63,T_stock[],COLUMN()-1,FALSE),\"\")","v":0.7},{"$f":"IF($A63<>\"\",VLOOKUP($A63,T_stock[],COLUMN()-1,FALSE),\"\")","v":2.1},5,"2013-03-20"]
["98 72 100","AGD",{"$f":"IF($A64<>\"\",VLOOKUP($A64,T_stock[],COLUMN()-1,FALSE),\"\")","v":"Fil"},{"$f":"IF($A64<>\"\",VLOOKUP($A64,T_stock[],COLUMN()-1,FALSE),\"\")","v":"St Pierre blanc"},{"$f":"IF($A64<>\"\",VLOOKUP($A64,T_stock[],COLUMN()-1,FALSE),\"\")","v":0},{"$f":"IF($A64<>\"\",VLOOKUP($A64,T_stock[],COLUMN()-1,FALSE),\"\")","v":0.7},{"$f":"IF($A64<>\"\",VLOOKUP($A64,T_stock[],COLUMN()-1,FALSE),\"\")","v":2.1},5,"2013-03-21"]
["98 72 180","AGD",{"$f":"IF($A65<>\"\",VLOOKUP($A65,T_stock[],COLUMN()-1,FALSE),\"\")","v":"Fil"},{"$f":"IF($A65<>\"\",VLOOKUP($A65,T_stock[],COLUMN()-1,FALSE),\"\")","v":"St Pierre noir"},{"$f":"IF($A65<>\"\",VLOOKUP($A65,T_stock[],COLUMN()-1,FALSE),\"\")","v":0},{"$f":"IF($A65<>\"\",VLOOKUP($A65,T_stock[],COLUMN()-1,FALSE),\"\")","v":0.7},{"$f":"IF($A65<>\"\",VLOOKUP($A65,T_stock[],COLUMN()-1,FALSE),\"\")","v":2.1},5,"2013-03-22"]
["334 40 10","AGD",{"$f":"IF($A66<>\"\",VLOOKUP($A66,T_stock[],COLUMN()-1,FALSE),\"\")","v":"Fil"},{"$f":"IF($A66<>\"\",VLOOKUP($A66,T_stock[],COLUMN()-1,FALSE),\"\")","v":"Câblé cheval vert blanc"},{"$f":"IF($A66<>\"\",VLOOKUP($A66,T_stock[],COLUMN()-1,FALSE),\"\")","v":40},{"$f":"IF($A66<>\"\",VLOOKUP($A66,T_stock[],COLUMN()-1,FALSE),\"\")","v":3.58},{"$f":"IF($A66<>\"\",VLOOKUP($A66,T_stock[],COLUMN()-1,FALSE),\"\")","v":10.7},1]
["334 40 310","AGD",{"$f":"IF($A67<>\"\",VLOOKUP($A67,T_stock[],COLUMN()-1,FALSE),\"\")","v":"Fil"},{"$f":"IF($A67<>\"\",VLOOKUP($A67,T_stock[],COLUMN()-1,FALSE),\"\")","v":"Câblé cheval vert noir"},{"$f":"IF($A67<>\"\",VLOOKUP($A67,T_stock[],COLUMN()-1,FALSE),\"\")","v":40},{"$f":"IF($A67<>\"\",VLOOKUP($A67,T_stock[],COLUMN()-1,FALSE),\"\")","v":3.58},{"$f":"IF($A67<>\"\",VLOOKUP($A67,T_stock[],COLUMN()-1,FALSE),\"\")","v":10.7},1]
["334 50 10","AGD",{"$f":"IF($A68<>\"\",VLOOKUP($A68,T_stock[],COLUMN()-1,FALSE),\"\")","v":"Fil"},{"$f":"IF($A68<>\"\",VLOOKUP($A68,T_stock[],COLUMN()-1,FALSE),\"\")","v":"Câblé cheval vert blanc"},{"$f":"IF($A68<>\"\",VLOOKUP($A68,T_stock[],COLUMN()-1,FALSE),\"\")","v":50},{"$f":"IF($A68<>\"\",VLOOKUP($A68,T_stock[],COLUMN()-1,FALSE),\"\")","v":3.58},{"$f":"IF($A68<>\"\",VLOOKUP($A68,T_stock[],COLUMN()-1,FALSE),\"\")","v":10.7},1]
["334 50 310","AGD",{"$f":"IF($A69<>\"\",VLOOKUP($A69,T_stock[],COLUMN()-1,FALSE),\"\")","v":"Fil"},{"$f":"IF($A69<>\"\",VLOOKUP($A69,T_stock[],COLUMN()-1,FALSE),\"\")","v":"Câblé cheval vert noir"},{"$f":"IF($A69<>\"\",VLOOKUP($A69,T_stock[],COLUMN()-1,FALSE),\"\")","v":50},{"$f":"IF($A69<>\"\",VLOOKUP($A69,T_stock[],COLUMN()-1,FALSE),\"\")","v":3.58},{"$f":"IF($A69<>\"\",VLOOKUP($A69,T_stock[],COLUMN()-1,FALSE),\"\")","v":10.7},1]
["282201","AGD",{"$f":"IF($A70<>\"\",VLOOKUP($A70,T_stock[],COLUMN()-1,FALSE),\"\")","v":"Mercerie"},{"$f":"IF($A70<>\"\",VLOOKUP($A70,T_stock[],COLUMN()-1,FALSE),\"\")","v":"Mètre automatic"},{"$f":"IF($A70<>\"\",VLOOKUP($A70,T_stock[],COLUMN()-1,FALSE),\"\")","v":"maxi"},{"$f":"IF($A70<>\"\",VLOOKUP($A70,T_stock[],COLUMN()-1,FALSE),\"\")","v":2.4500000000000002},{"$f":"IF($A70<>\"\",VLOOKUP($A70,T_stock[],COLUMN()-1,FALSE),\"\")","v":6.4},1]
["923101","AGD",{"$f":"IF($A71<>\"\",VLOOKUP($A71,T_stock[],COLUMN()-1,FALSE),\"\")","v":"Motif"},{"$f":"IF($A71<>\"\",VLOOKUP($A71,T_stock[],COLUMN()-1,FALSE),\"\")","v":"Chouette"},{"$f":"IF($A71<>\"\",VLOOKUP($A71,T_stock[],COLUMN()-1,FALSE),\"\")","v":0},{"$f":"IF($A71<>\"\",VLOOKUP($A71,T_stock[],COLUMN()-1,FALSE),\"\")","v":1.75},{"$f":"IF($A71<>\"\",VLOOKUP($A71,T_stock[],COLUMN()-1,FALSE),\"\")","v":5.2},1]
["282101","AGD",{"$f":"IF($A72<>\"\",VLOOKUP($A72,T_stock[],COLUMN()-1,FALSE),\"\")","v":"Mercerie"},{"$f":"IF($A72<>\"\",VLOOKUP($A72,T_stock[],COLUMN()-1,FALSE),\"\")","v":"Mètre ruban"},{"$f":"IF($A72<>\"\",VLOOKUP($A72,T_stock[],COLUMN()-1,FALSE),\"\")","v":"junior"},{"$f":"IF($A72<>\"\",VLOOKUP($A72,T_stock[],COLUMN()-1,FALSE),\"\")","v":1.27},{"$f":"IF($A72<>\"\",VLOOKUP($A72,T_stock[],COLUMN()-1,FALSE),\"\")","v":4.5},1]
["403712","AGD",{"$f":"IF($A73<>\"\",VLOOKUP($A73,T_stock[],COLUMN()-1,FALSE),\"\")","v":"Motif"},{"$f":"IF($A73<>\"\",VLOOKUP($A73,T_stock[],COLUMN()-1,FALSE),\"\")","v":"Strass"},{"$f":"IF($A73<>\"\",VLOOKUP($A73,T_stock[],COLUMN()-1,FALSE),\"\")","v":0},{"$f":"IF($A73<>\"\",VLOOKUP($A73,T_stock[],COLUMN()-1,FALSE),\"\")","v":1.92},{"$f":"IF($A73<>\"\",VLOOKUP($A73,T_stock[],COLUMN()-1,FALSE),\"\")","v":5.8},2]
["282209","AGD",{"$f":"IF($A74<>\"\",VLOOKUP($A74,T_stock[],COLUMN()-1,FALSE),\"\")","v":"Mercerie"},{"$f":"IF($A74<>\"\",VLOOKUP($A74,T_stock[],COLUMN()-1,FALSE),\"\")","v":"Mètre automatic"},{"$f":"IF($A74<>\"\",VLOOKUP($A74,T_stock[],COLUMN()-1,FALSE),\"\")","v":"mini"},{"$f":"IF($A74<>\"\",VLOOKUP($A74,T_stock[],COLUMN()-1,FALSE),\"\")","v":2.2000000000000002},{"$f":"IF($A74<>\"\",VLOOKUP($A74,T_stock[],COLUMN()-1,FALSE),\"\")","v":5.6},1]
["923103","AGD",{"$f":"IF($A75<>\"\",VLOOKUP($A75,T_stock[],COLUMN()-1,FALSE),\"\")","v":"Motif"},{"$f":"IF($A75<>\"\",VLOOKUP($A75,T_stock[],COLUMN()-1,FALSE),\"\")","v":"Papillon"},{"$f":"IF($A75<>\"\",VLOOKUP($A75,T_stock[],COLUMN()-1,FALSE),\"\")","v":0},{"$f":"IF($A75<>\"\",VLOOKUP($A75,T_stock[],COLUMN()-1,FALSE),\"\")","v":1.42},{"$f":"IF($A75<>\"\",VLOOKUP($A75,T_stock[],COLUMN()-1,FALSE),\"\")","v":4.2},1]
["925156","AGD",{"$f":"IF($A76<>\"\",VLOOKUP($A76,T_stock[],COLUMN()-1,FALSE),\"\")","v":"Motif"},{"$f":"IF($A76<>\"\",VLOOKUP($A76,T_stock[],COLUMN()-1,FALSE),\"\")","v":"Mouton"},{"$f":"IF($A76<>\"\",VLOOKUP($A76,T_stock[],COLUMN()-1,FALSE),\"\")","v":0},{"$f":"IF($A76<>\"\",VLOOKUP($A76,T_stock[],COLUMN()-1,FALSE),\"\")","v":2.0499999999999998},{"$f":"IF($A76<>\"\",VLOOKUP($A76,T_stock[],COLUMN()-1,FALSE),\"\")","v":6.1},1]
["159951","AGD",{"$f":"IF($A77<>\"\",VLOOKUP($A77,T_stock[],COLUMN()-1,FALSE),\"\")","v":"Ciseaux"},{"$f":"IF($A77<>\"\",VLOOKUP($A77,T_stock[],COLUMN()-1,FALSE),\"\")","v":"Fiskars universel"},{"$f":"IF($A77<>\"\",VLOOKUP($A77,T_stock[],COLUMN()-1,FALSE),\"\")","v":"21cm"},{"$f":"IF($A77<>\"\",VLOOKUP($A77,T_stock[],COLUMN()-1,FALSE),\"\")","v":6.86},{"$f":"IF($A77<>\"\",VLOOKUP($A77,T_stock[],COLUMN()-1,FALSE),\"\")","v":20.5},1]
["615159","AGD",{"$f":"IF($A78<>\"\",VLOOKUP($A78,T_stock[],COLUMN()-1,FALSE),\"\")","v":"Mercerie"},{"$f":"IF($A78<>\"\",VLOOKUP($A78,T_stock[],COLUMN()-1,FALSE),\"\")","v":"Fermoir Julia"},{"$f":"IF($A78<>\"\",VLOOKUP($A78,T_stock[],COLUMN()-1,FALSE),\"\")","v":"petit"},{"$f":"IF($A78<>\"\",VLOOKUP($A78,T_stock[],COLUMN()-1,FALSE),\"\")","v":2.0499999999999998},{"$f":"IF($A78<>\"\",VLOOKUP($A78,T_stock[],COLUMN()-1,FALSE),\"\")","v":6.1},2]
["611321","AGD",{"$f":"IF($A79<>\"\",VLOOKUP($A79,T_stock[],COLUMN()-1,FALSE),\"\")","v":"Mercerie"},{"$f":"IF($A79<>\"\",VLOOKUP($A79,T_stock[],COLUMN()-1,FALSE),\"\")","v":"Pelote tomate"},{"$f":"IF($A79<>\"\",VLOOKUP($A79,T_stock[],COLUMN()-1,FALSE),\"\")","v":0},{"$f":"IF($A79<>\"\",VLOOKUP($A79,T_stock[],COLUMN()-1,FALSE),\"\")","v":1.61},{"$f":"IF($A79<>\"\",VLOOKUP($A79,T_stock[],COLUMN()-1,FALSE),\"\")","v":5.5},1]
["615158","AGD",{"$f":"IF($A80<>\"\",VLOOKUP($A80,T_stock[],COLUMN()-1,FALSE),\"\")","v":"Mercerie"},{"$f":"IF($A80<>\"\",VLOOKUP($A80,T_stock[],COLUMN()-1,FALSE),\"\")","v":"Fermoir Emilia"},{"$f":"IF($A80<>\"\",VLOOKUP($A80,T_stock[],COLUMN()-1,FALSE),\"\")","v":"moyen"},{"$f":"IF($A80<>\"\",VLOOKUP($A80,T_stock[],COLUMN()-1,FALSE),\"\")","v":2.4500000000000002},{"$f":"IF($A80<>\"\",VLOOKUP($A80,T_stock[],COLUMN()-1,FALSE),\"\")","v":7.3},2]
["615151","AGD",{"$f":"IF($A81<>\"\",VLOOKUP($A81,T_stock[],COLUMN()-1,FALSE),\"\")","v":"Mercerie"},{"$f":"IF($A81<>\"\",VLOOKUP($A81,T_stock[],COLUMN()-1,FALSE),\"\")","v":"Fermoir Lucia"},{"$f":"IF($A81<>\"\",VLOOKUP($A81,T_stock[],COLUMN()-1,FALSE),\"\")","v":"grand"},{"$f":"IF($A81<>\"\",VLOOKUP($A81,T_stock[],COLUMN()-1,FALSE),\"\")","v":3.8},{"$f":"IF($A81<>\"\",VLOOKUP($A81,T_stock[],COLUMN()-1,FALSE),\"\")","v":11},2]
["6702601","AGD",{"$f":"IF($A82<>\"\",VLOOKUP($A82,T_stock[],COLUMN()-1,FALSE),\"\")","v":"Outils"},{"$f":"IF($A82<>\"\",VLOOKUP($A82,T_stock[],COLUMN()-1,FALSE),\"\")","v":"Pince coupante"},{"$f":"IF($A82<>\"\",VLOOKUP($A82,T_stock[],COLUMN()-1,FALSE),\"\")","v":0},{"$f":"IF($A82<>\"\",VLOOKUP($A82,T_stock[],COLUMN()-1,FALSE),\"\")","v":4.6500000000000004},{"$f":"IF($A82<>\"\",VLOOKUP($A82,T_stock[],COLUMN()-1,FALSE),\"\")","v":13.5},1]
["6702431","AGD",{"$f":"IF($A83<>\"\",VLOOKUP($A83,T_stock[],COLUMN()-1,FALSE),\"\")","v":"Outils"},{"$f":"IF($A83<>\"\",VLOOKUP($A83,T_stock[],COLUMN()-1,FALSE),\"\")","v":"Pince plate"},{"$f":"IF($A83<>\"\",VLOOKUP($A83,T_stock[],COLUMN()-1,FALSE),\"\")","v":0},{"$f":"IF($A83<>\"\",VLOOKUP($A83,T_stock[],COLUMN()-1,FALSE),\"\")","v":4.6500000000000004},{"$f":"IF($A83<>\"\",VLOOKUP($A83,T_stock[],COLUMN()-1,FALSE),\"\")","v":13.5},1]
["321111","AGD",{"$f":"IF($A84<>\"\",VLOOKUP($A84,T_stock[],COLUMN()-1,FALSE),\"\")","v":"Ciseaux"},{"$f":"IF($A84<>\"\",VLOOKUP($A84,T_stock[],COLUMN()-1,FALSE),\"\")","v":"A broder"},{"$f":"IF($A84<>\"\",VLOOKUP($A84,T_stock[],COLUMN()-1,FALSE),\"\")","v":"7cm"},{"$f":"IF($A84<>\"\",VLOOKUP($A84,T_stock[],COLUMN()-1,FALSE),\"\")","v":6.34},{"$f":"IF($A84<>\"\",VLOOKUP($A84,T_stock[],COLUMN()-1,FALSE),\"\")","v":15},3]
["32713414","AGD",{"$f":"IF($A85<>\"\",VLOOKUP($A85,T_stock[],COLUMN()-1,FALSE),\"\")","v":"Ciseaux"},{"$f":"IF($A85<>\"\",VLOOKUP($A85,T_stock[],COLUMN()-1,FALSE),\"\")","v":"Lingère"},{"$f":"IF($A85<>\"\",VLOOKUP($A85,T_stock[],COLUMN()-1,FALSE),\"\")","v":"14cm"},{"$f":"IF($A85<>\"\",VLOOKUP($A85,T_stock[],COLUMN()-1,FALSE),\"\")","v":3.66},{"$f":"IF($A85<>\"\",VLOOKUP($A85,T_stock[],COLUMN()-1,FALSE),\"\")","v":11},1]
["32713411","AGD",{"$f":"IF($A86<>\"\",VLOOKUP($A86,T_stock[],COLUMN()-1,FALSE),\"\")","v":"Ciseaux"},{"$f":"IF($A86<>\"\",VLOOKUP($A86,T_stock[],COLUMN()-1,FALSE),\"\")","v":"Lingère"},{"$f":"IF($A86<>\"\",VLOOKUP($A86,T_stock[],COLUMN()-1,FALSE),\"\")","v":"11cm"},{"$f":"IF($A86<>\"\",VLOOKUP($A86,T_stock[],COLUMN()-1,FALSE),\"\")","v":3.43},{"$f":"IF($A86<>\"\",VLOOKUP($A86,T_stock[],COLUMN()-1,FALSE),\"\")","v":10.3},1]
["98752100","AGD",{"$f":"IF($A87<>\"\",VLOOKUP($A87,T_stock[],COLUMN()-1,FALSE),\"\")","v":"Fil"},{"$f":"IF($A87<>\"\",VLOOKUP($A87,T_stock[],COLUMN()-1,FALSE),\"\")","v":"Fusette blanc"},{"$f":"IF($A87<>\"\",VLOOKUP($A87,T_stock[],COLUMN()-1,FALSE),\"\")","v":"1000m"},{"$f":"IF($A87<>\"\",VLOOKUP($A87,T_stock[],COLUMN()-1,FALSE),\"\")","v":1.25},{"$f":"IF($A87<>\"\",VLOOKUP($A87,T_stock[],COLUMN()-1,FALSE),\"\")","v":6},5]
["98752180","AGD",{"$f":"IF($A88<>\"\",VLOOKUP($A88,T_stock[],COLUMN()-1,FALSE),\"\")","v":"Fil"},{"$f":"IF($A88<>\"\",VLOOKUP($A88,T_stock[],COLUMN()-1,FALSE),\"\")","v":"Fusette noir"},{"$f":"IF($A88<>\"\",VLOOKUP($A88,T_stock[],COLUMN()-1,FALSE),\"\")","v":"1000m"},{"$f":"IF($A88<>\"\",VLOOKUP($A88,T_stock[],COLUMN()-1,FALSE),\"\")","v":1.25},{"$f":"IF($A88<>\"\",VLOOKUP($A88,T_stock[],COLUMN()-1,FALSE),\"\")","v":6},5]
["925157","AGD",{"$f":"IF($A89<>\"\",VLOOKUP($A89,T_stock[],COLUMN()-1,FALSE),\"\")","v":"Motif"},{"$f":"IF($A89<>\"\",VLOOKUP($A89,T_stock[],COLUMN()-1,FALSE),\"\")","v":"Chien"},{"$f":"IF($A89<>\"\",VLOOKUP($A89,T_stock[],COLUMN()-1,FALSE),\"\")","v":0},{"$f":"IF($A89<>\"\",VLOOKUP($A89,T_stock[],COLUMN()-1,FALSE),\"\")","v":2.0499999999999998},{"$f":"IF($A89<>\"\",VLOOKUP($A89,T_stock[],COLUMN()-1,FALSE),\"\")","v":6.1},1]
["98 36210 592","AGD",{"$f":"IF($A90<>\"\",VLOOKUP($A90,T_stock[],COLUMN()-1,FALSE),\"\")","v":"Fil"},{"$f":"IF($A90<>\"\",VLOOKUP($A90,T_stock[],COLUMN()-1,FALSE),\"\")","v":"Fil à bâtir rose"},{"$f":"IF($A90<>\"\",VLOOKUP($A90,T_stock[],COLUMN()-1,FALSE),\"\")","v":0},{"$f":"IF($A90<>\"\",VLOOKUP($A90,T_stock[],COLUMN()-1,FALSE),\"\")","v":1.31},{"$f":"IF($A90<>\"\",VLOOKUP($A90,T_stock[],COLUMN()-1,FALSE),\"\")","v":3.9},5]
["98 36210 100","AGD",{"$f":"IF($A91<>\"\",VLOOKUP($A91,T_stock[],COLUMN()-1,FALSE),\"\")","v":"Fil"},{"$f":"IF($A91<>\"\",VLOOKUP($A91,T_stock[],COLUMN()-1,FALSE),\"\")","v":"Fil à bâtir blanc"},{"$f":"IF($A91<>\"\",VLOOKUP($A91,T_stock[],COLUMN()-1,FALSE),\"\")","v":0},{"$f":"IF($A91<>\"\",VLOOKUP($A91,T_stock[],COLUMN()-1,FALSE),\"\")","v":1.31},{"$f":"IF($A91<>\"\",VLOOKUP($A91,T_stock[],COLUMN()-1,FALSE),\"\")","v":3.9},5]
["611862","AGD",{"$f":"IF($A92<>\"\",VLOOKUP($A92,T_stock[],COLUMN()-1,FALSE),\"\")","v":"Laine"},{"$f":"IF($A92<>\"\",VLOOKUP($A92,T_stock[],COLUMN()-1,FALSE),\"\")","v":"Boîte à laine"},{"$f":"IF($A92<>\"\",VLOOKUP($A92,T_stock[],COLUMN()-1,FALSE),\"\")","v":0},{"$f":"IF($A92<>\"\",VLOOKUP($A92,T_stock[],COLUMN()-1,FALSE),\"\")","v":2.69},{"$f":"IF($A92<>\"\",VLOOKUP($A92,T_stock[],COLUMN()-1,FALSE),\"\")","v":8},1]
["148/12","LEFORT",{"$f":"IF($A93<>\"\",VLOOKUP($A93,T_stock[],COLUMN()-1,FALSE),\"\")","v":"Mercerie"},{"$f":"IF($A93<>\"\",VLOOKUP($A93,T_stock[],COLUMN()-1,FALSE),\"\")","v":"Coude Nigal noir"},{"$f":"IF($A93<>\"\",VLOOKUP($A93,T_stock[],COLUMN()-1,FALSE),\"\")","v":"grand"},{"$f":"IF($A93<>\"\",VLOOKUP($A93,T_stock[],COLUMN()-1,FALSE),\"\")","v":0},{"$f":"IF($A93<>\"\",VLOOKUP($A93,T_stock[],COLUMN()-1,FALSE),\"\")","v":4.8},2]
["181/12","LEFORT",{"$f":"IF($A94<>\"\",VLOOKUP($A94,T_stock[],COLUMN()-1,FALSE),\"\")","v":"Mercerie"},{"$f":"IF($A94<>\"\",VLOOKUP($A94,T_stock[],COLUMN()-1,FALSE),\"\")","v":"Coude Kleiber noir imitation cuir"},{"$f":"IF($A94<>\"\",VLOOKUP($A94,T_stock[],COLUMN()-1,FALSE),\"\")","v":"grand"},{"$f":"IF($A94<>\"\",VLOOKUP($A94,T_stock[],COLUMN()-1,FALSE),\"\")","v":0},{"$f":"IF($A94<>\"\",VLOOKUP($A94,T_stock[],COLUMN()-1,FALSE),\"\")","v":5.5},1]
["213/12","LEFORT",{"$f":"IF($A95<>\"\",VLOOKUP($A95,T_stock[],COLUMN()-1,FALSE),\"\")","v":"Mercerie"},{"$f":"IF($A95<>\"\",VLOOKUP($A95,T_stock[],COLUMN()-1,FALSE),\"\")","v":"Coude Kleiber gris daim"},{"$f":"IF($A95<>\"\",VLOOKUP($A95,T_stock[],COLUMN()-1,FALSE),\"\")","v":"grand"},{"$f":"IF($A95<>\"\",VLOOKUP($A95,T_stock[],COLUMN()-1,FALSE),\"\")","v":0},{"$f":"IF($A95<>\"\",VLOOKUP($A95,T_stock[],COLUMN()-1,FALSE),\"\")","v":6.2},2]
["182/12","LEFORT",{"$f":"IF($A96<>\"\",VLOOKUP($A96,T_stock[],COLUMN()-1,FALSE),\"\")","v":"Mercerie"},{"$f":"IF($A96<>\"\",VLOOKUP($A96,T_stock[],COLUMN()-1,FALSE),\"\")","v":"Coude Kleiber marron imitation cuir"},{"$f":"IF($A96<>\"\",VLOOKUP($A96,T_stock[],COLUMN()-1,FALSE),\"\")","v":"grand"},{"$f":"IF($A96<>\"\",VLOOKUP($A96,T_stock[],COLUMN()-1,FALSE),\"\")","v":0},{"$f":"IF($A96<>\"\",VLOOKUP($A96,T_stock[],COLUMN()-1,FALSE),\"\")","v":5.5},1]
["144/11","LEFORT",{"$f":"IF($A97<>\"\",VLOOKUP($A97,T_stock[],COLUMN()-1,FALSE),\"\")","v":"Mercerie"},{"$f":"IF($A97<>\"\",VLOOKUP($A97,T_stock[],COLUMN()-1,FALSE),\"\")","v":"Coude Nigal vert sapin"},{"$f":"IF($A97<>\"\",VLOOKUP($A97,T_stock[],COLUMN()-1,FALSE),\"\")","v":"grand"},{"$f":"IF($A97<>\"\",VLOOKUP($A97,T_stock[],COLUMN()-1,FALSE),\"\")","v":0},{"$f":"IF($A97<>\"\",VLOOKUP($A97,T_stock[],COLUMN()-1,FALSE),\"\")","v":4.9000000000000004},1]
["149/12","LEFORT",{"$f":"IF($A98<>\"\",VLOOKUP($A98,T_stock[],COLUMN()-1,FALSE),\"\")","v":"Mercerie"},{"$f":"IF($A98<>\"\",VLOOKUP($A98,T_stock[],COLUMN()-1,FALSE),\"\")","v":"Coude Nigal kaki"},{"$f":"IF($A98<>\"\",VLOOKUP($A98,T_stock[],COLUMN()-1,FALSE),\"\")","v":"grand"},{"$f":"IF($A98<>\"\",VLOOKUP($A98,T_stock[],COLUMN()-1,FALSE),\"\")","v":0},{"$f":"IF($A98<>\"\",VLOOKUP($A98,T_stock[],COLUMN()-1,FALSE),\"\")","v":4.9000000000000004},1]
["150/12","LEFORT",{"$f":"IF($A99<>\"\",VLOOKUP($A99,T_stock[],COLUMN()-1,FALSE),\"\")","v":"Mercerie"},{"$f":"IF($A99<>\"\",VLOOKUP($A99,T_stock[],COLUMN()-1,FALSE),\"\")","v":"Coude Pronty kaki"},{"$f":"IF($A99<>\"\",VLOOKUP($A99,T_stock[],COLUMN()-1,FALSE),\"\")","v":0},{"$f":"IF($A99<>\"\",VLOOKUP($A99,T_stock[],COLUMN()-1,FALSE),\"\")","v":0},{"$f":"IF($A99<>\"\",VLOOKUP($A99,T_stock[],COLUMN()-1,FALSE),\"\")","v":4.5},1]
["165/11","LEFORT",{"$f":"IF($A100<>\"\",VLOOKUP($A100,T_stock[],COLUMN()-1,FALSE),\"\")","v":"Mercerie"},{"$f":"IF($A100<>\"\",VLOOKUP($A100,T_stock[],COLUMN()-1,FALSE),\"\")","v":"Coude Union Knopf kaki"},{"$f":"IF($A100<>\"\",VLOOKUP($A100,T_stock[],COLUMN()-1,FALSE),\"\")","v":0},{"$f":"IF($A100<>\"\",VLOOKUP($A100,T_stock[],COLUMN()-1,FALSE),\"\")","v":0},{"$f":"IF($A100<>\"\",VLOOKUP($A100,T_stock[],COLUMN()-1,FALSE),\"\")","v":4.95},1]
["183/12","LEFORT",{"$f":"IF($A101<>\"\",VLOOKUP($A101,T_stock[],COLUMN()-1,FALSE),\"\")","v":"Mercerie"},{"$f":"IF($A101<>\"\",VLOOKUP($A101,T_stock[],COLUMN()-1,FALSE),\"\")","v":"Coude Kleiber marine imitation cuir"},{"$f":"IF($A101<>\"\",VLOOKUP($A101,T_stock[],COLUMN()-1,FALSE),\"\")","v":"grand"},{"$f":"IF($A101<>\"\",VLOOKUP($A101,T_stock[],COLUMN()-1,FALSE),\"\")","v":0},{"$f":"IF($A101<>\"\",VLOOKUP($A101,T_stock[],COLUMN()-1,FALSE),\"\")","v":5.5},1]
["151/12","LEFORT",{"$f":"IF($A102<>\"\",VLOOKUP($A102,T_stock[],COLUMN()-1,FALSE),\"\")","v":"Mercerie"},{"$f":"IF($A102<>\"\",VLOOKUP($A102,T_stock[],COLUMN()-1,FALSE),\"\")","v":"Coude Nigal rouge"},{"$f":"IF($A102<>\"\",VLOOKUP($A102,T_stock[],COLUMN()-1,FALSE),\"\")","v":"grand"},{"$f":"IF($A102<>\"\",VLOOKUP($A102,T_stock[],COLUMN()-1,FALSE),\"\")","v":0},{"$f":"IF($A102<>\"\",VLOOKUP($A102,T_stock[],COLUMN()-1,FALSE),\"\")","v":4.9000000000000004},1]
["152/12","LEFORT",{"$f":"IF($A103<>\"\",VLOOKUP($A103,T_stock[],COLUMN()-1,FALSE),\"\")","v":"Mercerie"},{"$f":"IF($A103<>\"\",VLOOKUP($A103,T_stock[],COLUMN()-1,FALSE),\"\")","v":"Coude Pronty beige"},{"$f":"IF($A103<>\"\",VLOOKUP($A103,T_stock[],COLUMN()-1,FALSE),\"\")","v":0},{"$f":"IF($A103<>\"\",VLOOKUP($A103,T_stock[],COLUMN()-1,FALSE),\"\")","v":0},{"$f":"IF($A103<>\"\",VLOOKUP($A103,T_stock[],COLUMN()-1,FALSE),\"\")","v":4.5},1]
["130/12","LEFORT",{"$f":"IF($A104<>\"\",VLOOKUP($A104,T_stock[],COLUMN()-1,FALSE),\"\")","v":"Mercerie"},{"$f":"IF($A104<>\"\",VLOOKUP($A104,T_stock[],COLUMN()-1,FALSE),\"\")","v":"Coude Pic&malice beige"},{"$f":"IF($A104<>\"\",VLOOKUP($A104,T_stock[],COLUMN()-1,FALSE),\"\")","v":"grand"},{"$f":"IF($A104<>\"\",VLOOKUP($A104,T_stock[],COLUMN()-1,FALSE),\"\")","v":0},{"$f":"IF($A104<>\"\",VLOOKUP($A104,T_stock[],COLUMN()-1,FALSE),\"\")","v":3.9},1]
["00000","LEFORT",{"$f":"IF($A105<>\"\",VLOOKUP($A105,T_stock[],COLUMN()-1,FALSE),\"\")","v":"Motif"},{"$f":"IF($A105<>\"\",VLOOKUP($A105,T_stock[],COLUMN()-1,FALSE),\"\")","v":"Motifs divers (LEFORT)"},{"$f":"IF($A105<>\"\",VLOOKUP($A105,T_stock[],COLUMN()-1,FALSE),\"\")","v":0},{"$f":"IF($A105<>\"\",VLOOKUP($A105,T_stock[],COLUMN()-1,FALSE),\"\")","v":0},{"$f":"IF($A105<>\"\",VLOOKUP($A105,T_stock[],COLUMN()-1,FALSE),\"\")","v":0},96]
["133/12","LEFORT",{"$f":"IF($A106<>\"\",VLOOKUP($A106,T_stock[],COLUMN()-1,FALSE),\"\")","v":"Mercerie"},{"$f":"IF($A106<>\"\",VLOOKUP($A106,T_stock[],COLUMN()-1,FALSE),\"\")","v":"Thermocollant quick gris clair"},{"$f":"IF($A106<>\"\",VLOOKUP($A106,T_stock[],COLUMN()-1,FALSE),\"\")","v":0},{"$f":"IF($A106<>\"\",VLOOKUP($A106,T_stock[],COLUMN()-1,FALSE),\"\")","v":0},{"$f":"IF($A106<>\"\",VLOOKUP($A106,T_stock[],COLUMN()-1,FALSE),\"\")","v":4.2},1]
["127/12","LEFORT",{"$f":"IF($A107<>\"\",VLOOKUP($A107,T_stock[],COLUMN()-1,FALSE),\"\")","v":"Mercerie"},{"$f":"IF($A107<>\"\",VLOOKUP($A107,T_stock[],COLUMN()-1,FALSE),\"\")","v":"Thermocollant quick beige"},{"$f":"IF($A107<>\"\",VLOOKUP($A107,T_stock[],COLUMN()-1,FALSE),\"\")","v":0},{"$f":"IF($A107<>\"\",VLOOKUP($A107,T_stock[],COLUMN()-1,FALSE),\"\")","v":0},{"$f":"IF($A107<>\"\",VLOOKUP($A107,T_stock[],COLUMN()-1,FALSE),\"\")","v":4.2},1]
["138/12","LEFORT",{"$f":"IF($A108<>\"\",VLOOKUP($A108,T_stock[],COLUMN()-1,FALSE),\"\")","v":"Mercerie"},{"$f":"IF($A108<>\"\",VLOOKUP($A108,T_stock[],COLUMN()-1,FALSE),\"\")","v":"Thermocollant quick blanc"},{"$f":"IF($A108<>\"\",VLOOKUP($A108,T_stock[],COLUMN()-1,FALSE),\"\")","v":0},{"$f":"IF($A108<>\"\",VLOOKUP($A108,T_stock[],COLUMN()-1,FALSE),\"\")","v":0},{"$f":"IF($A108<>\"\",VLOOKUP($A108,T_stock[],COLUMN()-1,FALSE),\"\")","v":4.2},1]
["136/12","LEFORT",{"$f":"IF($A109<>\"\",VLOOKUP($A109,T_stock[],COLUMN()-1,FALSE),\"\")","v":"Mercerie"},{"$f":"IF($A109<>\"\",VLOOKUP($A109,T_stock[],COLUMN()-1,FALSE),\"\")","v":"Thermocollant quick écru"},{"$f":"IF($A109<>\"\",VLOOKUP($A109,T_stock[],COLUMN()-1,FALSE),\"\")","v":0},{"$f":"IF($A109<>\"\",VLOOKUP($A109,T_stock[],COLUMN()-1,FALSE),\"\")","v":0},{"$f":"IF($A109<>\"\",VLOOKUP($A109,T_stock[],COLUMN()-1,FALSE),\"\")","v":4.2},1]
["245/11","LEFORT",{"$f":"IF($A110<>\"\",VLOOKUP($A110,T_stock[],COLUMN()-1,FALSE),\"\")","v":"Mercerie"},{"$f":"IF($A110<>\"\",VLOOKUP($A110,T_stock[],COLUMN()-1,FALSE),\"\")","v":"Aiguilles machine"},{"$f":"IF($A110<>\"\",VLOOKUP($A110,T_stock[],COLUMN()-1,FALSE),\"\")","v":70},{"$f":"IF($A110<>\"\",VLOOKUP($A110,T_stock[],COLUMN()-1,FALSE),\"\")","v":0},{"$f":"IF($A110<>\"\",VLOOKUP($A110,T_stock[],COLUMN()-1,FALSE),\"\")","v":7.8},1]
["251/12","LEFORT",{"$f":"IF($A111<>\"\",VLOOKUP($A111,T_stock[],COLUMN()-1,FALSE),\"\")","v":"Mercerie"},{"$f":"IF($A111<>\"\",VLOOKUP($A111,T_stock[],COLUMN()-1,FALSE),\"\")","v":"Aiguilles machine"},{"$f":"IF($A111<>\"\",VLOOKUP($A111,T_stock[],COLUMN()-1,FALSE),\"\")","v":80},{"$f":"IF($A111<>\"\",VLOOKUP($A111,T_stock[],COLUMN()-1,FALSE),\"\")","v":0},{"$f":"IF($A111<>\"\",VLOOKUP($A111,T_stock[],COLUMN()-1,FALSE),\"\")","v":8},2]
["250/12","LEFORT",{"$f":"IF($A112<>\"\",VLOOKUP($A112,T_stock[],COLUMN()-1,FALSE),\"\")","v":"Mercerie"},{"$f":"IF($A112<>\"\",VLOOKUP($A112,T_stock[],COLUMN()-1,FALSE),\"\")","v":"Aiguilles machine"},{"$f":"IF($A112<>\"\",VLOOKUP($A112,T_stock[],COLUMN()-1,FALSE),\"\")","v":"70 80 90"},{"$f":"IF($A112<>\"\",VLOOKUP($A112,T_stock[],COLUMN()-1,FALSE),\"\")","v":0},{"$f":"IF($A112<>\"\",VLOOKUP($A112,T_stock[],COLUMN()-1,FALSE),\"\")","v":8},1]
["090/12","LEFORT",{"$f":"IF($A113<>\"\",VLOOKUP($A113,T_stock[],COLUMN()-1,FALSE),\"\")","v":"Mercerie"},{"$f":"IF($A113<>\"\",VLOOKUP($A113,T_stock[],COLUMN()-1,FALSE),\"\")","v":"Aiguilles à main "},{"$f":"IF($A113<>\"\",VLOOKUP($A113,T_stock[],COLUMN()-1,FALSE),\"\")","v":"1/5"},{"$f":"IF($A113<>\"\",VLOOKUP($A113,T_stock[],COLUMN()-1,FALSE),\"\")","v":0},{"$f":"IF($A113<>\"\",VLOOKUP($A113,T_stock[],COLUMN()-1,FALSE),\"\")","v":3},3]
["091/12","LEFORT",{"$f":"IF($A114<>\"\",VLOOKUP($A114,T_stock[],COLUMN()-1,FALSE),\"\")","v":"Mercerie"},{"$f":"IF($A114<>\"\",VLOOKUP($A114,T_stock[],COLUMN()-1,FALSE),\"\")","v":"Aiguilles à main "},{"$f":"IF($A114<>\"\",VLOOKUP($A114,T_stock[],COLUMN()-1,FALSE),\"\")","v":"3/9"},{"$f":"IF($A114<>\"\",VLOOKUP($A114,T_stock[],COLUMN()-1,FALSE),\"\")","v":0},{"$f":"IF($A114<>\"\",VLOOKUP($A114,T_stock[],COLUMN()-1,FALSE),\"\")","v":3},3]
["093/12","LEFORT",{"$f":"IF($A115<>\"\",VLOOKUP($A115,T_stock[],COLUMN()-1,FALSE),\"\")","v":"Mercerie"},{"$f":"IF($A115<>\"\",VLOOKUP($A115,T_stock[],COLUMN()-1,FALSE),\"\")","v":"Aiguilles à main "},{"$f":"IF($A115<>\"\",VLOOKUP($A115,T_stock[],COLUMN()-1,FALSE),\"\")","v":7},{"$f":"IF($A115<>\"\",VLOOKUP($A115,T_stock[],COLUMN()-1,FALSE),\"\")","v":0},{"$f":"IF($A115<>\"\",VLOOKUP($A115,T_stock[],COLUMN()-1,FALSE),\"\")","v":3},3]
["094/12","LEFORT",{"$f":"IF($A116<>\"\",VLOOKUP($A116,T_stock[],COLUMN()-1,FALSE),\"\")","v":"Mercerie"},{"$f":"IF($A116<>\"\",VLOOKUP($A116,T_stock[],COLUMN()-1,FALSE),\"\")","v":"Aiguilles à main "},{"$f":"IF($A116<>\"\",VLOOKUP($A116,T_stock[],COLUMN()-1,FALSE),\"\")","v":"5/10"},{"$f":"IF($A116<>\"\",VLOOKUP($A116,T_stock[],COLUMN()-1,FALSE),\"\")","v":0},{"$f":"IF($A116<>\"\",VLOOKUP($A116,T_stock[],COLUMN()-1,FALSE),\"\")","v":3},3]
["082/12","LEFORT",{"$f":"IF($A117<>\"\",VLOOKUP($A117,T_stock[],COLUMN()-1,FALSE),\"\")","v":"Mercerie"},{"$f":"IF($A117<>\"\",VLOOKUP($A117,T_stock[],COLUMN()-1,FALSE),\"\")","v":"Epingles en acier n°4"},{"$f":"IF($A117<>\"\",VLOOKUP($A117,T_stock[],COLUMN()-1,FALSE),\"\")","v":0},{"$f":"IF($A117<>\"\",VLOOKUP($A117,T_stock[],COLUMN()-1,FALSE),\"\")","v":0},{"$f":"IF($A117<>\"\",VLOOKUP($A117,T_stock[],COLUMN()-1,FALSE),\"\")","v":3.2},3]
["140/12","LEFORT",{"$f":"IF($A118<>\"\",VLOOKUP($A118,T_stock[],COLUMN()-1,FALSE),\"\")","v":"Mercerie"},{"$f":"IF($A118<>\"\",VLOOKUP($A118,T_stock[],COLUMN()-1,FALSE),\"\")","v":"Epingles tête verre (Lefort)"},{"$f":"IF($A118<>\"\",VLOOKUP($A118,T_stock[],COLUMN()-1,FALSE),\"\")","v":0},{"$f":"IF($A118<>\"\",VLOOKUP($A118,T_stock[],COLUMN()-1,FALSE),\"\")","v":0},{"$f":"IF($A118<>\"\",VLOOKUP($A118,T_stock[],COLUMN()-1,FALSE),\"\")","v":5.5},2]
["051/12","LEFORT",{"$f":"IF($A119<>\"\",VLOOKUP($A119,T_stock[],COLUMN()-1,FALSE),\"\")","v":"Mercerie"},{"$f":"IF($A119<>\"\",VLOOKUP($A119,T_stock[],COLUMN()-1,FALSE),\"\")","v":"Agrafes pantalon x3 argent"},{"$f":"IF($A119<>\"\",VLOOKUP($A119,T_stock[],COLUMN()-1,FALSE),\"\")","v":0},{"$f":"IF($A119<>\"\",VLOOKUP($A119,T_stock[],COLUMN()-1,FALSE),\"\")","v":0},{"$f":"IF($A119<>\"\",VLOOKUP($A119,T_stock[],COLUMN()-1,FALSE),\"\")","v":2.2000000000000002},2]
["050/12","LEFORT",{"$f":"IF($A120<>\"\",VLOOKUP($A120,T_stock[],COLUMN()-1,FALSE),\"\")","v":"Mercerie"},{"$f":"IF($A120<>\"\",VLOOKUP($A120,T_stock[],COLUMN()-1,FALSE),\"\")","v":"Agrafes pantalon x3 noir"},{"$f":"IF($A120<>\"\",VLOOKUP($A120,T_stock[],COLUMN()-1,FALSE),\"\")","v":0},{"$f":"IF($A120<>\"\",VLOOKUP($A120,T_stock[],COLUMN()-1,FALSE),\"\")","v":0},{"$f":"IF($A120<>\"\",VLOOKUP($A120,T_stock[],COLUMN()-1,FALSE),\"\")","v":2.2000000000000002},2]
["081/12","LEFORT",{"$f":"IF($A121<>\"\",VLOOKUP($A121,T_stock[],COLUMN()-1,FALSE),\"\")","v":"Mercerie"},{"$f":"IF($A121<>\"\",VLOOKUP($A121,T_stock[],COLUMN()-1,FALSE),\"\")","v":"Agrafes à ressort x14 noir"},{"$f":"IF($A121<>\"\",VLOOKUP($A121,T_stock[],COLUMN()-1,FALSE),\"\")","v":0},{"$f":"IF($A121<>\"\",VLOOKUP($A121,T_stock[],COLUMN()-1,FALSE),\"\")","v":0},{"$f":"IF($A121<>\"\",VLOOKUP($A121,T_stock[],COLUMN()-1,FALSE),\"\")","v":2.5},4]
["080/12","LEFORT",{"$f":"IF($A122<>\"\",VLOOKUP($A122,T_stock[],COLUMN()-1,FALSE),\"\")","v":"Mercerie"},{"$f":"IF($A122<>\"\",VLOOKUP($A122,T_stock[],COLUMN()-1,FALSE),\"\")","v":"Agrafes à ressort x14 argent"},{"$f":"IF($A122<>\"\",VLOOKUP($A122,T_stock[],COLUMN()-1,FALSE),\"\")","v":0},{"$f":"IF($A122<>\"\",VLOOKUP($A122,T_stock[],COLUMN()-1,FALSE),\"\")","v":0},{"$f":"IF($A122<>\"\",VLOOKUP($A122,T_stock[],COLUMN()-1,FALSE),\"\")","v":2.5},2]
["099/11","LEFORT",{"$f":"IF($A123<>\"\",VLOOKUP($A123,T_stock[],COLUMN()-1,FALSE),\"\")","v":"Mercerie"},{"$f":"IF($A123<>\"\",VLOOKUP($A123,T_stock[],COLUMN()-1,FALSE),\"\")","v":"Agrafes à jupe x6 noir"},{"$f":"IF($A123<>\"\",VLOOKUP($A123,T_stock[],COLUMN()-1,FALSE),\"\")","v":0},{"$f":"IF($A123<>\"\",VLOOKUP($A123,T_stock[],COLUMN()-1,FALSE),\"\")","v":0},{"$f":"IF($A123<>\"\",VLOOKUP($A123,T_stock[],COLUMN()-1,FALSE),\"\")","v":3.6},2]
["080/11","LEFORT",{"$f":"IF($A124<>\"\",VLOOKUP($A124,T_stock[],COLUMN()-1,FALSE),\"\")","v":"Mercerie"},{"$f":"IF($A124<>\"\",VLOOKUP($A124,T_stock[],COLUMN()-1,FALSE),\"\")","v":"Boutons pression argent divers"},{"$f":"IF($A124<>\"\",VLOOKUP($A124,T_stock[],COLUMN()-1,FALSE),\"\")","v":0},{"$f":"IF($A124<>\"\",VLOOKUP($A124,T_stock[],COLUMN()-1,FALSE),\"\")","v":0},{"$f":"IF($A124<>\"\",VLOOKUP($A124,T_stock[],COLUMN()-1,FALSE),\"\")","v":2.8},3]
["133/11","LEFORT",{"$f":"IF($A125<>\"\",VLOOKUP($A125,T_stock[],COLUMN()-1,FALSE),\"\")","v":"Mercerie"},{"$f":"IF($A125<>\"\",VLOOKUP($A125,T_stock[],COLUMN()-1,FALSE),\"\")","v":"Boutons pression Prym x4"},{"$f":"IF($A125<>\"\",VLOOKUP($A125,T_stock[],COLUMN()-1,FALSE),\"\")","v":"17mm"},{"$f":"IF($A125<>\"\",VLOOKUP($A125,T_stock[],COLUMN()-1,FALSE),\"\")","v":0},{"$f":"IF($A125<>\"\",VLOOKUP($A125,T_stock[],COLUMN()-1,FALSE),\"\")","v":4.3},1]
["084/12","LEFORT",{"$f":"IF($A126<>\"\",VLOOKUP($A126,T_stock[],COLUMN()-1,FALSE),\"\")","v":"Mercerie"},{"$f":"IF($A126<>\"\",VLOOKUP($A126,T_stock[],COLUMN()-1,FALSE),\"\")","v":"Boutons pression Pic&malice x10"},{"$f":"IF($A126<>\"\",VLOOKUP($A126,T_stock[],COLUMN()-1,FALSE),\"\")","v":"11mm"},{"$f":"IF($A126<>\"\",VLOOKUP($A126,T_stock[],COLUMN()-1,FALSE),\"\")","v":0},{"$f":"IF($A126<>\"\",VLOOKUP($A126,T_stock[],COLUMN()-1,FALSE),\"\")","v":2.6},2]
["085/12","LEFORT",{"$f":"IF($A127<>\"\",VLOOKUP($A127,T_stock[],COLUMN()-1,FALSE),\"\")","v":"Mercerie"},{"$f":"IF($A127<>\"\",VLOOKUP($A127,T_stock[],COLUMN()-1,FALSE),\"\")","v":"Boutons pression x6 noir"},{"$f":"IF($A127<>\"\",VLOOKUP($A127,T_stock[],COLUMN()-1,FALSE),\"\")","v":"13mm"},{"$f":"IF($A127<>\"\",VLOOKUP($A127,T_stock[],COLUMN()-1,FALSE),\"\")","v":0},{"$f":"IF($A127<>\"\",VLOOKUP($A127,T_stock[],COLUMN()-1,FALSE),\"\")","v":2.8},1]
["135/11","LEFORT",{"$f":"IF($A128<>\"\",VLOOKUP($A128,T_stock[],COLUMN()-1,FALSE),\"\")","v":"Mercerie"},{"$f":"IF($A128<>\"\",VLOOKUP($A128,T_stock[],COLUMN()-1,FALSE),\"\")","v":"Boutons pression Prym x20 noir"},{"$f":"IF($A128<>\"\",VLOOKUP($A128,T_stock[],COLUMN()-1,FALSE),\"\")","v":"9mm"},{"$f":"IF($A128<>\"\",VLOOKUP($A128,T_stock[],COLUMN()-1,FALSE),\"\")","v":0},{"$f":"IF($A128<>\"\",VLOOKUP($A128,T_stock[],COLUMN()-1,FALSE),\"\")","v":4},2]
["096/11","LEFORT",{"$f":"IF($A129<>\"\",VLOOKUP($A129,T_stock[],COLUMN()-1,FALSE),\"\")","v":"Mercerie"},{"$f":"IF($A129<>\"\",VLOOKUP($A129,T_stock[],COLUMN()-1,FALSE),\"\")","v":"Boutons pression Prym x12 noir"},{"$f":"IF($A129<>\"\",VLOOKUP($A129,T_stock[],COLUMN()-1,FALSE),\"\")","v":"7mm"},{"$f":"IF($A129<>\"\",VLOOKUP($A129,T_stock[],COLUMN()-1,FALSE),\"\")","v":0},{"$f":"IF($A129<>\"\",VLOOKUP($A129,T_stock[],COLUMN()-1,FALSE),\"\")","v":3.1},2]
["184/10","LEFORT",{"$f":"IF($A130<>\"\",VLOOKUP($A130,T_stock[],COLUMN()-1,FALSE),\"\")","v":"Mercerie"},{"$f":"IF($A130<>\"\",VLOOKUP($A130,T_stock[],COLUMN()-1,FALSE),\"\")","v":"Bouton magnétique Bohin"},{"$f":"IF($A130<>\"\",VLOOKUP($A130,T_stock[],COLUMN()-1,FALSE),\"\")","v":"18mm"},{"$f":"IF($A130<>\"\",VLOOKUP($A130,T_stock[],COLUMN()-1,FALSE),\"\")","v":0},{"$f":"IF($A130<>\"\",VLOOKUP($A130,T_stock[],COLUMN()-1,FALSE),\"\")","v":6},2]
["096/10","LEFORT",{"$f":"IF($A131<>\"\",VLOOKUP($A131,T_stock[],COLUMN()-1,FALSE),\"\")","v":"Mercerie"},{"$f":"IF($A131<>\"\",VLOOKUP($A131,T_stock[],COLUMN()-1,FALSE),\"\")","v":"Boutons pression Prym x24 noir"},{"$f":"IF($A131<>\"\",VLOOKUP($A131,T_stock[],COLUMN()-1,FALSE),\"\")","v":"7mm"},{"$f":"IF($A131<>\"\",VLOOKUP($A131,T_stock[],COLUMN()-1,FALSE),\"\")","v":0},{"$f":"IF($A131<>\"\",VLOOKUP($A131,T_stock[],COLUMN()-1,FALSE),\"\")","v":3.1},1]
["097/10","LEFORT",{"$f":"IF($A132<>\"\",VLOOKUP($A132,T_stock[],COLUMN()-1,FALSE),\"\")","v":"Mercerie"},{"$f":"IF($A132<>\"\",VLOOKUP($A132,T_stock[],COLUMN()-1,FALSE),\"\")","v":"Boutons pression x18 noir"},{"$f":"IF($A132<>\"\",VLOOKUP($A132,T_stock[],COLUMN()-1,FALSE),\"\")","v":"10mm"},{"$f":"IF($A132<>\"\",VLOOKUP($A132,T_stock[],COLUMN()-1,FALSE),\"\")","v":0},{"$f":"IF($A132<>\"\",VLOOKUP($A132,T_stock[],COLUMN()-1,FALSE),\"\")","v":3.1},1]
["101/12","LEFORT",{"$f":"IF($A133<>\"\",VLOOKUP($A133,T_stock[],COLUMN()-1,FALSE),\"\")","v":"Mercerie"},{"$f":"IF($A133<>\"\",VLOOKUP($A133,T_stock[],COLUMN()-1,FALSE),\"\")","v":"Boutons pression Prym x18 transparent"},{"$f":"IF($A133<>\"\",VLOOKUP($A133,T_stock[],COLUMN()-1,FALSE),\"\")","v":"10mm"},{"$f":"IF($A133<>\"\",VLOOKUP($A133,T_stock[],COLUMN()-1,FALSE),\"\")","v":0},{"$f":"IF($A133<>\"\",VLOOKUP($A133,T_stock[],COLUMN()-1,FALSE),\"\")","v":3.2},1]
["096/12","LEFORT",{"$f":"IF($A134<>\"\",VLOOKUP($A134,T_stock[],COLUMN()-1,FALSE),\"\")","v":"Mercerie"},{"$f":"IF($A134<>\"\",VLOOKUP($A134,T_stock[],COLUMN()-1,FALSE),\"\")","v":"Boutons pression Prym x24 transparent"},{"$f":"IF($A134<>\"\",VLOOKUP($A134,T_stock[],COLUMN()-1,FALSE),\"\")","v":"7mm"},{"$f":"IF($A134<>\"\",VLOOKUP($A134,T_stock[],COLUMN()-1,FALSE),\"\")","v":0},{"$f":"IF($A134<>\"\",VLOOKUP($A134,T_stock[],COLUMN()-1,FALSE),\"\")","v":3.2},1]
["158/10","LEFORT",{"$f":"IF($A135<>\"\",VLOOKUP($A135,T_stock[],COLUMN()-1,FALSE),\"\")","v":"Outils"},{"$f":"IF($A135<>\"\",VLOOKUP($A135,T_stock[],COLUMN()-1,FALSE),\"\")","v":"Ampoule"},{"$f":"IF($A135<>\"\",VLOOKUP($A135,T_stock[],COLUMN()-1,FALSE),\"\")","v":0},{"$f":"IF($A135<>\"\",VLOOKUP($A135,T_stock[],COLUMN()-1,FALSE),\"\")","v":0},{"$f":"IF($A135<>\"\",VLOOKUP($A135,T_stock[],COLUMN()-1,FALSE),\"\")","v":4.9000000000000004},2]
["158/12","LEFORT",{"$f":"IF($A136<>\"\",VLOOKUP($A136,T_stock[],COLUMN()-1,FALSE),\"\")","v":"Outils"},{"$f":"IF($A136<>\"\",VLOOKUP($A136,T_stock[],COLUMN()-1,FALSE),\"\")","v":"Roulette à patron"},{"$f":"IF($A136<>\"\",VLOOKUP($A136,T_stock[],COLUMN()-1,FALSE),\"\")","v":0},{"$f":"IF($A136<>\"\",VLOOKUP($A136,T_stock[],COLUMN()-1,FALSE),\"\")","v":0},{"$f":"IF($A136<>\"\",VLOOKUP($A136,T_stock[],COLUMN()-1,FALSE),\"\")","v":5.3},1]
["196/12","LEFORT",{"$f":"IF($A137<>\"\",VLOOKUP($A137,T_stock[],COLUMN()-1,FALSE),\"\")","v":"Mercerie"},{"$f":"IF($A137<>\"\",VLOOKUP($A137,T_stock[],COLUMN()-1,FALSE),\"\")","v":"Attache soutien-gorge blanc"},{"$f":"IF($A137<>\"\",VLOOKUP($A137,T_stock[],COLUMN()-1,FALSE),\"\")","v":"petit"},{"$f":"IF($A137<>\"\",VLOOKUP($A137,T_stock[],COLUMN()-1,FALSE),\"\")","v":0},{"$f":"IF($A137<>\"\",VLOOKUP($A137,T_stock[],COLUMN()-1,FALSE),\"\")","v":3.8},1]
["196/11","LEFORT",{"$f":"IF($A138<>\"\",VLOOKUP($A138,T_stock[],COLUMN()-1,FALSE),\"\")","v":"Mercerie"},{"$f":"IF($A138<>\"\",VLOOKUP($A138,T_stock[],COLUMN()-1,FALSE),\"\")","v":"Attache soutien-gorge ivoire"},{"$f":"IF($A138<>\"\",VLOOKUP($A138,T_stock[],COLUMN()-1,FALSE),\"\")","v":"petit"},{"$f":"IF($A138<>\"\",VLOOKUP($A138,T_stock[],COLUMN()-1,FALSE),\"\")","v":0},{"$f":"IF($A138<>\"\",VLOOKUP($A138,T_stock[],COLUMN()-1,FALSE),\"\")","v":3.8},1]
["196/10","LEFORT",{"$f":"IF($A139<>\"\",VLOOKUP($A139,T_stock[],COLUMN()-1,FALSE),\"\")","v":"Mercerie"},{"$f":"IF($A139<>\"\",VLOOKUP($A139,T_stock[],COLUMN()-1,FALSE),\"\")","v":"Attache soutien-gorge noir"},{"$f":"IF($A139<>\"\",VLOOKUP($A139,T_stock[],COLUMN()-1,FALSE),\"\")","v":"petit"},{"$f":"IF($A139<>\"\",VLOOKUP($A139,T_stock[],COLUMN()-1,FALSE),\"\")","v":0},{"$f":"IF($A139<>\"\",VLOOKUP($A139,T_stock[],COLUMN()-1,FALSE),\"\")","v":3.8},5]
["123/13","LEFORT",{"$f":"IF($A140<>\"\",VLOOKUP($A140,T_stock[],COLUMN()-1,FALSE),\"\")","v":"Mercerie"},{"$f":"IF($A140<>\"\",VLOOKUP($A140,T_stock[],COLUMN()-1,FALSE),\"\")","v":"Attache soutien-gorge blanc"},{"$f":"IF($A140<>\"\",VLOOKUP($A140,T_stock[],COLUMN()-1,FALSE),\"\")","v":"moyen"},{"$f":"IF($A140<>\"\",VLOOKUP($A140,T_stock[],COLUMN()-1,FALSE),\"\")","v":0},{"$f":"IF($A140<>\"\",VLOOKUP($A140,T_stock[],COLUMN()-1,FALSE),\"\")","v":4.2},1]
["123/14","LEFORT",{"$f":"IF($A141<>\"\",VLOOKUP($A141,T_stock[],COLUMN()-1,FALSE),\"\")","v":"Mercerie"},{"$f":"IF($A141<>\"\",VLOOKUP($A141,T_stock[],COLUMN()-1,FALSE),\"\")","v":"Attache soutien-gorge ivoire"},{"$f":"IF($A141<>\"\",VLOOKUP($A141,T_stock[],COLUMN()-1,FALSE),\"\")","v":"moyen"},{"$f":"IF($A141<>\"\",VLOOKUP($A141,T_stock[],COLUMN()-1,FALSE),\"\")","v":0},{"$f":"IF($A141<>\"\",VLOOKUP($A141,T_stock[],COLUMN()-1,FALSE),\"\")","v":4.2},3]
["123/15","LEFORT",{"$f":"IF($A142<>\"\",VLOOKUP($A142,T_stock[],COLUMN()-1,FALSE),\"\")","v":"Mercerie"},{"$f":"IF($A142<>\"\",VLOOKUP($A142,T_stock[],COLUMN()-1,FALSE),\"\")","v":"Attache soutien-gorge noir"},{"$f":"IF($A142<>\"\",VLOOKUP($A142,T_stock[],COLUMN()-1,FALSE),\"\")","v":"moyen"},{"$f":"IF($A142<>\"\",VLOOKUP($A142,T_stock[],COLUMN()-1,FALSE),\"\")","v":0},{"$f":"IF($A142<>\"\",VLOOKUP($A142,T_stock[],COLUMN()-1,FALSE),\"\")","v":4.2},2]
["124/13","LEFORT",{"$f":"IF($A143<>\"\",VLOOKUP($A143,T_stock[],COLUMN()-1,FALSE),\"\")","v":"Mercerie"},{"$f":"IF($A143<>\"\",VLOOKUP($A143,T_stock[],COLUMN()-1,FALSE),\"\")","v":"Attache soutien-gorge blanc"},{"$f":"IF($A143<>\"\",VLOOKUP($A143,T_stock[],COLUMN()-1,FALSE),\"\")","v":"grand"},{"$f":"IF($A143<>\"\",VLOOKUP($A143,T_stock[],COLUMN()-1,FALSE),\"\")","v":0},{"$f":"IF($A143<>\"\",VLOOKUP($A143,T_stock[],COLUMN()-1,FALSE),\"\")","v":4.8},1]
["124/14","LEFORT",{"$f":"IF($A144<>\"\",VLOOKUP($A144,T_stock[],COLUMN()-1,FALSE),\"\")","v":"Mercerie"},{"$f":"IF($A144<>\"\",VLOOKUP($A144,T_stock[],COLUMN()-1,FALSE),\"\")","v":"Attache soutien-gorge ivoire"},{"$f":"IF($A144<>\"\",VLOOKUP($A144,T_stock[],COLUMN()-1,FALSE),\"\")","v":"grand"},{"$f":"IF($A144<>\"\",VLOOKUP($A144,T_stock[],COLUMN()-1,FALSE),\"\")","v":0},{"$f":"IF($A144<>\"\",VLOOKUP($A144,T_stock[],COLUMN()-1,FALSE),\"\")","v":4.8},1]
["124/15","LEFORT",{"$f":"IF($A145<>\"\",VLOOKUP($A145,T_stock[],COLUMN()-1,FALSE),\"\")","v":"Mercerie"},{"$f":"IF($A145<>\"\",VLOOKUP($A145,T_stock[],COLUMN()-1,FALSE),\"\")","v":"Attache soutien-gorge noir"},{"$f":"IF($A145<>\"\",VLOOKUP($A145,T_stock[],COLUMN()-1,FALSE),\"\")","v":"grand"},{"$f":"IF($A145<>\"\",VLOOKUP($A145,T_stock[],COLUMN()-1,FALSE),\"\")","v":0},{"$f":"IF($A145<>\"\",VLOOKUP($A145,T_stock[],COLUMN()-1,FALSE),\"\")","v":4.8},1]
["190/12","LEFORT",{"$f":"IF($A146<>\"\",VLOOKUP($A146,T_stock[],COLUMN()-1,FALSE),\"\")","v":"Mercerie"},{"$f":"IF($A146<>\"\",VLOOKUP($A146,T_stock[],COLUMN()-1,FALSE),\"\")","v":"Bord manche marine foncé"},{"$f":"IF($A146<>\"\",VLOOKUP($A146,T_stock[],COLUMN()-1,FALSE),\"\")","v":0},{"$f":"IF($A146<>\"\",VLOOKUP($A146,T_stock[],COLUMN()-1,FALSE),\"\")","v":0},{"$f":"IF($A146<>\"\",VLOOKUP($A146,T_stock[],COLUMN()-1,FALSE),\"\")","v":5.9},1]
["190/13","LEFORT",{"$f":"IF($A147<>\"\",VLOOKUP($A147,T_stock[],COLUMN()-1,FALSE),\"\")","v":"Mercerie"},{"$f":"IF($A147<>\"\",VLOOKUP($A147,T_stock[],COLUMN()-1,FALSE),\"\")","v":"Bord manche marine clair"},{"$f":"IF($A147<>\"\",VLOOKUP($A147,T_stock[],COLUMN()-1,FALSE),\"\")","v":0},{"$f":"IF($A147<>\"\",VLOOKUP($A147,T_stock[],COLUMN()-1,FALSE),\"\")","v":0},{"$f":"IF($A147<>\"\",VLOOKUP($A147,T_stock[],COLUMN()-1,FALSE),\"\")","v":5.9},1]
["190/14","LEFORT",{"$f":"IF($A148<>\"\",VLOOKUP($A148,T_stock[],COLUMN()-1,FALSE),\"\")","v":"Mercerie"},{"$f":"IF($A148<>\"\",VLOOKUP($A148,T_stock[],COLUMN()-1,FALSE),\"\")","v":"Bord manche marron"},{"$f":"IF($A148<>\"\",VLOOKUP($A148,T_stock[],COLUMN()-1,FALSE),\"\")","v":0},{"$f":"IF($A148<>\"\",VLOOKUP($A148,T_stock[],COLUMN()-1,FALSE),\"\")","v":0},{"$f":"IF($A148<>\"\",VLOOKUP($A148,T_stock[],COLUMN()-1,FALSE),\"\")","v":5.9},1]
["190/15","LEFORT",{"$f":"IF($A149<>\"\",VLOOKUP($A149,T_stock[],COLUMN()-1,FALSE),\"\")","v":"Mercerie"},{"$f":"IF($A149<>\"\",VLOOKUP($A149,T_stock[],COLUMN()-1,FALSE),\"\")","v":"Bord manche gris clair"},{"$f":"IF($A149<>\"\",VLOOKUP($A149,T_stock[],COLUMN()-1,FALSE),\"\")","v":0},{"$f":"IF($A149<>\"\",VLOOKUP($A149,T_stock[],COLUMN()-1,FALSE),\"\")","v":0},{"$f":"IF($A149<>\"\",VLOOKUP($A149,T_stock[],COLUMN()-1,FALSE),\"\")","v":6.2},1]
["190/16","LEFORT",{"$f":"IF($A150<>\"\",VLOOKUP($A150,T_stock[],COLUMN()-1,FALSE),\"\")","v":"Mercerie"},{"$f":"IF($A150<>\"\",VLOOKUP($A150,T_stock[],COLUMN()-1,FALSE),\"\")","v":"Bord manche écru"},{"$f":"IF($A150<>\"\",VLOOKUP($A150,T_stock[],COLUMN()-1,FALSE),\"\")","v":0},{"$f":"IF($A150<>\"\",VLOOKUP($A150,T_stock[],COLUMN()-1,FALSE),\"\")","v":0},{"$f":"IF($A150<>\"\",VLOOKUP($A150,T_stock[],COLUMN()-1,FALSE),\"\")","v":6.2},1]
["293/12","LEFORT",{"$f":"IF($A151<>\"\",VLOOKUP($A151,T_stock[],COLUMN()-1,FALSE),\"\")","v":"Mercerie"},{"$f":"IF($A151<>\"\",VLOOKUP($A151,T_stock[],COLUMN()-1,FALSE),\"\")","v":"Bord bas blanc"},{"$f":"IF($A151<>\"\",VLOOKUP($A151,T_stock[],COLUMN()-1,FALSE),\"\")","v":0},{"$f":"IF($A151<>\"\",VLOOKUP($A151,T_stock[],COLUMN()-1,FALSE),\"\")","v":0},{"$f":"IF($A151<>\"\",VLOOKUP($A151,T_stock[],COLUMN()-1,FALSE),\"\")","v":7.8},1]
["171/12","LEFORT",{"$f":"IF($A152<>\"\",VLOOKUP($A152,T_stock[],COLUMN()-1,FALSE),\"\")","v":"Laine"},{"$f":"IF($A152<>\"\",VLOOKUP($A152,T_stock[],COLUMN()-1,FALSE),\"\")","v":"Bobinettes pour tricot"},{"$f":"IF($A152<>\"\",VLOOKUP($A152,T_stock[],COLUMN()-1,FALSE),\"\")","v":"petit"},{"$f":"IF($A152<>\"\",VLOOKUP($A152,T_stock[],COLUMN()-1,FALSE),\"\")","v":0},{"$f":"IF($A152<>\"\",VLOOKUP($A152,T_stock[],COLUMN()-1,FALSE),\"\")","v":5.5},2]
["171/13","LEFORT",{"$f":"IF($A153<>\"\",VLOOKUP($A153,T_stock[],COLUMN()-1,FALSE),\"\")","v":"Laine"},{"$f":"IF($A153<>\"\",VLOOKUP($A153,T_stock[],COLUMN()-1,FALSE),\"\")","v":"Bobinettes pour tricot"},{"$f":"IF($A153<>\"\",VLOOKUP($A153,T_stock[],COLUMN()-1,FALSE),\"\")","v":"moyen"},{"$f":"IF($A153<>\"\",VLOOKUP($A153,T_stock[],COLUMN()-1,FALSE),\"\")","v":0},{"$f":"IF($A153<>\"\",VLOOKUP($A153,T_stock[],COLUMN()-1,FALSE),\"\")","v":5.5},1]
["074/12","LEFORT",{"$f":"IF($A154<>\"\",VLOOKUP($A154,T_stock[],COLUMN()-1,FALSE),\"\")","v":"Laine"},{"$f":"IF($A154<>\"\",VLOOKUP($A154,T_stock[],COLUMN()-1,FALSE),\"\")","v":"Aiguilles à tricoter 2,5mm"},{"$f":"IF($A154<>\"\",VLOOKUP($A154,T_stock[],COLUMN()-1,FALSE),\"\")","v":"30cm"},{"$f":"IF($A154<>\"\",VLOOKUP($A154,T_stock[],COLUMN()-1,FALSE),\"\")","v":0},{"$f":"IF($A154<>\"\",VLOOKUP($A154,T_stock[],COLUMN()-1,FALSE),\"\")","v":3},3]
["100/12","LEFORT",{"$f":"IF($A155<>\"\",VLOOKUP($A155,T_stock[],COLUMN()-1,FALSE),\"\")","v":"Laine"},{"$f":"IF($A155<>\"\",VLOOKUP($A155,T_stock[],COLUMN()-1,FALSE),\"\")","v":"Aiguilles à tricoter 3mm"},{"$f":"IF($A155<>\"\",VLOOKUP($A155,T_stock[],COLUMN()-1,FALSE),\"\")","v":"30cm"},{"$f":"IF($A155<>\"\",VLOOKUP($A155,T_stock[],COLUMN()-1,FALSE),\"\")","v":0},{"$f":"IF($A155<>\"\",VLOOKUP($A155,T_stock[],COLUMN()-1,FALSE),\"\")","v":3.4},3]
["100/13","LEFORT",{"$f":"IF($A156<>\"\",VLOOKUP($A156,T_stock[],COLUMN()-1,FALSE),\"\")","v":"Laine"},{"$f":"IF($A156<>\"\",VLOOKUP($A156,T_stock[],COLUMN()-1,FALSE),\"\")","v":" Aiguilles à tricoter 3,5mm"},{"$f":"IF($A156<>\"\",VLOOKUP($A156,T_stock[],COLUMN()-1,FALSE),\"\")","v":"30cm"},{"$f":"IF($A156<>\"\",VLOOKUP($A156,T_stock[],COLUMN()-1,FALSE),\"\")","v":0},{"$f":"IF($A156<>\"\",VLOOKUP($A156,T_stock[],COLUMN()-1,FALSE),\"\")","v":3.5},3]
["131/14","LEFORT",{"$f":"IF($A157<>\"\",VLOOKUP($A157,T_stock[],COLUMN()-1,FALSE),\"\")","v":"Laine"},{"$f":"IF($A157<>\"\",VLOOKUP($A157,T_stock[],COLUMN()-1,FALSE),\"\")","v":"Aiguilles à tricoter 4mm"},{"$f":"IF($A157<>\"\",VLOOKUP($A157,T_stock[],COLUMN()-1,FALSE),\"\")","v":"30cm"},{"$f":"IF($A157<>\"\",VLOOKUP($A157,T_stock[],COLUMN()-1,FALSE),\"\")","v":0},{"$f":"IF($A157<>\"\",VLOOKUP($A157,T_stock[],COLUMN()-1,FALSE),\"\")","v":4.2},3]
[null,null,{"$f":"IF($A158<>\"\",VLOOKUP($A158,T_stock[],COLUMN()-1,FALSE),\"\")","v":""},{"$f":"IF($A158<>\"\",VLOOKUP($A158,T_stock[],COLUMN()-1,FALSE),\"\")","v":""},{"$f":"IF($A158<>\"\",VLOOKUP($A158,T_stock[],COLUMN()-1,FALSE),\"\")","v":""},{"$f":"IF($A158<>\"\",VLOOKUP($A158,T_stock[],COLUMN()-1,FALSE),\"\")","v":""},{"$f":"IF($A158<>\"\",VLOOKUP($A158,T_stock[],COLUMN()-1,FALSE),\"\")","v":""}]
["Total entrées","nombres",{"$f":"SUBTOTAL(103,[Famille])","v":154},null,null,null,"quantités",{"$f":"SUBTOTAL(109,[Quantité])","v":1082}]

{"sheet":"listes","index":3,"n_rows":76,"n_cols":11,"rows_kept":76,"cut":false,"hidden":false,"merged":[]}
["Fournisseurs","Familles","A riveter","Bouton","Colle","Fil","Laine","Mercerie","Motif","Outils","Ciseaux"]
["AGD","A riveter","Œillet argent","Rond fushia fille","HT2","Lastex blanc","Boîte à laine","Attache bretelle blanche","Drapeau anglais","Pince coupante","Fiskars universel"]
["PARITYS","Bouton","Œillet noir","Rond turquoise Kidz",null,"Lastex noir","Bobinettes pour tricot","Craie blanche","Ecusson fleur lys","Pince plate","A broder"]
["LEFORT","Colle",null,"Cœur marron et beige",null,"Câblé cheval vert blanc","Aiguilles à tricoter 2,5mm","Attache bretelle noire","Drapeau français","Ampoule","Lingère"]
[null,"Fil",null,"Rond jaune smiley",null,"Câblé cheval vert noir","Aiguilles à tricoter 3mm","Aimant","Cœur paillette noir","Roulette à patron"]
[null,"Laine",null,"Cœur bois",null,"Fusette blanc"," Aiguilles à tricoter 3,5mm","Pelote épingles","Poupées russes"]
[null,"Mercerie",null,"Voiture rouge et blanc",null,"Fusette noir","Aiguilles à tricoter 4mm","Epingles Bohin 100g","Cœur tweed"]
[null,"Motif",null,"Petite fleur Blanc nacré",null,"Fil à bâtir rose",null,"Epingles tête verre","Cœur paillette rouge"]
[null,"Outils",null,"Petit cœur métal",null,"St Pierre marine",null,"Epingles Bohin 50g","Fleur rose"]
[null,"Ciseaux",null,"Rond rose gravé",null,"St Pierre blanc",null,"Remailleur","Tête de mort brillante"]
[null,null,null,"Rond rose bord gravé",null,"St Pierre noir",null,"Mètre automatic","3 cœurs brillants rouges"]
[null,null,null,"Rond gris marbré",null,"Fil à bâtir blanc",null,"Mètre ruban","3 fleurs brillantes roses"]
[null,null,null,"Voiture bleu et blanc",null,null,null,"Fermoir Julia","Danseuse brillante"]
[null,null,null,"Bateau bleu",null,null,null,"Fermoir Emilia","Timbre Tour Eiffel"]
[null,null,null,"Rond bleu lune",null,null,null,"Fermoir Lucia","Rond racing"]
[null,null,null,"Petit rond gris clair et foncé",null,null,null,"Pelote tomate","Chat"]
[null,null,null,"Carré beige rainure",null,null,null,"Coude Nigal noir","Chouette"]
[null,null,null,"Rond rose tâcheté",null,null,null,"Coude Kleiber noir daim","Strass"]
[null,null,null,"Coccinelle jaune",null,null,null,"Coude Kleiber noir imitation cuir","Papillon"]
[null,null,null,"Grand rond gris clair et foncé",null,null,null,"Coude Kleiber gris daim","Mouton"]
[null,null,null,"Carré gris rainure",null,null,null,"Coude Kleiber marron ","Chien"]
[null,null,null,"Cœur x3 métal",null,null,null,"Coude Nigal vert sapin","Motifs divers (LEFORT)"]
[null,null,null,"Grand cœur métal",null,null,null,"Coude Pronty kaki"]
[null,null,null,"Ovale noir",null,null,null,"Coude Union Knopf kaki"]
[null,null,null,"Rond noir rainures blanches",null,null,null,"Coude Nigal kaki"]
[null,null,null,"Noir gravé ancre",null,null,null,"Coude Kleiber marron imitation cuir"]
[null,null,null,"Rond doré et noir ",null,null,null,"Coude Nigal rouge"]
[null,null,null,"Grand rond violet",null,null,null,"Coude Pronty beige"]
[null,null,null,"Grand rond gris et noir",null,null,null,"Coude Pic&malice beige"]
[null,null,null,"Très grand métal cœur",null,null,null,"Coude Kleiber marine imitation cuir"]
[null,null,null,null,null,null,null,"Thermocollant quick vert foncé"]
[null,null,null,null,null,null,null,"Thermocollant quick marron foncé"]
[null,null,null,null,null,null,null,"Thermocollant quick gris foncé"]
[null,null,null,null,null,null,null,"Thermocollant quick bordeaux"]
[null,null,null,null,null,null,null,"Thermocollant quick ciel jean's"]
[null,null,null,null,null,null,null,"Thermocollant quick jean's"]
[null,null,null,null,null,null,null,"Thermocollant quick marine"]
[null,null,null,null,null,null,null,"Thermocollant quick blanc"]
[null,null,null,null,null,null,null,"Thermocollant quick écru"]
[null,null,null,null,null,null,null,"Thermocollant quick gris clair"]
[null,null,null,null,null,null,null,"Thermocollant quick beige"]
[null,null,null,null,null,null,null,"Aiguilles à main "]
[null,null,null,null,null,null,null,"Aiguilles machine"]
[null,null,null,null,null,null,null,"Epingles en acier n°4"]
[null,null,null,null,null,null,null,"Epingles tête verre (Lefort)"]
[null,null,null,null,null,null,null,"Agrafes pantalon x3 argent"]
[null,null,null,null,null,null,null,"Agrafes pantalon x3 noir"]
[null,null,null,null,null,null,null,"Agrafes à ressort x14 noir"]
[null,null,null,null,null,null,null,"Agrafes à ressort x14 argent"]
[null,null,null,null,null,null,null,"Agrafes à jupe x6 noir"]
[null,null,null,null,null,null,null,"Boutons pression argent divers"]
[null,null,null,null,null,null,null,"Boutons pression Prym x4"]
[null,null,null,null,null,null,null,"Boutons pression x6 noir"]
[null,null,null,null,null,null,null,"Boutons pression Pic&malice x10"]
[null,null,null,null,null,null,null,"Boutons pression Prym x20 noir"]
[null,null,null,null,null,null,null,"Boutons pression Prym x12 noir"]
[null,null,null,null,null,null,null,"Boutons magnétique Bohin"]
[null,null,null,null,null,null,null,"Boutons pression Prym x24 noir"]
[null,null,null,null,null,null,null,"Boutons pression Prym x18 transparent"]
[null,null,null,null,null,null,null,"Boutons pression x18 noir"]
[null,null,null,null,null,null,null,"Boutons pression Prym x24 transparent"]
[null,null,null,null,null,null,null,"Attache soutien-gorge blanc"]
[null,null,null,null,null,null,null,"Attache soutien-gorge ivoire"]
[null,null,null,null,null,null,null,"Attache soutien-gorge noir"]
[null,null,null,null,null,null,null,"Bord manche marine clair"]
[null,null,null,null,null,null,null,"Bord manche marine foncé"]
[null,null,null,null,null,null,null,"Bord manche gris clair"]
[null,null,null,null,null,null,null,"Bord manche écru"]
[null,null,null,null,null,null,null,"Bord manche marron"]
[null,null,null,null,null,null,null,"Bord bas blanc"]
[null,null,null,null,null,null,null,"Baleine soutien-gorge x2"]
[null,null,null,null,null,null,null,"Ampliforme mousse x2 n°291"]
[null,null,null,null,null,null,null,"Ampliforme mousse x2 n°290"]
[null,null,null,null,null,null,null,"Ampliforme mousse x2 n°242"]
[null,null,null,null,null,null,null,"Ampliforme mousse x2 n°295"]
[null,null,null,null,null,null,null,"Ampliforme mousse x2 n°"]

{"sheet":"Mode d'emploi","index":4,"n_rows":0,"n_cols":0,"rows_kept":0,"cut":false,"hidden":false,"merged":[]}