{"text_format":"1","workbook":"xlsx","n_sheets":3,"sheets":["Feuil1","Feuil2","Feuil3"],"not_rendered":{"charts":0,"images":3,"macros":1,"external_links":0,"defined_names":0,"comments":1,"pivot_tables":0},"unopened":[],"bounds":{"document_bytes":16777216,"sheet_cells":100000,"rows_first":2000,"rows_last":500,"rows_between":2000,"halvings":0,"cell_chars":16384,"cell_head_chars":4096},"cells_cut":0,"cells_raw":0,"read":"whole","date_system":"1900"}

{"sheet":"Feuil1","index":0,"n_rows":64,"n_cols":13,"rows_kept":64,"cut":false,"hidden":false,"merged":[[28,7,28,12]]}
[]
[]
[]
[]
["Leucippe","Un vagabond","Aime","un médicament","de ","maison abandonnée"]
["Eleuthère","Un type ordinaire","veut manipuler","une arme","a","un lieu hanté"]
["Numas","Un marchand","veut corrompre","un plan","chez","la prison"]
["Ciriac","un assassin","Jalouse","un bijou","pres de","la ferme des…"]
["Horbe","Un inquisiteur","veut tuer","une œuvre d’art","dans","la commune"]
["Lionidas","Un agent","veut aider","un artefact",null,"l’antre d’un démon"]
["Aldaric","Un érudit","veut kidnapper","un animal",null,"un palais"]
["Orphée","Un mutant","veut séduire","un grimoire interdit",null,"la bibliothèque"]
["Vitalis","Un courtisan","se fait passer pour","un poison",null,"le port"]
["Philoxème","Un PJ","veut faire affaire","un bouclier",null,"le galion"]
["Montaigue","Un mendiant","veut détruire","un parchemin",null,"un temple de l’Empereur"]
["Thuride","Un noble","veut vendre","un lapin",null,"la ferme"]
["Jacquet","Un démon","veut fuir","une commande",null,"la chapelle"]
["Delphus","Un Bucheron","veut voler","du fer",null,"une cité ruche"]
["Winidas","Une fille de plaisir","veut découvrir","du cuivre",null,"la fontaine"]
["Berthuen","Un garde impérial","est en quête de","de l’Or",null,"une mine"]
["Flavien","Un corrompu","veut acheter","un coffre",null,"de la nourriture"]
["Cyrique","Un prêtre ","veut cacher","une armes",null,"un village"]
["Morasse","Un criminel","veut estimer","de la nourriture",null,"un membre corrompu"]
["Armélius","Un gouverneur ","veut étudier un…","un grimoire ancien",null,"un lieu proche"]
["Theddé","un marin","veut lire",null,null,"L'aigle jaune"]
["Rénat","un pêcheur","veut casser",null,null,"Chez Drogrard"]
["Ermilius","un sorcier","cherche",null,null,"La pieuvre jaune"]
["Flévius","le cuisinier",null,null,null,"L'anguille qui fume"]
["Victalien","travailleur de cuir",null,null,null,"Chez Drodidot",null,"Pressez sur le bouton GENERER pour voir une autre phrase"]
["Rédempti","l’alchimiste",null,null,null,"Les cinq couronnes"]
["Théovale","le forgeron",null,null,null,"Chez Brallus",null,{"$f":"INDEX($A$5:$A$64,(RANDBETWEEN(1,60)),1)","v":"Ophilienne"},{"$f":"INDEX($B$5:$B$31,(RANDBETWEEN(1,27)),1)","v":"Un Bucheron"},{"$f":"INDEX($C$5:$C$27,(RANDBETWEEN(1,22)),1)","v":"veut faire affaire"},{"$f":"INDEX($D$5:$D$24,(RANDBETWEEN(1,20)),1)","v":"du cuivre"},{"$f":"INDEX($E$5:$E$9,(RANDBETWEEN(1,5)),1)","v":"chez"},{"$f":"INDEX($F$5:$F$34,(RANDBETWEEN(1,30)),1)","v":"L'aigle jaune"}]
["Horidor",null,null,null,null,"Aux batailles"]
["Désiré",null,null,null,null,"A la loutre folle"]
["Franciscus",null,null,null,null,"Le cheval fatigué"]
["Hermaline"]
["Amareldée",null,null,null,null,null,null,null,null,null,null,null,"© Lafouine 2014"]
["Ovilise"]
["Romélia"]
["Louisella"]
["Frésine"]
["Norbérine"]
["Dorsinie"]
["Frédérica"]
["Résildée"]
["Esiline"]
["Alphéda"]
["Evénie"]
["Médille"]
["Ancéline"]
["Alzérina"]
["Amarance"]
["Araxie"]
["Ethéra"]
["Palmélina"]
["Olympiade"]
["Emabilice"]
["Sitaline"]
["Adorine"]
["Emérentia"]
["Oxinia"]
["Ariette"]
["Ophilienne"]
["Eulémie"]
["Colinda"]

{"sheet":"Feuil2","index":1,"n_rows":0,"n_cols":0,"rows_kept":0,"cut":false,"hidden":false,"merged":[]}

{"sheet":"Feuil3","index":2,"n_rows":0,"n_cols":0,"rows_kept":0,"cut":false,"hidden":false,"merged":[]}