{"text_format":"1","workbook":"xlsx","n_sheets":3,"sheets":["Choix des indicateurs","Indicateur OF","BDD OF"],"not_rendered":{"charts":0,"images":0,"macros":1,"external_links":0,"defined_names":1,"comments":0,"pivot_tables":0},"unopened":[],"bounds":{"document_bytes":16777216,"sheet_cells":100000,"rows_first":2000,"rows_last":500,"rows_between":2000,"halvings":0,"cell_chars":16384,"cell_head_chars":4096},"cells_cut":0,"cells_raw":0,"read":"whole","date_system":"1900"}

{"sheet":"Choix des indicateurs","index":0,"n_rows":19,"n_cols":8,"rows_kept":19,"cut":false,"hidden":false,"merged":[]}
[]
[]
[]
[]
[null,null,null,"Bienvenue, grâce à cet outil vous pourrez consulter différents indicateurs:"]
[]
[]
[]
[]
[]
[]
[]
[]
[]
[]
[]
[null,null,null,null,null,null,null,"Colonne D = GMR.GM400. et colonne E = Ordre de fabrication. Ensuite la même chose avec"]
[null,null,null,null,null,null,null,"Colonne D = GMR.GM400. et colonne E = OF non standard. Puis le total sur les GM400:"]
[null,null,null,null,null,null,null,"Colonne D = GMR.GM400."]

{"sheet":"Indicateur OF","index":1,"n_rows":35,"n_cols":12,"rows_kept":35,"cut":false,"hidden":false,"merged":[[16,1,16,3],[17,3,19,3],[17,4,19,4],[2,1,3,3],[2,4,3,4],[13,3,15,3],[13,4,15,4],[5,3,7,3],[5,4,7,4],[4,1,4,3],[8,1,8,3],[12,1,12,3],[9,3,11,3],[9,4,11,4],[2,8,3,10],[2,11,3,11],[4,8,4,10],[5,10,6,10],[5,11,6,11],[7,8,7,10],[8,10,9,10],[8,11,9,11],[10,8,10,10],[11,10,12,10],[11,11,12,11],[13,8,14,10],[13,11,14,11],[15,8,15,10],[16,10,17,10],[16,11,17,11],[18,8,18,10],[19,10,20,10],[19,11,20,11],[21,8,21,10],[22,10,23,10],[22,11,23,11],[24,8,25,10],[24,11,25,11],[26,8,26,10],[27,10,28,10],[27,11,28,11],[29,8,29,10],[30,10,31,10],[30,11,31,11],[32,8,32,10],[33,10,34,10],[33,11,34,11]]}
[]
[]
[null,"Nombre d'OF  (> à définir) ",null,null,"Tendance",null,null,null,"GM60",null,null,"Tendance"]
[]
[null,"Lancé",null,null,null,null,null,null,"Standard"]
[null,"Critique   >","terminé",0,{"$f":"IF(D6<=C8,\"J\",IF(D6>=C6,\"L\",\"K\"))","v":"J"},null,null,null,"Alerte   >",null,null,{"$f":"IF(K6<=J8,\"J\",IF(K6>=J6,\"L\",\"K\"))","v":"J"}]
[null,"Alerte   >","Lancé",null,null,null,null,null,"Cible  <"]
[null,"Cible  <","non lancé",null,null,null,null,null,"Non Standard"]
[null,"Terminé",null,null,null,null,null,null,"Alerte   >",null,null,{"$f":"IF(K9<=J11,\"J\",IF(K9>=J9,\"L\",\"K\"))","v":"J"}]
[null,"Critique   >",10,0,{"$f":"IF(D10<=C12,\"J\",IF(D10>=C10,\"L\",\"K\"))","v":"J"},null,null,null,"Cible  <"]
[null,"Alerte   >",5,null,null,null,null,null,"Total"]
[null,"Cible  <",5,null,null,null,null,null,"Alerte   >",null,0,{"$f":"IF(K12<=Q33,\"J\",IF(K12>=J12,\"L\",\"K\"))","v":"J"}]
[null,"Non lancé",null,null,null,null,null,null,"Cible  <"]
[null,"Critique   >",100,0,{"$f":"IF(D14<=C16,\"J\",IF(D14>=C14,\"L\",\"K\"))","v":"J"},null,null,null,"GM200",null,null,"Tendance"]
[null,"Alerte   >",20]
[null,"Cible  <",20,null,null,null,null,null,"Standard"]
[null,"Total",null,null,null,null,null,null,"Alerte   >",null,7,{"$f":"IF(K17<=J19,\"J\",IF(K17>=J17,\"L\",\"K\"))","v":"L"}]
[null,"Critique   >",100,null,{"$f":"IF(D18<=C20,\"J\",IF(D18>=C18,\"L\",\"K\"))","v":"J"},null,null,null,"Cible  <"]
[null,"Alerte   >",20,null,null,null,null,null,"Non Standard"]
[null,"Cible  <",20,null,null,null,null,null,"Alerte   >",null,2,{"$f":"IF(K20<=J22,\"J\",IF(K20>=J20,\"L\",\"K\"))","v":"L"}]
[null,null,null,null,null,null,null,null,"Cible  <"]
[null,null,null,null,null,null,null,null,"Total"]
[null,null,null,null,null,null,null,null,"Alerte   >",null,9,{"$f":"IF(K23<=Q44,\"J\",IF(K23>=J23,\"L\",\"K\"))","v":"L"}]
[null,null,null,null,null,null,null,null,"Cible  <"]
[null,null,null,null,null,null,null,null,"GM400",null,null,"Tendance"]
[]
[null,null,null,null,null,null,null,null,"Standard"]
[null,null,null,null,null,null,null,null,"Alerte   >",null,9,{"$f":"IF(K28<=J30,\"J\",IF(K28>=J28,\"L\",\"K\"))","v":"L"}]
[null,null,null,null,null,null,null,null,"Cible  <"]
[null,null,null,null,null,null,null,null,"Non Standard"]
[null,null,null,null,null,null,null,null,"Alerte   >",null,150,{"$f":"IF(K31<=J33,\"J\",IF(K31>=J31,\"L\",\"K\"))","v":"L"}]
[null,null,null,null,null,null,null,null,"Cible  <"]
[null,null,null,null,null,null,null,null,"Total"]
[null,null,null,null,null,null,null,null,"Alerte   >",null,159,{"$f":"IF(K34<=Q55,\"J\",IF(K34>=J34,\"L\",\"K\"))","v":"L"}]
[null,null,null,null,null,null,null,null,"Cible  <"]

{"sheet":"BDD OF","index":2,"n_rows":169,"n_cols":13,"rows_kept":169,"cut":false,"hidden":false,"merged":[]}
[null,"Item Number","Description","Plan Cat","Supply Type","Supply Order Number","Order Qty","S Planner","S Project","S Task","Job Comments","Sugg Start Date","Completion date"]
[null,null,null,"GMR.GM400.","OF non standard",null,1,"PROJET",null,null,null,"18/07/2014","31/10/2013"]
[null,null,null,"GMR.GM400.","OF non standard",null,1,"LIM_REB",null,null,null,"18/07/2014","2014-07-04"]
[null,null,null,"GMR.GM400.","OF non standard",null,1,"PROJET",null,null,null,"18/07/2014","15/07/2014"]
[null,null,null,"GMR.GM400.","OF non standard",null,1,"PROJET",null,null,null,"18/07/2014","28/11/2013"]
[null,null,null,"GMR.GM400.","OF non standard",null,5,"LIM_GMR",null,null,null,"18/07/2014","25/04/2014"]
[null,null,null,"GMR.GM400.","OF non standard",null,1,"PROJET",null,null,null,"18/07/2014","23/05/2014"]
[null,null,null,"GMR.GM400.","OF non standard",null,1,"PROJET",null,null,null,"18/07/2014","15/07/2014"]
[null,null,null,"GMR.GM400.","OF non standard",null,2,"LIM_REB",null,null,null,"18/07/2014","26/12/2013"]
[null,null,null,"GMR.GM400.","OF non standard",null,1,"PROJET",null,null,null,"18/07/2014","30/06/2014"]
[null,null,null,"GMR.GM400.","OF non standard",null,1,"PROJET",null,null,null,"18/07/2014","30/09/2014"]
[null,null,null,"GMR.GM400.","OF non standard",null,1,"LIM_GMR",null,null,null,"18/07/2014","31/07/2014"]
[null,null,null,"GMR.GM400.","OF non standard",null,5,"LIM_GMR",null,null,null,"18/07/2014","25/04/2014"]
[null,null,null,"GMR.GM400.","OF non standard",null,1,"LIM_REB",null,null,null,"18/07/2014","28/03/2014"]
[null,null,null,"GMR.GM400.","OF non standard",null,1,"PROJET",null,null,null,"18/07/2014","31/01/2014"]
[null,null,null,"GMR.GM400.","OF non standard",null,1,"PROJET",null,null,null,"18/07/2014","17/07/2013"]
[null,null,null,"GMR.GM400.","OF non standard",null,1,"PROJET",null,null,null,"18/07/2014","2014-02-12"]
[null,null,null,"GMR.GM400.","Ordre de fabrication",null,1,"LIM_GMR",null,null,null,"14/10/2014","2014-07-07"]
[null,null,null,"GMR.GM400.","OF non standard",null,5,"PROJET",null,null,null,"18/07/2014","28/02/2014"]
[null,null,null,"GMR.GM400.","OF non standard",null,1,"LIM_REB",null,null,null,"18/07/2014","29/11/2013"]
[null,null,null,"GMR.GM400.","OF non standard",null,1,"PROJET",null,null,null,"18/07/2014","31/01/2014"]
[null,null,null,"GMR.GM200.","Ordre de fabrication",null,2,"PROJET",null,null,null,"18/07/2014","26/06/2014"]
[null,null,null,"GMR.GM200.","Ordre de fabrication",null,1,"PROJET",null,null,null,"31/07/2014","31/08/2014"]
[null,null,null,"GMR.GM200.","Ordre de fabrication",null,24,"PROJET",null,null,null,"25/08/2014","17/07/2014"]
[null,null,null,"GMR.GM200.","Ordre de fabrication",null,1,"PROJET",null,null,null,"28/10/2014","2014-07-08"]
[null,null,null,"GMR.GM200.","Ordre de fabrication",null,24,"PROJET",null,null,null,"2014-07-11","16/07/2014"]
[null,null,null,"GMR.GM200.","Ordre de fabrication",null,24,"PROJET",null,null,null,"2014-09-12","26/06/2014"]
[null,null,null,"GMR.GM200.","Ordre de fabrication",null,24,"PROJET",null,null,null,"2014-01-12","2014-04-07"]
[null,null,null,"GMR.GM400.","Ordre de fabrication",null,1,"PROJET",null,null,null,"23/07/2014","23/08/2013"]
[null,null,null,"GMR.GM400.","Ordre de fabrication",null,1,"PROJET",null,null,null,"18/07/2014","19/07/2014"]
[null,null,null,"GMR.GM200.","OF non standard",null,200,"PROJET",null,null,null,"18/07/2014","31/07/2014"]
[null,null,null,"GMR.GM400.","OF non standard",null,1,"PROJET",null,null,null,"18/07/2014","29/11/2013"]
[null,null,null,"GMR.GM400.","OF non standard",null,2,"PROJET",null,null,null,"18/07/2014","28/02/2014"]
[null,null,null,"GMR.GM400.","OF non standard",null,1,"PROJET",null,null,null,"18/07/2014","30/04/2014"]
[null,null,null,"GMR.GM400.","OF non standard",null,1,"PROJET",null,null,null,"18/07/2014","31/12/2013"]
[null,null,null,"GMR.GM400.","OF non standard",null,1,"PROJET",null,null,null,"18/07/2014","31/07/2014"]
[null,null,null,"GMR.GM400.","OF non standard",null,1,"PROJET",null,null,null,"18/07/2014","2014-01-09"]
[null,null,null,"GMR.GM400.","OF non standard",null,1,"PROJET",null,null,null,"18/07/2014","2014-01-09"]
[null,null,null,"GMR.GM400.","OF non standard",null,5,"PROJET",null,null,null,"18/07/2014","28/02/2014"]
[null,null,null,"GMR.GM400.","OF non standard",null,1,"PROJET",null,null,null,"18/07/2014","28/03/2014"]
[null,null,null,"GMR.GM400.","OF non standard",null,1,"PROJET",null,null,null,"18/07/2014","28/03/2014"]
[null,null,null,"GMR.GM400.","OF non standard",null,30,"PROJET",null,null,null,"18/07/2014","15/07/2014"]
[null,null,null,"GMR.GM400.","OF non standard",null,1,"PROJET",null,null,null,"18/07/2014","28/02/2014"]
[null,null,null,"GMR.GM400.","OF non standard",null,1,"PROJET",null,null,null,"18/07/2014","31/10/2013"]
[null,null,null,"GMR.GM400.","OF non standard",null,1,"PROJET",null,null,null,"18/07/2014","27/09/2013"]
[null,null,null,"GMR.GM400.","OF non standard",null,1,"PROJET",null,null,null,"18/07/2014","28/06/2013"]
[null,null,null,"GMR.GM400.","OF non standard",null,2,"PROJET",null,null,null,"18/07/2014","29/11/2013"]
[null,null,null,"GMR.GM400.","OF non standard",null,1,"PROJET",null,null,null,"18/07/2014","30/06/2014"]
[null,null,null,"GMR.GM400.","OF non standard",null,1,"PROJET",null,null,null,"18/07/2014","31/01/2014"]
[null,null,null,"GMR.GM400.","OF non standard",null,1,"PROJET",null,null,null,"18/07/2014","15/07/2014"]
[null,null,null,"GMR.GM400.","OF non standard",null,1,"LIM_REB",null,null,null,"18/07/2014","2014-03-04"]
[null,null,null,"GMR.GM400.","OF non standard",null,1,"LIM_REB",null,null,null,"18/07/2014","2014-04-04"]
[null,null,null,"GMR.GM400.","OF non standard",null,1,"LIM_REB",null,null,null,"18/07/2014","25/04/2014"]
[null,null,null,"GMR.GM400.","OF non standard",null,1,"LIM_REB",null,null,null,"18/07/2014","2014-10-04"]
[null,null,null,"GMR.GM400.","OF non standard",null,1,"LIM_REB",null,null,null,"18/07/2014","26/05/2014"]
[null,null,null,"GMR.GM400.","OF non standard",null,1,"LIM_REB",null,null,null,"18/07/2014","30/06/2014"]
[null,null,null,"GMR.GM400.","OF non standard",null,1,"LIM_REB",null,null,null,"18/07/2014","30/06/2014"]
[null,null,null,"GMR.GM400.","OF non standard",null,1,"LIM_REB",null,null,null,"18/07/2014","2014-09-05"]
[null,null,null,"GMR.GM400.","OF non standard",null,1,"LIM_REB",null,null,null,"18/07/2014","2014-09-06"]
[null,null,null,"GMR.GM400.","OF non standard",null,1,"LIM_REB",null,null,null,"18/07/2014","2014-09-06"]
[null,null,null,"GMR.GM400.","OF non standard",null,1,"LIM_REB",null,null,null,"18/07/2014","2014-05-05"]
[null,null,null,"GMR.GM400.","OF non standard",null,1,"LIM_REB",null,null,null,"18/07/2014","2014-02-06"]
[null,null,null,"GMR.GM400.","OF non standard",null,1,"LIM_REB",null,null,null,"18/07/2014","26/05/2014"]
[null,null,null,"GMR.GM400.","OF non standard",null,1,"LIM_REB",null,null,null,"18/07/2014","26/05/2014"]
[null,null,null,"GMR.GM400.","OF non standard",null,1,"LIM_REB",null,null,null,"18/07/2014","2014-04-04"]
[null,null,null,"GMR.GM400.","OF non standard",null,1,"LIM_REB",null,null,null,"18/07/2014","2013-11-10"]
[null,null,null,"GMR.GM400.","OF non standard",null,2,"LIM_REB",null,null,null,"18/07/2014","2013-05-09"]
[null,null,null,"GMR.GM400.","OF non standard",null,1,"LIM_REB",null,null,null,"18/07/2014","31/07/2014"]
[null,null,null,"GMR.GM400.","OF non standard",null,1,"LIM_REB",null,null,null,"18/07/2014","31/07/2014"]
[null,null,null,"GMR.GM400.","OF non standard",null,1,"LIM_REB",null,null,null,"18/07/2014","31/07/2014"]
[null,null,null,"GMR.GM400.","OF non standard",null,1,"PROJET",null,null,null,"18/07/2014","2013-11-10"]
[null,null,null,"GMR.GM400.","OF non standard",null,1,"PROJET",null,null,null,"18/07/2014","2014-03-04"]
[null,null,null,"GMR.GM400.","OF non standard",null,1,"PROJET",null,null,null,"18/07/2014","2014-03-06"]
[null,null,null,"GMR.GM400.","OF non standard",null,1,"PROJET",null,null,null,"18/07/2014","2014-03-06"]
[null,null,null,"GMR.GM400.","OF non standard",null,1,"PROJET",null,null,null,"18/07/2014","14/04/2014"]
[null,null,null,"GMR.GM400.","OF non standard",null,1,"PROJET",null,null,null,"18/07/2014","27/03/2014"]
[null,null,null,"GMR.GM400.","OF non standard",null,1,"PROJET",null,null,null,"18/07/2014","31/07/2014"]
[null,null,null,"GMR.GM400.","OF non standard",null,1,"LIM_REB",null,null,null,"18/07/2014","2014-07-04"]
[null,null,null,"GMR.GM400.","OF non standard",null,1,"LIM_REB",null,null,null,"18/07/2014","2014-07-04"]
[null,null,null,"GMR.GM400.","OF non standard",null,1,"LIM_REB",null,null,null,"18/07/2014","2014-07-04"]
[null,null,null,"GMR.GM400.","OF non standard",null,1,"LIM_REB",null,null,null,"18/07/2014","2014-07-04"]
[null,null,null,"GMR.GM400.","OF non standard",null,1,"LIM_REB",null,null,null,"18/07/2014","2014-07-04"]
[null,null,null,"GMR.GM400.","OF non standard",null,1,"LIM_REB",null,null,null,"18/07/2014","31/10/2013"]
[null,null,null,"GMR.GM400.","OF non standard",null,1,"LIM_REB",null,null,null,"18/07/2014","31/07/2014"]
[null,null,null,"GMR.GM400.","OF non standard",null,1,"LIM_REB",null,null,null,"18/07/2014","31/07/2014"]
[null,null,null,"GMR.GM400.","OF non standard",null,1,"PROJET",null,null,null,"18/07/2014","26/05/2014"]
[null,null,null,"GMR.GM400.","OF non standard",null,1,"PROJET",null,null,null,"18/07/2014","31/07/2014"]
[null,null,null,"GMR.GM400.","OF non standard",null,1,"PROJET",null,null,null,"18/07/2014","30/04/2014"]
[null,null,null,"GMR.GM400.","OF non standard",null,1,"PROJET",null,null,null,"18/07/2014","30/04/2014"]
[null,null,null,"GMR.GM400.","OF non standard",null,1,"PROJET",null,null,null,"26/12/2014","26/12/2014"]
[null,null,null,"GMR.GM400.","OF non standard",null,1,"LIM_REB",null,null,null,"18/07/2014","30/06/2014"]
[null,null,null,"GMR.GM400.","OF non standard",null,1,"LIM_REB",null,null,null,"18/07/2014","18/04/2014"]
[null,null,null,"GMR.GM400.","OF non standard",null,1,"LIM_REB",null,null,null,"18/07/2014","30/11/2014"]
[null,null,null,"GMR.GM400.","Ordre de fabrication",null,1,"LIM_GMR",null,null,null,"18/07/2014","13/12/2013"]
[null,null,null,"GMR.GM400.","OF non standard",null,1,"LIM_GMR",null,null,null,"18/07/2014","30/04/2014"]
[null,null,null,"GMR.GM400.","Ordre de fabrication",null,1,"LIM_GMR",null,null,null,"18/07/2014","21/11/2014"]
[null,null,null,"GMR.GM400.","Ordre de fabrication",null,1,"PROJET",null,null,null,"18/07/2014","22/08/2014"]
[null,null,null,"GMR.GM400.","Ordre de fabrication",null,1,"PROJET",null,null,null,"18/07/2014","15/08/2016"]
[null,null,null,"GMR.GM400.","OF non standard",null,1,"PROJET",null,null,null,"18/07/2014","2014-09-07"]
[null,null,null,"GMR.GM400.","OF non standard",null,1,"PROJET",null,null,null,"18/07/2014","31/07/2013"]
[null,null,null,"GMR.GM400.","OF non standard",null,1,"PROJET",null,null,null,"18/07/2014","24/03/2014"]
[null,null,null,"GMR.GM400.","OF non standard",null,1,"PROJET",null,null,null,"18/07/2014","28/04/2014"]
[null,null,null,"GMR.GM400.","OF non standard",null,1,"PROJET",null,null,null,"18/07/2014","2014-01-09"]
[null,null,null,"GMR.GM400.","OF non standard",null,1,"PROJET",null,null,null,"18/07/2014","21/06/2013"]
[null,null,null,"GMR.GM400.","OF non standard",null,1,"PROJET",null,null,null,"18/07/2014","2013-04-10"]
[null,null,null,"GMR.GM400.","OF non standard",null,1,"PROJET",null,null,null,"18/07/2014","31/01/2014"]
[null,null,null,"GMR.GM400.","OF non standard",null,1,"PROJET",null,null,null,"18/07/2014","31/08/2014"]
[null,null,null,"GMR.GM400.","OF non standard",null,9,"PROJET",null,null,null,"18/07/2014","31/03/2014"]
[null,null,null,"GMR.GM400.","Ordre de fabrication",null,1,"PROJET",null,null,null,"18/07/2014","2013-01-10"]
[null,null,null,"GMR.GM400.","OF non standard",null,1,"PROJET",null,null,null,"18/07/2014","20/09/2013"]
[null,null,null,"GMR.GM400.","OF non standard",null,1,"PROJET",null,null,null,"18/07/2014","2014-02-06"]
[null,null,null,"GMR.GM400.","OF non standard",null,1,"PROJET",null,null,null,"18/07/2014","15/07/2014"]
[null,null,null,"GMR.GM400.","OF non standard",null,2,"LIM_REB",null,null,null,"18/07/2014","26/12/2013"]
[null,null,null,"GMR.GM400.","OF non standard",null,1,"LIM_REB",null,null,null,"18/07/2014","24/04/2014"]
[null,null,null,"GMR.GM400.","OF non standard",null,1,"LIM_REB",null,null,null,"18/07/2014","26/12/2013"]
[null,null,null,"GMR.GM400.","OF non standard",null,1,"PROJET",null,null,null,"18/07/2014","28/03/2014"]
[null,null,null,"GMR.GM400.","OF non standard",null,1,"PROJET",null,null,null,"18/07/2014","18/04/2014"]
[null,null,null,"GMR.GM400.","OF non standard",null,1,"PROJET",null,null,null,"18/07/2014","2014-01-09"]
[null,null,null,"GMR.GM400.","OF non standard",null,1,"PROJET",null,null,null,"18/07/2014","14/03/2013"]
[null,null,null,"GMR.GM400.","OF non standard",null,1,"PROJET",null,null,null,"18/07/2014","20/05/2013"]
[null,null,null,"GMR.GM400.","OF non standard",null,1,"PROJET",null,null,null,"18/07/2014","24/04/2014"]
[null,null,null,"GMR.GM400.","OF non standard",null,1,"PROJET",null,null,null,"18/07/2014","30/05/2014"]
[null,null,null,"GMR.GM400.","OF non standard",null,1,"PROJET",null,null,null,"18/07/2014","31/12/2013"]
[null,null,null,"GMR.GM400.","OF non standard",null,1,"LIM_REB",null,null,null,"18/07/2014","30/06/2014"]
[null,null,null,"GMR.GM400.","OF non standard",null,1,"LIM_REB",null,null,null,"18/07/2014","30/04/2014"]
[null,null,null,"GMR.GM400.","OF non standard",null,1,"PROJET",null,null,null,"18/07/2014","24/04/2014"]
[null,null,null,"GMR.GM400.","OF non standard",null,1,"PROJET",null,null,null,"18/07/2014","30/04/2014"]
[null,null,null,"GMR.GM400.","OF non standard",null,1,"PROJET",null,null,null,"18/07/2014","2014-01-07"]
[null,null,null,"GMR.GM400.","OF non standard",null,1,"PROJET",null,null,null,"18/07/2014","30/06/2014"]
[null,null,null,"GMR.GM400.","OF non standard",null,1,"PROJET",null,null,null,"18/07/2014","25/04/2014"]
[null,null,null,"GMR.GM400.","OF non standard",null,1,"PROJET",null,null,null,"18/07/2014","30/11/2014"]
[null,null,null,"GMR.GM400.","OF non standard",null,1,"PROJET",null,null,null,"18/07/2014","30/06/2014"]
[null,null,null,"GMR.GM400.","OF non standard",null,1,"PROJET",null,null,null,"18/07/2014","2014-03-07"]
[null,null,null,"GMR.GM400.","OF non standard",null,2,"LIM_REB",null,null,null,"18/07/2014","15/05/2014"]
[null,null,null,"GMR.GM400.","OF non standard",null,2,"LIM_REB",null,null,null,"18/07/2014","2014-06-06"]
[null,null,null,"GMR.GM400.","OF non standard",null,2,"LIM_REB",null,null,null,"18/07/2014","30/06/2014"]
[null,null,null,"GMR.GM400.","OF non standard",null,1,"LIM_REB",null,null,null,"18/07/2014","2014-08-08"]
[null,null,null,"GMR.GM400.","OF non standard",null,1,"LIM_REB",null,null,null,"18/07/2014","15/08/2014"]
[null,null,null,"GMR.GM400.","OF non standard",null,1,"PROJET",null,null,null,"18/07/2014","15/07/2014"]
[null,null,null,"GMR.GM400.","OF non standard",null,1,"PROJET",null,null,null,"18/07/2014","31/07/2014"]
[null,null,null,"GMR.GM400.","OF non standard",null,1,"PROJET",null,null,null,"18/07/2014","31/07/2014"]
[null,null,null,"GMR.GM400.","OF non standard",null,1,"PROJET",null,null,null,"18/07/2014","2014-11-02"]
[null,null,null,"GMR.GM400.","OF non standard",null,1,"PROJET",null,null,null,"18/07/2014","30/11/2013"]
[null,null,null,"GMR.GM400.","OF non standard",null,1,"PROJET",null,null,null,"18/07/2014","31/08/2013"]
[null,null,null,"GMR.GM400.","OF non standard",null,1,"PROJET",null,null,null,"18/07/2014","24/10/2014"]
[null,null,null,"GMR.GM400.","Ordre de fabrication",null,1,"PROJET",null,null,null,"18/07/2014","2014-06-08"]
[null,null,null,"GMR.GM400.","OF non standard",null,1,"PROJET",null,null,null,"18/07/2014","16/07/2014"]
[null,null,null,"GMR.GM200.","OF non standard",null,4,"PROJET",null,null,null,"18/07/2014","31/07/2014"]
[null,null,null,"GMR.GM400.","OF non standard",null,1,"PROJET",null,null,null,"18/07/2014","20/06/2014"]
[null,null,null,"GMR.GM400.","OF non standard",null,1,"PROJET",null,null,null,"18/07/2014","22/05/2014"]
[null,null,null,"GMR.GM400.","OF non standard",null,1,"PROJET",null,null,null,"18/07/2014","31/07/2014"]
[null,null,null,"GMR.GM400.","OF non standard",null,1,"PROJET",null,null,null,"18/07/2014","31/07/2014"]
[null,null,null,"GMR.GM400.","OF non standard",null,1,"PROJET",null,null,null,"18/07/2014","18/08/2014"]
[null,null,null,"GMR.GM400.","OF non standard",null,1,"PROJET",null,null,null,"18/07/2014","18/08/2014"]
[null,null,null,"GMR.GM400.","OF non standard",null,1,"PROJET",null,null,null,"18/07/2014","18/08/2014"]
[null,null,null,"GMR.GM400.","OF non standard",null,2,"PROJET",null,null,null,"18/07/2014","17/01/2014"]
[null,null,null,"GMR.GM400.","OF non standard",null,1,"PROJET",null,null,null,"18/07/2014","2013-12-08"]
[null,null,null,"GMR.GM400.","OF non standard",null,1,"PROJET",null,null,null,"18/07/2014","2013-12-08"]
[null,null,null,"GMR.GM400.","OF non standard",null,1,"PROJET",null,null,null,"18/07/2014","27/03/2014"]
[null,null,null,"GMR.GM400.","OF non standard",null,1,"PROJET",null,null,null,"18/07/2014","14/04/2014"]
[null,null,null,"GMR.GM400.","OF non standard",null,1,"PROJET",null,null,null,"18/07/2014","2014-03-04"]
[null,null,null,"GMR.GM400.","OF non standard",null,1,"PROJET",null,null,null,"18/07/2014","2014-04-04"]
[null,null,null,"GMR.GM400.","OF non standard",null,1,"PROJET",null,null,null,"18/07/2014","25/04/2014"]
[null,null,null,"GMR.GM400.","OF non standard",null,1,"PROJET",null,null,null,"18/07/2014","14/04/2014"]
[null,null,null,"GMR.GM400.","OF non standard",null,1,"PROJET",null,null,null,"18/07/2014","2014-04-04"]
[null,null,null,"GMR.GM400.","OF non standard",null,1,"PROJET",null,null,null,"18/07/2014","16/06/2014"]
[null,null,null,"GMR.GM400.","OF non standard",null,1,"PROJET",null,null,null,"18/07/2014","30/04/2014"]
[null,null,null,"GMR.GM400.","OF non standard",null,1,"LIM_GMR",null,null,null,"18/07/2014","30/09/2014"]
[null,null,null,"GMR.GM400.","OF non standard",null,2,"LIM_GMR",null,null,null,"18/07/2014","2014-01-09"]