{"text_format":"1","workbook":"xlsx","n_sheets":3,"sheets":["Tableau Commandes","Récapitulatifs","Feuil3"],"not_rendered":{"charts":0,"images":0,"macros":1,"external_links":0,"defined_names":8,"comments":0,"pivot_tables":0},"unopened":[],"bounds":{"document_bytes":16777216,"sheet_cells":100000,"rows_first":2000,"rows_last":500,"rows_between":2000,"halvings":0,"cell_chars":16384,"cell_head_chars":4096},"cells_cut":0,"cells_raw":0,"read":"whole","date_system":"1900"}

{"sheet":"Tableau Commandes","index":0,"n_rows":150,"n_cols":13,"rows_kept":150,"cut":false,"hidden":false,"merged":[[1,0,1,4],[0,1,0,11]]}
[null,"COMMANDES"]
[{"$f":"TODAY()","v":"2013-01-06"}]
["NOM - Prénom-N° Fiche ","Désignation","Quantité","DISPO SUR STOCK","REF ","PRIX ACHAT","PRIX DE VENTE ","FABRICANT",null,"TRANSPORTEUR","EMPLACEMENT","PREPAREE RELIQUAT","MESSAGE"]
["Colonne1","Colonne2","Colonne3","Colonne4","Colonne5","Colonne52","Colonne53","Colonne54","Colonne55","Colonne56","Colonne57","Colonne6","Colonne7"]
[{"$f":"INDIRECT(\"Feuil3!\" & ADDRESS(ROW(A2),COLUMN(A2)))","v":"A"},{"$f":"INDIRECT(\"Feuil3!\" & ADDRESS(ROW(B2),COLUMN(B2)))","v":"test"},1,{"$f":"INDIRECT(\"Feuil3!\" & ADDRESS(ROW(D2),COLUMN(D2)))","v":0},"81035",0,0,0,"Mondial Relay(code=MON) / orig=",{"$f":"IF(LEFT(I5,1)=\"M\",\"MONDIAL RELAY\",IF(LEFT(I5,1)=\"E\",\"PREPASECURE\",IF(LEFT(I5,1)=\"S\",\"SO COLISSIMO\",IF(LEFT(I5,2)=\"CO\",\"COLISSIMO\",IF(LEFT(I5,2)=\"CH\",\"CHRONOPOST\",\"\")))))","v":"MONDIAL RELAY"},{"$f":"INDIRECT(\"Feuil3!\" & ADDRESS(ROW(J2),COLUMN(J2)))","v":0},{"$f":"INDEX(Récapitulatifs!$F$4:$F$61,MATCH($E5,Récapitulatifs!$B$4:$B$61,0))","v":0},{"$f":"IF(D5=\"STOCK RES\",\"DISPO CHEZ MOI\",IF(D5=\"Sold Out\",\"STOCK A VERIFIER\",\"\"))","v":""}]
["A","test",1,{"$f":"INDIRECT(\"Feuil3!\" & ADDRESS(ROW(D3),COLUMN(D3)))","v":0},"MECA997",0,0,null,{"$f":"INDIRECT(\"Feuil3!\" & ADDRESS(ROW(I3),COLUMN(I3)))","v":"Mondial Relay(code=MON) / orig="},"MONDIAL RELAY",0,{"$f":"INDEX(Récapitulatifs!$F$4:$F$61,MATCH($E6,Récapitulatifs!$B$4:$B$61,0))","v":0},""]
["A","test",1,{"$f":"INDIRECT(\"Feuil3!\" & ADDRESS(ROW(D4),COLUMN(D4)))","v":0},"MECA985",0,0,null,{"$f":"INDIRECT(\"Feuil3!\" & ADDRESS(ROW(I4),COLUMN(I4)))","v":"Mondial Relay(code=MON) / orig="},"MONDIAL RELAY",0,{"$f":"INDEX(Récapitulatifs!$F$4:$F$61,MATCH($E7,Récapitulatifs!$B$4:$B$61,0))","v":0},""]
["A","test",1,{"$f":"INDIRECT(\"Feuil3!\" & ADDRESS(ROW(D5),COLUMN(D5)))","v":0},"321050",0,0,null,{"$f":"INDIRECT(\"Feuil3!\" & ADDRESS(ROW(I5),COLUMN(I5)))","v":"Chrono Relais*(code=REL) / orig="},"CHRONOPOST",0,{"$f":"INDEX(Récapitulatifs!$F$4:$F$61,MATCH($E8,Récapitulatifs!$B$4:$B$61,0))","v":0},""]
["A","test",1,{"$f":"INDIRECT(\"Feuil3!\" & ADDRESS(ROW(D6),COLUMN(D6)))","v":"stock res"},"GLC41431",0,0,null,{"$f":"INDIRECT(\"Feuil3!\" & ADDRESS(ROW(I6),COLUMN(I6)))","v":"Mondial Relay(code=MON) / orig="},"MONDIAL RELAY",0,{"$f":"INDEX(Récapitulatifs!$F$4:$F$61,MATCH($E9,Récapitulatifs!$B$4:$B$61,0))","v":0},"DISPO CHEZ MOI"]
["A","test",1,{"$f":"INDIRECT(\"Feuil3!\" & ADDRESS(ROW(D7),COLUMN(D7)))","v":0},"14135",0,0,null,{"$f":"INDIRECT(\"Feuil3!\" & ADDRESS(ROW(I7),COLUMN(I7)))","v":"Mondial Relay(code=MON) / orig="},"MONDIAL RELAY",0,{"$f":"INDEX(Récapitulatifs!$F$4:$F$61,MATCH($E10,Récapitulatifs!$B$4:$B$61,0))","v":0},""]
["A","test",1,{"$f":"INDIRECT(\"Feuil3!\" & ADDRESS(ROW(D8),COLUMN(D8)))","v":0},"14134",0,0,null,{"$f":"INDIRECT(\"Feuil3!\" & ADDRESS(ROW(I8),COLUMN(I8)))","v":"Mondial Relay(code=MON) / orig="},"MONDIAL RELAY",0,{"$f":"INDEX(Récapitulatifs!$F$4:$F$61,MATCH($E11,Récapitulatifs!$B$4:$B$61,0))","v":0},""]
["A","test",1,{"$f":"INDIRECT(\"Feuil3!\" & ADDRESS(ROW(D9),COLUMN(D9)))","v":0},"A14541",0,0,null,{"$f":"INDIRECT(\"Feuil3!\" & ADDRESS(ROW(I9),COLUMN(I9)))","v":"Mondial Relay(code=MON) / orig="},"MONDIAL RELAY",0,{"$f":"INDEX(Récapitulatifs!$F$4:$F$61,MATCH($E12,Récapitulatifs!$B$4:$B$61,0))","v":0},""]
["A","test",1,{"$f":"INDIRECT(\"Feuil3!\" & ADDRESS(ROW(D10),COLUMN(D10)))","v":0},"26599",0,0,null,{"$f":"INDIRECT(\"Feuil3!\" & ADDRESS(ROW(I10),COLUMN(I10)))","v":"Mondial Relay(code=MON) / orig="},"MONDIAL RELAY",0,{"$f":"INDEX(Récapitulatifs!$F$4:$F$61,MATCH($E13,Récapitulatifs!$B$4:$B$61,0))","v":0},""]
["A","test",1,{"$f":"INDIRECT(\"Feuil3!\" & ADDRESS(ROW(D11),COLUMN(D11)))","v":"stock res"},"4594",0,0,null,{"$f":"INDIRECT(\"Feuil3!\" & ADDRESS(ROW(I11),COLUMN(I11)))","v":"Mondial Relay(code=MON) / orig="},"MONDIAL RELAY",0,{"$f":"INDEX(Récapitulatifs!$F$4:$F$61,MATCH($E14,Récapitulatifs!$B$4:$B$61,0))","v":0},"DISPO CHEZ MOI"]
["A","test",1,{"$f":"INDIRECT(\"Feuil3!\" & ADDRESS(ROW(D12),COLUMN(D12)))","v":"stock res"},"CDAL-54510z",0,0,null,{"$f":"INDIRECT(\"Feuil3!\" & ADDRESS(ROW(I12),COLUMN(I12)))","v":"Mondial Relay(code=MON) / orig="},"MONDIAL RELAY",0,{"$f":"INDEX(Récapitulatifs!$F$4:$F$61,MATCH($E15,Récapitulatifs!$B$4:$B$61,0))","v":0},"DISPO CHEZ MOI"]
["A","test",1,{"$f":"INDIRECT(\"Feuil3!\" & ADDRESS(ROW(D13),COLUMN(D13)))","v":"purge stock"},"14588",0,0,null,{"$f":"INDIRECT(\"Feuil3!\" & ADDRESS(ROW(I13),COLUMN(I13)))","v":"Mondial Relay(code=MON) / orig="},"MONDIAL RELAY",0,{"$f":"INDEX(Récapitulatifs!$F$4:$F$61,MATCH($E16,Récapitulatifs!$B$4:$B$61,0))","v":0},""]
["A","test",1,{"$f":"INDIRECT(\"Feuil3!\" & ADDRESS(ROW(D14),COLUMN(D14)))","v":"stock res"},"RI71112",0,0,null,{"$f":"INDIRECT(\"Feuil3!\" & ADDRESS(ROW(I14),COLUMN(I14)))","v":"Mondial Relay(code=MON) / orig="},"MONDIAL RELAY",0,{"$f":"INDEX(Récapitulatifs!$F$4:$F$61,MATCH($E17,Récapitulatifs!$B$4:$B$61,0))","v":0},"DISPO CHEZ MOI"]
["A","test",1,{"$f":"INDIRECT(\"Feuil3!\" & ADDRESS(ROW(D15),COLUMN(D15)))","v":0},"318204",0,0,null,{"$f":"INDIRECT(\"Feuil3!\" & ADDRESS(ROW(I15),COLUMN(I15)))","v":"Mondial Relay(code=MON) / orig="},"MONDIAL RELAY",0,{"$f":"INDEX(Récapitulatifs!$F$4:$F$61,MATCH($E18,Récapitulatifs!$B$4:$B$61,0))","v":0},""]
["A","test",1,{"$f":"INDIRECT(\"Feuil3!\" & ADDRESS(ROW(D16),COLUMN(D16)))","v":"stock res"},"4725",0,0,null,{"$f":"INDIRECT(\"Feuil3!\" & ADDRESS(ROW(I16),COLUMN(I16)))","v":"Mondial Relay(code=MON) / orig="},"MONDIAL RELAY",0,{"$f":"INDEX(Récapitulatifs!$F$4:$F$61,MATCH($E19,Récapitulatifs!$B$4:$B$61,0))","v":0},"DISPO CHEZ MOI"]
["A","test",1,{"$f":"INDIRECT(\"Feuil3!\" & ADDRESS(ROW(D17),COLUMN(D17)))","v":0},"350240XDEUX",0,0,null,{"$f":"INDIRECT(\"Feuil3!\" & ADDRESS(ROW(I17),COLUMN(I17)))","v":"Mondial Relay(code=MON) / orig="},"MONDIAL RELAY",0,{"$f":"INDEX(Récapitulatifs!$F$4:$F$61,MATCH($E20,Récapitulatifs!$B$4:$B$61,0))","v":0},""]
["A","test",1,{"$f":"INDIRECT(\"Feuil3!\" & ADDRESS(ROW(D18),COLUMN(D18)))","v":0},"106390",0,0,null,{"$f":"INDIRECT(\"Feuil3!\" & ADDRESS(ROW(I18),COLUMN(I18)))","v":"Mondial Relay(code=MON) / orig="},"MONDIAL RELAY",0,{"$f":"INDEX(Récapitulatifs!$F$4:$F$61,MATCH($E21,Récapitulatifs!$B$4:$B$61,0))","v":0},""]
["A","test",1,{"$f":"INDIRECT(\"Feuil3!\" & ADDRESS(ROW(D19),COLUMN(D19)))","v":0},"GLC41429",0,0,null,{"$f":"INDIRECT(\"Feuil3!\" & ADDRESS(ROW(I19),COLUMN(I19)))","v":"Mondial Relay(code=MON) / orig="},"MONDIAL RELAY",0,{"$f":"INDEX(Récapitulatifs!$F$4:$F$61,MATCH($E22,Récapitulatifs!$B$4:$B$61,0))","v":0},""]
["A","test",2,{"$f":"INDIRECT(\"Feuil3!\" & ADDRESS(ROW(D20),COLUMN(D20)))","v":0},"MECA4178",0,0,null,{"$f":"INDIRECT(\"Feuil3!\" & ADDRESS(ROW(I20),COLUMN(I20)))","v":"Mondial Relay(code=MON) / orig="},"MONDIAL RELAY",0,{"$f":"INDEX(Récapitulatifs!$F$4:$F$61,MATCH($E23,Récapitulatifs!$B$4:$B$61,0))","v":0},""]
["A","test",1,{"$f":"INDIRECT(\"Feuil3!\" & ADDRESS(ROW(D21),COLUMN(D21)))","v":0},"MECA3836",0,0,null,{"$f":"INDIRECT(\"Feuil3!\" & ADDRESS(ROW(I21),COLUMN(I21)))","v":"Chronopost*(code=CHR) / orig="},"CHRONOPOST",0,{"$f":"INDEX(Récapitulatifs!$F$4:$F$61,MATCH($E24,Récapitulatifs!$B$4:$B$61,0))","v":0},""]
["A","test",1,{"$f":"INDIRECT(\"Feuil3!\" & ADDRESS(ROW(D22),COLUMN(D22)))","v":0},"99907",0,0,null,{"$f":"INDIRECT(\"Feuil3!\" & ADDRESS(ROW(I22),COLUMN(I22)))","v":"SO Colissimo(code=SOC) / orig="},"SO COLISSIMO",0,{"$f":"INDEX(Récapitulatifs!$F$4:$F$61,MATCH($E25,Récapitulatifs!$B$4:$B$61,0))","v":0},""]
["A","test",1,{"$f":"INDIRECT(\"Feuil3!\" & ADDRESS(ROW(D23),COLUMN(D23)))","v":0},"GLC40101",0,0,null,{"$f":"INDIRECT(\"Feuil3!\" & ADDRESS(ROW(I23),COLUMN(I23)))","v":"Chronopost*(code=CHR) / orig="},"CHRONOPOST",0,{"$f":"INDEX(Récapitulatifs!$F$4:$F$61,MATCH($E26,Récapitulatifs!$B$4:$B$61,0))","v":0},""]
["A","test",1,{"$f":"INDIRECT(\"Feuil3!\" & ADDRESS(ROW(D24),COLUMN(D24)))","v":0},"MECA3836",0,0,null,{"$f":"INDIRECT(\"Feuil3!\" & ADDRESS(ROW(I24),COLUMN(I24)))","v":"Colissimo*(Contre Remboursement Possible +7,00)(code=COL) / orig="},"COLISSIMO",0,{"$f":"INDEX(Récapitulatifs!$F$4:$F$61,MATCH($E27,Récapitulatifs!$B$4:$B$61,0))","v":0},""]
["A","test",1,{"$f":"INDIRECT(\"Feuil3!\" & ADDRESS(ROW(D25),COLUMN(D25)))","v":0},"813412X2",0,0,null,{"$f":"INDIRECT(\"Feuil3!\" & ADDRESS(ROW(I25),COLUMN(I25)))","v":0},"",0,{"$f":"INDEX(Récapitulatifs!$F$4:$F$61,MATCH($E28,Récapitulatifs!$B$4:$B$61,0))","v":0},""]
["A","test",1,{"$f":"INDIRECT(\"Feuil3!\" & ADDRESS(ROW(D26),COLUMN(D26)))","v":0},"CDAL29409k",0,0,null,{"$f":"INDIRECT(\"Feuil3!\" & ADDRESS(ROW(I26),COLUMN(I26)))","v":0},"",0,{"$f":"INDEX(Récapitulatifs!$F$4:$F$61,MATCH($E29,Récapitulatifs!$B$4:$B$61,0))","v":0},""]
["A","test",2,{"$f":"INDIRECT(\"Feuil3!\" & ADDRESS(ROW(D27),COLUMN(D27)))","v":0},"MECA4032",0,0,null,{"$f":"INDIRECT(\"Feuil3!\" & ADDRESS(ROW(I27),COLUMN(I27)))","v":0},"",0,{"$f":"INDEX(Récapitulatifs!$F$4:$F$61,MATCH($E30,Récapitulatifs!$B$4:$B$61,0))","v":0},""]
["A","test",1,{"$f":"INDIRECT(\"Feuil3!\" & ADDRESS(ROW(D28),COLUMN(D28)))","v":0},"SPILU409003",0,0,null,{"$f":"INDIRECT(\"Feuil3!\" & ADDRESS(ROW(I28),COLUMN(I28)))","v":0},"",0,{"$f":"INDEX(Récapitulatifs!$F$4:$F$61,MATCH($E31,Récapitulatifs!$B$4:$B$61,0))","v":0},""]
["A","test",1,{"$f":"INDIRECT(\"Feuil3!\" & ADDRESS(ROW(D29),COLUMN(D29)))","v":0},"351200",0,0,null,{"$f":"INDIRECT(\"Feuil3!\" & ADDRESS(ROW(I29),COLUMN(I29)))","v":"SO Colissimo(code=SOC) / orig="},"SO COLISSIMO",0,{"$f":"INDEX(Récapitulatifs!$F$4:$F$61,MATCH($E32,Récapitulatifs!$B$4:$B$61,0))","v":0},""]
["A","test",1,{"$f":"INDIRECT(\"Feuil3!\" & ADDRESS(ROW(D30),COLUMN(D30)))","v":0},"GS11205",0,0,null,{"$f":"INDIRECT(\"Feuil3!\" & ADDRESS(ROW(I30),COLUMN(I30)))","v":"Colissimo*(Contre Remboursement Possible +7,00)(code=COL) / orig="},"COLISSIMO",0,{"$f":"INDEX(Récapitulatifs!$F$4:$F$61,MATCH($E33,Récapitulatifs!$B$4:$B$61,0))","v":0},""]
["A","test",1,{"$f":"INDIRECT(\"Feuil3!\" & ADDRESS(ROW(D31),COLUMN(D31)))","v":0},"A14119",0,0,null,{"$f":"INDIRECT(\"Feuil3!\" & ADDRESS(ROW(I31),COLUMN(I31)))","v":"SO Colissimo(code=SOC) / orig="},"SO COLISSIMO",0,{"$f":"INDEX(Récapitulatifs!$F$4:$F$61,MATCH($E34,Récapitulatifs!$B$4:$B$61,0))","v":0},""]
["A","test",1,{"$f":"INDIRECT(\"Feuil3!\" & ADDRESS(ROW(D32),COLUMN(D32)))","v":0},"3652",0,0,null,{"$f":"INDIRECT(\"Feuil3!\" & ADDRESS(ROW(I32),COLUMN(I32)))","v":"Colissimo*(Contre Remboursement Possible +7,00)(code=COL) / orig="},"COLISSIMO",0,{"$f":"INDEX(Récapitulatifs!$F$4:$F$61,MATCH($E35,Récapitulatifs!$B$4:$B$61,0))","v":0},""]
["A","test",1,{"$f":"INDIRECT(\"Feuil3!\" & ADDRESS(ROW(D33),COLUMN(D33)))","v":"stock res"},"4740",0,0,null,{"$f":"INDIRECT(\"Feuil3!\" & ADDRESS(ROW(I33),COLUMN(I33)))","v":"Colissimo*(Contre Remboursement Possible +7,00)(code=COL) / orig="},"COLISSIMO",0,{"$f":"INDEX(Récapitulatifs!$F$4:$F$61,MATCH($E36,Récapitulatifs!$B$4:$B$61,0))","v":0},"DISPO CHEZ MOI"]
["A","test",1,{"$f":"INDIRECT(\"Feuil3!\" & ADDRESS(ROW(D34),COLUMN(D34)))","v":0},"106400",0,0,null,{"$f":"INDIRECT(\"Feuil3!\" & ADDRESS(ROW(I34),COLUMN(I34)))","v":"Colissimo*(Contre Remboursement Possible +7,00)(code=COL) / orig="},"COLISSIMO",{"$f":"INDIRECT(\"Feuil3!\" & ADDRESS(ROW(J34),COLUMN(J34)))","v":0},{"$f":"INDEX(Récapitulatifs!$F$4:$F$61,MATCH($E37,Récapitulatifs!$B$4:$B$61,0))","v":0},{"$f":"IF(D37=\"STOCK RES\",\"DISPO CHEZ MOI\",IF(D37=\"Sold Out\",\"STOCK A VERIFIER\",\"\"))","v":""}]
["A","test",1,{"$f":"INDIRECT(\"Feuil3!\" & ADDRESS(ROW(D35),COLUMN(D35)))","v":0},"9018",0,0,null,{"$f":"INDIRECT(\"Feuil3!\" & ADDRESS(ROW(I35),COLUMN(I35)))","v":"Colissimo*(Contre Remboursement Possible +7,00)(code=COL) / orig="},"COLISSIMO",0,{"$f":"INDEX(Récapitulatifs!$F$4:$F$61,MATCH($E38,Récapitulatifs!$B$4:$B$61,0))","v":0},""]
["A","test",1,{"$f":"INDIRECT(\"Feuil3!\" & ADDRESS(ROW(D36),COLUMN(D36)))","v":0},"24099XDEUX",0,0,null,{"$f":"INDIRECT(\"Feuil3!\" & ADDRESS(ROW(I36),COLUMN(I36)))","v":"SO Colissimo(code=SOC) / orig="},"SO COLISSIMO",0,{"$f":"INDEX(Récapitulatifs!$F$4:$F$61,MATCH($E39,Récapitulatifs!$B$4:$B$61,0))","v":0},""]
["A","test",1,{"$f":"INDIRECT(\"Feuil3!\" & ADDRESS(ROW(D37),COLUMN(D37)))","v":0},"A027XDEUX",0,0,null,{"$f":"INDIRECT(\"Feuil3!\" & ADDRESS(ROW(I37),COLUMN(I37)))","v":"SO Colissimo(code=SOC) / orig="},"SO COLISSIMO",0,{"$f":"INDEX(Récapitulatifs!$F$4:$F$61,MATCH($E40,Récapitulatifs!$B$4:$B$61,0))","v":0},""]
["A","test",1,{"$f":"INDIRECT(\"Feuil3!\" & ADDRESS(ROW(D38),COLUMN(D38)))","v":0},"99952",0,0,null,{"$f":"INDIRECT(\"Feuil3!\" & ADDRESS(ROW(I38),COLUMN(I38)))","v":"Enveloppes Rigides Avec Suivi(code=POS) / orig="},"PREPASECURE",0,{"$f":"INDEX(Récapitulatifs!$F$4:$F$61,MATCH($E41,Récapitulatifs!$B$4:$B$61,0))","v":0},""]
["A","test",1,{"$f":"INDIRECT(\"Feuil3!\" & ADDRESS(ROW(D39),COLUMN(D39)))","v":0},"561020",0,0,null,{"$f":"INDIRECT(\"Feuil3!\" & ADDRESS(ROW(I39),COLUMN(I39)))","v":"Colissimo*(Contre Remboursement Possible +7,00)(code=COL) / orig="},"COLISSIMO",0,{"$f":"INDEX(Récapitulatifs!$F$4:$F$61,MATCH($E42,Récapitulatifs!$B$4:$B$61,0))","v":0},""]
["A","test",1,{"$f":"INDIRECT(\"Feuil3!\" & ADDRESS(ROW(D40),COLUMN(D40)))","v":"stock res"},"599610",0,0,null,{"$f":"INDIRECT(\"Feuil3!\" & ADDRESS(ROW(I40),COLUMN(I40)))","v":"Enveloppes Rigides Avec Suivi(code=POS) / orig="},"PREPASECURE",0,{"$f":"INDEX(Récapitulatifs!$F$4:$F$61,MATCH($E43,Récapitulatifs!$B$4:$B$61,0))","v":0},"DISPO CHEZ MOI"]
["A","test",1,{"$f":"INDIRECT(\"Feuil3!\" & ADDRESS(ROW(D41),COLUMN(D41)))","v":0},"9501300",0,0,null,{"$f":"INDIRECT(\"Feuil3!\" & ADDRESS(ROW(I41),COLUMN(I41)))","v":"SO Colissimo(code=SOC) / orig="},"SO COLISSIMO",0,{"$f":"INDEX(Récapitulatifs!$F$4:$F$61,MATCH($E44,Récapitulatifs!$B$4:$B$61,0))","v":0},""]
[0,0,1,{"$f":"INDIRECT(\"Feuil3!\" & ADDRESS(ROW(D42),COLUMN(D42)))","v":0},"123",0,0,null,{"$f":"INDIRECT(\"Feuil3!\" & ADDRESS(ROW(I42),COLUMN(I42)))","v":"SO Colissimo(code=SOC) / orig="},"SO COLISSIMO",0,{"$f":"INDEX(Récapitulatifs!$F$4:$F$61,MATCH($E45,Récapitulatifs!$B$4:$B$61,0))","v":0},""]
[0,0,0,{"$f":"INDIRECT(\"Feuil3!\" & ADDRESS(ROW(D43),COLUMN(D43)))","v":0},0,0,0,null,{"$f":"INDIRECT(\"Feuil3!\" & ADDRESS(ROW(I43),COLUMN(I43)))","v":0},"",0,{"$f":"INDEX(Récapitulatifs!$F$4:$F$61,MATCH($E46,Récapitulatifs!$B$4:$B$61,0))","v":{"$error":"#N/A"}},""]
[0,0,0,{"$f":"INDIRECT(\"Feuil3!\" & ADDRESS(ROW(D44),COLUMN(D44)))","v":0},0,0,0,null,{"$f":"INDIRECT(\"Feuil3!\" & ADDRESS(ROW(I44),COLUMN(I44)))","v":0},"",0,{"$f":"INDEX(Récapitulatifs!$F$4:$F$61,MATCH($E47,Récapitulatifs!$B$4:$B$61,0))","v":{"$error":"#N/A"}},""]
[0,0,0,{"$f":"INDIRECT(\"Feuil3!\" & ADDRESS(ROW(D45),COLUMN(D45)))","v":0},0,0,0,null,{"$f":"INDIRECT(\"Feuil3!\" & ADDRESS(ROW(I45),COLUMN(I45)))","v":0},"",0,{"$f":"INDEX(Récapitulatifs!$F$4:$F$61,MATCH($E48,Récapitulatifs!$B$4:$B$61,0))","v":{"$error":"#N/A"}},""]
[0,0,0,{"$f":"INDIRECT(\"Feuil3!\" & ADDRESS(ROW(D46),COLUMN(D46)))","v":0},0,0,0,null,{"$f":"INDIRECT(\"Feuil3!\" & ADDRESS(ROW(I46),COLUMN(I46)))","v":0},"",0,{"$f":"INDEX(Récapitulatifs!$F$4:$F$61,MATCH($E49,Récapitulatifs!$B$4:$B$61,0))","v":{"$error":"#N/A"}},""]
[0,0,0,{"$f":"INDIRECT(\"Feuil3!\" & ADDRESS(ROW(D47),COLUMN(D47)))","v":0},0,0,0,null,{"$f":"INDIRECT(\"Feuil3!\" & ADDRESS(ROW(I47),COLUMN(I47)))","v":0},"",0,{"$f":"INDEX(Récapitulatifs!$F$4:$F$61,MATCH($E50,Récapitulatifs!$B$4:$B$61,0))","v":{"$error":"#N/A"}},""]
[0,0,0,{"$f":"INDIRECT(\"Feuil3!\" & ADDRESS(ROW(D48),COLUMN(D48)))","v":0},0,0,0,null,{"$f":"INDIRECT(\"Feuil3!\" & ADDRESS(ROW(I48),COLUMN(I48)))","v":0},"",0,{"$f":"INDEX(Récapitulatifs!$F$4:$F$61,MATCH($E51,Récapitulatifs!$B$4:$B$61,0))","v":{"$error":"#N/A"}},""]
[0,0,0,{"$f":"INDIRECT(\"Feuil3!\" & ADDRESS(ROW(D49),COLUMN(D49)))","v":0},0,0,0,null,{"$f":"INDIRECT(\"Feuil3!\" & ADDRESS(ROW(I49),COLUMN(I49)))","v":0},"",0,{"$f":"INDEX(Récapitulatifs!$F$4:$F$61,MATCH($E52,Récapitulatifs!$B$4:$B$61,0))","v":{"$error":"#N/A"}},""]
[0,0,0,{"$f":"INDIRECT(\"Feuil3!\" & ADDRESS(ROW(D50),COLUMN(D50)))","v":0},0,0,0,null,{"$f":"INDIRECT(\"Feuil3!\" & ADDRESS(ROW(I50),COLUMN(I50)))","v":0},"",0,{"$f":"INDEX(Récapitulatifs!$F$4:$F$61,MATCH($E53,Récapitulatifs!$B$4:$B$61,0))","v":{"$error":"#N/A"}},""]
[0,0,0,{"$f":"INDIRECT(\"Feuil3!\" & ADDRESS(ROW(D51),COLUMN(D51)))","v":0},0,0,0,null,{"$f":"INDIRECT(\"Feuil3!\" & ADDRESS(ROW(I51),COLUMN(I51)))","v":0},"",0,{"$f":"INDEX(Récapitulatifs!$F$4:$F$61,MATCH($E54,Récapitulatifs!$B$4:$B$61,0))","v":{"$error":"#N/A"}},""]
[0,0,0,{"$f":"INDIRECT(\"Feuil3!\" & ADDRESS(ROW(D52),COLUMN(D52)))","v":0},0,0,0,null,{"$f":"INDIRECT(\"Feuil3!\" & ADDRESS(ROW(I52),COLUMN(I52)))","v":0},"",0,{"$f":"INDEX(Récapitulatifs!$F$4:$F$61,MATCH($E55,Récapitulatifs!$B$4:$B$61,0))","v":{"$error":"#N/A"}},""]
[0,0,0,{"$f":"INDIRECT(\"Feuil3!\" & ADDRESS(ROW(D53),COLUMN(D53)))","v":0},0,0,0,null,{"$f":"INDIRECT(\"Feuil3!\" & ADDRESS(ROW(I53),COLUMN(I53)))","v":0},"",0,{"$f":"INDEX(Récapitulatifs!$F$4:$F$61,MATCH($E56,Récapitulatifs!$B$4:$B$61,0))","v":{"$error":"#N/A"}},""]
[0,0,0,{"$f":"INDIRECT(\"Feuil3!\" & ADDRESS(ROW(D54),COLUMN(D54)))","v":0},0,0,0,null,{"$f":"INDIRECT(\"Feuil3!\" & ADDRESS(ROW(I54),COLUMN(I54)))","v":0},"",0,{"$f":"INDEX(Récapitulatifs!$F$4:$F$61,MATCH($E57,Récapitulatifs!$B$4:$B$61,0))","v":{"$error":"#N/A"}},""]
[0,0,0,{"$f":"INDIRECT(\"Feuil3!\" & ADDRESS(ROW(D55),COLUMN(D55)))","v":0},0,0,0,null,{"$f":"INDIRECT(\"Feuil3!\" & ADDRESS(ROW(I55),COLUMN(I55)))","v":0},"",0,{"$f":"INDEX(Récapitulatifs!$F$4:$F$61,MATCH($E58,Récapitulatifs!$B$4:$B$61,0))","v":{"$error":"#N/A"}},""]
[0,0,0,{"$f":"INDIRECT(\"Feuil3!\" & ADDRESS(ROW(D56),COLUMN(D56)))","v":0},0,0,0,null,{"$f":"INDIRECT(\"Feuil3!\" & ADDRESS(ROW(I56),COLUMN(I56)))","v":0},"",0,{"$f":"INDEX(Récapitulatifs!$F$4:$F$61,MATCH($E59,Récapitulatifs!$B$4:$B$61,0))","v":{"$error":"#N/A"}},""]
[0,0,0,{"$f":"INDIRECT(\"Feuil3!\" & ADDRESS(ROW(D57),COLUMN(D57)))","v":0},0,0,0,null,{"$f":"INDIRECT(\"Feuil3!\" & ADDRESS(ROW(I57),COLUMN(I57)))","v":0},"",0,{"$f":"INDEX(Récapitulatifs!$F$4:$F$61,MATCH($E60,Récapitulatifs!$B$4:$B$61,0))","v":{"$error":"#N/A"}},""]
[0,0,0,{"$f":"INDIRECT(\"Feuil3!\" & ADDRESS(ROW(D58),COLUMN(D58)))","v":0},0,0,0,null,{"$f":"INDIRECT(\"Feuil3!\" & ADDRESS(ROW(I58),COLUMN(I58)))","v":0},"",0,{"$f":"INDEX(Récapitulatifs!$F$4:$F$61,MATCH($E61,Récapitulatifs!$B$4:$B$61,0))","v":{"$error":"#N/A"}},""]
[0,0,0,{"$f":"INDIRECT(\"Feuil3!\" & ADDRESS(ROW(D59),COLUMN(D59)))","v":0},0,0,0,null,{"$f":"INDIRECT(\"Feuil3!\" & ADDRESS(ROW(I59),COLUMN(I59)))","v":0},"",0,{"$f":"INDEX(Récapitulatifs!$F$4:$F$61,MATCH($E62,Récapitulatifs!$B$4:$B$61,0))","v":{"$error":"#N/A"}},""]
[{"$f":"INDIRECT(\"Feuil3!\" & ADDRESS(ROW(A60),COLUMN(A60)))","v":0},0,0,0,0,0,0,null,0,{"$f":"IF(LEFT(I63,1)=\"M\",\"MONDIAL RELAY\",IF(LEFT(I63,1)=\"E\",\"PREPASECURE\",IF(LEFT(I63,1)=\"S\",\"SO COLISSIMO\",IF(LEFT(I63,2)=\"CO\",\"COLISSIMO\",IF(LEFT(I63,2)=\"CH\",\"CHRONOPOST\",\"\")))))","v":""},{"$f":"INDIRECT(\"Feuil3!\" & ADDRESS(ROW(J60),COLUMN(J60)))","v":0},{"$f":"INDEX(Récapitulatifs!$F$4:$F$61,MATCH($E63,Récapitulatifs!$B$4:$B$61,0))","v":{"$error":"#N/A"}},{"$f":"IF(D63=\"STOCK RES\",\"DISPO CHEZ MOI\",IF(D63=\"Sold Out\",\"STOCK A VERIFIER\",\"\"))","v":""}]
[{"$f":"INDIRECT(\"Feuil3!\" & ADDRESS(ROW(A61),COLUMN(A61)))","v":0},0,0,0,0,0,0,null,0,"",0,{"$f":"INDEX(Récapitulatifs!$F$4:$F$61,MATCH($E64,Récapitulatifs!$B$4:$B$61,0))","v":{"$error":"#N/A"}},""]
[{"$f":"INDIRECT(\"Feuil3!\" & ADDRESS(ROW(A62),COLUMN(A62)))","v":0},0,0,0,0,0,0,null,0,"",0,{"$f":"INDEX(Récapitulatifs!$F$4:$F$61,MATCH($E65,Récapitulatifs!$B$4:$B$61,0))","v":{"$error":"#N/A"}},""]
[{"$f":"INDIRECT(\"Feuil3!\" & ADDRESS(ROW(A63),COLUMN(A63)))","v":0},0,0,0,0,0,0,null,0,"",0,{"$f":"INDEX(Récapitulatifs!$F$4:$F$61,MATCH($E66,Récapitulatifs!$B$4:$B$61,0))","v":{"$error":"#N/A"}},""]
[{"$f":"INDIRECT(\"Feuil3!\" & ADDRESS(ROW(A64),COLUMN(A64)))","v":0},0,0,0,0,0,0,null,0,"",0,{"$f":"INDEX(Récapitulatifs!$F$4:$F$61,MATCH($E67,Récapitulatifs!$B$4:$B$61,0))","v":{"$error":"#N/A"}},""]
[{"$f":"INDIRECT(\"Feuil3!\" & ADDRESS(ROW(A65),COLUMN(A65)))","v":0},0,0,0,0,0,0,null,0,"",0,{"$f":"INDEX(Récapitulatifs!$F$4:$F$61,MATCH($E68,Récapitulatifs!$B$4:$B$61,0))","v":{"$error":"#N/A"}},""]
[{"$f":"INDIRECT(\"Feuil3!\" & ADDRESS(ROW(A66),COLUMN(A66)))","v":0},0,0,0,0,0,0,null,0,"",0,{"$f":"INDEX(Récapitulatifs!$F$4:$F$61,MATCH($E69,Récapitulatifs!$B$4:$B$61,0))","v":{"$error":"#N/A"}},""]
[{"$f":"INDIRECT(\"Feuil3!\" & ADDRESS(ROW(A67),COLUMN(A67)))","v":0},0,0,0,0,0,0,null,0,"",0,{"$f":"INDEX(Récapitulatifs!$F$4:$F$61,MATCH($E70,Récapitulatifs!$B$4:$B$61,0))","v":{"$error":"#N/A"}},""]
[{"$f":"INDIRECT(\"Feuil3!\" & ADDRESS(ROW(A68),COLUMN(A68)))","v":0},0,0,0,0,0,0,null,0,"",0,{"$f":"INDEX(Récapitulatifs!$F$4:$F$61,MATCH($E71,Récapitulatifs!$B$4:$B$61,0))","v":{"$error":"#N/A"}},""]
[{"$f":"INDIRECT(\"Feuil3!\" & ADDRESS(ROW(A69),COLUMN(A69)))","v":0},0,0,0,0,0,0,null,0,"",0,{"$f":"INDEX(Récapitulatifs!$F$4:$F$61,MATCH($E72,Récapitulatifs!$B$4:$B$61,0))","v":{"$error":"#N/A"}},""]
[{"$f":"INDIRECT(\"Feuil3!\" & ADDRESS(ROW(A70),COLUMN(A70)))","v":0},0,0,0,0,0,0,null,0,"",0,{"$f":"INDEX(Récapitulatifs!$F$4:$F$61,MATCH($E73,Récapitulatifs!$B$4:$B$61,0))","v":{"$error":"#N/A"}},""]
[{"$f":"INDIRECT(\"Feuil3!\" & ADDRESS(ROW(A71),COLUMN(A71)))","v":0},0,0,0,0,0,0,null,0,"",0,{"$f":"INDEX(Récapitulatifs!$F$4:$F$61,MATCH($E74,Récapitulatifs!$B$4:$B$61,0))","v":{"$error":"#N/A"}},""]
[{"$f":"INDIRECT(\"Feuil3!\" & ADDRESS(ROW(A72),COLUMN(A72)))","v":0},0,0,0,0,0,0,null,0,"",0,{"$f":"INDEX(Récapitulatifs!$F$4:$F$61,MATCH($E75,Récapitulatifs!$B$4:$B$61,0))","v":{"$error":"#N/A"}},""]
[{"$f":"INDIRECT(\"Feuil3!\" & ADDRESS(ROW(A73),COLUMN(A73)))","v":0},0,0,0,0,0,0,null,0,"",0,{"$f":"INDEX(Récapitulatifs!$F$4:$F$61,MATCH($E76,Récapitulatifs!$B$4:$B$61,0))","v":{"$error":"#N/A"}},""]
[{"$f":"INDIRECT(\"Feuil3!\" & ADDRESS(ROW(A74),COLUMN(A74)))","v":0},0,0,0,0,0,0,null,0,"",0,{"$f":"INDEX(Récapitulatifs!$F$4:$F$61,MATCH($E77,Récapitulatifs!$B$4:$B$61,0))","v":{"$error":"#N/A"}},""]
[{"$f":"INDIRECT(\"Feuil3!\" & ADDRESS(ROW(A75),COLUMN(A75)))","v":0},0,0,0,0,0,0,null,0,"",0,{"$f":"INDEX(Récapitulatifs!$F$4:$F$61,MATCH($E78,Récapitulatifs!$B$4:$B$61,0))","v":{"$error":"#N/A"}},""]
[{"$f":"INDIRECT(\"Feuil3!\" & ADDRESS(ROW(A76),COLUMN(A76)))","v":0},0,0,0,0,0,0,null,0,"",0,{"$f":"INDEX(Récapitulatifs!$F$4:$F$61,MATCH($E79,Récapitulatifs!$B$4:$B$61,0))","v":{"$error":"#N/A"}},""]
[{"$f":"INDIRECT(\"Feuil3!\" & ADDRESS(ROW(A77),COLUMN(A77)))","v":0},0,0,0,0,0,0,null,0,"",0,{"$f":"INDEX(Récapitulatifs!$F$4:$F$61,MATCH($E80,Récapitulatifs!$B$4:$B$61,0))","v":{"$error":"#N/A"}},""]
[{"$f":"INDIRECT(\"Feuil3!\" & ADDRESS(ROW(A78),COLUMN(A78)))","v":0},0,0,0,0,0,0,null,0,"",0,{"$f":"INDEX(Récapitulatifs!$F$4:$F$61,MATCH($E81,Récapitulatifs!$B$4:$B$61,0))","v":{"$error":"#N/A"}},""]
[{"$f":"INDIRECT(\"Feuil3!\" & ADDRESS(ROW(A79),COLUMN(A79)))","v":0},0,0,0,0,0,0,null,0,"",0,{"$f":"INDEX(Récapitulatifs!$F$4:$F$61,MATCH($E82,Récapitulatifs!$B$4:$B$61,0))","v":{"$error":"#N/A"}},""]
[{"$f":"INDIRECT(\"Feuil3!\" & ADDRESS(ROW(A80),COLUMN(A80)))","v":0},0,0,0,0,0,0,null,0,"",0,{"$f":"INDEX(Récapitulatifs!$F$4:$F$61,MATCH($E83,Récapitulatifs!$B$4:$B$61,0))","v":{"$error":"#N/A"}},""]
[{"$f":"INDIRECT(\"Feuil3!\" & ADDRESS(ROW(A81),COLUMN(A81)))","v":0},0,0,0,0,0,0,null,0,"",0,{"$f":"INDEX(Récapitulatifs!$F$4:$F$61,MATCH($E84,Récapitulatifs!$B$4:$B$61,0))","v":{"$error":"#N/A"}},""]
[{"$f":"INDIRECT(\"Feuil3!\" & ADDRESS(ROW(A82),COLUMN(A82)))","v":0},0,0,0,0,0,0,null,0,"",0,{"$f":"INDEX(Récapitulatifs!$F$4:$F$61,MATCH($E85,Récapitulatifs!$B$4:$B$61,0))","v":{"$error":"#N/A"}},""]
[{"$f":"INDIRECT(\"Feuil3!\" & ADDRESS(ROW(A83),COLUMN(A83)))","v":0},0,0,0,0,0,0,null,0,"",0,{"$f":"INDEX(Récapitulatifs!$F$4:$F$61,MATCH($E86,Récapitulatifs!$B$4:$B$61,0))","v":{"$error":"#N/A"}},""]
[{"$f":"INDIRECT(\"Feuil3!\" & ADDRESS(ROW(A84),COLUMN(A84)))","v":0},0,0,0,0,0,0,null,0,"",0,{"$f":"INDEX(Récapitulatifs!$F$4:$F$61,MATCH($E87,Récapitulatifs!$B$4:$B$61,0))","v":{"$error":"#N/A"}},""]
[{"$f":"INDIRECT(\"Feuil3!\" & ADDRESS(ROW(A85),COLUMN(A85)))","v":0},0,0,0,0,0,0,null,0,"",0,{"$f":"INDEX(Récapitulatifs!$F$4:$F$61,MATCH($E88,Récapitulatifs!$B$4:$B$61,0))","v":{"$error":"#N/A"}},""]
[{"$f":"INDIRECT(\"Feuil3!\" & ADDRESS(ROW(A86),COLUMN(A86)))","v":0},0,0,0,0,0,0,null,0,"",0,{"$f":"INDEX(Récapitulatifs!$F$4:$F$61,MATCH($E89,Récapitulatifs!$B$4:$B$61,0))","v":{"$error":"#N/A"}},""]
[{"$f":"INDIRECT(\"Feuil3!\" & ADDRESS(ROW(A87),COLUMN(A87)))","v":0},0,0,0,0,0,0,null,0,"",0,{"$f":"INDEX(Récapitulatifs!$F$4:$F$61,MATCH($E90,Récapitulatifs!$B$4:$B$61,0))","v":{"$error":"#N/A"}},""]
[{"$f":"INDIRECT(\"Feuil3!\" & ADDRESS(ROW(A88),COLUMN(A88)))","v":0},0,0,0,0,0,0,null,0,"",0,{"$f":"INDEX(Récapitulatifs!$F$4:$F$61,MATCH($E91,Récapitulatifs!$B$4:$B$61,0))","v":{"$error":"#N/A"}},""]
[{"$f":"INDIRECT(\"Feuil3!\" & ADDRESS(ROW(A89),COLUMN(A89)))","v":0},0,0,0,0,0,0,null,0,"",0,{"$f":"INDEX(Récapitulatifs!$F$4:$F$61,MATCH($E92,Récapitulatifs!$B$4:$B$61,0))","v":{"$error":"#N/A"}},""]
[{"$f":"INDIRECT(\"Feuil3!\" & ADDRESS(ROW(A90),COLUMN(A90)))","v":0},0,0,0,0,0,0,null,0,"",0,{"$f":"INDEX(Récapitulatifs!$F$4:$F$61,MATCH($E93,Récapitulatifs!$B$4:$B$61,0))","v":{"$error":"#N/A"}},""]
[{"$f":"INDIRECT(\"Feuil3!\" & ADDRESS(ROW(A91),COLUMN(A91)))","v":0},0,0,0,0,0,0,null,0,"",0,{"$f":"INDEX(Récapitulatifs!$F$4:$F$61,MATCH($E94,Récapitulatifs!$B$4:$B$61,0))","v":{"$error":"#N/A"}},""]
[{"$f":"INDIRECT(\"Feuil3!\" & ADDRESS(ROW(A92),COLUMN(A92)))","v":0},0,0,0,0,0,0,null,0,"",0,{"$f":"INDEX(Récapitulatifs!$F$4:$F$61,MATCH($E95,Récapitulatifs!$B$4:$B$61,0))","v":{"$error":"#N/A"}},""]
[{"$f":"INDIRECT(\"Feuil3!\" & ADDRESS(ROW(A93),COLUMN(A93)))","v":0},0,0,0,0,0,0,null,0,"",0,{"$f":"INDEX(Récapitulatifs!$F$4:$F$61,MATCH($E96,Récapitulatifs!$B$4:$B$61,0))","v":{"$error":"#N/A"}},""]
[{"$f":"INDIRECT(\"Feuil3!\" & ADDRESS(ROW(A94),COLUMN(A94)))","v":0},0,0,0,0,0,0,null,0,"",0,{"$f":"INDEX(Récapitulatifs!$F$4:$F$61,MATCH($E97,Récapitulatifs!$B$4:$B$61,0))","v":{"$error":"#N/A"}},""]
[{"$f":"INDIRECT(\"Feuil3!\" & ADDRESS(ROW(A95),COLUMN(A95)))","v":0},0,0,0,0,0,0,null,0,"",0,{"$f":"INDEX(Récapitulatifs!$F$4:$F$61,MATCH($E98,Récapitulatifs!$B$4:$B$61,0))","v":{"$error":"#N/A"}},""]
[{"$f":"INDIRECT(\"Feuil3!\" & ADDRESS(ROW(A96),COLUMN(A96)))","v":0},0,0,0,0,0,0,null,0,"",0,{"$f":"INDEX(Récapitulatifs!$F$4:$F$61,MATCH($E99,Récapitulatifs!$B$4:$B$61,0))","v":{"$error":"#N/A"}},""]
[{"$f":"INDIRECT(\"Feuil3!\" & ADDRESS(ROW(A97),COLUMN(A97)))","v":0},0,0,0,0,0,0,null,0,"",0,{"$f":"INDEX(Récapitulatifs!$F$4:$F$61,MATCH($E100,Récapitulatifs!$B$4:$B$61,0))","v":{"$error":"#N/A"}},""]
[{"$f":"INDIRECT(\"Feuil3!\" & ADDRESS(ROW(A98),COLUMN(A98)))","v":0},0,0,0,0,0,0,null,0,"",0,{"$f":"INDEX(Récapitulatifs!$F$4:$F$61,MATCH($E101,Récapitulatifs!$B$4:$B$61,0))","v":{"$error":"#N/A"}},""]
[{"$f":"INDIRECT(\"Feuil3!\" & ADDRESS(ROW(A99),COLUMN(A99)))","v":0},0,0,0,0,0,0,null,0,"",0,{"$f":"INDEX(Récapitulatifs!$F$4:$F$61,MATCH($E102,Récapitulatifs!$B$4:$B$61,0))","v":{"$error":"#N/A"}},""]
[{"$f":"INDIRECT(\"Feuil3!\" & ADDRESS(ROW(A100),COLUMN(A100)))","v":0},0,0,0,0,0,0,null,0,"",0,{"$f":"INDEX(Récapitulatifs!$F$4:$F$61,MATCH($E103,Récapitulatifs!$B$4:$B$61,0))","v":{"$error":"#N/A"}},""]
[{"$f":"INDIRECT(\"Feuil3!\" & ADDRESS(ROW(A101),COLUMN(A101)))","v":0},0,0,0,0,0,0,null,0,"",0,{"$f":"INDEX(Récapitulatifs!$F$4:$F$61,MATCH($E104,Récapitulatifs!$B$4:$B$61,0))","v":{"$error":"#N/A"}},""]
[{"$f":"INDIRECT(\"Feuil3!\" & ADDRESS(ROW(A102),COLUMN(A102)))","v":0},0,0,0,0,0,0,null,0,"",0,{"$f":"INDEX(Récapitulatifs!$F$4:$F$61,MATCH($E105,Récapitulatifs!$B$4:$B$61,0))","v":{"$error":"#N/A"}},""]
[{"$f":"INDIRECT(\"Feuil3!\" & ADDRESS(ROW(A103),COLUMN(A103)))","v":0},0,0,0,0,0,0,null,0,"",0,{"$f":"INDEX(Récapitulatifs!$F$4:$F$61,MATCH($E106,Récapitulatifs!$B$4:$B$61,0))","v":{"$error":"#N/A"}},""]
[{"$f":"INDIRECT(\"Feuil3!\" & ADDRESS(ROW(A104),COLUMN(A104)))","v":0},0,0,0,0,0,0,null,0,"",0,{"$f":"INDEX(Récapitulatifs!$F$4:$F$61,MATCH($E107,Récapitulatifs!$B$4:$B$61,0))","v":{"$error":"#N/A"}},""]
[{"$f":"INDIRECT(\"Feuil3!\" & ADDRESS(ROW(A105),COLUMN(A105)))","v":0},0,0,0,0,0,0,null,0,"",0,{"$f":"INDEX(Récapitulatifs!$F$4:$F$61,MATCH($E108,Récapitulatifs!$B$4:$B$61,0))","v":{"$error":"#N/A"}},""]
[{"$f":"INDIRECT(\"Feuil3!\" & ADDRESS(ROW(A106),COLUMN(A106)))","v":0},0,0,0,0,0,0,null,0,"",0,{"$f":"INDEX(Récapitulatifs!$F$4:$F$61,MATCH($E109,Récapitulatifs!$B$4:$B$61,0))","v":{"$error":"#N/A"}},""]
[{"$f":"INDIRECT(\"Feuil3!\" & ADDRESS(ROW(A107),COLUMN(A107)))","v":0},0,0,0,0,0,0,null,0,"",0,{"$f":"INDEX(Récapitulatifs!$F$4:$F$61,MATCH($E110,Récapitulatifs!$B$4:$B$61,0))","v":{"$error":"#N/A"}},""]
[{"$f":"INDIRECT(\"Feuil3!\" & ADDRESS(ROW(A108),COLUMN(A108)))","v":0},0,0,0,0,0,0,null,0,"",0,{"$f":"INDEX(Récapitulatifs!$F$4:$F$61,MATCH($E111,Récapitulatifs!$B$4:$B$61,0))","v":{"$error":"#N/A"}},""]
[{"$f":"INDIRECT(\"Feuil3!\" & ADDRESS(ROW(A109),COLUMN(A109)))","v":0},0,0,0,0,0,0,null,0,"",0,{"$f":"INDEX(Récapitulatifs!$F$4:$F$61,MATCH($E112,Récapitulatifs!$B$4:$B$61,0))","v":{"$error":"#N/A"}},""]
[{"$f":"INDIRECT(\"Feuil3!\" & ADDRESS(ROW(A110),COLUMN(A110)))","v":0},0,0,0,0,0,0,null,0,"",0,{"$f":"INDEX(Récapitulatifs!$F$4:$F$61,MATCH($E113,Récapitulatifs!$B$4:$B$61,0))","v":{"$error":"#N/A"}},""]
[{"$f":"INDIRECT(\"Feuil3!\" & ADDRESS(ROW(A111),COLUMN(A111)))","v":0},0,0,0,0,0,0,null,0,"",0,{"$f":"INDEX(Récapitulatifs!$F$4:$F$61,MATCH($E114,Récapitulatifs!$B$4:$B$61,0))","v":{"$error":"#N/A"}},""]
[{"$f":"INDIRECT(\"Feuil3!\" & ADDRESS(ROW(A112),COLUMN(A112)))","v":0},0,0,0,0,0,0,null,0,"",0,{"$f":"INDEX(Récapitulatifs!$F$4:$F$61,MATCH($E115,Récapitulatifs!$B$4:$B$61,0))","v":{"$error":"#N/A"}},""]
[{"$f":"INDIRECT(\"Feuil3!\" & ADDRESS(ROW(A113),COLUMN(A113)))","v":0},0,0,0,0,0,0,null,0,"",0,{"$f":"INDEX(Récapitulatifs!$F$4:$F$61,MATCH($E116,Récapitulatifs!$B$4:$B$61,0))","v":{"$error":"#N/A"}},""]
[{"$f":"INDIRECT(\"Feuil3!\" & ADDRESS(ROW(A114),COLUMN(A114)))","v":0},0,0,0,0,0,0,null,0,"",0,{"$f":"INDEX(Récapitulatifs!$F$4:$F$61,MATCH($E117,Récapitulatifs!$B$4:$B$61,0))","v":{"$error":"#N/A"}},""]
[{"$f":"INDIRECT(\"Feuil3!\" & ADDRESS(ROW(A115),COLUMN(A115)))","v":0},0,0,0,0,0,0,null,0,"",0,{"$f":"INDEX(Récapitulatifs!$F$4:$F$61,MATCH($E118,Récapitulatifs!$B$4:$B$61,0))","v":{"$error":"#N/A"}},""]
[{"$f":"INDIRECT(\"Feuil3!\" & ADDRESS(ROW(A116),COLUMN(A116)))","v":0},0,0,0,0,0,0,null,0,"",0,{"$f":"INDEX(Récapitulatifs!$F$4:$F$61,MATCH($E119,Récapitulatifs!$B$4:$B$61,0))","v":{"$error":"#N/A"}},""]
[{"$f":"INDIRECT(\"Feuil3!\" & ADDRESS(ROW(A117),COLUMN(A117)))","v":0},0,0,0,0,0,0,null,0,"",0,{"$f":"INDEX(Récapitulatifs!$F$4:$F$61,MATCH($E120,Récapitulatifs!$B$4:$B$61,0))","v":{"$error":"#N/A"}},""]
[{"$f":"INDIRECT(\"Feuil3!\" & ADDRESS(ROW(A118),COLUMN(A118)))","v":0},0,0,0,0,0,0,null,0,"",0,{"$f":"INDEX(Récapitulatifs!$F$4:$F$61,MATCH($E121,Récapitulatifs!$B$4:$B$61,0))","v":{"$error":"#N/A"}},""]
[{"$f":"INDIRECT(\"Feuil3!\" & ADDRESS(ROW(A119),COLUMN(A119)))","v":0},0,0,0,0,0,0,null,0,"",0,{"$f":"INDEX(Récapitulatifs!$F$4:$F$61,MATCH($E122,Récapitulatifs!$B$4:$B$61,0))","v":{"$error":"#N/A"}},""]
[{"$f":"INDIRECT(\"Feuil3!\" & ADDRESS(ROW(A120),COLUMN(A120)))","v":0},0,0,0,0,0,0,null,0,"",0,{"$f":"INDEX(Récapitulatifs!$F$4:$F$61,MATCH($E123,Récapitulatifs!$B$4:$B$61,0))","v":{"$error":"#N/A"}},""]
[{"$f":"INDIRECT(\"Feuil3!\" & ADDRESS(ROW(A121),COLUMN(A121)))","v":0},0,0,0,0,0,0,null,0,"",0,{"$f":"INDEX(Récapitulatifs!$F$4:$F$61,MATCH($E124,Récapitulatifs!$B$4:$B$61,0))","v":{"$error":"#N/A"}},""]
[{"$f":"INDIRECT(\"Feuil3!\" & ADDRESS(ROW(A122),COLUMN(A122)))","v":0},0,0,0,0,0,0,null,0,"",0,{"$f":"INDEX(Récapitulatifs!$F$4:$F$61,MATCH($E125,Récapitulatifs!$B$4:$B$61,0))","v":{"$error":"#N/A"}},""]
[{"$f":"INDIRECT(\"Feuil3!\" & ADDRESS(ROW(A123),COLUMN(A123)))","v":0},0,0,0,0,0,0,null,{"$f":"INDIRECT(\"Feuil3!\" & ADDRESS(ROW(I123),COLUMN(I123)))","v":0},"",0,{"$f":"INDEX(Récapitulatifs!$F$4:$F$61,MATCH($E126,Récapitulatifs!$B$4:$B$61,0))","v":{"$error":"#N/A"}},""]
[{"$f":"INDIRECT(\"Feuil3!\" & ADDRESS(ROW(A124),COLUMN(A124)))","v":0},0,0,0,0,0,0,null,0,{"$f":"IF(LEFT(I127,1)=\"M\",\"MONDIAL RELAY\",IF(LEFT(I127,1)=\"E\",\"PREPASECURE\",IF(LEFT(I127,1)=\"S\",\"SO COLISSIMO\",IF(LEFT(I127,2)=\"CO\",\"COLISSIMO\",IF(LEFT(I127,2)=\"CH\",\"CHRONOPOST\",\"\")))))","v":""},{"$f":"INDIRECT(\"Feuil3!\" & ADDRESS(ROW(J124),COLUMN(J124)))","v":0},{"$f":"INDEX(Récapitulatifs!$F$4:$F$61,MATCH($E127,Récapitulatifs!$B$4:$B$61,0))","v":{"$error":"#N/A"}},{"$f":"IF(D127=\"STOCK RES\",\"DISPO CHEZ MOI\",IF(D127=\"Sold Out\",\"STOCK A VERIFIER\",\"\"))","v":""}]
[{"$f":"INDIRECT(\"Feuil3!\" & ADDRESS(ROW(A125),COLUMN(A125)))","v":0},0,0,0,0,0,0,null,0,"",0,{"$f":"INDEX(Récapitulatifs!$F$4:$F$61,MATCH($E128,Récapitulatifs!$B$4:$B$61,0))","v":{"$error":"#N/A"}},""]
[{"$f":"INDIRECT(\"Feuil3!\" & ADDRESS(ROW(A126),COLUMN(A126)))","v":0},0,0,0,0,0,0,null,0,"",0,{"$f":"INDEX(Récapitulatifs!$F$4:$F$61,MATCH($E129,Récapitulatifs!$B$4:$B$61,0))","v":{"$error":"#N/A"}},""]
[{"$f":"INDIRECT(\"Feuil3!\" & ADDRESS(ROW(A127),COLUMN(A127)))","v":0},0,0,0,0,0,0,null,0,"",0,{"$f":"INDEX(Récapitulatifs!$F$4:$F$61,MATCH($E130,Récapitulatifs!$B$4:$B$61,0))","v":{"$error":"#N/A"}},""]
[{"$f":"INDIRECT(\"Feuil3!\" & ADDRESS(ROW(A128),COLUMN(A128)))","v":0},0,0,0,0,0,0,null,0,"",0,{"$f":"INDEX(Récapitulatifs!$F$4:$F$61,MATCH($E131,Récapitulatifs!$B$4:$B$61,0))","v":{"$error":"#N/A"}},""]
[{"$f":"INDIRECT(\"Feuil3!\" & ADDRESS(ROW(A129),COLUMN(A129)))","v":0},0,0,0,0,0,0,null,0,"",0,{"$f":"INDEX(Récapitulatifs!$F$4:$F$61,MATCH($E132,Récapitulatifs!$B$4:$B$61,0))","v":{"$error":"#N/A"}},""]
[{"$f":"INDIRECT(\"Feuil3!\" & ADDRESS(ROW(A130),COLUMN(A130)))","v":0},0,0,0,0,0,0,null,0,"",0,{"$f":"INDEX(Récapitulatifs!$F$4:$F$61,MATCH($E133,Récapitulatifs!$B$4:$B$61,0))","v":{"$error":"#N/A"}},""]
[{"$f":"INDIRECT(\"Feuil3!\" & ADDRESS(ROW(A131),COLUMN(A131)))","v":0},0,0,0,0,0,0,null,0,"",0,{"$f":"INDEX(Récapitulatifs!$F$4:$F$61,MATCH($E134,Récapitulatifs!$B$4:$B$61,0))","v":{"$error":"#N/A"}},""]
[{"$f":"INDIRECT(\"Feuil3!\" & ADDRESS(ROW(A132),COLUMN(A132)))","v":0},0,0,0,0,0,0,null,0,"",0,{"$f":"INDEX(Récapitulatifs!$F$4:$F$61,MATCH($E135,Récapitulatifs!$B$4:$B$61,0))","v":{"$error":"#N/A"}},""]
[{"$f":"INDIRECT(\"Feuil3!\" & ADDRESS(ROW(A133),COLUMN(A133)))","v":0},0,0,0,0,0,0,null,0,"",0,{"$f":"INDEX(Récapitulatifs!$F$4:$F$61,MATCH($E136,Récapitulatifs!$B$4:$B$61,0))","v":{"$error":"#N/A"}},""]
[{"$f":"INDIRECT(\"Feuil3!\" & ADDRESS(ROW(A134),COLUMN(A134)))","v":0},0,0,0,0,0,0,null,0,"",0,{"$f":"INDEX(Récapitulatifs!$F$4:$F$61,MATCH($E137,Récapitulatifs!$B$4:$B$61,0))","v":{"$error":"#N/A"}},""]
[{"$f":"INDIRECT(\"Feuil3!\" & ADDRESS(ROW(A135),COLUMN(A135)))","v":0},0,0,0,0,0,0,null,0,"",0,{"$f":"INDEX(Récapitulatifs!$F$4:$F$61,MATCH($E138,Récapitulatifs!$B$4:$B$61,0))","v":{"$error":"#N/A"}},""]
[{"$f":"INDIRECT(\"Feuil3!\" & ADDRESS(ROW(A136),COLUMN(A136)))","v":0},0,0,0,0,0,0,null,0,"",0,{"$f":"INDEX(Récapitulatifs!$F$4:$F$61,MATCH($E139,Récapitulatifs!$B$4:$B$61,0))","v":{"$error":"#N/A"}},""]
[{"$f":"INDIRECT(\"Feuil3!\" & ADDRESS(ROW(A137),COLUMN(A137)))","v":0},0,0,0,0,0,0,null,0,"",0,{"$f":"INDEX(Récapitulatifs!$F$4:$F$61,MATCH($E140,Récapitulatifs!$B$4:$B$61,0))","v":{"$error":"#N/A"}},""]
[{"$f":"INDIRECT(\"Feuil3!\" & ADDRESS(ROW(A138),COLUMN(A138)))","v":0},0,0,0,0,0,0,null,0,"",0,{"$f":"INDEX(Récapitulatifs!$F$4:$F$61,MATCH($E141,Récapitulatifs!$B$4:$B$61,0))","v":{"$error":"#N/A"}},""]
[{"$f":"INDIRECT(\"Feuil3!\" & ADDRESS(ROW(A139),COLUMN(A139)))","v":0},0,0,0,0,0,0,null,0,"",0,{"$f":"INDEX(Récapitulatifs!$F$4:$F$61,MATCH($E142,Récapitulatifs!$B$4:$B$61,0))","v":{"$error":"#N/A"}},""]
[{"$f":"INDIRECT(\"Feuil3!\" & ADDRESS(ROW(A140),COLUMN(A140)))","v":0},0,0,0,0,0,0,null,0,"",0,{"$f":"INDEX(Récapitulatifs!$F$4:$F$61,MATCH($E143,Récapitulatifs!$B$4:$B$61,0))","v":{"$error":"#N/A"}},""]
[{"$f":"INDIRECT(\"Feuil3!\" & ADDRESS(ROW(A141),COLUMN(A141)))","v":0},0,0,0,0,0,0,null,0,"",0,{"$f":"INDEX(Récapitulatifs!$F$4:$F$61,MATCH($E144,Récapitulatifs!$B$4:$B$61,0))","v":{"$error":"#N/A"}},""]
[{"$f":"INDIRECT(\"Feuil3!\" & ADDRESS(ROW(A142),COLUMN(A142)))","v":0},0,0,0,0,0,0,null,0,"",0,{"$f":"INDEX(Récapitulatifs!$F$4:$F$61,MATCH($E145,Récapitulatifs!$B$4:$B$61,0))","v":{"$error":"#N/A"}},""]
[{"$f":"INDIRECT(\"Feuil3!\" & ADDRESS(ROW(A143),COLUMN(A143)))","v":0},0,0,0,0,0,0,null,0,"",0,{"$f":"INDEX(Récapitulatifs!$F$4:$F$61,MATCH($E146,Récapitulatifs!$B$4:$B$61,0))","v":{"$error":"#N/A"}},""]
[{"$f":"INDIRECT(\"Feuil3!\" & ADDRESS(ROW(A144),COLUMN(A144)))","v":0},0,0,0,0,0,0,null,0,"",0,{"$f":"INDEX(Récapitulatifs!$F$4:$F$61,MATCH($E147,Récapitulatifs!$B$4:$B$61,0))","v":{"$error":"#N/A"}},""]
[{"$f":"INDIRECT(\"Feuil3!\" & ADDRESS(ROW(A145),COLUMN(A145)))","v":0},0,0,0,0,0,0,null,0,"",0,{"$f":"INDEX(Récapitulatifs!$F$4:$F$61,MATCH($E148,Récapitulatifs!$B$4:$B$61,0))","v":{"$error":"#N/A"}},""]
[{"$f":"INDIRECT(\"Feuil3!\" & ADDRESS(ROW(A146),COLUMN(A146)))","v":0},0,0,0,0,0,0,null,0,"",0,{"$f":"INDEX(Récapitulatifs!$F$4:$F$61,MATCH($E149,Récapitulatifs!$B$4:$B$61,0))","v":{"$error":"#N/A"}},""]
[{"$f":"INDIRECT(\"Feuil3!\" & ADDRESS(ROW(A147),COLUMN(A147)))","v":0},0,0,0,0,0,0,null,0,"",0,{"$f":"INDEX(Récapitulatifs!$F$4:$F$61,MATCH($E150,Récapitulatifs!$B$4:$B$61,0))","v":{"$error":"#N/A"}},""]

{"sheet":"Récapitulatifs","index":1,"n_rows":252,"n_cols":9,"rows_kept":252,"cut":false,"hidden":false,"merged":[]}
[]
[]
[null,"REFERENCE","QUANTITE","QUANTITE","VALIDATION","INFO DE PREPARATION  ","MESSAGE ","VALIDATION","INFO DE PREPARATION  "]
[null,"81035",{"$f":"IF(B4<>\"\",COUNTIF('Tableau Commandes'!E5:E150,Récapitulatifs!B4),\"\")","v":1},{"$f":"IF(B4=\"\",\"\",SUMIF(REF,B4,'Tableau Commandes'!$C$5:$C$26))","v":1},{"$f":"H4","v":0},{"$f":"IF(E4=\"P\",\"PREPAREE\",IF(E4=\"R\",\"RELIQUAT\",))","v":0},{"$f":"INDEX('Tableau Commandes'!$M$4:$M$150,MATCH($B4,'Tableau Commandes'!$E$4:$E$150,0))","v":""},null,{"$f":"IF(H4=\"P\",\"PREPAREE\",IF(H4=\"R\",\"RELIQUAT\",))","v":0}]
[null,"MECA997",{"$f":"IF(B5<>\"\",COUNTIF('Tableau Commandes'!E6:E151,Récapitulatifs!B5),\"\")","v":1},{"$f":"IF(B5=\"\",\"\",SUMIF(REF,B5,'Tableau Commandes'!$C$5:$C$26))","v":1},{"$f":"H5","v":0},{"$f":"IF(E5=\"P\",\"PREPAREE\",IF(E5=\"R\",\"RELIQUAT\",))","v":0},{"$f":"INDEX('Tableau Commandes'!$M$4:$M$150,MATCH($B5,'Tableau Commandes'!$E$4:$E$150,0))","v":""},null,{"$f":"IF(H5=\"P\",\"PREPAREE\",IF(H5=\"R\",\"RELIQUAT\",))","v":0}]
[null,"MECA985",{"$f":"IF(B6<>\"\",COUNTIF('Tableau Commandes'!E7:E152,Récapitulatifs!B6),\"\")","v":1},{"$f":"IF(B6=\"\",\"\",SUMIF(REF,B6,'Tableau Commandes'!$C$5:$C$26))","v":1},0,0,{"$f":"INDEX('Tableau Commandes'!$M$4:$M$150,MATCH($B6,'Tableau Commandes'!$E$4:$E$150,0))","v":""},null,0]
[null,"321050",{"$f":"IF(B7<>\"\",COUNTIF('Tableau Commandes'!E8:E153,Récapitulatifs!B7),\"\")","v":1},{"$f":"IF(B7=\"\",\"\",SUMIF(REF,B7,'Tableau Commandes'!$C$5:$C$26))","v":1},0,0,{"$f":"INDEX('Tableau Commandes'!$M$4:$M$150,MATCH($B7,'Tableau Commandes'!$E$4:$E$150,0))","v":""},null,0]
[null,"GLC41431",{"$f":"IF(B8<>\"\",COUNTIF('Tableau Commandes'!E9:E154,Récapitulatifs!B8),\"\")","v":1},{"$f":"IF(B8=\"\",\"\",SUMIF(REF,B8,'Tableau Commandes'!$C$5:$C$26))","v":1},0,0,{"$f":"INDEX('Tableau Commandes'!$M$4:$M$150,MATCH($B8,'Tableau Commandes'!$E$4:$E$150,0))","v":"DISPO CHEZ MOI"},null,0]
[null,"14135",{"$f":"IF(B9<>\"\",COUNTIF('Tableau Commandes'!E10:E155,Récapitulatifs!B9),\"\")","v":1},{"$f":"IF(B9=\"\",\"\",SUMIF(REF,B9,'Tableau Commandes'!$C$5:$C$26))","v":1},0,0,{"$f":"INDEX('Tableau Commandes'!$M$4:$M$150,MATCH($B9,'Tableau Commandes'!$E$4:$E$150,0))","v":""},null,0]
[null,"14134",{"$f":"IF(B10<>\"\",COUNTIF('Tableau Commandes'!E11:E156,Récapitulatifs!B10),\"\")","v":1},{"$f":"IF(B10=\"\",\"\",SUMIF(REF,B10,'Tableau Commandes'!$C$5:$C$26))","v":1},0,0,{"$f":"INDEX('Tableau Commandes'!$M$4:$M$150,MATCH($B10,'Tableau Commandes'!$E$4:$E$150,0))","v":""},null,0]
[null,"A14541",{"$f":"IF(B11<>\"\",COUNTIF('Tableau Commandes'!E12:E157,Récapitulatifs!B11),\"\")","v":1},{"$f":"IF(B11=\"\",\"\",SUMIF(REF,B11,'Tableau Commandes'!$C$5:$C$26))","v":1},0,0,{"$f":"INDEX('Tableau Commandes'!$M$4:$M$150,MATCH($B11,'Tableau Commandes'!$E$4:$E$150,0))","v":""},null,0]
[null,"26599",{"$f":"IF(B12<>\"\",COUNTIF('Tableau Commandes'!E13:E158,Récapitulatifs!B12),\"\")","v":1},{"$f":"IF(B12=\"\",\"\",SUMIF(REF,B12,'Tableau Commandes'!$C$5:$C$26))","v":1},0,0,{"$f":"INDEX('Tableau Commandes'!$M$4:$M$150,MATCH($B12,'Tableau Commandes'!$E$4:$E$150,0))","v":""},null,0]
[null,"4594",{"$f":"IF(B13<>\"\",COUNTIF('Tableau Commandes'!E14:E159,Récapitulatifs!B13),\"\")","v":1},{"$f":"IF(B13=\"\",\"\",SUMIF(REF,B13,'Tableau Commandes'!$C$5:$C$26))","v":1},0,0,{"$f":"INDEX('Tableau Commandes'!$M$4:$M$150,MATCH($B13,'Tableau Commandes'!$E$4:$E$150,0))","v":"DISPO CHEZ MOI"},null,0]
[null,"CDAL-54510z",{"$f":"IF(B14<>\"\",COUNTIF('Tableau Commandes'!E15:E160,Récapitulatifs!B14),\"\")","v":1},{"$f":"IF(B14=\"\",\"\",SUMIF(REF,B14,'Tableau Commandes'!$C$5:$C$26))","v":1},0,0,{"$f":"INDEX('Tableau Commandes'!$M$4:$M$150,MATCH($B14,'Tableau Commandes'!$E$4:$E$150,0))","v":"DISPO CHEZ MOI"},null,0]
[null,"14588",{"$f":"IF(B15<>\"\",COUNTIF('Tableau Commandes'!E16:E161,Récapitulatifs!B15),\"\")","v":1},{"$f":"IF(B15=\"\",\"\",SUMIF(REF,B15,'Tableau Commandes'!$C$5:$C$26))","v":1},0,0,{"$f":"INDEX('Tableau Commandes'!$M$4:$M$150,MATCH($B15,'Tableau Commandes'!$E$4:$E$150,0))","v":""},null,0]
[null,"RI71112",{"$f":"IF(B16<>\"\",COUNTIF('Tableau Commandes'!E17:E162,Récapitulatifs!B16),\"\")","v":1},{"$f":"IF(B16=\"\",\"\",SUMIF(REF,B16,'Tableau Commandes'!$C$5:$C$26))","v":1},0,0,{"$f":"INDEX('Tableau Commandes'!$M$4:$M$150,MATCH($B16,'Tableau Commandes'!$E$4:$E$150,0))","v":"DISPO CHEZ MOI"},null,0]
[null,"318204",{"$f":"IF(B17<>\"\",COUNTIF('Tableau Commandes'!E18:E163,Récapitulatifs!B17),\"\")","v":1},{"$f":"IF(B17=\"\",\"\",SUMIF(REF,B17,'Tableau Commandes'!$C$5:$C$26))","v":1},0,0,{"$f":"INDEX('Tableau Commandes'!$M$4:$M$150,MATCH($B17,'Tableau Commandes'!$E$4:$E$150,0))","v":""},null,0]
[null,"4725",{"$f":"IF(B18<>\"\",COUNTIF('Tableau Commandes'!E19:E164,Récapitulatifs!B18),\"\")","v":1},{"$f":"IF(B18=\"\",\"\",SUMIF(REF,B18,'Tableau Commandes'!$C$5:$C$26))","v":1},0,{"$f":"IF(E18=\"P\",\"PREPAREE\",IF(E18=\"R\",\"RELIQUAT\",))","v":0},{"$f":"INDEX('Tableau Commandes'!$M$4:$M$150,MATCH($B18,'Tableau Commandes'!$E$4:$E$150,0))","v":"DISPO CHEZ MOI"},null,0]
[null,"350240XDEUX",{"$f":"IF(B19<>\"\",COUNTIF('Tableau Commandes'!E20:E165,Récapitulatifs!B19),\"\")","v":1},{"$f":"IF(B19=\"\",\"\",SUMIF(REF,B19,'Tableau Commandes'!$C$5:$C$26))","v":1},0,0,{"$f":"INDEX('Tableau Commandes'!$M$4:$M$150,MATCH($B19,'Tableau Commandes'!$E$4:$E$150,0))","v":""},null,0]
[null,"106390",{"$f":"IF(B20<>\"\",COUNTIF('Tableau Commandes'!E21:E166,Récapitulatifs!B20),\"\")","v":1},{"$f":"IF(B20=\"\",\"\",SUMIF(REF,B20,'Tableau Commandes'!$C$5:$C$26))","v":1},0,0,{"$f":"INDEX('Tableau Commandes'!$M$4:$M$150,MATCH($B20,'Tableau Commandes'!$E$4:$E$150,0))","v":""},null,0]
[null,"GLC41429",{"$f":"IF(B21<>\"\",COUNTIF('Tableau Commandes'!E22:E167,Récapitulatifs!B21),\"\")","v":1},{"$f":"IF(B21=\"\",\"\",SUMIF(REF,B21,'Tableau Commandes'!$C$5:$C$26))","v":1},0,0,{"$f":"INDEX('Tableau Commandes'!$M$4:$M$150,MATCH($B21,'Tableau Commandes'!$E$4:$E$150,0))","v":""},null,0]
[null,"MECA4178",{"$f":"IF(B22<>\"\",COUNTIF('Tableau Commandes'!E23:E168,Récapitulatifs!B22),\"\")","v":1},{"$f":"IF(B22=\"\",\"\",SUMIF(REF,B22,'Tableau Commandes'!$C$5:$C$26))","v":2},0,0,{"$f":"INDEX('Tableau Commandes'!$M$4:$M$150,MATCH($B22,'Tableau Commandes'!$E$4:$E$150,0))","v":""},null,0]
[null,"MECA3836",{"$f":"IF(B23<>\"\",COUNTIF('Tableau Commandes'!E24:E169,Récapitulatifs!B23),\"\")","v":2},{"$f":"IF(B23=\"\",\"\",SUMIF(REF,B23,'Tableau Commandes'!$C$5:$C$26))","v":2},0,0,{"$f":"INDEX('Tableau Commandes'!$M$4:$M$150,MATCH($B23,'Tableau Commandes'!$E$4:$E$150,0))","v":""},null,0]
[null,"99907",{"$f":"IF(B24<>\"\",COUNTIF('Tableau Commandes'!E25:E170,Récapitulatifs!B24),\"\")","v":1},{"$f":"IF(B24=\"\",\"\",SUMIF(REF,B24,'Tableau Commandes'!$C$5:$C$26))","v":1},0,0,{"$f":"INDEX('Tableau Commandes'!$M$4:$M$150,MATCH($B24,'Tableau Commandes'!$E$4:$E$150,0))","v":""},null,0]
[null,"GLC40101",{"$f":"IF(B25<>\"\",COUNTIF('Tableau Commandes'!E26:E171,Récapitulatifs!B25),\"\")","v":1},{"$f":"IF(B25=\"\",\"\",SUMIF(REF,B25,'Tableau Commandes'!$C$5:$C$26))","v":1},0,0,{"$f":"INDEX('Tableau Commandes'!$M$4:$M$150,MATCH($B25,'Tableau Commandes'!$E$4:$E$150,0))","v":""},null,0]
[null,"813412X2",{"$f":"IF(B26<>\"\",COUNTIF('Tableau Commandes'!E27:E172,Récapitulatifs!B26),\"\")","v":1},{"$f":"IF(B26=\"\",\"\",SUMIF(REF,B26,'Tableau Commandes'!$C$5:$C$26))","v":1},0,0,{"$f":"INDEX('Tableau Commandes'!$M$4:$M$150,MATCH($B26,'Tableau Commandes'!$E$4:$E$150,0))","v":""},null,0]
[null,"CDAL29409k",{"$f":"IF(B27<>\"\",COUNTIF('Tableau Commandes'!E28:E173,Récapitulatifs!B27),\"\")","v":1},{"$f":"IF(B27=\"\",\"\",SUMIF(REF,B27,'Tableau Commandes'!$C$5:$C$26))","v":1},0,0,{"$f":"INDEX('Tableau Commandes'!$M$4:$M$150,MATCH($B27,'Tableau Commandes'!$E$4:$E$150,0))","v":""},null,0]
[null,"MECA4032",{"$f":"IF(B28<>\"\",COUNTIF('Tableau Commandes'!E29:E174,Récapitulatifs!B28),\"\")","v":1},{"$f":"IF(B28=\"\",\"\",SUMIF(REF,B28,'Tableau Commandes'!$C$5:$C$26))","v":2},0,0,{"$f":"INDEX('Tableau Commandes'!$M$4:$M$150,MATCH($B28,'Tableau Commandes'!$E$4:$E$150,0))","v":""},null,0]
[null,"SPILU409003",{"$f":"IF(B29<>\"\",COUNTIF('Tableau Commandes'!E30:E175,Récapitulatifs!B29),\"\")","v":1},{"$f":"IF(B29=\"\",\"\",SUMIF(REF,B29,'Tableau Commandes'!$C$5:$C$26))","v":1},0,0,{"$f":"INDEX('Tableau Commandes'!$M$4:$M$150,MATCH($B29,'Tableau Commandes'!$E$4:$E$150,0))","v":""},null,0]
[null,"351200",{"$f":"IF(B30<>\"\",COUNTIF('Tableau Commandes'!E31:E176,Récapitulatifs!B30),\"\")","v":1},{"$f":"IF(B30=\"\",\"\",SUMIF(REF,B30,'Tableau Commandes'!$C$5:$C$26))","v":1},0,0,{"$f":"INDEX('Tableau Commandes'!$M$4:$M$150,MATCH($B30,'Tableau Commandes'!$E$4:$E$150,0))","v":""},null,0]
[null,"GS11205",{"$f":"IF(B31<>\"\",COUNTIF('Tableau Commandes'!E32:E177,Récapitulatifs!B31),\"\")","v":1},{"$f":"IF(B31=\"\",\"\",SUMIF(REF,B31,'Tableau Commandes'!$C$5:$C$26))","v":1},0,0,{"$f":"INDEX('Tableau Commandes'!$M$4:$M$150,MATCH($B31,'Tableau Commandes'!$E$4:$E$150,0))","v":""},null,0]
[null,"A14119",{"$f":"IF(B32<>\"\",COUNTIF('Tableau Commandes'!E33:E178,Récapitulatifs!B32),\"\")","v":1},{"$f":"IF(B32=\"\",\"\",SUMIF(REF,B32,'Tableau Commandes'!$C$5:$C$26))","v":1},0,0,{"$f":"INDEX('Tableau Commandes'!$M$4:$M$150,MATCH($B32,'Tableau Commandes'!$E$4:$E$150,0))","v":""},null,0]
[null,"3652",{"$f":"IF(B33<>\"\",COUNTIF('Tableau Commandes'!E34:E179,Récapitulatifs!B33),\"\")","v":1},{"$f":"IF(B33=\"\",\"\",SUMIF(REF,B33,'Tableau Commandes'!$C$5:$C$26))","v":1},0,0,{"$f":"INDEX('Tableau Commandes'!$M$4:$M$150,MATCH($B33,'Tableau Commandes'!$E$4:$E$150,0))","v":""},null,0]
[null,"4740",{"$f":"IF(B34<>\"\",COUNTIF('Tableau Commandes'!E35:E180,Récapitulatifs!B34),\"\")","v":1},{"$f":"IF(B34=\"\",\"\",SUMIF(REF,B34,'Tableau Commandes'!$C$5:$C$26))","v":1},0,0,{"$f":"INDEX('Tableau Commandes'!$M$4:$M$150,MATCH($B34,'Tableau Commandes'!$E$4:$E$150,0))","v":"DISPO CHEZ MOI"},null,0]
[null,"106400",{"$f":"IF(B35<>\"\",COUNTIF('Tableau Commandes'!E36:E181,Récapitulatifs!B35),\"\")","v":1},{"$f":"IF(B35=\"\",\"\",SUMIF(REF,B35,'Tableau Commandes'!$C$5:$C$26))","v":1},0,0,{"$f":"INDEX('Tableau Commandes'!$M$4:$M$150,MATCH($B35,'Tableau Commandes'!$E$4:$E$150,0))","v":""},null,0]
[null,"9018",{"$f":"IF(B36<>\"\",COUNTIF('Tableau Commandes'!E37:E182,Récapitulatifs!B36),\"\")","v":1},{"$f":"IF(B36=\"\",\"\",SUMIF(REF,B36,'Tableau Commandes'!$C$5:$C$26))","v":1},0,0,{"$f":"INDEX('Tableau Commandes'!$M$4:$M$150,MATCH($B36,'Tableau Commandes'!$E$4:$E$150,0))","v":""},null,0]
[null,"24099XDEUX",{"$f":"IF(B37<>\"\",COUNTIF('Tableau Commandes'!E38:E183,Récapitulatifs!B37),\"\")","v":1},{"$f":"IF(B37=\"\",\"\",SUMIF(REF,B37,'Tableau Commandes'!$C$5:$C$26))","v":1},0,0,{"$f":"INDEX('Tableau Commandes'!$M$4:$M$150,MATCH($B37,'Tableau Commandes'!$E$4:$E$150,0))","v":""},null,0]
[null,"A027XDEUX",{"$f":"IF(B38<>\"\",COUNTIF('Tableau Commandes'!E39:E184,Récapitulatifs!B38),\"\")","v":1},{"$f":"IF(B38=\"\",\"\",SUMIF(REF,B38,'Tableau Commandes'!$C$5:$C$26))","v":1},0,0,{"$f":"INDEX('Tableau Commandes'!$M$4:$M$150,MATCH($B38,'Tableau Commandes'!$E$4:$E$150,0))","v":""},null,0]
[null,"99952",{"$f":"IF(B39<>\"\",COUNTIF('Tableau Commandes'!E40:E185,Récapitulatifs!B39),\"\")","v":1},{"$f":"IF(B39=\"\",\"\",SUMIF(REF,B39,'Tableau Commandes'!$C$5:$C$26))","v":1},0,0,{"$f":"INDEX('Tableau Commandes'!$M$4:$M$150,MATCH($B39,'Tableau Commandes'!$E$4:$E$150,0))","v":""},null,0]
[null,"561020",{"$f":"IF(B40<>\"\",COUNTIF('Tableau Commandes'!E41:E186,Récapitulatifs!B40),\"\")","v":1},{"$f":"IF(B40=\"\",\"\",SUMIF(REF,B40,'Tableau Commandes'!$C$5:$C$26))","v":1},0,0,{"$f":"INDEX('Tableau Commandes'!$M$4:$M$150,MATCH($B40,'Tableau Commandes'!$E$4:$E$150,0))","v":""},null,0]
[null,"599610",{"$f":"IF(B41<>\"\",COUNTIF('Tableau Commandes'!E42:E187,Récapitulatifs!B41),\"\")","v":1},{"$f":"IF(B41=\"\",\"\",SUMIF(REF,B41,'Tableau Commandes'!$C$5:$C$26))","v":1},0,0,{"$f":"INDEX('Tableau Commandes'!$M$4:$M$150,MATCH($B41,'Tableau Commandes'!$E$4:$E$150,0))","v":"DISPO CHEZ MOI"},null,0]
[null,"9501300",{"$f":"IF(B42<>\"\",COUNTIF('Tableau Commandes'!E43:E188,Récapitulatifs!B42),\"\")","v":1},{"$f":"IF(B42=\"\",\"\",SUMIF(REF,B42,'Tableau Commandes'!$C$5:$C$26))","v":1},0,0,{"$f":"INDEX('Tableau Commandes'!$M$4:$M$150,MATCH($B42,'Tableau Commandes'!$E$4:$E$150,0))","v":""},null,0]
[null,"123",{"$f":"IF(B43<>\"\",COUNTIF('Tableau Commandes'!E44:E189,Récapitulatifs!B43),\"\")","v":1},{"$f":"IF(B43=\"\",\"\",SUMIF(REF,B43,'Tableau Commandes'!$C$5:$C$26))","v":1},0,0,{"$f":"INDEX('Tableau Commandes'!$M$4:$M$150,MATCH($B43,'Tableau Commandes'!$E$4:$E$150,0))","v":""},null,0]
[null,null,{"$f":"IF(B44<>\"\",COUNTIF('Tableau Commandes'!E45:E190,Récapitulatifs!B44),\"\")","v":""},{"$f":"IF(B44=\"\",\"\",SUMIF(REF,B44,'Tableau Commandes'!$C$5:$C$26))","v":""},0,0,{"$f":"INDEX('Tableau Commandes'!$M$4:$M$150,MATCH($B44,'Tableau Commandes'!$E$4:$E$150,0))","v":""},null,0]
[null,null,{"$f":"IF(B45<>\"\",COUNTIF('Tableau Commandes'!E46:E191,Récapitulatifs!B45),\"\")","v":""},{"$f":"IF(B45=\"\",\"\",SUMIF(REF,B45,'Tableau Commandes'!$C$5:$C$26))","v":""},0,0,{"$f":"INDEX('Tableau Commandes'!$M$4:$M$150,MATCH($B45,'Tableau Commandes'!$E$4:$E$150,0))","v":""},null,0]
[null,null,{"$f":"IF(B46<>\"\",COUNTIF('Tableau Commandes'!E47:E192,Récapitulatifs!B46),\"\")","v":""},{"$f":"IF(B46=\"\",\"\",SUMIF(REF,B46,'Tableau Commandes'!$C$5:$C$26))","v":""},0,0,{"$f":"INDEX('Tableau Commandes'!$M$4:$M$150,MATCH($B46,'Tableau Commandes'!$E$4:$E$150,0))","v":""},null,0]
[null,null,{"$f":"IF(B47<>\"\",COUNTIF('Tableau Commandes'!E48:E193,Récapitulatifs!B47),\"\")","v":""},{"$f":"IF(B47=\"\",\"\",SUMIF(REF,B47,'Tableau Commandes'!$C$5:$C$26))","v":""},0,0,{"$f":"INDEX('Tableau Commandes'!$M$4:$M$150,MATCH($B47,'Tableau Commandes'!$E$4:$E$150,0))","v":""},null,0]
[null,null,{"$f":"IF(B48<>\"\",COUNTIF('Tableau Commandes'!E49:E194,Récapitulatifs!B48),\"\")","v":""},{"$f":"IF(B48=\"\",\"\",SUMIF(REF,B48,'Tableau Commandes'!$C$5:$C$26))","v":""},0,0,{"$f":"INDEX('Tableau Commandes'!$M$4:$M$150,MATCH($B48,'Tableau Commandes'!$E$4:$E$150,0))","v":""},null,0]
[null,null,{"$f":"IF(B49<>\"\",COUNTIF('Tableau Commandes'!E50:E195,Récapitulatifs!B49),\"\")","v":""},{"$f":"IF(B49=\"\",\"\",SUMIF(REF,B49,'Tableau Commandes'!$C$5:$C$26))","v":""},0,0,{"$f":"INDEX('Tableau Commandes'!$M$4:$M$150,MATCH($B49,'Tableau Commandes'!$E$4:$E$150,0))","v":""},null,0]
[null,null,{"$f":"IF(B50<>\"\",COUNTIF('Tableau Commandes'!E51:E196,Récapitulatifs!B50),\"\")","v":""},{"$f":"IF(B50=\"\",\"\",SUMIF(REF,B50,'Tableau Commandes'!$C$5:$C$26))","v":""},0,0,{"$f":"INDEX('Tableau Commandes'!$M$4:$M$150,MATCH($B50,'Tableau Commandes'!$E$4:$E$150,0))","v":""},null,0]
[null,null,{"$f":"IF(B51<>\"\",COUNTIF('Tableau Commandes'!E52:E197,Récapitulatifs!B51),\"\")","v":""},{"$f":"IF(B51=\"\",\"\",SUMIF(REF,B51,'Tableau Commandes'!$C$5:$C$26))","v":""},0,0,{"$f":"INDEX('Tableau Commandes'!$M$4:$M$150,MATCH($B51,'Tableau Commandes'!$E$4:$E$150,0))","v":""},null,0]
[null,null,{"$f":"IF(B52<>\"\",COUNTIF('Tableau Commandes'!E53:E198,Récapitulatifs!B52),\"\")","v":""},{"$f":"IF(B52=\"\",\"\",SUMIF(REF,B52,'Tableau Commandes'!$C$5:$C$26))","v":""},0,0,{"$f":"INDEX('Tableau Commandes'!$M$4:$M$150,MATCH($B52,'Tableau Commandes'!$E$4:$E$150,0))","v":""},null,0]
[null,null,{"$f":"IF(B53<>\"\",COUNTIF('Tableau Commandes'!E54:E199,Récapitulatifs!B53),\"\")","v":""},{"$f":"IF(B53=\"\",\"\",SUMIF(REF,B53,'Tableau Commandes'!$C$5:$C$26))","v":""},0,0,{"$f":"INDEX('Tableau Commandes'!$M$4:$M$150,MATCH($B53,'Tableau Commandes'!$E$4:$E$150,0))","v":""},null,0]
[null,null,{"$f":"IF(B54<>\"\",COUNTIF('Tableau Commandes'!E55:E200,Récapitulatifs!B54),\"\")","v":""},{"$f":"IF(B54=\"\",\"\",SUMIF(REF,B54,'Tableau Commandes'!$C$5:$C$26))","v":""},0,0,{"$f":"INDEX('Tableau Commandes'!$M$4:$M$150,MATCH($B54,'Tableau Commandes'!$E$4:$E$150,0))","v":""},null,0]
[null,null,{"$f":"IF(B55<>\"\",COUNTIF('Tableau Commandes'!E56:E201,Récapitulatifs!B55),\"\")","v":""},{"$f":"IF(B55=\"\",\"\",SUMIF(REF,B55,'Tableau Commandes'!$C$5:$C$26))","v":""},0,0,{"$f":"INDEX('Tableau Commandes'!$M$4:$M$150,MATCH($B55,'Tableau Commandes'!$E$4:$E$150,0))","v":""},null,0]
[null,null,{"$f":"IF(B56<>\"\",COUNTIF('Tableau Commandes'!E57:E202,Récapitulatifs!B56),\"\")","v":""},{"$f":"IF(B56=\"\",\"\",SUMIF(REF,B56,'Tableau Commandes'!$C$5:$C$26))","v":""},0,0,{"$f":"INDEX('Tableau Commandes'!$M$4:$M$150,MATCH($B56,'Tableau Commandes'!$E$4:$E$150,0))","v":""},null,0]
[null,null,{"$f":"IF(B57<>\"\",COUNTIF('Tableau Commandes'!E58:E203,Récapitulatifs!B57),\"\")","v":""},{"$f":"IF(B57=\"\",\"\",SUMIF(REF,B57,'Tableau Commandes'!$C$5:$C$26))","v":""},0,0,{"$f":"INDEX('Tableau Commandes'!$M$4:$M$150,MATCH($B57,'Tableau Commandes'!$E$4:$E$150,0))","v":""},null,0]
[null,null,{"$f":"IF(B58<>\"\",COUNTIF('Tableau Commandes'!E59:E204,Récapitulatifs!B58),\"\")","v":""},{"$f":"IF(B58=\"\",\"\",SUMIF(REF,B58,'Tableau Commandes'!$C$5:$C$26))","v":""},0,0,{"$f":"INDEX('Tableau Commandes'!$M$4:$M$150,MATCH($B58,'Tableau Commandes'!$E$4:$E$150,0))","v":""},null,0]
[null,null,{"$f":"IF(B59<>\"\",COUNTIF('Tableau Commandes'!E60:E205,Récapitulatifs!B59),\"\")","v":""},{"$f":"IF(B59=\"\",\"\",SUMIF(REF,B59,'Tableau Commandes'!$C$5:$C$26))","v":""},0,0,{"$f":"INDEX('Tableau Commandes'!$M$4:$M$150,MATCH($B59,'Tableau Commandes'!$E$4:$E$150,0))","v":""},null,0]
[null,null,{"$f":"IF(B60<>\"\",COUNTIF('Tableau Commandes'!E61:E206,Récapitulatifs!B60),\"\")","v":""},{"$f":"IF(B60=\"\",\"\",SUMIF(REF,B60,'Tableau Commandes'!$C$5:$C$26))","v":""},0,0,{"$f":"INDEX('Tableau Commandes'!$M$4:$M$150,MATCH($B60,'Tableau Commandes'!$E$4:$E$150,0))","v":""},null,0]
[null,null,{"$f":"IF(B61<>\"\",COUNTIF('Tableau Commandes'!E62:E207,Récapitulatifs!B61),\"\")","v":""},{"$f":"IF(B61=\"\",\"\",SUMIF(REF,B61,'Tableau Commandes'!$C$5:$C$26))","v":""},0,0,{"$f":"INDEX('Tableau Commandes'!$M$4:$M$150,MATCH($B61,'Tableau Commandes'!$E$4:$E$150,0))","v":""},null,0]
[null,null,{"$f":"IF(B62<>\"\",COUNTIF('Tableau Commandes'!E63:E208,Récapitulatifs!B62),\"\")","v":""},{"$f":"IF(B62=\"\",\"\",SUMIF(REF,B62,'Tableau Commandes'!$C$5:$C$26))","v":""},{"$f":"H62","v":0},{"$f":"IF(E62=\"P\",\"PREPAREE\",IF(E62=\"R\",\"RELIQUAT\",))","v":0},{"$f":"INDEX('Tableau Commandes'!$M$4:$M$150,MATCH($B62,'Tableau Commandes'!$E$4:$E$150,0))","v":""},null,{"$f":"IF(H62=\"P\",\"PREPAREE\",IF(H62=\"R\",\"RELIQUAT\",))","v":0}]
[null,null,{"$f":"IF(B63<>\"\",COUNTIF('Tableau Commandes'!E64:E209,Récapitulatifs!B63),\"\")","v":""},{"$f":"IF(B63=\"\",\"\",SUMIF(REF,B63,'Tableau Commandes'!$C$5:$C$26))","v":""},0,0,{"$f":"INDEX('Tableau Commandes'!$M$4:$M$150,MATCH($B63,'Tableau Commandes'!$E$4:$E$150,0))","v":""},null,0]
[null,null,{"$f":"IF(B64<>\"\",COUNTIF('Tableau Commandes'!E65:E210,Récapitulatifs!B64),\"\")","v":""},{"$f":"IF(B64=\"\",\"\",SUMIF(REF,B64,'Tableau Commandes'!$C$5:$C$26))","v":""},0,0,{"$f":"INDEX('Tableau Commandes'!$M$4:$M$150,MATCH($B64,'Tableau Commandes'!$E$4:$E$150,0))","v":""},null,0]
[null,null,{"$f":"IF(B65<>\"\",COUNTIF('Tableau Commandes'!E66:E211,Récapitulatifs!B65),\"\")","v":""},{"$f":"IF(B65=\"\",\"\",SUMIF(REF,B65,'Tableau Commandes'!$C$5:$C$26))","v":""},0,0,{"$f":"INDEX('Tableau Commandes'!$M$4:$M$150,MATCH($B65,'Tableau Commandes'!$E$4:$E$150,0))","v":""},null,0]
[null,null,{"$f":"IF(B66<>\"\",COUNTIF('Tableau Commandes'!E67:E212,Récapitulatifs!B66),\"\")","v":""},{"$f":"IF(B66=\"\",\"\",SUMIF(REF,B66,'Tableau Commandes'!$C$5:$C$26))","v":""},0,0,{"$f":"INDEX('Tableau Commandes'!$M$4:$M$150,MATCH($B66,'Tableau Commandes'!$E$4:$E$150,0))","v":""},null,0]
[null,null,{"$f":"IF(B67<>\"\",COUNTIF('Tableau Commandes'!E68:E213,Récapitulatifs!B67),\"\")","v":""},{"$f":"IF(B67=\"\",\"\",SUMIF(REF,B67,'Tableau Commandes'!$C$5:$C$26))","v":""},0,0,{"$f":"INDEX('Tableau Commandes'!$M$4:$M$150,MATCH($B67,'Tableau Commandes'!$E$4:$E$150,0))","v":""},null,0]
[null,null,{"$f":"IF(B68<>\"\",COUNTIF('Tableau Commandes'!E69:E214,Récapitulatifs!B68),\"\")","v":""},{"$f":"IF(B68=\"\",\"\",SUMIF(REF,B68,'Tableau Commandes'!$C$5:$C$26))","v":""},0,0,{"$f":"INDEX('Tableau Commandes'!$M$4:$M$150,MATCH($B68,'Tableau Commandes'!$E$4:$E$150,0))","v":""},null,0]
[null,null,{"$f":"IF(B69<>\"\",COUNTIF('Tableau Commandes'!E70:E215,Récapitulatifs!B69),\"\")","v":""},{"$f":"IF(B69=\"\",\"\",SUMIF(REF,B69,'Tableau Commandes'!$C$5:$C$26))","v":""},0,0,{"$f":"INDEX('Tableau Commandes'!$M$4:$M$150,MATCH($B69,'Tableau Commandes'!$E$4:$E$150,0))","v":""},null,0]
[null,null,{"$f":"IF(B70<>\"\",COUNTIF('Tableau Commandes'!E71:E216,Récapitulatifs!B70),\"\")","v":""},{"$f":"IF(B70=\"\",\"\",SUMIF(REF,B70,'Tableau Commandes'!$C$5:$C$26))","v":""},0,0,{"$f":"INDEX('Tableau Commandes'!$M$4:$M$150,MATCH($B70,'Tableau Commandes'!$E$4:$E$150,0))","v":""},null,0]
[null,null,{"$f":"IF(B71<>\"\",COUNTIF('Tableau Commandes'!E72:E217,Récapitulatifs!B71),\"\")","v":""},{"$f":"IF(B71=\"\",\"\",SUMIF(REF,B71,'Tableau Commandes'!$C$5:$C$26))","v":""},0,0,{"$f":"INDEX('Tableau Commandes'!$M$4:$M$150,MATCH($B71,'Tableau Commandes'!$E$4:$E$150,0))","v":""},null,0]
[null,null,{"$f":"IF(B72<>\"\",COUNTIF('Tableau Commandes'!E73:E218,Récapitulatifs!B72),\"\")","v":""},{"$f":"IF(B72=\"\",\"\",SUMIF(REF,B72,'Tableau Commandes'!$C$5:$C$26))","v":""},0,0,{"$f":"INDEX('Tableau Commandes'!$M$4:$M$150,MATCH($B72,'Tableau Commandes'!$E$4:$E$150,0))","v":""},null,0]
[null,null,{"$f":"IF(B73<>\"\",COUNTIF('Tableau Commandes'!E74:E219,Récapitulatifs!B73),\"\")","v":""},{"$f":"IF(B73=\"\",\"\",SUMIF(REF,B73,'Tableau Commandes'!$C$5:$C$26))","v":""},0,0,{"$f":"INDEX('Tableau Commandes'!$M$4:$M$150,MATCH($B73,'Tableau Commandes'!$E$4:$E$150,0))","v":""},null,0]
[null,null,{"$f":"IF(B74<>\"\",COUNTIF('Tableau Commandes'!E75:E220,Récapitulatifs!B74),\"\")","v":""},{"$f":"IF(B74=\"\",\"\",SUMIF(REF,B74,'Tableau Commandes'!$C$5:$C$26))","v":""},0,0,{"$f":"INDEX('Tableau Commandes'!$M$4:$M$150,MATCH($B74,'Tableau Commandes'!$E$4:$E$150,0))","v":""},null,0]
[null,null,{"$f":"IF(B75<>\"\",COUNTIF('Tableau Commandes'!E76:E221,Récapitulatifs!B75),\"\")","v":""},{"$f":"IF(B75=\"\",\"\",SUMIF(REF,B75,'Tableau Commandes'!$C$5:$C$26))","v":""},0,0,{"$f":"INDEX('Tableau Commandes'!$M$4:$M$150,MATCH($B75,'Tableau Commandes'!$E$4:$E$150,0))","v":""},null,0]
[null,null,{"$f":"IF(B76<>\"\",COUNTIF('Tableau Commandes'!E77:E222,Récapitulatifs!B76),\"\")","v":""},{"$f":"IF(B76=\"\",\"\",SUMIF(REF,B76,'Tableau Commandes'!$C$5:$C$26))","v":""},0,0,{"$f":"INDEX('Tableau Commandes'!$M$4:$M$150,MATCH($B76,'Tableau Commandes'!$E$4:$E$150,0))","v":""},null,0]
[null,null,{"$f":"IF(B77<>\"\",COUNTIF('Tableau Commandes'!E78:E223,Récapitulatifs!B77),\"\")","v":""},{"$f":"IF(B77=\"\",\"\",SUMIF(REF,B77,'Tableau Commandes'!$C$5:$C$26))","v":""},0,0,{"$f":"INDEX('Tableau Commandes'!$M$4:$M$150,MATCH($B77,'Tableau Commandes'!$E$4:$E$150,0))","v":""},null,0]
[null,null,{"$f":"IF(B78<>\"\",COUNTIF('Tableau Commandes'!E79:E224,Récapitulatifs!B78),\"\")","v":""},{"$f":"IF(B78=\"\",\"\",SUMIF(REF,B78,'Tableau Commandes'!$C$5:$C$26))","v":""},0,0,{"$f":"INDEX('Tableau Commandes'!$M$4:$M$150,MATCH($B78,'Tableau Commandes'!$E$4:$E$150,0))","v":""},null,0]
[null,null,{"$f":"IF(B79<>\"\",COUNTIF('Tableau Commandes'!E80:E225,Récapitulatifs!B79),\"\")","v":""},{"$f":"IF(B79=\"\",\"\",SUMIF(REF,B79,'Tableau Commandes'!$C$5:$C$26))","v":""},0,0,{"$f":"INDEX('Tableau Commandes'!$M$4:$M$150,MATCH($B79,'Tableau Commandes'!$E$4:$E$150,0))","v":""},null,0]
[null,null,{"$f":"IF(B80<>\"\",COUNTIF('Tableau Commandes'!E81:E226,Récapitulatifs!B80),\"\")","v":""},{"$f":"IF(B80=\"\",\"\",SUMIF(REF,B80,'Tableau Commandes'!$C$5:$C$26))","v":""},0,0,{"$f":"INDEX('Tableau Commandes'!$M$4:$M$150,MATCH($B80,'Tableau Commandes'!$E$4:$E$150,0))","v":""},null,0]
[null,null,{"$f":"IF(B81<>\"\",COUNTIF('Tableau Commandes'!E82:E227,Récapitulatifs!B81),\"\")","v":""},{"$f":"IF(B81=\"\",\"\",SUMIF(REF,B81,'Tableau Commandes'!$C$5:$C$26))","v":""},0,0,{"$f":"INDEX('Tableau Commandes'!$M$4:$M$150,MATCH($B81,'Tableau Commandes'!$E$4:$E$150,0))","v":""},null,0]
[null,null,{"$f":"IF(B82<>\"\",COUNTIF('Tableau Commandes'!E83:E228,Récapitulatifs!B82),\"\")","v":""},{"$f":"IF(B82=\"\",\"\",SUMIF(REF,B82,'Tableau Commandes'!$C$5:$C$26))","v":""},0,0,{"$f":"INDEX('Tableau Commandes'!$M$4:$M$150,MATCH($B82,'Tableau Commandes'!$E$4:$E$150,0))","v":""},null,0]
[null,null,{"$f":"IF(B83<>\"\",COUNTIF('Tableau Commandes'!E84:E229,Récapitulatifs!B83),\"\")","v":""},{"$f":"IF(B83=\"\",\"\",SUMIF(REF,B83,'Tableau Commandes'!$C$5:$C$26))","v":""},0,0,{"$f":"INDEX('Tableau Commandes'!$M$4:$M$150,MATCH($B83,'Tableau Commandes'!$E$4:$E$150,0))","v":""},null,0]
[null,null,{"$f":"IF(B84<>\"\",COUNTIF('Tableau Commandes'!E85:E230,Récapitulatifs!B84),\"\")","v":""},{"$f":"IF(B84=\"\",\"\",SUMIF(REF,B84,'Tableau Commandes'!$C$5:$C$26))","v":""},0,0,{"$f":"INDEX('Tableau Commandes'!$M$4:$M$150,MATCH($B84,'Tableau Commandes'!$E$4:$E$150,0))","v":""},null,0]
[null,null,{"$f":"IF(B85<>\"\",COUNTIF('Tableau Commandes'!E86:E231,Récapitulatifs!B85),\"\")","v":""},{"$f":"IF(B85=\"\",\"\",SUMIF(REF,B85,'Tableau Commandes'!$C$5:$C$26))","v":""},0,0,{"$f":"INDEX('Tableau Commandes'!$M$4:$M$150,MATCH($B85,'Tableau Commandes'!$E$4:$E$150,0))","v":""},null,0]
[null,null,{"$f":"IF(B86<>\"\",COUNTIF('Tableau Commandes'!E87:E232,Récapitulatifs!B86),\"\")","v":""},{"$f":"IF(B86=\"\",\"\",SUMIF(REF,B86,'Tableau Commandes'!$C$5:$C$26))","v":""},0,0,{"$f":"INDEX('Tableau Commandes'!$M$4:$M$150,MATCH($B86,'Tableau Commandes'!$E$4:$E$150,0))","v":""},null,0]
[null,null,{"$f":"IF(B87<>\"\",COUNTIF('Tableau Commandes'!E88:E233,Récapitulatifs!B87),\"\")","v":""},{"$f":"IF(B87=\"\",\"\",SUMIF(REF,B87,'Tableau Commandes'!$C$5:$C$26))","v":""},0,0,{"$f":"INDEX('Tableau Commandes'!$M$4:$M$150,MATCH($B87,'Tableau Commandes'!$E$4:$E$150,0))","v":""},null,0]
[null,null,{"$f":"IF(B88<>\"\",COUNTIF('Tableau Commandes'!E89:E234,Récapitulatifs!B88),\"\")","v":""},{"$f":"IF(B88=\"\",\"\",SUMIF(REF,B88,'Tableau Commandes'!$C$5:$C$26))","v":""},0,0,{"$f":"INDEX('Tableau Commandes'!$M$4:$M$150,MATCH($B88,'Tableau Commandes'!$E$4:$E$150,0))","v":""},null,0]
[null,null,{"$f":"IF(B89<>\"\",COUNTIF('Tableau Commandes'!E90:E235,Récapitulatifs!B89),\"\")","v":""},{"$f":"IF(B89=\"\",\"\",SUMIF(REF,B89,'Tableau Commandes'!$C$5:$C$26))","v":""},0,0,{"$f":"INDEX('Tableau Commandes'!$M$4:$M$150,MATCH($B89,'Tableau Commandes'!$E$4:$E$150,0))","v":""},null,0]
[null,null,{"$f":"IF(B90<>\"\",COUNTIF('Tableau Commandes'!E91:E236,Récapitulatifs!B90),\"\")","v":""},{"$f":"IF(B90=\"\",\"\",SUMIF(REF,B90,'Tableau Commandes'!$C$5:$C$26))","v":""},0,0,{"$f":"INDEX('Tableau Commandes'!$M$4:$M$150,MATCH($B90,'Tableau Commandes'!$E$4:$E$150,0))","v":""},null,0]
[null,null,{"$f":"IF(B91<>\"\",COUNTIF('Tableau Commandes'!E92:E237,Récapitulatifs!B91),\"\")","v":""},{"$f":"IF(B91=\"\",\"\",SUMIF(REF,B91,'Tableau Commandes'!$C$5:$C$26))","v":""},0,0,{"$f":"INDEX('Tableau Commandes'!$M$4:$M$150,MATCH($B91,'Tableau Commandes'!$E$4:$E$150,0))","v":""},null,0]
[null,null,{"$f":"IF(B92<>\"\",COUNTIF('Tableau Commandes'!E93:E238,Récapitulatifs!B92),\"\")","v":""},{"$f":"IF(B92=\"\",\"\",SUMIF(REF,B92,'Tableau Commandes'!$C$5:$C$26))","v":""},0,0,{"$f":"INDEX('Tableau Commandes'!$M$4:$M$150,MATCH($B92,'Tableau Commandes'!$E$4:$E$150,0))","v":""},null,0]
[null,null,{"$f":"IF(B93<>\"\",COUNTIF('Tableau Commandes'!E94:E239,Récapitulatifs!B93),\"\")","v":""},{"$f":"IF(B93=\"\",\"\",SUMIF(REF,B93,'Tableau Commandes'!$C$5:$C$26))","v":""},0,0,{"$f":"INDEX('Tableau Commandes'!$M$4:$M$150,MATCH($B93,'Tableau Commandes'!$E$4:$E$150,0))","v":""},null,0]
[null,null,{"$f":"IF(B94<>\"\",COUNTIF('Tableau Commandes'!E95:E240,Récapitulatifs!B94),\"\")","v":""},{"$f":"IF(B94=\"\",\"\",SUMIF(REF,B94,'Tableau Commandes'!$C$5:$C$26))","v":""},0,0,{"$f":"INDEX('Tableau Commandes'!$M$4:$M$150,MATCH($B94,'Tableau Commandes'!$E$4:$E$150,0))","v":""},null,0]
[null,null,{"$f":"IF(B95<>\"\",COUNTIF('Tableau Commandes'!E96:E241,Récapitulatifs!B95),\"\")","v":""},{"$f":"IF(B95=\"\",\"\",SUMIF(REF,B95,'Tableau Commandes'!$C$5:$C$26))","v":""},0,0,{"$f":"INDEX('Tableau Commandes'!$M$4:$M$150,MATCH($B95,'Tableau Commandes'!$E$4:$E$150,0))","v":""},null,0]
[null,null,{"$f":"IF(B96<>\"\",COUNTIF('Tableau Commandes'!E97:E242,Récapitulatifs!B96),\"\")","v":""},{"$f":"IF(B96=\"\",\"\",SUMIF(REF,B96,'Tableau Commandes'!$C$5:$C$26))","v":""},0,0,{"$f":"INDEX('Tableau Commandes'!$M$4:$M$150,MATCH($B96,'Tableau Commandes'!$E$4:$E$150,0))","v":""},null,0]
[null,null,{"$f":"IF(B97<>\"\",COUNTIF('Tableau Commandes'!E98:E243,Récapitulatifs!B97),\"\")","v":""},{"$f":"IF(B97=\"\",\"\",SUMIF(REF,B97,'Tableau Commandes'!$C$5:$C$26))","v":""},0,0,{"$f":"INDEX('Tableau Commandes'!$M$4:$M$150,MATCH($B97,'Tableau Commandes'!$E$4:$E$150,0))","v":""},null,0]
[null,null,{"$f":"IF(B98<>\"\",COUNTIF('Tableau Commandes'!E99:E244,Récapitulatifs!B98),\"\")","v":""},{"$f":"IF(B98=\"\",\"\",SUMIF(REF,B98,'Tableau Commandes'!$C$5:$C$26))","v":""},0,0,{"$f":"INDEX('Tableau Commandes'!$M$4:$M$150,MATCH($B98,'Tableau Commandes'!$E$4:$E$150,0))","v":""},null,0]
[null,null,{"$f":"IF(B99<>\"\",COUNTIF('Tableau Commandes'!E100:E245,Récapitulatifs!B99),\"\")","v":""},{"$f":"IF(B99=\"\",\"\",SUMIF(REF,B99,'Tableau Commandes'!$C$5:$C$26))","v":""},0,0,{"$f":"INDEX('Tableau Commandes'!$M$4:$M$150,MATCH($B99,'Tableau Commandes'!$E$4:$E$150,0))","v":""},null,0]
[null,null,{"$f":"IF(B100<>\"\",COUNTIF('Tableau Commandes'!E101:E246,Récapitulatifs!B100),\"\")","v":""},{"$f":"IF(B100=\"\",\"\",SUMIF(REF,B100,'Tableau Commandes'!$C$5:$C$26))","v":""},0,0,{"$f":"INDEX('Tableau Commandes'!$M$4:$M$150,MATCH($B100,'Tableau Commandes'!$E$4:$E$150,0))","v":""},null,0]
[null,null,{"$f":"IF(B101<>\"\",COUNTIF('Tableau Commandes'!E102:E247,Récapitulatifs!B101),\"\")","v":""},{"$f":"IF(B101=\"\",\"\",SUMIF(REF,B101,'Tableau Commandes'!$C$5:$C$26))","v":""},{"$f":"H101","v":0},{"$f":"IF(E101=\"P\",\"PREPAREE\",IF(E101=\"R\",\"RELIQUAT\",))","v":0},{"$f":"INDEX('Tableau Commandes'!$M$4:$M$150,MATCH($B101,'Tableau Commandes'!$E$4:$E$150,0))","v":""},null,{"$f":"IF(H101=\"P\",\"PREPAREE\",IF(H101=\"R\",\"RELIQUAT\",))","v":0}]
[null,null,{"$f":"IF(B102<>\"\",COUNTIF('Tableau Commandes'!E103:E248,Récapitulatifs!B102),\"\")","v":""},{"$f":"IF(B102=\"\",\"\",SUMIF(REF,B102,'Tableau Commandes'!$C$5:$C$26))","v":""},0,0,{"$f":"INDEX('Tableau Commandes'!$M$4:$M$150,MATCH($B102,'Tableau Commandes'!$E$4:$E$150,0))","v":""},null,0]
[null,null,{"$f":"IF(B103<>\"\",COUNTIF('Tableau Commandes'!E104:E249,Récapitulatifs!B103),\"\")","v":""},{"$f":"IF(B103=\"\",\"\",SUMIF(REF,B103,'Tableau Commandes'!$C$5:$C$26))","v":""},0,0,{"$f":"INDEX('Tableau Commandes'!$M$4:$M$150,MATCH($B103,'Tableau Commandes'!$E$4:$E$150,0))","v":""},null,0]
[null,null,{"$f":"IF(B104<>\"\",COUNTIF('Tableau Commandes'!E105:E250,Récapitulatifs!B104),\"\")","v":""},{"$f":"IF(B104=\"\",\"\",SUMIF(REF,B104,'Tableau Commandes'!$C$5:$C$26))","v":""},0,0,{"$f":"INDEX('Tableau Commandes'!$M$4:$M$150,MATCH($B104,'Tableau Commandes'!$E$4:$E$150,0))","v":""},null,0]
[null,null,{"$f":"IF(B105<>\"\",COUNTIF('Tableau Commandes'!E106:E251,Récapitulatifs!B105),\"\")","v":""},{"$f":"IF(B105=\"\",\"\",SUMIF(REF,B105,'Tableau Commandes'!$C$5:$C$26))","v":""},0,0,{"$f":"INDEX('Tableau Commandes'!$M$4:$M$150,MATCH($B105,'Tableau Commandes'!$E$4:$E$150,0))","v":""},null,0]
[null,null,{"$f":"IF(B106<>\"\",COUNTIF('Tableau Commandes'!E107:E252,Récapitulatifs!B106),\"\")","v":""},{"$f":"IF(B106=\"\",\"\",SUMIF(REF,B106,'Tableau Commandes'!$C$5:$C$26))","v":""},0,0,{"$f":"INDEX('Tableau Commandes'!$M$4:$M$150,MATCH($B106,'Tableau Commandes'!$E$4:$E$150,0))","v":""},null,0]
[null,null,{"$f":"IF(B107<>\"\",COUNTIF('Tableau Commandes'!E108:E253,Récapitulatifs!B107),\"\")","v":""},{"$f":"IF(B107=\"\",\"\",SUMIF(REF,B107,'Tableau Commandes'!$C$5:$C$26))","v":""},0,0,{"$f":"INDEX('Tableau Commandes'!$M$4:$M$150,MATCH($B107,'Tableau Commandes'!$E$4:$E$150,0))","v":""},null,0]
[null,null,{"$f":"IF(B108<>\"\",COUNTIF('Tableau Commandes'!E109:E254,Récapitulatifs!B108),\"\")","v":""},{"$f":"IF(B108=\"\",\"\",SUMIF(REF,B108,'Tableau Commandes'!$C$5:$C$26))","v":""},0,0,{"$f":"INDEX('Tableau Commandes'!$M$4:$M$150,MATCH($B108,'Tableau Commandes'!$E$4:$E$150,0))","v":""},null,0]
[null,null,{"$f":"IF(B109<>\"\",COUNTIF('Tableau Commandes'!E110:E255,Récapitulatifs!B109),\"\")","v":""},{"$f":"IF(B109=\"\",\"\",SUMIF(REF,B109,'Tableau Commandes'!$C$5:$C$26))","v":""},0,0,{"$f":"INDEX('Tableau Commandes'!$M$4:$M$150,MATCH($B109,'Tableau Commandes'!$E$4:$E$150,0))","v":""},null,0]
[null,null,{"$f":"IF(B110<>\"\",COUNTIF('Tableau Commandes'!E111:E256,Récapitulatifs!B110),\"\")","v":""},{"$f":"IF(B110=\"\",\"\",SUMIF(REF,B110,'Tableau Commandes'!$C$5:$C$26))","v":""},0,0,{"$f":"INDEX('Tableau Commandes'!$M$4:$M$150,MATCH($B110,'Tableau Commandes'!$E$4:$E$150,0))","v":""},null,0]
[null,null,{"$f":"IF(B111<>\"\",COUNTIF('Tableau Commandes'!E112:E257,Récapitulatifs!B111),\"\")","v":""},{"$f":"IF(B111=\"\",\"\",SUMIF(REF,B111,'Tableau Commandes'!$C$5:$C$26))","v":""},0,0,{"$f":"INDEX('Tableau Commandes'!$M$4:$M$150,MATCH($B111,'Tableau Commandes'!$E$4:$E$150,0))","v":""},null,0]
[null,null,{"$f":"IF(B112<>\"\",COUNTIF('Tableau Commandes'!E113:E258,Récapitulatifs!B112),\"\")","v":""},{"$f":"IF(B112=\"\",\"\",SUMIF(REF,B112,'Tableau Commandes'!$C$5:$C$26))","v":""},0,0,{"$f":"INDEX('Tableau Commandes'!$M$4:$M$150,MATCH($B112,'Tableau Commandes'!$E$4:$E$150,0))","v":""},null,0]
[null,null,{"$f":"IF(B113<>\"\",COUNTIF('Tableau Commandes'!E114:E259,Récapitulatifs!B113),\"\")","v":""},{"$f":"IF(B113=\"\",\"\",SUMIF(REF,B113,'Tableau Commandes'!$C$5:$C$26))","v":""},0,0,{"$f":"INDEX('Tableau Commandes'!$M$4:$M$150,MATCH($B113,'Tableau Commandes'!$E$4:$E$150,0))","v":""},null,0]
[null,null,{"$f":"IF(B114<>\"\",COUNTIF('Tableau Commandes'!E115:E260,Récapitulatifs!B114),\"\")","v":""},{"$f":"IF(B114=\"\",\"\",SUMIF(REF,B114,'Tableau Commandes'!$C$5:$C$26))","v":""},0,0,{"$f":"INDEX('Tableau Commandes'!$M$4:$M$150,MATCH($B114,'Tableau Commandes'!$E$4:$E$150,0))","v":""},null,0]
[null,null,{"$f":"IF(B115<>\"\",COUNTIF('Tableau Commandes'!E116:E261,Récapitulatifs!B115),\"\")","v":""},{"$f":"IF(B115=\"\",\"\",SUMIF(REF,B115,'Tableau Commandes'!$C$5:$C$26))","v":""},0,0,{"$f":"INDEX('Tableau Commandes'!$M$4:$M$150,MATCH($B115,'Tableau Commandes'!$E$4:$E$150,0))","v":""},null,0]
[null,null,{"$f":"IF(B116<>\"\",COUNTIF('Tableau Commandes'!E117:E262,Récapitulatifs!B116),\"\")","v":""},{"$f":"IF(B116=\"\",\"\",SUMIF(REF,B116,'Tableau Commandes'!$C$5:$C$26))","v":""},0,0,{"$f":"INDEX('Tableau Commandes'!$M$4:$M$150,MATCH($B116,'Tableau Commandes'!$E$4:$E$150,0))","v":""},null,0]
[null,null,{"$f":"IF(B117<>\"\",COUNTIF('Tableau Commandes'!E118:E263,Récapitulatifs!B117),\"\")","v":""},{"$f":"IF(B117=\"\",\"\",SUMIF(REF,B117,'Tableau Commandes'!$C$5:$C$26))","v":""},0,0,{"$f":"INDEX('Tableau Commandes'!$M$4:$M$150,MATCH($B117,'Tableau Commandes'!$E$4:$E$150,0))","v":""},null,0]
[null,null,{"$f":"IF(B118<>\"\",COUNTIF('Tableau Commandes'!E119:E264,Récapitulatifs!B118),\"\")","v":""},{"$f":"IF(B118=\"\",\"\",SUMIF(REF,B118,'Tableau Commandes'!$C$5:$C$26))","v":""},0,0,{"$f":"INDEX('Tableau Commandes'!$M$4:$M$150,MATCH($B118,'Tableau Commandes'!$E$4:$E$150,0))","v":""},null,0]
[null,null,{"$f":"IF(B119<>\"\",COUNTIF('Tableau Commandes'!E120:E265,Récapitulatifs!B119),\"\")","v":""},{"$f":"IF(B119=\"\",\"\",SUMIF(REF,B119,'Tableau Commandes'!$C$5:$C$26))","v":""},0,0,{"$f":"INDEX('Tableau Commandes'!$M$4:$M$150,MATCH($B119,'Tableau Commandes'!$E$4:$E$150,0))","v":""},null,0]
[null,null,{"$f":"IF(B120<>\"\",COUNTIF('Tableau Commandes'!E121:E266,Récapitulatifs!B120),\"\")","v":""},{"$f":"IF(B120=\"\",\"\",SUMIF(REF,B120,'Tableau Commandes'!$C$5:$C$26))","v":""},0,0,{"$f":"INDEX('Tableau Commandes'!$M$4:$M$150,MATCH($B120,'Tableau Commandes'!$E$4:$E$150,0))","v":""},null,0]
[null,null,{"$f":"IF(B121<>\"\",COUNTIF('Tableau Commandes'!E122:E267,Récapitulatifs!B121),\"\")","v":""},{"$f":"IF(B121=\"\",\"\",SUMIF(REF,B121,'Tableau Commandes'!$C$5:$C$26))","v":""},0,0,{"$f":"INDEX('Tableau Commandes'!$M$4:$M$150,MATCH($B121,'Tableau Commandes'!$E$4:$E$150,0))","v":""},null,0]
[null,null,{"$f":"IF(B122<>\"\",COUNTIF('Tableau Commandes'!E123:E268,Récapitulatifs!B122),\"\")","v":""},{"$f":"IF(B122=\"\",\"\",SUMIF(REF,B122,'Tableau Commandes'!$C$5:$C$26))","v":""},0,0,{"$f":"INDEX('Tableau Commandes'!$M$4:$M$150,MATCH($B122,'Tableau Commandes'!$E$4:$E$150,0))","v":""},null,0]
[null,null,{"$f":"IF(B123<>\"\",COUNTIF('Tableau Commandes'!E124:E269,Récapitulatifs!B123),\"\")","v":""},{"$f":"IF(B123=\"\",\"\",SUMIF(REF,B123,'Tableau Commandes'!$C$5:$C$26))","v":""},0,0,{"$f":"INDEX('Tableau Commandes'!$M$4:$M$150,MATCH($B123,'Tableau Commandes'!$E$4:$E$150,0))","v":""},null,0]
[null,null,{"$f":"IF(B124<>\"\",COUNTIF('Tableau Commandes'!E125:E270,Récapitulatifs!B124),\"\")","v":""},{"$f":"IF(B124=\"\",\"\",SUMIF(REF,B124,'Tableau Commandes'!$C$5:$C$26))","v":""},0,0,{"$f":"INDEX('Tableau Commandes'!$M$4:$M$150,MATCH($B124,'Tableau Commandes'!$E$4:$E$150,0))","v":""},null,0]
[null,null,{"$f":"IF(B125<>\"\",COUNTIF('Tableau Commandes'!E126:E271,Récapitulatifs!B125),\"\")","v":""},{"$f":"IF(B125=\"\",\"\",SUMIF(REF,B125,'Tableau Commandes'!$C$5:$C$26))","v":""},0,0,{"$f":"INDEX('Tableau Commandes'!$M$4:$M$150,MATCH($B125,'Tableau Commandes'!$E$4:$E$150,0))","v":""},null,0]
[null,null,{"$f":"IF(B126<>\"\",COUNTIF('Tableau Commandes'!E127:E272,Récapitulatifs!B126),\"\")","v":""},{"$f":"IF(B126=\"\",\"\",SUMIF(REF,B126,'Tableau Commandes'!$C$5:$C$26))","v":""},0,0,{"$f":"INDEX('Tableau Commandes'!$M$4:$M$150,MATCH($B126,'Tableau Commandes'!$E$4:$E$150,0))","v":""},null,0]
[null,null,{"$f":"IF(B127<>\"\",COUNTIF('Tableau Commandes'!E128:E273,Récapitulatifs!B127),\"\")","v":""},{"$f":"IF(B127=\"\",\"\",SUMIF(REF,B127,'Tableau Commandes'!$C$5:$C$26))","v":""},0,0,{"$f":"INDEX('Tableau Commandes'!$M$4:$M$150,MATCH($B127,'Tableau Commandes'!$E$4:$E$150,0))","v":""},null,0]
[null,null,{"$f":"IF(B128<>\"\",COUNTIF('Tableau Commandes'!E129:E274,Récapitulatifs!B128),\"\")","v":""},{"$f":"IF(B128=\"\",\"\",SUMIF(REF,B128,'Tableau Commandes'!$C$5:$C$26))","v":""},0,0,{"$f":"INDEX('Tableau Commandes'!$M$4:$M$150,MATCH($B128,'Tableau Commandes'!$E$4:$E$150,0))","v":""},null,0]
[null,null,{"$f":"IF(B129<>\"\",COUNTIF('Tableau Commandes'!E130:E275,Récapitulatifs!B129),\"\")","v":""},{"$f":"IF(B129=\"\",\"\",SUMIF(REF,B129,'Tableau Commandes'!$C$5:$C$26))","v":""},0,0,{"$f":"INDEX('Tableau Commandes'!$M$4:$M$150,MATCH($B129,'Tableau Commandes'!$E$4:$E$150,0))","v":""},null,0]
[null,null,{"$f":"IF(B130<>\"\",COUNTIF('Tableau Commandes'!E131:E276,Récapitulatifs!B130),\"\")","v":""},{"$f":"IF(B130=\"\",\"\",SUMIF(REF,B130,'Tableau Commandes'!$C$5:$C$26))","v":""},0,0,{"$f":"INDEX('Tableau Commandes'!$M$4:$M$150,MATCH($B130,'Tableau Commandes'!$E$4:$E$150,0))","v":""},null,0]
[null,null,{"$f":"IF(B131<>\"\",COUNTIF('Tableau Commandes'!E132:E277,Récapitulatifs!B131),\"\")","v":""},{"$f":"IF(B131=\"\",\"\",SUMIF(REF,B131,'Tableau Commandes'!$C$5:$C$26))","v":""},0,0,{"$f":"INDEX('Tableau Commandes'!$M$4:$M$150,MATCH($B131,'Tableau Commandes'!$E$4:$E$150,0))","v":""},null,0]
[null,null,{"$f":"IF(B132<>\"\",COUNTIF('Tableau Commandes'!E133:E278,Récapitulatifs!B132),\"\")","v":""},{"$f":"IF(B132=\"\",\"\",SUMIF(REF,B132,'Tableau Commandes'!$C$5:$C$26))","v":""},0,0,{"$f":"INDEX('Tableau Commandes'!$M$4:$M$150,MATCH($B132,'Tableau Commandes'!$E$4:$E$150,0))","v":""},null,0]
[null,null,{"$f":"IF(B133<>\"\",COUNTIF('Tableau Commandes'!E134:E279,Récapitulatifs!B133),\"\")","v":""},{"$f":"IF(B133=\"\",\"\",SUMIF(REF,B133,'Tableau Commandes'!$C$5:$C$26))","v":""},0,0,{"$f":"INDEX('Tableau Commandes'!$M$4:$M$150,MATCH($B133,'Tableau Commandes'!$E$4:$E$150,0))","v":""},null,0]
[null,null,{"$f":"IF(B134<>\"\",COUNTIF('Tableau Commandes'!E135:E280,Récapitulatifs!B134),\"\")","v":""},{"$f":"IF(B134=\"\",\"\",SUMIF(REF,B134,'Tableau Commandes'!$C$5:$C$26))","v":""},0,0,{"$f":"INDEX('Tableau Commandes'!$M$4:$M$150,MATCH($B134,'Tableau Commandes'!$E$4:$E$150,0))","v":""},null,0]
[null,null,{"$f":"IF(B135<>\"\",COUNTIF('Tableau Commandes'!E136:E281,Récapitulatifs!B135),\"\")","v":""},{"$f":"IF(B135=\"\",\"\",SUMIF(REF,B135,'Tableau Commandes'!$C$5:$C$26))","v":""},0,0,{"$f":"INDEX('Tableau Commandes'!$M$4:$M$150,MATCH($B135,'Tableau Commandes'!$E$4:$E$150,0))","v":""},null,0]
[null,null,{"$f":"IF(B136<>\"\",COUNTIF('Tableau Commandes'!E137:E282,Récapitulatifs!B136),\"\")","v":""},{"$f":"IF(B136=\"\",\"\",SUMIF(REF,B136,'Tableau Commandes'!$C$5:$C$26))","v":""},0,0,{"$f":"INDEX('Tableau Commandes'!$M$4:$M$150,MATCH($B136,'Tableau Commandes'!$E$4:$E$150,0))","v":""},null,0]
[null,null,{"$f":"IF(B137<>\"\",COUNTIF('Tableau Commandes'!E138:E283,Récapitulatifs!B137),\"\")","v":""},{"$f":"IF(B137=\"\",\"\",SUMIF(REF,B137,'Tableau Commandes'!$C$5:$C$26))","v":""},0,0,{"$f":"INDEX('Tableau Commandes'!$M$4:$M$150,MATCH($B137,'Tableau Commandes'!$E$4:$E$150,0))","v":""},null,0]
[null,null,{"$f":"IF(B138<>\"\",COUNTIF('Tableau Commandes'!E139:E284,Récapitulatifs!B138),\"\")","v":""},{"$f":"IF(B138=\"\",\"\",SUMIF(REF,B138,'Tableau Commandes'!$C$5:$C$26))","v":""},0,0,{"$f":"INDEX('Tableau Commandes'!$M$4:$M$150,MATCH($B138,'Tableau Commandes'!$E$4:$E$150,0))","v":""},null,0]
[null,null,{"$f":"IF(B139<>\"\",COUNTIF('Tableau Commandes'!E140:E285,Récapitulatifs!B139),\"\")","v":""},{"$f":"IF(B139=\"\",\"\",SUMIF(REF,B139,'Tableau Commandes'!$C$5:$C$26))","v":""},0,0,{"$f":"INDEX('Tableau Commandes'!$M$4:$M$150,MATCH($B139,'Tableau Commandes'!$E$4:$E$150,0))","v":""},null,0]
[null,null,{"$f":"IF(B140<>\"\",COUNTIF('Tableau Commandes'!E141:E286,Récapitulatifs!B140),\"\")","v":""},{"$f":"IF(B140=\"\",\"\",SUMIF(REF,B140,'Tableau Commandes'!$C$5:$C$26))","v":""},0,0,{"$f":"INDEX('Tableau Commandes'!$M$4:$M$150,MATCH($B140,'Tableau Commandes'!$E$4:$E$150,0))","v":""},null,0]
[null,null,{"$f":"IF(B141<>\"\",COUNTIF('Tableau Commandes'!E142:E287,Récapitulatifs!B141),\"\")","v":""},{"$f":"IF(B141=\"\",\"\",SUMIF(REF,B141,'Tableau Commandes'!$C$5:$C$26))","v":""},0,0,{"$f":"INDEX('Tableau Commandes'!$M$4:$M$150,MATCH($B141,'Tableau Commandes'!$E$4:$E$150,0))","v":""},null,0]
[null,null,{"$f":"IF(B142<>\"\",COUNTIF('Tableau Commandes'!E143:E288,Récapitulatifs!B142),\"\")","v":""},{"$f":"IF(B142=\"\",\"\",SUMIF(REF,B142,'Tableau Commandes'!$C$5:$C$26))","v":""},0,0,{"$f":"INDEX('Tableau Commandes'!$M$4:$M$150,MATCH($B142,'Tableau Commandes'!$E$4:$E$150,0))","v":""},null,0]
[null,null,{"$f":"IF(B143<>\"\",COUNTIF('Tableau Commandes'!E144:E289,Récapitulatifs!B143),\"\")","v":""},{"$f":"IF(B143=\"\",\"\",SUMIF(REF,B143,'Tableau Commandes'!$C$5:$C$26))","v":""},0,0,{"$f":"INDEX('Tableau Commandes'!$M$4:$M$150,MATCH($B143,'Tableau Commandes'!$E$4:$E$150,0))","v":""},null,0]
[null,null,{"$f":"IF(B144<>\"\",COUNTIF('Tableau Commandes'!E145:E290,Récapitulatifs!B144),\"\")","v":""},{"$f":"IF(B144=\"\",\"\",SUMIF(REF,B144,'Tableau Commandes'!$C$5:$C$26))","v":""},0,0,{"$f":"INDEX('Tableau Commandes'!$M$4:$M$150,MATCH($B144,'Tableau Commandes'!$E$4:$E$150,0))","v":""},null,0]
[null,null,{"$f":"IF(B145<>\"\",COUNTIF('Tableau Commandes'!E146:E291,Récapitulatifs!B145),\"\")","v":""},{"$f":"IF(B145=\"\",\"\",SUMIF(REF,B145,'Tableau Commandes'!$C$5:$C$26))","v":""},0,0,{"$f":"INDEX('Tableau Commandes'!$M$4:$M$150,MATCH($B145,'Tableau Commandes'!$E$4:$E$150,0))","v":""},null,0]
[null,null,{"$f":"IF(B146<>\"\",COUNTIF('Tableau Commandes'!E147:E292,Récapitulatifs!B146),\"\")","v":""},{"$f":"IF(B146=\"\",\"\",SUMIF(REF,B146,'Tableau Commandes'!$C$5:$C$26))","v":""},0,0,{"$f":"INDEX('Tableau Commandes'!$M$4:$M$150,MATCH($B146,'Tableau Commandes'!$E$4:$E$150,0))","v":""},null,0]
[null,null,{"$f":"IF(B147<>\"\",COUNTIF('Tableau Commandes'!E148:E293,Récapitulatifs!B147),\"\")","v":""},{"$f":"IF(B147=\"\",\"\",SUMIF(REF,B147,'Tableau Commandes'!$C$5:$C$26))","v":""},0,0,{"$f":"INDEX('Tableau Commandes'!$M$4:$M$150,MATCH($B147,'Tableau Commandes'!$E$4:$E$150,0))","v":""},null,0]
[null,null,{"$f":"IF(B148<>\"\",COUNTIF('Tableau Commandes'!E149:E294,Récapitulatifs!B148),\"\")","v":""},{"$f":"IF(B148=\"\",\"\",SUMIF(REF,B148,'Tableau Commandes'!$C$5:$C$26))","v":""},0,0,{"$f":"INDEX('Tableau Commandes'!$M$4:$M$150,MATCH($B148,'Tableau Commandes'!$E$4:$E$150,0))","v":""},null,0]
[null,null,{"$f":"IF(B149<>\"\",COUNTIF('Tableau Commandes'!E150:E295,Récapitulatifs!B149),\"\")","v":""},{"$f":"IF(B149=\"\",\"\",SUMIF(REF,B149,'Tableau Commandes'!$C$5:$C$26))","v":""},0,0,{"$f":"INDEX('Tableau Commandes'!$M$4:$M$150,MATCH($B149,'Tableau Commandes'!$E$4:$E$150,0))","v":""},null,0]
[null,null,{"$f":"IF(B150<>\"\",COUNTIF('Tableau Commandes'!E151:E296,Récapitulatifs!B150),\"\")","v":""},{"$f":"IF(B150=\"\",\"\",SUMIF(REF,B150,'Tableau Commandes'!$C$5:$C$26))","v":""},0,0,{"$f":"INDEX('Tableau Commandes'!$M$4:$M$150,MATCH($B150,'Tableau Commandes'!$E$4:$E$150,0))","v":""},null,0]
[null,null,{"$f":"IF(B151<>\"\",COUNTIF('Tableau Commandes'!E152:E297,Récapitulatifs!B151),\"\")","v":""},{"$f":"IF(B151=\"\",\"\",SUMIF(REF,B151,'Tableau Commandes'!$C$5:$C$26))","v":""},0,0,{"$f":"INDEX('Tableau Commandes'!$M$4:$M$150,MATCH($B151,'Tableau Commandes'!$E$4:$E$150,0))","v":""},null,0]
[null,null,{"$f":"IF(B152<>\"\",COUNTIF('Tableau Commandes'!E153:E298,Récapitulatifs!B152),\"\")","v":""},{"$f":"IF(B152=\"\",\"\",SUMIF(REF,B152,'Tableau Commandes'!$C$5:$C$26))","v":""},0,0,{"$f":"INDEX('Tableau Commandes'!$M$4:$M$150,MATCH($B152,'Tableau Commandes'!$E$4:$E$150,0))","v":""},null,0]
[null,null,{"$f":"IF(B153<>\"\",COUNTIF('Tableau Commandes'!E154:E299,Récapitulatifs!B153),\"\")","v":""},{"$f":"IF(B153=\"\",\"\",SUMIF(REF,B153,'Tableau Commandes'!$C$5:$C$26))","v":""},0,0,{"$f":"INDEX('Tableau Commandes'!$M$4:$M$150,MATCH($B153,'Tableau Commandes'!$E$4:$E$150,0))","v":""},null,0]
[null,null,{"$f":"IF(B154<>\"\",COUNTIF('Tableau Commandes'!E155:E300,Récapitulatifs!B154),\"\")","v":""},{"$f":"IF(B154=\"\",\"\",SUMIF(REF,B154,'Tableau Commandes'!$C$5:$C$26))","v":""},0,0,{"$f":"INDEX('Tableau Commandes'!$M$4:$M$150,MATCH($B154,'Tableau Commandes'!$E$4:$E$150,0))","v":""},null,0]
[null,null,{"$f":"IF(B155<>\"\",COUNTIF('Tableau Commandes'!E156:E301,Récapitulatifs!B155),\"\")","v":""},{"$f":"IF(B155=\"\",\"\",SUMIF(REF,B155,'Tableau Commandes'!$C$5:$C$26))","v":""},0,0,{"$f":"INDEX('Tableau Commandes'!$M$4:$M$150,MATCH($B155,'Tableau Commandes'!$E$4:$E$150,0))","v":""},null,0]
[null,null,{"$f":"IF(B156<>\"\",COUNTIF('Tableau Commandes'!E157:E302,Récapitulatifs!B156),\"\")","v":""},{"$f":"IF(B156=\"\",\"\",SUMIF(REF,B156,'Tableau Commandes'!$C$5:$C$26))","v":""},0,0,{"$f":"INDEX('Tableau Commandes'!$M$4:$M$150,MATCH($B156,'Tableau Commandes'!$E$4:$E$150,0))","v":""},null,0]
[null,null,{"$f":"IF(B157<>\"\",COUNTIF('Tableau Commandes'!E158:E303,Récapitulatifs!B157),\"\")","v":""},{"$f":"IF(B157=\"\",\"\",SUMIF(REF,B157,'Tableau Commandes'!$C$5:$C$26))","v":""},0,0,{"$f":"INDEX('Tableau Commandes'!$M$4:$M$150,MATCH($B157,'Tableau Commandes'!$E$4:$E$150,0))","v":""},null,0]
[null,null,{"$f":"IF(B158<>\"\",COUNTIF('Tableau Commandes'!E159:E304,Récapitulatifs!B158),\"\")","v":""},{"$f":"IF(B158=\"\",\"\",SUMIF(REF,B158,'Tableau Commandes'!$C$5:$C$26))","v":""},0,0,{"$f":"INDEX('Tableau Commandes'!$M$4:$M$150,MATCH($B158,'Tableau Commandes'!$E$4:$E$150,0))","v":""},null,0]
[null,null,{"$f":"IF(B159<>\"\",COUNTIF('Tableau Commandes'!E160:E305,Récapitulatifs!B159),\"\")","v":""},{"$f":"IF(B159=\"\",\"\",SUMIF(REF,B159,'Tableau Commandes'!$C$5:$C$26))","v":""},0,0,{"$f":"INDEX('Tableau Commandes'!$M$4:$M$150,MATCH($B159,'Tableau Commandes'!$E$4:$E$150,0))","v":""},null,0]
[null,null,{"$f":"IF(B160<>\"\",COUNTIF('Tableau Commandes'!E161:E306,Récapitulatifs!B160),\"\")","v":""},{"$f":"IF(B160=\"\",\"\",SUMIF(REF,B160,'Tableau Commandes'!$C$5:$C$26))","v":""},0,0,{"$f":"INDEX('Tableau Commandes'!$M$4:$M$150,MATCH($B160,'Tableau Commandes'!$E$4:$E$150,0))","v":""},null,0]
[null,null,{"$f":"IF(B161<>\"\",COUNTIF('Tableau Commandes'!E162:E307,Récapitulatifs!B161),\"\")","v":""},{"$f":"IF(B161=\"\",\"\",SUMIF(REF,B161,'Tableau Commandes'!$C$5:$C$26))","v":""},0,0,{"$f":"INDEX('Tableau Commandes'!$M$4:$M$150,MATCH($B161,'Tableau Commandes'!$E$4:$E$150,0))","v":""},null,0]
[null,null,{"$f":"IF(B162<>\"\",COUNTIF('Tableau Commandes'!E163:E308,Récapitulatifs!B162),\"\")","v":""},{"$f":"IF(B162=\"\",\"\",SUMIF(REF,B162,'Tableau Commandes'!$C$5:$C$26))","v":""},0,0,{"$f":"INDEX('Tableau Commandes'!$M$4:$M$150,MATCH($B162,'Tableau Commandes'!$E$4:$E$150,0))","v":""},null,0]
[null,null,{"$f":"IF(B163<>\"\",COUNTIF('Tableau Commandes'!E164:E309,Récapitulatifs!B163),\"\")","v":""},{"$f":"IF(B163=\"\",\"\",SUMIF(REF,B163,'Tableau Commandes'!$C$5:$C$26))","v":""},0,0,{"$f":"INDEX('Tableau Commandes'!$M$4:$M$150,MATCH($B163,'Tableau Commandes'!$E$4:$E$150,0))","v":""},null,0]
[null,null,{"$f":"IF(B164<>\"\",COUNTIF('Tableau Commandes'!E165:E310,Récapitulatifs!B164),\"\")","v":""},{"$f":"IF(B164=\"\",\"\",SUMIF(REF,B164,'Tableau Commandes'!$C$5:$C$26))","v":""},0,0,{"$f":"INDEX('Tableau Commandes'!$M$4:$M$150,MATCH($B164,'Tableau Commandes'!$E$4:$E$150,0))","v":""},null,0]
[null,null,{"$f":"IF(B165<>\"\",COUNTIF('Tableau Commandes'!E166:E311,Récapitulatifs!B165),\"\")","v":""},{"$f":"IF(B165=\"\",\"\",SUMIF(REF,B165,'Tableau Commandes'!$C$5:$C$26))","v":""},{"$f":"H165","v":0},{"$f":"IF(E165=\"P\",\"PREPAREE\",IF(E165=\"R\",\"RELIQUAT\",))","v":0},{"$f":"INDEX('Tableau Commandes'!$M$4:$M$150,MATCH($B165,'Tableau Commandes'!$E$4:$E$150,0))","v":""},null,{"$f":"IF(H165=\"P\",\"PREPAREE\",IF(H165=\"R\",\"RELIQUAT\",))","v":0}]
[null,null,{"$f":"IF(B166<>\"\",COUNTIF('Tableau Commandes'!E167:E312,Récapitulatifs!B166),\"\")","v":""},{"$f":"IF(B166=\"\",\"\",SUMIF(REF,B166,'Tableau Commandes'!$C$5:$C$26))","v":""},0,0,{"$f":"INDEX('Tableau Commandes'!$M$4:$M$150,MATCH($B166,'Tableau Commandes'!$E$4:$E$150,0))","v":""},null,0]
[null,null,{"$f":"IF(B167<>\"\",COUNTIF('Tableau Commandes'!E168:E313,Récapitulatifs!B167),\"\")","v":""},{"$f":"IF(B167=\"\",\"\",SUMIF(REF,B167,'Tableau Commandes'!$C$5:$C$26))","v":""},0,0,{"$f":"INDEX('Tableau Commandes'!$M$4:$M$150,MATCH($B167,'Tableau Commandes'!$E$4:$E$150,0))","v":""},null,0]
[null,null,{"$f":"IF(B168<>\"\",COUNTIF('Tableau Commandes'!E169:E314,Récapitulatifs!B168),\"\")","v":""},{"$f":"IF(B168=\"\",\"\",SUMIF(REF,B168,'Tableau Commandes'!$C$5:$C$26))","v":""},0,0,{"$f":"INDEX('Tableau Commandes'!$M$4:$M$150,MATCH($B168,'Tableau Commandes'!$E$4:$E$150,0))","v":""},null,0]
[null,null,{"$f":"IF(B169<>\"\",COUNTIF('Tableau Commandes'!E170:E315,Récapitulatifs!B169),\"\")","v":""},{"$f":"IF(B169=\"\",\"\",SUMIF(REF,B169,'Tableau Commandes'!$C$5:$C$26))","v":""},0,0,{"$f":"INDEX('Tableau Commandes'!$M$4:$M$150,MATCH($B169,'Tableau Commandes'!$E$4:$E$150,0))","v":""},null,0]
[null,null,{"$f":"IF(B170<>\"\",COUNTIF('Tableau Commandes'!E171:E316,Récapitulatifs!B170),\"\")","v":""},{"$f":"IF(B170=\"\",\"\",SUMIF(REF,B170,'Tableau Commandes'!$C$5:$C$26))","v":""},0,0,{"$f":"INDEX('Tableau Commandes'!$M$4:$M$150,MATCH($B170,'Tableau Commandes'!$E$4:$E$150,0))","v":""},null,0]
[null,null,{"$f":"IF(B171<>\"\",COUNTIF('Tableau Commandes'!E172:E317,Récapitulatifs!B171),\"\")","v":""},{"$f":"IF(B171=\"\",\"\",SUMIF(REF,B171,'Tableau Commandes'!$C$5:$C$26))","v":""},0,0,{"$f":"INDEX('Tableau Commandes'!$M$4:$M$150,MATCH($B171,'Tableau Commandes'!$E$4:$E$150,0))","v":""},null,0]
[null,null,{"$f":"IF(B172<>\"\",COUNTIF('Tableau Commandes'!E173:E318,Récapitulatifs!B172),\"\")","v":""},{"$f":"IF(B172=\"\",\"\",SUMIF(REF,B172,'Tableau Commandes'!$C$5:$C$26))","v":""},0,0,{"$f":"INDEX('Tableau Commandes'!$M$4:$M$150,MATCH($B172,'Tableau Commandes'!$E$4:$E$150,0))","v":""},null,0]
[null,null,{"$f":"IF(B173<>\"\",COUNTIF('Tableau Commandes'!E174:E319,Récapitulatifs!B173),\"\")","v":""},{"$f":"IF(B173=\"\",\"\",SUMIF(REF,B173,'Tableau Commandes'!$C$5:$C$26))","v":""},0,0,{"$f":"INDEX('Tableau Commandes'!$M$4:$M$150,MATCH($B173,'Tableau Commandes'!$E$4:$E$150,0))","v":""},null,0]
[null,null,{"$f":"IF(B174<>\"\",COUNTIF('Tableau Commandes'!E175:E320,Récapitulatifs!B174),\"\")","v":""},{"$f":"IF(B174=\"\",\"\",SUMIF(REF,B174,'Tableau Commandes'!$C$5:$C$26))","v":""},0,0,{"$f":"INDEX('Tableau Commandes'!$M$4:$M$150,MATCH($B174,'Tableau Commandes'!$E$4:$E$150,0))","v":""},null,0]
[null,null,{"$f":"IF(B175<>\"\",COUNTIF('Tableau Commandes'!E176:E321,Récapitulatifs!B175),\"\")","v":""},{"$f":"IF(B175=\"\",\"\",SUMIF(REF,B175,'Tableau Commandes'!$C$5:$C$26))","v":""},0,0,{"$f":"INDEX('Tableau Commandes'!$M$4:$M$150,MATCH($B175,'Tableau Commandes'!$E$4:$E$150,0))","v":""},null,0]
[null,null,{"$f":"IF(B176<>\"\",COUNTIF('Tableau Commandes'!E177:E322,Récapitulatifs!B176),\"\")","v":""},{"$f":"IF(B176=\"\",\"\",SUMIF(REF,B176,'Tableau Commandes'!$C$5:$C$26))","v":""},0,0,{"$f":"INDEX('Tableau Commandes'!$M$4:$M$150,MATCH($B176,'Tableau Commandes'!$E$4:$E$150,0))","v":""},null,0]
[null,null,{"$f":"IF(B177<>\"\",COUNTIF('Tableau Commandes'!E178:E323,Récapitulatifs!B177),\"\")","v":""},{"$f":"IF(B177=\"\",\"\",SUMIF(REF,B177,'Tableau Commandes'!$C$5:$C$26))","v":""},0,0,{"$f":"INDEX('Tableau Commandes'!$M$4:$M$150,MATCH($B177,'Tableau Commandes'!$E$4:$E$150,0))","v":""},null,0]
[null,null,{"$f":"IF(B178<>\"\",COUNTIF('Tableau Commandes'!E179:E324,Récapitulatifs!B178),\"\")","v":""},{"$f":"IF(B178=\"\",\"\",SUMIF(REF,B178,'Tableau Commandes'!$C$5:$C$26))","v":""},0,0,{"$f":"INDEX('Tableau Commandes'!$M$4:$M$150,MATCH($B178,'Tableau Commandes'!$E$4:$E$150,0))","v":""},null,0]
[null,null,{"$f":"IF(B179<>\"\",COUNTIF('Tableau Commandes'!E180:E325,Récapitulatifs!B179),\"\")","v":""},{"$f":"IF(B179=\"\",\"\",SUMIF(REF,B179,'Tableau Commandes'!$C$5:$C$26))","v":""},0,0,{"$f":"INDEX('Tableau Commandes'!$M$4:$M$150,MATCH($B179,'Tableau Commandes'!$E$4:$E$150,0))","v":""},null,0]
[null,null,{"$f":"IF(B180<>\"\",COUNTIF('Tableau Commandes'!E181:E326,Récapitulatifs!B180),\"\")","v":""},{"$f":"IF(B180=\"\",\"\",SUMIF(REF,B180,'Tableau Commandes'!$C$5:$C$26))","v":""},0,0,{"$f":"INDEX('Tableau Commandes'!$M$4:$M$150,MATCH($B180,'Tableau Commandes'!$E$4:$E$150,0))","v":""},null,0]
[null,null,{"$f":"IF(B181<>\"\",COUNTIF('Tableau Commandes'!E182:E327,Récapitulatifs!B181),\"\")","v":""},{"$f":"IF(B181=\"\",\"\",SUMIF(REF,B181,'Tableau Commandes'!$C$5:$C$26))","v":""},0,0,{"$f":"INDEX('Tableau Commandes'!$M$4:$M$150,MATCH($B181,'Tableau Commandes'!$E$4:$E$150,0))","v":""},null,0]
[null,null,{"$f":"IF(B182<>\"\",COUNTIF('Tableau Commandes'!E183:E328,Récapitulatifs!B182),\"\")","v":""},{"$f":"IF(B182=\"\",\"\",SUMIF(REF,B182,'Tableau Commandes'!$C$5:$C$26))","v":""},0,0,{"$f":"INDEX('Tableau Commandes'!$M$4:$M$150,MATCH($B182,'Tableau Commandes'!$E$4:$E$150,0))","v":""},null,0]
[null,null,{"$f":"IF(B183<>\"\",COUNTIF('Tableau Commandes'!E184:E329,Récapitulatifs!B183),\"\")","v":""},{"$f":"IF(B183=\"\",\"\",SUMIF(REF,B183,'Tableau Commandes'!$C$5:$C$26))","v":""},0,0,{"$f":"INDEX('Tableau Commandes'!$M$4:$M$150,MATCH($B183,'Tableau Commandes'!$E$4:$E$150,0))","v":""},null,0]
[null,null,{"$f":"IF(B184<>\"\",COUNTIF('Tableau Commandes'!E185:E330,Récapitulatifs!B184),\"\")","v":""},{"$f":"IF(B184=\"\",\"\",SUMIF(REF,B184,'Tableau Commandes'!$C$5:$C$26))","v":""},0,0,{"$f":"INDEX('Tableau Commandes'!$M$4:$M$150,MATCH($B184,'Tableau Commandes'!$E$4:$E$150,0))","v":""},null,0]
[null,null,{"$f":"IF(B185<>\"\",COUNTIF('Tableau Commandes'!E186:E331,Récapitulatifs!B185),\"\")","v":""},{"$f":"IF(B185=\"\",\"\",SUMIF(REF,B185,'Tableau Commandes'!$C$5:$C$26))","v":""},0,0,{"$f":"INDEX('Tableau Commandes'!$M$4:$M$150,MATCH($B185,'Tableau Commandes'!$E$4:$E$150,0))","v":""},null,0]
[null,null,{"$f":"IF(B186<>\"\",COUNTIF('Tableau Commandes'!E187:E332,Récapitulatifs!B186),\"\")","v":""},{"$f":"IF(B186=\"\",\"\",SUMIF(REF,B186,'Tableau Commandes'!$C$5:$C$26))","v":""},0,0,{"$f":"INDEX('Tableau Commandes'!$M$4:$M$150,MATCH($B186,'Tableau Commandes'!$E$4:$E$150,0))","v":""},null,0]
[null,null,{"$f":"IF(B187<>\"\",COUNTIF('Tableau Commandes'!E188:E333,Récapitulatifs!B187),\"\")","v":""},{"$f":"IF(B187=\"\",\"\",SUMIF(REF,B187,'Tableau Commandes'!$C$5:$C$26))","v":""},0,0,{"$f":"INDEX('Tableau Commandes'!$M$4:$M$150,MATCH($B187,'Tableau Commandes'!$E$4:$E$150,0))","v":""},null,0]
[null,null,{"$f":"IF(B188<>\"\",COUNTIF('Tableau Commandes'!E189:E334,Récapitulatifs!B188),\"\")","v":""},{"$f":"IF(B188=\"\",\"\",SUMIF(REF,B188,'Tableau Commandes'!$C$5:$C$26))","v":""},0,0,{"$f":"INDEX('Tableau Commandes'!$M$4:$M$150,MATCH($B188,'Tableau Commandes'!$E$4:$E$150,0))","v":""},null,0]
[null,null,{"$f":"IF(B189<>\"\",COUNTIF('Tableau Commandes'!E190:E335,Récapitulatifs!B189),\"\")","v":""},{"$f":"IF(B189=\"\",\"\",SUMIF(REF,B189,'Tableau Commandes'!$C$5:$C$26))","v":""},0,0,{"$f":"INDEX('Tableau Commandes'!$M$4:$M$150,MATCH($B189,'Tableau Commandes'!$E$4:$E$150,0))","v":""},null,0]
[null,null,{"$f":"IF(B190<>\"\",COUNTIF('Tableau Commandes'!E191:E336,Récapitulatifs!B190),\"\")","v":""},{"$f":"IF(B190=\"\",\"\",SUMIF(REF,B190,'Tableau Commandes'!$C$5:$C$26))","v":""},0,0,{"$f":"INDEX('Tableau Commandes'!$M$4:$M$150,MATCH($B190,'Tableau Commandes'!$E$4:$E$150,0))","v":""},null,0]
[null,null,{"$f":"IF(B191<>\"\",COUNTIF('Tableau Commandes'!E192:E337,Récapitulatifs!B191),\"\")","v":""},{"$f":"IF(B191=\"\",\"\",SUMIF(REF,B191,'Tableau Commandes'!$C$5:$C$26))","v":""},0,0,{"$f":"INDEX('Tableau Commandes'!$M$4:$M$150,MATCH($B191,'Tableau Commandes'!$E$4:$E$150,0))","v":""},null,0]
[null,null,{"$f":"IF(B192<>\"\",COUNTIF('Tableau Commandes'!E193:E338,Récapitulatifs!B192),\"\")","v":""},{"$f":"IF(B192=\"\",\"\",SUMIF(REF,B192,'Tableau Commandes'!$C$5:$C$26))","v":""},0,0,{"$f":"INDEX('Tableau Commandes'!$M$4:$M$150,MATCH($B192,'Tableau Commandes'!$E$4:$E$150,0))","v":""},null,0]
[null,null,{"$f":"IF(B193<>\"\",COUNTIF('Tableau Commandes'!E194:E339,Récapitulatifs!B193),\"\")","v":""},{"$f":"IF(B193=\"\",\"\",SUMIF(REF,B193,'Tableau Commandes'!$C$5:$C$26))","v":""},0,0,{"$f":"INDEX('Tableau Commandes'!$M$4:$M$150,MATCH($B193,'Tableau Commandes'!$E$4:$E$150,0))","v":""},null,0]
[null,null,{"$f":"IF(B194<>\"\",COUNTIF('Tableau Commandes'!E195:E340,Récapitulatifs!B194),\"\")","v":""},{"$f":"IF(B194=\"\",\"\",SUMIF(REF,B194,'Tableau Commandes'!$C$5:$C$26))","v":""},0,0,{"$f":"INDEX('Tableau Commandes'!$M$4:$M$150,MATCH($B194,'Tableau Commandes'!$E$4:$E$150,0))","v":""},null,0]
[null,null,{"$f":"IF(B195<>\"\",COUNTIF('Tableau Commandes'!E196:E341,Récapitulatifs!B195),\"\")","v":""},{"$f":"IF(B195=\"\",\"\",SUMIF(REF,B195,'Tableau Commandes'!$C$5:$C$26))","v":""},0,0,{"$f":"INDEX('Tableau Commandes'!$M$4:$M$150,MATCH($B195,'Tableau Commandes'!$E$4:$E$150,0))","v":""},null,0]
[null,null,{"$f":"IF(B196<>\"\",COUNTIF('Tableau Commandes'!E197:E342,Récapitulatifs!B196),\"\")","v":""},{"$f":"IF(B196=\"\",\"\",SUMIF(REF,B196,'Tableau Commandes'!$C$5:$C$26))","v":""},0,0,{"$f":"INDEX('Tableau Commandes'!$M$4:$M$150,MATCH($B196,'Tableau Commandes'!$E$4:$E$150,0))","v":""},null,0]
[null,null,{"$f":"IF(B197<>\"\",COUNTIF('Tableau Commandes'!E198:E343,Récapitulatifs!B197),\"\")","v":""},{"$f":"IF(B197=\"\",\"\",SUMIF(REF,B197,'Tableau Commandes'!$C$5:$C$26))","v":""},0,0,{"$f":"INDEX('Tableau Commandes'!$M$4:$M$150,MATCH($B197,'Tableau Commandes'!$E$4:$E$150,0))","v":""},null,0]
[null,null,{"$f":"IF(B198<>\"\",COUNTIF('Tableau Commandes'!E199:E344,Récapitulatifs!B198),\"\")","v":""},{"$f":"IF(B198=\"\",\"\",SUMIF(REF,B198,'Tableau Commandes'!$C$5:$C$26))","v":""},0,0,{"$f":"INDEX('Tableau Commandes'!$M$4:$M$150,MATCH($B198,'Tableau Commandes'!$E$4:$E$150,0))","v":""},null,0]
[null,null,{"$f":"IF(B199<>\"\",COUNTIF('Tableau Commandes'!E200:E345,Récapitulatifs!B199),\"\")","v":""},{"$f":"IF(B199=\"\",\"\",SUMIF(REF,B199,'Tableau Commandes'!$C$5:$C$26))","v":""},0,0,{"$f":"INDEX('Tableau Commandes'!$M$4:$M$150,MATCH($B199,'Tableau Commandes'!$E$4:$E$150,0))","v":""},null,0]
[null,null,{"$f":"IF(B200<>\"\",COUNTIF('Tableau Commandes'!E201:E346,Récapitulatifs!B200),\"\")","v":""},{"$f":"IF(B200=\"\",\"\",SUMIF(REF,B200,'Tableau Commandes'!$C$5:$C$26))","v":""},0,0,{"$f":"INDEX('Tableau Commandes'!$M$4:$M$150,MATCH($B200,'Tableau Commandes'!$E$4:$E$150,0))","v":""},null,0]
[null,null,{"$f":"IF(B201<>\"\",COUNTIF('Tableau Commandes'!E202:E347,Récapitulatifs!B201),\"\")","v":""},{"$f":"IF(B201=\"\",\"\",SUMIF(REF,B201,'Tableau Commandes'!$C$5:$C$26))","v":""},0,0,{"$f":"INDEX('Tableau Commandes'!$M$4:$M$150,MATCH($B201,'Tableau Commandes'!$E$4:$E$150,0))","v":""},null,0]
[null,null,{"$f":"IF(B202<>\"\",COUNTIF('Tableau Commandes'!E203:E348,Récapitulatifs!B202),\"\")","v":""},{"$f":"IF(B202=\"\",\"\",SUMIF(REF,B202,'Tableau Commandes'!$C$5:$C$26))","v":""},0,0,{"$f":"INDEX('Tableau Commandes'!$M$4:$M$150,MATCH($B202,'Tableau Commandes'!$E$4:$E$150,0))","v":""},null,0]
[null,null,{"$f":"IF(B203<>\"\",COUNTIF('Tableau Commandes'!E204:E349,Récapitulatifs!B203),\"\")","v":""},{"$f":"IF(B203=\"\",\"\",SUMIF(REF,B203,'Tableau Commandes'!$C$5:$C$26))","v":""},0,0,{"$f":"INDEX('Tableau Commandes'!$M$4:$M$150,MATCH($B203,'Tableau Commandes'!$E$4:$E$150,0))","v":""},null,0]
[null,null,{"$f":"IF(B204<>\"\",COUNTIF('Tableau Commandes'!E205:E350,Récapitulatifs!B204),\"\")","v":""},{"$f":"IF(B204=\"\",\"\",SUMIF(REF,B204,'Tableau Commandes'!$C$5:$C$26))","v":""},0,0,{"$f":"INDEX('Tableau Commandes'!$M$4:$M$150,MATCH($B204,'Tableau Commandes'!$E$4:$E$150,0))","v":""},null,0]
[null,null,{"$f":"IF(B205<>\"\",COUNTIF('Tableau Commandes'!E206:E351,Récapitulatifs!B205),\"\")","v":""},{"$f":"IF(B205=\"\",\"\",SUMIF(REF,B205,'Tableau Commandes'!$C$5:$C$26))","v":""},0,0,{"$f":"INDEX('Tableau Commandes'!$M$4:$M$150,MATCH($B205,'Tableau Commandes'!$E$4:$E$150,0))","v":""},null,0]
[null,null,{"$f":"IF(B206<>\"\",COUNTIF('Tableau Commandes'!E207:E352,Récapitulatifs!B206),\"\")","v":""},{"$f":"IF(B206=\"\",\"\",SUMIF(REF,B206,'Tableau Commandes'!$C$5:$C$26))","v":""},0,0,{"$f":"INDEX('Tableau Commandes'!$M$4:$M$150,MATCH($B206,'Tableau Commandes'!$E$4:$E$150,0))","v":""},null,0]
[null,null,{"$f":"IF(B207<>\"\",COUNTIF('Tableau Commandes'!E208:E353,Récapitulatifs!B207),\"\")","v":""},{"$f":"IF(B207=\"\",\"\",SUMIF(REF,B207,'Tableau Commandes'!$C$5:$C$26))","v":""},0,0,{"$f":"INDEX('Tableau Commandes'!$M$4:$M$150,MATCH($B207,'Tableau Commandes'!$E$4:$E$150,0))","v":""},null,0]
[null,null,{"$f":"IF(B208<>\"\",COUNTIF('Tableau Commandes'!E209:E354,Récapitulatifs!B208),\"\")","v":""},{"$f":"IF(B208=\"\",\"\",SUMIF(REF,B208,'Tableau Commandes'!$C$5:$C$26))","v":""},0,0,{"$f":"INDEX('Tableau Commandes'!$M$4:$M$150,MATCH($B208,'Tableau Commandes'!$E$4:$E$150,0))","v":""},null,0]
[null,null,{"$f":"IF(B209<>\"\",COUNTIF('Tableau Commandes'!E210:E355,Récapitulatifs!B209),\"\")","v":""},{"$f":"IF(B209=\"\",\"\",SUMIF(REF,B209,'Tableau Commandes'!$C$5:$C$26))","v":""},0,0,{"$f":"INDEX('Tableau Commandes'!$M$4:$M$150,MATCH($B209,'Tableau Commandes'!$E$4:$E$150,0))","v":""},null,0]
[null,null,{"$f":"IF(B210<>\"\",COUNTIF('Tableau Commandes'!E211:E356,Récapitulatifs!B210),\"\")","v":""},{"$f":"IF(B210=\"\",\"\",SUMIF(REF,B210,'Tableau Commandes'!$C$5:$C$26))","v":""},0,0,{"$f":"INDEX('Tableau Commandes'!$M$4:$M$150,MATCH($B210,'Tableau Commandes'!$E$4:$E$150,0))","v":""},null,0]
[null,null,{"$f":"IF(B211<>\"\",COUNTIF('Tableau Commandes'!E212:E357,Récapitulatifs!B211),\"\")","v":""},{"$f":"IF(B211=\"\",\"\",SUMIF(REF,B211,'Tableau Commandes'!$C$5:$C$26))","v":""},0,0,{"$f":"INDEX('Tableau Commandes'!$M$4:$M$150,MATCH($B211,'Tableau Commandes'!$E$4:$E$150,0))","v":""},null,0]
[null,null,{"$f":"IF(B212<>\"\",COUNTIF('Tableau Commandes'!E213:E358,Récapitulatifs!B212),\"\")","v":""},{"$f":"IF(B212=\"\",\"\",SUMIF(REF,B212,'Tableau Commandes'!$C$5:$C$26))","v":""},0,0,{"$f":"INDEX('Tableau Commandes'!$M$4:$M$150,MATCH($B212,'Tableau Commandes'!$E$4:$E$150,0))","v":""},null,0]
[null,null,{"$f":"IF(B213<>\"\",COUNTIF('Tableau Commandes'!E214:E359,Récapitulatifs!B213),\"\")","v":""},{"$f":"IF(B213=\"\",\"\",SUMIF(REF,B213,'Tableau Commandes'!$C$5:$C$26))","v":""},0,0,{"$f":"INDEX('Tableau Commandes'!$M$4:$M$150,MATCH($B213,'Tableau Commandes'!$E$4:$E$150,0))","v":""},null,0]
[null,null,{"$f":"IF(B214<>\"\",COUNTIF('Tableau Commandes'!E215:E360,Récapitulatifs!B214),\"\")","v":""},{"$f":"IF(B214=\"\",\"\",SUMIF(REF,B214,'Tableau Commandes'!$C$5:$C$26))","v":""},0,0,{"$f":"INDEX('Tableau Commandes'!$M$4:$M$150,MATCH($B214,'Tableau Commandes'!$E$4:$E$150,0))","v":""},null,0]
[null,null,{"$f":"IF(B215<>\"\",COUNTIF('Tableau Commandes'!E216:E361,Récapitulatifs!B215),\"\")","v":""},{"$f":"IF(B215=\"\",\"\",SUMIF(REF,B215,'Tableau Commandes'!$C$5:$C$26))","v":""},0,0,{"$f":"INDEX('Tableau Commandes'!$M$4:$M$150,MATCH($B215,'Tableau Commandes'!$E$4:$E$150,0))","v":""},null,0]
[null,null,{"$f":"IF(B216<>\"\",COUNTIF('Tableau Commandes'!E217:E362,Récapitulatifs!B216),\"\")","v":""},{"$f":"IF(B216=\"\",\"\",SUMIF(REF,B216,'Tableau Commandes'!$C$5:$C$26))","v":""},0,0,{"$f":"INDEX('Tableau Commandes'!$M$4:$M$150,MATCH($B216,'Tableau Commandes'!$E$4:$E$150,0))","v":""},null,0]
[null,null,{"$f":"IF(B217<>\"\",COUNTIF('Tableau Commandes'!E218:E363,Récapitulatifs!B217),\"\")","v":""},{"$f":"IF(B217=\"\",\"\",SUMIF(REF,B217,'Tableau Commandes'!$C$5:$C$26))","v":""},0,0,{"$f":"INDEX('Tableau Commandes'!$M$4:$M$150,MATCH($B217,'Tableau Commandes'!$E$4:$E$150,0))","v":""},null,0]
[null,null,{"$f":"IF(B218<>\"\",COUNTIF('Tableau Commandes'!E219:E364,Récapitulatifs!B218),\"\")","v":""},{"$f":"IF(B218=\"\",\"\",SUMIF(REF,B218,'Tableau Commandes'!$C$5:$C$26))","v":""},0,0,{"$f":"INDEX('Tableau Commandes'!$M$4:$M$150,MATCH($B218,'Tableau Commandes'!$E$4:$E$150,0))","v":""},null,0]
[null,null,{"$f":"IF(B219<>\"\",COUNTIF('Tableau Commandes'!E220:E365,Récapitulatifs!B219),\"\")","v":""},{"$f":"IF(B219=\"\",\"\",SUMIF(REF,B219,'Tableau Commandes'!$C$5:$C$26))","v":""},0,0,{"$f":"INDEX('Tableau Commandes'!$M$4:$M$150,MATCH($B219,'Tableau Commandes'!$E$4:$E$150,0))","v":""},null,0]
[null,null,{"$f":"IF(B220<>\"\",COUNTIF('Tableau Commandes'!E221:E366,Récapitulatifs!B220),\"\")","v":""},{"$f":"IF(B220=\"\",\"\",SUMIF(REF,B220,'Tableau Commandes'!$C$5:$C$26))","v":""},0,0,{"$f":"INDEX('Tableau Commandes'!$M$4:$M$150,MATCH($B220,'Tableau Commandes'!$E$4:$E$150,0))","v":""},null,0]
[null,null,{"$f":"IF(B221<>\"\",COUNTIF('Tableau Commandes'!E222:E367,Récapitulatifs!B221),\"\")","v":""},{"$f":"IF(B221=\"\",\"\",SUMIF(REF,B221,'Tableau Commandes'!$C$5:$C$26))","v":""},0,0,{"$f":"INDEX('Tableau Commandes'!$M$4:$M$150,MATCH($B221,'Tableau Commandes'!$E$4:$E$150,0))","v":""},null,0]
[null,null,{"$f":"IF(B222<>\"\",COUNTIF('Tableau Commandes'!E223:E368,Récapitulatifs!B222),\"\")","v":""},{"$f":"IF(B222=\"\",\"\",SUMIF(REF,B222,'Tableau Commandes'!$C$5:$C$26))","v":""},0,0,{"$f":"INDEX('Tableau Commandes'!$M$4:$M$150,MATCH($B222,'Tableau Commandes'!$E$4:$E$150,0))","v":""},null,0]
[null,null,{"$f":"IF(B223<>\"\",COUNTIF('Tableau Commandes'!E224:E369,Récapitulatifs!B223),\"\")","v":""},{"$f":"IF(B223=\"\",\"\",SUMIF(REF,B223,'Tableau Commandes'!$C$5:$C$26))","v":""},0,0,{"$f":"INDEX('Tableau Commandes'!$M$4:$M$150,MATCH($B223,'Tableau Commandes'!$E$4:$E$150,0))","v":""},null,0]
[null,null,{"$f":"IF(B224<>\"\",COUNTIF('Tableau Commandes'!E225:E370,Récapitulatifs!B224),\"\")","v":""},{"$f":"IF(B224=\"\",\"\",SUMIF(REF,B224,'Tableau Commandes'!$C$5:$C$26))","v":""},0,0,{"$f":"INDEX('Tableau Commandes'!$M$4:$M$150,MATCH($B224,'Tableau Commandes'!$E$4:$E$150,0))","v":""},null,0]
[null,null,{"$f":"IF(B225<>\"\",COUNTIF('Tableau Commandes'!E226:E371,Récapitulatifs!B225),\"\")","v":""},{"$f":"IF(B225=\"\",\"\",SUMIF(REF,B225,'Tableau Commandes'!$C$5:$C$26))","v":""},0,0,{"$f":"INDEX('Tableau Commandes'!$M$4:$M$150,MATCH($B225,'Tableau Commandes'!$E$4:$E$150,0))","v":""},null,0]
[null,null,{"$f":"IF(B226<>\"\",COUNTIF('Tableau Commandes'!E227:E372,Récapitulatifs!B226),\"\")","v":""},{"$f":"IF(B226=\"\",\"\",SUMIF(REF,B226,'Tableau Commandes'!$C$5:$C$26))","v":""},0,0,{"$f":"INDEX('Tableau Commandes'!$M$4:$M$150,MATCH($B226,'Tableau Commandes'!$E$4:$E$150,0))","v":""},null,0]
[null,null,{"$f":"IF(B227<>\"\",COUNTIF('Tableau Commandes'!E228:E373,Récapitulatifs!B227),\"\")","v":""},{"$f":"IF(B227=\"\",\"\",SUMIF(REF,B227,'Tableau Commandes'!$C$5:$C$26))","v":""},0,0,{"$f":"INDEX('Tableau Commandes'!$M$4:$M$150,MATCH($B227,'Tableau Commandes'!$E$4:$E$150,0))","v":""},null,0]
[null,null,{"$f":"IF(B228<>\"\",COUNTIF('Tableau Commandes'!E229:E374,Récapitulatifs!B228),\"\")","v":""},{"$f":"IF(B228=\"\",\"\",SUMIF(REF,B228,'Tableau Commandes'!$C$5:$C$26))","v":""},0,0,{"$f":"INDEX('Tableau Commandes'!$M$4:$M$150,MATCH($B228,'Tableau Commandes'!$E$4:$E$150,0))","v":""},null,0]
[null,null,{"$f":"IF(B229<>\"\",COUNTIF('Tableau Commandes'!E230:E375,Récapitulatifs!B229),\"\")","v":""},{"$f":"IF(B229=\"\",\"\",SUMIF(REF,B229,'Tableau Commandes'!$C$5:$C$26))","v":""},{"$f":"H229","v":0},{"$f":"IF(E229=\"P\",\"PREPAREE\",IF(E229=\"R\",\"RELIQUAT\",))","v":0},{"$f":"INDEX('Tableau Commandes'!$M$4:$M$150,MATCH($B229,'Tableau Commandes'!$E$4:$E$150,0))","v":""},null,{"$f":"IF(H229=\"P\",\"PREPAREE\",IF(H229=\"R\",\"RELIQUAT\",))","v":0}]
[null,null,{"$f":"IF(B230<>\"\",COUNTIF('Tableau Commandes'!E231:E376,Récapitulatifs!B230),\"\")","v":""},{"$f":"IF(B230=\"\",\"\",SUMIF(REF,B230,'Tableau Commandes'!$C$5:$C$26))","v":""},0,0,{"$f":"INDEX('Tableau Commandes'!$M$4:$M$150,MATCH($B230,'Tableau Commandes'!$E$4:$E$150,0))","v":""},null,0]
[null,null,{"$f":"IF(B231<>\"\",COUNTIF('Tableau Commandes'!E232:E377,Récapitulatifs!B231),\"\")","v":""},{"$f":"IF(B231=\"\",\"\",SUMIF(REF,B231,'Tableau Commandes'!$C$5:$C$26))","v":""},0,0,{"$f":"INDEX('Tableau Commandes'!$M$4:$M$150,MATCH($B231,'Tableau Commandes'!$E$4:$E$150,0))","v":""},null,0]
[null,null,{"$f":"IF(B232<>\"\",COUNTIF('Tableau Commandes'!E233:E378,Récapitulatifs!B232),\"\")","v":""},{"$f":"IF(B232=\"\",\"\",SUMIF(REF,B232,'Tableau Commandes'!$C$5:$C$26))","v":""},0,0,{"$f":"INDEX('Tableau Commandes'!$M$4:$M$150,MATCH($B232,'Tableau Commandes'!$E$4:$E$150,0))","v":""},null,0]
[null,null,{"$f":"IF(B233<>\"\",COUNTIF('Tableau Commandes'!E234:E379,Récapitulatifs!B233),\"\")","v":""},{"$f":"IF(B233=\"\",\"\",SUMIF(REF,B233,'Tableau Commandes'!$C$5:$C$26))","v":""},0,0,{"$f":"INDEX('Tableau Commandes'!$M$4:$M$150,MATCH($B233,'Tableau Commandes'!$E$4:$E$150,0))","v":""},null,0]
[null,null,{"$f":"IF(B234<>\"\",COUNTIF('Tableau Commandes'!E235:E380,Récapitulatifs!B234),\"\")","v":""},{"$f":"IF(B234=\"\",\"\",SUMIF(REF,B234,'Tableau Commandes'!$C$5:$C$26))","v":""},0,0,{"$f":"INDEX('Tableau Commandes'!$M$4:$M$150,MATCH($B234,'Tableau Commandes'!$E$4:$E$150,0))","v":""},null,0]
[null,null,{"$f":"IF(B235<>\"\",COUNTIF('Tableau Commandes'!E236:E381,Récapitulatifs!B235),\"\")","v":""},{"$f":"IF(B235=\"\",\"\",SUMIF(REF,B235,'Tableau Commandes'!$C$5:$C$26))","v":""},0,0,{"$f":"INDEX('Tableau Commandes'!$M$4:$M$150,MATCH($B235,'Tableau Commandes'!$E$4:$E$150,0))","v":""},null,0]
[null,null,{"$f":"IF(B236<>\"\",COUNTIF('Tableau Commandes'!E237:E382,Récapitulatifs!B236),\"\")","v":""},{"$f":"IF(B236=\"\",\"\",SUMIF(REF,B236,'Tableau Commandes'!$C$5:$C$26))","v":""},0,0,{"$f":"INDEX('Tableau Commandes'!$M$4:$M$150,MATCH($B236,'Tableau Commandes'!$E$4:$E$150,0))","v":""},null,0]
[null,null,{"$f":"IF(B237<>\"\",COUNTIF('Tableau Commandes'!E238:E383,Récapitulatifs!B237),\"\")","v":""},{"$f":"IF(B237=\"\",\"\",SUMIF(REF,B237,'Tableau Commandes'!$C$5:$C$26))","v":""},0,0,{"$f":"INDEX('Tableau Commandes'!$M$4:$M$150,MATCH($B237,'Tableau Commandes'!$E$4:$E$150,0))","v":""},null,0]
[null,null,{"$f":"IF(B238<>\"\",COUNTIF('Tableau Commandes'!E239:E384,Récapitulatifs!B238),\"\")","v":""},{"$f":"IF(B238=\"\",\"\",SUMIF(REF,B238,'Tableau Commandes'!$C$5:$C$26))","v":""},0,0,{"$f":"INDEX('Tableau Commandes'!$M$4:$M$150,MATCH($B238,'Tableau Commandes'!$E$4:$E$150,0))","v":""},null,0]
[null,null,{"$f":"IF(B239<>\"\",COUNTIF('Tableau Commandes'!E240:E385,Récapitulatifs!B239),\"\")","v":""},{"$f":"IF(B239=\"\",\"\",SUMIF(REF,B239,'Tableau Commandes'!$C$5:$C$26))","v":""},0,0,{"$f":"INDEX('Tableau Commandes'!$M$4:$M$150,MATCH($B239,'Tableau Commandes'!$E$4:$E$150,0))","v":""},null,0]
[null,null,{"$f":"IF(B240<>\"\",COUNTIF('Tableau Commandes'!E241:E386,Récapitulatifs!B240),\"\")","v":""},{"$f":"IF(B240=\"\",\"\",SUMIF(REF,B240,'Tableau Commandes'!$C$5:$C$26))","v":""},0,0,{"$f":"INDEX('Tableau Commandes'!$M$4:$M$150,MATCH($B240,'Tableau Commandes'!$E$4:$E$150,0))","v":""},null,0]
[null,null,{"$f":"IF(B241<>\"\",COUNTIF('Tableau Commandes'!E242:E387,Récapitulatifs!B241),\"\")","v":""},{"$f":"IF(B241=\"\",\"\",SUMIF(REF,B241,'Tableau Commandes'!$C$5:$C$26))","v":""},0,0,{"$f":"INDEX('Tableau Commandes'!$M$4:$M$150,MATCH($B241,'Tableau Commandes'!$E$4:$E$150,0))","v":""},null,0]
[null,null,{"$f":"IF(B242<>\"\",COUNTIF('Tableau Commandes'!E243:E388,Récapitulatifs!B242),\"\")","v":""},{"$f":"IF(B242=\"\",\"\",SUMIF(REF,B242,'Tableau Commandes'!$C$5:$C$26))","v":""},0,0,{"$f":"INDEX('Tableau Commandes'!$M$4:$M$150,MATCH($B242,'Tableau Commandes'!$E$4:$E$150,0))","v":""},null,0]
[null,null,{"$f":"IF(B243<>\"\",COUNTIF('Tableau Commandes'!E244:E389,Récapitulatifs!B243),\"\")","v":""},{"$f":"IF(B243=\"\",\"\",SUMIF(REF,B243,'Tableau Commandes'!$C$5:$C$26))","v":""},0,0,{"$f":"INDEX('Tableau Commandes'!$M$4:$M$150,MATCH($B243,'Tableau Commandes'!$E$4:$E$150,0))","v":""},null,0]
[null,null,{"$f":"IF(B244<>\"\",COUNTIF('Tableau Commandes'!E245:E390,Récapitulatifs!B244),\"\")","v":""},{"$f":"IF(B244=\"\",\"\",SUMIF(REF,B244,'Tableau Commandes'!$C$5:$C$26))","v":""},0,0,{"$f":"INDEX('Tableau Commandes'!$M$4:$M$150,MATCH($B244,'Tableau Commandes'!$E$4:$E$150,0))","v":""},null,0]
[null,null,{"$f":"IF(B245<>\"\",COUNTIF('Tableau Commandes'!E246:E391,Récapitulatifs!B245),\"\")","v":""},{"$f":"IF(B245=\"\",\"\",SUMIF(REF,B245,'Tableau Commandes'!$C$5:$C$26))","v":""},0,0,{"$f":"INDEX('Tableau Commandes'!$M$4:$M$150,MATCH($B245,'Tableau Commandes'!$E$4:$E$150,0))","v":""},null,0]
[null,null,{"$f":"IF(B246<>\"\",COUNTIF('Tableau Commandes'!E247:E392,Récapitulatifs!B246),\"\")","v":""},{"$f":"IF(B246=\"\",\"\",SUMIF(REF,B246,'Tableau Commandes'!$C$5:$C$26))","v":""},0,0,{"$f":"INDEX('Tableau Commandes'!$M$4:$M$150,MATCH($B246,'Tableau Commandes'!$E$4:$E$150,0))","v":""},null,0]
[null,null,{"$f":"IF(B247<>\"\",COUNTIF('Tableau Commandes'!E248:E393,Récapitulatifs!B247),\"\")","v":""},{"$f":"IF(B247=\"\",\"\",SUMIF(REF,B247,'Tableau Commandes'!$C$5:$C$26))","v":""},0,0,{"$f":"INDEX('Tableau Commandes'!$M$4:$M$150,MATCH($B247,'Tableau Commandes'!$E$4:$E$150,0))","v":""},null,0]
[null,null,{"$f":"IF(B248<>\"\",COUNTIF('Tableau Commandes'!E249:E394,Récapitulatifs!B248),\"\")","v":""},{"$f":"IF(B248=\"\",\"\",SUMIF(REF,B248,'Tableau Commandes'!$C$5:$C$26))","v":""},0,0,{"$f":"INDEX('Tableau Commandes'!$M$4:$M$150,MATCH($B248,'Tableau Commandes'!$E$4:$E$150,0))","v":""},null,0]
[null,null,{"$f":"IF(B249<>\"\",COUNTIF('Tableau Commandes'!E250:E395,Récapitulatifs!B249),\"\")","v":""},{"$f":"IF(B249=\"\",\"\",SUMIF(REF,B249,'Tableau Commandes'!$C$5:$C$26))","v":""},0,0,{"$f":"INDEX('Tableau Commandes'!$M$4:$M$150,MATCH($B249,'Tableau Commandes'!$E$4:$E$150,0))","v":""},null,0]
[null,null,{"$f":"IF(B250<>\"\",COUNTIF('Tableau Commandes'!E251:E396,Récapitulatifs!B250),\"\")","v":""},{"$f":"IF(B250=\"\",\"\",SUMIF(REF,B250,'Tableau Commandes'!$C$5:$C$26))","v":""},0,0,{"$f":"INDEX('Tableau Commandes'!$M$4:$M$150,MATCH($B250,'Tableau Commandes'!$E$4:$E$150,0))","v":""},null,0]
[null,null,{"$f":"IF(B251<>\"\",COUNTIF('Tableau Commandes'!E252:E397,Récapitulatifs!B251),\"\")","v":""},{"$f":"IF(B251=\"\",\"\",SUMIF(REF,B251,'Tableau Commandes'!$C$5:$C$26))","v":""},0,0,{"$f":"INDEX('Tableau Commandes'!$M$4:$M$150,MATCH($B251,'Tableau Commandes'!$E$4:$E$150,0))","v":""},null,0]
[null,null,{"$f":"IF(B252<>\"\",COUNTIF('Tableau Commandes'!E253:E398,Récapitulatifs!B252),\"\")","v":""},{"$f":"IF(B252=\"\",\"\",SUMIF(REF,B252,'Tableau Commandes'!$C$5:$C$26))","v":""},0,0,{"$f":"INDEX('Tableau Commandes'!$M$4:$M$150,MATCH($B252,'Tableau Commandes'!$E$4:$E$150,0))","v":""},null,0]

{"sheet":"Feuil3","index":2,"n_rows":42,"n_cols":12,"rows_kept":42,"cut":false,"hidden":false,"merged":[]}
["NOM - Prenom - BL ","Designation","Quantite","Info_Stock","Ref_","Prix_Achat_HT","Prix_Vente_HT","Fabricant","Transporteur","Emplacement","Ref_Utilisee_Si_Differente","Livree_Reliquat"]
["A","test",1,null,"81035",null,null,null,"Mondial Relay(code=MON) / orig="]
["A","test",1,null,"MECA997",null,null,null,"Mondial Relay(code=MON) / orig="]
["A","test",1,null,"MECA985",null,null,null,"Mondial Relay(code=MON) / orig="]
["A","test",1,null,"321050",null,null,null,"Chrono Relais*(code=REL) / orig="]
["A","test",1,"stock res","GLC41431",null,null,null,"Mondial Relay(code=MON) / orig="]
["A","test",1,null,"14135",null,null,null,"Mondial Relay(code=MON) / orig="]
["A","test",1,null,"14134",null,null,null,"Mondial Relay(code=MON) / orig="]
["A","test",1,null,"A14541",null,null,null,"Mondial Relay(code=MON) / orig="]
["A","test",1,null,"26599",null,null,null,"Mondial Relay(code=MON) / orig="]
["A","test",1,"stock res","4594",null,null,null,"Mondial Relay(code=MON) / orig="]
["A","test",1,"stock res","CDAL-54510z",null,null,null,"Mondial Relay(code=MON) / orig="]
["A","test",1,"purge stock","14588",null,null,null,"Mondial Relay(code=MON) / orig="]
["A","test",1,"stock res","RI71112",null,null,null,"Mondial Relay(code=MON) / orig="]
["A","test",1,null,"318204",null,null,null,"Mondial Relay(code=MON) / orig="]
["A","test",1,"stock res","4725",null,null,null,"Mondial Relay(code=MON) / orig="]
["A","test",1,null,"350240XDEUX",null,null,null,"Mondial Relay(code=MON) / orig="]
["A","test",1,null,"106390",null,null,null,"Mondial Relay(code=MON) / orig="]
["A","test",1,null,"GLC41429",null,null,null,"Mondial Relay(code=MON) / orig="]
["A","test",2,null,"MECA4178",null,null,null,"Mondial Relay(code=MON) / orig="]
["A","test",1,null,"MECA3836",null,null,null,"Chronopost*(code=CHR) / orig="]
["A","test",1,null,"99907",null,null,null,"SO Colissimo(code=SOC) / orig="]
["A","test",1,null,"GLC40101",null,null,null,"Chronopost*(code=CHR) / orig="]
["A","test",1,null,"MECA3836",null,null,null,"Colissimo*(Contre Remboursement Possible +7,00)(code=COL) / orig="]
["A","test",1,null,"813412X2"]
["A","test",1,null,"CDAL29409k"]
["A","test",2,null,"MECA4032"]
["A","test",1,null,"SPILU409003"]
["A","test",1,null,"351200",null,null,null,"SO Colissimo(code=SOC) / orig="]
["A","test",1,null,"GS11205",null,null,null,"Colissimo*(Contre Remboursement Possible +7,00)(code=COL) / orig="]
["A","test",1,null,"A14119",null,null,null,"SO Colissimo(code=SOC) / orig="]
["A","test",1,null,"3652",null,null,null,"Colissimo*(Contre Remboursement Possible +7,00)(code=COL) / orig="]
["A","test",1,"stock res","4740",null,null,null,"Colissimo*(Contre Remboursement Possible +7,00)(code=COL) / orig="]
["A","test",1,null,"106400",null,null,null,"Colissimo*(Contre Remboursement Possible +7,00)(code=COL) / orig="]
["A","test",1,null,"9018",null,null,null,"Colissimo*(Contre Remboursement Possible +7,00)(code=COL) / orig="]
["A","test",1,null,"24099XDEUX",null,null,null,"SO Colissimo(code=SOC) / orig="]
["A","test",1,null,"A027XDEUX",null,null,null,"SO Colissimo(code=SOC) / orig="]
["A","test",1,null,"99952",null,null,null,"Enveloppes Rigides Avec Suivi(code=POS) / orig="]
["A","test",1,null,"561020",null,null,null,"Colissimo*(Contre Remboursement Possible +7,00)(code=COL) / orig="]
["A","test",1,"stock res","599610",null,null,null,"Enveloppes Rigides Avec Suivi(code=POS) / orig="]
["A","test",1,null,"9501300",null,null,null,"SO Colissimo(code=SOC) / orig="]
[null,null,1,null,"123",null,null,null,"SO Colissimo(code=SOC) / orig="]