{"text_format":"1","workbook":"xlsx","n_sheets":3,"sheets":["Tableau Commandes","Récapitulatifs","Feuil3"],"not_rendered":{"charts":0,"images":0,"macros":1,"external_links":0,"defined_names":8,"comments":0,"pivot_tables":0},"unopened":[],"bounds":{"document_bytes":16777216,"sheet_cells":100000,"rows_first":2000,"rows_last":500,"rows_between":2000,"halvings":0,"cell_chars":16384,"cell_head_chars":4096},"cells_cut":0,"cells_raw":0,"read":"whole","date_system":"1900"}

{"sheet":"Tableau Commandes","index":0,"n_rows":150,"n_cols":13,"rows_kept":150,"cut":false,"hidden":false,"merged":[[1,0,1,4],[0,1,0,11]]}
[null,"COMMANDES"]
[{"$f":"TODAY()","v":"2013-01-06"}]
["NOM - Prénom-N° Fiche ","Désignation","Quantité","DISPO SUR STOCK","REF ","PRIX ACHAT","PRIX DE VENTE ","FABRICANT",null,"TRANSPORTEUR","EMPLACEMENT","PREPAREE RELIQUAT","MESSAGE"]
["Colonne1","Colonne2","Colonne3","Colonne4","Colonne5","Colonne52","Colonne53","Colonne54","Colonne55","Colonne56","Colonne57","Colonne6","Colonne7"]
[{"$f":"INDIRECT(\"Feuil3!\" & ADDRESS(ROW(A2),COLUMN(A2)))","v":"A"},{"$f":"INDIRECT(\"Feuil3!\" & ADDRESS(ROW(B2),COLUMN(B2)))","v":"test"},1,{"$f":"INDIRECT(\"Feuil3!\" & ADDRESS(ROW(D2),COLUMN(D2)))","v":0},"81035",0,0,0,"Mondial Relay(code=MON) / orig=",{"$f":"IF(LEFT(I5,1)=\"M\",\"MONDIAL RELAY\",IF(LEFT(I5,1)=\"E\",\"PREPASECURE\",IF(LEFT(I5,1)=\"S\",\"SO COLISSIMO\",IF(LEFT(I5,2)=\"CO\",\"COLISSIMO\",IF(LEFT(I5,2)=\"CH\",\"CHRONOPOST\",\"\")))))","v":"MONDIAL RELAY"},{"$f":"INDIRECT(\"Feuil3!\" & ADDRESS(ROW(J2),COLUMN(J2)))","v":0},{"$f":"INDEX(Récapitulatifs!$F$4:$F$61,MATCH($E5,Récapitulatifs!$B$4:$B$61,0))","v":0},{"$f":"IF(D5=\"STOCK RES\",\"DISPO CHEZ MOI\",IF(D5=\"Sold Out\",\"STOCK A VERIFIER\",\"\"))","v":""}]
["A","test",1,{"$f":"INDIRECT(\"Feuil3!\" & ADDRESS(ROW(D3),COLUMN(D3)))","v":0},"MECA997",0,0,null,{"$f":"INDIRECT(\"Feuil3!\" & ADDRESS(ROW(I3),COLUMN(I3)))","v":"Mondial Relay(code=MON) / orig="},"MONDIAL RELAY",0,{"$f":"INDEX(Récapitulatifs!$F$4:$F$61,MATCH($E6,Récapitulatifs!$B$4:$B$61,0))","v":0},""]
["A","test",1,{"$f":"INDIRECT(\"Feuil3!\" & ADDRESS(ROW(D4),COLUMN(D4)))","v":0},"MECA985",0,0,null,{"$f":"INDIRECT(\"Feuil3!\" & ADDRESS(ROW(I4),COLUMN(I4)))","v":"Mondial Relay(code=MON) / orig="},"MONDIAL RELAY",0,{"$f":"INDEX(Récapitulatifs!$F$4:$F$61,MATCH($E7,Récapitulatifs!$B$4:$B$61,0))","v":0},""]
["A","test",1,{"$f":"INDIRECT(\"Feuil3!\" & ADDRESS(ROW(D5),COLUMN(D5)))","v":0},"321050",0,0,null,{"$f":"INDIRECT(\"Feuil3!\" & ADDRESS(ROW(I5),COLUMN(I5)))","v":"Chrono Relais*(code=REL) / orig="},"CHRONOPOST",0,{"$f":"INDEX(Récapitulatifs!$F$4:$F$61,MATCH($E8,Récapitulatifs!$B$4:$B$61,0))","v":0},""]
["A","test",1,{"$f":"INDIRECT(\"Feuil3!\" & ADDRESS(ROW(D6),COLUMN(D6)))","v":"stock res"},"GLC41431",0,0,null,{"$f":"INDIRECT(\"Feuil3!\" & ADDRESS(ROW(I6),COLUMN(I6)))","v":"Mondial Relay(code=MON) / orig="},"MONDIAL RELAY",0,{"$f":"INDEX(Récapitulatifs!$F$4:$F$61,MATCH($E9,Récapitulatifs!$B$4:$B$61,0))","v":0},"DISPO CHEZ MOI"]
["A","test",1,{"$f":"INDIRECT(\"Feuil3!\" & ADDRESS(ROW(D7),COLUMN(D7)))","v":0},"14135",0,0,null,{"$f":"INDIRECT(\"Feuil3!\" & ADDRESS(ROW(I7),COLUMN(I7)))","v":"Mondial Relay(code=MON) / orig="},"MONDIAL RELAY",0,{"$f":"INDEX(Récapitulatifs!$F$4:$F$61,MATCH($E10,Récapitulatifs!$B$4:$B$61,0))","v":0},""]
["A","test",1,{"$f":"INDIRECT(\"Feuil3!\" & ADDRESS(ROW(D8),COLUMN(D8)))","v":0},"14134",0,0,null,{"$f":"INDIRECT(\"Feuil3!\" & ADDRESS(ROW(I8),COLUMN(I8)))","v":"Mondial Relay(code=MON) / orig="},"MONDIAL RELAY",0,{"$f":"INDEX(Récapitulatifs!$F$4:$F$61,MATCH($E11,Récapitulatifs!$B$4:$B$61,0))","v":0},""]
["A","test",1,{"$f":"INDIRECT(\"Feuil3!\" & ADDRESS(ROW(D9),COLUMN(D9)))","v":0},"A14541",0,0,null,{"$f":"INDIRECT(\"Feuil3!\" & ADDRESS(ROW(I9),COLUMN(I9)))","v":"Mondial Relay(code=MON) / orig="},"MONDIAL RELAY",0,{"$f":"INDEX(Récapitulatifs!$F$4:$F$61,MATCH($E12,Récapitulatifs!$B$4:$B$61,0))","v":0},""]
["A","test",1,{"$f":"INDIRECT(\"Feuil3!\" & ADDRESS(ROW(D10),COLUMN(D10)))","v":0},"26599",0,0,null,{"$f":"INDIRECT(\"Feuil3!\" & ADDRESS(ROW(I10),COLUMN(I10)))","v":"Mondial Relay(code=MON) / orig="},"MONDIAL RELAY",0,{"$f":"INDEX(Récapitulatifs!$F$4:$F$61,MATCH($E13,Récapitulatifs!$B$4:$B$61,0))","v":0},""]
["A","test",1,{"$f":"INDIRECT(\"Feuil3!\" & ADDRESS(ROW(D11),COLUMN(D11)))","v":"stock res"},"4594",0,0,null,{"$f":"INDIRECT(\"Feuil3!\" & ADDRESS(ROW(I11),COLUMN(I11)))","v":"Mondial Relay(code=MON) / orig="},"MONDIAL RELAY",0,{"$f":"INDEX(Récapitulatifs!$F$4:$F$61,MATCH($E14,Récapitulatifs!$B$4:$B$61,0))","v":0},"DISPO CHEZ MOI"]
["A","test",1,{"$f":"INDIRECT(\"Feuil3!\" & ADDRESS(ROW(D12),COLUMN(D12)))","v":"stock res"},"CDAL-54510z",0,0,null,{"$f":"INDIRECT(\"Feuil3!\" & ADDRESS(ROW(I12),COLUMN(I12)))","v":"Mondial Relay(code=MON) / orig="},"MONDIAL RELAY",0,{"$f":"INDEX(Récapitulatifs!$F$4:$F$61,MATCH($E15,Récapitulatifs!$B$4:$B$61,0))","v":0},"DISPO CHEZ MOI"]
["A","test",1,{"$f":"INDIRECT(\"Feuil3!\" & ADDRESS(ROW(D13),COLUMN(D13)))","v":"purge stock"},"14588",0,0,null,{"$f":"INDIRECT(\"Feuil3!\" & ADDRESS(ROW(I13),COLUMN(I13)))","v":"Mondial Relay(code=MON) / orig="},"MONDIAL RELAY",0,{"$f":"INDEX(Récapitulatifs!$F$4:$F$61,MATCH($E16,Récapitulatifs!$B$4:$B$61,0))","v":0},""]
["A","test",1,{"$f":"INDIRECT(\"Feuil3!\" & ADDRESS(ROW(D14),COLUMN(D14)))","v":"stock res"},"RI71112",0,0,null,{"$f":"INDIRECT(\"Feuil3!\" & ADDRESS(ROW(I14),COLUMN(I14)))","v":"Mondial Relay(code=MON) / orig="},"MONDIAL RELAY",0,{"$f":"INDEX(Récapitulatifs!$F$4:$F$61,MATCH($E17,Récapitulatifs!$B$4:$B$61,0))","v":0},"DISPO CHEZ MOI"]
["A","test",1,{"$f":"INDIRECT(\"Feuil3!\" & ADDRESS(ROW(D15),COLUMN(D15)))","v":0},"318204",0,0,null,{"$f":"INDIRECT(\"Feuil3!\" & ADDRESS(ROW(I15),COLUMN(I15)))","v":"Mondial Relay(code=MON) / orig="},"MONDIAL RELAY",0,{"$f":"INDEX(Récapitulatifs!$F$4:$F$61,MATCH($E18,Récapitulatifs!$B$4:$B$61,0))","v":0},""]
["A","test",1,{"$f":"INDIRECT(\"Feuil3!\" & ADDRESS(ROW(D16),COLUMN(D16)))","v":"stock res"},"4725",0,0,null,{"$f":"INDIRECT(\"Feuil3!\" & ADDRESS(ROW(I16),COLUMN(I16)))","v":"Mondial Relay(code=MON) / orig="},"MONDIAL RELAY",0,{"$f":"INDEX(Récapitulatifs!$F$4:$F$61,MATCH($E19,Récapitulatifs!$B$4:$B$61,0))","v":0},"DISPO CHEZ MOI"]
["A","test",1,{"$f":"INDIRECT(\"Feuil3!\" & ADDRESS(ROW(D17),COLUMN(D17)))","v":0},"350240XDEUX",0,0,null,{"$f":"INDIRECT(\"Feuil3!\" & ADDRESS(ROW(I17),COLUMN(I17)))","v":"Mondial Relay(code=MON) / orig="},"MONDIAL RELAY",0,{"$f":"INDEX(Récapitulatifs!$F$4:$F$61,MATCH($E20,Récapitulatifs!$B$4:$B$61,0))","v":0},""]
["A","test",1,{"$f":"INDIRECT(\"Feuil3!\" & ADDRESS(ROW(D18),COLUMN(D18)))","v":0},"106390",0,0,null,{"$f":"INDIRECT(\"Feuil3!\" & ADDRESS(ROW(I18),COLUMN(I18)))","v":"Mondial Relay(code=MON) / orig="},"MONDIAL RELAY",0,{"$f":"INDEX(Récapitulatifs!$F$4:$F$61,MATCH($E21,Récapitulatifs!$B$4:$B$61,0))","v":0},""]
["A","test",1,{"$f":"INDIRECT(\"Feuil3!\" & ADDRESS(ROW(D19),COLUMN(D19)))","v":0},"GLC41429",0,0,null,{"$f":"INDIRECT(\"Feuil3!\" & ADDRESS(ROW(I19),COLUMN(I19)))","v":"Mondial Relay(code=MON) / orig="},"MONDIAL RELAY",0,{"$f":"INDEX(Récapitulatifs!$F$4:$F$61,MATCH($E22,Récapitulatifs!$B$4:$B$61,0))","v":0},""]
["A","test",2,{"$f":"INDIRECT(\"Feuil3!\" & ADDRESS(ROW(D20),COLUMN(D20)))","v":0},"MECA4178",0,0,null,{"$f":"INDIRECT(\"Feuil3!\" & ADDRESS(ROW(I20),COLUMN(I20)))","v":"Mondial Relay(code=MON) / orig="},"MONDIAL RELAY",0,{"$f":"INDEX(Récapitulatifs!$F$4:$F$61,MATCH($E23,Récapitulatifs!$B$4:$B$61,0))","v":0},""]
["A","test",1,{"$f":"INDIRECT(\"Feuil3!\" & ADDRESS(ROW(D21),COLUMN(D21)))","v":0},"MECA3836",0,0,null,{"$f":"INDIRECT(\"Feuil3!\" & ADDRESS(ROW(I21),COLUMN(I21)))","v":"Chronopost*(code=CHR) / orig="},"CHRONOPOST",0,{"$f":"INDEX(Récapitulatifs!$F$4:$F$61,MATCH($E24,Récapitulatifs!$B$4:$B$61,0))","v":0},""]
["A","test",1,{"$f":"INDIRECT(\"Feuil3!\" & ADDRESS(ROW(D22),COLUMN(D22)))","v":0},"99907",0,0,null,{"$f":"INDIRECT(\"Feuil3!\" & ADDRESS(ROW(I22),COLUMN(I22)))","v":"SO Colissimo(code=SOC) / orig="},"SO COLISSIMO",0,{"$f":"INDEX(Récapitulatifs!$F$4:$F$61,MATCH($E25,Récapitulatifs!$B$4:$B$61,0))","v":0},""]
["A","test",1,{"$f":"INDIRECT(\"Feuil3!\" & ADDRESS(ROW(D23),COLUMN(D23)))","v":0},"GLC40101",0,0,null,{"$f":"INDIRECT(\"Feuil3!\" & ADDRESS(ROW(I23),COLUMN(I23)))","v":"Chronopost*(code=CHR) / orig="},"CHRONOPOST",0,{"$f":"INDEX(Récapitulatifs!$F$4:$F$61,MATCH($E26,Récapitulatifs!$B$4:$B$61,0))","v":0},""]
["A","test",1,{"$f":"INDIRECT(\"Feuil3!\" & ADDRESS(ROW(D24),COLUMN(D24)))","v":0},"MECA3836",0,0,null,{"$f":"INDIRECT(\"Feuil3!\" & ADDRESS(ROW(I24),COLUMN(I24)))","v":"Colissimo*(Contre Remboursement Possible +7,00)(code=COL) / orig="},"COLISSIMO",0,{"$f":"INDEX(Récapitulatifs!$F$4:$F$61,MATCH($E27,Récapitulatifs!$B$4:$B$61,0))","v":0},""]
["A","test",1,{"$f":"INDIRECT(\"Feuil3!\" & ADDRESS(ROW(D25),COLUMN(D25)))","v":0},"813412X2",0,0,null,{"$f":"INDIRECT(\"Feuil3!\" & ADDRESS(ROW(I25),COLUMN(I25)))","v":0},"",0,{"$f":"INDEX(Récapitulatifs!$F$4:$F$61,MATCH($E28,Récapitulatifs!$B$4:$B$61,0))","v":0},""]
["A","test",1,{"$f":"INDIRECT(\"Feuil3!\" & ADDRESS(ROW(D26),COLUMN(D26)))","v":0},"CDAL29409k",0,0,null,{"$f":"INDIRECT(\"Feuil3!\" & ADDRESS(ROW(I26),COLUMN(I26)))","v":0},"",0,{"$f":"INDEX(Récapitulatifs!$F$4:$F$61,MATCH($E29,Récapitulatifs!$B$4:$B$61,0))","v":0},""]
["A","test",2,{"$f":"INDIRECT(\"Feuil3!\" & ADDRESS(ROW(D27),COLUMN(D27)))","v":0},"MECA4032",0,0,null,{"$f":"INDIRECT(\"Feuil3!\" & ADDRESS(ROW(I27),COLUMN(I27)))","v":0},"",0,{"$f":"INDEX(Récapitulatifs!$F$4:$F$61,MATCH($E30,Récapitulatifs!$B$4:$B$61,0))","v":0},""]
{"$rows_left_out":121}
{"sheet":"Récapitulatifs","index":1,"n_rows":252,"n_cols":9,"rows_kept":252,"cut":false,"hidden":false,"merged":[]}
[]
[]
[null,"REFERENCE","QUANTITE","QUANTITE","VALIDATION","INFO DE PREPARATION  ","MESSAGE ","VALIDATION","INFO DE PREPARATION  "]
[null,"81035",{"$f":"IF(B4<>\"\",COUNTIF('Tableau Commandes'!E5:E150,Récapitulatifs!B4),\"\")","v":1},{"$f":"IF(B4=\"\",\"\",SUMIF(REF,B4,'Tableau Commandes'!$C$5:$C$26))","v":1},{"$f":"H4","v":0},{"$f":"IF(E4=\"P\",\"PREPAREE\",IF(E4=\"R\",\"RELIQUAT\",))","v":0},{"$f":"INDEX('Tableau Commandes'!$M$4:$M$150,MATCH($B4,'Tableau Commandes'!$E$4:$E$150,0))","v":""},null,{"$f":"IF(H4=\"P\",\"PREPAREE\",IF(H4=\"R\",\"RELIQUAT\",))","v":0}]
[null,"MECA997",{"$f":"IF(B5<>\"\",COUNTIF('Tableau Commandes'!E6:E151,Récapitulatifs!B5),\"\")","v":1},{"$f":"IF(B5=\"\",\"\",SUMIF(REF,B5,'Tableau Commandes'!$C$5:$C$26))","v":1},{"$f":"H5","v":0},{"$f":"IF(E5=\"P\",\"PREPAREE\",IF(E5=\"R\",\"RELIQUAT\",))","v":0},{"$f":"INDEX('Tableau Commandes'!$M$4:$M$150,MATCH($B5,'Tableau Commandes'!$E$4:$E$150,0))","v":""},null,{"$f":"IF(H5=\"P\",\"PREPAREE\",IF(H5=\"R\",\"RELIQUAT\",))","v":0}]
[null,"MECA985",{"$f":"IF(B6<>\"\",COUNTIF('Tableau Commandes'!E7:E152,Récapitulatifs!B6),\"\")","v":1},{"$f":"IF(B6=\"\",\"\",SUMIF(REF,B6,'Tableau Commandes'!$C$5:$C$26))","v":1},0,0,{"$f":"INDEX('Tableau Commandes'!$M$4:$M$150,MATCH($B6,'Tableau Commandes'!$E$4:$E$150,0))","v":""},null,0]
[null,"321050",{"$f":"IF(B7<>\"\",COUNTIF('Tableau Commandes'!E8:E153,Récapitulatifs!B7),\"\")","v":1},{"$f":"IF(B7=\"\",\"\",SUMIF(REF,B7,'Tableau Commandes'!$C$5:$C$26))","v":1},0,0,{"$f":"INDEX('Tableau Commandes'!$M$4:$M$150,MATCH($B7,'Tableau Commandes'!$E$4:$E$150,0))","v":""},null,0]
[null,"GLC41431",{"$f":"IF(B8<>\"\",COUNTIF('Tableau Commandes'!E9:E154,Récapitulatifs!B8),\"\")","v":1},{"$f":"IF(B8=\"\",\"\",SUMIF(REF,B8,'Tableau Commandes'!$C$5:$C$26))","v":1},0,0,{"$f":"INDEX('Tableau Commandes'!$M$4:$M$150,MATCH($B8,'Tableau Commandes'!$E$4:$E$150,0))","v":"DISPO CHEZ MOI"},null,0]
[null,"14135",{"$f":"IF(B9<>\"\",COUNTIF('Tableau Commandes'!E10:E155,Récapitulatifs!B9),\"\")","v":1},{"$f":"IF(B9=\"\",\"\",SUMIF(REF,B9,'Tableau Commandes'!$C$5:$C$26))","v":1},0,0,{"$f":"INDEX('Tableau Commandes'!$M$4:$M$150,MATCH($B9,'Tableau Commandes'!$E$4:$E$150,0))","v":""},null,0]
[null,"14134",{"$f":"IF(B10<>\"\",COUNTIF('Tableau Commandes'!E11:E156,Récapitulatifs!B10),\"\")","v":1},{"$f":"IF(B10=\"\",\"\",SUMIF(REF,B10,'Tableau Commandes'!$C$5:$C$26))","v":1},0,0,{"$f":"INDEX('Tableau Commandes'!$M$4:$M$150,MATCH($B10,'Tableau Commandes'!$E$4:$E$150,0))","v":""},null,0]
[null,"A14541",{"$f":"IF(B11<>\"\",COUNTIF('Tableau Commandes'!E12:E157,Récapitulatifs!B11),\"\")","v":1},{"$f":"IF(B11=\"\",\"\",SUMIF(REF,B11,'Tableau Commandes'!$C$5:$C$26))","v":1},0,0,{"$f":"INDEX('Tableau Commandes'!$M$4:$M$150,MATCH($B11,'Tableau Commandes'!$E$4:$E$150,0))","v":""},null,0]
[null,"26599",{"$f":"IF(B12<>\"\",COUNTIF('Tableau Commandes'!E13:E158,Récapitulatifs!B12),\"\")","v":1},{"$f":"IF(B12=\"\",\"\",SUMIF(REF,B12,'Tableau Commandes'!$C$5:$C$26))","v":1},0,0,{"$f":"INDEX('Tableau Commandes'!$M$4:$M$150,MATCH($B12,'Tableau Commandes'!$E$4:$E$150,0))","v":""},null,0]
[null,"4594",{"$f":"IF(B13<>\"\",COUNTIF('Tableau Commandes'!E14:E159,Récapitulatifs!B13),\"\")","v":1},{"$f":"IF(B13=\"\",\"\",SUMIF(REF,B13,'Tableau Commandes'!$C$5:$C$26))","v":1},0,0,{"$f":"INDEX('Tableau Commandes'!$M$4:$M$150,MATCH($B13,'Tableau Commandes'!$E$4:$E$150,0))","v":"DISPO CHEZ MOI"},null,0]
[null,"CDAL-54510z",{"$f":"IF(B14<>\"\",COUNTIF('Tableau Commandes'!E15:E160,Récapitulatifs!B14),\"\")","v":1},{"$f":"IF(B14=\"\",\"\",SUMIF(REF,B14,'Tableau Commandes'!$C$5:$C$26))","v":1},0,0,{"$f":"INDEX('Tableau Commandes'!$M$4:$M$150,MATCH($B14,'Tableau Commandes'!$E$4:$E$150,0))","v":"DISPO CHEZ MOI"},null,0]
[null,"14588",{"$f":"IF(B15<>\"\",COUNTIF('Tableau Commandes'!E16:E161,Récapitulatifs!B15),\"\")","v":1},{"$f":"IF(B15=\"\",\"\",SUMIF(REF,B15,'Tableau Commandes'!$C$5:$C$26))","v":1},0,0,{"$f":"INDEX('Tableau Commandes'!$M$4:$M$150,MATCH($B15,'Tableau Commandes'!$E$4:$E$150,0))","v":""},null,0]
[null,"RI71112",{"$f":"IF(B16<>\"\",COUNTIF('Tableau Commandes'!E17:E162,Récapitulatifs!B16),\"\")","v":1},{"$f":"IF(B16=\"\",\"\",SUMIF(REF,B16,'Tableau Commandes'!$C$5:$C$26))","v":1},0,0,{"$f":"INDEX('Tableau Commandes'!$M$4:$M$150,MATCH($B16,'Tableau Commandes'!$E$4:$E$150,0))","v":"DISPO CHEZ MOI"},null,0]
[null,"318204",{"$f":"IF(B17<>\"\",COUNTIF('Tableau Commandes'!E18:E163,Récapitulatifs!B17),\"\")","v":1},{"$f":"IF(B17=\"\",\"\",SUMIF(REF,B17,'Tableau Commandes'!$C$5:$C$26))","v":1},0,0,{"$f":"INDEX('Tableau Commandes'!$M$4:$M$150,MATCH($B17,'Tableau Commandes'!$E$4:$E$150,0))","v":""},null,0]
[null,"4725",{"$f":"IF(B18<>\"\",COUNTIF('Tableau Commandes'!E19:E164,Récapitulatifs!B18),\"\")","v":1},{"$f":"IF(B18=\"\",\"\",SUMIF(REF,B18,'Tableau Commandes'!$C$5:$C$26))","v":1},0,{"$f":"IF(E18=\"P\",\"PREPAREE\",IF(E18=\"R\",\"RELIQUAT\",))","v":0},{"$f":"INDEX('Tableau Commandes'!$M$4:$M$150,MATCH($B18,'Tableau Commandes'!$E$4:$E$150,0))","v":"DISPO CHEZ MOI"},null,0]
[null,"350240XDEUX",{"$f":"IF(B19<>\"\",COUNTIF('Tableau Commandes'!E20:E165,Récapitulatifs!B19),\"\")","v":1},{"$f":"IF(B19=\"\",\"\",SUMIF(REF,B19,'Tableau Commandes'!$C$5:$C$26))","v":1},0,0,{"$f":"INDEX('Tableau Commandes'!$M$4:$M$150,MATCH($B19,'Tableau Commandes'!$E$4:$E$150,0))","v":""},null,0]
[null,"106390",{"$f":"IF(B20<>\"\",COUNTIF('Tableau Commandes'!E21:E166,Récapitulatifs!B20),\"\")","v":1},{"$f":"IF(B20=\"\",\"\",SUMIF(REF,B20,'Tableau Commandes'!$C$5:$C$26))","v":1},0,0,{"$f":"INDEX('Tableau Commandes'!$M$4:$M$150,MATCH($B20,'Tableau Commandes'!$E$4:$E$150,0))","v":""},null,0]
[null,"GLC41429",{"$f":"IF(B21<>\"\",COUNTIF('Tableau Commandes'!E22:E167,Récapitulatifs!B21),\"\")","v":1},{"$f":"IF(B21=\"\",\"\",SUMIF(REF,B21,'Tableau Commandes'!$C$5:$C$26))","v":1},0,0,{"$f":"INDEX('Tableau Commandes'!$M$4:$M$150,MATCH($B21,'Tableau Commandes'!$E$4:$E$150,0))","v":""},null,0]
[null,"MECA4178",{"$f":"IF(B22<>\"\",COUNTIF('Tableau Commandes'!E23:E168,Récapitulatifs!B22),\"\")","v":1},{"$f":"IF(B22=\"\",\"\",SUMIF(REF,B22,'Tableau Commandes'!$C$5:$C$26))","v":2},0,0,{"$f":"INDEX('Tableau Commandes'!$M$4:$M$150,MATCH($B22,'Tableau Commandes'!$E$4:$E$150,0))","v":""},null,0]
[null,"MECA3836",{"$f":"IF(B23<>\"\",COUNTIF('Tableau Commandes'!E24:E169,Récapitulatifs!B23),\"\")","v":2},{"$f":"IF(B23=\"\",\"\",SUMIF(REF,B23,'Tableau Commandes'!$C$5:$C$26))","v":2},0,0,{"$f":"INDEX('Tableau Commandes'!$M$4:$M$150,MATCH($B23,'Tableau Commandes'!$E$4:$E$150,0))","v":""},null,0]
[null,"99907",{"$f":"IF(B24<>\"\",COUNTIF('Tableau Commandes'!E25:E170,Récapitulatifs!B24),\"\")","v":1},{"$f":"IF(B24=\"\",\"\",SUMIF(REF,B24,'Tableau Commandes'!$C$5:$C$26))","v":1},0,0,{"$f":"INDEX('Tableau Commandes'!$M$4:$M$150,MATCH($B24,'Tableau Commandes'!$E$4:$E$150,0))","v":""},null,0]
[null,"GLC40101",{"$f":"IF(B25<>\"\",COUNTIF('Tableau Commandes'!E26:E171,Récapitulatifs!B25),\"\")","v":1},{"$f":"IF(B25=\"\",\"\",SUMIF(REF,B25,'Tableau Commandes'!$C$5:$C$26))","v":1},0,0,{"$f":"INDEX('Tableau Commandes'!$M$4:$M$150,MATCH($B25,'Tableau Commandes'!$E$4:$E$150,0))","v":""},null,0]
[null,"813412X2",{"$f":"IF(B26<>\"\",COUNTIF('Tableau Commandes'!E27:E172,Récapitulatifs!B26),\"\")","v":1},{"$f":"IF(B26=\"\",\"\",SUMIF(REF,B26,'Tableau Commandes'!$C$5:$C$26))","v":1},0,0,{"$f":"INDEX('Tableau Commandes'!$M$4:$M$150,MATCH($B26,'Tableau Commandes'!$E$4:$E$150,0))","v":""},null,0]
[null,"CDAL29409k",{"$f":"IF(B27<>\"\",COUNTIF('Tableau Commandes'!E28:E173,Récapitulatifs!B27),\"\")","v":1},{"$f":"IF(B27=\"\",\"\",SUMIF(REF,B27,'Tableau Commandes'!$C$5:$C$26))","v":1},0,0,{"$f":"INDEX('Tableau Commandes'!$M$4:$M$150,MATCH($B27,'Tableau Commandes'!$E$4:$E$150,0))","v":""},null,0]
[null,"MECA4032",{"$f":"IF(B28<>\"\",COUNTIF('Tableau Commandes'!E29:E174,Récapitulatifs!B28),\"\")","v":1},{"$f":"IF(B28=\"\",\"\",SUMIF(REF,B28,'Tableau Commandes'!$C$5:$C$26))","v":2},0,0,{"$f":"INDEX('Tableau Commandes'!$M$4:$M$150,MATCH($B28,'Tableau Commandes'!$E$4:$E$150,0))","v":""},null,0]
[null,"SPILU409003",{"$f":"IF(B29<>\"\",COUNTIF('Tableau Commandes'!E30:E175,Récapitulatifs!B29),\"\")","v":1},{"$f":"IF(B29=\"\",\"\",SUMIF(REF,B29,'Tableau Commandes'!$C$5:$C$26))","v":1},0,0,{"$f":"INDEX('Tableau Commandes'!$M$4:$M$150,MATCH($B29,'Tableau Commandes'!$E$4:$E$150,0))","v":""},null,0]
[null,"351200",{"$f":"IF(B30<>\"\",COUNTIF('Tableau Commandes'!E31:E176,Récapitulatifs!B30),\"\")","v":1},{"$f":"IF(B30=\"\",\"\",SUMIF(REF,B30,'Tableau Commandes'!$C$5:$C$26))","v":1},0,0,{"$f":"INDEX('Tableau Commandes'!$M$4:$M$150,MATCH($B30,'Tableau Commandes'!$E$4:$E$150,0))","v":""},null,0]
{"$rows_left_out":223}
{"sheet":"Feuil3","index":2,"n_rows":42,"n_cols":12,"rows_kept":42,"cut":false,"hidden":false,"merged":[]}
["NOM - Prenom - BL ","Designation","Quantite","Info_Stock","Ref_","Prix_Achat_HT","Prix_Vente_HT","Fabricant","Transporteur","Emplacement","Ref_Utilisee_Si_Differente","Livree_Reliquat"]
["A","test",1,null,"81035",null,null,null,"Mondial Relay(code=MON) / orig="]
["A","test",1,null,"MECA997",null,null,null,"Mondial Relay(code=MON) / orig="]
["A","test",1,null,"MECA985",null,null,null,"Mondial Relay(code=MON) / orig="]
["A","test",1,null,"321050",null,null,null,"Chrono Relais*(code=REL) / orig="]
["A","test",1,"stock res","GLC41431",null,null,null,"Mondial Relay(code=MON) / orig="]
["A","test",1,null,"14135",null,null,null,"Mondial Relay(code=MON) / orig="]
["A","test",1,null,"14134",null,null,null,"Mondial Relay(code=MON) / orig="]
["A","test",1,null,"A14541",null,null,null,"Mondial Relay(code=MON) / orig="]
["A","test",1,null,"26599",null,null,null,"Mondial Relay(code=MON) / orig="]
["A","test",1,"stock res","4594",null,null,null,"Mondial Relay(code=MON) / orig="]
["A","test",1,"stock res","CDAL-54510z",null,null,null,"Mondial Relay(code=MON) / orig="]
["A","test",1,"purge stock","14588",null,null,null,"Mondial Relay(code=MON) / orig="]
["A","test",1,"stock res","RI71112",null,null,null,"Mondial Relay(code=MON) / orig="]
["A","test",1,null,"318204",null,null,null,"Mondial Relay(code=MON) / orig="]
["A","test",1,"stock res","4725",null,null,null,"Mondial Relay(code=MON) / orig="]
["A","test",1,null,"350240XDEUX",null,null,null,"Mondial Relay(code=MON) / orig="]
["A","test",1,null,"106390",null,null,null,"Mondial Relay(code=MON) / orig="]
["A","test",1,null,"GLC41429",null,null,null,"Mondial Relay(code=MON) / orig="]
["A","test",2,null,"MECA4178",null,null,null,"Mondial Relay(code=MON) / orig="]
["A","test",1,null,"MECA3836",null,null,null,"Chronopost*(code=CHR) / orig="]
["A","test",1,null,"99907",null,null,null,"SO Colissimo(code=SOC) / orig="]
["A","test",1,null,"GLC40101",null,null,null,"Chronopost*(code=CHR) / orig="]
["A","test",1,null,"MECA3836",null,null,null,"Colissimo*(Contre Remboursement Possible +7,00)(code=COL) / orig="]
["A","test",1,null,"813412X2"]
["A","test",1,null,"CDAL29409k"]
["A","test",2,null,"MECA4032"]
["A","test",1,null,"SPILU409003"]
["A","test",1,null,"351200",null,null,null,"SO Colissimo(code=SOC) / orig="]
["A","test",1,null,"GS11205",null,null,null,"Colissimo*(Contre Remboursement Possible +7,00)(code=COL) / orig="]
{"$rows_left_out":12}