{"text_format":"1","workbook":"xlsx","n_sheets":3,"sheets":["Tableau Commandes","Récapitulatifs","Feuil3"],"not_rendered":{"charts":0,"images":1,"macros":1,"external_links":0,"defined_names":8,"comments":0,"pivot_tables":0},"unopened":[],"bounds":{"document_bytes":16777216,"sheet_cells":100000,"rows_first":2000,"rows_last":500,"rows_between":2000,"halvings":0,"cell_chars":16384,"cell_head_chars":4096},"cells_cut":0,"cells_raw":0,"read":"whole","date_system":"1900"}

{"sheet":"Tableau Commandes","index":0,"n_rows":300,"n_cols":13,"rows_kept":300,"cut":false,"hidden":false,"merged":[[0,1,0,11],[1,0,1,1],[1,2,1,3],[1,4,1,10]]}
[null,"COMMANDES"]
[{"$f":"TODAY()","v":"2013-01-06"},null,"recherche",null,""]
["NOM - Prénom-N° Fiche ","Désignation","Quantité","DISPO SUR STOCK","REF ","PRIX ACHAT","PRIX DE VENTE ","FABRICANT",null,"TRANSPORTEUR","EMPLACEMENT","PREPAREE RELIQUAT","MESSAGE"]
["Colonne1","Colonne2","Colonne3","Colonne4","Colonne5","Colonne52","Colonne53","Colonne54","Colonne55","Colonne56","Colonne57","Colonne6","Colonne7"]
[{"$f":"INDIRECT(\"Feuil3!\" & ADDRESS(ROW(A2),COLUMN(A2)))","v":0},{"$f":"INDIRECT(\"Feuil3!\" & ADDRESS(ROW(B2),COLUMN(B2)))","v":"A"},1,{"$f":"INDIRECT(\"Feuil3!\" & ADDRESS(ROW(D2),COLUMN(D2)))","v":"stock res"},"4740",0,"SO Colissimo(code=SOC) / orig=",0,0,{"$f":"IF(LEFT(I5,1)=\"M\",\"MONDIAL RELAY\",IF(LEFT(I5,1)=\"E\",\"PREPASECURE\",IF(LEFT(I5,1)=\"S\",\"SO COLISSIMO\",IF(LEFT(I5,2)=\"CO\",\"COLISSIMO\",IF(LEFT(I5,2)=\"CH\",\"CHRONOPOST\",\"\")))))","v":""},{"$f":"INDIRECT(\"Feuil3!\" & ADDRESS(ROW(J2),COLUMN(J2)))","v":0},{"$f":"INDEX(Récapitulatifs!$F$4:$F$250,MATCH($E5,Récapitulatifs!$B$4:$B$250,0))","v":0},{"$f":"IF(D5=\"STOCK RES\",\"DISPO CHEZ MOI\",IF(D5=\"Sold Out\",\"STOCK A VERIFIER\",\"\"))","v":"DISPO CHEZ MOI"}]
[0,"A",1,{"$f":"INDIRECT(\"Feuil3!\" & ADDRESS(ROW(D3),COLUMN(D3)))","v":0},"79925",0,"Mondial Relay(code=MON) / orig=",null,{"$f":"INDIRECT(\"Feuil3!\" & ADDRESS(ROW(I3),COLUMN(I3)))","v":0},"",0,{"$f":"INDEX(Récapitulatifs!$F$4:$F$250,MATCH($E6,Récapitulatifs!$B$4:$B$250,0))","v":0},""]
[0,"A",2,{"$f":"INDIRECT(\"Feuil3!\" & ADDRESS(ROW(D4),COLUMN(D4)))","v":0},"87196",0,"Mondial Relay(code=MON) / orig=",null,{"$f":"INDIRECT(\"Feuil3!\" & ADDRESS(ROW(I4),COLUMN(I4)))","v":0},"",0,{"$f":"INDEX(Récapitulatifs!$F$4:$F$250,MATCH($E7,Récapitulatifs!$B$4:$B$250,0))","v":0},""]
[0,"A",2,{"$f":"INDIRECT(\"Feuil3!\" & ADDRESS(ROW(D5),COLUMN(D5)))","v":0},"99904",0,"Mondial Relay(code=MON) / orig=",null,{"$f":"INDIRECT(\"Feuil3!\" & ADDRESS(ROW(I5),COLUMN(I5)))","v":0},"",0,{"$f":"INDEX(Récapitulatifs!$F$4:$F$250,MATCH($E8,Récapitulatifs!$B$4:$B$250,0))","v":0},""]
[0,"A",1,{"$f":"INDIRECT(\"Feuil3!\" & ADDRESS(ROW(D6),COLUMN(D6)))","v":0},"199016",0,"SO Colissimo(code=SOC) / orig=",null,{"$f":"INDIRECT(\"Feuil3!\" & ADDRESS(ROW(I6),COLUMN(I6)))","v":0},"",0,{"$f":"INDEX(Récapitulatifs!$F$4:$F$250,MATCH($E9,Récapitulatifs!$B$4:$B$250,0))","v":0},""]
[0,"A",1,{"$f":"INDIRECT(\"Feuil3!\" & ADDRESS(ROW(D7),COLUMN(D7)))","v":0},"GLC40101",0,"Mondial Relay(code=MON) / orig=",null,{"$f":"INDIRECT(\"Feuil3!\" & ADDRESS(ROW(I7),COLUMN(I7)))","v":0},"",0,{"$f":"INDEX(Récapitulatifs!$F$4:$F$250,MATCH($E10,Récapitulatifs!$B$4:$B$250,0))","v":0},""]
[0,"A",1,{"$f":"INDIRECT(\"Feuil3!\" & ADDRESS(ROW(D8),COLUMN(D8)))","v":0},{"$f":"INDIRECT(\"Feuil3!\" & ADDRESS(ROW(E8),COLUMN(E8)))","v":"MECA8425"},0,"SO Colissimo(code=SOC) / orig=",null,{"$f":"INDIRECT(\"Feuil3!\" & ADDRESS(ROW(I8),COLUMN(I8)))","v":0},"",0,{"$f":"INDEX(Récapitulatifs!$F$4:$F$250,MATCH($E11,Récapitulatifs!$B$4:$B$250,0))","v":0},""]
[0,"A",1,{"$f":"INDIRECT(\"Feuil3!\" & ADDRESS(ROW(D9),COLUMN(D9)))","v":0},"152760","STORM","SO Colissimo(code=SOC) / orig=",null,{"$f":"INDIRECT(\"Feuil3!\" & ADDRESS(ROW(I9),COLUMN(I9)))","v":0},"",0,{"$f":"INDEX(Récapitulatifs!$F$4:$F$250,MATCH($E12,Récapitulatifs!$B$4:$B$250,0))","v":0},""]
[0,"A",2,{"$f":"INDIRECT(\"Feuil3!\" & ADDRESS(ROW(D10),COLUMN(D10)))","v":"stock res"},"83523",0,"Mondial Relay(code=MON) / orig=",null,{"$f":"INDIRECT(\"Feuil3!\" & ADDRESS(ROW(I10),COLUMN(I10)))","v":0},"",0,{"$f":"INDEX(Récapitulatifs!$F$4:$F$250,MATCH($E13,Récapitulatifs!$B$4:$B$250,0))","v":0},"DISPO CHEZ MOI"]
[0,"A",1,{"$f":"INDIRECT(\"Feuil3!\" & ADDRESS(ROW(D11),COLUMN(D11)))","v":"stock res"},"83524",0,"Mondial Relay(code=MON) / orig=",null,{"$f":"INDIRECT(\"Feuil3!\" & ADDRESS(ROW(I11),COLUMN(I11)))","v":0},"",0,{"$f":"INDEX(Récapitulatifs!$F$4:$F$250,MATCH($E14,Récapitulatifs!$B$4:$B$250,0))","v":0},"DISPO CHEZ MOI"]
[0,"A",1,{"$f":"INDIRECT(\"Feuil3!\" & ADDRESS(ROW(D12),COLUMN(D12)))","v":0},"MECA8655",0,"SO Colissimo(code=SOC) / orig=",null,{"$f":"INDIRECT(\"Feuil3!\" & ADDRESS(ROW(I12),COLUMN(I12)))","v":0},"",0,{"$f":"INDEX(Récapitulatifs!$F$4:$F$250,MATCH($E15,Récapitulatifs!$B$4:$B$250,0))","v":0},""]
[0,"A",1,{"$f":"INDIRECT(\"Feuil3!\" & ADDRESS(ROW(D13),COLUMN(D13)))","v":"stock res"},"2335",0,"SO Colissimo(code=SOC) / orig=",null,{"$f":"INDIRECT(\"Feuil3!\" & ADDRESS(ROW(I13),COLUMN(I13)))","v":0},"",0,{"$f":"INDEX(Récapitulatifs!$F$4:$F$250,MATCH($E16,Récapitulatifs!$B$4:$B$250,0))","v":0},"DISPO CHEZ MOI"]
[0,"A",1,{"$f":"INDIRECT(\"Feuil3!\" & ADDRESS(ROW(D14),COLUMN(D14)))","v":"stock res"},"99901XDEUX",0,"SO Colissimo(code=SOC) / orig=",null,{"$f":"INDIRECT(\"Feuil3!\" & ADDRESS(ROW(I14),COLUMN(I14)))","v":0},"",0,{"$f":"INDEX(Récapitulatifs!$F$4:$F$250,MATCH($E17,Récapitulatifs!$B$4:$B$250,0))","v":0},"DISPO CHEZ MOI"]
[0,"A",1,{"$f":"INDIRECT(\"Feuil3!\" & ADDRESS(ROW(D15),COLUMN(D15)))","v":0},"350240XDEUX","MECA","SO Colissimo(code=SOC) / orig=",null,{"$f":"INDIRECT(\"Feuil3!\" & ADDRESS(ROW(I15),COLUMN(I15)))","v":0},"",0,{"$f":"INDEX(Récapitulatifs!$F$4:$F$250,MATCH($E18,Récapitulatifs!$B$4:$B$250,0))","v":0},""]
[0,"A",1,{"$f":"INDIRECT(\"Feuil3!\" & ADDRESS(ROW(D16),COLUMN(D16)))","v":"stock res"},"81036",0,"SO Colissimo(code=SOC) / orig=",null,{"$f":"INDIRECT(\"Feuil3!\" & ADDRESS(ROW(I16),COLUMN(I16)))","v":0},"",0,{"$f":"INDEX(Récapitulatifs!$F$4:$F$250,MATCH($E19,Récapitulatifs!$B$4:$B$250,0))","v":0},"DISPO CHEZ MOI"]
[0,"A",1,{"$f":"INDIRECT(\"Feuil3!\" & ADDRESS(ROW(D17),COLUMN(D17)))","v":0},"79038XDEUX",0,"Mondial Relay(code=MON) / orig=",null,{"$f":"INDIRECT(\"Feuil3!\" & ADDRESS(ROW(I17),COLUMN(I17)))","v":0},"",0,{"$f":"INDEX(Récapitulatifs!$F$4:$F$250,MATCH($E20,Récapitulatifs!$B$4:$B$250,0))","v":0},""]
[0,"A",1,{"$f":"INDIRECT(\"Feuil3!\" & ADDRESS(ROW(D18),COLUMN(D18)))","v":0},"199017",0,"SO Colissimo(code=SOC) / orig=",null,{"$f":"INDIRECT(\"Feuil3!\" & ADDRESS(ROW(I18),COLUMN(I18)))","v":0},"",0,{"$f":"INDEX(Récapitulatifs!$F$4:$F$250,MATCH($E21,Récapitulatifs!$B$4:$B$250,0))","v":0},""]
[0,"A",1,{"$f":"INDIRECT(\"Feuil3!\" & ADDRESS(ROW(D19),COLUMN(D19)))","v":0},"A14541",0,"Mondial Relay(code=MON) / orig=",null,{"$f":"INDIRECT(\"Feuil3!\" & ADDRESS(ROW(I19),COLUMN(I19)))","v":0},"",0,{"$f":"INDEX(Récapitulatifs!$F$4:$F$250,MATCH($E22,Récapitulatifs!$B$4:$B$250,0))","v":0},""]
[0,"A",2,{"$f":"INDIRECT(\"Feuil3!\" & ADDRESS(ROW(D20),COLUMN(D20)))","v":0},"99971",0,"Mondial Relay(code=MON) / orig=",null,{"$f":"INDIRECT(\"Feuil3!\" & ADDRESS(ROW(I20),COLUMN(I20)))","v":0},"",0,{"$f":"INDEX(Récapitulatifs!$F$4:$F$250,MATCH($E23,Récapitulatifs!$B$4:$B$250,0))","v":0},""]
[0,"A",1,{"$f":"INDIRECT(\"Feuil3!\" & ADDRESS(ROW(D21),COLUMN(D21)))","v":0},"6PK1563",0,"Mondial Relay(code=MON) / orig=",null,{"$f":"INDIRECT(\"Feuil3!\" & ADDRESS(ROW(I21),COLUMN(I21)))","v":0},"",0,{"$f":"INDEX(Récapitulatifs!$F$4:$F$250,MATCH($E24,Récapitulatifs!$B$4:$B$250,0))","v":0},""]
[0,"A",1,{"$f":"INDIRECT(\"Feuil3!\" & ADDRESS(ROW(D22),COLUMN(D22)))","v":"stock res"},"MECA3836",0,"SO Colissimo(code=SOC) / orig=",null,{"$f":"INDIRECT(\"Feuil3!\" & ADDRESS(ROW(I22),COLUMN(I22)))","v":0},"",0,{"$f":"INDEX(Récapitulatifs!$F$4:$F$250,MATCH($E25,Récapitulatifs!$B$4:$B$250,0))","v":0},"DISPO CHEZ MOI"]
[0,"A",1,{"$f":"INDIRECT(\"Feuil3!\" & ADDRESS(ROW(D23),COLUMN(D23)))","v":0},"CDAL-116922",0,"SO Colissimo(code=SOC) / orig=",null,{"$f":"INDIRECT(\"Feuil3!\" & ADDRESS(ROW(I23),COLUMN(I23)))","v":0},"",0,{"$f":"INDEX(Récapitulatifs!$F$4:$F$250,MATCH($E26,Récapitulatifs!$B$4:$B$250,0))","v":0},""]
[0,"A",1,{"$f":"INDIRECT(\"Feuil3!\" & ADDRESS(ROW(D24),COLUMN(D24)))","v":0},"GLC42119",0,"Mondial Relay(code=MON) / orig=",null,{"$f":"INDIRECT(\"Feuil3!\" & ADDRESS(ROW(I24),COLUMN(I24)))","v":0},"",0,{"$f":"INDEX(Récapitulatifs!$F$4:$F$250,MATCH($E27,Récapitulatifs!$B$4:$B$250,0))","v":0},""]
[0,"A",1,{"$f":"INDIRECT(\"Feuil3!\" & ADDRESS(ROW(D25),COLUMN(D25)))","v":0},"GLC42120",0,"Mondial Relay(code=MON) / orig=",null,{"$f":"INDIRECT(\"Feuil3!\" & ADDRESS(ROW(I25),COLUMN(I25)))","v":0},"",0,{"$f":"INDEX(Récapitulatifs!$F$4:$F$250,MATCH($E28,Récapitulatifs!$B$4:$B$250,0))","v":0},""]
[0,"A",2,{"$f":"INDIRECT(\"Feuil3!\" & ADDRESS(ROW(D26),COLUMN(D26)))","v":0},"GLC42303",0,"SO Colissimo(code=SOC) / orig=",null,{"$f":"INDIRECT(\"Feuil3!\" & ADDRESS(ROW(I26),COLUMN(I26)))","v":0},"",0,{"$f":"INDEX(Récapitulatifs!$F$4:$F$250,MATCH($E29,Récapitulatifs!$B$4:$B$250,0))","v":0},""]
[0,"A",1,{"$f":"INDIRECT(\"Feuil3!\" & ADDRESS(ROW(D27),COLUMN(D27)))","v":"stock res"},"4672",0,"SO Colissimo(code=SOC) / orig=",null,{"$f":"INDIRECT(\"Feuil3!\" & ADDRESS(ROW(I27),COLUMN(I27)))","v":0},"",0,{"$f":"INDEX(Récapitulatifs!$F$4:$F$250,MATCH($E30,Récapitulatifs!$B$4:$B$250,0))","v":0},"DISPO CHEZ MOI"]
{"$rows_left_out":271}
{"sheet":"Récapitulatifs","index":1,"n_rows":250,"n_cols":9,"rows_kept":250,"cut":false,"hidden":false,"merged":[]}
[]
[]
[null,"REFERENCE","QUANTITE","QUANTITE","VALIDATION","INFO DE PREPARATION  ","MESSAGE ","VALIDATION","INFO DE PREPARATION  "]
[null,{"$f":"IF(ISERROR(INDEX(ColE,MIN(IF((Nom<>0)*(COUNTIF($B$3:B3,Nom)=0),ROW(Nom))))&\"\"),\"\",INDEX(ColE,MIN(IF((Nom<>0)*(COUNTIF($B$3:B3,Nom)=0),ROW(Nom))))&\"\")","v":"4740"},{"$f":"IF(B4<>\"\",COUNTIF('Tableau Commandes'!E5:E300,Récapitulatifs!B4),\"\")","v":5},{"$f":"IF(B4=\"\",\"\",SUMIF(REF,B4,'Tableau Commandes'!$C$5:$C$26))","v":5},{"$f":"H4","v":0},{"$f":"IF(E4=\"P\",\"PREPAREE\",IF(E4=\"R\",\"RELIQUAT\",))","v":0},{"$f":"INDEX('Tableau Commandes'!$M$4:$M$300,MATCH($B4,'Tableau Commandes'!$E$4:$E$300,0))","v":"DISPO CHEZ MOI"},null,{"$f":"IF(H4=\"P\",\"PREPAREE\",IF(H4=\"R\",\"RELIQUAT\",))","v":0}]
[null,{"$f":"IF(ISERROR(INDEX(ColE,MIN(IF((Nom<>0)*(COUNTIF($B$3:B4,Nom)=0),ROW(Nom))))&\"\"),\"\",INDEX(ColE,MIN(IF((Nom<>0)*(COUNTIF($B$3:B4,Nom)=0),ROW(Nom))))&\"\")","v":"79925"},{"$f":"IF(B5<>\"\",COUNTIF('Tableau Commandes'!E6:E301,Récapitulatifs!B5),\"\")","v":1},{"$f":"IF(B5=\"\",\"\",SUMIF(REF,B5,'Tableau Commandes'!$C$5:$C$26))","v":1},{"$f":"H5","v":0},{"$f":"IF(E5=\"P\",\"PREPAREE\",IF(E5=\"R\",\"RELIQUAT\",))","v":0},{"$f":"INDEX('Tableau Commandes'!$M$4:$M$300,MATCH($B5,'Tableau Commandes'!$E$4:$E$300,0))","v":""},null,{"$f":"IF(H5=\"P\",\"PREPAREE\",IF(H5=\"R\",\"RELIQUAT\",))","v":0}]
[null,{"$f":"IF(ISERROR(INDEX(ColE,MIN(IF((Nom<>0)*(COUNTIF($B$3:B5,Nom)=0),ROW(Nom))))&\"\"),\"\",INDEX(ColE,MIN(IF((Nom<>0)*(COUNTIF($B$3:B5,Nom)=0),ROW(Nom))))&\"\")","v":"87196"},{"$f":"IF(B6<>\"\",COUNTIF('Tableau Commandes'!E7:E302,Récapitulatifs!B6),\"\")","v":1},{"$f":"IF(B6=\"\",\"\",SUMIF(REF,B6,'Tableau Commandes'!$C$5:$C$26))","v":2},0,0,{"$f":"INDEX('Tableau Commandes'!$M$4:$M$300,MATCH($B6,'Tableau Commandes'!$E$4:$E$300,0))","v":""},null,0]
[null,{"$f":"IF(ISERROR(INDEX(ColE,MIN(IF((Nom<>0)*(COUNTIF($B$3:B6,Nom)=0),ROW(Nom))))&\"\"),\"\",INDEX(ColE,MIN(IF((Nom<>0)*(COUNTIF($B$3:B6,Nom)=0),ROW(Nom))))&\"\")","v":"99904"},{"$f":"IF(B7<>\"\",COUNTIF('Tableau Commandes'!E8:E303,Récapitulatifs!B7),\"\")","v":1},{"$f":"IF(B7=\"\",\"\",SUMIF(REF,B7,'Tableau Commandes'!$C$5:$C$26))","v":2},0,0,{"$f":"INDEX('Tableau Commandes'!$M$4:$M$300,MATCH($B7,'Tableau Commandes'!$E$4:$E$300,0))","v":""},null,0]
[null,{"$f":"IF(ISERROR(INDEX(ColE,MIN(IF((Nom<>0)*(COUNTIF($B$3:B7,Nom)=0),ROW(Nom))))&\"\"),\"\",INDEX(ColE,MIN(IF((Nom<>0)*(COUNTIF($B$3:B7,Nom)=0),ROW(Nom))))&\"\")","v":"199016"},{"$f":"IF(B8<>\"\",COUNTIF('Tableau Commandes'!E9:E304,Récapitulatifs!B8),\"\")","v":1},{"$f":"IF(B8=\"\",\"\",SUMIF(REF,B8,'Tableau Commandes'!$C$5:$C$26))","v":1},0,0,{"$f":"INDEX('Tableau Commandes'!$M$4:$M$300,MATCH($B8,'Tableau Commandes'!$E$4:$E$300,0))","v":""},null,0]
[null,{"$f":"IF(ISERROR(INDEX(ColE,MIN(IF((Nom<>0)*(COUNTIF($B$3:B8,Nom)=0),ROW(Nom))))&\"\"),\"\",INDEX(ColE,MIN(IF((Nom<>0)*(COUNTIF($B$3:B8,Nom)=0),ROW(Nom))))&\"\")","v":"GLC40101"},{"$f":"IF(B9<>\"\",COUNTIF('Tableau Commandes'!E10:E305,Récapitulatifs!B9),\"\")","v":1},{"$f":"IF(B9=\"\",\"\",SUMIF(REF,B9,'Tableau Commandes'!$C$5:$C$26))","v":1},0,0,{"$f":"INDEX('Tableau Commandes'!$M$4:$M$300,MATCH($B9,'Tableau Commandes'!$E$4:$E$300,0))","v":""},null,0]
[null,{"$f":"IF(ISERROR(INDEX(ColE,MIN(IF((Nom<>0)*(COUNTIF($B$3:B9,Nom)=0),ROW(Nom))))&\"\"),\"\",INDEX(ColE,MIN(IF((Nom<>0)*(COUNTIF($B$3:B9,Nom)=0),ROW(Nom))))&\"\")","v":"MECA8425"},{"$f":"IF(B10<>\"\",COUNTIF('Tableau Commandes'!E11:E306,Récapitulatifs!B10),\"\")","v":1},{"$f":"IF(B10=\"\",\"\",SUMIF(REF,B10,'Tableau Commandes'!$C$5:$C$26))","v":1},0,0,{"$f":"INDEX('Tableau Commandes'!$M$4:$M$300,MATCH($B10,'Tableau Commandes'!$E$4:$E$300,0))","v":""},null,0]
[null,{"$f":"IF(ISERROR(INDEX(ColE,MIN(IF((Nom<>0)*(COUNTIF($B$3:B10,Nom)=0),ROW(Nom))))&\"\"),\"\",INDEX(ColE,MIN(IF((Nom<>0)*(COUNTIF($B$3:B10,Nom)=0),ROW(Nom))))&\"\")","v":"152760"},{"$f":"IF(B11<>\"\",COUNTIF('Tableau Commandes'!E12:E307,Récapitulatifs!B11),\"\")","v":2},{"$f":"IF(B11=\"\",\"\",SUMIF(REF,B11,'Tableau Commandes'!$C$5:$C$26))","v":2},0,0,{"$f":"INDEX('Tableau Commandes'!$M$4:$M$300,MATCH($B11,'Tableau Commandes'!$E$4:$E$300,0))","v":""},null,0]
[null,{"$f":"IF(ISERROR(INDEX(ColE,MIN(IF((Nom<>0)*(COUNTIF($B$3:B11,Nom)=0),ROW(Nom))))&\"\"),\"\",INDEX(ColE,MIN(IF((Nom<>0)*(COUNTIF($B$3:B11,Nom)=0),ROW(Nom))))&\"\")","v":"83523"},{"$f":"IF(B12<>\"\",COUNTIF('Tableau Commandes'!E13:E308,Récapitulatifs!B12),\"\")","v":4},{"$f":"IF(B12=\"\",\"\",SUMIF(REF,B12,'Tableau Commandes'!$C$5:$C$26))","v":5},0,0,{"$f":"INDEX('Tableau Commandes'!$M$4:$M$300,MATCH($B12,'Tableau Commandes'!$E$4:$E$300,0))","v":"DISPO CHEZ MOI"},null,0]
[null,{"$f":"IF(ISERROR(INDEX(ColE,MIN(IF((Nom<>0)*(COUNTIF($B$3:B12,Nom)=0),ROW(Nom))))&\"\"),\"\",INDEX(ColE,MIN(IF((Nom<>0)*(COUNTIF($B$3:B12,Nom)=0),ROW(Nom))))&\"\")","v":"83524"},{"$f":"IF(B13<>\"\",COUNTIF('Tableau Commandes'!E14:E309,Récapitulatifs!B13),\"\")","v":5},{"$f":"IF(B13=\"\",\"\",SUMIF(REF,B13,'Tableau Commandes'!$C$5:$C$26))","v":6},0,0,{"$f":"INDEX('Tableau Commandes'!$M$4:$M$300,MATCH($B13,'Tableau Commandes'!$E$4:$E$300,0))","v":"DISPO CHEZ MOI"},null,0]
[null,{"$f":"IF(ISERROR(INDEX(ColE,MIN(IF((Nom<>0)*(COUNTIF($B$3:B13,Nom)=0),ROW(Nom))))&\"\"),\"\",INDEX(ColE,MIN(IF((Nom<>0)*(COUNTIF($B$3:B13,Nom)=0),ROW(Nom))))&\"\")","v":"MECA8655"},{"$f":"IF(B14<>\"\",COUNTIF('Tableau Commandes'!E15:E310,Récapitulatifs!B14),\"\")","v":1},{"$f":"IF(B14=\"\",\"\",SUMIF(REF,B14,'Tableau Commandes'!$C$5:$C$26))","v":1},0,0,{"$f":"INDEX('Tableau Commandes'!$M$4:$M$300,MATCH($B14,'Tableau Commandes'!$E$4:$E$300,0))","v":""},null,0]
[null,{"$f":"IF(ISERROR(INDEX(ColE,MIN(IF((Nom<>0)*(COUNTIF($B$3:B14,Nom)=0),ROW(Nom))))&\"\"),\"\",INDEX(ColE,MIN(IF((Nom<>0)*(COUNTIF($B$3:B14,Nom)=0),ROW(Nom))))&\"\")","v":"2335"},{"$f":"IF(B15<>\"\",COUNTIF('Tableau Commandes'!E16:E311,Récapitulatifs!B15),\"\")","v":4},{"$f":"IF(B15=\"\",\"\",SUMIF(REF,B15,'Tableau Commandes'!$C$5:$C$26))","v":4},0,0,{"$f":"INDEX('Tableau Commandes'!$M$4:$M$300,MATCH($B15,'Tableau Commandes'!$E$4:$E$300,0))","v":"DISPO CHEZ MOI"},null,0]
[null,{"$f":"IF(ISERROR(INDEX(ColE,MIN(IF((Nom<>0)*(COUNTIF($B$3:B15,Nom)=0),ROW(Nom))))&\"\"),\"\",INDEX(ColE,MIN(IF((Nom<>0)*(COUNTIF($B$3:B15,Nom)=0),ROW(Nom))))&\"\")","v":"99901XDEUX"},{"$f":"IF(B16<>\"\",COUNTIF('Tableau Commandes'!E17:E312,Récapitulatifs!B16),\"\")","v":1},{"$f":"IF(B16=\"\",\"\",SUMIF(REF,B16,'Tableau Commandes'!$C$5:$C$26))","v":1},0,0,{"$f":"INDEX('Tableau Commandes'!$M$4:$M$300,MATCH($B16,'Tableau Commandes'!$E$4:$E$300,0))","v":"DISPO CHEZ MOI"},null,0]
[null,{"$f":"IF(ISERROR(INDEX(ColE,MIN(IF((Nom<>0)*(COUNTIF($B$3:B16,Nom)=0),ROW(Nom))))&\"\"),\"\",INDEX(ColE,MIN(IF((Nom<>0)*(COUNTIF($B$3:B16,Nom)=0),ROW(Nom))))&\"\")","v":"350240XDEUX"},{"$f":"IF(B17<>\"\",COUNTIF('Tableau Commandes'!E18:E313,Récapitulatifs!B17),\"\")","v":3},{"$f":"IF(B17=\"\",\"\",SUMIF(REF,B17,'Tableau Commandes'!$C$5:$C$26))","v":3},0,0,{"$f":"INDEX('Tableau Commandes'!$M$4:$M$300,MATCH($B17,'Tableau Commandes'!$E$4:$E$300,0))","v":""},null,0]
[null,{"$f":"IF(ISERROR(INDEX(ColE,MIN(IF((Nom<>0)*(COUNTIF($B$3:B17,Nom)=0),ROW(Nom))))&\"\"),\"\",INDEX(ColE,MIN(IF((Nom<>0)*(COUNTIF($B$3:B17,Nom)=0),ROW(Nom))))&\"\")","v":"81036"},{"$f":"IF(B18<>\"\",COUNTIF('Tableau Commandes'!E19:E314,Récapitulatifs!B18),\"\")","v":1},{"$f":"IF(B18=\"\",\"\",SUMIF(REF,B18,'Tableau Commandes'!$C$5:$C$26))","v":1},0,{"$f":"IF(E18=\"P\",\"PREPAREE\",IF(E18=\"R\",\"RELIQUAT\",))","v":0},{"$f":"INDEX('Tableau Commandes'!$M$4:$M$300,MATCH($B18,'Tableau Commandes'!$E$4:$E$300,0))","v":"DISPO CHEZ MOI"},null,0]
[null,{"$f":"IF(ISERROR(INDEX(ColE,MIN(IF((Nom<>0)*(COUNTIF($B$3:B18,Nom)=0),ROW(Nom))))&\"\"),\"\",INDEX(ColE,MIN(IF((Nom<>0)*(COUNTIF($B$3:B18,Nom)=0),ROW(Nom))))&\"\")","v":"79038XDEUX"},{"$f":"IF(B19<>\"\",COUNTIF('Tableau Commandes'!E20:E315,Récapitulatifs!B19),\"\")","v":1},{"$f":"IF(B19=\"\",\"\",SUMIF(REF,B19,'Tableau Commandes'!$C$5:$C$26))","v":1},0,0,{"$f":"INDEX('Tableau Commandes'!$M$4:$M$300,MATCH($B19,'Tableau Commandes'!$E$4:$E$300,0))","v":""},null,0]
[null,{"$f":"IF(ISERROR(INDEX(ColE,MIN(IF((Nom<>0)*(COUNTIF($B$3:B19,Nom)=0),ROW(Nom))))&\"\"),\"\",INDEX(ColE,MIN(IF((Nom<>0)*(COUNTIF($B$3:B19,Nom)=0),ROW(Nom))))&\"\")","v":"199017"},{"$f":"IF(B20<>\"\",COUNTIF('Tableau Commandes'!E21:E316,Récapitulatifs!B20),\"\")","v":2},{"$f":"IF(B20=\"\",\"\",SUMIF(REF,B20,'Tableau Commandes'!$C$5:$C$26))","v":2},0,0,{"$f":"INDEX('Tableau Commandes'!$M$4:$M$300,MATCH($B20,'Tableau Commandes'!$E$4:$E$300,0))","v":""},null,0]
[null,{"$f":"IF(ISERROR(INDEX(ColE,MIN(IF((Nom<>0)*(COUNTIF($B$3:B20,Nom)=0),ROW(Nom))))&\"\"),\"\",INDEX(ColE,MIN(IF((Nom<>0)*(COUNTIF($B$3:B20,Nom)=0),ROW(Nom))))&\"\")","v":"A14541"},{"$f":"IF(B21<>\"\",COUNTIF('Tableau Commandes'!E22:E317,Récapitulatifs!B21),\"\")","v":2},{"$f":"IF(B21=\"\",\"\",SUMIF(REF,B21,'Tableau Commandes'!$C$5:$C$26))","v":2},0,0,{"$f":"INDEX('Tableau Commandes'!$M$4:$M$300,MATCH($B21,'Tableau Commandes'!$E$4:$E$300,0))","v":""},null,0]
[null,{"$f":"IF(ISERROR(INDEX(ColE,MIN(IF((Nom<>0)*(COUNTIF($B$3:B21,Nom)=0),ROW(Nom))))&\"\"),\"\",INDEX(ColE,MIN(IF((Nom<>0)*(COUNTIF($B$3:B21,Nom)=0),ROW(Nom))))&\"\")","v":"99971"},{"$f":"IF(B22<>\"\",COUNTIF('Tableau Commandes'!E23:E318,Récapitulatifs!B22),\"\")","v":1},{"$f":"IF(B22=\"\",\"\",SUMIF(REF,B22,'Tableau Commandes'!$C$5:$C$26))","v":2},0,0,{"$f":"INDEX('Tableau Commandes'!$M$4:$M$300,MATCH($B22,'Tableau Commandes'!$E$4:$E$300,0))","v":""},null,0]
[null,{"$f":"IF(ISERROR(INDEX(ColE,MIN(IF((Nom<>0)*(COUNTIF($B$3:B22,Nom)=0),ROW(Nom))))&\"\"),\"\",INDEX(ColE,MIN(IF((Nom<>0)*(COUNTIF($B$3:B22,Nom)=0),ROW(Nom))))&\"\")","v":"6PK1563"},{"$f":"IF(B23<>\"\",COUNTIF('Tableau Commandes'!E24:E319,Récapitulatifs!B23),\"\")","v":1},{"$f":"IF(B23=\"\",\"\",SUMIF(REF,B23,'Tableau Commandes'!$C$5:$C$26))","v":1},0,0,{"$f":"INDEX('Tableau Commandes'!$M$4:$M$300,MATCH($B23,'Tableau Commandes'!$E$4:$E$300,0))","v":""},null,0]
[null,{"$f":"IF(ISERROR(INDEX(ColE,MIN(IF((Nom<>0)*(COUNTIF($B$3:B23,Nom)=0),ROW(Nom))))&\"\"),\"\",INDEX(ColE,MIN(IF((Nom<>0)*(COUNTIF($B$3:B23,Nom)=0),ROW(Nom))))&\"\")","v":"MECA3836"},{"$f":"IF(B24<>\"\",COUNTIF('Tableau Commandes'!E25:E320,Récapitulatifs!B24),\"\")","v":3},{"$f":"IF(B24=\"\",\"\",SUMIF(REF,B24,'Tableau Commandes'!$C$5:$C$26))","v":3},0,0,{"$f":"INDEX('Tableau Commandes'!$M$4:$M$300,MATCH($B24,'Tableau Commandes'!$E$4:$E$300,0))","v":"DISPO CHEZ MOI"},null,0]
[null,{"$f":"IF(ISERROR(INDEX(ColE,MIN(IF((Nom<>0)*(COUNTIF($B$3:B24,Nom)=0),ROW(Nom))))&\"\"),\"\",INDEX(ColE,MIN(IF((Nom<>0)*(COUNTIF($B$3:B24,Nom)=0),ROW(Nom))))&\"\")","v":"CDAL-116922"},{"$f":"IF(B25<>\"\",COUNTIF('Tableau Commandes'!E26:E321,Récapitulatifs!B25),\"\")","v":2},{"$f":"IF(B25=\"\",\"\",SUMIF(REF,B25,'Tableau Commandes'!$C$5:$C$26))","v":2},0,0,{"$f":"INDEX('Tableau Commandes'!$M$4:$M$300,MATCH($B25,'Tableau Commandes'!$E$4:$E$300,0))","v":""},null,0]
[null,{"$f":"IF(ISERROR(INDEX(ColE,MIN(IF((Nom<>0)*(COUNTIF($B$3:B25,Nom)=0),ROW(Nom))))&\"\"),\"\",INDEX(ColE,MIN(IF((Nom<>0)*(COUNTIF($B$3:B25,Nom)=0),ROW(Nom))))&\"\")","v":"GLC42119"},{"$f":"IF(B26<>\"\",COUNTIF('Tableau Commandes'!E27:E322,Récapitulatifs!B26),\"\")","v":1},{"$f":"IF(B26=\"\",\"\",SUMIF(REF,B26,'Tableau Commandes'!$C$5:$C$26))","v":1},0,0,{"$f":"INDEX('Tableau Commandes'!$M$4:$M$300,MATCH($B26,'Tableau Commandes'!$E$4:$E$300,0))","v":""},null,0]
[null,{"$f":"IF(ISERROR(INDEX(ColE,MIN(IF((Nom<>0)*(COUNTIF($B$3:B26,Nom)=0),ROW(Nom))))&\"\"),\"\",INDEX(ColE,MIN(IF((Nom<>0)*(COUNTIF($B$3:B26,Nom)=0),ROW(Nom))))&\"\")","v":"GLC42120"},{"$f":"IF(B27<>\"\",COUNTIF('Tableau Commandes'!E28:E323,Récapitulatifs!B27),\"\")","v":1},{"$f":"IF(B27=\"\",\"\",SUMIF(REF,B27,'Tableau Commandes'!$C$5:$C$26))","v":1},0,0,{"$f":"INDEX('Tableau Commandes'!$M$4:$M$300,MATCH($B27,'Tableau Commandes'!$E$4:$E$300,0))","v":""},null,0]
[null,{"$f":"IF(ISERROR(INDEX(ColE,MIN(IF((Nom<>0)*(COUNTIF($B$3:B27,Nom)=0),ROW(Nom))))&\"\"),\"\",INDEX(ColE,MIN(IF((Nom<>0)*(COUNTIF($B$3:B27,Nom)=0),ROW(Nom))))&\"\")","v":"GLC42303"},{"$f":"IF(B28<>\"\",COUNTIF('Tableau Commandes'!E29:E324,Récapitulatifs!B28),\"\")","v":1},{"$f":"IF(B28=\"\",\"\",SUMIF(REF,B28,'Tableau Commandes'!$C$5:$C$26))","v":2},0,0,{"$f":"INDEX('Tableau Commandes'!$M$4:$M$300,MATCH($B28,'Tableau Commandes'!$E$4:$E$300,0))","v":""},null,0]
[null,{"$f":"IF(ISERROR(INDEX(ColE,MIN(IF((Nom<>0)*(COUNTIF($B$3:B28,Nom)=0),ROW(Nom))))&\"\"),\"\",INDEX(ColE,MIN(IF((Nom<>0)*(COUNTIF($B$3:B28,Nom)=0),ROW(Nom))))&\"\")","v":"4672"},{"$f":"IF(B29<>\"\",COUNTIF('Tableau Commandes'!E30:E325,Récapitulatifs!B29),\"\")","v":1},{"$f":"IF(B29=\"\",\"\",SUMIF(REF,B29,'Tableau Commandes'!$C$5:$C$26))","v":1},0,0,{"$f":"INDEX('Tableau Commandes'!$M$4:$M$300,MATCH($B29,'Tableau Commandes'!$E$4:$E$300,0))","v":"DISPO CHEZ MOI"},null,0]
[null,{"$f":"IF(ISERROR(INDEX(ColE,MIN(IF((Nom<>0)*(COUNTIF($B$3:B29,Nom)=0),ROW(Nom))))&\"\"),\"\",INDEX(ColE,MIN(IF((Nom<>0)*(COUNTIF($B$3:B29,Nom)=0),ROW(Nom))))&\"\")","v":"MECA2684"},{"$f":"IF(B30<>\"\",COUNTIF('Tableau Commandes'!E31:E326,Récapitulatifs!B30),\"\")","v":1},{"$f":"IF(B30=\"\",\"\",SUMIF(REF,B30,'Tableau Commandes'!$C$5:$C$26))","v":1},0,0,{"$f":"INDEX('Tableau Commandes'!$M$4:$M$300,MATCH($B30,'Tableau Commandes'!$E$4:$E$300,0))","v":"DISPO CHEZ MOI"},null,0]
{"$rows_left_out":221}
{"sheet":"Feuil3","index":2,"n_rows":232,"n_cols":7,"rows_kept":232,"cut":false,"hidden":false,"merged":[]}
["NOM - Prenom - ","Designation","Quantite","Info_Stock","Ref_","Fabricant","Transporteur"]
[null,"A",1,"stock res","4740",null,"SO Colissimo(code=SOC) / orig="]
[null,"A",1,null,"79925",null,"Mondial Relay(code=MON) / orig="]
[null,"A",2,null,"87196",null,"Mondial Relay(code=MON) / orig="]
[null,"A",2,null,"99904",null,"Mondial Relay(code=MON) / orig="]
[null,"A",1,null,"199016",null,"SO Colissimo(code=SOC) / orig="]
[null,"A",1,null,"GLC40101",null,"Mondial Relay(code=MON) / orig="]
[null,"A",1,null,"MECA8425",null,"SO Colissimo(code=SOC) / orig="]
[null,"A",1,null,"152760","STORM","SO Colissimo(code=SOC) / orig="]
[null,"A",2,"stock res","83523",null,"Mondial Relay(code=MON) / orig="]
[null,"A",1,"stock res","83524",null,"Mondial Relay(code=MON) / orig="]
[null,"A",1,null,"MECA8655",null,"SO Colissimo(code=SOC) / orig="]
[null,"A",1,"stock res","2335",null,"SO Colissimo(code=SOC) / orig="]
[null,"A",1,"stock res","99901XDEUX",null,"SO Colissimo(code=SOC) / orig="]
[null,"A",1,null,"350240XDEUX","MECA","SO Colissimo(code=SOC) / orig="]
[null,"A",1,"stock res","81036",null,"SO Colissimo(code=SOC) / orig="]
[null,"A",1,null,"79038XDEUX",null,"Mondial Relay(code=MON) / orig="]
[null,"A",1,null,"199017",null,"SO Colissimo(code=SOC) / orig="]
[null,"A",1,null,"A14541",null,"Mondial Relay(code=MON) / orig="]
[null,"A",2,null,"99971",null,"Mondial Relay(code=MON) / orig="]
[null,"A",1,null,"6PK1563",null,"Mondial Relay(code=MON) / orig="]
[null,"A",1,"stock res","MECA3836",null,"SO Colissimo(code=SOC) / orig="]
[null,"A",1,null,"CDAL-116922",null,"SO Colissimo(code=SOC) / orig="]
[null,"A",1,null,"GLC42119",null,"Mondial Relay(code=MON) / orig="]
[null,"A",1,null,"GLC42120",null,"Mondial Relay(code=MON) / orig="]
[null,"A",2,null,"GLC42303",null,"SO Colissimo(code=SOC) / orig="]
[null,"A",1,"stock res","4672",null,"SO Colissimo(code=SOC) / orig="]
[null,"A",1,"stock res","MECA2684","MECA","SO Colissimo(code=SOC) / orig="]
[null,"A",1,"stock res","9501167",null,"SO Colissimo(code=SOC) / orig="]
[null,"A",1,"stock res","4612",null,"SO Colissimo(code=SOC) / orig="]
{"$rows_left_out":202}