{"text_format":"1","workbook":"xlsx","n_sheets":3,"sheets":["Tableau Commandes","Récapitulatifs","Feuil3"],"not_rendered":{"charts":0,"images":1,"macros":1,"external_links":0,"defined_names":8,"comments":0,"pivot_tables":0},"unopened":[],"bounds":{"document_bytes":16777216,"sheet_cells":100000,"rows_first":2000,"rows_last":500,"rows_between":2000,"halvings":0,"cell_chars":16384,"cell_head_chars":4096},"cells_cut":0,"cells_raw":0,"read":"whole","date_system":"1900"}

{"sheet":"Tableau Commandes","index":0,"n_rows":300,"n_cols":13,"rows_kept":300,"cut":false,"hidden":false,"merged":[[0,1,0,11],[1,0,1,1],[1,2,1,3],[1,4,1,10]]}
[null,"COMMANDES"]
[{"$f":"TODAY()","v":"2013-01-06"},null,"recherche",null,""]
["NOM - Prénom-N° Fiche ","Désignation","Quantité","DISPO SUR STOCK","REF ","PRIX ACHAT","PRIX DE VENTE ","FABRICANT",null,"TRANSPORTEUR","EMPLACEMENT","PREPAREE RELIQUAT","MESSAGE"]
["Colonne1","Colonne2","Colonne3","Colonne4","Colonne5","Colonne52","Colonne53","Colonne54","Colonne55","Colonne56","Colonne57","Colonne6","Colonne7"]
[{"$f":"INDIRECT(\"Feuil3!\" & ADDRESS(ROW(A2),COLUMN(A2)))","v":0},{"$f":"INDIRECT(\"Feuil3!\" & ADDRESS(ROW(B2),COLUMN(B2)))","v":"A"},1,{"$f":"INDIRECT(\"Feuil3!\" & ADDRESS(ROW(D2),COLUMN(D2)))","v":"stock res"},"4740",0,"SO Colissimo(code=SOC) / orig=",0,0,{"$f":"IF(LEFT(I5,1)=\"M\",\"MONDIAL RELAY\",IF(LEFT(I5,1)=\"E\",\"PREPASECURE\",IF(LEFT(I5,1)=\"S\",\"SO COLISSIMO\",IF(LEFT(I5,2)=\"CO\",\"COLISSIMO\",IF(LEFT(I5,2)=\"CH\",\"CHRONOPOST\",\"\")))))","v":""},{"$f":"INDIRECT(\"Feuil3!\" & ADDRESS(ROW(J2),COLUMN(J2)))","v":0},{"$f":"INDEX(Récapitulatifs!$F$4:$F$250,MATCH($E5,Récapitulatifs!$B$4:$B$250,0))","v":0},{"$f":"IF(D5=\"STOCK RES\",\"DISPO CHEZ MOI\",IF(D5=\"Sold Out\",\"STOCK A VERIFIER\",\"\"))","v":"DISPO CHEZ MOI"}]
[0,"A",1,{"$f":"INDIRECT(\"Feuil3!\" & ADDRESS(ROW(D3),COLUMN(D3)))","v":0},"79925",0,"Mondial Relay(code=MON) / orig=",null,{"$f":"INDIRECT(\"Feuil3!\" & ADDRESS(ROW(I3),COLUMN(I3)))","v":0},"",0,{"$f":"INDEX(Récapitulatifs!$F$4:$F$250,MATCH($E6,Récapitulatifs!$B$4:$B$250,0))","v":0},""]
[0,"A",2,{"$f":"INDIRECT(\"Feuil3!\" & ADDRESS(ROW(D4),COLUMN(D4)))","v":0},"87196",0,"Mondial Relay(code=MON) / orig=",null,{"$f":"INDIRECT(\"Feuil3!\" & ADDRESS(ROW(I4),COLUMN(I4)))","v":0},"",0,{"$f":"INDEX(Récapitulatifs!$F$4:$F$250,MATCH($E7,Récapitulatifs!$B$4:$B$250,0))","v":0},""]
[0,"A",2,{"$f":"INDIRECT(\"Feuil3!\" & ADDRESS(ROW(D5),COLUMN(D5)))","v":0},"99904",0,"Mondial Relay(code=MON) / orig=",null,{"$f":"INDIRECT(\"Feuil3!\" & ADDRESS(ROW(I5),COLUMN(I5)))","v":0},"",0,{"$f":"INDEX(Récapitulatifs!$F$4:$F$250,MATCH($E8,Récapitulatifs!$B$4:$B$250,0))","v":0},""]
[0,"A",1,{"$f":"INDIRECT(\"Feuil3!\" & ADDRESS(ROW(D6),COLUMN(D6)))","v":0},"199016",0,"SO Colissimo(code=SOC) / orig=",null,{"$f":"INDIRECT(\"Feuil3!\" & ADDRESS(ROW(I6),COLUMN(I6)))","v":0},"",0,{"$f":"INDEX(Récapitulatifs!$F$4:$F$250,MATCH($E9,Récapitulatifs!$B$4:$B$250,0))","v":0},""]
[0,"A",1,{"$f":"INDIRECT(\"Feuil3!\" & ADDRESS(ROW(D7),COLUMN(D7)))","v":0},"GLC40101",0,"Mondial Relay(code=MON) / orig=",null,{"$f":"INDIRECT(\"Feuil3!\" & ADDRESS(ROW(I7),COLUMN(I7)))","v":0},"",0,{"$f":"INDEX(Récapitulatifs!$F$4:$F$250,MATCH($E10,Récapitulatifs!$B$4:$B$250,0))","v":0},""]
[0,"A",1,{"$f":"INDIRECT(\"Feuil3!\" & ADDRESS(ROW(D8),COLUMN(D8)))","v":0},{"$f":"INDIRECT(\"Feuil3!\" & ADDRESS(ROW(E8),COLUMN(E8)))","v":"MECA8425"},0,"SO Colissimo(code=SOC) / orig=",null,{"$f":"INDIRECT(\"Feuil3!\" & ADDRESS(ROW(I8),COLUMN(I8)))","v":0},"",0,{"$f":"INDEX(Récapitulatifs!$F$4:$F$250,MATCH($E11,Récapitulatifs!$B$4:$B$250,0))","v":0},""]
[0,"A",1,{"$f":"INDIRECT(\"Feuil3!\" & ADDRESS(ROW(D9),COLUMN(D9)))","v":0},"152760","STORM","SO Colissimo(code=SOC) / orig=",null,{"$f":"INDIRECT(\"Feuil3!\" & ADDRESS(ROW(I9),COLUMN(I9)))","v":0},"",0,{"$f":"INDEX(Récapitulatifs!$F$4:$F$250,MATCH($E12,Récapitulatifs!$B$4:$B$250,0))","v":0},""]
[0,"A",2,{"$f":"INDIRECT(\"Feuil3!\" & ADDRESS(ROW(D10),COLUMN(D10)))","v":"stock res"},"83523",0,"Mondial Relay(code=MON) / orig=",null,{"$f":"INDIRECT(\"Feuil3!\" & ADDRESS(ROW(I10),COLUMN(I10)))","v":0},"",0,{"$f":"INDEX(Récapitulatifs!$F$4:$F$250,MATCH($E13,Récapitulatifs!$B$4:$B$250,0))","v":0},"DISPO CHEZ MOI"]
[0,"A",1,{"$f":"INDIRECT(\"Feuil3!\" & ADDRESS(ROW(D11),COLUMN(D11)))","v":"stock res"},"83524",0,"Mondial Relay(code=MON) / orig=",null,{"$f":"INDIRECT(\"Feuil3!\" & ADDRESS(ROW(I11),COLUMN(I11)))","v":0},"",0,{"$f":"INDEX(Récapitulatifs!$F$4:$F$250,MATCH($E14,Récapitulatifs!$B$4:$B$250,0))","v":0},"DISPO CHEZ MOI"]
[0,"A",1,{"$f":"INDIRECT(\"Feuil3!\" & ADDRESS(ROW(D12),COLUMN(D12)))","v":0},"MECA8655",0,"SO Colissimo(code=SOC) / orig=",null,{"$f":"INDIRECT(\"Feuil3!\" & ADDRESS(ROW(I12),COLUMN(I12)))","v":0},"",0,{"$f":"INDEX(Récapitulatifs!$F$4:$F$250,MATCH($E15,Récapitulatifs!$B$4:$B$250,0))","v":0},""]
[0,"A",1,{"$f":"INDIRECT(\"Feuil3!\" & ADDRESS(ROW(D13),COLUMN(D13)))","v":"stock res"},"2335",0,"SO Colissimo(code=SOC) / orig=",null,{"$f":"INDIRECT(\"Feuil3!\" & ADDRESS(ROW(I13),COLUMN(I13)))","v":0},"",0,{"$f":"INDEX(Récapitulatifs!$F$4:$F$250,MATCH($E16,Récapitulatifs!$B$4:$B$250,0))","v":0},"DISPO CHEZ MOI"]
[0,"A",1,{"$f":"INDIRECT(\"Feuil3!\" & ADDRESS(ROW(D14),COLUMN(D14)))","v":"stock res"},"99901XDEUX",0,"SO Colissimo(code=SOC) / orig=",null,{"$f":"INDIRECT(\"Feuil3!\" & ADDRESS(ROW(I14),COLUMN(I14)))","v":0},"",0,{"$f":"INDEX(Récapitulatifs!$F$4:$F$250,MATCH($E17,Récapitulatifs!$B$4:$B$250,0))","v":0},"DISPO CHEZ MOI"]
[0,"A",1,{"$f":"INDIRECT(\"Feuil3!\" & ADDRESS(ROW(D15),COLUMN(D15)))","v":0},"350240XDEUX","MECA","SO Colissimo(code=SOC) / orig=",null,{"$f":"INDIRECT(\"Feuil3!\" & ADDRESS(ROW(I15),COLUMN(I15)))","v":0},"",0,{"$f":"INDEX(Récapitulatifs!$F$4:$F$250,MATCH($E18,Récapitulatifs!$B$4:$B$250,0))","v":0},""]
[0,"A",1,{"$f":"INDIRECT(\"Feuil3!\" & ADDRESS(ROW(D16),COLUMN(D16)))","v":"stock res"},"81036",0,"SO Colissimo(code=SOC) / orig=",null,{"$f":"INDIRECT(\"Feuil3!\" & ADDRESS(ROW(I16),COLUMN(I16)))","v":0},"",0,{"$f":"INDEX(Récapitulatifs!$F$4:$F$250,MATCH($E19,Récapitulatifs!$B$4:$B$250,0))","v":0},"DISPO CHEZ MOI"]
[0,"A",1,{"$f":"INDIRECT(\"Feuil3!\" & ADDRESS(ROW(D17),COLUMN(D17)))","v":0},"79038XDEUX",0,"Mondial Relay(code=MON) / orig=",null,{"$f":"INDIRECT(\"Feuil3!\" & ADDRESS(ROW(I17),COLUMN(I17)))","v":0},"",0,{"$f":"INDEX(Récapitulatifs!$F$4:$F$250,MATCH($E20,Récapitulatifs!$B$4:$B$250,0))","v":0},""]
[0,"A",1,{"$f":"INDIRECT(\"Feuil3!\" & ADDRESS(ROW(D18),COLUMN(D18)))","v":0},"199017",0,"SO Colissimo(code=SOC) / orig=",null,{"$f":"INDIRECT(\"Feuil3!\" & ADDRESS(ROW(I18),COLUMN(I18)))","v":0},"",0,{"$f":"INDEX(Récapitulatifs!$F$4:$F$250,MATCH($E21,Récapitulatifs!$B$4:$B$250,0))","v":0},""]
[0,"A",1,{"$f":"INDIRECT(\"Feuil3!\" & ADDRESS(ROW(D19),COLUMN(D19)))","v":0},"A14541",0,"Mondial Relay(code=MON) / orig=",null,{"$f":"INDIRECT(\"Feuil3!\" & ADDRESS(ROW(I19),COLUMN(I19)))","v":0},"",0,{"$f":"INDEX(Récapitulatifs!$F$4:$F$250,MATCH($E22,Récapitulatifs!$B$4:$B$250,0))","v":0},""]
[0,"A",2,{"$f":"INDIRECT(\"Feuil3!\" & ADDRESS(ROW(D20),COLUMN(D20)))","v":0},"99971",0,"Mondial Relay(code=MON) / orig=",null,{"$f":"INDIRECT(\"Feuil3!\" & ADDRESS(ROW(I20),COLUMN(I20)))","v":0},"",0,{"$f":"INDEX(Récapitulatifs!$F$4:$F$250,MATCH($E23,Récapitulatifs!$B$4:$B$250,0))","v":0},""]
[0,"A",1,{"$f":"INDIRECT(\"Feuil3!\" & ADDRESS(ROW(D21),COLUMN(D21)))","v":0},"6PK1563",0,"Mondial Relay(code=MON) / orig=",null,{"$f":"INDIRECT(\"Feuil3!\" & ADDRESS(ROW(I21),COLUMN(I21)))","v":0},"",0,{"$f":"INDEX(Récapitulatifs!$F$4:$F$250,MATCH($E24,Récapitulatifs!$B$4:$B$250,0))","v":0},""]
[0,"A",1,{"$f":"INDIRECT(\"Feuil3!\" & ADDRESS(ROW(D22),COLUMN(D22)))","v":"stock res"},"MECA3836",0,"SO Colissimo(code=SOC) / orig=",null,{"$f":"INDIRECT(\"Feuil3!\" & ADDRESS(ROW(I22),COLUMN(I22)))","v":0},"",0,{"$f":"INDEX(Récapitulatifs!$F$4:$F$250,MATCH($E25,Récapitulatifs!$B$4:$B$250,0))","v":0},"DISPO CHEZ MOI"]
[0,"A",1,{"$f":"INDIRECT(\"Feuil3!\" & ADDRESS(ROW(D23),COLUMN(D23)))","v":0},"CDAL-116922",0,"SO Colissimo(code=SOC) / orig=",null,{"$f":"INDIRECT(\"Feuil3!\" & ADDRESS(ROW(I23),COLUMN(I23)))","v":0},"",0,{"$f":"INDEX(Récapitulatifs!$F$4:$F$250,MATCH($E26,Récapitulatifs!$B$4:$B$250,0))","v":0},""]
[0,"A",1,{"$f":"INDIRECT(\"Feuil3!\" & ADDRESS(ROW(D24),COLUMN(D24)))","v":0},"GLC42119",0,"Mondial Relay(code=MON) / orig=",null,{"$f":"INDIRECT(\"Feuil3!\" & ADDRESS(ROW(I24),COLUMN(I24)))","v":0},"",0,{"$f":"INDEX(Récapitulatifs!$F$4:$F$250,MATCH($E27,Récapitulatifs!$B$4:$B$250,0))","v":0},""]
[0,"A",1,{"$f":"INDIRECT(\"Feuil3!\" & ADDRESS(ROW(D25),COLUMN(D25)))","v":0},"GLC42120",0,"Mondial Relay(code=MON) / orig=",null,{"$f":"INDIRECT(\"Feuil3!\" & ADDRESS(ROW(I25),COLUMN(I25)))","v":0},"",0,{"$f":"INDEX(Récapitulatifs!$F$4:$F$250,MATCH($E28,Récapitulatifs!$B$4:$B$250,0))","v":0},""]
[0,"A",2,{"$f":"INDIRECT(\"Feuil3!\" & ADDRESS(ROW(D26),COLUMN(D26)))","v":0},"GLC42303",0,"SO Colissimo(code=SOC) / orig=",null,{"$f":"INDIRECT(\"Feuil3!\" & ADDRESS(ROW(I26),COLUMN(I26)))","v":0},"",0,{"$f":"INDEX(Récapitulatifs!$F$4:$F$250,MATCH($E29,Récapitulatifs!$B$4:$B$250,0))","v":0},""]
[0,"A",1,{"$f":"INDIRECT(\"Feuil3!\" & ADDRESS(ROW(D27),COLUMN(D27)))","v":"stock res"},"4672",0,"SO Colissimo(code=SOC) / orig=",null,{"$f":"INDIRECT(\"Feuil3!\" & ADDRESS(ROW(I27),COLUMN(I27)))","v":0},"",0,{"$f":"INDEX(Récapitulatifs!$F$4:$F$250,MATCH($E30,Récapitulatifs!$B$4:$B$250,0))","v":0},"DISPO CHEZ MOI"]
[0,"A",1,{"$f":"INDIRECT(\"Feuil3!\" & ADDRESS(ROW(D28),COLUMN(D28)))","v":"stock res"},"MECA2684","MECA","SO Colissimo(code=SOC) / orig=",null,{"$f":"INDIRECT(\"Feuil3!\" & ADDRESS(ROW(I28),COLUMN(I28)))","v":0},"",0,{"$f":"INDEX(Récapitulatifs!$F$4:$F$250,MATCH($E31,Récapitulatifs!$B$4:$B$250,0))","v":0},"DISPO CHEZ MOI"]
[0,"A",1,{"$f":"INDIRECT(\"Feuil3!\" & ADDRESS(ROW(D29),COLUMN(D29)))","v":"stock res"},"9501167",0,"SO Colissimo(code=SOC) / orig=",null,{"$f":"INDIRECT(\"Feuil3!\" & ADDRESS(ROW(I29),COLUMN(I29)))","v":0},"",0,{"$f":"INDEX(Récapitulatifs!$F$4:$F$250,MATCH($E32,Récapitulatifs!$B$4:$B$250,0))","v":0},"DISPO CHEZ MOI"]
[0,"A",1,{"$f":"INDIRECT(\"Feuil3!\" & ADDRESS(ROW(D30),COLUMN(D30)))","v":"stock res"},"4612",0,"SO Colissimo(code=SOC) / orig=",null,{"$f":"INDIRECT(\"Feuil3!\" & ADDRESS(ROW(I30),COLUMN(I30)))","v":0},"",0,{"$f":"INDEX(Récapitulatifs!$F$4:$F$250,MATCH($E33,Récapitulatifs!$B$4:$B$250,0))","v":0},"DISPO CHEZ MOI"]
[0,"A",1,{"$f":"INDIRECT(\"Feuil3!\" & ADDRESS(ROW(D31),COLUMN(D31)))","v":"stock res"},"2000450",0,"SO Colissimo(code=SOC) / orig=",null,{"$f":"INDIRECT(\"Feuil3!\" & ADDRESS(ROW(I31),COLUMN(I31)))","v":0},"",0,{"$f":"INDEX(Récapitulatifs!$F$4:$F$250,MATCH($E34,Récapitulatifs!$B$4:$B$250,0))","v":0},"DISPO CHEZ MOI"]
[0,"A",1,{"$f":"INDIRECT(\"Feuil3!\" & ADDRESS(ROW(D32),COLUMN(D32)))","v":"stock res"},"2000600",0,"SO Colissimo(code=SOC) / orig=",null,{"$f":"INDIRECT(\"Feuil3!\" & ADDRESS(ROW(I32),COLUMN(I32)))","v":0},"",0,{"$f":"INDEX(Récapitulatifs!$F$4:$F$250,MATCH($E35,Récapitulatifs!$B$4:$B$250,0))","v":0},"DISPO CHEZ MOI"]
[0,"A",1,{"$f":"INDIRECT(\"Feuil3!\" & ADDRESS(ROW(D33),COLUMN(D33)))","v":0},"CDAL-116922",0,"SO Colissimo(code=SOC) / orig=",null,{"$f":"INDIRECT(\"Feuil3!\" & ADDRESS(ROW(I33),COLUMN(I33)))","v":0},"",0,{"$f":"INDEX(Récapitulatifs!$F$4:$F$250,MATCH($E36,Récapitulatifs!$B$4:$B$250,0))","v":0},""]
[0,"A",1,{"$f":"INDIRECT(\"Feuil3!\" & ADDRESS(ROW(D34),COLUMN(D34)))","v":"stock res"},"800800",0,"SO Colissimo(code=SOC) / orig=",null,{"$f":"INDIRECT(\"Feuil3!\" & ADDRESS(ROW(I34),COLUMN(I34)))","v":0},"",{"$f":"INDIRECT(\"Feuil3!\" & ADDRESS(ROW(J34),COLUMN(J34)))","v":0},{"$f":"INDEX(Récapitulatifs!$F$4:$F$250,MATCH($E37,Récapitulatifs!$B$4:$B$250,0))","v":0},{"$f":"IF(D37=\"STOCK RES\",\"DISPO CHEZ MOI\",IF(D37=\"Sold Out\",\"STOCK A VERIFIER\",\"\"))","v":"DISPO CHEZ MOI"}]
[0,"A",1,{"$f":"INDIRECT(\"Feuil3!\" & ADDRESS(ROW(D35),COLUMN(D35)))","v":0},"30503",0,"SO Colissimo(code=SOC) / orig=",null,{"$f":"INDIRECT(\"Feuil3!\" & ADDRESS(ROW(I35),COLUMN(I35)))","v":0},"",0,{"$f":"INDEX(Récapitulatifs!$F$4:$F$250,MATCH($E38,Récapitulatifs!$B$4:$B$250,0))","v":0},""]
[0,"A",1,{"$f":"INDIRECT(\"Feuil3!\" & ADDRESS(ROW(D36),COLUMN(D36)))","v":0},"30502",0,"SO Colissimo(code=SOC) / orig=",null,{"$f":"INDIRECT(\"Feuil3!\" & ADDRESS(ROW(I36),COLUMN(I36)))","v":0},"",0,{"$f":"INDEX(Récapitulatifs!$F$4:$F$250,MATCH($E39,Récapitulatifs!$B$4:$B$250,0))","v":0},""]
[0,"A",1,{"$f":"INDIRECT(\"Feuil3!\" & ADDRESS(ROW(D37),COLUMN(D37)))","v":0},"199006",0,"SO Colissimo(code=SOC) / orig=",null,{"$f":"INDIRECT(\"Feuil3!\" & ADDRESS(ROW(I37),COLUMN(I37)))","v":0},"",0,{"$f":"INDEX(Récapitulatifs!$F$4:$F$250,MATCH($E40,Récapitulatifs!$B$4:$B$250,0))","v":0},""]
[0,"A",1,{"$f":"INDIRECT(\"Feuil3!\" & ADDRESS(ROW(D38),COLUMN(D38)))","v":0},"71065XDEUX",0,"SO Colissimo(code=SOC) / orig=",null,{"$f":"INDIRECT(\"Feuil3!\" & ADDRESS(ROW(I38),COLUMN(I38)))","v":0},"",0,{"$f":"INDEX(Récapitulatifs!$F$4:$F$250,MATCH($E41,Récapitulatifs!$B$4:$B$250,0))","v":0},""]
[0,"A",2,{"$f":"INDIRECT(\"Feuil3!\" & ADDRESS(ROW(D39),COLUMN(D39)))","v":"stock res"},"86286X",0,"SO Colissimo(code=SOC) / orig=",null,{"$f":"INDIRECT(\"Feuil3!\" & ADDRESS(ROW(I39),COLUMN(I39)))","v":0},"",0,{"$f":"INDEX(Récapitulatifs!$F$4:$F$250,MATCH($E42,Récapitulatifs!$B$4:$B$250,0))","v":0},"DISPO CHEZ MOI"]
[0,"A",1,{"$f":"INDIRECT(\"Feuil3!\" & ADDRESS(ROW(D40),COLUMN(D40)))","v":"stock res"},"86404X",0,"SO Colissimo(code=SOC) / orig=",null,{"$f":"INDIRECT(\"Feuil3!\" & ADDRESS(ROW(I40),COLUMN(I40)))","v":0},"",0,{"$f":"INDEX(Récapitulatifs!$F$4:$F$250,MATCH($E43,Récapitulatifs!$B$4:$B$250,0))","v":0},"DISPO CHEZ MOI"]
[0,"A",1,{"$f":"INDIRECT(\"Feuil3!\" & ADDRESS(ROW(D41),COLUMN(D41)))","v":0},"SPILU54582",0,"SO Colissimo(code=SOC) / orig=",null,{"$f":"INDIRECT(\"Feuil3!\" & ADDRESS(ROW(I41),COLUMN(I41)))","v":0},"",0,{"$f":"INDEX(Récapitulatifs!$F$4:$F$250,MATCH($E44,Récapitulatifs!$B$4:$B$250,0))","v":0},""]
[0,"A",2,{"$f":"INDIRECT(\"Feuil3!\" & ADDRESS(ROW(D42),COLUMN(D42)))","v":0},"26027","RADIA","SO Colissimo(code=SOC) / orig=",null,{"$f":"INDIRECT(\"Feuil3!\" & ADDRESS(ROW(I42),COLUMN(I42)))","v":0},"",0,{"$f":"INDEX(Récapitulatifs!$F$4:$F$250,MATCH($E45,Récapitulatifs!$B$4:$B$250,0))","v":0},""]
[{"$f":"INDIRECT(\"Feuil3!\" & ADDRESS(ROW(A43),COLUMN(A43)))","v":0},"A",1,0,"A14541",0,"SO Colissimo(code=SOC) / orig=",null,0,{"$f":"IF(LEFT(I46,1)=\"M\",\"MONDIAL RELAY\",IF(LEFT(I46,1)=\"E\",\"PREPASECURE\",IF(LEFT(I46,1)=\"S\",\"SO COLISSIMO\",IF(LEFT(I46,2)=\"CO\",\"COLISSIMO\",IF(LEFT(I46,2)=\"CH\",\"CHRONOPOST\",\"\")))))","v":""},{"$f":"INDIRECT(\"Feuil3!\" & ADDRESS(ROW(J43),COLUMN(J43)))","v":0},{"$f":"INDEX(Récapitulatifs!$F$4:$F$250,MATCH($E46,Récapitulatifs!$B$4:$B$250,0))","v":0},{"$f":"IF(D46=\"STOCK RES\",\"DISPO CHEZ MOI\",IF(D46=\"Sold Out\",\"STOCK A VERIFIER\",\"\"))","v":""}]
[{"$f":"INDIRECT(\"Feuil3!\" & ADDRESS(ROW(A44),COLUMN(A44)))","v":0},"A",1,"stock res","2335",0,"SO Colissimo(code=SOC) / orig=",null,0,"",0,{"$f":"INDEX(Récapitulatifs!$F$4:$F$250,MATCH($E47,Récapitulatifs!$B$4:$B$250,0))","v":0},"DISPO CHEZ MOI"]
[{"$f":"INDIRECT(\"Feuil3!\" & ADDRESS(ROW(A45),COLUMN(A45)))","v":0},"A",1,"stock res","MECA3836",0,"SO Colissimo(code=SOC) / orig=",null,0,"",0,{"$f":"INDEX(Récapitulatifs!$F$4:$F$250,MATCH($E48,Récapitulatifs!$B$4:$B$250,0))","v":0},"DISPO CHEZ MOI"]
[{"$f":"INDIRECT(\"Feuil3!\" & ADDRESS(ROW(A46),COLUMN(A46)))","v":0},"A",1,0,"88091",0,"SO Colissimo(code=SOC) / orig=",null,0,"",0,{"$f":"INDEX(Récapitulatifs!$F$4:$F$250,MATCH($E49,Récapitulatifs!$B$4:$B$250,0))","v":0},""]
[{"$f":"INDIRECT(\"Feuil3!\" & ADDRESS(ROW(A47),COLUMN(A47)))","v":0},"A",1,0,"RAD1000450",0,"SO Colissimo(code=SOC) / orig=",null,0,"",0,{"$f":"INDEX(Récapitulatifs!$F$4:$F$250,MATCH($E50,Récapitulatifs!$B$4:$B$250,0))","v":0},""]
[{"$f":"INDIRECT(\"Feuil3!\" & ADDRESS(ROW(A48),COLUMN(A48)))","v":0},"A",1,0,"RAD1000600",0,"SO Colissimo(code=SOC) / orig=",null,0,"",0,{"$f":"INDEX(Récapitulatifs!$F$4:$F$250,MATCH($E51,Récapitulatifs!$B$4:$B$250,0))","v":0},""]
[{"$f":"INDIRECT(\"Feuil3!\" & ADDRESS(ROW(A49),COLUMN(A49)))","v":0},"A",1,"stock res","1063",0,"SO Colissimo(code=SOC) / orig=",null,0,"",0,{"$f":"INDEX(Récapitulatifs!$F$4:$F$250,MATCH($E52,Récapitulatifs!$B$4:$B$250,0))","v":0},"DISPO CHEZ MOI"]
[{"$f":"INDIRECT(\"Feuil3!\" & ADDRESS(ROW(A50),COLUMN(A50)))","v":0},"A",1,0,"GLC42230",0,"SO Colissimo(code=SOC) / orig=",null,0,"",0,{"$f":"INDEX(Récapitulatifs!$F$4:$F$250,MATCH($E53,Récapitulatifs!$B$4:$B$250,0))","v":0},""]
[{"$f":"INDIRECT(\"Feuil3!\" & ADDRESS(ROW(A51),COLUMN(A51)))","v":0},"A",1,0,"350240XDEUX","MECA","SO Colissimo(code=SOC) / orig=",null,0,"",0,{"$f":"INDEX(Récapitulatifs!$F$4:$F$250,MATCH($E54,Récapitulatifs!$B$4:$B$250,0))","v":0},""]
[{"$f":"INDIRECT(\"Feuil3!\" & ADDRESS(ROW(A52),COLUMN(A52)))","v":0},"A",1,0,"9659",0,"SO Colissimo(code=SOC) / orig=",null,0,"",0,{"$f":"INDEX(Récapitulatifs!$F$4:$F$250,MATCH($E55,Récapitulatifs!$B$4:$B$250,0))","v":0},""]
[{"$f":"INDIRECT(\"Feuil3!\" & ADDRESS(ROW(A53),COLUMN(A53)))","v":0},"A",1,"stock res","4741",0,"SO Colissimo(code=SOC) / orig=",null,0,"",0,{"$f":"INDEX(Récapitulatifs!$F$4:$F$250,MATCH($E56,Récapitulatifs!$B$4:$B$250,0))","v":0},"DISPO CHEZ MOI"]
[{"$f":"INDIRECT(\"Feuil3!\" & ADDRESS(ROW(A54),COLUMN(A54)))","v":0},"A",1,"stock res","MECA3836",0,"SO Colissimo(code=SOC) / orig=",null,0,"",0,{"$f":"INDEX(Récapitulatifs!$F$4:$F$250,MATCH($E57,Récapitulatifs!$B$4:$B$250,0))","v":0},"DISPO CHEZ MOI"]
[{"$f":"INDIRECT(\"Feuil3!\" & ADDRESS(ROW(A55),COLUMN(A55)))","v":0},"A",2,0,"96042",0,"SO Colissimo(code=SOC) / orig=",null,0,"",0,{"$f":"INDEX(Récapitulatifs!$F$4:$F$250,MATCH($E58,Récapitulatifs!$B$4:$B$250,0))","v":0},""]
[{"$f":"INDIRECT(\"Feuil3!\" & ADDRESS(ROW(A56),COLUMN(A56)))","v":0},"A",1,0,"GLC43812",0,"SO Colissimo(code=SOC) / orig=",null,0,"",0,{"$f":"INDEX(Récapitulatifs!$F$4:$F$250,MATCH($E59,Récapitulatifs!$B$4:$B$250,0))","v":0},""]
[{"$f":"INDIRECT(\"Feuil3!\" & ADDRESS(ROW(A57),COLUMN(A57)))","v":0},"A",2,0,"88599",0,"SO Colissimo(code=SOC) / orig=",null,0,"",0,{"$f":"INDEX(Récapitulatifs!$F$4:$F$250,MATCH($E60,Récapitulatifs!$B$4:$B$250,0))","v":0},""]
[{"$f":"INDIRECT(\"Feuil3!\" & ADDRESS(ROW(A58),COLUMN(A58)))","v":0},"A",1,"stock res","4725",0,"SO Colissimo(code=SOC) / orig=",null,0,"",0,{"$f":"INDEX(Récapitulatifs!$F$4:$F$250,MATCH($E61,Récapitulatifs!$B$4:$B$250,0))","v":0},"DISPO CHEZ MOI"]
[{"$f":"INDIRECT(\"Feuil3!\" & ADDRESS(ROW(A59),COLUMN(A59)))","v":0},"A",1,0,"A1300XDEUX",0,"SO Colissimo(code=SOC) / orig=",null,0,"",0,{"$f":"INDEX(Récapitulatifs!$F$4:$F$250,MATCH($E62,Récapitulatifs!$B$4:$B$250,0))","v":0},""]
[{"$f":"INDIRECT(\"Feuil3!\" & ADDRESS(ROW(A60),COLUMN(A60)))","v":0},"A",1,"stock res","FH001z",0,"SO Colissimo(code=SOC) / orig=",null,0,"",0,{"$f":"INDEX(Récapitulatifs!$F$4:$F$250,MATCH($E63,Récapitulatifs!$B$4:$B$250,0))","v":0},"DISPO CHEZ MOI"]
[{"$f":"INDIRECT(\"Feuil3!\" & ADDRESS(ROW(A61),COLUMN(A61)))","v":0},"A",1,0,"FH002z",0,"SO Colissimo(code=SOC) / orig=",null,0,"",0,{"$f":"INDEX(Récapitulatifs!$F$4:$F$250,MATCH($E64,Récapitulatifs!$B$4:$B$250,0))","v":0},""]
[{"$f":"INDIRECT(\"Feuil3!\" & ADDRESS(ROW(A62),COLUMN(A62)))","v":0},"A",1,0,"78054",0,"SO Colissimo(code=SOC) / orig=",null,0,"",0,{"$f":"INDEX(Récapitulatifs!$F$4:$F$250,MATCH($E65,Récapitulatifs!$B$4:$B$250,0))","v":0},""]
[{"$f":"INDIRECT(\"Feuil3!\" & ADDRESS(ROW(A63),COLUMN(A63)))","v":0},"A",2,0,"MECA4177",0,"SO Colissimo(code=SOC) / orig=",null,0,"",0,{"$f":"INDEX(Récapitulatifs!$F$4:$F$250,MATCH($E66,Récapitulatifs!$B$4:$B$250,0))","v":0},""]
[{"$f":"INDIRECT(\"Feuil3!\" & ADDRESS(ROW(A64),COLUMN(A64)))","v":0},"A",2,0,"MECA4320",0,"SO Colissimo(code=SOC) / orig=",null,0,"",0,{"$f":"INDEX(Récapitulatifs!$F$4:$F$250,MATCH($E67,Récapitulatifs!$B$4:$B$250,0))","v":0},""]
[{"$f":"INDIRECT(\"Feuil3!\" & ADDRESS(ROW(A65),COLUMN(A65)))","v":0},"A",1,"stock res","5156",0,"SO Colissimo(code=SOC) / orig=",null,0,"",0,{"$f":"INDEX(Récapitulatifs!$F$4:$F$250,MATCH($E68,Récapitulatifs!$B$4:$B$250,0))","v":0},"DISPO CHEZ MOI"]
[{"$f":"INDIRECT(\"Feuil3!\" & ADDRESS(ROW(A66),COLUMN(A66)))","v":0},"A",1,0,"2118",0,"SO Colissimo(code=SOC) / orig=",null,0,"",0,{"$f":"INDEX(Récapitulatifs!$F$4:$F$250,MATCH($E69,Récapitulatifs!$B$4:$B$250,0))","v":0},""]
[{"$f":"INDIRECT(\"Feuil3!\" & ADDRESS(ROW(A67),COLUMN(A67)))","v":0},"A",1,0,"816151X2",0,"SO Colissimo(code=SOC) / orig=",null,0,"",0,{"$f":"INDEX(Récapitulatifs!$F$4:$F$250,MATCH($E70,Récapitulatifs!$B$4:$B$250,0))","v":0},""]
[{"$f":"INDIRECT(\"Feuil3!\" & ADDRESS(ROW(A68),COLUMN(A68)))","v":0},"A",1,0,"3653",0,"SO Colissimo(code=SOC) / orig=",null,0,"",0,{"$f":"INDEX(Récapitulatifs!$F$4:$F$250,MATCH($E71,Récapitulatifs!$B$4:$B$250,0))","v":0},""]
[{"$f":"INDIRECT(\"Feuil3!\" & ADDRESS(ROW(A69),COLUMN(A69)))","v":0},"A",1,"stock res","800200",0,"SO Colissimo(code=SOC) / orig=",null,0,"",0,{"$f":"INDEX(Récapitulatifs!$F$4:$F$250,MATCH($E72,Récapitulatifs!$B$4:$B$250,0))","v":0},"DISPO CHEZ MOI"]
[{"$f":"INDIRECT(\"Feuil3!\" & ADDRESS(ROW(A70),COLUMN(A70)))","v":0},"A",1,0,"MECA5386",0,"SO Colissimo(code=SOC) / orig=",null,0,"",0,{"$f":"INDEX(Récapitulatifs!$F$4:$F$250,MATCH($E73,Récapitulatifs!$B$4:$B$250,0))","v":0},""]
[{"$f":"INDIRECT(\"Feuil3!\" & ADDRESS(ROW(A71),COLUMN(A71)))","v":0},"A",1,0,"BEZ600124XDEUX",0,"SO Colissimo(code=SOC) / orig=",null,0,"",0,{"$f":"INDEX(Récapitulatifs!$F$4:$F$250,MATCH($E74,Récapitulatifs!$B$4:$B$250,0))","v":0},""]
[{"$f":"INDIRECT(\"Feuil3!\" & ADDRESS(ROW(A72),COLUMN(A72)))","v":0},"A",1,"stock res","4740",0,"SO Colissimo(code=SOC) / orig=",null,0,"",0,{"$f":"INDEX(Récapitulatifs!$F$4:$F$250,MATCH($E75,Récapitulatifs!$B$4:$B$250,0))","v":0},"DISPO CHEZ MOI"]
[{"$f":"INDIRECT(\"Feuil3!\" & ADDRESS(ROW(A73),COLUMN(A73)))","v":0},"A",1,"stock res","4760",0,"SO Colissimo(code=SOC) / orig=",null,0,"",0,{"$f":"INDEX(Récapitulatifs!$F$4:$F$250,MATCH($E76,Récapitulatifs!$B$4:$B$250,0))","v":0},"DISPO CHEZ MOI"]
[{"$f":"INDIRECT(\"Feuil3!\" & ADDRESS(ROW(A74),COLUMN(A74)))","v":0},"A",1,0,"BEZ600286XDEUX",0,"SO Colissimo(code=SOC) / orig=",null,0,"",0,{"$f":"INDEX(Récapitulatifs!$F$4:$F$250,MATCH($E77,Récapitulatifs!$B$4:$B$250,0))","v":0},""]
[{"$f":"INDIRECT(\"Feuil3!\" & ADDRESS(ROW(A75),COLUMN(A75)))","v":0},"A",1,0,"800700",0,"SO Colissimo(code=SOC) / orig=",null,0,"",0,{"$f":"INDEX(Récapitulatifs!$F$4:$F$250,MATCH($E78,Récapitulatifs!$B$4:$B$250,0))","v":0},""]
[{"$f":"INDIRECT(\"Feuil3!\" & ADDRESS(ROW(A76),COLUMN(A76)))","v":0},"A",1,0,"MECA8015",0,"SO Colissimo(code=SOC) / orig=",null,0,"",0,{"$f":"INDEX(Récapitulatifs!$F$4:$F$250,MATCH($E79,Récapitulatifs!$B$4:$B$250,0))","v":0},""]
[{"$f":"INDIRECT(\"Feuil3!\" & ADDRESS(ROW(A77),COLUMN(A77)))","v":0},"A",1,0,"79095",0,"SO Colissimo(code=SOC) / orig=",null,0,"",0,{"$f":"INDEX(Récapitulatifs!$F$4:$F$250,MATCH($E80,Récapitulatifs!$B$4:$B$250,0))","v":0},""]
[{"$f":"INDIRECT(\"Feuil3!\" & ADDRESS(ROW(A78),COLUMN(A78)))","v":0},"A",1,"stock res","4725",0,"SO Colissimo(code=SOC) / orig=",null,0,"",0,{"$f":"INDEX(Récapitulatifs!$F$4:$F$250,MATCH($E81,Récapitulatifs!$B$4:$B$250,0))","v":0},"DISPO CHEZ MOI"]
[{"$f":"INDIRECT(\"Feuil3!\" & ADDRESS(ROW(A79),COLUMN(A79)))","v":0},"A",1,0,"81795",0,"SO Colissimo(code=SOC) / orig=",null,0,"",0,{"$f":"INDEX(Récapitulatifs!$F$4:$F$250,MATCH($E82,Récapitulatifs!$B$4:$B$250,0))","v":0},""]
[{"$f":"INDIRECT(\"Feuil3!\" & ADDRESS(ROW(A80),COLUMN(A80)))","v":0},"A",1,0,"28553",0,"SO Colissimo(code=SOC) / orig=",null,0,"",0,{"$f":"INDEX(Récapitulatifs!$F$4:$F$250,MATCH($E83,Récapitulatifs!$B$4:$B$250,0))","v":0},""]
[{"$f":"INDIRECT(\"Feuil3!\" & ADDRESS(ROW(A81),COLUMN(A81)))","v":0},"A",1,0,"28554",0,"SO Colissimo(code=SOC) / orig=",null,0,"",0,{"$f":"INDEX(Récapitulatifs!$F$4:$F$250,MATCH($E84,Récapitulatifs!$B$4:$B$250,0))","v":0},""]
[{"$f":"INDIRECT(\"Feuil3!\" & ADDRESS(ROW(A82),COLUMN(A82)))","v":0},"A",1,"stock res","599610","STORM","SO Colissimo(code=SOC) / orig=",null,0,"",0,{"$f":"INDEX(Récapitulatifs!$F$4:$F$250,MATCH($E85,Récapitulatifs!$B$4:$B$250,0))","v":0},"DISPO CHEZ MOI"]
[{"$f":"INDIRECT(\"Feuil3!\" & ADDRESS(ROW(A83),COLUMN(A83)))","v":0},"A",1,"stock res","KF15948",0,"SO Colissimo(code=SOC) / orig=",null,0,"",0,{"$f":"INDEX(Récapitulatifs!$F$4:$F$250,MATCH($E86,Récapitulatifs!$B$4:$B$250,0))","v":0},"DISPO CHEZ MOI"]
[{"$f":"INDIRECT(\"Feuil3!\" & ADDRESS(ROW(A84),COLUMN(A84)))","v":0},"A",1,"stock res","4725",0,"SO Colissimo(code=SOC) / orig=",null,0,"",0,{"$f":"INDEX(Récapitulatifs!$F$4:$F$250,MATCH($E87,Récapitulatifs!$B$4:$B$250,0))","v":0},"DISPO CHEZ MOI"]
[{"$f":"INDIRECT(\"Feuil3!\" & ADDRESS(ROW(A85),COLUMN(A85)))","v":0},"A",1,0,"288100",0,0,null,0,"",0,{"$f":"INDEX(Récapitulatifs!$F$4:$F$250,MATCH($E88,Récapitulatifs!$B$4:$B$250,0))","v":0},""]
[{"$f":"INDIRECT(\"Feuil3!\" & ADDRESS(ROW(A86),COLUMN(A86)))","v":0},"A",1,0,"BEZLX1282","BEZIAT",0,null,0,"",0,{"$f":"INDEX(Récapitulatifs!$F$4:$F$250,MATCH($E89,Récapitulatifs!$B$4:$B$250,0))","v":0},""]
[{"$f":"INDIRECT(\"Feuil3!\" & ADDRESS(ROW(A87),COLUMN(A87)))","v":0},"A",1,0,"BEZOX171-2D",0,0,null,0,"",0,{"$f":"INDEX(Récapitulatifs!$F$4:$F$250,MATCH($E90,Récapitulatifs!$B$4:$B$250,0))","v":0},""]
[{"$f":"INDIRECT(\"Feuil3!\" & ADDRESS(ROW(A88),COLUMN(A88)))","v":0},"A",1,0,"FC033z",0,0,null,0,"",0,{"$f":"INDEX(Récapitulatifs!$F$4:$F$250,MATCH($E91,Récapitulatifs!$B$4:$B$250,0))","v":0},""]
[{"$f":"INDIRECT(\"Feuil3!\" & ADDRESS(ROW(A89),COLUMN(A89)))","v":0},"A",1,0,"MECA5391",0,0,null,0,"",0,{"$f":"INDEX(Récapitulatifs!$F$4:$F$250,MATCH($E92,Récapitulatifs!$B$4:$B$250,0))","v":0},""]
[{"$f":"INDIRECT(\"Feuil3!\" & ADDRESS(ROW(A90),COLUMN(A90)))","v":0},"A",1,0,"999706",0,"Transport Train Arrière(code=TNT) / orig=",null,0,"",0,{"$f":"INDEX(Récapitulatifs!$F$4:$F$250,MATCH($E93,Récapitulatifs!$B$4:$B$250,0))","v":0},""]
[{"$f":"INDIRECT(\"Feuil3!\" & ADDRESS(ROW(A91),COLUMN(A91)))","v":0},"A",1,0,"CARTER999001",0,"SO Colissimo(code=SOC) / orig=",null,0,"",0,{"$f":"INDEX(Récapitulatifs!$F$4:$F$250,MATCH($E94,Récapitulatifs!$B$4:$B$250,0))","v":0},""]
[{"$f":"INDIRECT(\"Feuil3!\" & ADDRESS(ROW(A92),COLUMN(A92)))","v":0},"A",1,"stock res","99902",0,"SO Colissimo(code=SOC) / orig=",null,0,"",0,{"$f":"INDEX(Récapitulatifs!$F$4:$F$250,MATCH($E95,Récapitulatifs!$B$4:$B$250,0))","v":0},"DISPO CHEZ MOI"]
[{"$f":"INDIRECT(\"Feuil3!\" & ADDRESS(ROW(A93),COLUMN(A93)))","v":0},"A",1,0,"100001UNITE",0,"SO Colissimo(code=SOC) / orig=",null,0,"",0,{"$f":"INDEX(Récapitulatifs!$F$4:$F$250,MATCH($E96,Récapitulatifs!$B$4:$B$250,0))","v":0},""]
[{"$f":"INDIRECT(\"Feuil3!\" & ADDRESS(ROW(A94),COLUMN(A94)))","v":0},"A",1,0,"313501",0,"SO Colissimo(code=SOC) / orig=",null,0,"",0,{"$f":"INDEX(Récapitulatifs!$F$4:$F$250,MATCH($E97,Récapitulatifs!$B$4:$B$250,0))","v":0},""]
[{"$f":"INDIRECT(\"Feuil3!\" & ADDRESS(ROW(A95),COLUMN(A95)))","v":0},"A",1,0,"70566XDEUX",0,"SO Colissimo(code=SOC) / orig=",null,0,"",0,{"$f":"INDEX(Récapitulatifs!$F$4:$F$250,MATCH($E98,Récapitulatifs!$B$4:$B$250,0))","v":0},""]
[{"$f":"INDIRECT(\"Feuil3!\" & ADDRESS(ROW(A96),COLUMN(A96)))","v":0},"A",1,0,"111114",0,"SO Colissimo(code=SOC) / orig=",null,0,"",0,{"$f":"INDEX(Récapitulatifs!$F$4:$F$250,MATCH($E99,Récapitulatifs!$B$4:$B$250,0))","v":0},""]
[{"$f":"INDIRECT(\"Feuil3!\" & ADDRESS(ROW(A97),COLUMN(A97)))","v":0},"A",1,0,"502043X4",0,"SO Colissimo(code=SOC) / orig=",null,0,"",0,{"$f":"INDEX(Récapitulatifs!$F$4:$F$250,MATCH($E100,Récapitulatifs!$B$4:$B$250,0))","v":0},""]
[{"$f":"INDIRECT(\"Feuil3!\" & ADDRESS(ROW(A98),COLUMN(A98)))","v":0},"A",1,0,"199006",0,"SO Colissimo(code=SOC) / orig=",null,0,"",0,{"$f":"INDEX(Récapitulatifs!$F$4:$F$250,MATCH($E101,Récapitulatifs!$B$4:$B$250,0))","v":0},""]
[{"$f":"INDIRECT(\"Feuil3!\" & ADDRESS(ROW(A99),COLUMN(A99)))","v":0},"A",1,0,"FA048z","CDAL","SO Colissimo(code=SOC) / orig=",null,0,"",0,{"$f":"INDEX(Récapitulatifs!$F$4:$F$250,MATCH($E102,Récapitulatifs!$B$4:$B$250,0))","v":0},""]
[{"$f":"INDIRECT(\"Feuil3!\" & ADDRESS(ROW(A100),COLUMN(A100)))","v":0},"A",1,0,"526373X4",0,"SO Colissimo(code=SOC) / orig=",null,0,"",0,{"$f":"INDEX(Récapitulatifs!$F$4:$F$250,MATCH($E103,Récapitulatifs!$B$4:$B$250,0))","v":0},""]
[{"$f":"INDIRECT(\"Feuil3!\" & ADDRESS(ROW(A101),COLUMN(A101)))","v":0},"A",1,0,"9960C",0,"SO Colissimo(code=SOC) / orig=",null,0,"",0,{"$f":"INDEX(Récapitulatifs!$F$4:$F$250,MATCH($E104,Récapitulatifs!$B$4:$B$250,0))","v":0},""]
[{"$f":"INDIRECT(\"Feuil3!\" & ADDRESS(ROW(A102),COLUMN(A102)))","v":0},"A",1,0,"87132",0,"SO Colissimo(code=SOC) / orig=",null,0,"",0,{"$f":"INDEX(Récapitulatifs!$F$4:$F$250,MATCH($E105,Récapitulatifs!$B$4:$B$250,0))","v":0},""]
[{"$f":"INDIRECT(\"Feuil3!\" & ADDRESS(ROW(A103),COLUMN(A103)))","v":0},"A",1,0,"89090",0,"SO Colissimo(code=SOC) / orig=",null,0,"",0,{"$f":"INDEX(Récapitulatifs!$F$4:$F$250,MATCH($E106,Récapitulatifs!$B$4:$B$250,0))","v":0},""]
[{"$f":"INDIRECT(\"Feuil3!\" & ADDRESS(ROW(A104),COLUMN(A104)))","v":0},"A",1,"stock res","88090",0,"SO Colissimo(code=SOC) / orig=",null,0,"",0,{"$f":"INDEX(Récapitulatifs!$F$4:$F$250,MATCH($E107,Récapitulatifs!$B$4:$B$250,0))","v":0},"DISPO CHEZ MOI"]
[{"$f":"INDIRECT(\"Feuil3!\" & ADDRESS(ROW(A105),COLUMN(A105)))","v":0},"A",1,"stock res","88098XDEUX",0,"SO Colissimo(code=SOC) / orig=",null,0,"",0,{"$f":"INDEX(Récapitulatifs!$F$4:$F$250,MATCH($E108,Récapitulatifs!$B$4:$B$250,0))","v":0},"DISPO CHEZ MOI"]
[{"$f":"INDIRECT(\"Feuil3!\" & ADDRESS(ROW(A106),COLUMN(A106)))","v":0},"A",1,"stock res","199000",0,"SO Colissimo(code=SOC) / orig=",null,{"$f":"INDIRECT(\"Feuil3!\" & ADDRESS(ROW(I106),COLUMN(I106)))","v":0},"",0,{"$f":"INDEX(Récapitulatifs!$F$4:$F$250,MATCH($E109,Récapitulatifs!$B$4:$B$250,0))","v":0},"DISPO CHEZ MOI"]
[{"$f":"INDIRECT(\"Feuil3!\" & ADDRESS(ROW(A107),COLUMN(A107)))","v":0},"A",1,"stock res","5169",0,"SO Colissimo(code=SOC) / orig=",null,0,{"$f":"IF(LEFT(I110,1)=\"M\",\"MONDIAL RELAY\",IF(LEFT(I110,1)=\"E\",\"PREPASECURE\",IF(LEFT(I110,1)=\"S\",\"SO COLISSIMO\",IF(LEFT(I110,2)=\"CO\",\"COLISSIMO\",IF(LEFT(I110,2)=\"CH\",\"CHRONOPOST\",\"\")))))","v":""},{"$f":"INDIRECT(\"Feuil3!\" & ADDRESS(ROW(J107),COLUMN(J107)))","v":0},{"$f":"INDEX(Récapitulatifs!$F$4:$F$250,MATCH($E110,Récapitulatifs!$B$4:$B$250,0))","v":0},{"$f":"IF(D110=\"STOCK RES\",\"DISPO CHEZ MOI\",IF(D110=\"Sold Out\",\"STOCK A VERIFIER\",\"\"))","v":"DISPO CHEZ MOI"}]
[{"$f":"INDIRECT(\"Feuil3!\" & ADDRESS(ROW(A108),COLUMN(A108)))","v":0},"A",1,0,"152760","STORM","SO Colissimo(code=SOC) / orig=",null,0,"",0,{"$f":"INDEX(Récapitulatifs!$F$4:$F$250,MATCH($E111,Récapitulatifs!$B$4:$B$250,0))","v":0},""]
[{"$f":"INDIRECT(\"Feuil3!\" & ADDRESS(ROW(A109),COLUMN(A109)))","v":0},"A",1,0,"14575",0,"SO Colissimo(code=SOC) / orig=",null,0,"",0,{"$f":"INDEX(Récapitulatifs!$F$4:$F$250,MATCH($E112,Récapitulatifs!$B$4:$B$250,0))","v":0},""]
[{"$f":"INDIRECT(\"Feuil3!\" & ADDRESS(ROW(A110),COLUMN(A110)))","v":0},"A",1,0,"BEZ600102XDEUX",0,"SO Colissimo(code=SOC) / orig=",null,0,"",0,{"$f":"INDEX(Récapitulatifs!$F$4:$F$250,MATCH($E113,Récapitulatifs!$B$4:$B$250,0))","v":0},""]
[{"$f":"INDIRECT(\"Feuil3!\" & ADDRESS(ROW(A111),COLUMN(A111)))","v":0},"A",1,0,"6PK1713",0,"SO Colissimo(code=SOC) / orig=",null,0,"",0,{"$f":"INDEX(Récapitulatifs!$F$4:$F$250,MATCH($E114,Récapitulatifs!$B$4:$B$250,0))","v":0},""]
[{"$f":"INDIRECT(\"Feuil3!\" & ADDRESS(ROW(A112),COLUMN(A112)))","v":0},"A",2,0,"CDAL-54506z",0,"SO Colissimo(code=SOC) / orig=",null,0,"",0,{"$f":"INDEX(Récapitulatifs!$F$4:$F$250,MATCH($E115,Récapitulatifs!$B$4:$B$250,0))","v":0},""]
[{"$f":"INDIRECT(\"Feuil3!\" & ADDRESS(ROW(A113),COLUMN(A113)))","v":0},"A",1,"stock res","124150","STORM","SO Colissimo(code=SOC) / orig=",null,0,"",0,{"$f":"INDEX(Récapitulatifs!$F$4:$F$250,MATCH($E116,Récapitulatifs!$B$4:$B$250,0))","v":0},"DISPO CHEZ MOI"]
[{"$f":"INDIRECT(\"Feuil3!\" & ADDRESS(ROW(A114),COLUMN(A114)))","v":0},"A",1,"stock res","83524",0,"SO Colissimo(code=SOC) / orig=",null,0,"",0,{"$f":"INDEX(Récapitulatifs!$F$4:$F$250,MATCH($E117,Récapitulatifs!$B$4:$B$250,0))","v":0},"DISPO CHEZ MOI"]
[{"$f":"INDIRECT(\"Feuil3!\" & ADDRESS(ROW(A115),COLUMN(A115)))","v":0},"A",1,0,"999995",0,"SO Colissimo(code=SOC) / orig=",null,0,"",0,{"$f":"INDEX(Récapitulatifs!$F$4:$F$250,MATCH($E118,Récapitulatifs!$B$4:$B$250,0))","v":0},""]
[{"$f":"INDIRECT(\"Feuil3!\" & ADDRESS(ROW(A116),COLUMN(A116)))","v":0},"A",1,0,"RI71130",0,"SO Colissimo(code=SOC) / orig=",null,0,"",0,{"$f":"INDEX(Récapitulatifs!$F$4:$F$250,MATCH($E119,Récapitulatifs!$B$4:$B$250,0))","v":0},""]
[{"$f":"INDIRECT(\"Feuil3!\" & ADDRESS(ROW(A117),COLUMN(A117)))","v":0},"A",1,0,"GS12475",0,"SO Colissimo(code=SOC) / orig=",null,0,"",0,{"$f":"INDEX(Récapitulatifs!$F$4:$F$250,MATCH($E120,Récapitulatifs!$B$4:$B$250,0))","v":0},""]
[{"$f":"INDIRECT(\"Feuil3!\" & ADDRESS(ROW(A118),COLUMN(A118)))","v":0},"A",1,"stock res","800990",0,"SO Colissimo(code=SOC) / orig=",null,0,"",0,{"$f":"INDEX(Récapitulatifs!$F$4:$F$250,MATCH($E121,Récapitulatifs!$B$4:$B$250,0))","v":0},"DISPO CHEZ MOI"]
[{"$f":"INDIRECT(\"Feuil3!\" & ADDRESS(ROW(A119),COLUMN(A119)))","v":0},"A",1,"stock res","124150","STORM",0,null,0,"",0,{"$f":"INDEX(Récapitulatifs!$F$4:$F$250,MATCH($E122,Récapitulatifs!$B$4:$B$250,0))","v":0},"DISPO CHEZ MOI"]
[{"$f":"INDIRECT(\"Feuil3!\" & ADDRESS(ROW(A120),COLUMN(A120)))","v":0},"A",1,"stock res","5156",0,"SO Colissimo(code=SOC) / orig=",null,0,"",0,{"$f":"INDEX(Récapitulatifs!$F$4:$F$250,MATCH($E123,Récapitulatifs!$B$4:$B$250,0))","v":0},"DISPO CHEZ MOI"]
[{"$f":"INDIRECT(\"Feuil3!\" & ADDRESS(ROW(A121),COLUMN(A121)))","v":0},"A",1,"stock res","4725",0,"SO Colissimo(code=SOC) / orig=",null,0,"",0,{"$f":"INDEX(Récapitulatifs!$F$4:$F$250,MATCH($E124,Récapitulatifs!$B$4:$B$250,0))","v":0},"DISPO CHEZ MOI"]
[{"$f":"INDIRECT(\"Feuil3!\" & ADDRESS(ROW(A122),COLUMN(A122)))","v":0},"A",1,0,"RI71132",0,"SO Colissimo(code=SOC) / orig=",null,0,"",0,{"$f":"INDEX(Récapitulatifs!$F$4:$F$250,MATCH($E125,Récapitulatifs!$B$4:$B$250,0))","v":0},""]
[{"$f":"INDIRECT(\"Feuil3!\" & ADDRESS(ROW(A123),COLUMN(A123)))","v":0},"A",1,"stock res","123890","STORM","SO Colissimo(code=SOC) / orig=",null,0,"",0,{"$f":"INDEX(Récapitulatifs!$F$4:$F$250,MATCH($E126,Récapitulatifs!$B$4:$B$250,0))","v":0},"DISPO CHEZ MOI"]
[{"$f":"INDIRECT(\"Feuil3!\" & ADDRESS(ROW(A124),COLUMN(A124)))","v":0},"A",1,0,"555555",0,"Transport Train Arrière(code=TNT) / orig=",null,0,"",0,{"$f":"INDEX(Récapitulatifs!$F$4:$F$250,MATCH($E127,Récapitulatifs!$B$4:$B$250,0))","v":0},""]
[{"$f":"INDIRECT(\"Feuil3!\" & ADDRESS(ROW(A125),COLUMN(A125)))","v":0},"A",1,0,"133600",0,"SO Colissimo(code=SOC) / orig=",null,0,"",0,{"$f":"INDEX(Récapitulatifs!$F$4:$F$250,MATCH($E128,Récapitulatifs!$B$4:$B$250,0))","v":0},""]
[{"$f":"INDIRECT(\"Feuil3!\" & ADDRESS(ROW(A126),COLUMN(A126)))","v":0},"A",1,0,"19599XDEUX",0,"SO Colissimo(code=SOC) / orig=",null,0,"",0,{"$f":"INDEX(Récapitulatifs!$F$4:$F$250,MATCH($E129,Récapitulatifs!$B$4:$B$250,0))","v":0},""]
[{"$f":"INDIRECT(\"Feuil3!\" & ADDRESS(ROW(A127),COLUMN(A127)))","v":0},"A",2,0,"1000350ST",0,"SO Colissimo(code=SOC) / orig=",null,0,"",0,{"$f":"INDEX(Récapitulatifs!$F$4:$F$250,MATCH($E130,Récapitulatifs!$B$4:$B$250,0))","v":0},""]
[{"$f":"INDIRECT(\"Feuil3!\" & ADDRESS(ROW(A128),COLUMN(A128)))","v":0},"A",1,"stock res","2335",0,"SO Colissimo(code=SOC) / orig=",null,0,"",0,{"$f":"INDEX(Récapitulatifs!$F$4:$F$250,MATCH($E131,Récapitulatifs!$B$4:$B$250,0))","v":0},"DISPO CHEZ MOI"]
[{"$f":"INDIRECT(\"Feuil3!\" & ADDRESS(ROW(A129),COLUMN(A129)))","v":0},"A",1,"stock res","83524",0,"SO Colissimo(code=SOC) / orig=",null,0,"",0,{"$f":"INDEX(Récapitulatifs!$F$4:$F$250,MATCH($E132,Récapitulatifs!$B$4:$B$250,0))","v":0},"DISPO CHEZ MOI"]
[{"$f":"INDIRECT(\"Feuil3!\" & ADDRESS(ROW(A130),COLUMN(A130)))","v":0},"A",1,0,"502024X4",0,"Enveloppes Rigides Avec Suivi(code=POS) / orig=",null,0,"",0,{"$f":"INDEX(Récapitulatifs!$F$4:$F$250,MATCH($E133,Récapitulatifs!$B$4:$B$250,0))","v":0},""]
[{"$f":"INDIRECT(\"Feuil3!\" & ADDRESS(ROW(A131),COLUMN(A131)))","v":0},"A",10,0,"CDAL-54504z",0,"SO Colissimo(code=SOC) / orig=",null,0,"",0,{"$f":"INDEX(Récapitulatifs!$F$4:$F$250,MATCH($E134,Récapitulatifs!$B$4:$B$250,0))","v":0},""]
[{"$f":"INDIRECT(\"Feuil3!\" & ADDRESS(ROW(A132),COLUMN(A132)))","v":0},"A",1,"stock res","4612",0,"SO Colissimo(code=SOC) / orig=",null,0,"",0,{"$f":"INDEX(Récapitulatifs!$F$4:$F$250,MATCH($E135,Récapitulatifs!$B$4:$B$250,0))","v":0},"DISPO CHEZ MOI"]
[{"$f":"INDIRECT(\"Feuil3!\" & ADDRESS(ROW(A133),COLUMN(A133)))","v":0},"A",1,"stock res","321040","STORM","SO Colissimo(code=SOC) / orig=",null,0,"",0,{"$f":"INDEX(Récapitulatifs!$F$4:$F$250,MATCH($E136,Récapitulatifs!$B$4:$B$250,0))","v":0},"DISPO CHEZ MOI"]
[{"$f":"INDIRECT(\"Feuil3!\" & ADDRESS(ROW(A134),COLUMN(A134)))","v":0},"A",1,0,"810781",0,"SO Colissimo(code=SOC) / orig=",null,0,"",0,{"$f":"INDEX(Récapitulatifs!$F$4:$F$250,MATCH($E137,Récapitulatifs!$B$4:$B$250,0))","v":0},""]
[{"$f":"INDIRECT(\"Feuil3!\" & ADDRESS(ROW(A135),COLUMN(A135)))","v":0},"A",1,0,"1000400ST",0,"SO Colissimo(code=SOC) / orig=",null,0,"",0,{"$f":"INDEX(Récapitulatifs!$F$4:$F$250,MATCH($E138,Récapitulatifs!$B$4:$B$250,0))","v":0},""]
[{"$f":"INDIRECT(\"Feuil3!\" & ADDRESS(ROW(A136),COLUMN(A136)))","v":0},"A",1,0,"1000600ST",0,"SO Colissimo(code=SOC) / orig=",null,0,"",0,{"$f":"INDEX(Récapitulatifs!$F$4:$F$250,MATCH($E139,Récapitulatifs!$B$4:$B$250,0))","v":0},""]
[{"$f":"INDIRECT(\"Feuil3!\" & ADDRESS(ROW(A137),COLUMN(A137)))","v":0},"A",1,0,"350240XDEUX","MECA","SO Colissimo(code=SOC) / orig=",null,0,"",0,{"$f":"INDEX(Récapitulatifs!$F$4:$F$250,MATCH($E140,Récapitulatifs!$B$4:$B$250,0))","v":0},""]
[{"$f":"INDIRECT(\"Feuil3!\" & ADDRESS(ROW(A138),COLUMN(A138)))","v":0},"A",1,"stock res","4740",0,"SO Colissimo(code=SOC) / orig=",null,0,"",0,{"$f":"INDEX(Récapitulatifs!$F$4:$F$250,MATCH($E141,Récapitulatifs!$B$4:$B$250,0))","v":0},"DISPO CHEZ MOI"]
[{"$f":"INDIRECT(\"Feuil3!\" & ADDRESS(ROW(A139),COLUMN(A139)))","v":0},"A",1,0,"321030","STORM","SO Colissimo(code=SOC) / orig=",null,0,"",0,{"$f":"INDEX(Récapitulatifs!$F$4:$F$250,MATCH($E142,Récapitulatifs!$B$4:$B$250,0))","v":0},""]
[{"$f":"INDIRECT(\"Feuil3!\" & ADDRESS(ROW(A140),COLUMN(A140)))","v":0},"A",1,0,"321020","STORM","SO Colissimo(code=SOC) / orig=",null,0,"",0,{"$f":"INDEX(Récapitulatifs!$F$4:$F$250,MATCH($E143,Récapitulatifs!$B$4:$B$250,0))","v":0},""]
[{"$f":"INDIRECT(\"Feuil3!\" & ADDRESS(ROW(A141),COLUMN(A141)))","v":0},"A",1,"stock res","4740",0,"SO Colissimo(code=SOC) / orig=",null,0,"",0,{"$f":"INDEX(Récapitulatifs!$F$4:$F$250,MATCH($E144,Récapitulatifs!$B$4:$B$250,0))","v":0},"DISPO CHEZ MOI"]
[{"$f":"INDIRECT(\"Feuil3!\" & ADDRESS(ROW(A142),COLUMN(A142)))","v":0},"A",1,0,"A304",0,"SO Colissimo(code=SOC) / orig=",null,0,"",0,{"$f":"INDEX(Récapitulatifs!$F$4:$F$250,MATCH($E145,Récapitulatifs!$B$4:$B$250,0))","v":0},""]
[{"$f":"INDIRECT(\"Feuil3!\" & ADDRESS(ROW(A143),COLUMN(A143)))","v":0},"A",1,0,"BEZ600260XDEUX",0,"SO Colissimo(code=SOC) / orig=",null,0,"",0,{"$f":"INDEX(Récapitulatifs!$F$4:$F$250,MATCH($E146,Récapitulatifs!$B$4:$B$250,0))","v":0},""]
[{"$f":"INDIRECT(\"Feuil3!\" & ADDRESS(ROW(A144),COLUMN(A144)))","v":0},"A",1,"stock res","4594",0,"SO Colissimo(code=SOC) / orig=",null,0,"",0,{"$f":"INDEX(Récapitulatifs!$F$4:$F$250,MATCH($E147,Récapitulatifs!$B$4:$B$250,0))","v":0},"DISPO CHEZ MOI"]
[{"$f":"INDIRECT(\"Feuil3!\" & ADDRESS(ROW(A145),COLUMN(A145)))","v":0},"A",1,0,"LPALPALPA1",0,"SO Colissimo(code=SOC) / orig=",null,0,"",0,{"$f":"INDEX(Récapitulatifs!$F$4:$F$250,MATCH($E148,Récapitulatifs!$B$4:$B$250,0))","v":0},""]
[{"$f":"INDIRECT(\"Feuil3!\" & ADDRESS(ROW(A146),COLUMN(A146)))","v":0},"A",1,"stock res","4741",0,"SO Colissimo(code=SOC) / orig=",null,0,"",0,{"$f":"INDEX(Récapitulatifs!$F$4:$F$250,MATCH($E149,Récapitulatifs!$B$4:$B$250,0))","v":0},"DISPO CHEZ MOI"]
[{"$f":"INDIRECT(\"Feuil3!\" & ADDRESS(ROW(A147),COLUMN(A147)))","v":0},"A",1,0,"20032",0,"SO Colissimo(code=SOC) / orig=",null,0,"",0,{"$f":"INDEX(Récapitulatifs!$F$4:$F$250,MATCH($E150,Récapitulatifs!$B$4:$B$250,0))","v":0},""]
[{"$f":"INDIRECT(\"Feuil3!\" & ADDRESS(ROW(A148),COLUMN(A148)))","v":0},"A",1,0,"81025","RADIA","SO Colissimo(code=SOC) / orig=",null,0,"",0,{"$f":"INDEX(Récapitulatifs!$F$4:$F$250,MATCH($E151,Récapitulatifs!$B$4:$B$250,0))","v":0},""]
[{"$f":"INDIRECT(\"Feuil3!\" & ADDRESS(ROW(A149),COLUMN(A149)))","v":0},"A",1,0,"87197XDEUX",0,"SO Colissimo(code=SOC) / orig=",null,0,"",0,{"$f":"INDEX(Récapitulatifs!$F$4:$F$250,MATCH($E152,Récapitulatifs!$B$4:$B$250,0))","v":0},""]
[{"$f":"INDIRECT(\"Feuil3!\" & ADDRESS(ROW(A150),COLUMN(A150)))","v":0},"A",1,0,"199017",0,"SO Colissimo(code=SOC) / orig=",null,0,"",0,{"$f":"INDEX(Récapitulatifs!$F$4:$F$250,MATCH($E153,Récapitulatifs!$B$4:$B$250,0))","v":0},""]
[{"$f":"INDIRECT(\"Feuil3!\" & ADDRESS(ROW(A151),COLUMN(A151)))","v":0},"A",1,"stock res","4725",0,"SO Colissimo(code=SOC) / orig=",null,0,"",0,{"$f":"INDEX(Récapitulatifs!$F$4:$F$250,MATCH($E154,Récapitulatifs!$B$4:$B$250,0))","v":0},"DISPO CHEZ MOI"]
[{"$f":"INDIRECT(\"Feuil3!\" & ADDRESS(ROW(A152),COLUMN(A152)))","v":0},"A",1,0,"MECA8370",0,"SO Colissimo(code=SOC) / orig=",null,0,"",0,{"$f":"INDEX(Récapitulatifs!$F$4:$F$250,MATCH($E155,Récapitulatifs!$B$4:$B$250,0))","v":0},""]
[{"$f":"INDIRECT(\"Feuil3!\" & ADDRESS(ROW(A153),COLUMN(A153)))","v":0},"A",1,"stock res","53014",0,"SO Colissimo(code=SOC) / orig=",null,0,"",0,{"$f":"INDEX(Récapitulatifs!$F$4:$F$250,MATCH($E156,Récapitulatifs!$B$4:$B$250,0))","v":0},"DISPO CHEZ MOI"]
[{"$f":"INDIRECT(\"Feuil3!\" & ADDRESS(ROW(A154),COLUMN(A154)))","v":0},"A",1,0,"3120000312",0,"SO Colissimo(code=SOC) / orig=",null,0,"",0,{"$f":"INDEX(Récapitulatifs!$F$4:$F$250,MATCH($E157,Récapitulatifs!$B$4:$B$250,0))","v":0},""]
[{"$f":"INDIRECT(\"Feuil3!\" & ADDRESS(ROW(A155),COLUMN(A155)))","v":0},"A",1,0,"80030",0,"SO Colissimo(code=SOC) / orig=",null,0,"",0,{"$f":"INDEX(Récapitulatifs!$F$4:$F$250,MATCH($E158,Récapitulatifs!$B$4:$B$250,0))","v":0},""]
[{"$f":"INDIRECT(\"Feuil3!\" & ADDRESS(ROW(A156),COLUMN(A156)))","v":0},"A",1,0,"86066",0,"SO Colissimo(code=SOC) / orig=",null,0,"",0,{"$f":"INDEX(Récapitulatifs!$F$4:$F$250,MATCH($E159,Récapitulatifs!$B$4:$B$250,0))","v":0},""]
[{"$f":"INDIRECT(\"Feuil3!\" & ADDRESS(ROW(A157),COLUMN(A157)))","v":0},"A",1,"stock res","CDAL-NF",0,"SO Colissimo(code=SOC) / orig=",null,0,"",0,{"$f":"INDEX(Récapitulatifs!$F$4:$F$250,MATCH($E160,Récapitulatifs!$B$4:$B$250,0))","v":0},"DISPO CHEZ MOI"]
[{"$f":"INDIRECT(\"Feuil3!\" & ADDRESS(ROW(A158),COLUMN(A158)))","v":0},"A",1,0,"880003","RADIA","SO Colissimo(code=SOC) / orig=",null,0,"",0,{"$f":"INDEX(Récapitulatifs!$F$4:$F$250,MATCH($E161,Récapitulatifs!$B$4:$B$250,0))","v":0},""]
[{"$f":"INDIRECT(\"Feuil3!\" & ADDRESS(ROW(A159),COLUMN(A159)))","v":0},"A",1,"stock res","2335",0,"SO Colissimo(code=SOC) / orig=",null,0,"",0,{"$f":"INDEX(Récapitulatifs!$F$4:$F$250,MATCH($E162,Récapitulatifs!$B$4:$B$250,0))","v":0},"DISPO CHEZ MOI"]
[{"$f":"INDIRECT(\"Feuil3!\" & ADDRESS(ROW(A160),COLUMN(A160)))","v":0},"A",1,"stock res","321040","STORM","SO Colissimo(code=SOC) / orig=",null,0,"",0,{"$f":"INDEX(Récapitulatifs!$F$4:$F$250,MATCH($E163,Récapitulatifs!$B$4:$B$250,0))","v":0},"DISPO CHEZ MOI"]
[{"$f":"INDIRECT(\"Feuil3!\" & ADDRESS(ROW(A161),COLUMN(A161)))","v":0},"A",1,0,"199101",0,0,null,0,"",0,{"$f":"INDEX(Récapitulatifs!$F$4:$F$250,MATCH($E164,Récapitulatifs!$B$4:$B$250,0))","v":0},""]
[{"$f":"INDIRECT(\"Feuil3!\" & ADDRESS(ROW(A162),COLUMN(A162)))","v":0},"A",1,0,"3770000806",0,0,null,0,"",0,{"$f":"INDEX(Récapitulatifs!$F$4:$F$250,MATCH($E165,Récapitulatifs!$B$4:$B$250,0))","v":0},""]
[{"$f":"INDIRECT(\"Feuil3!\" & ADDRESS(ROW(A163),COLUMN(A163)))","v":0},"A",2,"stock res","2000700",0,0,null,0,"",0,{"$f":"INDEX(Récapitulatifs!$F$4:$F$250,MATCH($E166,Récapitulatifs!$B$4:$B$250,0))","v":0},"DISPO CHEZ MOI"]
[{"$f":"INDIRECT(\"Feuil3!\" & ADDRESS(ROW(A164),COLUMN(A164)))","v":0},"A",1,"stock res","2000400",0,0,null,0,"",0,{"$f":"INDEX(Récapitulatifs!$F$4:$F$250,MATCH($E167,Récapitulatifs!$B$4:$B$250,0))","v":0},"DISPO CHEZ MOI"]
[{"$f":"INDIRECT(\"Feuil3!\" & ADDRESS(ROW(A165),COLUMN(A165)))","v":0},"A",1,"stock res","800285",0,0,null,0,"",0,{"$f":"INDEX(Récapitulatifs!$F$4:$F$250,MATCH($E168,Récapitulatifs!$B$4:$B$250,0))","v":0},"DISPO CHEZ MOI"]
[{"$f":"INDIRECT(\"Feuil3!\" & ADDRESS(ROW(A166),COLUMN(A166)))","v":0},"A",1,"stock res","86311X",0,0,null,0,"",0,{"$f":"INDEX(Récapitulatifs!$F$4:$F$250,MATCH($E169,Récapitulatifs!$B$4:$B$250,0))","v":0},"DISPO CHEZ MOI"]
[{"$f":"INDIRECT(\"Feuil3!\" & ADDRESS(ROW(A167),COLUMN(A167)))","v":0},"A",1,"stock res","86276X",0,0,null,0,"",0,{"$f":"INDEX(Récapitulatifs!$F$4:$F$250,MATCH($E170,Récapitulatifs!$B$4:$B$250,0))","v":0},"DISPO CHEZ MOI"]
[{"$f":"INDIRECT(\"Feuil3!\" & ADDRESS(ROW(A168),COLUMN(A168)))","v":0},"A",1,"stock res","86404X",0,0,null,0,"",0,{"$f":"INDEX(Récapitulatifs!$F$4:$F$250,MATCH($E171,Récapitulatifs!$B$4:$B$250,0))","v":0},"DISPO CHEZ MOI"]
[{"$f":"INDIRECT(\"Feuil3!\" & ADDRESS(ROW(A169),COLUMN(A169)))","v":0},"A",1,0,"81199",0,"SO Colissimo(code=SOC) / orig=",null,0,"",0,{"$f":"INDEX(Récapitulatifs!$F$4:$F$250,MATCH($E172,Récapitulatifs!$B$4:$B$250,0))","v":0},""]
[{"$f":"INDIRECT(\"Feuil3!\" & ADDRESS(ROW(A170),COLUMN(A170)))","v":0},"A",1,"stock res","1063XDEUX",0,"SO Colissimo(code=SOC) / orig=",null,{"$f":"INDIRECT(\"Feuil3!\" & ADDRESS(ROW(I170),COLUMN(I170)))","v":0},"",0,{"$f":"INDEX(Récapitulatifs!$F$4:$F$250,MATCH($E173,Récapitulatifs!$B$4:$B$250,0))","v":0},"DISPO CHEZ MOI"]
[{"$f":"INDIRECT(\"Feuil3!\" & ADDRESS(ROW(A171),COLUMN(A171)))","v":0},"A",1,"stock res","86311X",0,"SO Colissimo(code=SOC) / orig=",null,0,{"$f":"IF(LEFT(I174,1)=\"M\",\"MONDIAL RELAY\",IF(LEFT(I174,1)=\"E\",\"PREPASECURE\",IF(LEFT(I174,1)=\"S\",\"SO COLISSIMO\",IF(LEFT(I174,2)=\"CO\",\"COLISSIMO\",IF(LEFT(I174,2)=\"CH\",\"CHRONOPOST\",\"\")))))","v":""},{"$f":"INDIRECT(\"Feuil3!\" & ADDRESS(ROW(J171),COLUMN(J171)))","v":0},{"$f":"INDEX(Récapitulatifs!$F$4:$F$250,MATCH($E174,Récapitulatifs!$B$4:$B$250,0))","v":0},{"$f":"IF(D174=\"STOCK RES\",\"DISPO CHEZ MOI\",IF(D174=\"Sold Out\",\"STOCK A VERIFIER\",\"\"))","v":"DISPO CHEZ MOI"}]
[{"$f":"INDIRECT(\"Feuil3!\" & ADDRESS(ROW(A172),COLUMN(A172)))","v":0},"A",1,"stock res","599610","STORM","SO Colissimo(code=SOC) / orig=",null,0,"",0,{"$f":"INDEX(Récapitulatifs!$F$4:$F$250,MATCH($E175,Récapitulatifs!$B$4:$B$250,0))","v":0},"DISPO CHEZ MOI"]
[{"$f":"INDIRECT(\"Feuil3!\" & ADDRESS(ROW(A173),COLUMN(A173)))","v":0},"A",1,0,"MECA8121",0,"SO Colissimo(code=SOC) / orig=",null,0,"",0,{"$f":"INDEX(Récapitulatifs!$F$4:$F$250,MATCH($E176,Récapitulatifs!$B$4:$B$250,0))","v":0},""]
[{"$f":"INDIRECT(\"Feuil3!\" & ADDRESS(ROW(A174),COLUMN(A174)))","v":0},"A",1,0,"13993",0,"SO Colissimo(code=SOC) / orig=",null,0,"",0,{"$f":"INDEX(Récapitulatifs!$F$4:$F$250,MATCH($E177,Récapitulatifs!$B$4:$B$250,0))","v":0},""]
[{"$f":"INDIRECT(\"Feuil3!\" & ADDRESS(ROW(A175),COLUMN(A175)))","v":0},"A",1,"stock res","900810",0,"SO Colissimo(code=SOC) / orig=",null,0,"",0,{"$f":"INDEX(Récapitulatifs!$F$4:$F$250,MATCH($E178,Récapitulatifs!$B$4:$B$250,0))","v":0},"DISPO CHEZ MOI"]
[{"$f":"INDIRECT(\"Feuil3!\" & ADDRESS(ROW(A176),COLUMN(A176)))","v":0},"A",1,0,"71112ET59995",0,"SO Colissimo(code=SOC) / orig=",null,0,"",0,{"$f":"INDEX(Récapitulatifs!$F$4:$F$250,MATCH($E179,Récapitulatifs!$B$4:$B$250,0))","v":0},""]
[{"$f":"INDIRECT(\"Feuil3!\" & ADDRESS(ROW(A177),COLUMN(A177)))","v":0},"A",1,0,"883265459",0,"SO Colissimo(code=SOC) / orig=",null,0,"",0,{"$f":"INDEX(Récapitulatifs!$F$4:$F$250,MATCH($E180,Récapitulatifs!$B$4:$B$250,0))","v":0},""]
[{"$f":"INDIRECT(\"Feuil3!\" & ADDRESS(ROW(A178),COLUMN(A178)))","v":0},"A",1,0,"86095",0,"SO Colissimo(code=SOC) / orig=",null,0,"",0,{"$f":"INDEX(Récapitulatifs!$F$4:$F$250,MATCH($E181,Récapitulatifs!$B$4:$B$250,0))","v":0},""]
[{"$f":"INDIRECT(\"Feuil3!\" & ADDRESS(ROW(A179),COLUMN(A179)))","v":0},"A",1,0,"A1210XDEUX",0,"SO Colissimo(code=SOC) / orig=",null,0,"",0,{"$f":"INDEX(Récapitulatifs!$F$4:$F$250,MATCH($E182,Récapitulatifs!$B$4:$B$250,0))","v":0},""]
[{"$f":"INDIRECT(\"Feuil3!\" & ADDRESS(ROW(A180),COLUMN(A180)))","v":0},"A",1,"stock res","CDAL-54505z",0,"SO Colissimo(code=SOC) / orig=",null,0,"",0,{"$f":"INDEX(Récapitulatifs!$F$4:$F$250,MATCH($E183,Récapitulatifs!$B$4:$B$250,0))","v":0},"DISPO CHEZ MOI"]
[{"$f":"INDIRECT(\"Feuil3!\" & ADDRESS(ROW(A181),COLUMN(A181)))","v":0},"A",1,"stock res","83523",0,"SO Colissimo(code=SOC) / orig=",null,0,"",0,{"$f":"INDEX(Récapitulatifs!$F$4:$F$250,MATCH($E184,Récapitulatifs!$B$4:$B$250,0))","v":0},"DISPO CHEZ MOI"]
[{"$f":"INDIRECT(\"Feuil3!\" & ADDRESS(ROW(A182),COLUMN(A182)))","v":0},"A",1,0,"182470","STORM","SO Colissimo(code=SOC) / orig=",null,0,"",0,{"$f":"INDEX(Récapitulatifs!$F$4:$F$250,MATCH($E185,Récapitulatifs!$B$4:$B$250,0))","v":0},""]
[{"$f":"INDIRECT(\"Feuil3!\" & ADDRESS(ROW(A183),COLUMN(A183)))","v":0},"A",1,"stock res","4741",0,"SO Colissimo(code=SOC) / orig=",null,0,"",0,{"$f":"INDEX(Récapitulatifs!$F$4:$F$250,MATCH($E186,Récapitulatifs!$B$4:$B$250,0))","v":0},"DISPO CHEZ MOI"]
[{"$f":"INDIRECT(\"Feuil3!\" & ADDRESS(ROW(A184),COLUMN(A184)))","v":0},"A",1,0,"31814",0,0,null,0,"",0,{"$f":"INDEX(Récapitulatifs!$F$4:$F$250,MATCH($E187,Récapitulatifs!$B$4:$B$250,0))","v":0},""]
[{"$f":"INDIRECT(\"Feuil3!\" & ADDRESS(ROW(A185),COLUMN(A185)))","v":0},"A",1,0,"802700",0,"SO Colissimo(code=SOC) / orig=",null,0,"",0,{"$f":"INDEX(Récapitulatifs!$F$4:$F$250,MATCH($E188,Récapitulatifs!$B$4:$B$250,0))","v":0},""]
[{"$f":"INDIRECT(\"Feuil3!\" & ADDRESS(ROW(A186),COLUMN(A186)))","v":0},"A",1,"stock res","106450",0,"SO Colissimo(code=SOC) / orig=",null,0,"",0,{"$f":"INDEX(Récapitulatifs!$F$4:$F$250,MATCH($E189,Récapitulatifs!$B$4:$B$250,0))","v":0},"DISPO CHEZ MOI"]
[{"$f":"INDIRECT(\"Feuil3!\" & ADDRESS(ROW(A187),COLUMN(A187)))","v":0},"A",1,0,"297802",0,0,null,0,"",0,{"$f":"INDEX(Récapitulatifs!$F$4:$F$250,MATCH($E190,Récapitulatifs!$B$4:$B$250,0))","v":0},""]
[{"$f":"INDIRECT(\"Feuil3!\" & ADDRESS(ROW(A188),COLUMN(A188)))","v":0},"A",1,0,"70052",0,"SO Colissimo(code=SOC) / orig=",null,0,"",0,{"$f":"INDEX(Récapitulatifs!$F$4:$F$250,MATCH($E191,Récapitulatifs!$B$4:$B$250,0))","v":0},""]
[{"$f":"INDIRECT(\"Feuil3!\" & ADDRESS(ROW(A189),COLUMN(A189)))","v":0},"A",1,0,"217014",0,"SO Colissimo(code=SOC) / orig=",null,0,"",0,{"$f":"INDEX(Récapitulatifs!$F$4:$F$250,MATCH($E192,Récapitulatifs!$B$4:$B$250,0))","v":0},""]
[{"$f":"INDIRECT(\"Feuil3!\" & ADDRESS(ROW(A190),COLUMN(A190)))","v":0},"A",1,0,"613000",0,"SO Colissimo(code=SOC) / orig=",null,0,"",0,{"$f":"INDEX(Récapitulatifs!$F$4:$F$250,MATCH($E193,Récapitulatifs!$B$4:$B$250,0))","v":0},""]
[{"$f":"INDIRECT(\"Feuil3!\" & ADDRESS(ROW(A191),COLUMN(A191)))","v":0},"A",1,"stock res","MECA4608",0,"SO Colissimo(code=SOC) / orig=",null,0,"",0,{"$f":"INDEX(Récapitulatifs!$F$4:$F$250,MATCH($E194,Récapitulatifs!$B$4:$B$250,0))","v":0},"DISPO CHEZ MOI"]
[{"$f":"INDIRECT(\"Feuil3!\" & ADDRESS(ROW(A192),COLUMN(A192)))","v":0},"A",1,0,"88095",0,"Colissimo(Option Crbt+7,00€)(code=COL) / orig=",null,0,"",0,{"$f":"INDEX(Récapitulatifs!$F$4:$F$250,MATCH($E195,Récapitulatifs!$B$4:$B$250,0))","v":0},""]
[{"$f":"INDIRECT(\"Feuil3!\" & ADDRESS(ROW(A193),COLUMN(A193)))","v":0},"A",1,0,"321020","STORM","SO Colissimo(code=SOC) / orig=",null,0,"",0,{"$f":"INDEX(Récapitulatifs!$F$4:$F$250,MATCH($E196,Récapitulatifs!$B$4:$B$250,0))","v":0},""]
[{"$f":"INDIRECT(\"Feuil3!\" & ADDRESS(ROW(A194),COLUMN(A194)))","v":0},"A",1,"stock res","4593",0,"SO Colissimo(code=SOC) / orig=",null,0,"",0,{"$f":"INDEX(Récapitulatifs!$F$4:$F$250,MATCH($E197,Récapitulatifs!$B$4:$B$250,0))","v":0},"DISPO CHEZ MOI"]
[{"$f":"INDIRECT(\"Feuil3!\" & ADDRESS(ROW(A195),COLUMN(A195)))","v":0},"A",1,0,"RAD1000350",0,"SO Colissimo(code=SOC) / orig=",null,0,"",0,{"$f":"INDEX(Récapitulatifs!$F$4:$F$250,MATCH($E198,Récapitulatifs!$B$4:$B$250,0))","v":0},""]
[{"$f":"INDIRECT(\"Feuil3!\" & ADDRESS(ROW(A196),COLUMN(A196)))","v":0},"A",1,0,"RAD1000450",0,"SO Colissimo(code=SOC) / orig=",null,0,"",0,{"$f":"INDEX(Récapitulatifs!$F$4:$F$250,MATCH($E199,Récapitulatifs!$B$4:$B$250,0))","v":0},""]
[{"$f":"INDIRECT(\"Feuil3!\" & ADDRESS(ROW(A197),COLUMN(A197)))","v":0},"A",1,0,"RAD1000600",0,"SO Colissimo(code=SOC) / orig=",null,0,"",0,{"$f":"INDEX(Récapitulatifs!$F$4:$F$250,MATCH($E200,Récapitulatifs!$B$4:$B$250,0))","v":0},""]
[{"$f":"INDIRECT(\"Feuil3!\" & ADDRESS(ROW(A198),COLUMN(A198)))","v":0},"A",1,0,"99949",0,"Colissimo(Option Crbt+7,00€)(code=COL) / orig=",null,0,"",0,{"$f":"INDEX(Récapitulatifs!$F$4:$F$250,MATCH($E201,Récapitulatifs!$B$4:$B$250,0))","v":0},""]
[{"$f":"INDIRECT(\"Feuil3!\" & ADDRESS(ROW(A199),COLUMN(A199)))","v":0},"A",1,"stock res","MECA3835",0,"SO Colissimo(code=SOC) / orig=",null,0,"",0,{"$f":"INDEX(Récapitulatifs!$F$4:$F$250,MATCH($E202,Récapitulatifs!$B$4:$B$250,0))","v":0},"DISPO CHEZ MOI"]
[{"$f":"INDIRECT(\"Feuil3!\" & ADDRESS(ROW(A200),COLUMN(A200)))","v":0},"A",1,"stock res","561030","STORM","SO Colissimo(code=SOC) / orig=",null,0,"",0,{"$f":"INDEX(Récapitulatifs!$F$4:$F$250,MATCH($E203,Récapitulatifs!$B$4:$B$250,0))","v":0},"DISPO CHEZ MOI"]
[{"$f":"INDIRECT(\"Feuil3!\" & ADDRESS(ROW(A201),COLUMN(A201)))","v":0},"A",1,"stock res","599610","STORM","SO Colissimo(code=SOC) / orig=",null,0,"",0,{"$f":"INDEX(Récapitulatifs!$F$4:$F$250,MATCH($E204,Récapitulatifs!$B$4:$B$250,0))","v":0},"DISPO CHEZ MOI"]
[{"$f":"INDIRECT(\"Feuil3!\" & ADDRESS(ROW(A202),COLUMN(A202)))","v":0},"A",1,"stock res","4741",0,"SO Colissimo(code=SOC) / orig=",null,0,"",0,{"$f":"INDEX(Récapitulatifs!$F$4:$F$250,MATCH($E205,Récapitulatifs!$B$4:$B$250,0))","v":0},"DISPO CHEZ MOI"]
[{"$f":"INDIRECT(\"Feuil3!\" & ADDRESS(ROW(A203),COLUMN(A203)))","v":0},"A",1,0,"99952",0,"Chronopost(code=CHR) / orig=",null,0,"",0,{"$f":"INDEX(Récapitulatifs!$F$4:$F$250,MATCH($E206,Récapitulatifs!$B$4:$B$250,0))","v":0},""]
[{"$f":"INDIRECT(\"Feuil3!\" & ADDRESS(ROW(A204),COLUMN(A204)))","v":0},"A",1,0,"CDAL-54506z",0,"SO Colissimo(code=SOC) / orig=",null,0,"",0,{"$f":"INDEX(Récapitulatifs!$F$4:$F$250,MATCH($E207,Récapitulatifs!$B$4:$B$250,0))","v":0},""]
[{"$f":"INDIRECT(\"Feuil3!\" & ADDRESS(ROW(A205),COLUMN(A205)))","v":0},"A",1,"stock res","4740",0,"SO Colissimo(code=SOC) / orig=",null,0,"",0,{"$f":"INDEX(Récapitulatifs!$F$4:$F$250,MATCH($E208,Récapitulatifs!$B$4:$B$250,0))","v":0},"DISPO CHEZ MOI"]
[{"$f":"INDIRECT(\"Feuil3!\" & ADDRESS(ROW(A206),COLUMN(A206)))","v":0},"A",1,0,"A14113",0,"SO Colissimo(code=SOC) / orig=",null,0,"",0,{"$f":"INDEX(Récapitulatifs!$F$4:$F$250,MATCH($E209,Récapitulatifs!$B$4:$B$250,0))","v":0},""]
[{"$f":"INDIRECT(\"Feuil3!\" & ADDRESS(ROW(A207),COLUMN(A207)))","v":0},"A",1,"stock res","83524",0,"SO Colissimo(code=SOC) / orig=",null,0,"",0,{"$f":"INDEX(Récapitulatifs!$F$4:$F$250,MATCH($E210,Récapitulatifs!$B$4:$B$250,0))","v":0},"DISPO CHEZ MOI"]
[{"$f":"INDIRECT(\"Feuil3!\" & ADDRESS(ROW(A208),COLUMN(A208)))","v":0},"A",1,0,"82065",0,"SO Colissimo(code=SOC) / orig=",null,0,"",0,{"$f":"INDEX(Récapitulatifs!$F$4:$F$250,MATCH($E211,Récapitulatifs!$B$4:$B$250,0))","v":0},""]
[{"$f":"INDIRECT(\"Feuil3!\" & ADDRESS(ROW(A209),COLUMN(A209)))","v":0},"A",1,"stock res","83523",0,"SO Colissimo(code=SOC) / orig=",null,0,"",0,{"$f":"INDEX(Récapitulatifs!$F$4:$F$250,MATCH($E212,Récapitulatifs!$B$4:$B$250,0))","v":0},"DISPO CHEZ MOI"]
[{"$f":"INDIRECT(\"Feuil3!\" & ADDRESS(ROW(A210),COLUMN(A210)))","v":0},"A",1,"stock res","83523",0,"SO Colissimo(code=SOC) / orig=",null,0,"",0,{"$f":"INDEX(Récapitulatifs!$F$4:$F$250,MATCH($E213,Récapitulatifs!$B$4:$B$250,0))","v":0},"DISPO CHEZ MOI"]
[{"$f":"INDIRECT(\"Feuil3!\" & ADDRESS(ROW(A211),COLUMN(A211)))","v":0},"A",2,"stock res","83524",0,"SO Colissimo(code=SOC) / orig=",null,0,"",0,{"$f":"INDEX(Récapitulatifs!$F$4:$F$250,MATCH($E214,Récapitulatifs!$B$4:$B$250,0))","v":0},"DISPO CHEZ MOI"]
[{"$f":"INDIRECT(\"Feuil3!\" & ADDRESS(ROW(A212),COLUMN(A212)))","v":0},"A",1,"stock res","4741",0,"SO Colissimo(code=SOC) / orig=",null,0,"",0,{"$f":"INDEX(Récapitulatifs!$F$4:$F$250,MATCH($E215,Récapitulatifs!$B$4:$B$250,0))","v":0},"DISPO CHEZ MOI"]
[{"$f":"INDIRECT(\"Feuil3!\" & ADDRESS(ROW(A213),COLUMN(A213)))","v":0},"A",1,0,"20032",0,"SO Colissimo(code=SOC) / orig=",null,0,"",0,{"$f":"INDEX(Récapitulatifs!$F$4:$F$250,MATCH($E216,Récapitulatifs!$B$4:$B$250,0))","v":0},""]
[{"$f":"INDIRECT(\"Feuil3!\" & ADDRESS(ROW(A214),COLUMN(A214)))","v":0},"A",1,0,"70034",0,"SO Colissimo(code=SOC) / orig=",null,0,"",0,{"$f":"INDEX(Récapitulatifs!$F$4:$F$250,MATCH($E217,Récapitulatifs!$B$4:$B$250,0))","v":0},""]
[{"$f":"INDIRECT(\"Feuil3!\" & ADDRESS(ROW(A215),COLUMN(A215)))","v":0},"A",1,0,"20032",0,"SO Colissimo(code=SOC) / orig=",null,0,"",0,{"$f":"INDEX(Récapitulatifs!$F$4:$F$250,MATCH($E218,Récapitulatifs!$B$4:$B$250,0))","v":0},""]
[{"$f":"INDIRECT(\"Feuil3!\" & ADDRESS(ROW(A216),COLUMN(A216)))","v":0},"A",1,0,"26599",0,"SO Colissimo(code=SOC) / orig=",null,0,"",0,{"$f":"INDEX(Récapitulatifs!$F$4:$F$250,MATCH($E219,Récapitulatifs!$B$4:$B$250,0))","v":0},""]
[{"$f":"INDIRECT(\"Feuil3!\" & ADDRESS(ROW(A217),COLUMN(A217)))","v":0},"A",1,0,"26599",0,"SO Colissimo(code=SOC) / orig=",null,0,"",0,{"$f":"INDEX(Récapitulatifs!$F$4:$F$250,MATCH($E220,Récapitulatifs!$B$4:$B$250,0))","v":0},""]
[{"$f":"INDIRECT(\"Feuil3!\" & ADDRESS(ROW(A218),COLUMN(A218)))","v":0},"A",1,0,"MECA2869",0,"SO Colissimo(code=SOC) / orig=",null,0,"",0,{"$f":"INDEX(Récapitulatifs!$F$4:$F$250,MATCH($E221,Récapitulatifs!$B$4:$B$250,0))","v":0},""]
[{"$f":"INDIRECT(\"Feuil3!\" & ADDRESS(ROW(A219),COLUMN(A219)))","v":0},"A",1,0,"153540",0,"SO Colissimo(code=SOC) / orig=",null,0,"",0,{"$f":"INDEX(Récapitulatifs!$F$4:$F$250,MATCH($E222,Récapitulatifs!$B$4:$B$250,0))","v":0},""]
[{"$f":"INDIRECT(\"Feuil3!\" & ADDRESS(ROW(A220),COLUMN(A220)))","v":0},"A",1,0,"5206",0,"SO Colissimo(code=SOC) / orig=",null,0,"",0,{"$f":"INDEX(Récapitulatifs!$F$4:$F$250,MATCH($E223,Récapitulatifs!$B$4:$B$250,0))","v":0},""]
[{"$f":"INDIRECT(\"Feuil3!\" & ADDRESS(ROW(A221),COLUMN(A221)))","v":0},"A",1,0,"99999A",0,"SO Colissimo(code=SOC) / orig=",null,0,"",0,{"$f":"INDEX(Récapitulatifs!$F$4:$F$250,MATCH($E224,Récapitulatifs!$B$4:$B$250,0))","v":0},""]
[{"$f":"INDIRECT(\"Feuil3!\" & ADDRESS(ROW(A222),COLUMN(A222)))","v":0},"A",1,"stock res","99901",0,"SO Colissimo(code=SOC) / orig=",null,0,"",0,{"$f":"INDEX(Récapitulatifs!$F$4:$F$250,MATCH($E225,Récapitulatifs!$B$4:$B$250,0))","v":0},"DISPO CHEZ MOI"]
[{"$f":"INDIRECT(\"Feuil3!\" & ADDRESS(ROW(A223),COLUMN(A223)))","v":0},"A",1,0,"883265459",0,"SO Colissimo(code=SOC) / orig=",null,0,"",0,{"$f":"INDEX(Récapitulatifs!$F$4:$F$250,MATCH($E226,Récapitulatifs!$B$4:$B$250,0))","v":0},""]
[{"$f":"INDIRECT(\"Feuil3!\" & ADDRESS(ROW(A224),COLUMN(A224)))","v":0},"A",2,0,"24099",0,"SO Colissimo(code=SOC) / orig=",null,0,"",0,{"$f":"INDEX(Récapitulatifs!$F$4:$F$250,MATCH($E227,Récapitulatifs!$B$4:$B$250,0))","v":0},""]
[{"$f":"INDIRECT(\"Feuil3!\" & ADDRESS(ROW(A225),COLUMN(A225)))","v":0},"A",2,0,"72083",0,"SO Colissimo(code=SOC) / orig=",null,0,"",0,{"$f":"INDEX(Récapitulatifs!$F$4:$F$250,MATCH($E228,Récapitulatifs!$B$4:$B$250,0))","v":0},""]
[{"$f":"INDIRECT(\"Feuil3!\" & ADDRESS(ROW(A226),COLUMN(A226)))","v":0},"A",2,0,"85081",0,"SO Colissimo(code=SOC) / orig=",null,0,"",0,{"$f":"INDEX(Récapitulatifs!$F$4:$F$250,MATCH($E229,Récapitulatifs!$B$4:$B$250,0))","v":0},""]
[{"$f":"INDIRECT(\"Feuil3!\" & ADDRESS(ROW(A227),COLUMN(A227)))","v":0},"A",1,0,"80090",0,"SO Colissimo(code=SOC) / orig=",null,0,"",0,{"$f":"INDEX(Récapitulatifs!$F$4:$F$250,MATCH($E230,Récapitulatifs!$B$4:$B$250,0))","v":0},""]
[{"$f":"INDIRECT(\"Feuil3!\" & ADDRESS(ROW(A228),COLUMN(A228)))","v":0},"A",1,"stock res","42329",0,"Enveloppes Rigides Avec Suivi(code=POS) / orig=",null,0,"",0,{"$f":"INDEX(Récapitulatifs!$F$4:$F$250,MATCH($E231,Récapitulatifs!$B$4:$B$250,0))","v":0},"DISPO CHEZ MOI"]
[{"$f":"INDIRECT(\"Feuil3!\" & ADDRESS(ROW(A229),COLUMN(A229)))","v":0},"A",1,0,"316900",0,"SO Colissimo(code=SOC) / orig=",null,0,"",0,{"$f":"INDEX(Récapitulatifs!$F$4:$F$250,MATCH($E232,Récapitulatifs!$B$4:$B$250,0))","v":0},""]
[{"$f":"INDIRECT(\"Feuil3!\" & ADDRESS(ROW(A230),COLUMN(A230)))","v":0},"A",1,0,"34516",0,"SO Colissimo(code=SOC) / orig=",null,0,"",0,{"$f":"INDEX(Récapitulatifs!$F$4:$F$250,MATCH($E233,Récapitulatifs!$B$4:$B$250,0))","v":0},""]
[{"$f":"INDIRECT(\"Feuil3!\" & ADDRESS(ROW(A231),COLUMN(A231)))","v":0},"A",1,0,"MECA2869",0,"SO Colissimo(code=SOC) / orig=",null,0,"",0,{"$f":"INDEX(Récapitulatifs!$F$4:$F$250,MATCH($E234,Récapitulatifs!$B$4:$B$250,0))","v":0},""]
[{"$f":"INDIRECT(\"Feuil3!\" & ADDRESS(ROW(A232),COLUMN(A232)))","v":0},"A",1,0,"450200",0,"SO Colissimo(code=SOC) / orig=",null,0,"",0,{"$f":"INDEX(Récapitulatifs!$F$4:$F$250,MATCH($E235,Récapitulatifs!$B$4:$B$250,0))","v":0},""]
[{"$f":"INDIRECT(\"Feuil3!\" & ADDRESS(ROW(A233),COLUMN(A233)))","v":0},0,0,0,0,0,0,null,0,"",0,{"$f":"INDEX(Récapitulatifs!$F$4:$F$250,MATCH($E236,Récapitulatifs!$B$4:$B$250,0))","v":{"$error":"#N/A"}},""]
[{"$f":"INDIRECT(\"Feuil3!\" & ADDRESS(ROW(A234),COLUMN(A234)))","v":0},0,0,0,0,0,0,null,{"$f":"INDIRECT(\"Feuil3!\" & ADDRESS(ROW(I234),COLUMN(I234)))","v":0},"",0,{"$f":"INDEX(Récapitulatifs!$F$4:$F$250,MATCH($E237,Récapitulatifs!$B$4:$B$250,0))","v":{"$error":"#N/A"}},""]
[{"$f":"INDIRECT(\"Feuil3!\" & ADDRESS(ROW(A235),COLUMN(A235)))","v":0},0,0,0,0,0,0,null,0,{"$f":"IF(LEFT(I238,1)=\"M\",\"MONDIAL RELAY\",IF(LEFT(I238,1)=\"E\",\"PREPASECURE\",IF(LEFT(I238,1)=\"S\",\"SO COLISSIMO\",IF(LEFT(I238,2)=\"CO\",\"COLISSIMO\",IF(LEFT(I238,2)=\"CH\",\"CHRONOPOST\",\"\")))))","v":""},{"$f":"INDIRECT(\"Feuil3!\" & ADDRESS(ROW(J235),COLUMN(J235)))","v":0},{"$f":"INDEX(Récapitulatifs!$F$4:$F$250,MATCH($E238,Récapitulatifs!$B$4:$B$250,0))","v":{"$error":"#N/A"}},{"$f":"IF(D238=\"STOCK RES\",\"DISPO CHEZ MOI\",IF(D238=\"Sold Out\",\"STOCK A VERIFIER\",\"\"))","v":""}]
[{"$f":"INDIRECT(\"Feuil3!\" & ADDRESS(ROW(A236),COLUMN(A236)))","v":0},0,0,0,0,0,0,null,0,"",0,{"$f":"INDEX(Récapitulatifs!$F$4:$F$250,MATCH($E239,Récapitulatifs!$B$4:$B$250,0))","v":{"$error":"#N/A"}},""]
[{"$f":"INDIRECT(\"Feuil3!\" & ADDRESS(ROW(A237),COLUMN(A237)))","v":0},0,0,0,0,0,0,null,0,"",0,{"$f":"INDEX(Récapitulatifs!$F$4:$F$250,MATCH($E240,Récapitulatifs!$B$4:$B$250,0))","v":{"$error":"#N/A"}},""]
[{"$f":"INDIRECT(\"Feuil3!\" & ADDRESS(ROW(A238),COLUMN(A238)))","v":0},0,0,0,0,0,0,null,0,"",0,{"$f":"INDEX(Récapitulatifs!$F$4:$F$250,MATCH($E241,Récapitulatifs!$B$4:$B$250,0))","v":{"$error":"#N/A"}},""]
[{"$f":"INDIRECT(\"Feuil3!\" & ADDRESS(ROW(A239),COLUMN(A239)))","v":0},0,0,0,0,0,0,null,0,"",0,{"$f":"INDEX(Récapitulatifs!$F$4:$F$250,MATCH($E242,Récapitulatifs!$B$4:$B$250,0))","v":{"$error":"#N/A"}},""]
[{"$f":"INDIRECT(\"Feuil3!\" & ADDRESS(ROW(A240),COLUMN(A240)))","v":0},0,0,0,0,0,0,null,0,"",0,{"$f":"INDEX(Récapitulatifs!$F$4:$F$250,MATCH($E243,Récapitulatifs!$B$4:$B$250,0))","v":{"$error":"#N/A"}},""]
[{"$f":"INDIRECT(\"Feuil3!\" & ADDRESS(ROW(A241),COLUMN(A241)))","v":0},0,0,0,0,0,0,null,0,"",0,{"$f":"INDEX(Récapitulatifs!$F$4:$F$250,MATCH($E244,Récapitulatifs!$B$4:$B$250,0))","v":{"$error":"#N/A"}},""]
[{"$f":"INDIRECT(\"Feuil3!\" & ADDRESS(ROW(A242),COLUMN(A242)))","v":0},0,0,0,0,0,0,null,0,"",0,{"$f":"INDEX(Récapitulatifs!$F$4:$F$250,MATCH($E245,Récapitulatifs!$B$4:$B$250,0))","v":{"$error":"#N/A"}},""]
[{"$f":"INDIRECT(\"Feuil3!\" & ADDRESS(ROW(A243),COLUMN(A243)))","v":0},0,0,0,0,0,0,null,0,"",0,{"$f":"INDEX(Récapitulatifs!$F$4:$F$250,MATCH($E246,Récapitulatifs!$B$4:$B$250,0))","v":{"$error":"#N/A"}},""]
[{"$f":"INDIRECT(\"Feuil3!\" & ADDRESS(ROW(A244),COLUMN(A244)))","v":0},0,0,0,0,0,0,null,0,"",0,{"$f":"INDEX(Récapitulatifs!$F$4:$F$250,MATCH($E247,Récapitulatifs!$B$4:$B$250,0))","v":{"$error":"#N/A"}},""]
[{"$f":"INDIRECT(\"Feuil3!\" & ADDRESS(ROW(A245),COLUMN(A245)))","v":0},0,0,0,0,0,0,null,0,"",0,{"$f":"INDEX(Récapitulatifs!$F$4:$F$250,MATCH($E248,Récapitulatifs!$B$4:$B$250,0))","v":{"$error":"#N/A"}},""]
[{"$f":"INDIRECT(\"Feuil3!\" & ADDRESS(ROW(A246),COLUMN(A246)))","v":0},0,0,0,0,0,0,null,0,"",0,{"$f":"INDEX(Récapitulatifs!$F$4:$F$250,MATCH($E249,Récapitulatifs!$B$4:$B$250,0))","v":{"$error":"#N/A"}},""]
[{"$f":"INDIRECT(\"Feuil3!\" & ADDRESS(ROW(A247),COLUMN(A247)))","v":0},0,0,0,0,0,0,null,0,"",0,{"$f":"INDEX(Récapitulatifs!$F$4:$F$250,MATCH($E250,Récapitulatifs!$B$4:$B$250,0))","v":{"$error":"#N/A"}},""]
[{"$f":"INDIRECT(\"Feuil3!\" & ADDRESS(ROW(A248),COLUMN(A248)))","v":0},0,0,0,0,0,0,null,0,"",0,{"$f":"INDEX(Récapitulatifs!$F$4:$F$250,MATCH($E251,Récapitulatifs!$B$4:$B$250,0))","v":{"$error":"#N/A"}},""]
[{"$f":"INDIRECT(\"Feuil3!\" & ADDRESS(ROW(A249),COLUMN(A249)))","v":0},0,0,0,0,0,0,null,0,"",0,{"$f":"INDEX(Récapitulatifs!$F$4:$F$250,MATCH($E252,Récapitulatifs!$B$4:$B$250,0))","v":{"$error":"#N/A"}},""]
[{"$f":"INDIRECT(\"Feuil3!\" & ADDRESS(ROW(A250),COLUMN(A250)))","v":0},0,0,0,0,0,0,null,0,"",0,{"$f":"INDEX(Récapitulatifs!$F$4:$F$250,MATCH($E253,Récapitulatifs!$B$4:$B$250,0))","v":{"$error":"#N/A"}},""]
[{"$f":"INDIRECT(\"Feuil3!\" & ADDRESS(ROW(A251),COLUMN(A251)))","v":0},0,0,0,0,0,0,null,0,"",0,{"$f":"INDEX(Récapitulatifs!$F$4:$F$250,MATCH($E254,Récapitulatifs!$B$4:$B$250,0))","v":{"$error":"#N/A"}},""]
[{"$f":"INDIRECT(\"Feuil3!\" & ADDRESS(ROW(A252),COLUMN(A252)))","v":0},0,0,0,0,0,0,null,0,"",0,{"$f":"INDEX(Récapitulatifs!$F$4:$F$250,MATCH($E255,Récapitulatifs!$B$4:$B$250,0))","v":{"$error":"#N/A"}},""]
[{"$f":"INDIRECT(\"Feuil3!\" & ADDRESS(ROW(A253),COLUMN(A253)))","v":0},0,0,0,0,0,0,null,0,"",0,{"$f":"INDEX(Récapitulatifs!$F$4:$F$250,MATCH($E256,Récapitulatifs!$B$4:$B$250,0))","v":{"$error":"#N/A"}},""]
[{"$f":"INDIRECT(\"Feuil3!\" & ADDRESS(ROW(A254),COLUMN(A254)))","v":0},0,0,0,0,0,0,null,0,"",0,{"$f":"INDEX(Récapitulatifs!$F$4:$F$250,MATCH($E257,Récapitulatifs!$B$4:$B$250,0))","v":{"$error":"#N/A"}},""]
[{"$f":"INDIRECT(\"Feuil3!\" & ADDRESS(ROW(A255),COLUMN(A255)))","v":0},0,0,0,0,0,0,null,0,"",0,{"$f":"INDEX(Récapitulatifs!$F$4:$F$250,MATCH($E258,Récapitulatifs!$B$4:$B$250,0))","v":{"$error":"#N/A"}},""]
[{"$f":"INDIRECT(\"Feuil3!\" & ADDRESS(ROW(A256),COLUMN(A256)))","v":0},0,0,0,0,0,0,null,0,"",0,{"$f":"INDEX(Récapitulatifs!$F$4:$F$250,MATCH($E259,Récapitulatifs!$B$4:$B$250,0))","v":{"$error":"#N/A"}},""]
[{"$f":"INDIRECT(\"Feuil3!\" & ADDRESS(ROW(A257),COLUMN(A257)))","v":0},0,0,0,0,0,0,null,0,"",0,{"$f":"INDEX(Récapitulatifs!$F$4:$F$250,MATCH($E260,Récapitulatifs!$B$4:$B$250,0))","v":{"$error":"#N/A"}},""]
[{"$f":"INDIRECT(\"Feuil3!\" & ADDRESS(ROW(A258),COLUMN(A258)))","v":0},0,0,0,0,0,0,null,0,"",0,{"$f":"INDEX(Récapitulatifs!$F$4:$F$250,MATCH($E261,Récapitulatifs!$B$4:$B$250,0))","v":{"$error":"#N/A"}},""]
[{"$f":"INDIRECT(\"Feuil3!\" & ADDRESS(ROW(A259),COLUMN(A259)))","v":0},0,0,0,0,0,0,null,0,"",0,{"$f":"INDEX(Récapitulatifs!$F$4:$F$250,MATCH($E262,Récapitulatifs!$B$4:$B$250,0))","v":{"$error":"#N/A"}},""]
[{"$f":"INDIRECT(\"Feuil3!\" & ADDRESS(ROW(A260),COLUMN(A260)))","v":0},0,0,0,0,0,0,null,0,"",0,{"$f":"INDEX(Récapitulatifs!$F$4:$F$250,MATCH($E263,Récapitulatifs!$B$4:$B$250,0))","v":{"$error":"#N/A"}},""]
[{"$f":"INDIRECT(\"Feuil3!\" & ADDRESS(ROW(A261),COLUMN(A261)))","v":0},0,0,0,0,0,0,null,0,"",0,{"$f":"INDEX(Récapitulatifs!$F$4:$F$250,MATCH($E264,Récapitulatifs!$B$4:$B$250,0))","v":{"$error":"#N/A"}},""]
[{"$f":"INDIRECT(\"Feuil3!\" & ADDRESS(ROW(A262),COLUMN(A262)))","v":0},0,0,0,0,0,0,null,0,"",0,{"$f":"INDEX(Récapitulatifs!$F$4:$F$250,MATCH($E265,Récapitulatifs!$B$4:$B$250,0))","v":{"$error":"#N/A"}},""]
[{"$f":"INDIRECT(\"Feuil3!\" & ADDRESS(ROW(A263),COLUMN(A263)))","v":0},0,0,0,0,0,0,null,0,"",0,{"$f":"INDEX(Récapitulatifs!$F$4:$F$250,MATCH($E266,Récapitulatifs!$B$4:$B$250,0))","v":{"$error":"#N/A"}},""]
[{"$f":"INDIRECT(\"Feuil3!\" & ADDRESS(ROW(A264),COLUMN(A264)))","v":0},0,0,0,0,0,0,null,0,"",0,{"$f":"INDEX(Récapitulatifs!$F$4:$F$250,MATCH($E267,Récapitulatifs!$B$4:$B$250,0))","v":{"$error":"#N/A"}},""]
[{"$f":"INDIRECT(\"Feuil3!\" & ADDRESS(ROW(A265),COLUMN(A265)))","v":0},0,0,0,0,0,0,null,0,"",0,{"$f":"INDEX(Récapitulatifs!$F$4:$F$250,MATCH($E268,Récapitulatifs!$B$4:$B$250,0))","v":{"$error":"#N/A"}},""]
[{"$f":"INDIRECT(\"Feuil3!\" & ADDRESS(ROW(A266),COLUMN(A266)))","v":0},0,0,0,0,0,0,null,0,"",0,{"$f":"INDEX(Récapitulatifs!$F$4:$F$250,MATCH($E269,Récapitulatifs!$B$4:$B$250,0))","v":{"$error":"#N/A"}},""]
[{"$f":"INDIRECT(\"Feuil3!\" & ADDRESS(ROW(A267),COLUMN(A267)))","v":0},0,0,0,0,0,0,null,0,"",0,{"$f":"INDEX(Récapitulatifs!$F$4:$F$250,MATCH($E270,Récapitulatifs!$B$4:$B$250,0))","v":{"$error":"#N/A"}},""]
[{"$f":"INDIRECT(\"Feuil3!\" & ADDRESS(ROW(A268),COLUMN(A268)))","v":0},0,0,0,0,0,0,null,0,"",0,{"$f":"INDEX(Récapitulatifs!$F$4:$F$250,MATCH($E271,Récapitulatifs!$B$4:$B$250,0))","v":{"$error":"#N/A"}},""]
[{"$f":"INDIRECT(\"Feuil3!\" & ADDRESS(ROW(A269),COLUMN(A269)))","v":0},0,0,0,0,0,0,null,0,"",0,{"$f":"INDEX(Récapitulatifs!$F$4:$F$250,MATCH($E272,Récapitulatifs!$B$4:$B$250,0))","v":{"$error":"#N/A"}},""]
[{"$f":"INDIRECT(\"Feuil3!\" & ADDRESS(ROW(A270),COLUMN(A270)))","v":0},0,0,0,0,0,0,null,0,"",0,{"$f":"INDEX(Récapitulatifs!$F$4:$F$250,MATCH($E273,Récapitulatifs!$B$4:$B$250,0))","v":{"$error":"#N/A"}},""]
[{"$f":"INDIRECT(\"Feuil3!\" & ADDRESS(ROW(A271),COLUMN(A271)))","v":0},0,0,0,0,0,0,null,0,"",0,{"$f":"INDEX(Récapitulatifs!$F$4:$F$250,MATCH($E274,Récapitulatifs!$B$4:$B$250,0))","v":{"$error":"#N/A"}},""]
[{"$f":"INDIRECT(\"Feuil3!\" & ADDRESS(ROW(A272),COLUMN(A272)))","v":0},0,0,0,0,0,0,null,0,"",0,{"$f":"INDEX(Récapitulatifs!$F$4:$F$250,MATCH($E275,Récapitulatifs!$B$4:$B$250,0))","v":{"$error":"#N/A"}},""]
[{"$f":"INDIRECT(\"Feuil3!\" & ADDRESS(ROW(A273),COLUMN(A273)))","v":0},0,0,0,0,0,0,null,0,"",0,{"$f":"INDEX(Récapitulatifs!$F$4:$F$250,MATCH($E276,Récapitulatifs!$B$4:$B$250,0))","v":{"$error":"#N/A"}},""]
[{"$f":"INDIRECT(\"Feuil3!\" & ADDRESS(ROW(A274),COLUMN(A274)))","v":0},0,0,0,0,0,0,null,0,"",0,{"$f":"INDEX(Récapitulatifs!$F$4:$F$250,MATCH($E277,Récapitulatifs!$B$4:$B$250,0))","v":{"$error":"#N/A"}},""]
[{"$f":"INDIRECT(\"Feuil3!\" & ADDRESS(ROW(A275),COLUMN(A275)))","v":0},0,0,0,0,0,0,null,0,"",0,{"$f":"INDEX(Récapitulatifs!$F$4:$F$250,MATCH($E278,Récapitulatifs!$B$4:$B$250,0))","v":{"$error":"#N/A"}},""]
[{"$f":"INDIRECT(\"Feuil3!\" & ADDRESS(ROW(A276),COLUMN(A276)))","v":0},0,0,0,0,0,0,null,0,"",0,{"$f":"INDEX(Récapitulatifs!$F$4:$F$250,MATCH($E279,Récapitulatifs!$B$4:$B$250,0))","v":{"$error":"#N/A"}},""]
[{"$f":"INDIRECT(\"Feuil3!\" & ADDRESS(ROW(A277),COLUMN(A277)))","v":0},0,0,0,0,0,0,null,0,"",0,{"$f":"INDEX(Récapitulatifs!$F$4:$F$250,MATCH($E280,Récapitulatifs!$B$4:$B$250,0))","v":{"$error":"#N/A"}},""]
[{"$f":"INDIRECT(\"Feuil3!\" & ADDRESS(ROW(A278),COLUMN(A278)))","v":0},0,0,0,0,0,0,null,0,"",0,{"$f":"INDEX(Récapitulatifs!$F$4:$F$250,MATCH($E281,Récapitulatifs!$B$4:$B$250,0))","v":{"$error":"#N/A"}},""]
[{"$f":"INDIRECT(\"Feuil3!\" & ADDRESS(ROW(A279),COLUMN(A279)))","v":0},0,0,0,0,0,0,null,0,"",0,{"$f":"INDEX(Récapitulatifs!$F$4:$F$250,MATCH($E282,Récapitulatifs!$B$4:$B$250,0))","v":{"$error":"#N/A"}},""]
[{"$f":"INDIRECT(\"Feuil3!\" & ADDRESS(ROW(A280),COLUMN(A280)))","v":0},0,0,0,0,0,0,null,0,"",0,{"$f":"INDEX(Récapitulatifs!$F$4:$F$250,MATCH($E283,Récapitulatifs!$B$4:$B$250,0))","v":{"$error":"#N/A"}},""]
[{"$f":"INDIRECT(\"Feuil3!\" & ADDRESS(ROW(A281),COLUMN(A281)))","v":0},0,0,0,0,0,0,null,0,"",0,{"$f":"INDEX(Récapitulatifs!$F$4:$F$250,MATCH($E284,Récapitulatifs!$B$4:$B$250,0))","v":{"$error":"#N/A"}},""]
[{"$f":"INDIRECT(\"Feuil3!\" & ADDRESS(ROW(A282),COLUMN(A282)))","v":0},0,0,0,0,0,0,null,0,"",0,{"$f":"INDEX(Récapitulatifs!$F$4:$F$250,MATCH($E285,Récapitulatifs!$B$4:$B$250,0))","v":{"$error":"#N/A"}},""]
[{"$f":"INDIRECT(\"Feuil3!\" & ADDRESS(ROW(A283),COLUMN(A283)))","v":0},0,0,0,0,0,0,null,0,"",0,{"$f":"INDEX(Récapitulatifs!$F$4:$F$250,MATCH($E286,Récapitulatifs!$B$4:$B$250,0))","v":{"$error":"#N/A"}},""]
[{"$f":"INDIRECT(\"Feuil3!\" & ADDRESS(ROW(A284),COLUMN(A284)))","v":0},0,0,0,0,0,0,null,0,"",0,{"$f":"INDEX(Récapitulatifs!$F$4:$F$250,MATCH($E287,Récapitulatifs!$B$4:$B$250,0))","v":{"$error":"#N/A"}},""]
[{"$f":"INDIRECT(\"Feuil3!\" & ADDRESS(ROW(A285),COLUMN(A285)))","v":0},0,0,0,0,0,0,null,0,"",0,{"$f":"INDEX(Récapitulatifs!$F$4:$F$250,MATCH($E288,Récapitulatifs!$B$4:$B$250,0))","v":{"$error":"#N/A"}},""]
[{"$f":"INDIRECT(\"Feuil3!\" & ADDRESS(ROW(A286),COLUMN(A286)))","v":0},0,0,0,0,0,0,null,0,"",0,{"$f":"INDEX(Récapitulatifs!$F$4:$F$250,MATCH($E289,Récapitulatifs!$B$4:$B$250,0))","v":{"$error":"#N/A"}},""]
[{"$f":"INDIRECT(\"Feuil3!\" & ADDRESS(ROW(A287),COLUMN(A287)))","v":0},0,0,0,0,0,0,null,0,"",0,{"$f":"INDEX(Récapitulatifs!$F$4:$F$250,MATCH($E290,Récapitulatifs!$B$4:$B$250,0))","v":{"$error":"#N/A"}},""]
[{"$f":"INDIRECT(\"Feuil3!\" & ADDRESS(ROW(A288),COLUMN(A288)))","v":0},0,0,0,0,0,0,null,0,"",0,{"$f":"INDEX(Récapitulatifs!$F$4:$F$250,MATCH($E291,Récapitulatifs!$B$4:$B$250,0))","v":{"$error":"#N/A"}},""]
[{"$f":"INDIRECT(\"Feuil3!\" & ADDRESS(ROW(A289),COLUMN(A289)))","v":0},0,0,0,0,0,0,null,0,"",0,{"$f":"INDEX(Récapitulatifs!$F$4:$F$250,MATCH($E292,Récapitulatifs!$B$4:$B$250,0))","v":{"$error":"#N/A"}},""]
[{"$f":"INDIRECT(\"Feuil3!\" & ADDRESS(ROW(A290),COLUMN(A290)))","v":0},0,0,0,0,0,0,null,0,"",0,{"$f":"INDEX(Récapitulatifs!$F$4:$F$250,MATCH($E293,Récapitulatifs!$B$4:$B$250,0))","v":{"$error":"#N/A"}},""]
[{"$f":"INDIRECT(\"Feuil3!\" & ADDRESS(ROW(A291),COLUMN(A291)))","v":0},0,0,0,0,0,0,null,0,"",0,{"$f":"INDEX(Récapitulatifs!$F$4:$F$250,MATCH($E294,Récapitulatifs!$B$4:$B$250,0))","v":{"$error":"#N/A"}},""]
[{"$f":"INDIRECT(\"Feuil3!\" & ADDRESS(ROW(A292),COLUMN(A292)))","v":0},0,0,0,0,0,0,null,0,"",0,{"$f":"INDEX(Récapitulatifs!$F$4:$F$250,MATCH($E295,Récapitulatifs!$B$4:$B$250,0))","v":{"$error":"#N/A"}},""]
[{"$f":"INDIRECT(\"Feuil3!\" & ADDRESS(ROW(A293),COLUMN(A293)))","v":0},0,0,0,0,0,0,null,0,"",0,{"$f":"INDEX(Récapitulatifs!$F$4:$F$250,MATCH($E296,Récapitulatifs!$B$4:$B$250,0))","v":{"$error":"#N/A"}},""]
[{"$f":"INDIRECT(\"Feuil3!\" & ADDRESS(ROW(A294),COLUMN(A294)))","v":0},0,0,0,0,0,0,null,0,"",0,{"$f":"INDEX(Récapitulatifs!$F$4:$F$250,MATCH($E297,Récapitulatifs!$B$4:$B$250,0))","v":{"$error":"#N/A"}},""]
[{"$f":"INDIRECT(\"Feuil3!\" & ADDRESS(ROW(A295),COLUMN(A295)))","v":0},0,0,0,0,0,0,null,0,"",0,{"$f":"INDEX(Récapitulatifs!$F$4:$F$250,MATCH($E298,Récapitulatifs!$B$4:$B$250,0))","v":{"$error":"#N/A"}},""]
[{"$f":"INDIRECT(\"Feuil3!\" & ADDRESS(ROW(A296),COLUMN(A296)))","v":0},0,0,0,0,0,0,null,0,"",0,{"$f":"INDEX(Récapitulatifs!$F$4:$F$250,MATCH($E299,Récapitulatifs!$B$4:$B$250,0))","v":{"$error":"#N/A"}},""]
[{"$f":"INDIRECT(\"Feuil3!\" & ADDRESS(ROW(A297),COLUMN(A297)))","v":0},0,0,0,0,0,0,null,0,"",0,{"$f":"INDEX(Récapitulatifs!$F$4:$F$250,MATCH($E300,Récapitulatifs!$B$4:$B$250,0))","v":{"$error":"#N/A"}},""]

{"sheet":"Récapitulatifs","index":1,"n_rows":250,"n_cols":9,"rows_kept":250,"cut":false,"hidden":false,"merged":[]}
[]
[]
[null,"REFERENCE","QUANTITE","QUANTITE","VALIDATION","INFO DE PREPARATION  ","MESSAGE ","VALIDATION","INFO DE PREPARATION  "]
[null,{"$f":"IF(ISERROR(INDEX(ColE,MIN(IF((Nom<>0)*(COUNTIF($B$3:B3,Nom)=0),ROW(Nom))))&\"\"),\"\",INDEX(ColE,MIN(IF((Nom<>0)*(COUNTIF($B$3:B3,Nom)=0),ROW(Nom))))&\"\")","v":"4740"},{"$f":"IF(B4<>\"\",COUNTIF('Tableau Commandes'!E5:E300,Récapitulatifs!B4),\"\")","v":5},{"$f":"IF(B4=\"\",\"\",SUMIF(REF,B4,'Tableau Commandes'!$C$5:$C$26))","v":5},{"$f":"H4","v":0},{"$f":"IF(E4=\"P\",\"PREPAREE\",IF(E4=\"R\",\"RELIQUAT\",))","v":0},{"$f":"INDEX('Tableau Commandes'!$M$4:$M$300,MATCH($B4,'Tableau Commandes'!$E$4:$E$300,0))","v":"DISPO CHEZ MOI"},null,{"$f":"IF(H4=\"P\",\"PREPAREE\",IF(H4=\"R\",\"RELIQUAT\",))","v":0}]
[null,{"$f":"IF(ISERROR(INDEX(ColE,MIN(IF((Nom<>0)*(COUNTIF($B$3:B4,Nom)=0),ROW(Nom))))&\"\"),\"\",INDEX(ColE,MIN(IF((Nom<>0)*(COUNTIF($B$3:B4,Nom)=0),ROW(Nom))))&\"\")","v":"79925"},{"$f":"IF(B5<>\"\",COUNTIF('Tableau Commandes'!E6:E301,Récapitulatifs!B5),\"\")","v":1},{"$f":"IF(B5=\"\",\"\",SUMIF(REF,B5,'Tableau Commandes'!$C$5:$C$26))","v":1},{"$f":"H5","v":0},{"$f":"IF(E5=\"P\",\"PREPAREE\",IF(E5=\"R\",\"RELIQUAT\",))","v":0},{"$f":"INDEX('Tableau Commandes'!$M$4:$M$300,MATCH($B5,'Tableau Commandes'!$E$4:$E$300,0))","v":""},null,{"$f":"IF(H5=\"P\",\"PREPAREE\",IF(H5=\"R\",\"RELIQUAT\",))","v":0}]
[null,{"$f":"IF(ISERROR(INDEX(ColE,MIN(IF((Nom<>0)*(COUNTIF($B$3:B5,Nom)=0),ROW(Nom))))&\"\"),\"\",INDEX(ColE,MIN(IF((Nom<>0)*(COUNTIF($B$3:B5,Nom)=0),ROW(Nom))))&\"\")","v":"87196"},{"$f":"IF(B6<>\"\",COUNTIF('Tableau Commandes'!E7:E302,Récapitulatifs!B6),\"\")","v":1},{"$f":"IF(B6=\"\",\"\",SUMIF(REF,B6,'Tableau Commandes'!$C$5:$C$26))","v":2},0,0,{"$f":"INDEX('Tableau Commandes'!$M$4:$M$300,MATCH($B6,'Tableau Commandes'!$E$4:$E$300,0))","v":""},null,0]
[null,{"$f":"IF(ISERROR(INDEX(ColE,MIN(IF((Nom<>0)*(COUNTIF($B$3:B6,Nom)=0),ROW(Nom))))&\"\"),\"\",INDEX(ColE,MIN(IF((Nom<>0)*(COUNTIF($B$3:B6,Nom)=0),ROW(Nom))))&\"\")","v":"99904"},{"$f":"IF(B7<>\"\",COUNTIF('Tableau Commandes'!E8:E303,Récapitulatifs!B7),\"\")","v":1},{"$f":"IF(B7=\"\",\"\",SUMIF(REF,B7,'Tableau Commandes'!$C$5:$C$26))","v":2},0,0,{"$f":"INDEX('Tableau Commandes'!$M$4:$M$300,MATCH($B7,'Tableau Commandes'!$E$4:$E$300,0))","v":""},null,0]
[null,{"$f":"IF(ISERROR(INDEX(ColE,MIN(IF((Nom<>0)*(COUNTIF($B$3:B7,Nom)=0),ROW(Nom))))&\"\"),\"\",INDEX(ColE,MIN(IF((Nom<>0)*(COUNTIF($B$3:B7,Nom)=0),ROW(Nom))))&\"\")","v":"199016"},{"$f":"IF(B8<>\"\",COUNTIF('Tableau Commandes'!E9:E304,Récapitulatifs!B8),\"\")","v":1},{"$f":"IF(B8=\"\",\"\",SUMIF(REF,B8,'Tableau Commandes'!$C$5:$C$26))","v":1},0,0,{"$f":"INDEX('Tableau Commandes'!$M$4:$M$300,MATCH($B8,'Tableau Commandes'!$E$4:$E$300,0))","v":""},null,0]
[null,{"$f":"IF(ISERROR(INDEX(ColE,MIN(IF((Nom<>0)*(COUNTIF($B$3:B8,Nom)=0),ROW(Nom))))&\"\"),\"\",INDEX(ColE,MIN(IF((Nom<>0)*(COUNTIF($B$3:B8,Nom)=0),ROW(Nom))))&\"\")","v":"GLC40101"},{"$f":"IF(B9<>\"\",COUNTIF('Tableau Commandes'!E10:E305,Récapitulatifs!B9),\"\")","v":1},{"$f":"IF(B9=\"\",\"\",SUMIF(REF,B9,'Tableau Commandes'!$C$5:$C$26))","v":1},0,0,{"$f":"INDEX('Tableau Commandes'!$M$4:$M$300,MATCH($B9,'Tableau Commandes'!$E$4:$E$300,0))","v":""},null,0]
[null,{"$f":"IF(ISERROR(INDEX(ColE,MIN(IF((Nom<>0)*(COUNTIF($B$3:B9,Nom)=0),ROW(Nom))))&\"\"),\"\",INDEX(ColE,MIN(IF((Nom<>0)*(COUNTIF($B$3:B9,Nom)=0),ROW(Nom))))&\"\")","v":"MECA8425"},{"$f":"IF(B10<>\"\",COUNTIF('Tableau Commandes'!E11:E306,Récapitulatifs!B10),\"\")","v":1},{"$f":"IF(B10=\"\",\"\",SUMIF(REF,B10,'Tableau Commandes'!$C$5:$C$26))","v":1},0,0,{"$f":"INDEX('Tableau Commandes'!$M$4:$M$300,MATCH($B10,'Tableau Commandes'!$E$4:$E$300,0))","v":""},null,0]
[null,{"$f":"IF(ISERROR(INDEX(ColE,MIN(IF((Nom<>0)*(COUNTIF($B$3:B10,Nom)=0),ROW(Nom))))&\"\"),\"\",INDEX(ColE,MIN(IF((Nom<>0)*(COUNTIF($B$3:B10,Nom)=0),ROW(Nom))))&\"\")","v":"152760"},{"$f":"IF(B11<>\"\",COUNTIF('Tableau Commandes'!E12:E307,Récapitulatifs!B11),\"\")","v":2},{"$f":"IF(B11=\"\",\"\",SUMIF(REF,B11,'Tableau Commandes'!$C$5:$C$26))","v":2},0,0,{"$f":"INDEX('Tableau Commandes'!$M$4:$M$300,MATCH($B11,'Tableau Commandes'!$E$4:$E$300,0))","v":""},null,0]
[null,{"$f":"IF(ISERROR(INDEX(ColE,MIN(IF((Nom<>0)*(COUNTIF($B$3:B11,Nom)=0),ROW(Nom))))&\"\"),\"\",INDEX(ColE,MIN(IF((Nom<>0)*(COUNTIF($B$3:B11,Nom)=0),ROW(Nom))))&\"\")","v":"83523"},{"$f":"IF(B12<>\"\",COUNTIF('Tableau Commandes'!E13:E308,Récapitulatifs!B12),\"\")","v":4},{"$f":"IF(B12=\"\",\"\",SUMIF(REF,B12,'Tableau Commandes'!$C$5:$C$26))","v":5},0,0,{"$f":"INDEX('Tableau Commandes'!$M$4:$M$300,MATCH($B12,'Tableau Commandes'!$E$4:$E$300,0))","v":"DISPO CHEZ MOI"},null,0]
[null,{"$f":"IF(ISERROR(INDEX(ColE,MIN(IF((Nom<>0)*(COUNTIF($B$3:B12,Nom)=0),ROW(Nom))))&\"\"),\"\",INDEX(ColE,MIN(IF((Nom<>0)*(COUNTIF($B$3:B12,Nom)=0),ROW(Nom))))&\"\")","v":"83524"},{"$f":"IF(B13<>\"\",COUNTIF('Tableau Commandes'!E14:E309,Récapitulatifs!B13),\"\")","v":5},{"$f":"IF(B13=\"\",\"\",SUMIF(REF,B13,'Tableau Commandes'!$C$5:$C$26))","v":6},0,0,{"$f":"INDEX('Tableau Commandes'!$M$4:$M$300,MATCH($B13,'Tableau Commandes'!$E$4:$E$300,0))","v":"DISPO CHEZ MOI"},null,0]
[null,{"$f":"IF(ISERROR(INDEX(ColE,MIN(IF((Nom<>0)*(COUNTIF($B$3:B13,Nom)=0),ROW(Nom))))&\"\"),\"\",INDEX(ColE,MIN(IF((Nom<>0)*(COUNTIF($B$3:B13,Nom)=0),ROW(Nom))))&\"\")","v":"MECA8655"},{"$f":"IF(B14<>\"\",COUNTIF('Tableau Commandes'!E15:E310,Récapitulatifs!B14),\"\")","v":1},{"$f":"IF(B14=\"\",\"\",SUMIF(REF,B14,'Tableau Commandes'!$C$5:$C$26))","v":1},0,0,{"$f":"INDEX('Tableau Commandes'!$M$4:$M$300,MATCH($B14,'Tableau Commandes'!$E$4:$E$300,0))","v":""},null,0]
[null,{"$f":"IF(ISERROR(INDEX(ColE,MIN(IF((Nom<>0)*(COUNTIF($B$3:B14,Nom)=0),ROW(Nom))))&\"\"),\"\",INDEX(ColE,MIN(IF((Nom<>0)*(COUNTIF($B$3:B14,Nom)=0),ROW(Nom))))&\"\")","v":"2335"},{"$f":"IF(B15<>\"\",COUNTIF('Tableau Commandes'!E16:E311,Récapitulatifs!B15),\"\")","v":4},{"$f":"IF(B15=\"\",\"\",SUMIF(REF,B15,'Tableau Commandes'!$C$5:$C$26))","v":4},0,0,{"$f":"INDEX('Tableau Commandes'!$M$4:$M$300,MATCH($B15,'Tableau Commandes'!$E$4:$E$300,0))","v":"DISPO CHEZ MOI"},null,0]
[null,{"$f":"IF(ISERROR(INDEX(ColE,MIN(IF((Nom<>0)*(COUNTIF($B$3:B15,Nom)=0),ROW(Nom))))&\"\"),\"\",INDEX(ColE,MIN(IF((Nom<>0)*(COUNTIF($B$3:B15,Nom)=0),ROW(Nom))))&\"\")","v":"99901XDEUX"},{"$f":"IF(B16<>\"\",COUNTIF('Tableau Commandes'!E17:E312,Récapitulatifs!B16),\"\")","v":1},{"$f":"IF(B16=\"\",\"\",SUMIF(REF,B16,'Tableau Commandes'!$C$5:$C$26))","v":1},0,0,{"$f":"INDEX('Tableau Commandes'!$M$4:$M$300,MATCH($B16,'Tableau Commandes'!$E$4:$E$300,0))","v":"DISPO CHEZ MOI"},null,0]
[null,{"$f":"IF(ISERROR(INDEX(ColE,MIN(IF((Nom<>0)*(COUNTIF($B$3:B16,Nom)=0),ROW(Nom))))&\"\"),\"\",INDEX(ColE,MIN(IF((Nom<>0)*(COUNTIF($B$3:B16,Nom)=0),ROW(Nom))))&\"\")","v":"350240XDEUX"},{"$f":"IF(B17<>\"\",COUNTIF('Tableau Commandes'!E18:E313,Récapitulatifs!B17),\"\")","v":3},{"$f":"IF(B17=\"\",\"\",SUMIF(REF,B17,'Tableau Commandes'!$C$5:$C$26))","v":3},0,0,{"$f":"INDEX('Tableau Commandes'!$M$4:$M$300,MATCH($B17,'Tableau Commandes'!$E$4:$E$300,0))","v":""},null,0]
[null,{"$f":"IF(ISERROR(INDEX(ColE,MIN(IF((Nom<>0)*(COUNTIF($B$3:B17,Nom)=0),ROW(Nom))))&\"\"),\"\",INDEX(ColE,MIN(IF((Nom<>0)*(COUNTIF($B$3:B17,Nom)=0),ROW(Nom))))&\"\")","v":"81036"},{"$f":"IF(B18<>\"\",COUNTIF('Tableau Commandes'!E19:E314,Récapitulatifs!B18),\"\")","v":1},{"$f":"IF(B18=\"\",\"\",SUMIF(REF,B18,'Tableau Commandes'!$C$5:$C$26))","v":1},0,{"$f":"IF(E18=\"P\",\"PREPAREE\",IF(E18=\"R\",\"RELIQUAT\",))","v":0},{"$f":"INDEX('Tableau Commandes'!$M$4:$M$300,MATCH($B18,'Tableau Commandes'!$E$4:$E$300,0))","v":"DISPO CHEZ MOI"},null,0]
[null,{"$f":"IF(ISERROR(INDEX(ColE,MIN(IF((Nom<>0)*(COUNTIF($B$3:B18,Nom)=0),ROW(Nom))))&\"\"),\"\",INDEX(ColE,MIN(IF((Nom<>0)*(COUNTIF($B$3:B18,Nom)=0),ROW(Nom))))&\"\")","v":"79038XDEUX"},{"$f":"IF(B19<>\"\",COUNTIF('Tableau Commandes'!E20:E315,Récapitulatifs!B19),\"\")","v":1},{"$f":"IF(B19=\"\",\"\",SUMIF(REF,B19,'Tableau Commandes'!$C$5:$C$26))","v":1},0,0,{"$f":"INDEX('Tableau Commandes'!$M$4:$M$300,MATCH($B19,'Tableau Commandes'!$E$4:$E$300,0))","v":""},null,0]
[null,{"$f":"IF(ISERROR(INDEX(ColE,MIN(IF((Nom<>0)*(COUNTIF($B$3:B19,Nom)=0),ROW(Nom))))&\"\"),\"\",INDEX(ColE,MIN(IF((Nom<>0)*(COUNTIF($B$3:B19,Nom)=0),ROW(Nom))))&\"\")","v":"199017"},{"$f":"IF(B20<>\"\",COUNTIF('Tableau Commandes'!E21:E316,Récapitulatifs!B20),\"\")","v":2},{"$f":"IF(B20=\"\",\"\",SUMIF(REF,B20,'Tableau Commandes'!$C$5:$C$26))","v":2},0,0,{"$f":"INDEX('Tableau Commandes'!$M$4:$M$300,MATCH($B20,'Tableau Commandes'!$E$4:$E$300,0))","v":""},null,0]
[null,{"$f":"IF(ISERROR(INDEX(ColE,MIN(IF((Nom<>0)*(COUNTIF($B$3:B20,Nom)=0),ROW(Nom))))&\"\"),\"\",INDEX(ColE,MIN(IF((Nom<>0)*(COUNTIF($B$3:B20,Nom)=0),ROW(Nom))))&\"\")","v":"A14541"},{"$f":"IF(B21<>\"\",COUNTIF('Tableau Commandes'!E22:E317,Récapitulatifs!B21),\"\")","v":2},{"$f":"IF(B21=\"\",\"\",SUMIF(REF,B21,'Tableau Commandes'!$C$5:$C$26))","v":2},0,0,{"$f":"INDEX('Tableau Commandes'!$M$4:$M$300,MATCH($B21,'Tableau Commandes'!$E$4:$E$300,0))","v":""},null,0]
[null,{"$f":"IF(ISERROR(INDEX(ColE,MIN(IF((Nom<>0)*(COUNTIF($B$3:B21,Nom)=0),ROW(Nom))))&\"\"),\"\",INDEX(ColE,MIN(IF((Nom<>0)*(COUNTIF($B$3:B21,Nom)=0),ROW(Nom))))&\"\")","v":"99971"},{"$f":"IF(B22<>\"\",COUNTIF('Tableau Commandes'!E23:E318,Récapitulatifs!B22),\"\")","v":1},{"$f":"IF(B22=\"\",\"\",SUMIF(REF,B22,'Tableau Commandes'!$C$5:$C$26))","v":2},0,0,{"$f":"INDEX('Tableau Commandes'!$M$4:$M$300,MATCH($B22,'Tableau Commandes'!$E$4:$E$300,0))","v":""},null,0]
[null,{"$f":"IF(ISERROR(INDEX(ColE,MIN(IF((Nom<>0)*(COUNTIF($B$3:B22,Nom)=0),ROW(Nom))))&\"\"),\"\",INDEX(ColE,MIN(IF((Nom<>0)*(COUNTIF($B$3:B22,Nom)=0),ROW(Nom))))&\"\")","v":"6PK1563"},{"$f":"IF(B23<>\"\",COUNTIF('Tableau Commandes'!E24:E319,Récapitulatifs!B23),\"\")","v":1},{"$f":"IF(B23=\"\",\"\",SUMIF(REF,B23,'Tableau Commandes'!$C$5:$C$26))","v":1},0,0,{"$f":"INDEX('Tableau Commandes'!$M$4:$M$300,MATCH($B23,'Tableau Commandes'!$E$4:$E$300,0))","v":""},null,0]
[null,{"$f":"IF(ISERROR(INDEX(ColE,MIN(IF((Nom<>0)*(COUNTIF($B$3:B23,Nom)=0),ROW(Nom))))&\"\"),\"\",INDEX(ColE,MIN(IF((Nom<>0)*(COUNTIF($B$3:B23,Nom)=0),ROW(Nom))))&\"\")","v":"MECA3836"},{"$f":"IF(B24<>\"\",COUNTIF('Tableau Commandes'!E25:E320,Récapitulatifs!B24),\"\")","v":3},{"$f":"IF(B24=\"\",\"\",SUMIF(REF,B24,'Tableau Commandes'!$C$5:$C$26))","v":3},0,0,{"$f":"INDEX('Tableau Commandes'!$M$4:$M$300,MATCH($B24,'Tableau Commandes'!$E$4:$E$300,0))","v":"DISPO CHEZ MOI"},null,0]
[null,{"$f":"IF(ISERROR(INDEX(ColE,MIN(IF((Nom<>0)*(COUNTIF($B$3:B24,Nom)=0),ROW(Nom))))&\"\"),\"\",INDEX(ColE,MIN(IF((Nom<>0)*(COUNTIF($B$3:B24,Nom)=0),ROW(Nom))))&\"\")","v":"CDAL-116922"},{"$f":"IF(B25<>\"\",COUNTIF('Tableau Commandes'!E26:E321,Récapitulatifs!B25),\"\")","v":2},{"$f":"IF(B25=\"\",\"\",SUMIF(REF,B25,'Tableau Commandes'!$C$5:$C$26))","v":2},0,0,{"$f":"INDEX('Tableau Commandes'!$M$4:$M$300,MATCH($B25,'Tableau Commandes'!$E$4:$E$300,0))","v":""},null,0]
[null,{"$f":"IF(ISERROR(INDEX(ColE,MIN(IF((Nom<>0)*(COUNTIF($B$3:B25,Nom)=0),ROW(Nom))))&\"\"),\"\",INDEX(ColE,MIN(IF((Nom<>0)*(COUNTIF($B$3:B25,Nom)=0),ROW(Nom))))&\"\")","v":"GLC42119"},{"$f":"IF(B26<>\"\",COUNTIF('Tableau Commandes'!E27:E322,Récapitulatifs!B26),\"\")","v":1},{"$f":"IF(B26=\"\",\"\",SUMIF(REF,B26,'Tableau Commandes'!$C$5:$C$26))","v":1},0,0,{"$f":"INDEX('Tableau Commandes'!$M$4:$M$300,MATCH($B26,'Tableau Commandes'!$E$4:$E$300,0))","v":""},null,0]
[null,{"$f":"IF(ISERROR(INDEX(ColE,MIN(IF((Nom<>0)*(COUNTIF($B$3:B26,Nom)=0),ROW(Nom))))&\"\"),\"\",INDEX(ColE,MIN(IF((Nom<>0)*(COUNTIF($B$3:B26,Nom)=0),ROW(Nom))))&\"\")","v":"GLC42120"},{"$f":"IF(B27<>\"\",COUNTIF('Tableau Commandes'!E28:E323,Récapitulatifs!B27),\"\")","v":1},{"$f":"IF(B27=\"\",\"\",SUMIF(REF,B27,'Tableau Commandes'!$C$5:$C$26))","v":1},0,0,{"$f":"INDEX('Tableau Commandes'!$M$4:$M$300,MATCH($B27,'Tableau Commandes'!$E$4:$E$300,0))","v":""},null,0]
[null,{"$f":"IF(ISERROR(INDEX(ColE,MIN(IF((Nom<>0)*(COUNTIF($B$3:B27,Nom)=0),ROW(Nom))))&\"\"),\"\",INDEX(ColE,MIN(IF((Nom<>0)*(COUNTIF($B$3:B27,Nom)=0),ROW(Nom))))&\"\")","v":"GLC42303"},{"$f":"IF(B28<>\"\",COUNTIF('Tableau Commandes'!E29:E324,Récapitulatifs!B28),\"\")","v":1},{"$f":"IF(B28=\"\",\"\",SUMIF(REF,B28,'Tableau Commandes'!$C$5:$C$26))","v":2},0,0,{"$f":"INDEX('Tableau Commandes'!$M$4:$M$300,MATCH($B28,'Tableau Commandes'!$E$4:$E$300,0))","v":""},null,0]
[null,{"$f":"IF(ISERROR(INDEX(ColE,MIN(IF((Nom<>0)*(COUNTIF($B$3:B28,Nom)=0),ROW(Nom))))&\"\"),\"\",INDEX(ColE,MIN(IF((Nom<>0)*(COUNTIF($B$3:B28,Nom)=0),ROW(Nom))))&\"\")","v":"4672"},{"$f":"IF(B29<>\"\",COUNTIF('Tableau Commandes'!E30:E325,Récapitulatifs!B29),\"\")","v":1},{"$f":"IF(B29=\"\",\"\",SUMIF(REF,B29,'Tableau Commandes'!$C$5:$C$26))","v":1},0,0,{"$f":"INDEX('Tableau Commandes'!$M$4:$M$300,MATCH($B29,'Tableau Commandes'!$E$4:$E$300,0))","v":"DISPO CHEZ MOI"},null,0]
[null,{"$f":"IF(ISERROR(INDEX(ColE,MIN(IF((Nom<>0)*(COUNTIF($B$3:B29,Nom)=0),ROW(Nom))))&\"\"),\"\",INDEX(ColE,MIN(IF((Nom<>0)*(COUNTIF($B$3:B29,Nom)=0),ROW(Nom))))&\"\")","v":"MECA2684"},{"$f":"IF(B30<>\"\",COUNTIF('Tableau Commandes'!E31:E326,Récapitulatifs!B30),\"\")","v":1},{"$f":"IF(B30=\"\",\"\",SUMIF(REF,B30,'Tableau Commandes'!$C$5:$C$26))","v":1},0,0,{"$f":"INDEX('Tableau Commandes'!$M$4:$M$300,MATCH($B30,'Tableau Commandes'!$E$4:$E$300,0))","v":"DISPO CHEZ MOI"},null,0]
[null,{"$f":"IF(ISERROR(INDEX(ColE,MIN(IF((Nom<>0)*(COUNTIF($B$3:B30,Nom)=0),ROW(Nom))))&\"\"),\"\",INDEX(ColE,MIN(IF((Nom<>0)*(COUNTIF($B$3:B30,Nom)=0),ROW(Nom))))&\"\")","v":"9501167"},{"$f":"IF(B31<>\"\",COUNTIF('Tableau Commandes'!E32:E327,Récapitulatifs!B31),\"\")","v":1},{"$f":"IF(B31=\"\",\"\",SUMIF(REF,B31,'Tableau Commandes'!$C$5:$C$26))","v":1},0,0,{"$f":"INDEX('Tableau Commandes'!$M$4:$M$300,MATCH($B31,'Tableau Commandes'!$E$4:$E$300,0))","v":"DISPO CHEZ MOI"},null,0]
[null,{"$f":"IF(ISERROR(INDEX(ColE,MIN(IF((Nom<>0)*(COUNTIF($B$3:B31,Nom)=0),ROW(Nom))))&\"\"),\"\",INDEX(ColE,MIN(IF((Nom<>0)*(COUNTIF($B$3:B31,Nom)=0),ROW(Nom))))&\"\")","v":"4612"},{"$f":"IF(B32<>\"\",COUNTIF('Tableau Commandes'!E33:E328,Récapitulatifs!B32),\"\")","v":2},{"$f":"IF(B32=\"\",\"\",SUMIF(REF,B32,'Tableau Commandes'!$C$5:$C$26))","v":2},0,0,{"$f":"INDEX('Tableau Commandes'!$M$4:$M$300,MATCH($B32,'Tableau Commandes'!$E$4:$E$300,0))","v":"DISPO CHEZ MOI"},null,0]
[null,{"$f":"IF(ISERROR(INDEX(ColE,MIN(IF((Nom<>0)*(COUNTIF($B$3:B32,Nom)=0),ROW(Nom))))&\"\"),\"\",INDEX(ColE,MIN(IF((Nom<>0)*(COUNTIF($B$3:B32,Nom)=0),ROW(Nom))))&\"\")","v":"2000450"},{"$f":"IF(B33<>\"\",COUNTIF('Tableau Commandes'!E34:E329,Récapitulatifs!B33),\"\")","v":1},{"$f":"IF(B33=\"\",\"\",SUMIF(REF,B33,'Tableau Commandes'!$C$5:$C$26))","v":1},0,0,{"$f":"INDEX('Tableau Commandes'!$M$4:$M$300,MATCH($B33,'Tableau Commandes'!$E$4:$E$300,0))","v":"DISPO CHEZ MOI"},null,0]
[null,{"$f":"IF(ISERROR(INDEX(ColE,MIN(IF((Nom<>0)*(COUNTIF($B$3:B33,Nom)=0),ROW(Nom))))&\"\"),\"\",INDEX(ColE,MIN(IF((Nom<>0)*(COUNTIF($B$3:B33,Nom)=0),ROW(Nom))))&\"\")","v":"2000600"},{"$f":"IF(B34<>\"\",COUNTIF('Tableau Commandes'!E35:E330,Récapitulatifs!B34),\"\")","v":1},{"$f":"IF(B34=\"\",\"\",SUMIF(REF,B34,'Tableau Commandes'!$C$5:$C$26))","v":1},0,0,{"$f":"INDEX('Tableau Commandes'!$M$4:$M$300,MATCH($B34,'Tableau Commandes'!$E$4:$E$300,0))","v":"DISPO CHEZ MOI"},null,0]
[null,{"$f":"IF(ISERROR(INDEX(ColE,MIN(IF((Nom<>0)*(COUNTIF($B$3:B34,Nom)=0),ROW(Nom))))&\"\"),\"\",INDEX(ColE,MIN(IF((Nom<>0)*(COUNTIF($B$3:B34,Nom)=0),ROW(Nom))))&\"\")","v":"800800"},{"$f":"IF(B35<>\"\",COUNTIF('Tableau Commandes'!E36:E331,Récapitulatifs!B35),\"\")","v":1},{"$f":"IF(B35=\"\",\"\",SUMIF(REF,B35,'Tableau Commandes'!$C$5:$C$26))","v":1},0,0,{"$f":"INDEX('Tableau Commandes'!$M$4:$M$300,MATCH($B35,'Tableau Commandes'!$E$4:$E$300,0))","v":"DISPO CHEZ MOI"},null,0]
[null,{"$f":"IF(ISERROR(INDEX(ColE,MIN(IF((Nom<>0)*(COUNTIF($B$3:B35,Nom)=0),ROW(Nom))))&\"\"),\"\",INDEX(ColE,MIN(IF((Nom<>0)*(COUNTIF($B$3:B35,Nom)=0),ROW(Nom))))&\"\")","v":"30503"},{"$f":"IF(B36<>\"\",COUNTIF('Tableau Commandes'!E37:E332,Récapitulatifs!B36),\"\")","v":1},{"$f":"IF(B36=\"\",\"\",SUMIF(REF,B36,'Tableau Commandes'!$C$5:$C$26))","v":1},0,0,{"$f":"INDEX('Tableau Commandes'!$M$4:$M$300,MATCH($B36,'Tableau Commandes'!$E$4:$E$300,0))","v":""},null,0]
[null,{"$f":"IF(ISERROR(INDEX(ColE,MIN(IF((Nom<>0)*(COUNTIF($B$3:B36,Nom)=0),ROW(Nom))))&\"\"),\"\",INDEX(ColE,MIN(IF((Nom<>0)*(COUNTIF($B$3:B36,Nom)=0),ROW(Nom))))&\"\")","v":"30502"},{"$f":"IF(B37<>\"\",COUNTIF('Tableau Commandes'!E38:E333,Récapitulatifs!B37),\"\")","v":1},{"$f":"IF(B37=\"\",\"\",SUMIF(REF,B37,'Tableau Commandes'!$C$5:$C$26))","v":1},0,0,{"$f":"INDEX('Tableau Commandes'!$M$4:$M$300,MATCH($B37,'Tableau Commandes'!$E$4:$E$300,0))","v":""},null,0]
[null,{"$f":"IF(ISERROR(INDEX(ColE,MIN(IF((Nom<>0)*(COUNTIF($B$3:B37,Nom)=0),ROW(Nom))))&\"\"),\"\",INDEX(ColE,MIN(IF((Nom<>0)*(COUNTIF($B$3:B37,Nom)=0),ROW(Nom))))&\"\")","v":"199006"},{"$f":"IF(B38<>\"\",COUNTIF('Tableau Commandes'!E39:E334,Récapitulatifs!B38),\"\")","v":2},{"$f":"IF(B38=\"\",\"\",SUMIF(REF,B38,'Tableau Commandes'!$C$5:$C$26))","v":2},0,0,{"$f":"INDEX('Tableau Commandes'!$M$4:$M$300,MATCH($B38,'Tableau Commandes'!$E$4:$E$300,0))","v":""},null,0]
[null,{"$f":"IF(ISERROR(INDEX(ColE,MIN(IF((Nom<>0)*(COUNTIF($B$3:B38,Nom)=0),ROW(Nom))))&\"\"),\"\",INDEX(ColE,MIN(IF((Nom<>0)*(COUNTIF($B$3:B38,Nom)=0),ROW(Nom))))&\"\")","v":"71065XDEUX"},{"$f":"IF(B39<>\"\",COUNTIF('Tableau Commandes'!E40:E335,Récapitulatifs!B39),\"\")","v":1},{"$f":"IF(B39=\"\",\"\",SUMIF(REF,B39,'Tableau Commandes'!$C$5:$C$26))","v":1},0,0,{"$f":"INDEX('Tableau Commandes'!$M$4:$M$300,MATCH($B39,'Tableau Commandes'!$E$4:$E$300,0))","v":""},null,0]
[null,{"$f":"IF(ISERROR(INDEX(ColE,MIN(IF((Nom<>0)*(COUNTIF($B$3:B39,Nom)=0),ROW(Nom))))&\"\"),\"\",INDEX(ColE,MIN(IF((Nom<>0)*(COUNTIF($B$3:B39,Nom)=0),ROW(Nom))))&\"\")","v":"86286X"},{"$f":"IF(B40<>\"\",COUNTIF('Tableau Commandes'!E41:E336,Récapitulatifs!B40),\"\")","v":1},{"$f":"IF(B40=\"\",\"\",SUMIF(REF,B40,'Tableau Commandes'!$C$5:$C$26))","v":2},0,0,{"$f":"INDEX('Tableau Commandes'!$M$4:$M$300,MATCH($B40,'Tableau Commandes'!$E$4:$E$300,0))","v":"DISPO CHEZ MOI"},null,0]
[null,{"$f":"IF(ISERROR(INDEX(ColE,MIN(IF((Nom<>0)*(COUNTIF($B$3:B40,Nom)=0),ROW(Nom))))&\"\"),\"\",INDEX(ColE,MIN(IF((Nom<>0)*(COUNTIF($B$3:B40,Nom)=0),ROW(Nom))))&\"\")","v":"86404X"},{"$f":"IF(B41<>\"\",COUNTIF('Tableau Commandes'!E42:E337,Récapitulatifs!B41),\"\")","v":2},{"$f":"IF(B41=\"\",\"\",SUMIF(REF,B41,'Tableau Commandes'!$C$5:$C$26))","v":2},0,0,{"$f":"INDEX('Tableau Commandes'!$M$4:$M$300,MATCH($B41,'Tableau Commandes'!$E$4:$E$300,0))","v":"DISPO CHEZ MOI"},null,0]
[null,{"$f":"IF(ISERROR(INDEX(ColE,MIN(IF((Nom<>0)*(COUNTIF($B$3:B41,Nom)=0),ROW(Nom))))&\"\"),\"\",INDEX(ColE,MIN(IF((Nom<>0)*(COUNTIF($B$3:B41,Nom)=0),ROW(Nom))))&\"\")","v":"SPILU54582"},{"$f":"IF(B42<>\"\",COUNTIF('Tableau Commandes'!E43:E338,Récapitulatifs!B42),\"\")","v":1},{"$f":"IF(B42=\"\",\"\",SUMIF(REF,B42,'Tableau Commandes'!$C$5:$C$26))","v":1},0,0,{"$f":"INDEX('Tableau Commandes'!$M$4:$M$300,MATCH($B42,'Tableau Commandes'!$E$4:$E$300,0))","v":""},null,0]
[null,{"$f":"IF(ISERROR(INDEX(ColE,MIN(IF((Nom<>0)*(COUNTIF($B$3:B42,Nom)=0),ROW(Nom))))&\"\"),\"\",INDEX(ColE,MIN(IF((Nom<>0)*(COUNTIF($B$3:B42,Nom)=0),ROW(Nom))))&\"\")","v":"26027"},{"$f":"IF(B43<>\"\",COUNTIF('Tableau Commandes'!E44:E339,Récapitulatifs!B43),\"\")","v":1},{"$f":"IF(B43=\"\",\"\",SUMIF(REF,B43,'Tableau Commandes'!$C$5:$C$26))","v":2},0,0,{"$f":"INDEX('Tableau Commandes'!$M$4:$M$300,MATCH($B43,'Tableau Commandes'!$E$4:$E$300,0))","v":""},null,0]
[null,{"$f":"IF(ISERROR(INDEX(ColE,MIN(IF((Nom<>0)*(COUNTIF($B$3:B43,Nom)=0),ROW(Nom))))&\"\"),\"\",INDEX(ColE,MIN(IF((Nom<>0)*(COUNTIF($B$3:B43,Nom)=0),ROW(Nom))))&\"\")","v":"88091"},{"$f":"IF(B44<>\"\",COUNTIF('Tableau Commandes'!E45:E340,Récapitulatifs!B44),\"\")","v":1},{"$f":"IF(B44=\"\",\"\",SUMIF(REF,B44,'Tableau Commandes'!$C$5:$C$26))","v":1},{"$f":"H44","v":0},{"$f":"IF(E44=\"P\",\"PREPAREE\",IF(E44=\"R\",\"RELIQUAT\",))","v":0},{"$f":"INDEX('Tableau Commandes'!$M$4:$M$300,MATCH($B44,'Tableau Commandes'!$E$4:$E$300,0))","v":""},null,{"$f":"IF(H44=\"P\",\"PREPAREE\",IF(H44=\"R\",\"RELIQUAT\",))","v":0}]
[null,{"$f":"IF(ISERROR(INDEX(ColE,MIN(IF((Nom<>0)*(COUNTIF($B$3:B44,Nom)=0),ROW(Nom))))&\"\"),\"\",INDEX(ColE,MIN(IF((Nom<>0)*(COUNTIF($B$3:B44,Nom)=0),ROW(Nom))))&\"\")","v":"RAD1000450"},{"$f":"IF(B45<>\"\",COUNTIF('Tableau Commandes'!E46:E341,Récapitulatifs!B45),\"\")","v":2},{"$f":"IF(B45=\"\",\"\",SUMIF(REF,B45,'Tableau Commandes'!$C$5:$C$26))","v":2},0,0,{"$f":"INDEX('Tableau Commandes'!$M$4:$M$300,MATCH($B45,'Tableau Commandes'!$E$4:$E$300,0))","v":""},null,0]
[null,{"$f":"IF(ISERROR(INDEX(ColE,MIN(IF((Nom<>0)*(COUNTIF($B$3:B45,Nom)=0),ROW(Nom))))&\"\"),\"\",INDEX(ColE,MIN(IF((Nom<>0)*(COUNTIF($B$3:B45,Nom)=0),ROW(Nom))))&\"\")","v":"RAD1000600"},{"$f":"IF(B46<>\"\",COUNTIF('Tableau Commandes'!E47:E342,Récapitulatifs!B46),\"\")","v":2},{"$f":"IF(B46=\"\",\"\",SUMIF(REF,B46,'Tableau Commandes'!$C$5:$C$26))","v":2},0,0,{"$f":"INDEX('Tableau Commandes'!$M$4:$M$300,MATCH($B46,'Tableau Commandes'!$E$4:$E$300,0))","v":""},null,0]
[null,{"$f":"IF(ISERROR(INDEX(ColE,MIN(IF((Nom<>0)*(COUNTIF($B$3:B46,Nom)=0),ROW(Nom))))&\"\"),\"\",INDEX(ColE,MIN(IF((Nom<>0)*(COUNTIF($B$3:B46,Nom)=0),ROW(Nom))))&\"\")","v":"1063"},{"$f":"IF(B47<>\"\",COUNTIF('Tableau Commandes'!E48:E343,Récapitulatifs!B47),\"\")","v":1},{"$f":"IF(B47=\"\",\"\",SUMIF(REF,B47,'Tableau Commandes'!$C$5:$C$26))","v":1},0,0,{"$f":"INDEX('Tableau Commandes'!$M$4:$M$300,MATCH($B47,'Tableau Commandes'!$E$4:$E$300,0))","v":"DISPO CHEZ MOI"},null,0]
[null,{"$f":"IF(ISERROR(INDEX(ColE,MIN(IF((Nom<>0)*(COUNTIF($B$3:B47,Nom)=0),ROW(Nom))))&\"\"),\"\",INDEX(ColE,MIN(IF((Nom<>0)*(COUNTIF($B$3:B47,Nom)=0),ROW(Nom))))&\"\")","v":"GLC42230"},{"$f":"IF(B48<>\"\",COUNTIF('Tableau Commandes'!E49:E344,Récapitulatifs!B48),\"\")","v":1},{"$f":"IF(B48=\"\",\"\",SUMIF(REF,B48,'Tableau Commandes'!$C$5:$C$26))","v":1},0,0,{"$f":"INDEX('Tableau Commandes'!$M$4:$M$300,MATCH($B48,'Tableau Commandes'!$E$4:$E$300,0))","v":""},null,0]
[null,{"$f":"IF(ISERROR(INDEX(ColE,MIN(IF((Nom<>0)*(COUNTIF($B$3:B48,Nom)=0),ROW(Nom))))&\"\"),\"\",INDEX(ColE,MIN(IF((Nom<>0)*(COUNTIF($B$3:B48,Nom)=0),ROW(Nom))))&\"\")","v":"9659"},{"$f":"IF(B49<>\"\",COUNTIF('Tableau Commandes'!E50:E345,Récapitulatifs!B49),\"\")","v":1},{"$f":"IF(B49=\"\",\"\",SUMIF(REF,B49,'Tableau Commandes'!$C$5:$C$26))","v":1},0,0,{"$f":"INDEX('Tableau Commandes'!$M$4:$M$300,MATCH($B49,'Tableau Commandes'!$E$4:$E$300,0))","v":""},null,0]
[null,{"$f":"IF(ISERROR(INDEX(ColE,MIN(IF((Nom<>0)*(COUNTIF($B$3:B49,Nom)=0),ROW(Nom))))&\"\"),\"\",INDEX(ColE,MIN(IF((Nom<>0)*(COUNTIF($B$3:B49,Nom)=0),ROW(Nom))))&\"\")","v":"4741"},{"$f":"IF(B50<>\"\",COUNTIF('Tableau Commandes'!E51:E346,Récapitulatifs!B50),\"\")","v":5},{"$f":"IF(B50=\"\",\"\",SUMIF(REF,B50,'Tableau Commandes'!$C$5:$C$26))","v":5},0,0,{"$f":"INDEX('Tableau Commandes'!$M$4:$M$300,MATCH($B50,'Tableau Commandes'!$E$4:$E$300,0))","v":"DISPO CHEZ MOI"},null,0]
[null,{"$f":"IF(ISERROR(INDEX(ColE,MIN(IF((Nom<>0)*(COUNTIF($B$3:B50,Nom)=0),ROW(Nom))))&\"\"),\"\",INDEX(ColE,MIN(IF((Nom<>0)*(COUNTIF($B$3:B50,Nom)=0),ROW(Nom))))&\"\")","v":"96042"},{"$f":"IF(B51<>\"\",COUNTIF('Tableau Commandes'!E52:E347,Récapitulatifs!B51),\"\")","v":1},{"$f":"IF(B51=\"\",\"\",SUMIF(REF,B51,'Tableau Commandes'!$C$5:$C$26))","v":2},0,0,{"$f":"INDEX('Tableau Commandes'!$M$4:$M$300,MATCH($B51,'Tableau Commandes'!$E$4:$E$300,0))","v":""},null,0]
[null,{"$f":"IF(ISERROR(INDEX(ColE,MIN(IF((Nom<>0)*(COUNTIF($B$3:B51,Nom)=0),ROW(Nom))))&\"\"),\"\",INDEX(ColE,MIN(IF((Nom<>0)*(COUNTIF($B$3:B51,Nom)=0),ROW(Nom))))&\"\")","v":"GLC43812"},{"$f":"IF(B52<>\"\",COUNTIF('Tableau Commandes'!E53:E348,Récapitulatifs!B52),\"\")","v":1},{"$f":"IF(B52=\"\",\"\",SUMIF(REF,B52,'Tableau Commandes'!$C$5:$C$26))","v":1},0,0,{"$f":"INDEX('Tableau Commandes'!$M$4:$M$300,MATCH($B52,'Tableau Commandes'!$E$4:$E$300,0))","v":""},null,0]
[null,{"$f":"IF(ISERROR(INDEX(ColE,MIN(IF((Nom<>0)*(COUNTIF($B$3:B52,Nom)=0),ROW(Nom))))&\"\"),\"\",INDEX(ColE,MIN(IF((Nom<>0)*(COUNTIF($B$3:B52,Nom)=0),ROW(Nom))))&\"\")","v":"88599"},{"$f":"IF(B53<>\"\",COUNTIF('Tableau Commandes'!E54:E349,Récapitulatifs!B53),\"\")","v":1},{"$f":"IF(B53=\"\",\"\",SUMIF(REF,B53,'Tableau Commandes'!$C$5:$C$26))","v":2},0,0,{"$f":"INDEX('Tableau Commandes'!$M$4:$M$300,MATCH($B53,'Tableau Commandes'!$E$4:$E$300,0))","v":""},null,0]
[null,{"$f":"IF(ISERROR(INDEX(ColE,MIN(IF((Nom<>0)*(COUNTIF($B$3:B53,Nom)=0),ROW(Nom))))&\"\"),\"\",INDEX(ColE,MIN(IF((Nom<>0)*(COUNTIF($B$3:B53,Nom)=0),ROW(Nom))))&\"\")","v":"4725"},{"$f":"IF(B54<>\"\",COUNTIF('Tableau Commandes'!E55:E350,Récapitulatifs!B54),\"\")","v":5},{"$f":"IF(B54=\"\",\"\",SUMIF(REF,B54,'Tableau Commandes'!$C$5:$C$26))","v":5},0,0,{"$f":"INDEX('Tableau Commandes'!$M$4:$M$300,MATCH($B54,'Tableau Commandes'!$E$4:$E$300,0))","v":"DISPO CHEZ MOI"},null,0]
[null,{"$f":"IF(ISERROR(INDEX(ColE,MIN(IF((Nom<>0)*(COUNTIF($B$3:B54,Nom)=0),ROW(Nom))))&\"\"),\"\",INDEX(ColE,MIN(IF((Nom<>0)*(COUNTIF($B$3:B54,Nom)=0),ROW(Nom))))&\"\")","v":"A1300XDEUX"},{"$f":"IF(B55<>\"\",COUNTIF('Tableau Commandes'!E56:E351,Récapitulatifs!B55),\"\")","v":1},{"$f":"IF(B55=\"\",\"\",SUMIF(REF,B55,'Tableau Commandes'!$C$5:$C$26))","v":1},0,0,{"$f":"INDEX('Tableau Commandes'!$M$4:$M$300,MATCH($B55,'Tableau Commandes'!$E$4:$E$300,0))","v":""},null,0]
[null,{"$f":"IF(ISERROR(INDEX(ColE,MIN(IF((Nom<>0)*(COUNTIF($B$3:B55,Nom)=0),ROW(Nom))))&\"\"),\"\",INDEX(ColE,MIN(IF((Nom<>0)*(COUNTIF($B$3:B55,Nom)=0),ROW(Nom))))&\"\")","v":"FH001z"},{"$f":"IF(B56<>\"\",COUNTIF('Tableau Commandes'!E57:E352,Récapitulatifs!B56),\"\")","v":1},{"$f":"IF(B56=\"\",\"\",SUMIF(REF,B56,'Tableau Commandes'!$C$5:$C$26))","v":1},0,0,{"$f":"INDEX('Tableau Commandes'!$M$4:$M$300,MATCH($B56,'Tableau Commandes'!$E$4:$E$300,0))","v":"DISPO CHEZ MOI"},null,0]
[null,{"$f":"IF(ISERROR(INDEX(ColE,MIN(IF((Nom<>0)*(COUNTIF($B$3:B56,Nom)=0),ROW(Nom))))&\"\"),\"\",INDEX(ColE,MIN(IF((Nom<>0)*(COUNTIF($B$3:B56,Nom)=0),ROW(Nom))))&\"\")","v":"FH002z"},{"$f":"IF(B57<>\"\",COUNTIF('Tableau Commandes'!E58:E353,Récapitulatifs!B57),\"\")","v":1},{"$f":"IF(B57=\"\",\"\",SUMIF(REF,B57,'Tableau Commandes'!$C$5:$C$26))","v":1},0,0,{"$f":"INDEX('Tableau Commandes'!$M$4:$M$300,MATCH($B57,'Tableau Commandes'!$E$4:$E$300,0))","v":""},null,0]
[null,{"$f":"IF(ISERROR(INDEX(ColE,MIN(IF((Nom<>0)*(COUNTIF($B$3:B57,Nom)=0),ROW(Nom))))&\"\"),\"\",INDEX(ColE,MIN(IF((Nom<>0)*(COUNTIF($B$3:B57,Nom)=0),ROW(Nom))))&\"\")","v":"78054"},{"$f":"IF(B58<>\"\",COUNTIF('Tableau Commandes'!E59:E354,Récapitulatifs!B58),\"\")","v":1},{"$f":"IF(B58=\"\",\"\",SUMIF(REF,B58,'Tableau Commandes'!$C$5:$C$26))","v":1},0,0,{"$f":"INDEX('Tableau Commandes'!$M$4:$M$300,MATCH($B58,'Tableau Commandes'!$E$4:$E$300,0))","v":""},null,0]
[null,{"$f":"IF(ISERROR(INDEX(ColE,MIN(IF((Nom<>0)*(COUNTIF($B$3:B58,Nom)=0),ROW(Nom))))&\"\"),\"\",INDEX(ColE,MIN(IF((Nom<>0)*(COUNTIF($B$3:B58,Nom)=0),ROW(Nom))))&\"\")","v":"MECA4177"},{"$f":"IF(B59<>\"\",COUNTIF('Tableau Commandes'!E60:E355,Récapitulatifs!B59),\"\")","v":1},{"$f":"IF(B59=\"\",\"\",SUMIF(REF,B59,'Tableau Commandes'!$C$5:$C$26))","v":2},0,0,{"$f":"INDEX('Tableau Commandes'!$M$4:$M$300,MATCH($B59,'Tableau Commandes'!$E$4:$E$300,0))","v":""},null,0]
[null,{"$f":"IF(ISERROR(INDEX(ColE,MIN(IF((Nom<>0)*(COUNTIF($B$3:B59,Nom)=0),ROW(Nom))))&\"\"),\"\",INDEX(ColE,MIN(IF((Nom<>0)*(COUNTIF($B$3:B59,Nom)=0),ROW(Nom))))&\"\")","v":"MECA4320"},{"$f":"IF(B60<>\"\",COUNTIF('Tableau Commandes'!E61:E356,Récapitulatifs!B60),\"\")","v":1},{"$f":"IF(B60=\"\",\"\",SUMIF(REF,B60,'Tableau Commandes'!$C$5:$C$26))","v":2},0,0,{"$f":"INDEX('Tableau Commandes'!$M$4:$M$300,MATCH($B60,'Tableau Commandes'!$E$4:$E$300,0))","v":""},null,0]
[null,{"$f":"IF(ISERROR(INDEX(ColE,MIN(IF((Nom<>0)*(COUNTIF($B$3:B60,Nom)=0),ROW(Nom))))&\"\"),\"\",INDEX(ColE,MIN(IF((Nom<>0)*(COUNTIF($B$3:B60,Nom)=0),ROW(Nom))))&\"\")","v":"5156"},{"$f":"IF(B61<>\"\",COUNTIF('Tableau Commandes'!E62:E357,Récapitulatifs!B61),\"\")","v":2},{"$f":"IF(B61=\"\",\"\",SUMIF(REF,B61,'Tableau Commandes'!$C$5:$C$26))","v":2},0,0,{"$f":"INDEX('Tableau Commandes'!$M$4:$M$300,MATCH($B61,'Tableau Commandes'!$E$4:$E$300,0))","v":"DISPO CHEZ MOI"},null,0]
[null,{"$f":"IF(ISERROR(INDEX(ColE,MIN(IF((Nom<>0)*(COUNTIF($B$3:B61,Nom)=0),ROW(Nom))))&\"\"),\"\",INDEX(ColE,MIN(IF((Nom<>0)*(COUNTIF($B$3:B61,Nom)=0),ROW(Nom))))&\"\")","v":"2118"},{"$f":"IF(B62<>\"\",COUNTIF('Tableau Commandes'!E63:E358,Récapitulatifs!B62),\"\")","v":1},{"$f":"IF(B62=\"\",\"\",SUMIF(REF,B62,'Tableau Commandes'!$C$5:$C$26))","v":1},0,0,{"$f":"INDEX('Tableau Commandes'!$M$4:$M$300,MATCH($B62,'Tableau Commandes'!$E$4:$E$300,0))","v":""},null,0]
[null,{"$f":"IF(ISERROR(INDEX(ColE,MIN(IF((Nom<>0)*(COUNTIF($B$3:B62,Nom)=0),ROW(Nom))))&\"\"),\"\",INDEX(ColE,MIN(IF((Nom<>0)*(COUNTIF($B$3:B62,Nom)=0),ROW(Nom))))&\"\")","v":"816151X2"},{"$f":"IF(B63<>\"\",COUNTIF('Tableau Commandes'!E64:E359,Récapitulatifs!B63),\"\")","v":1},{"$f":"IF(B63=\"\",\"\",SUMIF(REF,B63,'Tableau Commandes'!$C$5:$C$26))","v":1},0,0,{"$f":"INDEX('Tableau Commandes'!$M$4:$M$300,MATCH($B63,'Tableau Commandes'!$E$4:$E$300,0))","v":""},null,0]
[null,{"$f":"IF(ISERROR(INDEX(ColE,MIN(IF((Nom<>0)*(COUNTIF($B$3:B63,Nom)=0),ROW(Nom))))&\"\"),\"\",INDEX(ColE,MIN(IF((Nom<>0)*(COUNTIF($B$3:B63,Nom)=0),ROW(Nom))))&\"\")","v":"3653"},{"$f":"IF(B64<>\"\",COUNTIF('Tableau Commandes'!E65:E360,Récapitulatifs!B64),\"\")","v":1},{"$f":"IF(B64=\"\",\"\",SUMIF(REF,B64,'Tableau Commandes'!$C$5:$C$26))","v":1},0,0,{"$f":"INDEX('Tableau Commandes'!$M$4:$M$300,MATCH($B64,'Tableau Commandes'!$E$4:$E$300,0))","v":""},null,0]
[null,{"$f":"IF(ISERROR(INDEX(ColE,MIN(IF((Nom<>0)*(COUNTIF($B$3:B64,Nom)=0),ROW(Nom))))&\"\"),\"\",INDEX(ColE,MIN(IF((Nom<>0)*(COUNTIF($B$3:B64,Nom)=0),ROW(Nom))))&\"\")","v":"800200"},{"$f":"IF(B65<>\"\",COUNTIF('Tableau Commandes'!E66:E361,Récapitulatifs!B65),\"\")","v":1},{"$f":"IF(B65=\"\",\"\",SUMIF(REF,B65,'Tableau Commandes'!$C$5:$C$26))","v":1},0,0,{"$f":"INDEX('Tableau Commandes'!$M$4:$M$300,MATCH($B65,'Tableau Commandes'!$E$4:$E$300,0))","v":"DISPO CHEZ MOI"},null,0]
[null,{"$f":"IF(ISERROR(INDEX(ColE,MIN(IF((Nom<>0)*(COUNTIF($B$3:B65,Nom)=0),ROW(Nom))))&\"\"),\"\",INDEX(ColE,MIN(IF((Nom<>0)*(COUNTIF($B$3:B65,Nom)=0),ROW(Nom))))&\"\")","v":"MECA5386"},{"$f":"IF(B66<>\"\",COUNTIF('Tableau Commandes'!E67:E362,Récapitulatifs!B66),\"\")","v":1},{"$f":"IF(B66=\"\",\"\",SUMIF(REF,B66,'Tableau Commandes'!$C$5:$C$26))","v":1},0,0,{"$f":"INDEX('Tableau Commandes'!$M$4:$M$300,MATCH($B66,'Tableau Commandes'!$E$4:$E$300,0))","v":""},null,0]
[null,{"$f":"IF(ISERROR(INDEX(ColE,MIN(IF((Nom<>0)*(COUNTIF($B$3:B66,Nom)=0),ROW(Nom))))&\"\"),\"\",INDEX(ColE,MIN(IF((Nom<>0)*(COUNTIF($B$3:B66,Nom)=0),ROW(Nom))))&\"\")","v":"BEZ600124XDEUX"},{"$f":"IF(B67<>\"\",COUNTIF('Tableau Commandes'!E68:E363,Récapitulatifs!B67),\"\")","v":1},{"$f":"IF(B67=\"\",\"\",SUMIF(REF,B67,'Tableau Commandes'!$C$5:$C$26))","v":1},0,0,{"$f":"INDEX('Tableau Commandes'!$M$4:$M$300,MATCH($B67,'Tableau Commandes'!$E$4:$E$300,0))","v":""},null,0]
[null,{"$f":"IF(ISERROR(INDEX(ColE,MIN(IF((Nom<>0)*(COUNTIF($B$3:B67,Nom)=0),ROW(Nom))))&\"\"),\"\",INDEX(ColE,MIN(IF((Nom<>0)*(COUNTIF($B$3:B67,Nom)=0),ROW(Nom))))&\"\")","v":"4760"},{"$f":"IF(B68<>\"\",COUNTIF('Tableau Commandes'!E69:E364,Récapitulatifs!B68),\"\")","v":1},{"$f":"IF(B68=\"\",\"\",SUMIF(REF,B68,'Tableau Commandes'!$C$5:$C$26))","v":1},0,0,{"$f":"INDEX('Tableau Commandes'!$M$4:$M$300,MATCH($B68,'Tableau Commandes'!$E$4:$E$300,0))","v":"DISPO CHEZ MOI"},null,0]
[null,{"$f":"IF(ISERROR(INDEX(ColE,MIN(IF((Nom<>0)*(COUNTIF($B$3:B68,Nom)=0),ROW(Nom))))&\"\"),\"\",INDEX(ColE,MIN(IF((Nom<>0)*(COUNTIF($B$3:B68,Nom)=0),ROW(Nom))))&\"\")","v":"BEZ600286XDEUX"},{"$f":"IF(B69<>\"\",COUNTIF('Tableau Commandes'!E70:E365,Récapitulatifs!B69),\"\")","v":1},{"$f":"IF(B69=\"\",\"\",SUMIF(REF,B69,'Tableau Commandes'!$C$5:$C$26))","v":1},0,0,{"$f":"INDEX('Tableau Commandes'!$M$4:$M$300,MATCH($B69,'Tableau Commandes'!$E$4:$E$300,0))","v":""},null,0]
[null,{"$f":"IF(ISERROR(INDEX(ColE,MIN(IF((Nom<>0)*(COUNTIF($B$3:B69,Nom)=0),ROW(Nom))))&\"\"),\"\",INDEX(ColE,MIN(IF((Nom<>0)*(COUNTIF($B$3:B69,Nom)=0),ROW(Nom))))&\"\")","v":"800700"},{"$f":"IF(B70<>\"\",COUNTIF('Tableau Commandes'!E71:E366,Récapitulatifs!B70),\"\")","v":1},{"$f":"IF(B70=\"\",\"\",SUMIF(REF,B70,'Tableau Commandes'!$C$5:$C$26))","v":1},0,0,{"$f":"INDEX('Tableau Commandes'!$M$4:$M$300,MATCH($B70,'Tableau Commandes'!$E$4:$E$300,0))","v":""},null,0]
[null,{"$f":"IF(ISERROR(INDEX(ColE,MIN(IF((Nom<>0)*(COUNTIF($B$3:B70,Nom)=0),ROW(Nom))))&\"\"),\"\",INDEX(ColE,MIN(IF((Nom<>0)*(COUNTIF($B$3:B70,Nom)=0),ROW(Nom))))&\"\")","v":"MECA8015"},{"$f":"IF(B71<>\"\",COUNTIF('Tableau Commandes'!E72:E367,Récapitulatifs!B71),\"\")","v":1},{"$f":"IF(B71=\"\",\"\",SUMIF(REF,B71,'Tableau Commandes'!$C$5:$C$26))","v":1},0,0,{"$f":"INDEX('Tableau Commandes'!$M$4:$M$300,MATCH($B71,'Tableau Commandes'!$E$4:$E$300,0))","v":""},null,0]
[null,{"$f":"IF(ISERROR(INDEX(ColE,MIN(IF((Nom<>0)*(COUNTIF($B$3:B71,Nom)=0),ROW(Nom))))&\"\"),\"\",INDEX(ColE,MIN(IF((Nom<>0)*(COUNTIF($B$3:B71,Nom)=0),ROW(Nom))))&\"\")","v":"79095"},{"$f":"IF(B72<>\"\",COUNTIF('Tableau Commandes'!E73:E368,Récapitulatifs!B72),\"\")","v":1},{"$f":"IF(B72=\"\",\"\",SUMIF(REF,B72,'Tableau Commandes'!$C$5:$C$26))","v":1},0,0,{"$f":"INDEX('Tableau Commandes'!$M$4:$M$300,MATCH($B72,'Tableau Commandes'!$E$4:$E$300,0))","v":""},null,0]
[null,{"$f":"IF(ISERROR(INDEX(ColE,MIN(IF((Nom<>0)*(COUNTIF($B$3:B72,Nom)=0),ROW(Nom))))&\"\"),\"\",INDEX(ColE,MIN(IF((Nom<>0)*(COUNTIF($B$3:B72,Nom)=0),ROW(Nom))))&\"\")","v":"81795"},{"$f":"IF(B73<>\"\",COUNTIF('Tableau Commandes'!E74:E369,Récapitulatifs!B73),\"\")","v":1},{"$f":"IF(B73=\"\",\"\",SUMIF(REF,B73,'Tableau Commandes'!$C$5:$C$26))","v":1},0,0,{"$f":"INDEX('Tableau Commandes'!$M$4:$M$300,MATCH($B73,'Tableau Commandes'!$E$4:$E$300,0))","v":""},null,0]
[null,{"$f":"IF(ISERROR(INDEX(ColE,MIN(IF((Nom<>0)*(COUNTIF($B$3:B73,Nom)=0),ROW(Nom))))&\"\"),\"\",INDEX(ColE,MIN(IF((Nom<>0)*(COUNTIF($B$3:B73,Nom)=0),ROW(Nom))))&\"\")","v":"28553"},{"$f":"IF(B74<>\"\",COUNTIF('Tableau Commandes'!E75:E370,Récapitulatifs!B74),\"\")","v":1},{"$f":"IF(B74=\"\",\"\",SUMIF(REF,B74,'Tableau Commandes'!$C$5:$C$26))","v":1},0,0,{"$f":"INDEX('Tableau Commandes'!$M$4:$M$300,MATCH($B74,'Tableau Commandes'!$E$4:$E$300,0))","v":""},null,0]
[null,{"$f":"IF(ISERROR(INDEX(ColE,MIN(IF((Nom<>0)*(COUNTIF($B$3:B74,Nom)=0),ROW(Nom))))&\"\"),\"\",INDEX(ColE,MIN(IF((Nom<>0)*(COUNTIF($B$3:B74,Nom)=0),ROW(Nom))))&\"\")","v":"28554"},{"$f":"IF(B75<>\"\",COUNTIF('Tableau Commandes'!E76:E371,Récapitulatifs!B75),\"\")","v":1},{"$f":"IF(B75=\"\",\"\",SUMIF(REF,B75,'Tableau Commandes'!$C$5:$C$26))","v":1},0,0,{"$f":"INDEX('Tableau Commandes'!$M$4:$M$300,MATCH($B75,'Tableau Commandes'!$E$4:$E$300,0))","v":""},null,0]
[null,{"$f":"IF(ISERROR(INDEX(ColE,MIN(IF((Nom<>0)*(COUNTIF($B$3:B75,Nom)=0),ROW(Nom))))&\"\"),\"\",INDEX(ColE,MIN(IF((Nom<>0)*(COUNTIF($B$3:B75,Nom)=0),ROW(Nom))))&\"\")","v":"599610"},{"$f":"IF(B76<>\"\",COUNTIF('Tableau Commandes'!E77:E372,Récapitulatifs!B76),\"\")","v":3},{"$f":"IF(B76=\"\",\"\",SUMIF(REF,B76,'Tableau Commandes'!$C$5:$C$26))","v":3},0,0,{"$f":"INDEX('Tableau Commandes'!$M$4:$M$300,MATCH($B76,'Tableau Commandes'!$E$4:$E$300,0))","v":"DISPO CHEZ MOI"},null,0]
[null,{"$f":"IF(ISERROR(INDEX(ColE,MIN(IF((Nom<>0)*(COUNTIF($B$3:B76,Nom)=0),ROW(Nom))))&\"\"),\"\",INDEX(ColE,MIN(IF((Nom<>0)*(COUNTIF($B$3:B76,Nom)=0),ROW(Nom))))&\"\")","v":"KF15948"},{"$f":"IF(B77<>\"\",COUNTIF('Tableau Commandes'!E78:E373,Récapitulatifs!B77),\"\")","v":1},{"$f":"IF(B77=\"\",\"\",SUMIF(REF,B77,'Tableau Commandes'!$C$5:$C$26))","v":1},0,0,{"$f":"INDEX('Tableau Commandes'!$M$4:$M$300,MATCH($B77,'Tableau Commandes'!$E$4:$E$300,0))","v":"DISPO CHEZ MOI"},null,0]
[null,{"$f":"IF(ISERROR(INDEX(ColE,MIN(IF((Nom<>0)*(COUNTIF($B$3:B77,Nom)=0),ROW(Nom))))&\"\"),\"\",INDEX(ColE,MIN(IF((Nom<>0)*(COUNTIF($B$3:B77,Nom)=0),ROW(Nom))))&\"\")","v":"288100"},{"$f":"IF(B78<>\"\",COUNTIF('Tableau Commandes'!E79:E374,Récapitulatifs!B78),\"\")","v":1},{"$f":"IF(B78=\"\",\"\",SUMIF(REF,B78,'Tableau Commandes'!$C$5:$C$26))","v":1},0,0,{"$f":"INDEX('Tableau Commandes'!$M$4:$M$300,MATCH($B78,'Tableau Commandes'!$E$4:$E$300,0))","v":""},null,0]
[null,{"$f":"IF(ISERROR(INDEX(ColE,MIN(IF((Nom<>0)*(COUNTIF($B$3:B78,Nom)=0),ROW(Nom))))&\"\"),\"\",INDEX(ColE,MIN(IF((Nom<>0)*(COUNTIF($B$3:B78,Nom)=0),ROW(Nom))))&\"\")","v":"BEZLX1282"},{"$f":"IF(B79<>\"\",COUNTIF('Tableau Commandes'!E80:E375,Récapitulatifs!B79),\"\")","v":1},{"$f":"IF(B79=\"\",\"\",SUMIF(REF,B79,'Tableau Commandes'!$C$5:$C$26))","v":1},0,0,{"$f":"INDEX('Tableau Commandes'!$M$4:$M$300,MATCH($B79,'Tableau Commandes'!$E$4:$E$300,0))","v":""},null,0]
[null,{"$f":"IF(ISERROR(INDEX(ColE,MIN(IF((Nom<>0)*(COUNTIF($B$3:B79,Nom)=0),ROW(Nom))))&\"\"),\"\",INDEX(ColE,MIN(IF((Nom<>0)*(COUNTIF($B$3:B79,Nom)=0),ROW(Nom))))&\"\")","v":"BEZOX171-2D"},{"$f":"IF(B80<>\"\",COUNTIF('Tableau Commandes'!E81:E376,Récapitulatifs!B80),\"\")","v":1},{"$f":"IF(B80=\"\",\"\",SUMIF(REF,B80,'Tableau Commandes'!$C$5:$C$26))","v":1},0,0,{"$f":"INDEX('Tableau Commandes'!$M$4:$M$300,MATCH($B80,'Tableau Commandes'!$E$4:$E$300,0))","v":""},null,0]
[null,{"$f":"IF(ISERROR(INDEX(ColE,MIN(IF((Nom<>0)*(COUNTIF($B$3:B80,Nom)=0),ROW(Nom))))&\"\"),\"\",INDEX(ColE,MIN(IF((Nom<>0)*(COUNTIF($B$3:B80,Nom)=0),ROW(Nom))))&\"\")","v":"FC033z"},{"$f":"IF(B81<>\"\",COUNTIF('Tableau Commandes'!E82:E377,Récapitulatifs!B81),\"\")","v":1},{"$f":"IF(B81=\"\",\"\",SUMIF(REF,B81,'Tableau Commandes'!$C$5:$C$26))","v":1},0,0,{"$f":"INDEX('Tableau Commandes'!$M$4:$M$300,MATCH($B81,'Tableau Commandes'!$E$4:$E$300,0))","v":""},null,0]
[null,{"$f":"IF(ISERROR(INDEX(ColE,MIN(IF((Nom<>0)*(COUNTIF($B$3:B81,Nom)=0),ROW(Nom))))&\"\"),\"\",INDEX(ColE,MIN(IF((Nom<>0)*(COUNTIF($B$3:B81,Nom)=0),ROW(Nom))))&\"\")","v":"MECA5391"},{"$f":"IF(B82<>\"\",COUNTIF('Tableau Commandes'!E83:E378,Récapitulatifs!B82),\"\")","v":1},{"$f":"IF(B82=\"\",\"\",SUMIF(REF,B82,'Tableau Commandes'!$C$5:$C$26))","v":1},0,0,{"$f":"INDEX('Tableau Commandes'!$M$4:$M$300,MATCH($B82,'Tableau Commandes'!$E$4:$E$300,0))","v":""},null,0]
[null,{"$f":"IF(ISERROR(INDEX(ColE,MIN(IF((Nom<>0)*(COUNTIF($B$3:B82,Nom)=0),ROW(Nom))))&\"\"),\"\",INDEX(ColE,MIN(IF((Nom<>0)*(COUNTIF($B$3:B82,Nom)=0),ROW(Nom))))&\"\")","v":"999706"},{"$f":"IF(B83<>\"\",COUNTIF('Tableau Commandes'!E84:E379,Récapitulatifs!B83),\"\")","v":1},{"$f":"IF(B83=\"\",\"\",SUMIF(REF,B83,'Tableau Commandes'!$C$5:$C$26))","v":1},0,0,{"$f":"INDEX('Tableau Commandes'!$M$4:$M$300,MATCH($B83,'Tableau Commandes'!$E$4:$E$300,0))","v":""},null,0]
[null,{"$f":"IF(ISERROR(INDEX(ColE,MIN(IF((Nom<>0)*(COUNTIF($B$3:B83,Nom)=0),ROW(Nom))))&\"\"),\"\",INDEX(ColE,MIN(IF((Nom<>0)*(COUNTIF($B$3:B83,Nom)=0),ROW(Nom))))&\"\")","v":"CARTER999001"},{"$f":"IF(B84<>\"\",COUNTIF('Tableau Commandes'!E85:E380,Récapitulatifs!B84),\"\")","v":1},{"$f":"IF(B84=\"\",\"\",SUMIF(REF,B84,'Tableau Commandes'!$C$5:$C$26))","v":1},0,0,{"$f":"INDEX('Tableau Commandes'!$M$4:$M$300,MATCH($B84,'Tableau Commandes'!$E$4:$E$300,0))","v":""},null,0]
[null,{"$f":"IF(ISERROR(INDEX(ColE,MIN(IF((Nom<>0)*(COUNTIF($B$3:B84,Nom)=0),ROW(Nom))))&\"\"),\"\",INDEX(ColE,MIN(IF((Nom<>0)*(COUNTIF($B$3:B84,Nom)=0),ROW(Nom))))&\"\")","v":"99902"},{"$f":"IF(B85<>\"\",COUNTIF('Tableau Commandes'!E86:E381,Récapitulatifs!B85),\"\")","v":1},{"$f":"IF(B85=\"\",\"\",SUMIF(REF,B85,'Tableau Commandes'!$C$5:$C$26))","v":1},0,0,{"$f":"INDEX('Tableau Commandes'!$M$4:$M$300,MATCH($B85,'Tableau Commandes'!$E$4:$E$300,0))","v":"DISPO CHEZ MOI"},null,0]
[null,{"$f":"IF(ISERROR(INDEX(ColE,MIN(IF((Nom<>0)*(COUNTIF($B$3:B85,Nom)=0),ROW(Nom))))&\"\"),\"\",INDEX(ColE,MIN(IF((Nom<>0)*(COUNTIF($B$3:B85,Nom)=0),ROW(Nom))))&\"\")","v":"100001UNITE"},{"$f":"IF(B86<>\"\",COUNTIF('Tableau Commandes'!E87:E382,Récapitulatifs!B86),\"\")","v":1},{"$f":"IF(B86=\"\",\"\",SUMIF(REF,B86,'Tableau Commandes'!$C$5:$C$26))","v":1},0,0,{"$f":"INDEX('Tableau Commandes'!$M$4:$M$300,MATCH($B86,'Tableau Commandes'!$E$4:$E$300,0))","v":""},null,0]
[null,{"$f":"IF(ISERROR(INDEX(ColE,MIN(IF((Nom<>0)*(COUNTIF($B$3:B86,Nom)=0),ROW(Nom))))&\"\"),\"\",INDEX(ColE,MIN(IF((Nom<>0)*(COUNTIF($B$3:B86,Nom)=0),ROW(Nom))))&\"\")","v":"313501"},{"$f":"IF(B87<>\"\",COUNTIF('Tableau Commandes'!E88:E383,Récapitulatifs!B87),\"\")","v":1},{"$f":"IF(B87=\"\",\"\",SUMIF(REF,B87,'Tableau Commandes'!$C$5:$C$26))","v":1},0,0,{"$f":"INDEX('Tableau Commandes'!$M$4:$M$300,MATCH($B87,'Tableau Commandes'!$E$4:$E$300,0))","v":""},null,0]
[null,{"$f":"IF(ISERROR(INDEX(ColE,MIN(IF((Nom<>0)*(COUNTIF($B$3:B87,Nom)=0),ROW(Nom))))&\"\"),\"\",INDEX(ColE,MIN(IF((Nom<>0)*(COUNTIF($B$3:B87,Nom)=0),ROW(Nom))))&\"\")","v":"70566XDEUX"},{"$f":"IF(B88<>\"\",COUNTIF('Tableau Commandes'!E89:E384,Récapitulatifs!B88),\"\")","v":1},{"$f":"IF(B88=\"\",\"\",SUMIF(REF,B88,'Tableau Commandes'!$C$5:$C$26))","v":1},0,0,{"$f":"INDEX('Tableau Commandes'!$M$4:$M$300,MATCH($B88,'Tableau Commandes'!$E$4:$E$300,0))","v":""},null,0]
[null,{"$f":"IF(ISERROR(INDEX(ColE,MIN(IF((Nom<>0)*(COUNTIF($B$3:B88,Nom)=0),ROW(Nom))))&\"\"),\"\",INDEX(ColE,MIN(IF((Nom<>0)*(COUNTIF($B$3:B88,Nom)=0),ROW(Nom))))&\"\")","v":"111114"},{"$f":"IF(B89<>\"\",COUNTIF('Tableau Commandes'!E90:E385,Récapitulatifs!B89),\"\")","v":1},{"$f":"IF(B89=\"\",\"\",SUMIF(REF,B89,'Tableau Commandes'!$C$5:$C$26))","v":1},0,0,{"$f":"INDEX('Tableau Commandes'!$M$4:$M$300,MATCH($B89,'Tableau Commandes'!$E$4:$E$300,0))","v":""},null,0]
[null,{"$f":"IF(ISERROR(INDEX(ColE,MIN(IF((Nom<>0)*(COUNTIF($B$3:B89,Nom)=0),ROW(Nom))))&\"\"),\"\",INDEX(ColE,MIN(IF((Nom<>0)*(COUNTIF($B$3:B89,Nom)=0),ROW(Nom))))&\"\")","v":"502043X4"},{"$f":"IF(B90<>\"\",COUNTIF('Tableau Commandes'!E91:E386,Récapitulatifs!B90),\"\")","v":1},{"$f":"IF(B90=\"\",\"\",SUMIF(REF,B90,'Tableau Commandes'!$C$5:$C$26))","v":1},0,0,{"$f":"INDEX('Tableau Commandes'!$M$4:$M$300,MATCH($B90,'Tableau Commandes'!$E$4:$E$300,0))","v":""},null,0]
[null,{"$f":"IF(ISERROR(INDEX(ColE,MIN(IF((Nom<>0)*(COUNTIF($B$3:B90,Nom)=0),ROW(Nom))))&\"\"),\"\",INDEX(ColE,MIN(IF((Nom<>0)*(COUNTIF($B$3:B90,Nom)=0),ROW(Nom))))&\"\")","v":"FA048z"},{"$f":"IF(B91<>\"\",COUNTIF('Tableau Commandes'!E92:E387,Récapitulatifs!B91),\"\")","v":1},{"$f":"IF(B91=\"\",\"\",SUMIF(REF,B91,'Tableau Commandes'!$C$5:$C$26))","v":1},0,0,{"$f":"INDEX('Tableau Commandes'!$M$4:$M$300,MATCH($B91,'Tableau Commandes'!$E$4:$E$300,0))","v":""},null,0]
[null,{"$f":"IF(ISERROR(INDEX(ColE,MIN(IF((Nom<>0)*(COUNTIF($B$3:B91,Nom)=0),ROW(Nom))))&\"\"),\"\",INDEX(ColE,MIN(IF((Nom<>0)*(COUNTIF($B$3:B91,Nom)=0),ROW(Nom))))&\"\")","v":"526373X4"},{"$f":"IF(B92<>\"\",COUNTIF('Tableau Commandes'!E93:E388,Récapitulatifs!B92),\"\")","v":1},{"$f":"IF(B92=\"\",\"\",SUMIF(REF,B92,'Tableau Commandes'!$C$5:$C$26))","v":1},0,0,{"$f":"INDEX('Tableau Commandes'!$M$4:$M$300,MATCH($B92,'Tableau Commandes'!$E$4:$E$300,0))","v":""},null,0]
[null,{"$f":"IF(ISERROR(INDEX(ColE,MIN(IF((Nom<>0)*(COUNTIF($B$3:B92,Nom)=0),ROW(Nom))))&\"\"),\"\",INDEX(ColE,MIN(IF((Nom<>0)*(COUNTIF($B$3:B92,Nom)=0),ROW(Nom))))&\"\")","v":"9960C"},{"$f":"IF(B93<>\"\",COUNTIF('Tableau Commandes'!E94:E389,Récapitulatifs!B93),\"\")","v":1},{"$f":"IF(B93=\"\",\"\",SUMIF(REF,B93,'Tableau Commandes'!$C$5:$C$26))","v":1},0,0,{"$f":"INDEX('Tableau Commandes'!$M$4:$M$300,MATCH($B93,'Tableau Commandes'!$E$4:$E$300,0))","v":""},null,0]
[null,{"$f":"IF(ISERROR(INDEX(ColE,MIN(IF((Nom<>0)*(COUNTIF($B$3:B93,Nom)=0),ROW(Nom))))&\"\"),\"\",INDEX(ColE,MIN(IF((Nom<>0)*(COUNTIF($B$3:B93,Nom)=0),ROW(Nom))))&\"\")","v":"87132"},{"$f":"IF(B94<>\"\",COUNTIF('Tableau Commandes'!E95:E390,Récapitulatifs!B94),\"\")","v":1},{"$f":"IF(B94=\"\",\"\",SUMIF(REF,B94,'Tableau Commandes'!$C$5:$C$26))","v":1},0,0,{"$f":"INDEX('Tableau Commandes'!$M$4:$M$300,MATCH($B94,'Tableau Commandes'!$E$4:$E$300,0))","v":""},null,0]
[null,{"$f":"IF(ISERROR(INDEX(ColE,MIN(IF((Nom<>0)*(COUNTIF($B$3:B94,Nom)=0),ROW(Nom))))&\"\"),\"\",INDEX(ColE,MIN(IF((Nom<>0)*(COUNTIF($B$3:B94,Nom)=0),ROW(Nom))))&\"\")","v":"89090"},{"$f":"IF(B95<>\"\",COUNTIF('Tableau Commandes'!E96:E391,Récapitulatifs!B95),\"\")","v":1},{"$f":"IF(B95=\"\",\"\",SUMIF(REF,B95,'Tableau Commandes'!$C$5:$C$26))","v":1},0,0,{"$f":"INDEX('Tableau Commandes'!$M$4:$M$300,MATCH($B95,'Tableau Commandes'!$E$4:$E$300,0))","v":""},null,0]
[null,{"$f":"IF(ISERROR(INDEX(ColE,MIN(IF((Nom<>0)*(COUNTIF($B$3:B95,Nom)=0),ROW(Nom))))&\"\"),\"\",INDEX(ColE,MIN(IF((Nom<>0)*(COUNTIF($B$3:B95,Nom)=0),ROW(Nom))))&\"\")","v":"88090"},{"$f":"IF(B96<>\"\",COUNTIF('Tableau Commandes'!E97:E392,Récapitulatifs!B96),\"\")","v":1},{"$f":"IF(B96=\"\",\"\",SUMIF(REF,B96,'Tableau Commandes'!$C$5:$C$26))","v":1},0,0,{"$f":"INDEX('Tableau Commandes'!$M$4:$M$300,MATCH($B96,'Tableau Commandes'!$E$4:$E$300,0))","v":"DISPO CHEZ MOI"},null,0]
[null,{"$f":"IF(ISERROR(INDEX(ColE,MIN(IF((Nom<>0)*(COUNTIF($B$3:B96,Nom)=0),ROW(Nom))))&\"\"),\"\",INDEX(ColE,MIN(IF((Nom<>0)*(COUNTIF($B$3:B96,Nom)=0),ROW(Nom))))&\"\")","v":"88098XDEUX"},{"$f":"IF(B97<>\"\",COUNTIF('Tableau Commandes'!E98:E393,Récapitulatifs!B97),\"\")","v":1},{"$f":"IF(B97=\"\",\"\",SUMIF(REF,B97,'Tableau Commandes'!$C$5:$C$26))","v":1},0,0,{"$f":"INDEX('Tableau Commandes'!$M$4:$M$300,MATCH($B97,'Tableau Commandes'!$E$4:$E$300,0))","v":"DISPO CHEZ MOI"},null,0]
[null,{"$f":"IF(ISERROR(INDEX(ColE,MIN(IF((Nom<>0)*(COUNTIF($B$3:B97,Nom)=0),ROW(Nom))))&\"\"),\"\",INDEX(ColE,MIN(IF((Nom<>0)*(COUNTIF($B$3:B97,Nom)=0),ROW(Nom))))&\"\")","v":"199000"},{"$f":"IF(B98<>\"\",COUNTIF('Tableau Commandes'!E99:E394,Récapitulatifs!B98),\"\")","v":1},{"$f":"IF(B98=\"\",\"\",SUMIF(REF,B98,'Tableau Commandes'!$C$5:$C$26))","v":1},0,0,{"$f":"INDEX('Tableau Commandes'!$M$4:$M$300,MATCH($B98,'Tableau Commandes'!$E$4:$E$300,0))","v":"DISPO CHEZ MOI"},null,0]
[null,{"$f":"IF(ISERROR(INDEX(ColE,MIN(IF((Nom<>0)*(COUNTIF($B$3:B98,Nom)=0),ROW(Nom))))&\"\"),\"\",INDEX(ColE,MIN(IF((Nom<>0)*(COUNTIF($B$3:B98,Nom)=0),ROW(Nom))))&\"\")","v":"5169"},{"$f":"IF(B99<>\"\",COUNTIF('Tableau Commandes'!E100:E395,Récapitulatifs!B99),\"\")","v":1},{"$f":"IF(B99=\"\",\"\",SUMIF(REF,B99,'Tableau Commandes'!$C$5:$C$26))","v":1},0,0,{"$f":"INDEX('Tableau Commandes'!$M$4:$M$300,MATCH($B99,'Tableau Commandes'!$E$4:$E$300,0))","v":"DISPO CHEZ MOI"},null,0]
[null,{"$f":"IF(ISERROR(INDEX(ColE,MIN(IF((Nom<>0)*(COUNTIF($B$3:B99,Nom)=0),ROW(Nom))))&\"\"),\"\",INDEX(ColE,MIN(IF((Nom<>0)*(COUNTIF($B$3:B99,Nom)=0),ROW(Nom))))&\"\")","v":"14575"},{"$f":"IF(B100<>\"\",COUNTIF('Tableau Commandes'!E101:E396,Récapitulatifs!B100),\"\")","v":1},{"$f":"IF(B100=\"\",\"\",SUMIF(REF,B100,'Tableau Commandes'!$C$5:$C$26))","v":1},0,0,{"$f":"INDEX('Tableau Commandes'!$M$4:$M$300,MATCH($B100,'Tableau Commandes'!$E$4:$E$300,0))","v":""},null,0]
[null,{"$f":"IF(ISERROR(INDEX(ColE,MIN(IF((Nom<>0)*(COUNTIF($B$3:B100,Nom)=0),ROW(Nom))))&\"\"),\"\",INDEX(ColE,MIN(IF((Nom<>0)*(COUNTIF($B$3:B100,Nom)=0),ROW(Nom))))&\"\")","v":"BEZ600102XDEUX"},{"$f":"IF(B101<>\"\",COUNTIF('Tableau Commandes'!E102:E397,Récapitulatifs!B101),\"\")","v":1},{"$f":"IF(B101=\"\",\"\",SUMIF(REF,B101,'Tableau Commandes'!$C$5:$C$26))","v":1},0,0,{"$f":"INDEX('Tableau Commandes'!$M$4:$M$300,MATCH($B101,'Tableau Commandes'!$E$4:$E$300,0))","v":""},null,0]
[null,{"$f":"IF(ISERROR(INDEX(ColE,MIN(IF((Nom<>0)*(COUNTIF($B$3:B101,Nom)=0),ROW(Nom))))&\"\"),\"\",INDEX(ColE,MIN(IF((Nom<>0)*(COUNTIF($B$3:B101,Nom)=0),ROW(Nom))))&\"\")","v":"6PK1713"},{"$f":"IF(B102<>\"\",COUNTIF('Tableau Commandes'!E103:E398,Récapitulatifs!B102),\"\")","v":1},{"$f":"IF(B102=\"\",\"\",SUMIF(REF,B102,'Tableau Commandes'!$C$5:$C$26))","v":1},0,0,{"$f":"INDEX('Tableau Commandes'!$M$4:$M$300,MATCH($B102,'Tableau Commandes'!$E$4:$E$300,0))","v":""},null,0]
[null,{"$f":"IF(ISERROR(INDEX(ColE,MIN(IF((Nom<>0)*(COUNTIF($B$3:B102,Nom)=0),ROW(Nom))))&\"\"),\"\",INDEX(ColE,MIN(IF((Nom<>0)*(COUNTIF($B$3:B102,Nom)=0),ROW(Nom))))&\"\")","v":"CDAL-54506z"},{"$f":"IF(B103<>\"\",COUNTIF('Tableau Commandes'!E104:E399,Récapitulatifs!B103),\"\")","v":2},{"$f":"IF(B103=\"\",\"\",SUMIF(REF,B103,'Tableau Commandes'!$C$5:$C$26))","v":3},0,0,{"$f":"INDEX('Tableau Commandes'!$M$4:$M$300,MATCH($B103,'Tableau Commandes'!$E$4:$E$300,0))","v":""},null,0]
[null,{"$f":"IF(ISERROR(INDEX(ColE,MIN(IF((Nom<>0)*(COUNTIF($B$3:B103,Nom)=0),ROW(Nom))))&\"\"),\"\",INDEX(ColE,MIN(IF((Nom<>0)*(COUNTIF($B$3:B103,Nom)=0),ROW(Nom))))&\"\")","v":"124150"},{"$f":"IF(B104<>\"\",COUNTIF('Tableau Commandes'!E105:E400,Récapitulatifs!B104),\"\")","v":2},{"$f":"IF(B104=\"\",\"\",SUMIF(REF,B104,'Tableau Commandes'!$C$5:$C$26))","v":2},0,0,{"$f":"INDEX('Tableau Commandes'!$M$4:$M$300,MATCH($B104,'Tableau Commandes'!$E$4:$E$300,0))","v":"DISPO CHEZ MOI"},null,0]
[null,{"$f":"IF(ISERROR(INDEX(ColE,MIN(IF((Nom<>0)*(COUNTIF($B$3:B104,Nom)=0),ROW(Nom))))&\"\"),\"\",INDEX(ColE,MIN(IF((Nom<>0)*(COUNTIF($B$3:B104,Nom)=0),ROW(Nom))))&\"\")","v":"999995"},{"$f":"IF(B105<>\"\",COUNTIF('Tableau Commandes'!E106:E401,Récapitulatifs!B105),\"\")","v":1},{"$f":"IF(B105=\"\",\"\",SUMIF(REF,B105,'Tableau Commandes'!$C$5:$C$26))","v":1},0,0,{"$f":"INDEX('Tableau Commandes'!$M$4:$M$300,MATCH($B105,'Tableau Commandes'!$E$4:$E$300,0))","v":""},null,0]
[null,{"$f":"IF(ISERROR(INDEX(ColE,MIN(IF((Nom<>0)*(COUNTIF($B$3:B105,Nom)=0),ROW(Nom))))&\"\"),\"\",INDEX(ColE,MIN(IF((Nom<>0)*(COUNTIF($B$3:B105,Nom)=0),ROW(Nom))))&\"\")","v":"RI71130"},{"$f":"IF(B106<>\"\",COUNTIF('Tableau Commandes'!E107:E402,Récapitulatifs!B106),\"\")","v":1},{"$f":"IF(B106=\"\",\"\",SUMIF(REF,B106,'Tableau Commandes'!$C$5:$C$26))","v":1},0,0,{"$f":"INDEX('Tableau Commandes'!$M$4:$M$300,MATCH($B106,'Tableau Commandes'!$E$4:$E$300,0))","v":""},null,0]
[null,{"$f":"IF(ISERROR(INDEX(ColE,MIN(IF((Nom<>0)*(COUNTIF($B$3:B106,Nom)=0),ROW(Nom))))&\"\"),\"\",INDEX(ColE,MIN(IF((Nom<>0)*(COUNTIF($B$3:B106,Nom)=0),ROW(Nom))))&\"\")","v":"GS12475"},{"$f":"IF(B107<>\"\",COUNTIF('Tableau Commandes'!E108:E403,Récapitulatifs!B107),\"\")","v":1},{"$f":"IF(B107=\"\",\"\",SUMIF(REF,B107,'Tableau Commandes'!$C$5:$C$26))","v":1},0,0,{"$f":"INDEX('Tableau Commandes'!$M$4:$M$300,MATCH($B107,'Tableau Commandes'!$E$4:$E$300,0))","v":""},null,0]
[null,{"$f":"IF(ISERROR(INDEX(ColE,MIN(IF((Nom<>0)*(COUNTIF($B$3:B107,Nom)=0),ROW(Nom))))&\"\"),\"\",INDEX(ColE,MIN(IF((Nom<>0)*(COUNTIF($B$3:B107,Nom)=0),ROW(Nom))))&\"\")","v":"800990"},{"$f":"IF(B108<>\"\",COUNTIF('Tableau Commandes'!E109:E404,Récapitulatifs!B108),\"\")","v":1},{"$f":"IF(B108=\"\",\"\",SUMIF(REF,B108,'Tableau Commandes'!$C$5:$C$26))","v":1},{"$f":"H108","v":0},{"$f":"IF(E108=\"P\",\"PREPAREE\",IF(E108=\"R\",\"RELIQUAT\",))","v":0},{"$f":"INDEX('Tableau Commandes'!$M$4:$M$300,MATCH($B108,'Tableau Commandes'!$E$4:$E$300,0))","v":"DISPO CHEZ MOI"},null,{"$f":"IF(H108=\"P\",\"PREPAREE\",IF(H108=\"R\",\"RELIQUAT\",))","v":0}]
[null,{"$f":"IF(ISERROR(INDEX(ColE,MIN(IF((Nom<>0)*(COUNTIF($B$3:B108,Nom)=0),ROW(Nom))))&\"\"),\"\",INDEX(ColE,MIN(IF((Nom<>0)*(COUNTIF($B$3:B108,Nom)=0),ROW(Nom))))&\"\")","v":"RI71132"},{"$f":"IF(B109<>\"\",COUNTIF('Tableau Commandes'!E110:E405,Récapitulatifs!B109),\"\")","v":1},{"$f":"IF(B109=\"\",\"\",SUMIF(REF,B109,'Tableau Commandes'!$C$5:$C$26))","v":1},0,0,{"$f":"INDEX('Tableau Commandes'!$M$4:$M$300,MATCH($B109,'Tableau Commandes'!$E$4:$E$300,0))","v":""},null,0]
[null,{"$f":"IF(ISERROR(INDEX(ColE,MIN(IF((Nom<>0)*(COUNTIF($B$3:B109,Nom)=0),ROW(Nom))))&\"\"),\"\",INDEX(ColE,MIN(IF((Nom<>0)*(COUNTIF($B$3:B109,Nom)=0),ROW(Nom))))&\"\")","v":"123890"},{"$f":"IF(B110<>\"\",COUNTIF('Tableau Commandes'!E111:E406,Récapitulatifs!B110),\"\")","v":1},{"$f":"IF(B110=\"\",\"\",SUMIF(REF,B110,'Tableau Commandes'!$C$5:$C$26))","v":1},0,0,{"$f":"INDEX('Tableau Commandes'!$M$4:$M$300,MATCH($B110,'Tableau Commandes'!$E$4:$E$300,0))","v":"DISPO CHEZ MOI"},null,0]
[null,{"$f":"IF(ISERROR(INDEX(ColE,MIN(IF((Nom<>0)*(COUNTIF($B$3:B110,Nom)=0),ROW(Nom))))&\"\"),\"\",INDEX(ColE,MIN(IF((Nom<>0)*(COUNTIF($B$3:B110,Nom)=0),ROW(Nom))))&\"\")","v":"555555"},{"$f":"IF(B111<>\"\",COUNTIF('Tableau Commandes'!E112:E407,Récapitulatifs!B111),\"\")","v":1},{"$f":"IF(B111=\"\",\"\",SUMIF(REF,B111,'Tableau Commandes'!$C$5:$C$26))","v":1},0,0,{"$f":"INDEX('Tableau Commandes'!$M$4:$M$300,MATCH($B111,'Tableau Commandes'!$E$4:$E$300,0))","v":""},null,0]
[null,{"$f":"IF(ISERROR(INDEX(ColE,MIN(IF((Nom<>0)*(COUNTIF($B$3:B111,Nom)=0),ROW(Nom))))&\"\"),\"\",INDEX(ColE,MIN(IF((Nom<>0)*(COUNTIF($B$3:B111,Nom)=0),ROW(Nom))))&\"\")","v":"133600"},{"$f":"IF(B112<>\"\",COUNTIF('Tableau Commandes'!E113:E408,Récapitulatifs!B112),\"\")","v":1},{"$f":"IF(B112=\"\",\"\",SUMIF(REF,B112,'Tableau Commandes'!$C$5:$C$26))","v":1},0,0,{"$f":"INDEX('Tableau Commandes'!$M$4:$M$300,MATCH($B112,'Tableau Commandes'!$E$4:$E$300,0))","v":""},null,0]
[null,{"$f":"IF(ISERROR(INDEX(ColE,MIN(IF((Nom<>0)*(COUNTIF($B$3:B112,Nom)=0),ROW(Nom))))&\"\"),\"\",INDEX(ColE,MIN(IF((Nom<>0)*(COUNTIF($B$3:B112,Nom)=0),ROW(Nom))))&\"\")","v":"19599XDEUX"},{"$f":"IF(B113<>\"\",COUNTIF('Tableau Commandes'!E114:E409,Récapitulatifs!B113),\"\")","v":1},{"$f":"IF(B113=\"\",\"\",SUMIF(REF,B113,'Tableau Commandes'!$C$5:$C$26))","v":1},0,0,{"$f":"INDEX('Tableau Commandes'!$M$4:$M$300,MATCH($B113,'Tableau Commandes'!$E$4:$E$300,0))","v":""},null,0]
[null,{"$f":"IF(ISERROR(INDEX(ColE,MIN(IF((Nom<>0)*(COUNTIF($B$3:B113,Nom)=0),ROW(Nom))))&\"\"),\"\",INDEX(ColE,MIN(IF((Nom<>0)*(COUNTIF($B$3:B113,Nom)=0),ROW(Nom))))&\"\")","v":"1000350ST"},{"$f":"IF(B114<>\"\",COUNTIF('Tableau Commandes'!E115:E410,Récapitulatifs!B114),\"\")","v":1},{"$f":"IF(B114=\"\",\"\",SUMIF(REF,B114,'Tableau Commandes'!$C$5:$C$26))","v":2},0,0,{"$f":"INDEX('Tableau Commandes'!$M$4:$M$300,MATCH($B114,'Tableau Commandes'!$E$4:$E$300,0))","v":""},null,0]
[null,{"$f":"IF(ISERROR(INDEX(ColE,MIN(IF((Nom<>0)*(COUNTIF($B$3:B114,Nom)=0),ROW(Nom))))&\"\"),\"\",INDEX(ColE,MIN(IF((Nom<>0)*(COUNTIF($B$3:B114,Nom)=0),ROW(Nom))))&\"\")","v":"502024X4"},{"$f":"IF(B115<>\"\",COUNTIF('Tableau Commandes'!E116:E411,Récapitulatifs!B115),\"\")","v":1},{"$f":"IF(B115=\"\",\"\",SUMIF(REF,B115,'Tableau Commandes'!$C$5:$C$26))","v":1},0,0,{"$f":"INDEX('Tableau Commandes'!$M$4:$M$300,MATCH($B115,'Tableau Commandes'!$E$4:$E$300,0))","v":""},null,0]
[null,{"$f":"IF(ISERROR(INDEX(ColE,MIN(IF((Nom<>0)*(COUNTIF($B$3:B115,Nom)=0),ROW(Nom))))&\"\"),\"\",INDEX(ColE,MIN(IF((Nom<>0)*(COUNTIF($B$3:B115,Nom)=0),ROW(Nom))))&\"\")","v":"CDAL-54504z"},{"$f":"IF(B116<>\"\",COUNTIF('Tableau Commandes'!E117:E412,Récapitulatifs!B116),\"\")","v":1},{"$f":"IF(B116=\"\",\"\",SUMIF(REF,B116,'Tableau Commandes'!$C$5:$C$26))","v":10},0,0,{"$f":"INDEX('Tableau Commandes'!$M$4:$M$300,MATCH($B116,'Tableau Commandes'!$E$4:$E$300,0))","v":""},null,0]
[null,{"$f":"IF(ISERROR(INDEX(ColE,MIN(IF((Nom<>0)*(COUNTIF($B$3:B116,Nom)=0),ROW(Nom))))&\"\"),\"\",INDEX(ColE,MIN(IF((Nom<>0)*(COUNTIF($B$3:B116,Nom)=0),ROW(Nom))))&\"\")","v":"321040"},{"$f":"IF(B117<>\"\",COUNTIF('Tableau Commandes'!E118:E413,Récapitulatifs!B117),\"\")","v":2},{"$f":"IF(B117=\"\",\"\",SUMIF(REF,B117,'Tableau Commandes'!$C$5:$C$26))","v":2},0,0,{"$f":"INDEX('Tableau Commandes'!$M$4:$M$300,MATCH($B117,'Tableau Commandes'!$E$4:$E$300,0))","v":"DISPO CHEZ MOI"},null,0]
[null,{"$f":"IF(ISERROR(INDEX(ColE,MIN(IF((Nom<>0)*(COUNTIF($B$3:B117,Nom)=0),ROW(Nom))))&\"\"),\"\",INDEX(ColE,MIN(IF((Nom<>0)*(COUNTIF($B$3:B117,Nom)=0),ROW(Nom))))&\"\")","v":"810781"},{"$f":"IF(B118<>\"\",COUNTIF('Tableau Commandes'!E119:E414,Récapitulatifs!B118),\"\")","v":1},{"$f":"IF(B118=\"\",\"\",SUMIF(REF,B118,'Tableau Commandes'!$C$5:$C$26))","v":1},0,0,{"$f":"INDEX('Tableau Commandes'!$M$4:$M$300,MATCH($B118,'Tableau Commandes'!$E$4:$E$300,0))","v":""},null,0]
[null,{"$f":"IF(ISERROR(INDEX(ColE,MIN(IF((Nom<>0)*(COUNTIF($B$3:B118,Nom)=0),ROW(Nom))))&\"\"),\"\",INDEX(ColE,MIN(IF((Nom<>0)*(COUNTIF($B$3:B118,Nom)=0),ROW(Nom))))&\"\")","v":"1000400ST"},{"$f":"IF(B119<>\"\",COUNTIF('Tableau Commandes'!E120:E415,Récapitulatifs!B119),\"\")","v":1},{"$f":"IF(B119=\"\",\"\",SUMIF(REF,B119,'Tableau Commandes'!$C$5:$C$26))","v":1},0,0,{"$f":"INDEX('Tableau Commandes'!$M$4:$M$300,MATCH($B119,'Tableau Commandes'!$E$4:$E$300,0))","v":""},null,0]
[null,{"$f":"IF(ISERROR(INDEX(ColE,MIN(IF((Nom<>0)*(COUNTIF($B$3:B119,Nom)=0),ROW(Nom))))&\"\"),\"\",INDEX(ColE,MIN(IF((Nom<>0)*(COUNTIF($B$3:B119,Nom)=0),ROW(Nom))))&\"\")","v":"1000600ST"},{"$f":"IF(B120<>\"\",COUNTIF('Tableau Commandes'!E121:E416,Récapitulatifs!B120),\"\")","v":1},{"$f":"IF(B120=\"\",\"\",SUMIF(REF,B120,'Tableau Commandes'!$C$5:$C$26))","v":1},0,0,{"$f":"INDEX('Tableau Commandes'!$M$4:$M$300,MATCH($B120,'Tableau Commandes'!$E$4:$E$300,0))","v":""},null,0]
[null,{"$f":"IF(ISERROR(INDEX(ColE,MIN(IF((Nom<>0)*(COUNTIF($B$3:B120,Nom)=0),ROW(Nom))))&\"\"),\"\",INDEX(ColE,MIN(IF((Nom<>0)*(COUNTIF($B$3:B120,Nom)=0),ROW(Nom))))&\"\")","v":"321030"},{"$f":"IF(B121<>\"\",COUNTIF('Tableau Commandes'!E122:E417,Récapitulatifs!B121),\"\")","v":1},{"$f":"IF(B121=\"\",\"\",SUMIF(REF,B121,'Tableau Commandes'!$C$5:$C$26))","v":1},0,0,{"$f":"INDEX('Tableau Commandes'!$M$4:$M$300,MATCH($B121,'Tableau Commandes'!$E$4:$E$300,0))","v":""},null,0]
[null,{"$f":"IF(ISERROR(INDEX(ColE,MIN(IF((Nom<>0)*(COUNTIF($B$3:B121,Nom)=0),ROW(Nom))))&\"\"),\"\",INDEX(ColE,MIN(IF((Nom<>0)*(COUNTIF($B$3:B121,Nom)=0),ROW(Nom))))&\"\")","v":"321020"},{"$f":"IF(B122<>\"\",COUNTIF('Tableau Commandes'!E123:E418,Récapitulatifs!B122),\"\")","v":2},{"$f":"IF(B122=\"\",\"\",SUMIF(REF,B122,'Tableau Commandes'!$C$5:$C$26))","v":2},0,0,{"$f":"INDEX('Tableau Commandes'!$M$4:$M$300,MATCH($B122,'Tableau Commandes'!$E$4:$E$300,0))","v":""},null,0]
[null,{"$f":"IF(ISERROR(INDEX(ColE,MIN(IF((Nom<>0)*(COUNTIF($B$3:B122,Nom)=0),ROW(Nom))))&\"\"),\"\",INDEX(ColE,MIN(IF((Nom<>0)*(COUNTIF($B$3:B122,Nom)=0),ROW(Nom))))&\"\")","v":"A304"},{"$f":"IF(B123<>\"\",COUNTIF('Tableau Commandes'!E124:E419,Récapitulatifs!B123),\"\")","v":1},{"$f":"IF(B123=\"\",\"\",SUMIF(REF,B123,'Tableau Commandes'!$C$5:$C$26))","v":1},0,0,{"$f":"INDEX('Tableau Commandes'!$M$4:$M$300,MATCH($B123,'Tableau Commandes'!$E$4:$E$300,0))","v":""},null,0]
[null,{"$f":"IF(ISERROR(INDEX(ColE,MIN(IF((Nom<>0)*(COUNTIF($B$3:B123,Nom)=0),ROW(Nom))))&\"\"),\"\",INDEX(ColE,MIN(IF((Nom<>0)*(COUNTIF($B$3:B123,Nom)=0),ROW(Nom))))&\"\")","v":"BEZ600260XDEUX"},{"$f":"IF(B124<>\"\",COUNTIF('Tableau Commandes'!E125:E420,Récapitulatifs!B124),\"\")","v":1},{"$f":"IF(B124=\"\",\"\",SUMIF(REF,B124,'Tableau Commandes'!$C$5:$C$26))","v":1},0,0,{"$f":"INDEX('Tableau Commandes'!$M$4:$M$300,MATCH($B124,'Tableau Commandes'!$E$4:$E$300,0))","v":""},null,0]
[null,{"$f":"IF(ISERROR(INDEX(ColE,MIN(IF((Nom<>0)*(COUNTIF($B$3:B124,Nom)=0),ROW(Nom))))&\"\"),\"\",INDEX(ColE,MIN(IF((Nom<>0)*(COUNTIF($B$3:B124,Nom)=0),ROW(Nom))))&\"\")","v":"4594"},{"$f":"IF(B125<>\"\",COUNTIF('Tableau Commandes'!E126:E421,Récapitulatifs!B125),\"\")","v":1},{"$f":"IF(B125=\"\",\"\",SUMIF(REF,B125,'Tableau Commandes'!$C$5:$C$26))","v":1},0,0,{"$f":"INDEX('Tableau Commandes'!$M$4:$M$300,MATCH($B125,'Tableau Commandes'!$E$4:$E$300,0))","v":"DISPO CHEZ MOI"},null,0]
[null,{"$f":"IF(ISERROR(INDEX(ColE,MIN(IF((Nom<>0)*(COUNTIF($B$3:B125,Nom)=0),ROW(Nom))))&\"\"),\"\",INDEX(ColE,MIN(IF((Nom<>0)*(COUNTIF($B$3:B125,Nom)=0),ROW(Nom))))&\"\")","v":"LPALPALPA1"},{"$f":"IF(B126<>\"\",COUNTIF('Tableau Commandes'!E127:E422,Récapitulatifs!B126),\"\")","v":1},{"$f":"IF(B126=\"\",\"\",SUMIF(REF,B126,'Tableau Commandes'!$C$5:$C$26))","v":1},0,0,{"$f":"INDEX('Tableau Commandes'!$M$4:$M$300,MATCH($B126,'Tableau Commandes'!$E$4:$E$300,0))","v":""},null,0]
[null,{"$f":"IF(ISERROR(INDEX(ColE,MIN(IF((Nom<>0)*(COUNTIF($B$3:B126,Nom)=0),ROW(Nom))))&\"\"),\"\",INDEX(ColE,MIN(IF((Nom<>0)*(COUNTIF($B$3:B126,Nom)=0),ROW(Nom))))&\"\")","v":"20032"},{"$f":"IF(B127<>\"\",COUNTIF('Tableau Commandes'!E128:E423,Récapitulatifs!B127),\"\")","v":3},{"$f":"IF(B127=\"\",\"\",SUMIF(REF,B127,'Tableau Commandes'!$C$5:$C$26))","v":3},0,0,{"$f":"INDEX('Tableau Commandes'!$M$4:$M$300,MATCH($B127,'Tableau Commandes'!$E$4:$E$300,0))","v":""},null,0]
[null,{"$f":"IF(ISERROR(INDEX(ColE,MIN(IF((Nom<>0)*(COUNTIF($B$3:B127,Nom)=0),ROW(Nom))))&\"\"),\"\",INDEX(ColE,MIN(IF((Nom<>0)*(COUNTIF($B$3:B127,Nom)=0),ROW(Nom))))&\"\")","v":"81025"},{"$f":"IF(B128<>\"\",COUNTIF('Tableau Commandes'!E129:E424,Récapitulatifs!B128),\"\")","v":1},{"$f":"IF(B128=\"\",\"\",SUMIF(REF,B128,'Tableau Commandes'!$C$5:$C$26))","v":1},0,0,{"$f":"INDEX('Tableau Commandes'!$M$4:$M$300,MATCH($B128,'Tableau Commandes'!$E$4:$E$300,0))","v":""},null,0]
[null,{"$f":"IF(ISERROR(INDEX(ColE,MIN(IF((Nom<>0)*(COUNTIF($B$3:B128,Nom)=0),ROW(Nom))))&\"\"),\"\",INDEX(ColE,MIN(IF((Nom<>0)*(COUNTIF($B$3:B128,Nom)=0),ROW(Nom))))&\"\")","v":"87197XDEUX"},{"$f":"IF(B129<>\"\",COUNTIF('Tableau Commandes'!E130:E425,Récapitulatifs!B129),\"\")","v":1},{"$f":"IF(B129=\"\",\"\",SUMIF(REF,B129,'Tableau Commandes'!$C$5:$C$26))","v":1},0,0,{"$f":"INDEX('Tableau Commandes'!$M$4:$M$300,MATCH($B129,'Tableau Commandes'!$E$4:$E$300,0))","v":""},null,0]
[null,{"$f":"IF(ISERROR(INDEX(ColE,MIN(IF((Nom<>0)*(COUNTIF($B$3:B129,Nom)=0),ROW(Nom))))&\"\"),\"\",INDEX(ColE,MIN(IF((Nom<>0)*(COUNTIF($B$3:B129,Nom)=0),ROW(Nom))))&\"\")","v":"MECA8370"},{"$f":"IF(B130<>\"\",COUNTIF('Tableau Commandes'!E131:E426,Récapitulatifs!B130),\"\")","v":1},{"$f":"IF(B130=\"\",\"\",SUMIF(REF,B130,'Tableau Commandes'!$C$5:$C$26))","v":1},0,0,{"$f":"INDEX('Tableau Commandes'!$M$4:$M$300,MATCH($B130,'Tableau Commandes'!$E$4:$E$300,0))","v":""},null,0]
[null,{"$f":"IF(ISERROR(INDEX(ColE,MIN(IF((Nom<>0)*(COUNTIF($B$3:B130,Nom)=0),ROW(Nom))))&\"\"),\"\",INDEX(ColE,MIN(IF((Nom<>0)*(COUNTIF($B$3:B130,Nom)=0),ROW(Nom))))&\"\")","v":"53014"},{"$f":"IF(B131<>\"\",COUNTIF('Tableau Commandes'!E132:E427,Récapitulatifs!B131),\"\")","v":1},{"$f":"IF(B131=\"\",\"\",SUMIF(REF,B131,'Tableau Commandes'!$C$5:$C$26))","v":1},0,0,{"$f":"INDEX('Tableau Commandes'!$M$4:$M$300,MATCH($B131,'Tableau Commandes'!$E$4:$E$300,0))","v":"DISPO CHEZ MOI"},null,0]
[null,{"$f":"IF(ISERROR(INDEX(ColE,MIN(IF((Nom<>0)*(COUNTIF($B$3:B131,Nom)=0),ROW(Nom))))&\"\"),\"\",INDEX(ColE,MIN(IF((Nom<>0)*(COUNTIF($B$3:B131,Nom)=0),ROW(Nom))))&\"\")","v":"3120000312"},{"$f":"IF(B132<>\"\",COUNTIF('Tableau Commandes'!E133:E428,Récapitulatifs!B132),\"\")","v":1},{"$f":"IF(B132=\"\",\"\",SUMIF(REF,B132,'Tableau Commandes'!$C$5:$C$26))","v":1},0,0,{"$f":"INDEX('Tableau Commandes'!$M$4:$M$300,MATCH($B132,'Tableau Commandes'!$E$4:$E$300,0))","v":""},null,0]
[null,{"$f":"IF(ISERROR(INDEX(ColE,MIN(IF((Nom<>0)*(COUNTIF($B$3:B132,Nom)=0),ROW(Nom))))&\"\"),\"\",INDEX(ColE,MIN(IF((Nom<>0)*(COUNTIF($B$3:B132,Nom)=0),ROW(Nom))))&\"\")","v":"80030"},{"$f":"IF(B133<>\"\",COUNTIF('Tableau Commandes'!E134:E429,Récapitulatifs!B133),\"\")","v":1},{"$f":"IF(B133=\"\",\"\",SUMIF(REF,B133,'Tableau Commandes'!$C$5:$C$26))","v":1},0,0,{"$f":"INDEX('Tableau Commandes'!$M$4:$M$300,MATCH($B133,'Tableau Commandes'!$E$4:$E$300,0))","v":""},null,0]
[null,{"$f":"IF(ISERROR(INDEX(ColE,MIN(IF((Nom<>0)*(COUNTIF($B$3:B133,Nom)=0),ROW(Nom))))&\"\"),\"\",INDEX(ColE,MIN(IF((Nom<>0)*(COUNTIF($B$3:B133,Nom)=0),ROW(Nom))))&\"\")","v":"86066"},{"$f":"IF(B134<>\"\",COUNTIF('Tableau Commandes'!E135:E430,Récapitulatifs!B134),\"\")","v":1},{"$f":"IF(B134=\"\",\"\",SUMIF(REF,B134,'Tableau Commandes'!$C$5:$C$26))","v":1},0,0,{"$f":"INDEX('Tableau Commandes'!$M$4:$M$300,MATCH($B134,'Tableau Commandes'!$E$4:$E$300,0))","v":""},null,0]
[null,{"$f":"IF(ISERROR(INDEX(ColE,MIN(IF((Nom<>0)*(COUNTIF($B$3:B134,Nom)=0),ROW(Nom))))&\"\"),\"\",INDEX(ColE,MIN(IF((Nom<>0)*(COUNTIF($B$3:B134,Nom)=0),ROW(Nom))))&\"\")","v":"CDAL-NF"},{"$f":"IF(B135<>\"\",COUNTIF('Tableau Commandes'!E136:E431,Récapitulatifs!B135),\"\")","v":1},{"$f":"IF(B135=\"\",\"\",SUMIF(REF,B135,'Tableau Commandes'!$C$5:$C$26))","v":1},0,0,{"$f":"INDEX('Tableau Commandes'!$M$4:$M$300,MATCH($B135,'Tableau Commandes'!$E$4:$E$300,0))","v":"DISPO CHEZ MOI"},null,0]
[null,{"$f":"IF(ISERROR(INDEX(ColE,MIN(IF((Nom<>0)*(COUNTIF($B$3:B135,Nom)=0),ROW(Nom))))&\"\"),\"\",INDEX(ColE,MIN(IF((Nom<>0)*(COUNTIF($B$3:B135,Nom)=0),ROW(Nom))))&\"\")","v":"880003"},{"$f":"IF(B136<>\"\",COUNTIF('Tableau Commandes'!E137:E432,Récapitulatifs!B136),\"\")","v":1},{"$f":"IF(B136=\"\",\"\",SUMIF(REF,B136,'Tableau Commandes'!$C$5:$C$26))","v":1},0,0,{"$f":"INDEX('Tableau Commandes'!$M$4:$M$300,MATCH($B136,'Tableau Commandes'!$E$4:$E$300,0))","v":""},null,0]
[null,{"$f":"IF(ISERROR(INDEX(ColE,MIN(IF((Nom<>0)*(COUNTIF($B$3:B136,Nom)=0),ROW(Nom))))&\"\"),\"\",INDEX(ColE,MIN(IF((Nom<>0)*(COUNTIF($B$3:B136,Nom)=0),ROW(Nom))))&\"\")","v":"199101"},{"$f":"IF(B137<>\"\",COUNTIF('Tableau Commandes'!E138:E433,Récapitulatifs!B137),\"\")","v":1},{"$f":"IF(B137=\"\",\"\",SUMIF(REF,B137,'Tableau Commandes'!$C$5:$C$26))","v":1},0,0,{"$f":"INDEX('Tableau Commandes'!$M$4:$M$300,MATCH($B137,'Tableau Commandes'!$E$4:$E$300,0))","v":""},null,0]
[null,{"$f":"IF(ISERROR(INDEX(ColE,MIN(IF((Nom<>0)*(COUNTIF($B$3:B137,Nom)=0),ROW(Nom))))&\"\"),\"\",INDEX(ColE,MIN(IF((Nom<>0)*(COUNTIF($B$3:B137,Nom)=0),ROW(Nom))))&\"\")","v":"3770000806"},{"$f":"IF(B138<>\"\",COUNTIF('Tableau Commandes'!E139:E434,Récapitulatifs!B138),\"\")","v":1},{"$f":"IF(B138=\"\",\"\",SUMIF(REF,B138,'Tableau Commandes'!$C$5:$C$26))","v":1},0,0,{"$f":"INDEX('Tableau Commandes'!$M$4:$M$300,MATCH($B138,'Tableau Commandes'!$E$4:$E$300,0))","v":""},null,0]
[null,{"$f":"IF(ISERROR(INDEX(ColE,MIN(IF((Nom<>0)*(COUNTIF($B$3:B138,Nom)=0),ROW(Nom))))&\"\"),\"\",INDEX(ColE,MIN(IF((Nom<>0)*(COUNTIF($B$3:B138,Nom)=0),ROW(Nom))))&\"\")","v":"2000700"},{"$f":"IF(B139<>\"\",COUNTIF('Tableau Commandes'!E140:E435,Récapitulatifs!B139),\"\")","v":1},{"$f":"IF(B139=\"\",\"\",SUMIF(REF,B139,'Tableau Commandes'!$C$5:$C$26))","v":2},0,0,{"$f":"INDEX('Tableau Commandes'!$M$4:$M$300,MATCH($B139,'Tableau Commandes'!$E$4:$E$300,0))","v":"DISPO CHEZ MOI"},null,0]
[null,{"$f":"IF(ISERROR(INDEX(ColE,MIN(IF((Nom<>0)*(COUNTIF($B$3:B139,Nom)=0),ROW(Nom))))&\"\"),\"\",INDEX(ColE,MIN(IF((Nom<>0)*(COUNTIF($B$3:B139,Nom)=0),ROW(Nom))))&\"\")","v":"2000400"},{"$f":"IF(B140<>\"\",COUNTIF('Tableau Commandes'!E141:E436,Récapitulatifs!B140),\"\")","v":1},{"$f":"IF(B140=\"\",\"\",SUMIF(REF,B140,'Tableau Commandes'!$C$5:$C$26))","v":1},0,0,{"$f":"INDEX('Tableau Commandes'!$M$4:$M$300,MATCH($B140,'Tableau Commandes'!$E$4:$E$300,0))","v":"DISPO CHEZ MOI"},null,0]
[null,{"$f":"IF(ISERROR(INDEX(ColE,MIN(IF((Nom<>0)*(COUNTIF($B$3:B140,Nom)=0),ROW(Nom))))&\"\"),\"\",INDEX(ColE,MIN(IF((Nom<>0)*(COUNTIF($B$3:B140,Nom)=0),ROW(Nom))))&\"\")","v":"800285"},{"$f":"IF(B141<>\"\",COUNTIF('Tableau Commandes'!E142:E437,Récapitulatifs!B141),\"\")","v":1},{"$f":"IF(B141=\"\",\"\",SUMIF(REF,B141,'Tableau Commandes'!$C$5:$C$26))","v":1},0,0,{"$f":"INDEX('Tableau Commandes'!$M$4:$M$300,MATCH($B141,'Tableau Commandes'!$E$4:$E$300,0))","v":"DISPO CHEZ MOI"},null,0]
[null,{"$f":"IF(ISERROR(INDEX(ColE,MIN(IF((Nom<>0)*(COUNTIF($B$3:B141,Nom)=0),ROW(Nom))))&\"\"),\"\",INDEX(ColE,MIN(IF((Nom<>0)*(COUNTIF($B$3:B141,Nom)=0),ROW(Nom))))&\"\")","v":"86311X"},{"$f":"IF(B142<>\"\",COUNTIF('Tableau Commandes'!E143:E438,Récapitulatifs!B142),\"\")","v":2},{"$f":"IF(B142=\"\",\"\",SUMIF(REF,B142,'Tableau Commandes'!$C$5:$C$26))","v":2},0,0,{"$f":"INDEX('Tableau Commandes'!$M$4:$M$300,MATCH($B142,'Tableau Commandes'!$E$4:$E$300,0))","v":"DISPO CHEZ MOI"},null,0]
[null,{"$f":"IF(ISERROR(INDEX(ColE,MIN(IF((Nom<>0)*(COUNTIF($B$3:B142,Nom)=0),ROW(Nom))))&\"\"),\"\",INDEX(ColE,MIN(IF((Nom<>0)*(COUNTIF($B$3:B142,Nom)=0),ROW(Nom))))&\"\")","v":"86276X"},{"$f":"IF(B143<>\"\",COUNTIF('Tableau Commandes'!E144:E439,Récapitulatifs!B143),\"\")","v":1},{"$f":"IF(B143=\"\",\"\",SUMIF(REF,B143,'Tableau Commandes'!$C$5:$C$26))","v":1},0,0,{"$f":"INDEX('Tableau Commandes'!$M$4:$M$300,MATCH($B143,'Tableau Commandes'!$E$4:$E$300,0))","v":"DISPO CHEZ MOI"},null,0]
[null,{"$f":"IF(ISERROR(INDEX(ColE,MIN(IF((Nom<>0)*(COUNTIF($B$3:B143,Nom)=0),ROW(Nom))))&\"\"),\"\",INDEX(ColE,MIN(IF((Nom<>0)*(COUNTIF($B$3:B143,Nom)=0),ROW(Nom))))&\"\")","v":"81199"},{"$f":"IF(B144<>\"\",COUNTIF('Tableau Commandes'!E145:E440,Récapitulatifs!B144),\"\")","v":1},{"$f":"IF(B144=\"\",\"\",SUMIF(REF,B144,'Tableau Commandes'!$C$5:$C$26))","v":1},0,0,{"$f":"INDEX('Tableau Commandes'!$M$4:$M$300,MATCH($B144,'Tableau Commandes'!$E$4:$E$300,0))","v":""},null,0]
[null,{"$f":"IF(ISERROR(INDEX(ColE,MIN(IF((Nom<>0)*(COUNTIF($B$3:B144,Nom)=0),ROW(Nom))))&\"\"),\"\",INDEX(ColE,MIN(IF((Nom<>0)*(COUNTIF($B$3:B144,Nom)=0),ROW(Nom))))&\"\")","v":"1063XDEUX"},{"$f":"IF(B145<>\"\",COUNTIF('Tableau Commandes'!E146:E441,Récapitulatifs!B145),\"\")","v":1},{"$f":"IF(B145=\"\",\"\",SUMIF(REF,B145,'Tableau Commandes'!$C$5:$C$26))","v":1},0,0,{"$f":"INDEX('Tableau Commandes'!$M$4:$M$300,MATCH($B145,'Tableau Commandes'!$E$4:$E$300,0))","v":"DISPO CHEZ MOI"},null,0]
[null,{"$f":"IF(ISERROR(INDEX(ColE,MIN(IF((Nom<>0)*(COUNTIF($B$3:B145,Nom)=0),ROW(Nom))))&\"\"),\"\",INDEX(ColE,MIN(IF((Nom<>0)*(COUNTIF($B$3:B145,Nom)=0),ROW(Nom))))&\"\")","v":"MECA8121"},{"$f":"IF(B146<>\"\",COUNTIF('Tableau Commandes'!E147:E442,Récapitulatifs!B146),\"\")","v":1},{"$f":"IF(B146=\"\",\"\",SUMIF(REF,B146,'Tableau Commandes'!$C$5:$C$26))","v":1},0,0,{"$f":"INDEX('Tableau Commandes'!$M$4:$M$300,MATCH($B146,'Tableau Commandes'!$E$4:$E$300,0))","v":""},null,0]
[null,{"$f":"IF(ISERROR(INDEX(ColE,MIN(IF((Nom<>0)*(COUNTIF($B$3:B146,Nom)=0),ROW(Nom))))&\"\"),\"\",INDEX(ColE,MIN(IF((Nom<>0)*(COUNTIF($B$3:B146,Nom)=0),ROW(Nom))))&\"\")","v":"13993"},{"$f":"IF(B147<>\"\",COUNTIF('Tableau Commandes'!E148:E443,Récapitulatifs!B147),\"\")","v":1},{"$f":"IF(B147=\"\",\"\",SUMIF(REF,B147,'Tableau Commandes'!$C$5:$C$26))","v":1},0,0,{"$f":"INDEX('Tableau Commandes'!$M$4:$M$300,MATCH($B147,'Tableau Commandes'!$E$4:$E$300,0))","v":""},null,0]
[null,{"$f":"IF(ISERROR(INDEX(ColE,MIN(IF((Nom<>0)*(COUNTIF($B$3:B147,Nom)=0),ROW(Nom))))&\"\"),\"\",INDEX(ColE,MIN(IF((Nom<>0)*(COUNTIF($B$3:B147,Nom)=0),ROW(Nom))))&\"\")","v":"900810"},{"$f":"IF(B148<>\"\",COUNTIF('Tableau Commandes'!E149:E444,Récapitulatifs!B148),\"\")","v":1},{"$f":"IF(B148=\"\",\"\",SUMIF(REF,B148,'Tableau Commandes'!$C$5:$C$26))","v":1},0,0,{"$f":"INDEX('Tableau Commandes'!$M$4:$M$300,MATCH($B148,'Tableau Commandes'!$E$4:$E$300,0))","v":"DISPO CHEZ MOI"},null,0]
[null,{"$f":"IF(ISERROR(INDEX(ColE,MIN(IF((Nom<>0)*(COUNTIF($B$3:B148,Nom)=0),ROW(Nom))))&\"\"),\"\",INDEX(ColE,MIN(IF((Nom<>0)*(COUNTIF($B$3:B148,Nom)=0),ROW(Nom))))&\"\")","v":"71112ET59995"},{"$f":"IF(B149<>\"\",COUNTIF('Tableau Commandes'!E150:E445,Récapitulatifs!B149),\"\")","v":1},{"$f":"IF(B149=\"\",\"\",SUMIF(REF,B149,'Tableau Commandes'!$C$5:$C$26))","v":1},0,0,{"$f":"INDEX('Tableau Commandes'!$M$4:$M$300,MATCH($B149,'Tableau Commandes'!$E$4:$E$300,0))","v":""},null,0]
[null,{"$f":"IF(ISERROR(INDEX(ColE,MIN(IF((Nom<>0)*(COUNTIF($B$3:B149,Nom)=0),ROW(Nom))))&\"\"),\"\",INDEX(ColE,MIN(IF((Nom<>0)*(COUNTIF($B$3:B149,Nom)=0),ROW(Nom))))&\"\")","v":"883265459"},{"$f":"IF(B150<>\"\",COUNTIF('Tableau Commandes'!E151:E446,Récapitulatifs!B150),\"\")","v":2},{"$f":"IF(B150=\"\",\"\",SUMIF(REF,B150,'Tableau Commandes'!$C$5:$C$26))","v":2},0,0,{"$f":"INDEX('Tableau Commandes'!$M$4:$M$300,MATCH($B150,'Tableau Commandes'!$E$4:$E$300,0))","v":""},null,0]
[null,{"$f":"IF(ISERROR(INDEX(ColE,MIN(IF((Nom<>0)*(COUNTIF($B$3:B150,Nom)=0),ROW(Nom))))&\"\"),\"\",INDEX(ColE,MIN(IF((Nom<>0)*(COUNTIF($B$3:B150,Nom)=0),ROW(Nom))))&\"\")","v":"86095"},{"$f":"IF(B151<>\"\",COUNTIF('Tableau Commandes'!E152:E447,Récapitulatifs!B151),\"\")","v":1},{"$f":"IF(B151=\"\",\"\",SUMIF(REF,B151,'Tableau Commandes'!$C$5:$C$26))","v":1},0,0,{"$f":"INDEX('Tableau Commandes'!$M$4:$M$300,MATCH($B151,'Tableau Commandes'!$E$4:$E$300,0))","v":""},null,0]
[null,{"$f":"IF(ISERROR(INDEX(ColE,MIN(IF((Nom<>0)*(COUNTIF($B$3:B151,Nom)=0),ROW(Nom))))&\"\"),\"\",INDEX(ColE,MIN(IF((Nom<>0)*(COUNTIF($B$3:B151,Nom)=0),ROW(Nom))))&\"\")","v":"A1210XDEUX"},{"$f":"IF(B152<>\"\",COUNTIF('Tableau Commandes'!E153:E448,Récapitulatifs!B152),\"\")","v":1},{"$f":"IF(B152=\"\",\"\",SUMIF(REF,B152,'Tableau Commandes'!$C$5:$C$26))","v":1},0,0,{"$f":"INDEX('Tableau Commandes'!$M$4:$M$300,MATCH($B152,'Tableau Commandes'!$E$4:$E$300,0))","v":""},null,0]
[null,{"$f":"IF(ISERROR(INDEX(ColE,MIN(IF((Nom<>0)*(COUNTIF($B$3:B152,Nom)=0),ROW(Nom))))&\"\"),\"\",INDEX(ColE,MIN(IF((Nom<>0)*(COUNTIF($B$3:B152,Nom)=0),ROW(Nom))))&\"\")","v":"CDAL-54505z"},{"$f":"IF(B153<>\"\",COUNTIF('Tableau Commandes'!E154:E449,Récapitulatifs!B153),\"\")","v":1},{"$f":"IF(B153=\"\",\"\",SUMIF(REF,B153,'Tableau Commandes'!$C$5:$C$26))","v":1},0,0,{"$f":"INDEX('Tableau Commandes'!$M$4:$M$300,MATCH($B153,'Tableau Commandes'!$E$4:$E$300,0))","v":"DISPO CHEZ MOI"},null,0]
[null,{"$f":"IF(ISERROR(INDEX(ColE,MIN(IF((Nom<>0)*(COUNTIF($B$3:B153,Nom)=0),ROW(Nom))))&\"\"),\"\",INDEX(ColE,MIN(IF((Nom<>0)*(COUNTIF($B$3:B153,Nom)=0),ROW(Nom))))&\"\")","v":"182470"},{"$f":"IF(B154<>\"\",COUNTIF('Tableau Commandes'!E155:E450,Récapitulatifs!B154),\"\")","v":1},{"$f":"IF(B154=\"\",\"\",SUMIF(REF,B154,'Tableau Commandes'!$C$5:$C$26))","v":1},0,0,{"$f":"INDEX('Tableau Commandes'!$M$4:$M$300,MATCH($B154,'Tableau Commandes'!$E$4:$E$300,0))","v":""},null,0]
[null,{"$f":"IF(ISERROR(INDEX(ColE,MIN(IF((Nom<>0)*(COUNTIF($B$3:B154,Nom)=0),ROW(Nom))))&\"\"),\"\",INDEX(ColE,MIN(IF((Nom<>0)*(COUNTIF($B$3:B154,Nom)=0),ROW(Nom))))&\"\")","v":"31814"},{"$f":"IF(B155<>\"\",COUNTIF('Tableau Commandes'!E156:E451,Récapitulatifs!B155),\"\")","v":1},{"$f":"IF(B155=\"\",\"\",SUMIF(REF,B155,'Tableau Commandes'!$C$5:$C$26))","v":1},0,0,{"$f":"INDEX('Tableau Commandes'!$M$4:$M$300,MATCH($B155,'Tableau Commandes'!$E$4:$E$300,0))","v":""},null,0]
[null,{"$f":"IF(ISERROR(INDEX(ColE,MIN(IF((Nom<>0)*(COUNTIF($B$3:B155,Nom)=0),ROW(Nom))))&\"\"),\"\",INDEX(ColE,MIN(IF((Nom<>0)*(COUNTIF($B$3:B155,Nom)=0),ROW(Nom))))&\"\")","v":"802700"},{"$f":"IF(B156<>\"\",COUNTIF('Tableau Commandes'!E157:E452,Récapitulatifs!B156),\"\")","v":1},{"$f":"IF(B156=\"\",\"\",SUMIF(REF,B156,'Tableau Commandes'!$C$5:$C$26))","v":1},0,0,{"$f":"INDEX('Tableau Commandes'!$M$4:$M$300,MATCH($B156,'Tableau Commandes'!$E$4:$E$300,0))","v":""},null,0]
[null,{"$f":"IF(ISERROR(INDEX(ColE,MIN(IF((Nom<>0)*(COUNTIF($B$3:B156,Nom)=0),ROW(Nom))))&\"\"),\"\",INDEX(ColE,MIN(IF((Nom<>0)*(COUNTIF($B$3:B156,Nom)=0),ROW(Nom))))&\"\")","v":"106450"},{"$f":"IF(B157<>\"\",COUNTIF('Tableau Commandes'!E158:E453,Récapitulatifs!B157),\"\")","v":1},{"$f":"IF(B157=\"\",\"\",SUMIF(REF,B157,'Tableau Commandes'!$C$5:$C$26))","v":1},0,0,{"$f":"INDEX('Tableau Commandes'!$M$4:$M$300,MATCH($B157,'Tableau Commandes'!$E$4:$E$300,0))","v":"DISPO CHEZ MOI"},null,0]
[null,{"$f":"IF(ISERROR(INDEX(ColE,MIN(IF((Nom<>0)*(COUNTIF($B$3:B157,Nom)=0),ROW(Nom))))&\"\"),\"\",INDEX(ColE,MIN(IF((Nom<>0)*(COUNTIF($B$3:B157,Nom)=0),ROW(Nom))))&\"\")","v":"297802"},{"$f":"IF(B158<>\"\",COUNTIF('Tableau Commandes'!E159:E454,Récapitulatifs!B158),\"\")","v":1},{"$f":"IF(B158=\"\",\"\",SUMIF(REF,B158,'Tableau Commandes'!$C$5:$C$26))","v":1},0,0,{"$f":"INDEX('Tableau Commandes'!$M$4:$M$300,MATCH($B158,'Tableau Commandes'!$E$4:$E$300,0))","v":""},null,0]
[null,{"$f":"IF(ISERROR(INDEX(ColE,MIN(IF((Nom<>0)*(COUNTIF($B$3:B158,Nom)=0),ROW(Nom))))&\"\"),\"\",INDEX(ColE,MIN(IF((Nom<>0)*(COUNTIF($B$3:B158,Nom)=0),ROW(Nom))))&\"\")","v":"70052"},{"$f":"IF(B159<>\"\",COUNTIF('Tableau Commandes'!E160:E455,Récapitulatifs!B159),\"\")","v":1},{"$f":"IF(B159=\"\",\"\",SUMIF(REF,B159,'Tableau Commandes'!$C$5:$C$26))","v":1},0,0,{"$f":"INDEX('Tableau Commandes'!$M$4:$M$300,MATCH($B159,'Tableau Commandes'!$E$4:$E$300,0))","v":""},null,0]
[null,{"$f":"IF(ISERROR(INDEX(ColE,MIN(IF((Nom<>0)*(COUNTIF($B$3:B159,Nom)=0),ROW(Nom))))&\"\"),\"\",INDEX(ColE,MIN(IF((Nom<>0)*(COUNTIF($B$3:B159,Nom)=0),ROW(Nom))))&\"\")","v":"217014"},{"$f":"IF(B160<>\"\",COUNTIF('Tableau Commandes'!E161:E456,Récapitulatifs!B160),\"\")","v":1},{"$f":"IF(B160=\"\",\"\",SUMIF(REF,B160,'Tableau Commandes'!$C$5:$C$26))","v":1},0,0,{"$f":"INDEX('Tableau Commandes'!$M$4:$M$300,MATCH($B160,'Tableau Commandes'!$E$4:$E$300,0))","v":""},null,0]
[null,{"$f":"IF(ISERROR(INDEX(ColE,MIN(IF((Nom<>0)*(COUNTIF($B$3:B160,Nom)=0),ROW(Nom))))&\"\"),\"\",INDEX(ColE,MIN(IF((Nom<>0)*(COUNTIF($B$3:B160,Nom)=0),ROW(Nom))))&\"\")","v":"613000"},{"$f":"IF(B161<>\"\",COUNTIF('Tableau Commandes'!E162:E457,Récapitulatifs!B161),\"\")","v":1},{"$f":"IF(B161=\"\",\"\",SUMIF(REF,B161,'Tableau Commandes'!$C$5:$C$26))","v":1},0,0,{"$f":"INDEX('Tableau Commandes'!$M$4:$M$300,MATCH($B161,'Tableau Commandes'!$E$4:$E$300,0))","v":""},null,0]
[null,{"$f":"IF(ISERROR(INDEX(ColE,MIN(IF((Nom<>0)*(COUNTIF($B$3:B161,Nom)=0),ROW(Nom))))&\"\"),\"\",INDEX(ColE,MIN(IF((Nom<>0)*(COUNTIF($B$3:B161,Nom)=0),ROW(Nom))))&\"\")","v":"MECA4608"},{"$f":"IF(B162<>\"\",COUNTIF('Tableau Commandes'!E163:E458,Récapitulatifs!B162),\"\")","v":1},{"$f":"IF(B162=\"\",\"\",SUMIF(REF,B162,'Tableau Commandes'!$C$5:$C$26))","v":1},0,0,{"$f":"INDEX('Tableau Commandes'!$M$4:$M$300,MATCH($B162,'Tableau Commandes'!$E$4:$E$300,0))","v":"DISPO CHEZ MOI"},null,0]
[null,{"$f":"IF(ISERROR(INDEX(ColE,MIN(IF((Nom<>0)*(COUNTIF($B$3:B162,Nom)=0),ROW(Nom))))&\"\"),\"\",INDEX(ColE,MIN(IF((Nom<>0)*(COUNTIF($B$3:B162,Nom)=0),ROW(Nom))))&\"\")","v":"88095"},{"$f":"IF(B163<>\"\",COUNTIF('Tableau Commandes'!E164:E459,Récapitulatifs!B163),\"\")","v":1},{"$f":"IF(B163=\"\",\"\",SUMIF(REF,B163,'Tableau Commandes'!$C$5:$C$26))","v":1},0,0,{"$f":"INDEX('Tableau Commandes'!$M$4:$M$300,MATCH($B163,'Tableau Commandes'!$E$4:$E$300,0))","v":""},null,0]
[null,{"$f":"IF(ISERROR(INDEX(ColE,MIN(IF((Nom<>0)*(COUNTIF($B$3:B163,Nom)=0),ROW(Nom))))&\"\"),\"\",INDEX(ColE,MIN(IF((Nom<>0)*(COUNTIF($B$3:B163,Nom)=0),ROW(Nom))))&\"\")","v":"4593"},{"$f":"IF(B164<>\"\",COUNTIF('Tableau Commandes'!E165:E460,Récapitulatifs!B164),\"\")","v":1},{"$f":"IF(B164=\"\",\"\",SUMIF(REF,B164,'Tableau Commandes'!$C$5:$C$26))","v":1},0,0,{"$f":"INDEX('Tableau Commandes'!$M$4:$M$300,MATCH($B164,'Tableau Commandes'!$E$4:$E$300,0))","v":"DISPO CHEZ MOI"},null,0]
[null,{"$f":"IF(ISERROR(INDEX(ColE,MIN(IF((Nom<>0)*(COUNTIF($B$3:B164,Nom)=0),ROW(Nom))))&\"\"),\"\",INDEX(ColE,MIN(IF((Nom<>0)*(COUNTIF($B$3:B164,Nom)=0),ROW(Nom))))&\"\")","v":"RAD1000350"},{"$f":"IF(B165<>\"\",COUNTIF('Tableau Commandes'!E166:E461,Récapitulatifs!B165),\"\")","v":1},{"$f":"IF(B165=\"\",\"\",SUMIF(REF,B165,'Tableau Commandes'!$C$5:$C$26))","v":1},0,0,{"$f":"INDEX('Tableau Commandes'!$M$4:$M$300,MATCH($B165,'Tableau Commandes'!$E$4:$E$300,0))","v":""},null,0]
[null,{"$f":"IF(ISERROR(INDEX(ColE,MIN(IF((Nom<>0)*(COUNTIF($B$3:B165,Nom)=0),ROW(Nom))))&\"\"),\"\",INDEX(ColE,MIN(IF((Nom<>0)*(COUNTIF($B$3:B165,Nom)=0),ROW(Nom))))&\"\")","v":"99949"},{"$f":"IF(B166<>\"\",COUNTIF('Tableau Commandes'!E167:E462,Récapitulatifs!B166),\"\")","v":1},{"$f":"IF(B166=\"\",\"\",SUMIF(REF,B166,'Tableau Commandes'!$C$5:$C$26))","v":1},0,0,{"$f":"INDEX('Tableau Commandes'!$M$4:$M$300,MATCH($B166,'Tableau Commandes'!$E$4:$E$300,0))","v":""},null,0]
[null,{"$f":"IF(ISERROR(INDEX(ColE,MIN(IF((Nom<>0)*(COUNTIF($B$3:B166,Nom)=0),ROW(Nom))))&\"\"),\"\",INDEX(ColE,MIN(IF((Nom<>0)*(COUNTIF($B$3:B166,Nom)=0),ROW(Nom))))&\"\")","v":"MECA3835"},{"$f":"IF(B167<>\"\",COUNTIF('Tableau Commandes'!E168:E463,Récapitulatifs!B167),\"\")","v":1},{"$f":"IF(B167=\"\",\"\",SUMIF(REF,B167,'Tableau Commandes'!$C$5:$C$26))","v":1},0,0,{"$f":"INDEX('Tableau Commandes'!$M$4:$M$300,MATCH($B167,'Tableau Commandes'!$E$4:$E$300,0))","v":"DISPO CHEZ MOI"},null,0]
[null,{"$f":"IF(ISERROR(INDEX(ColE,MIN(IF((Nom<>0)*(COUNTIF($B$3:B167,Nom)=0),ROW(Nom))))&\"\"),\"\",INDEX(ColE,MIN(IF((Nom<>0)*(COUNTIF($B$3:B167,Nom)=0),ROW(Nom))))&\"\")","v":"561030"},{"$f":"IF(B168<>\"\",COUNTIF('Tableau Commandes'!E169:E464,Récapitulatifs!B168),\"\")","v":1},{"$f":"IF(B168=\"\",\"\",SUMIF(REF,B168,'Tableau Commandes'!$C$5:$C$26))","v":1},0,0,{"$f":"INDEX('Tableau Commandes'!$M$4:$M$300,MATCH($B168,'Tableau Commandes'!$E$4:$E$300,0))","v":"DISPO CHEZ MOI"},null,0]
[null,{"$f":"IF(ISERROR(INDEX(ColE,MIN(IF((Nom<>0)*(COUNTIF($B$3:B168,Nom)=0),ROW(Nom))))&\"\"),\"\",INDEX(ColE,MIN(IF((Nom<>0)*(COUNTIF($B$3:B168,Nom)=0),ROW(Nom))))&\"\")","v":"99952"},{"$f":"IF(B169<>\"\",COUNTIF('Tableau Commandes'!E170:E465,Récapitulatifs!B169),\"\")","v":1},{"$f":"IF(B169=\"\",\"\",SUMIF(REF,B169,'Tableau Commandes'!$C$5:$C$26))","v":1},0,0,{"$f":"INDEX('Tableau Commandes'!$M$4:$M$300,MATCH($B169,'Tableau Commandes'!$E$4:$E$300,0))","v":""},null,0]
[null,{"$f":"IF(ISERROR(INDEX(ColE,MIN(IF((Nom<>0)*(COUNTIF($B$3:B169,Nom)=0),ROW(Nom))))&\"\"),\"\",INDEX(ColE,MIN(IF((Nom<>0)*(COUNTIF($B$3:B169,Nom)=0),ROW(Nom))))&\"\")","v":"A14113"},{"$f":"IF(B170<>\"\",COUNTIF('Tableau Commandes'!E171:E466,Récapitulatifs!B170),\"\")","v":1},{"$f":"IF(B170=\"\",\"\",SUMIF(REF,B170,'Tableau Commandes'!$C$5:$C$26))","v":1},0,0,{"$f":"INDEX('Tableau Commandes'!$M$4:$M$300,MATCH($B170,'Tableau Commandes'!$E$4:$E$300,0))","v":""},null,0]
[null,{"$f":"IF(ISERROR(INDEX(ColE,MIN(IF((Nom<>0)*(COUNTIF($B$3:B170,Nom)=0),ROW(Nom))))&\"\"),\"\",INDEX(ColE,MIN(IF((Nom<>0)*(COUNTIF($B$3:B170,Nom)=0),ROW(Nom))))&\"\")","v":"82065"},{"$f":"IF(B171<>\"\",COUNTIF('Tableau Commandes'!E172:E467,Récapitulatifs!B171),\"\")","v":1},{"$f":"IF(B171=\"\",\"\",SUMIF(REF,B171,'Tableau Commandes'!$C$5:$C$26))","v":1},0,0,{"$f":"INDEX('Tableau Commandes'!$M$4:$M$300,MATCH($B171,'Tableau Commandes'!$E$4:$E$300,0))","v":""},null,0]
[null,{"$f":"IF(ISERROR(INDEX(ColE,MIN(IF((Nom<>0)*(COUNTIF($B$3:B171,Nom)=0),ROW(Nom))))&\"\"),\"\",INDEX(ColE,MIN(IF((Nom<>0)*(COUNTIF($B$3:B171,Nom)=0),ROW(Nom))))&\"\")","v":"70034"},{"$f":"IF(B172<>\"\",COUNTIF('Tableau Commandes'!E173:E468,Récapitulatifs!B172),\"\")","v":1},{"$f":"IF(B172=\"\",\"\",SUMIF(REF,B172,'Tableau Commandes'!$C$5:$C$26))","v":1},{"$f":"H172","v":0},{"$f":"IF(E172=\"P\",\"PREPAREE\",IF(E172=\"R\",\"RELIQUAT\",))","v":0},{"$f":"INDEX('Tableau Commandes'!$M$4:$M$300,MATCH($B172,'Tableau Commandes'!$E$4:$E$300,0))","v":""},null,{"$f":"IF(H172=\"P\",\"PREPAREE\",IF(H172=\"R\",\"RELIQUAT\",))","v":0}]
[null,{"$f":"IF(ISERROR(INDEX(ColE,MIN(IF((Nom<>0)*(COUNTIF($B$3:B172,Nom)=0),ROW(Nom))))&\"\"),\"\",INDEX(ColE,MIN(IF((Nom<>0)*(COUNTIF($B$3:B172,Nom)=0),ROW(Nom))))&\"\")","v":"26599"},{"$f":"IF(B173<>\"\",COUNTIF('Tableau Commandes'!E174:E469,Récapitulatifs!B173),\"\")","v":2},{"$f":"IF(B173=\"\",\"\",SUMIF(REF,B173,'Tableau Commandes'!$C$5:$C$26))","v":2},0,0,{"$f":"INDEX('Tableau Commandes'!$M$4:$M$300,MATCH($B173,'Tableau Commandes'!$E$4:$E$300,0))","v":""},null,0]
[null,{"$f":"IF(ISERROR(INDEX(ColE,MIN(IF((Nom<>0)*(COUNTIF($B$3:B173,Nom)=0),ROW(Nom))))&\"\"),\"\",INDEX(ColE,MIN(IF((Nom<>0)*(COUNTIF($B$3:B173,Nom)=0),ROW(Nom))))&\"\")","v":"MECA2869"},{"$f":"IF(B174<>\"\",COUNTIF('Tableau Commandes'!E175:E470,Récapitulatifs!B174),\"\")","v":2},{"$f":"IF(B174=\"\",\"\",SUMIF(REF,B174,'Tableau Commandes'!$C$5:$C$26))","v":2},0,0,{"$f":"INDEX('Tableau Commandes'!$M$4:$M$300,MATCH($B174,'Tableau Commandes'!$E$4:$E$300,0))","v":""},null,0]
[null,{"$f":"IF(ISERROR(INDEX(ColE,MIN(IF((Nom<>0)*(COUNTIF($B$3:B174,Nom)=0),ROW(Nom))))&\"\"),\"\",INDEX(ColE,MIN(IF((Nom<>0)*(COUNTIF($B$3:B174,Nom)=0),ROW(Nom))))&\"\")","v":"153540"},{"$f":"IF(B175<>\"\",COUNTIF('Tableau Commandes'!E176:E471,Récapitulatifs!B175),\"\")","v":1},{"$f":"IF(B175=\"\",\"\",SUMIF(REF,B175,'Tableau Commandes'!$C$5:$C$26))","v":1},0,0,{"$f":"INDEX('Tableau Commandes'!$M$4:$M$300,MATCH($B175,'Tableau Commandes'!$E$4:$E$300,0))","v":""},null,0]
[null,{"$f":"IF(ISERROR(INDEX(ColE,MIN(IF((Nom<>0)*(COUNTIF($B$3:B175,Nom)=0),ROW(Nom))))&\"\"),\"\",INDEX(ColE,MIN(IF((Nom<>0)*(COUNTIF($B$3:B175,Nom)=0),ROW(Nom))))&\"\")","v":"5206"},{"$f":"IF(B176<>\"\",COUNTIF('Tableau Commandes'!E177:E472,Récapitulatifs!B176),\"\")","v":1},{"$f":"IF(B176=\"\",\"\",SUMIF(REF,B176,'Tableau Commandes'!$C$5:$C$26))","v":1},0,0,{"$f":"INDEX('Tableau Commandes'!$M$4:$M$300,MATCH($B176,'Tableau Commandes'!$E$4:$E$300,0))","v":""},null,0]
[null,{"$f":"IF(ISERROR(INDEX(ColE,MIN(IF((Nom<>0)*(COUNTIF($B$3:B176,Nom)=0),ROW(Nom))))&\"\"),\"\",INDEX(ColE,MIN(IF((Nom<>0)*(COUNTIF($B$3:B176,Nom)=0),ROW(Nom))))&\"\")","v":"99999A"},{"$f":"IF(B177<>\"\",COUNTIF('Tableau Commandes'!E178:E473,Récapitulatifs!B177),\"\")","v":1},{"$f":"IF(B177=\"\",\"\",SUMIF(REF,B177,'Tableau Commandes'!$C$5:$C$26))","v":1},0,0,{"$f":"INDEX('Tableau Commandes'!$M$4:$M$300,MATCH($B177,'Tableau Commandes'!$E$4:$E$300,0))","v":""},null,0]
[null,{"$f":"IF(ISERROR(INDEX(ColE,MIN(IF((Nom<>0)*(COUNTIF($B$3:B177,Nom)=0),ROW(Nom))))&\"\"),\"\",INDEX(ColE,MIN(IF((Nom<>0)*(COUNTIF($B$3:B177,Nom)=0),ROW(Nom))))&\"\")","v":"99901"},{"$f":"IF(B178<>\"\",COUNTIF('Tableau Commandes'!E179:E474,Récapitulatifs!B178),\"\")","v":1},{"$f":"IF(B178=\"\",\"\",SUMIF(REF,B178,'Tableau Commandes'!$C$5:$C$26))","v":1},0,0,{"$f":"INDEX('Tableau Commandes'!$M$4:$M$300,MATCH($B178,'Tableau Commandes'!$E$4:$E$300,0))","v":"DISPO CHEZ MOI"},null,0]
[null,{"$f":"IF(ISERROR(INDEX(ColE,MIN(IF((Nom<>0)*(COUNTIF($B$3:B178,Nom)=0),ROW(Nom))))&\"\"),\"\",INDEX(ColE,MIN(IF((Nom<>0)*(COUNTIF($B$3:B178,Nom)=0),ROW(Nom))))&\"\")","v":"24099"},{"$f":"IF(B179<>\"\",COUNTIF('Tableau Commandes'!E180:E475,Récapitulatifs!B179),\"\")","v":1},{"$f":"IF(B179=\"\",\"\",SUMIF(REF,B179,'Tableau Commandes'!$C$5:$C$26))","v":2},0,0,{"$f":"INDEX('Tableau Commandes'!$M$4:$M$300,MATCH($B179,'Tableau Commandes'!$E$4:$E$300,0))","v":""},null,0]
[null,{"$f":"IF(ISERROR(INDEX(ColE,MIN(IF((Nom<>0)*(COUNTIF($B$3:B179,Nom)=0),ROW(Nom))))&\"\"),\"\",INDEX(ColE,MIN(IF((Nom<>0)*(COUNTIF($B$3:B179,Nom)=0),ROW(Nom))))&\"\")","v":"72083"},{"$f":"IF(B180<>\"\",COUNTIF('Tableau Commandes'!E181:E476,Récapitulatifs!B180),\"\")","v":1},{"$f":"IF(B180=\"\",\"\",SUMIF(REF,B180,'Tableau Commandes'!$C$5:$C$26))","v":2},0,0,{"$f":"INDEX('Tableau Commandes'!$M$4:$M$300,MATCH($B180,'Tableau Commandes'!$E$4:$E$300,0))","v":""},null,0]
[null,{"$f":"IF(ISERROR(INDEX(ColE,MIN(IF((Nom<>0)*(COUNTIF($B$3:B180,Nom)=0),ROW(Nom))))&\"\"),\"\",INDEX(ColE,MIN(IF((Nom<>0)*(COUNTIF($B$3:B180,Nom)=0),ROW(Nom))))&\"\")","v":"85081"},{"$f":"IF(B181<>\"\",COUNTIF('Tableau Commandes'!E182:E477,Récapitulatifs!B181),\"\")","v":1},{"$f":"IF(B181=\"\",\"\",SUMIF(REF,B181,'Tableau Commandes'!$C$5:$C$26))","v":2},0,0,{"$f":"INDEX('Tableau Commandes'!$M$4:$M$300,MATCH($B181,'Tableau Commandes'!$E$4:$E$300,0))","v":""},null,0]
[null,{"$f":"IF(ISERROR(INDEX(ColE,MIN(IF((Nom<>0)*(COUNTIF($B$3:B181,Nom)=0),ROW(Nom))))&\"\"),\"\",INDEX(ColE,MIN(IF((Nom<>0)*(COUNTIF($B$3:B181,Nom)=0),ROW(Nom))))&\"\")","v":"80090"},{"$f":"IF(B182<>\"\",COUNTIF('Tableau Commandes'!E183:E478,Récapitulatifs!B182),\"\")","v":1},{"$f":"IF(B182=\"\",\"\",SUMIF(REF,B182,'Tableau Commandes'!$C$5:$C$26))","v":1},0,0,{"$f":"INDEX('Tableau Commandes'!$M$4:$M$300,MATCH($B182,'Tableau Commandes'!$E$4:$E$300,0))","v":""},null,0]
[null,{"$f":"IF(ISERROR(INDEX(ColE,MIN(IF((Nom<>0)*(COUNTIF($B$3:B182,Nom)=0),ROW(Nom))))&\"\"),\"\",INDEX(ColE,MIN(IF((Nom<>0)*(COUNTIF($B$3:B182,Nom)=0),ROW(Nom))))&\"\")","v":"42329"},{"$f":"IF(B183<>\"\",COUNTIF('Tableau Commandes'!E184:E479,Récapitulatifs!B183),\"\")","v":1},{"$f":"IF(B183=\"\",\"\",SUMIF(REF,B183,'Tableau Commandes'!$C$5:$C$26))","v":1},0,0,{"$f":"INDEX('Tableau Commandes'!$M$4:$M$300,MATCH($B183,'Tableau Commandes'!$E$4:$E$300,0))","v":"DISPO CHEZ MOI"},null,0]
[null,{"$f":"IF(ISERROR(INDEX(ColE,MIN(IF((Nom<>0)*(COUNTIF($B$3:B183,Nom)=0),ROW(Nom))))&\"\"),\"\",INDEX(ColE,MIN(IF((Nom<>0)*(COUNTIF($B$3:B183,Nom)=0),ROW(Nom))))&\"\")","v":"316900"},{"$f":"IF(B184<>\"\",COUNTIF('Tableau Commandes'!E185:E480,Récapitulatifs!B184),\"\")","v":1},{"$f":"IF(B184=\"\",\"\",SUMIF(REF,B184,'Tableau Commandes'!$C$5:$C$26))","v":1},0,0,{"$f":"INDEX('Tableau Commandes'!$M$4:$M$300,MATCH($B184,'Tableau Commandes'!$E$4:$E$300,0))","v":""},null,0]
[null,{"$f":"IF(ISERROR(INDEX(ColE,MIN(IF((Nom<>0)*(COUNTIF($B$3:B184,Nom)=0),ROW(Nom))))&\"\"),\"\",INDEX(ColE,MIN(IF((Nom<>0)*(COUNTIF($B$3:B184,Nom)=0),ROW(Nom))))&\"\")","v":"34516"},{"$f":"IF(B185<>\"\",COUNTIF('Tableau Commandes'!E186:E481,Récapitulatifs!B185),\"\")","v":1},{"$f":"IF(B185=\"\",\"\",SUMIF(REF,B185,'Tableau Commandes'!$C$5:$C$26))","v":1},0,0,{"$f":"INDEX('Tableau Commandes'!$M$4:$M$300,MATCH($B185,'Tableau Commandes'!$E$4:$E$300,0))","v":""},null,0]
[null,{"$f":"IF(ISERROR(INDEX(ColE,MIN(IF((Nom<>0)*(COUNTIF($B$3:B185,Nom)=0),ROW(Nom))))&\"\"),\"\",INDEX(ColE,MIN(IF((Nom<>0)*(COUNTIF($B$3:B185,Nom)=0),ROW(Nom))))&\"\")","v":"450200"},{"$f":"IF(B186<>\"\",COUNTIF('Tableau Commandes'!E187:E482,Récapitulatifs!B186),\"\")","v":1},{"$f":"IF(B186=\"\",\"\",SUMIF(REF,B186,'Tableau Commandes'!$C$5:$C$26))","v":1},0,0,{"$f":"INDEX('Tableau Commandes'!$M$4:$M$300,MATCH($B186,'Tableau Commandes'!$E$4:$E$300,0))","v":""},null,0]
[null,{"$f":"IF(ISERROR(INDEX(ColE,MIN(IF((Nom<>0)*(COUNTIF($B$3:B186,Nom)=0),ROW(Nom))))&\"\"),\"\",INDEX(ColE,MIN(IF((Nom<>0)*(COUNTIF($B$3:B186,Nom)=0),ROW(Nom))))&\"\")","v":""},{"$f":"IF(B187<>\"\",COUNTIF('Tableau Commandes'!E188:E483,Récapitulatifs!B187),\"\")","v":""},{"$f":"IF(B187=\"\",\"\",SUMIF(REF,B187,'Tableau Commandes'!$C$5:$C$26))","v":""},0,0,{"$f":"INDEX('Tableau Commandes'!$M$4:$M$300,MATCH($B187,'Tableau Commandes'!$E$4:$E$300,0))","v":{"$error":"#N/A"}},null,0]
[null,{"$f":"IF(ISERROR(INDEX(ColE,MIN(IF((Nom<>0)*(COUNTIF($B$3:B187,Nom)=0),ROW(Nom))))&\"\"),\"\",INDEX(ColE,MIN(IF((Nom<>0)*(COUNTIF($B$3:B187,Nom)=0),ROW(Nom))))&\"\")","v":""},{"$f":"IF(B188<>\"\",COUNTIF('Tableau Commandes'!E189:E484,Récapitulatifs!B188),\"\")","v":""},{"$f":"IF(B188=\"\",\"\",SUMIF(REF,B188,'Tableau Commandes'!$C$5:$C$26))","v":""},0,0,{"$f":"INDEX('Tableau Commandes'!$M$4:$M$300,MATCH($B188,'Tableau Commandes'!$E$4:$E$300,0))","v":{"$error":"#N/A"}},null,0]
[null,{"$f":"IF(ISERROR(INDEX(ColE,MIN(IF((Nom<>0)*(COUNTIF($B$3:B188,Nom)=0),ROW(Nom))))&\"\"),\"\",INDEX(ColE,MIN(IF((Nom<>0)*(COUNTIF($B$3:B188,Nom)=0),ROW(Nom))))&\"\")","v":""},{"$f":"IF(B189<>\"\",COUNTIF('Tableau Commandes'!E190:E485,Récapitulatifs!B189),\"\")","v":""},{"$f":"IF(B189=\"\",\"\",SUMIF(REF,B189,'Tableau Commandes'!$C$5:$C$26))","v":""},0,0,{"$f":"INDEX('Tableau Commandes'!$M$4:$M$300,MATCH($B189,'Tableau Commandes'!$E$4:$E$300,0))","v":{"$error":"#N/A"}},null,0]
[null,{"$f":"IF(ISERROR(INDEX(ColE,MIN(IF((Nom<>0)*(COUNTIF($B$3:B189,Nom)=0),ROW(Nom))))&\"\"),\"\",INDEX(ColE,MIN(IF((Nom<>0)*(COUNTIF($B$3:B189,Nom)=0),ROW(Nom))))&\"\")","v":""},{"$f":"IF(B190<>\"\",COUNTIF('Tableau Commandes'!E191:E486,Récapitulatifs!B190),\"\")","v":""},{"$f":"IF(B190=\"\",\"\",SUMIF(REF,B190,'Tableau Commandes'!$C$5:$C$26))","v":""},0,0,{"$f":"INDEX('Tableau Commandes'!$M$4:$M$300,MATCH($B190,'Tableau Commandes'!$E$4:$E$300,0))","v":{"$error":"#N/A"}},null,0]
[null,{"$f":"IF(ISERROR(INDEX(ColE,MIN(IF((Nom<>0)*(COUNTIF($B$3:B190,Nom)=0),ROW(Nom))))&\"\"),\"\",INDEX(ColE,MIN(IF((Nom<>0)*(COUNTIF($B$3:B190,Nom)=0),ROW(Nom))))&\"\")","v":""},{"$f":"IF(B191<>\"\",COUNTIF('Tableau Commandes'!E192:E487,Récapitulatifs!B191),\"\")","v":""},{"$f":"IF(B191=\"\",\"\",SUMIF(REF,B191,'Tableau Commandes'!$C$5:$C$26))","v":""},0,0,{"$f":"INDEX('Tableau Commandes'!$M$4:$M$300,MATCH($B191,'Tableau Commandes'!$E$4:$E$300,0))","v":{"$error":"#N/A"}},null,0]
[null,{"$f":"IF(ISERROR(INDEX(ColE,MIN(IF((Nom<>0)*(COUNTIF($B$3:B191,Nom)=0),ROW(Nom))))&\"\"),\"\",INDEX(ColE,MIN(IF((Nom<>0)*(COUNTIF($B$3:B191,Nom)=0),ROW(Nom))))&\"\")","v":""},{"$f":"IF(B192<>\"\",COUNTIF('Tableau Commandes'!E193:E488,Récapitulatifs!B192),\"\")","v":""},{"$f":"IF(B192=\"\",\"\",SUMIF(REF,B192,'Tableau Commandes'!$C$5:$C$26))","v":""},0,0,{"$f":"INDEX('Tableau Commandes'!$M$4:$M$300,MATCH($B192,'Tableau Commandes'!$E$4:$E$300,0))","v":{"$error":"#N/A"}},null,0]
[null,{"$f":"IF(ISERROR(INDEX(ColE,MIN(IF((Nom<>0)*(COUNTIF($B$3:B192,Nom)=0),ROW(Nom))))&\"\"),\"\",INDEX(ColE,MIN(IF((Nom<>0)*(COUNTIF($B$3:B192,Nom)=0),ROW(Nom))))&\"\")","v":""},{"$f":"IF(B193<>\"\",COUNTIF('Tableau Commandes'!E194:E489,Récapitulatifs!B193),\"\")","v":""},{"$f":"IF(B193=\"\",\"\",SUMIF(REF,B193,'Tableau Commandes'!$C$5:$C$26))","v":""},0,0,{"$f":"INDEX('Tableau Commandes'!$M$4:$M$300,MATCH($B193,'Tableau Commandes'!$E$4:$E$300,0))","v":{"$error":"#N/A"}},null,0]
[null,{"$f":"IF(ISERROR(INDEX(ColE,MIN(IF((Nom<>0)*(COUNTIF($B$3:B193,Nom)=0),ROW(Nom))))&\"\"),\"\",INDEX(ColE,MIN(IF((Nom<>0)*(COUNTIF($B$3:B193,Nom)=0),ROW(Nom))))&\"\")","v":""},{"$f":"IF(B194<>\"\",COUNTIF('Tableau Commandes'!E195:E490,Récapitulatifs!B194),\"\")","v":""},{"$f":"IF(B194=\"\",\"\",SUMIF(REF,B194,'Tableau Commandes'!$C$5:$C$26))","v":""},0,0,{"$f":"INDEX('Tableau Commandes'!$M$4:$M$300,MATCH($B194,'Tableau Commandes'!$E$4:$E$300,0))","v":{"$error":"#N/A"}},null,0]
[null,{"$f":"IF(ISERROR(INDEX(ColE,MIN(IF((Nom<>0)*(COUNTIF($B$3:B194,Nom)=0),ROW(Nom))))&\"\"),\"\",INDEX(ColE,MIN(IF((Nom<>0)*(COUNTIF($B$3:B194,Nom)=0),ROW(Nom))))&\"\")","v":""},{"$f":"IF(B195<>\"\",COUNTIF('Tableau Commandes'!E196:E491,Récapitulatifs!B195),\"\")","v":""},{"$f":"IF(B195=\"\",\"\",SUMIF(REF,B195,'Tableau Commandes'!$C$5:$C$26))","v":""},0,0,{"$f":"INDEX('Tableau Commandes'!$M$4:$M$300,MATCH($B195,'Tableau Commandes'!$E$4:$E$300,0))","v":{"$error":"#N/A"}},null,0]
[null,{"$f":"IF(ISERROR(INDEX(ColE,MIN(IF((Nom<>0)*(COUNTIF($B$3:B195,Nom)=0),ROW(Nom))))&\"\"),\"\",INDEX(ColE,MIN(IF((Nom<>0)*(COUNTIF($B$3:B195,Nom)=0),ROW(Nom))))&\"\")","v":""},{"$f":"IF(B196<>\"\",COUNTIF('Tableau Commandes'!E197:E492,Récapitulatifs!B196),\"\")","v":""},{"$f":"IF(B196=\"\",\"\",SUMIF(REF,B196,'Tableau Commandes'!$C$5:$C$26))","v":""},0,0,{"$f":"INDEX('Tableau Commandes'!$M$4:$M$300,MATCH($B196,'Tableau Commandes'!$E$4:$E$300,0))","v":{"$error":"#N/A"}},null,0]
[null,{"$f":"IF(ISERROR(INDEX(ColE,MIN(IF((Nom<>0)*(COUNTIF($B$3:B196,Nom)=0),ROW(Nom))))&\"\"),\"\",INDEX(ColE,MIN(IF((Nom<>0)*(COUNTIF($B$3:B196,Nom)=0),ROW(Nom))))&\"\")","v":""},{"$f":"IF(B197<>\"\",COUNTIF('Tableau Commandes'!E198:E493,Récapitulatifs!B197),\"\")","v":""},{"$f":"IF(B197=\"\",\"\",SUMIF(REF,B197,'Tableau Commandes'!$C$5:$C$26))","v":""},0,0,{"$f":"INDEX('Tableau Commandes'!$M$4:$M$300,MATCH($B197,'Tableau Commandes'!$E$4:$E$300,0))","v":{"$error":"#N/A"}},null,0]
[null,{"$f":"IF(ISERROR(INDEX(ColE,MIN(IF((Nom<>0)*(COUNTIF($B$3:B197,Nom)=0),ROW(Nom))))&\"\"),\"\",INDEX(ColE,MIN(IF((Nom<>0)*(COUNTIF($B$3:B197,Nom)=0),ROW(Nom))))&\"\")","v":""},{"$f":"IF(B198<>\"\",COUNTIF('Tableau Commandes'!E199:E494,Récapitulatifs!B198),\"\")","v":""},{"$f":"IF(B198=\"\",\"\",SUMIF(REF,B198,'Tableau Commandes'!$C$5:$C$26))","v":""},0,0,{"$f":"INDEX('Tableau Commandes'!$M$4:$M$300,MATCH($B198,'Tableau Commandes'!$E$4:$E$300,0))","v":{"$error":"#N/A"}},null,0]
[null,{"$f":"IF(ISERROR(INDEX(ColE,MIN(IF((Nom<>0)*(COUNTIF($B$3:B198,Nom)=0),ROW(Nom))))&\"\"),\"\",INDEX(ColE,MIN(IF((Nom<>0)*(COUNTIF($B$3:B198,Nom)=0),ROW(Nom))))&\"\")","v":""},{"$f":"IF(B199<>\"\",COUNTIF('Tableau Commandes'!E200:E495,Récapitulatifs!B199),\"\")","v":""},{"$f":"IF(B199=\"\",\"\",SUMIF(REF,B199,'Tableau Commandes'!$C$5:$C$26))","v":""},0,0,{"$f":"INDEX('Tableau Commandes'!$M$4:$M$300,MATCH($B199,'Tableau Commandes'!$E$4:$E$300,0))","v":{"$error":"#N/A"}},null,0]
[null,{"$f":"IF(ISERROR(INDEX(ColE,MIN(IF((Nom<>0)*(COUNTIF($B$3:B199,Nom)=0),ROW(Nom))))&\"\"),\"\",INDEX(ColE,MIN(IF((Nom<>0)*(COUNTIF($B$3:B199,Nom)=0),ROW(Nom))))&\"\")","v":""},{"$f":"IF(B200<>\"\",COUNTIF('Tableau Commandes'!E201:E496,Récapitulatifs!B200),\"\")","v":""},{"$f":"IF(B200=\"\",\"\",SUMIF(REF,B200,'Tableau Commandes'!$C$5:$C$26))","v":""},0,0,{"$f":"INDEX('Tableau Commandes'!$M$4:$M$300,MATCH($B200,'Tableau Commandes'!$E$4:$E$300,0))","v":{"$error":"#N/A"}},null,0]
[null,{"$f":"IF(ISERROR(INDEX(ColE,MIN(IF((Nom<>0)*(COUNTIF($B$3:B200,Nom)=0),ROW(Nom))))&\"\"),\"\",INDEX(ColE,MIN(IF((Nom<>0)*(COUNTIF($B$3:B200,Nom)=0),ROW(Nom))))&\"\")","v":""},{"$f":"IF(B201<>\"\",COUNTIF('Tableau Commandes'!E202:E497,Récapitulatifs!B201),\"\")","v":""},{"$f":"IF(B201=\"\",\"\",SUMIF(REF,B201,'Tableau Commandes'!$C$5:$C$26))","v":""},0,0,{"$f":"INDEX('Tableau Commandes'!$M$4:$M$300,MATCH($B201,'Tableau Commandes'!$E$4:$E$300,0))","v":{"$error":"#N/A"}},null,0]
[null,{"$f":"IF(ISERROR(INDEX(ColE,MIN(IF((Nom<>0)*(COUNTIF($B$3:B201,Nom)=0),ROW(Nom))))&\"\"),\"\",INDEX(ColE,MIN(IF((Nom<>0)*(COUNTIF($B$3:B201,Nom)=0),ROW(Nom))))&\"\")","v":""},{"$f":"IF(B202<>\"\",COUNTIF('Tableau Commandes'!E203:E498,Récapitulatifs!B202),\"\")","v":""},{"$f":"IF(B202=\"\",\"\",SUMIF(REF,B202,'Tableau Commandes'!$C$5:$C$26))","v":""},0,0,{"$f":"INDEX('Tableau Commandes'!$M$4:$M$300,MATCH($B202,'Tableau Commandes'!$E$4:$E$300,0))","v":{"$error":"#N/A"}},null,0]
[null,{"$f":"IF(ISERROR(INDEX(ColE,MIN(IF((Nom<>0)*(COUNTIF($B$3:B202,Nom)=0),ROW(Nom))))&\"\"),\"\",INDEX(ColE,MIN(IF((Nom<>0)*(COUNTIF($B$3:B202,Nom)=0),ROW(Nom))))&\"\")","v":""},{"$f":"IF(B203<>\"\",COUNTIF('Tableau Commandes'!E204:E499,Récapitulatifs!B203),\"\")","v":""},{"$f":"IF(B203=\"\",\"\",SUMIF(REF,B203,'Tableau Commandes'!$C$5:$C$26))","v":""},0,0,{"$f":"INDEX('Tableau Commandes'!$M$4:$M$300,MATCH($B203,'Tableau Commandes'!$E$4:$E$300,0))","v":{"$error":"#N/A"}},null,0]
[null,{"$f":"IF(ISERROR(INDEX(ColE,MIN(IF((Nom<>0)*(COUNTIF($B$3:B203,Nom)=0),ROW(Nom))))&\"\"),\"\",INDEX(ColE,MIN(IF((Nom<>0)*(COUNTIF($B$3:B203,Nom)=0),ROW(Nom))))&\"\")","v":""},{"$f":"IF(B204<>\"\",COUNTIF('Tableau Commandes'!E205:E500,Récapitulatifs!B204),\"\")","v":""},{"$f":"IF(B204=\"\",\"\",SUMIF(REF,B204,'Tableau Commandes'!$C$5:$C$26))","v":""},0,0,{"$f":"INDEX('Tableau Commandes'!$M$4:$M$300,MATCH($B204,'Tableau Commandes'!$E$4:$E$300,0))","v":{"$error":"#N/A"}},null,0]
[null,{"$f":"IF(ISERROR(INDEX(ColE,MIN(IF((Nom<>0)*(COUNTIF($B$3:B204,Nom)=0),ROW(Nom))))&\"\"),\"\",INDEX(ColE,MIN(IF((Nom<>0)*(COUNTIF($B$3:B204,Nom)=0),ROW(Nom))))&\"\")","v":""},{"$f":"IF(B205<>\"\",COUNTIF('Tableau Commandes'!E206:E501,Récapitulatifs!B205),\"\")","v":""},{"$f":"IF(B205=\"\",\"\",SUMIF(REF,B205,'Tableau Commandes'!$C$5:$C$26))","v":""},0,0,{"$f":"INDEX('Tableau Commandes'!$M$4:$M$300,MATCH($B205,'Tableau Commandes'!$E$4:$E$300,0))","v":{"$error":"#N/A"}},null,0]
[null,{"$f":"IF(ISERROR(INDEX(ColE,MIN(IF((Nom<>0)*(COUNTIF($B$3:B205,Nom)=0),ROW(Nom))))&\"\"),\"\",INDEX(ColE,MIN(IF((Nom<>0)*(COUNTIF($B$3:B205,Nom)=0),ROW(Nom))))&\"\")","v":""},{"$f":"IF(B206<>\"\",COUNTIF('Tableau Commandes'!E207:E502,Récapitulatifs!B206),\"\")","v":""},{"$f":"IF(B206=\"\",\"\",SUMIF(REF,B206,'Tableau Commandes'!$C$5:$C$26))","v":""},0,0,{"$f":"INDEX('Tableau Commandes'!$M$4:$M$300,MATCH($B206,'Tableau Commandes'!$E$4:$E$300,0))","v":{"$error":"#N/A"}},null,0]
[null,{"$f":"IF(ISERROR(INDEX(ColE,MIN(IF((Nom<>0)*(COUNTIF($B$3:B206,Nom)=0),ROW(Nom))))&\"\"),\"\",INDEX(ColE,MIN(IF((Nom<>0)*(COUNTIF($B$3:B206,Nom)=0),ROW(Nom))))&\"\")","v":""},{"$f":"IF(B207<>\"\",COUNTIF('Tableau Commandes'!E208:E503,Récapitulatifs!B207),\"\")","v":""},{"$f":"IF(B207=\"\",\"\",SUMIF(REF,B207,'Tableau Commandes'!$C$5:$C$26))","v":""},0,0,{"$f":"INDEX('Tableau Commandes'!$M$4:$M$300,MATCH($B207,'Tableau Commandes'!$E$4:$E$300,0))","v":{"$error":"#N/A"}},null,0]
[null,{"$f":"IF(ISERROR(INDEX(ColE,MIN(IF((Nom<>0)*(COUNTIF($B$3:B207,Nom)=0),ROW(Nom))))&\"\"),\"\",INDEX(ColE,MIN(IF((Nom<>0)*(COUNTIF($B$3:B207,Nom)=0),ROW(Nom))))&\"\")","v":""},{"$f":"IF(B208<>\"\",COUNTIF('Tableau Commandes'!E209:E504,Récapitulatifs!B208),\"\")","v":""},{"$f":"IF(B208=\"\",\"\",SUMIF(REF,B208,'Tableau Commandes'!$C$5:$C$26))","v":""},0,0,{"$f":"INDEX('Tableau Commandes'!$M$4:$M$300,MATCH($B208,'Tableau Commandes'!$E$4:$E$300,0))","v":{"$error":"#N/A"}},null,0]
[null,{"$f":"IF(ISERROR(INDEX(ColE,MIN(IF((Nom<>0)*(COUNTIF($B$3:B208,Nom)=0),ROW(Nom))))&\"\"),\"\",INDEX(ColE,MIN(IF((Nom<>0)*(COUNTIF($B$3:B208,Nom)=0),ROW(Nom))))&\"\")","v":""},{"$f":"IF(B209<>\"\",COUNTIF('Tableau Commandes'!E210:E505,Récapitulatifs!B209),\"\")","v":""},{"$f":"IF(B209=\"\",\"\",SUMIF(REF,B209,'Tableau Commandes'!$C$5:$C$26))","v":""},0,0,{"$f":"INDEX('Tableau Commandes'!$M$4:$M$300,MATCH($B209,'Tableau Commandes'!$E$4:$E$300,0))","v":{"$error":"#N/A"}},null,0]
[null,{"$f":"IF(ISERROR(INDEX(ColE,MIN(IF((Nom<>0)*(COUNTIF($B$3:B209,Nom)=0),ROW(Nom))))&\"\"),\"\",INDEX(ColE,MIN(IF((Nom<>0)*(COUNTIF($B$3:B209,Nom)=0),ROW(Nom))))&\"\")","v":""},{"$f":"IF(B210<>\"\",COUNTIF('Tableau Commandes'!E211:E506,Récapitulatifs!B210),\"\")","v":""},{"$f":"IF(B210=\"\",\"\",SUMIF(REF,B210,'Tableau Commandes'!$C$5:$C$26))","v":""},0,0,{"$f":"INDEX('Tableau Commandes'!$M$4:$M$300,MATCH($B210,'Tableau Commandes'!$E$4:$E$300,0))","v":{"$error":"#N/A"}},null,0]
[null,{"$f":"IF(ISERROR(INDEX(ColE,MIN(IF((Nom<>0)*(COUNTIF($B$3:B210,Nom)=0),ROW(Nom))))&\"\"),\"\",INDEX(ColE,MIN(IF((Nom<>0)*(COUNTIF($B$3:B210,Nom)=0),ROW(Nom))))&\"\")","v":""},{"$f":"IF(B211<>\"\",COUNTIF('Tableau Commandes'!E212:E507,Récapitulatifs!B211),\"\")","v":""},{"$f":"IF(B211=\"\",\"\",SUMIF(REF,B211,'Tableau Commandes'!$C$5:$C$26))","v":""},0,0,{"$f":"INDEX('Tableau Commandes'!$M$4:$M$300,MATCH($B211,'Tableau Commandes'!$E$4:$E$300,0))","v":{"$error":"#N/A"}},null,0]
[null,{"$f":"IF(ISERROR(INDEX(ColE,MIN(IF((Nom<>0)*(COUNTIF($B$3:B211,Nom)=0),ROW(Nom))))&\"\"),\"\",INDEX(ColE,MIN(IF((Nom<>0)*(COUNTIF($B$3:B211,Nom)=0),ROW(Nom))))&\"\")","v":""},{"$f":"IF(B212<>\"\",COUNTIF('Tableau Commandes'!E213:E508,Récapitulatifs!B212),\"\")","v":""},{"$f":"IF(B212=\"\",\"\",SUMIF(REF,B212,'Tableau Commandes'!$C$5:$C$26))","v":""},0,0,{"$f":"INDEX('Tableau Commandes'!$M$4:$M$300,MATCH($B212,'Tableau Commandes'!$E$4:$E$300,0))","v":{"$error":"#N/A"}},null,0]
[null,{"$f":"IF(ISERROR(INDEX(ColE,MIN(IF((Nom<>0)*(COUNTIF($B$3:B212,Nom)=0),ROW(Nom))))&\"\"),\"\",INDEX(ColE,MIN(IF((Nom<>0)*(COUNTIF($B$3:B212,Nom)=0),ROW(Nom))))&\"\")","v":""},{"$f":"IF(B213<>\"\",COUNTIF('Tableau Commandes'!E214:E509,Récapitulatifs!B213),\"\")","v":""},{"$f":"IF(B213=\"\",\"\",SUMIF(REF,B213,'Tableau Commandes'!$C$5:$C$26))","v":""},0,0,{"$f":"INDEX('Tableau Commandes'!$M$4:$M$300,MATCH($B213,'Tableau Commandes'!$E$4:$E$300,0))","v":{"$error":"#N/A"}},null,0]
[null,{"$f":"IF(ISERROR(INDEX(ColE,MIN(IF((Nom<>0)*(COUNTIF($B$3:B213,Nom)=0),ROW(Nom))))&\"\"),\"\",INDEX(ColE,MIN(IF((Nom<>0)*(COUNTIF($B$3:B213,Nom)=0),ROW(Nom))))&\"\")","v":""},{"$f":"IF(B214<>\"\",COUNTIF('Tableau Commandes'!E215:E510,Récapitulatifs!B214),\"\")","v":""},{"$f":"IF(B214=\"\",\"\",SUMIF(REF,B214,'Tableau Commandes'!$C$5:$C$26))","v":""},0,0,{"$f":"INDEX('Tableau Commandes'!$M$4:$M$300,MATCH($B214,'Tableau Commandes'!$E$4:$E$300,0))","v":{"$error":"#N/A"}},null,0]
[null,{"$f":"IF(ISERROR(INDEX(ColE,MIN(IF((Nom<>0)*(COUNTIF($B$3:B214,Nom)=0),ROW(Nom))))&\"\"),\"\",INDEX(ColE,MIN(IF((Nom<>0)*(COUNTIF($B$3:B214,Nom)=0),ROW(Nom))))&\"\")","v":""},{"$f":"IF(B215<>\"\",COUNTIF('Tableau Commandes'!E216:E511,Récapitulatifs!B215),\"\")","v":""},{"$f":"IF(B215=\"\",\"\",SUMIF(REF,B215,'Tableau Commandes'!$C$5:$C$26))","v":""},0,0,{"$f":"INDEX('Tableau Commandes'!$M$4:$M$300,MATCH($B215,'Tableau Commandes'!$E$4:$E$300,0))","v":{"$error":"#N/A"}},null,0]
[null,{"$f":"IF(ISERROR(INDEX(ColE,MIN(IF((Nom<>0)*(COUNTIF($B$3:B215,Nom)=0),ROW(Nom))))&\"\"),\"\",INDEX(ColE,MIN(IF((Nom<>0)*(COUNTIF($B$3:B215,Nom)=0),ROW(Nom))))&\"\")","v":""},{"$f":"IF(B216<>\"\",COUNTIF('Tableau Commandes'!E217:E512,Récapitulatifs!B216),\"\")","v":""},{"$f":"IF(B216=\"\",\"\",SUMIF(REF,B216,'Tableau Commandes'!$C$5:$C$26))","v":""},0,0,{"$f":"INDEX('Tableau Commandes'!$M$4:$M$300,MATCH($B216,'Tableau Commandes'!$E$4:$E$300,0))","v":{"$error":"#N/A"}},null,0]
[null,{"$f":"IF(ISERROR(INDEX(ColE,MIN(IF((Nom<>0)*(COUNTIF($B$3:B216,Nom)=0),ROW(Nom))))&\"\"),\"\",INDEX(ColE,MIN(IF((Nom<>0)*(COUNTIF($B$3:B216,Nom)=0),ROW(Nom))))&\"\")","v":""},{"$f":"IF(B217<>\"\",COUNTIF('Tableau Commandes'!E218:E513,Récapitulatifs!B217),\"\")","v":""},{"$f":"IF(B217=\"\",\"\",SUMIF(REF,B217,'Tableau Commandes'!$C$5:$C$26))","v":""},0,0,{"$f":"INDEX('Tableau Commandes'!$M$4:$M$300,MATCH($B217,'Tableau Commandes'!$E$4:$E$300,0))","v":{"$error":"#N/A"}},null,0]
[null,{"$f":"IF(ISERROR(INDEX(ColE,MIN(IF((Nom<>0)*(COUNTIF($B$3:B217,Nom)=0),ROW(Nom))))&\"\"),\"\",INDEX(ColE,MIN(IF((Nom<>0)*(COUNTIF($B$3:B217,Nom)=0),ROW(Nom))))&\"\")","v":""},{"$f":"IF(B218<>\"\",COUNTIF('Tableau Commandes'!E219:E514,Récapitulatifs!B218),\"\")","v":""},{"$f":"IF(B218=\"\",\"\",SUMIF(REF,B218,'Tableau Commandes'!$C$5:$C$26))","v":""},0,0,{"$f":"INDEX('Tableau Commandes'!$M$4:$M$300,MATCH($B218,'Tableau Commandes'!$E$4:$E$300,0))","v":{"$error":"#N/A"}},null,0]
[null,{"$f":"IF(ISERROR(INDEX(ColE,MIN(IF((Nom<>0)*(COUNTIF($B$3:B218,Nom)=0),ROW(Nom))))&\"\"),\"\",INDEX(ColE,MIN(IF((Nom<>0)*(COUNTIF($B$3:B218,Nom)=0),ROW(Nom))))&\"\")","v":""},{"$f":"IF(B219<>\"\",COUNTIF('Tableau Commandes'!E220:E515,Récapitulatifs!B219),\"\")","v":""},{"$f":"IF(B219=\"\",\"\",SUMIF(REF,B219,'Tableau Commandes'!$C$5:$C$26))","v":""},0,0,{"$f":"INDEX('Tableau Commandes'!$M$4:$M$300,MATCH($B219,'Tableau Commandes'!$E$4:$E$300,0))","v":{"$error":"#N/A"}},null,0]
[null,{"$f":"IF(ISERROR(INDEX(ColE,MIN(IF((Nom<>0)*(COUNTIF($B$3:B219,Nom)=0),ROW(Nom))))&\"\"),\"\",INDEX(ColE,MIN(IF((Nom<>0)*(COUNTIF($B$3:B219,Nom)=0),ROW(Nom))))&\"\")","v":""},{"$f":"IF(B220<>\"\",COUNTIF('Tableau Commandes'!E221:E516,Récapitulatifs!B220),\"\")","v":""},{"$f":"IF(B220=\"\",\"\",SUMIF(REF,B220,'Tableau Commandes'!$C$5:$C$26))","v":""},0,0,{"$f":"INDEX('Tableau Commandes'!$M$4:$M$300,MATCH($B220,'Tableau Commandes'!$E$4:$E$300,0))","v":{"$error":"#N/A"}},null,0]
[null,{"$f":"IF(ISERROR(INDEX(ColE,MIN(IF((Nom<>0)*(COUNTIF($B$3:B220,Nom)=0),ROW(Nom))))&\"\"),\"\",INDEX(ColE,MIN(IF((Nom<>0)*(COUNTIF($B$3:B220,Nom)=0),ROW(Nom))))&\"\")","v":""},{"$f":"IF(B221<>\"\",COUNTIF('Tableau Commandes'!E222:E517,Récapitulatifs!B221),\"\")","v":""},{"$f":"IF(B221=\"\",\"\",SUMIF(REF,B221,'Tableau Commandes'!$C$5:$C$26))","v":""},0,0,{"$f":"INDEX('Tableau Commandes'!$M$4:$M$300,MATCH($B221,'Tableau Commandes'!$E$4:$E$300,0))","v":{"$error":"#N/A"}},null,0]
[null,{"$f":"IF(ISERROR(INDEX(ColE,MIN(IF((Nom<>0)*(COUNTIF($B$3:B221,Nom)=0),ROW(Nom))))&\"\"),\"\",INDEX(ColE,MIN(IF((Nom<>0)*(COUNTIF($B$3:B221,Nom)=0),ROW(Nom))))&\"\")","v":""},{"$f":"IF(B222<>\"\",COUNTIF('Tableau Commandes'!E223:E518,Récapitulatifs!B222),\"\")","v":""},{"$f":"IF(B222=\"\",\"\",SUMIF(REF,B222,'Tableau Commandes'!$C$5:$C$26))","v":""},0,0,{"$f":"INDEX('Tableau Commandes'!$M$4:$M$300,MATCH($B222,'Tableau Commandes'!$E$4:$E$300,0))","v":{"$error":"#N/A"}},null,0]
[null,{"$f":"IF(ISERROR(INDEX(ColE,MIN(IF((Nom<>0)*(COUNTIF($B$3:B222,Nom)=0),ROW(Nom))))&\"\"),\"\",INDEX(ColE,MIN(IF((Nom<>0)*(COUNTIF($B$3:B222,Nom)=0),ROW(Nom))))&\"\")","v":""},{"$f":"IF(B223<>\"\",COUNTIF('Tableau Commandes'!E224:E519,Récapitulatifs!B223),\"\")","v":""},{"$f":"IF(B223=\"\",\"\",SUMIF(REF,B223,'Tableau Commandes'!$C$5:$C$26))","v":""},0,0,{"$f":"INDEX('Tableau Commandes'!$M$4:$M$300,MATCH($B223,'Tableau Commandes'!$E$4:$E$300,0))","v":{"$error":"#N/A"}},null,0]
[null,{"$f":"IF(ISERROR(INDEX(ColE,MIN(IF((Nom<>0)*(COUNTIF($B$3:B223,Nom)=0),ROW(Nom))))&\"\"),\"\",INDEX(ColE,MIN(IF((Nom<>0)*(COUNTIF($B$3:B223,Nom)=0),ROW(Nom))))&\"\")","v":""},{"$f":"IF(B224<>\"\",COUNTIF('Tableau Commandes'!E225:E520,Récapitulatifs!B224),\"\")","v":""},{"$f":"IF(B224=\"\",\"\",SUMIF(REF,B224,'Tableau Commandes'!$C$5:$C$26))","v":""},0,0,{"$f":"INDEX('Tableau Commandes'!$M$4:$M$300,MATCH($B224,'Tableau Commandes'!$E$4:$E$300,0))","v":{"$error":"#N/A"}},null,0]
[null,{"$f":"IF(ISERROR(INDEX(ColE,MIN(IF((Nom<>0)*(COUNTIF($B$3:B224,Nom)=0),ROW(Nom))))&\"\"),\"\",INDEX(ColE,MIN(IF((Nom<>0)*(COUNTIF($B$3:B224,Nom)=0),ROW(Nom))))&\"\")","v":""},{"$f":"IF(B225<>\"\",COUNTIF('Tableau Commandes'!E226:E521,Récapitulatifs!B225),\"\")","v":""},{"$f":"IF(B225=\"\",\"\",SUMIF(REF,B225,'Tableau Commandes'!$C$5:$C$26))","v":""},0,0,{"$f":"INDEX('Tableau Commandes'!$M$4:$M$300,MATCH($B225,'Tableau Commandes'!$E$4:$E$300,0))","v":{"$error":"#N/A"}},null,0]
[null,{"$f":"IF(ISERROR(INDEX(ColE,MIN(IF((Nom<>0)*(COUNTIF($B$3:B225,Nom)=0),ROW(Nom))))&\"\"),\"\",INDEX(ColE,MIN(IF((Nom<>0)*(COUNTIF($B$3:B225,Nom)=0),ROW(Nom))))&\"\")","v":""},{"$f":"IF(B226<>\"\",COUNTIF('Tableau Commandes'!E227:E522,Récapitulatifs!B226),\"\")","v":""},{"$f":"IF(B226=\"\",\"\",SUMIF(REF,B226,'Tableau Commandes'!$C$5:$C$26))","v":""},0,0,{"$f":"INDEX('Tableau Commandes'!$M$4:$M$300,MATCH($B226,'Tableau Commandes'!$E$4:$E$300,0))","v":{"$error":"#N/A"}},null,0]
[null,{"$f":"IF(ISERROR(INDEX(ColE,MIN(IF((Nom<>0)*(COUNTIF($B$3:B226,Nom)=0),ROW(Nom))))&\"\"),\"\",INDEX(ColE,MIN(IF((Nom<>0)*(COUNTIF($B$3:B226,Nom)=0),ROW(Nom))))&\"\")","v":""},{"$f":"IF(B227<>\"\",COUNTIF('Tableau Commandes'!E228:E523,Récapitulatifs!B227),\"\")","v":""},{"$f":"IF(B227=\"\",\"\",SUMIF(REF,B227,'Tableau Commandes'!$C$5:$C$26))","v":""},0,0,{"$f":"INDEX('Tableau Commandes'!$M$4:$M$300,MATCH($B227,'Tableau Commandes'!$E$4:$E$300,0))","v":{"$error":"#N/A"}},null,0]
[null,{"$f":"IF(ISERROR(INDEX(ColE,MIN(IF((Nom<>0)*(COUNTIF($B$3:B227,Nom)=0),ROW(Nom))))&\"\"),\"\",INDEX(ColE,MIN(IF((Nom<>0)*(COUNTIF($B$3:B227,Nom)=0),ROW(Nom))))&\"\")","v":""},{"$f":"IF(B228<>\"\",COUNTIF('Tableau Commandes'!E229:E524,Récapitulatifs!B228),\"\")","v":""},{"$f":"IF(B228=\"\",\"\",SUMIF(REF,B228,'Tableau Commandes'!$C$5:$C$26))","v":""},0,0,{"$f":"INDEX('Tableau Commandes'!$M$4:$M$300,MATCH($B228,'Tableau Commandes'!$E$4:$E$300,0))","v":{"$error":"#N/A"}},null,0]
[null,{"$f":"IF(ISERROR(INDEX(ColE,MIN(IF((Nom<>0)*(COUNTIF($B$3:B228,Nom)=0),ROW(Nom))))&\"\"),\"\",INDEX(ColE,MIN(IF((Nom<>0)*(COUNTIF($B$3:B228,Nom)=0),ROW(Nom))))&\"\")","v":""},{"$f":"IF(B229<>\"\",COUNTIF('Tableau Commandes'!E230:E525,Récapitulatifs!B229),\"\")","v":""},{"$f":"IF(B229=\"\",\"\",SUMIF(REF,B229,'Tableau Commandes'!$C$5:$C$26))","v":""},0,0,{"$f":"INDEX('Tableau Commandes'!$M$4:$M$300,MATCH($B229,'Tableau Commandes'!$E$4:$E$300,0))","v":{"$error":"#N/A"}},null,0]
[null,{"$f":"IF(ISERROR(INDEX(ColE,MIN(IF((Nom<>0)*(COUNTIF($B$3:B229,Nom)=0),ROW(Nom))))&\"\"),\"\",INDEX(ColE,MIN(IF((Nom<>0)*(COUNTIF($B$3:B229,Nom)=0),ROW(Nom))))&\"\")","v":""},{"$f":"IF(B230<>\"\",COUNTIF('Tableau Commandes'!E231:E526,Récapitulatifs!B230),\"\")","v":""},{"$f":"IF(B230=\"\",\"\",SUMIF(REF,B230,'Tableau Commandes'!$C$5:$C$26))","v":""},0,0,{"$f":"INDEX('Tableau Commandes'!$M$4:$M$300,MATCH($B230,'Tableau Commandes'!$E$4:$E$300,0))","v":{"$error":"#N/A"}},null,0]
[null,{"$f":"IF(ISERROR(INDEX(ColE,MIN(IF((Nom<>0)*(COUNTIF($B$3:B230,Nom)=0),ROW(Nom))))&\"\"),\"\",INDEX(ColE,MIN(IF((Nom<>0)*(COUNTIF($B$3:B230,Nom)=0),ROW(Nom))))&\"\")","v":""},{"$f":"IF(B231<>\"\",COUNTIF('Tableau Commandes'!E232:E527,Récapitulatifs!B231),\"\")","v":""},{"$f":"IF(B231=\"\",\"\",SUMIF(REF,B231,'Tableau Commandes'!$C$5:$C$26))","v":""},0,0,{"$f":"INDEX('Tableau Commandes'!$M$4:$M$300,MATCH($B231,'Tableau Commandes'!$E$4:$E$300,0))","v":{"$error":"#N/A"}},null,0]
[null,{"$f":"IF(ISERROR(INDEX(ColE,MIN(IF((Nom<>0)*(COUNTIF($B$3:B231,Nom)=0),ROW(Nom))))&\"\"),\"\",INDEX(ColE,MIN(IF((Nom<>0)*(COUNTIF($B$3:B231,Nom)=0),ROW(Nom))))&\"\")","v":""},{"$f":"IF(B232<>\"\",COUNTIF('Tableau Commandes'!E233:E528,Récapitulatifs!B232),\"\")","v":""},{"$f":"IF(B232=\"\",\"\",SUMIF(REF,B232,'Tableau Commandes'!$C$5:$C$26))","v":""},0,0,{"$f":"INDEX('Tableau Commandes'!$M$4:$M$300,MATCH($B232,'Tableau Commandes'!$E$4:$E$300,0))","v":{"$error":"#N/A"}},null,0]
[null,{"$f":"IF(ISERROR(INDEX(ColE,MIN(IF((Nom<>0)*(COUNTIF($B$3:B232,Nom)=0),ROW(Nom))))&\"\"),\"\",INDEX(ColE,MIN(IF((Nom<>0)*(COUNTIF($B$3:B232,Nom)=0),ROW(Nom))))&\"\")","v":""},{"$f":"IF(B233<>\"\",COUNTIF('Tableau Commandes'!E234:E529,Récapitulatifs!B233),\"\")","v":""},{"$f":"IF(B233=\"\",\"\",SUMIF(REF,B233,'Tableau Commandes'!$C$5:$C$26))","v":""},0,0,{"$f":"INDEX('Tableau Commandes'!$M$4:$M$300,MATCH($B233,'Tableau Commandes'!$E$4:$E$300,0))","v":{"$error":"#N/A"}},null,0]
[null,{"$f":"IF(ISERROR(INDEX(ColE,MIN(IF((Nom<>0)*(COUNTIF($B$3:B233,Nom)=0),ROW(Nom))))&\"\"),\"\",INDEX(ColE,MIN(IF((Nom<>0)*(COUNTIF($B$3:B233,Nom)=0),ROW(Nom))))&\"\")","v":""},{"$f":"IF(B234<>\"\",COUNTIF('Tableau Commandes'!E235:E530,Récapitulatifs!B234),\"\")","v":""},{"$f":"IF(B234=\"\",\"\",SUMIF(REF,B234,'Tableau Commandes'!$C$5:$C$26))","v":""},0,0,{"$f":"INDEX('Tableau Commandes'!$M$4:$M$300,MATCH($B234,'Tableau Commandes'!$E$4:$E$300,0))","v":{"$error":"#N/A"}},null,0]
[null,{"$f":"IF(ISERROR(INDEX(ColE,MIN(IF((Nom<>0)*(COUNTIF($B$3:B234,Nom)=0),ROW(Nom))))&\"\"),\"\",INDEX(ColE,MIN(IF((Nom<>0)*(COUNTIF($B$3:B234,Nom)=0),ROW(Nom))))&\"\")","v":""},{"$f":"IF(B235<>\"\",COUNTIF('Tableau Commandes'!E236:E531,Récapitulatifs!B235),\"\")","v":""},{"$f":"IF(B235=\"\",\"\",SUMIF(REF,B235,'Tableau Commandes'!$C$5:$C$26))","v":""},0,0,{"$f":"INDEX('Tableau Commandes'!$M$4:$M$300,MATCH($B235,'Tableau Commandes'!$E$4:$E$300,0))","v":{"$error":"#N/A"}},null,0]
[null,{"$f":"IF(ISERROR(INDEX(ColE,MIN(IF((Nom<>0)*(COUNTIF($B$3:B235,Nom)=0),ROW(Nom))))&\"\"),\"\",INDEX(ColE,MIN(IF((Nom<>0)*(COUNTIF($B$3:B235,Nom)=0),ROW(Nom))))&\"\")","v":""},{"$f":"IF(B236<>\"\",COUNTIF('Tableau Commandes'!E237:E532,Récapitulatifs!B236),\"\")","v":""},{"$f":"IF(B236=\"\",\"\",SUMIF(REF,B236,'Tableau Commandes'!$C$5:$C$26))","v":""},{"$f":"H236","v":0},{"$f":"IF(E236=\"P\",\"PREPAREE\",IF(E236=\"R\",\"RELIQUAT\",))","v":0},{"$f":"INDEX('Tableau Commandes'!$M$4:$M$300,MATCH($B236,'Tableau Commandes'!$E$4:$E$300,0))","v":{"$error":"#N/A"}},null,{"$f":"IF(H236=\"P\",\"PREPAREE\",IF(H236=\"R\",\"RELIQUAT\",))","v":0}]
[null,{"$f":"IF(ISERROR(INDEX(ColE,MIN(IF((Nom<>0)*(COUNTIF($B$3:B236,Nom)=0),ROW(Nom))))&\"\"),\"\",INDEX(ColE,MIN(IF((Nom<>0)*(COUNTIF($B$3:B236,Nom)=0),ROW(Nom))))&\"\")","v":""},{"$f":"IF(B237<>\"\",COUNTIF('Tableau Commandes'!E238:E533,Récapitulatifs!B237),\"\")","v":""},{"$f":"IF(B237=\"\",\"\",SUMIF(REF,B237,'Tableau Commandes'!$C$5:$C$26))","v":""},0,0,{"$f":"INDEX('Tableau Commandes'!$M$4:$M$300,MATCH($B237,'Tableau Commandes'!$E$4:$E$300,0))","v":{"$error":"#N/A"}},null,0]
[null,{"$f":"IF(ISERROR(INDEX(ColE,MIN(IF((Nom<>0)*(COUNTIF($B$3:B237,Nom)=0),ROW(Nom))))&\"\"),\"\",INDEX(ColE,MIN(IF((Nom<>0)*(COUNTIF($B$3:B237,Nom)=0),ROW(Nom))))&\"\")","v":""},{"$f":"IF(B238<>\"\",COUNTIF('Tableau Commandes'!E239:E534,Récapitulatifs!B238),\"\")","v":""},{"$f":"IF(B238=\"\",\"\",SUMIF(REF,B238,'Tableau Commandes'!$C$5:$C$26))","v":""},0,0,{"$f":"INDEX('Tableau Commandes'!$M$4:$M$300,MATCH($B238,'Tableau Commandes'!$E$4:$E$300,0))","v":{"$error":"#N/A"}},null,0]
[null,{"$f":"IF(ISERROR(INDEX(ColE,MIN(IF((Nom<>0)*(COUNTIF($B$3:B238,Nom)=0),ROW(Nom))))&\"\"),\"\",INDEX(ColE,MIN(IF((Nom<>0)*(COUNTIF($B$3:B238,Nom)=0),ROW(Nom))))&\"\")","v":""},{"$f":"IF(B239<>\"\",COUNTIF('Tableau Commandes'!E240:E535,Récapitulatifs!B239),\"\")","v":""},{"$f":"IF(B239=\"\",\"\",SUMIF(REF,B239,'Tableau Commandes'!$C$5:$C$26))","v":""},0,0,{"$f":"INDEX('Tableau Commandes'!$M$4:$M$300,MATCH($B239,'Tableau Commandes'!$E$4:$E$300,0))","v":{"$error":"#N/A"}},null,0]
[null,{"$f":"IF(ISERROR(INDEX(ColE,MIN(IF((Nom<>0)*(COUNTIF($B$3:B239,Nom)=0),ROW(Nom))))&\"\"),\"\",INDEX(ColE,MIN(IF((Nom<>0)*(COUNTIF($B$3:B239,Nom)=0),ROW(Nom))))&\"\")","v":""},{"$f":"IF(B240<>\"\",COUNTIF('Tableau Commandes'!E241:E536,Récapitulatifs!B240),\"\")","v":""},{"$f":"IF(B240=\"\",\"\",SUMIF(REF,B240,'Tableau Commandes'!$C$5:$C$26))","v":""},0,0,{"$f":"INDEX('Tableau Commandes'!$M$4:$M$300,MATCH($B240,'Tableau Commandes'!$E$4:$E$300,0))","v":{"$error":"#N/A"}},null,0]
[null,{"$f":"IF(ISERROR(INDEX(ColE,MIN(IF((Nom<>0)*(COUNTIF($B$3:B240,Nom)=0),ROW(Nom))))&\"\"),\"\",INDEX(ColE,MIN(IF((Nom<>0)*(COUNTIF($B$3:B240,Nom)=0),ROW(Nom))))&\"\")","v":""},{"$f":"IF(B241<>\"\",COUNTIF('Tableau Commandes'!E242:E537,Récapitulatifs!B241),\"\")","v":""},{"$f":"IF(B241=\"\",\"\",SUMIF(REF,B241,'Tableau Commandes'!$C$5:$C$26))","v":""},0,0,{"$f":"INDEX('Tableau Commandes'!$M$4:$M$300,MATCH($B241,'Tableau Commandes'!$E$4:$E$300,0))","v":{"$error":"#N/A"}},null,0]
[null,{"$f":"IF(ISERROR(INDEX(ColE,MIN(IF((Nom<>0)*(COUNTIF($B$3:B241,Nom)=0),ROW(Nom))))&\"\"),\"\",INDEX(ColE,MIN(IF((Nom<>0)*(COUNTIF($B$3:B241,Nom)=0),ROW(Nom))))&\"\")","v":""},{"$f":"IF(B242<>\"\",COUNTIF('Tableau Commandes'!E243:E538,Récapitulatifs!B242),\"\")","v":""},{"$f":"IF(B242=\"\",\"\",SUMIF(REF,B242,'Tableau Commandes'!$C$5:$C$26))","v":""},0,0,{"$f":"INDEX('Tableau Commandes'!$M$4:$M$300,MATCH($B242,'Tableau Commandes'!$E$4:$E$300,0))","v":{"$error":"#N/A"}},null,0]
[null,{"$f":"IF(ISERROR(INDEX(ColE,MIN(IF((Nom<>0)*(COUNTIF($B$3:B242,Nom)=0),ROW(Nom))))&\"\"),\"\",INDEX(ColE,MIN(IF((Nom<>0)*(COUNTIF($B$3:B242,Nom)=0),ROW(Nom))))&\"\")","v":""},{"$f":"IF(B243<>\"\",COUNTIF('Tableau Commandes'!E244:E539,Récapitulatifs!B243),\"\")","v":""},{"$f":"IF(B243=\"\",\"\",SUMIF(REF,B243,'Tableau Commandes'!$C$5:$C$26))","v":""},0,0,{"$f":"INDEX('Tableau Commandes'!$M$4:$M$300,MATCH($B243,'Tableau Commandes'!$E$4:$E$300,0))","v":{"$error":"#N/A"}},null,0]
[null,{"$f":"IF(ISERROR(INDEX(ColE,MIN(IF((Nom<>0)*(COUNTIF($B$3:B243,Nom)=0),ROW(Nom))))&\"\"),\"\",INDEX(ColE,MIN(IF((Nom<>0)*(COUNTIF($B$3:B243,Nom)=0),ROW(Nom))))&\"\")","v":""},{"$f":"IF(B244<>\"\",COUNTIF('Tableau Commandes'!E245:E540,Récapitulatifs!B244),\"\")","v":""},{"$f":"IF(B244=\"\",\"\",SUMIF(REF,B244,'Tableau Commandes'!$C$5:$C$26))","v":""},0,0,{"$f":"INDEX('Tableau Commandes'!$M$4:$M$300,MATCH($B244,'Tableau Commandes'!$E$4:$E$300,0))","v":{"$error":"#N/A"}},null,0]
[null,{"$f":"IF(ISERROR(INDEX(ColE,MIN(IF((Nom<>0)*(COUNTIF($B$3:B244,Nom)=0),ROW(Nom))))&\"\"),\"\",INDEX(ColE,MIN(IF((Nom<>0)*(COUNTIF($B$3:B244,Nom)=0),ROW(Nom))))&\"\")","v":""},{"$f":"IF(B245<>\"\",COUNTIF('Tableau Commandes'!E246:E541,Récapitulatifs!B245),\"\")","v":""},{"$f":"IF(B245=\"\",\"\",SUMIF(REF,B245,'Tableau Commandes'!$C$5:$C$26))","v":""},0,0,{"$f":"INDEX('Tableau Commandes'!$M$4:$M$300,MATCH($B245,'Tableau Commandes'!$E$4:$E$300,0))","v":{"$error":"#N/A"}},null,0]
[null,{"$f":"IF(ISERROR(INDEX(ColE,MIN(IF((Nom<>0)*(COUNTIF($B$3:B245,Nom)=0),ROW(Nom))))&\"\"),\"\",INDEX(ColE,MIN(IF((Nom<>0)*(COUNTIF($B$3:B245,Nom)=0),ROW(Nom))))&\"\")","v":""},{"$f":"IF(B246<>\"\",COUNTIF('Tableau Commandes'!E247:E542,Récapitulatifs!B246),\"\")","v":""},{"$f":"IF(B246=\"\",\"\",SUMIF(REF,B246,'Tableau Commandes'!$C$5:$C$26))","v":""},0,0,{"$f":"INDEX('Tableau Commandes'!$M$4:$M$300,MATCH($B246,'Tableau Commandes'!$E$4:$E$300,0))","v":{"$error":"#N/A"}},null,0]
[null,{"$f":"IF(ISERROR(INDEX(ColE,MIN(IF((Nom<>0)*(COUNTIF($B$3:B246,Nom)=0),ROW(Nom))))&\"\"),\"\",INDEX(ColE,MIN(IF((Nom<>0)*(COUNTIF($B$3:B246,Nom)=0),ROW(Nom))))&\"\")","v":""},{"$f":"IF(B247<>\"\",COUNTIF('Tableau Commandes'!E248:E543,Récapitulatifs!B247),\"\")","v":""},{"$f":"IF(B247=\"\",\"\",SUMIF(REF,B247,'Tableau Commandes'!$C$5:$C$26))","v":""},0,0,{"$f":"INDEX('Tableau Commandes'!$M$4:$M$300,MATCH($B247,'Tableau Commandes'!$E$4:$E$300,0))","v":{"$error":"#N/A"}},null,0]
[null,{"$f":"IF(ISERROR(INDEX(ColE,MIN(IF((Nom<>0)*(COUNTIF($B$3:B247,Nom)=0),ROW(Nom))))&\"\"),\"\",INDEX(ColE,MIN(IF((Nom<>0)*(COUNTIF($B$3:B247,Nom)=0),ROW(Nom))))&\"\")","v":""},{"$f":"IF(B248<>\"\",COUNTIF('Tableau Commandes'!E249:E544,Récapitulatifs!B248),\"\")","v":""},{"$f":"IF(B248=\"\",\"\",SUMIF(REF,B248,'Tableau Commandes'!$C$5:$C$26))","v":""},0,0,{"$f":"INDEX('Tableau Commandes'!$M$4:$M$300,MATCH($B248,'Tableau Commandes'!$E$4:$E$300,0))","v":{"$error":"#N/A"}},null,0]
[null,{"$f":"IF(ISERROR(INDEX(ColE,MIN(IF((Nom<>0)*(COUNTIF($B$3:B248,Nom)=0),ROW(Nom))))&\"\"),\"\",INDEX(ColE,MIN(IF((Nom<>0)*(COUNTIF($B$3:B248,Nom)=0),ROW(Nom))))&\"\")","v":""},{"$f":"IF(B249<>\"\",COUNTIF('Tableau Commandes'!E250:E545,Récapitulatifs!B249),\"\")","v":""},{"$f":"IF(B249=\"\",\"\",SUMIF(REF,B249,'Tableau Commandes'!$C$5:$C$26))","v":""},0,0,{"$f":"INDEX('Tableau Commandes'!$M$4:$M$300,MATCH($B249,'Tableau Commandes'!$E$4:$E$300,0))","v":{"$error":"#N/A"}},null,0]
[null,{"$f":"IF(ISERROR(INDEX(ColE,MIN(IF((Nom<>0)*(COUNTIF($B$3:B249,Nom)=0),ROW(Nom))))&\"\"),\"\",INDEX(ColE,MIN(IF((Nom<>0)*(COUNTIF($B$3:B249,Nom)=0),ROW(Nom))))&\"\")","v":""},{"$f":"IF(B250<>\"\",COUNTIF('Tableau Commandes'!E251:E546,Récapitulatifs!B250),\"\")","v":""},{"$f":"IF(B250=\"\",\"\",SUMIF(REF,B250,'Tableau Commandes'!$C$5:$C$26))","v":""},0,0,{"$f":"INDEX('Tableau Commandes'!$M$4:$M$300,MATCH($B250,'Tableau Commandes'!$E$4:$E$300,0))","v":{"$error":"#N/A"}},null,0]

{"sheet":"Feuil3","index":2,"n_rows":232,"n_cols":7,"rows_kept":232,"cut":false,"hidden":false,"merged":[]}
["NOM - Prenom - ","Designation","Quantite","Info_Stock","Ref_","Fabricant","Transporteur"]
[null,"A",1,"stock res","4740",null,"SO Colissimo(code=SOC) / orig="]
[null,"A",1,null,"79925",null,"Mondial Relay(code=MON) / orig="]
[null,"A",2,null,"87196",null,"Mondial Relay(code=MON) / orig="]
[null,"A",2,null,"99904",null,"Mondial Relay(code=MON) / orig="]
[null,"A",1,null,"199016",null,"SO Colissimo(code=SOC) / orig="]
[null,"A",1,null,"GLC40101",null,"Mondial Relay(code=MON) / orig="]
[null,"A",1,null,"MECA8425",null,"SO Colissimo(code=SOC) / orig="]
[null,"A",1,null,"152760","STORM","SO Colissimo(code=SOC) / orig="]
[null,"A",2,"stock res","83523",null,"Mondial Relay(code=MON) / orig="]
[null,"A",1,"stock res","83524",null,"Mondial Relay(code=MON) / orig="]
[null,"A",1,null,"MECA8655",null,"SO Colissimo(code=SOC) / orig="]
[null,"A",1,"stock res","2335",null,"SO Colissimo(code=SOC) / orig="]
[null,"A",1,"stock res","99901XDEUX",null,"SO Colissimo(code=SOC) / orig="]
[null,"A",1,null,"350240XDEUX","MECA","SO Colissimo(code=SOC) / orig="]
[null,"A",1,"stock res","81036",null,"SO Colissimo(code=SOC) / orig="]
[null,"A",1,null,"79038XDEUX",null,"Mondial Relay(code=MON) / orig="]
[null,"A",1,null,"199017",null,"SO Colissimo(code=SOC) / orig="]
[null,"A",1,null,"A14541",null,"Mondial Relay(code=MON) / orig="]
[null,"A",2,null,"99971",null,"Mondial Relay(code=MON) / orig="]
[null,"A",1,null,"6PK1563",null,"Mondial Relay(code=MON) / orig="]
[null,"A",1,"stock res","MECA3836",null,"SO Colissimo(code=SOC) / orig="]
[null,"A",1,null,"CDAL-116922",null,"SO Colissimo(code=SOC) / orig="]
[null,"A",1,null,"GLC42119",null,"Mondial Relay(code=MON) / orig="]
[null,"A",1,null,"GLC42120",null,"Mondial Relay(code=MON) / orig="]
[null,"A",2,null,"GLC42303",null,"SO Colissimo(code=SOC) / orig="]
[null,"A",1,"stock res","4672",null,"SO Colissimo(code=SOC) / orig="]
[null,"A",1,"stock res","MECA2684","MECA","SO Colissimo(code=SOC) / orig="]
[null,"A",1,"stock res","9501167",null,"SO Colissimo(code=SOC) / orig="]
[null,"A",1,"stock res","4612",null,"SO Colissimo(code=SOC) / orig="]
[null,"A",1,"stock res","2000450",null,"SO Colissimo(code=SOC) / orig="]
[null,"A",1,"stock res","2000600",null,"SO Colissimo(code=SOC) / orig="]
[null,"A",1,null,"CDAL-116922",null,"SO Colissimo(code=SOC) / orig="]
[null,"A",1,"stock res","800800",null,"SO Colissimo(code=SOC) / orig="]
[null,"A",1,null,"30503",null,"SO Colissimo(code=SOC) / orig="]
[null,"A",1,null,"30502",null,"SO Colissimo(code=SOC) / orig="]
[null,"A",1,null,"199006",null,"SO Colissimo(code=SOC) / orig="]
[null,"A",1,null,"71065XDEUX",null,"SO Colissimo(code=SOC) / orig="]
[null,"A",2,"stock res","86286X",null,"SO Colissimo(code=SOC) / orig="]
[null,"A",1,"stock res","86404X",null,"SO Colissimo(code=SOC) / orig="]
[null,"A",1,null,"SPILU54582",null,"SO Colissimo(code=SOC) / orig="]
[null,"A",2,null,"26027","RADIA","SO Colissimo(code=SOC) / orig="]
[null,"A",1,null,"A14541",null,"SO Colissimo(code=SOC) / orig="]
[null,"A",1,"stock res","2335",null,"SO Colissimo(code=SOC) / orig="]
[null,"A",1,"stock res","MECA3836",null,"SO Colissimo(code=SOC) / orig="]
[null,"A",1,null,"88091",null,"SO Colissimo(code=SOC) / orig="]
[null,"A",1,null,"RAD1000450",null,"SO Colissimo(code=SOC) / orig="]
[null,"A",1,null,"RAD1000600",null,"SO Colissimo(code=SOC) / orig="]
[null,"A",1,"stock res","1063",null,"SO Colissimo(code=SOC) / orig="]
[null,"A",1,null,"GLC42230",null,"SO Colissimo(code=SOC) / orig="]
[null,"A",1,null,"350240XDEUX","MECA","SO Colissimo(code=SOC) / orig="]
[null,"A",1,null,"9659",null,"SO Colissimo(code=SOC) / orig="]
[null,"A",1,"stock res","4741",null,"SO Colissimo(code=SOC) / orig="]
[null,"A",1,"stock res","MECA3836",null,"SO Colissimo(code=SOC) / orig="]
[null,"A",2,null,"96042",null,"SO Colissimo(code=SOC) / orig="]
[null,"A",1,null,"GLC43812",null,"SO Colissimo(code=SOC) / orig="]
[null,"A",2,null,"88599",null,"SO Colissimo(code=SOC) / orig="]
[null,"A",1,"stock res","4725",null,"SO Colissimo(code=SOC) / orig="]
[null,"A",1,null,"A1300XDEUX",null,"SO Colissimo(code=SOC) / orig="]
[null,"A",1,"stock res","FH001z",null,"SO Colissimo(code=SOC) / orig="]
[null,"A",1,null,"FH002z",null,"SO Colissimo(code=SOC) / orig="]
[null,"A",1,null,"78054",null,"SO Colissimo(code=SOC) / orig="]
[null,"A",2,null,"MECA4177",null,"SO Colissimo(code=SOC) / orig="]
[null,"A",2,null,"MECA4320",null,"SO Colissimo(code=SOC) / orig="]
[null,"A",1,"stock res","5156",null,"SO Colissimo(code=SOC) / orig="]
[null,"A",1,null,"2118",null,"SO Colissimo(code=SOC) / orig="]
[null,"A",1,null,"816151X2",null,"SO Colissimo(code=SOC) / orig="]
[null,"A",1,null,"3653",null,"SO Colissimo(code=SOC) / orig="]
[null,"A",1,"stock res","800200",null,"SO Colissimo(code=SOC) / orig="]
[null,"A",1,null,"MECA5386",null,"SO Colissimo(code=SOC) / orig="]
[null,"A",1,null,"BEZ600124XDEUX",null,"SO Colissimo(code=SOC) / orig="]
[null,"A",1,"stock res","4740",null,"SO Colissimo(code=SOC) / orig="]
[null,"A",1,"stock res","4760",null,"SO Colissimo(code=SOC) / orig="]
[null,"A",1,null,"BEZ600286XDEUX",null,"SO Colissimo(code=SOC) / orig="]
[null,"A",1,null,"800700",null,"SO Colissimo(code=SOC) / orig="]
[null,"A",1,null,"MECA8015",null,"SO Colissimo(code=SOC) / orig="]
[null,"A",1,null,"79095",null,"SO Colissimo(code=SOC) / orig="]
[null,"A",1,"stock res","4725",null,"SO Colissimo(code=SOC) / orig="]
[null,"A",1,null,"81795",null,"SO Colissimo(code=SOC) / orig="]
[null,"A",1,null,"28553",null,"SO Colissimo(code=SOC) / orig="]
[null,"A",1,null,"28554",null,"SO Colissimo(code=SOC) / orig="]
[null,"A",1,"stock res","599610","STORM","SO Colissimo(code=SOC) / orig="]
[null,"A",1,"stock res","KF15948",null,"SO Colissimo(code=SOC) / orig="]
[null,"A",1,"stock res","4725",null,"SO Colissimo(code=SOC) / orig="]
[null,"A",1,null,"288100"]
[null,"A",1,null,"BEZLX1282","BEZIAT"]
[null,"A",1,null,"BEZOX171-2D"]
[null,"A",1,null,"FC033z"]
[null,"A",1,null,"MECA5391"]
[null,"A",1,null,"999706",null,"Transport Train Arrière(code=TNT) / orig="]
[null,"A",1,null,"CARTER999001",null,"SO Colissimo(code=SOC) / orig="]
[null,"A",1,"stock res","99902",null,"SO Colissimo(code=SOC) / orig="]
[null,"A",1,null,"100001UNITE",null,"SO Colissimo(code=SOC) / orig="]
[null,"A",1,null,"313501",null,"SO Colissimo(code=SOC) / orig="]
[null,"A",1,null,"70566XDEUX",null,"SO Colissimo(code=SOC) / orig="]
[null,"A",1,null,"111114",null,"SO Colissimo(code=SOC) / orig="]
[null,"A",1,null,"502043X4",null,"SO Colissimo(code=SOC) / orig="]
[null,"A",1,null,"199006",null,"SO Colissimo(code=SOC) / orig="]
[null,"A",1,null,"FA048z","CDAL","SO Colissimo(code=SOC) / orig="]
[null,"A",1,null,"526373X4",null,"SO Colissimo(code=SOC) / orig="]
[null,"A",1,null,"9960C",null,"SO Colissimo(code=SOC) / orig="]
[null,"A",1,null,"87132",null,"SO Colissimo(code=SOC) / orig="]
[null,"A",1,null,"89090",null,"SO Colissimo(code=SOC) / orig="]
[null,"A",1,"stock res","88090",null,"SO Colissimo(code=SOC) / orig="]
[null,"A",1,"stock res","88098XDEUX",null,"SO Colissimo(code=SOC) / orig="]
[null,"A",1,"stock res","199000",null,"SO Colissimo(code=SOC) / orig="]
[null,"A",1,"stock res","5169",null,"SO Colissimo(code=SOC) / orig="]
[null,"A",1,null,"152760","STORM","SO Colissimo(code=SOC) / orig="]
[null,"A",1,null,"14575",null,"SO Colissimo(code=SOC) / orig="]
[null,"A",1,null,"BEZ600102XDEUX",null,"SO Colissimo(code=SOC) / orig="]
[null,"A",1,null,"6PK1713",null,"SO Colissimo(code=SOC) / orig="]
[null,"A",2,null,"CDAL-54506z",null,"SO Colissimo(code=SOC) / orig="]
[null,"A",1,"stock res","124150","STORM","SO Colissimo(code=SOC) / orig="]
[null,"A",1,"stock res","83524",null,"SO Colissimo(code=SOC) / orig="]
[null,"A",1,null,"999995",null,"SO Colissimo(code=SOC) / orig="]
[null,"A",1,null,"RI71130",null,"SO Colissimo(code=SOC) / orig="]
[null,"A",1,null,"GS12475",null,"SO Colissimo(code=SOC) / orig="]
[null,"A",1,"stock res","800990",null,"SO Colissimo(code=SOC) / orig="]
[null,"A",1,"stock res","124150","STORM"]
[null,"A",1,"stock res","5156",null,"SO Colissimo(code=SOC) / orig="]
[null,"A",1,"stock res","4725",null,"SO Colissimo(code=SOC) / orig="]
[null,"A",1,null,"RI71132",null,"SO Colissimo(code=SOC) / orig="]
[null,"A",1,"stock res","123890","STORM","SO Colissimo(code=SOC) / orig="]
[null,"A",1,null,"555555",null,"Transport Train Arrière(code=TNT) / orig="]
[null,"A",1,null,"133600",null,"SO Colissimo(code=SOC) / orig="]
[null,"A",1,null,"19599XDEUX",null,"SO Colissimo(code=SOC) / orig="]
[null,"A",2,null,"1000350ST",null,"SO Colissimo(code=SOC) / orig="]
[null,"A",1,"stock res","2335",null,"SO Colissimo(code=SOC) / orig="]
[null,"A",1,"stock res","83524",null,"SO Colissimo(code=SOC) / orig="]
[null,"A",1,null,"502024X4",null,"Enveloppes Rigides Avec Suivi(code=POS) / orig="]
[null,"A",10,null,"CDAL-54504z",null,"SO Colissimo(code=SOC) / orig="]
[null,"A",1,"stock res","4612",null,"SO Colissimo(code=SOC) / orig="]
[null,"A",1,"stock res","321040","STORM","SO Colissimo(code=SOC) / orig="]
[null,"A",1,null,"810781",null,"SO Colissimo(code=SOC) / orig="]
[null,"A",1,null,"1000400ST",null,"SO Colissimo(code=SOC) / orig="]
[null,"A",1,null,"1000600ST",null,"SO Colissimo(code=SOC) / orig="]
[null,"A",1,null,"350240XDEUX","MECA","SO Colissimo(code=SOC) / orig="]
[null,"A",1,"stock res","4740",null,"SO Colissimo(code=SOC) / orig="]
[null,"A",1,null,"321030","STORM","SO Colissimo(code=SOC) / orig="]
[null,"A",1,null,"321020","STORM","SO Colissimo(code=SOC) / orig="]
[null,"A",1,"stock res","4740",null,"SO Colissimo(code=SOC) / orig="]
[null,"A",1,null,"A304",null,"SO Colissimo(code=SOC) / orig="]
[null,"A",1,null,"BEZ600260XDEUX",null,"SO Colissimo(code=SOC) / orig="]
[null,"A",1,"stock res","4594",null,"SO Colissimo(code=SOC) / orig="]
[null,"A",1,null,"LPALPALPA1",null,"SO Colissimo(code=SOC) / orig="]
[null,"A",1,"stock res","4741",null,"SO Colissimo(code=SOC) / orig="]
[null,"A",1,null,"20032",null,"SO Colissimo(code=SOC) / orig="]
[null,"A",1,null,"81025","RADIA","SO Colissimo(code=SOC) / orig="]
[null,"A",1,null,"87197XDEUX",null,"SO Colissimo(code=SOC) / orig="]
[null,"A",1,null,"199017",null,"SO Colissimo(code=SOC) / orig="]
[null,"A",1,"stock res","4725",null,"SO Colissimo(code=SOC) / orig="]
[null,"A",1,null,"MECA8370",null,"SO Colissimo(code=SOC) / orig="]
[null,"A",1,"stock res","53014",null,"SO Colissimo(code=SOC) / orig="]
[null,"A",1,null,"3120000312",null,"SO Colissimo(code=SOC) / orig="]
[null,"A",1,null,"80030",null,"SO Colissimo(code=SOC) / orig="]
[null,"A",1,null,"86066",null,"SO Colissimo(code=SOC) / orig="]
[null,"A",1,"stock res","CDAL-NF",null,"SO Colissimo(code=SOC) / orig="]
[null,"A",1,null,"880003","RADIA","SO Colissimo(code=SOC) / orig="]
[null,"A",1,"stock res","2335",null,"SO Colissimo(code=SOC) / orig="]
[null,"A",1,"stock res","321040","STORM","SO Colissimo(code=SOC) / orig="]
[null,"A",1,null,"199101"]
[null,"A",1,null,"3770000806"]
[null,"A",2,"stock res","2000700"]
[null,"A",1,"stock res","2000400"]
[null,"A",1,"stock res","800285"]
[null,"A",1,"stock res","86311X"]
[null,"A",1,"stock res","86276X"]
[null,"A",1,"stock res","86404X"]
[null,"A",1,null,"81199",null,"SO Colissimo(code=SOC) / orig="]
[null,"A",1,"stock res","1063XDEUX",null,"SO Colissimo(code=SOC) / orig="]
[null,"A",1,"stock res","86311X",null,"SO Colissimo(code=SOC) / orig="]
[null,"A",1,"stock res","599610","STORM","SO Colissimo(code=SOC) / orig="]
[null,"A",1,null,"MECA8121",null,"SO Colissimo(code=SOC) / orig="]
[null,"A",1,null,"13993",null,"SO Colissimo(code=SOC) / orig="]
[null,"A",1,"stock res","900810",null,"SO Colissimo(code=SOC) / orig="]
[null,"A",1,null,"71112ET59995",null,"SO Colissimo(code=SOC) / orig="]
[null,"A",1,null,"883265459",null,"SO Colissimo(code=SOC) / orig="]
[null,"A",1,null,"86095",null,"SO Colissimo(code=SOC) / orig="]
[null,"A",1,null,"A1210XDEUX",null,"SO Colissimo(code=SOC) / orig="]
[null,"A",1,"stock res","CDAL-54505z",null,"SO Colissimo(code=SOC) / orig="]
[null,"A",1,"stock res","83523",null,"SO Colissimo(code=SOC) / orig="]
[null,"A",1,null,"182470","STORM","SO Colissimo(code=SOC) / orig="]
[null,"A",1,"stock res","4741",null,"SO Colissimo(code=SOC) / orig="]
[null,"A",1,null,"31814"]
[null,"A",1,null,"802700",null,"SO Colissimo(code=SOC) / orig="]
[null,"A",1,"stock res","106450",null,"SO Colissimo(code=SOC) / orig="]
[null,"A",1,null,"297802"]
[null,"A",1,null,"70052",null,"SO Colissimo(code=SOC) / orig="]
[null,"A",1,null,"217014",null,"SO Colissimo(code=SOC) / orig="]
[null,"A",1,null,"613000",null,"SO Colissimo(code=SOC) / orig="]
[null,"A",1,"stock res","MECA4608",null,"SO Colissimo(code=SOC) / orig="]
[null,"A",1,null,"88095",null,"Colissimo(Option Crbt+7,00€)(code=COL) / orig="]
[null,"A",1,null,"321020","STORM","SO Colissimo(code=SOC) / orig="]
[null,"A",1,"stock res","4593",null,"SO Colissimo(code=SOC) / orig="]
[null,"A",1,null,"RAD1000350",null,"SO Colissimo(code=SOC) / orig="]
[null,"A",1,null,"RAD1000450",null,"SO Colissimo(code=SOC) / orig="]
[null,"A",1,null,"RAD1000600",null,"SO Colissimo(code=SOC) / orig="]
[null,"A",1,null,"99949",null,"Colissimo(Option Crbt+7,00€)(code=COL) / orig="]
[null,"A",1,"stock res","MECA3835",null,"SO Colissimo(code=SOC) / orig="]
[null,"A",1,"stock res","561030","STORM","SO Colissimo(code=SOC) / orig="]
[null,"A",1,"stock res","599610","STORM","SO Colissimo(code=SOC) / orig="]
[null,"A",1,"stock res","4741",null,"SO Colissimo(code=SOC) / orig="]
[null,"A",1,null,"99952",null,"Chronopost(code=CHR) / orig="]
[null,"A",1,null,"CDAL-54506z",null,"SO Colissimo(code=SOC) / orig="]
[null,"A",1,"stock res","4740",null,"SO Colissimo(code=SOC) / orig="]
[null,"A",1,null,"A14113",null,"SO Colissimo(code=SOC) / orig="]
[null,"A",1,"stock res","83524",null,"SO Colissimo(code=SOC) / orig="]
[null,"A",1,null,"82065",null,"SO Colissimo(code=SOC) / orig="]
[null,"A",1,"stock res","83523",null,"SO Colissimo(code=SOC) / orig="]
[null,"A",1,"stock res","83523",null,"SO Colissimo(code=SOC) / orig="]
[null,"A",2,"stock res","83524",null,"SO Colissimo(code=SOC) / orig="]
[null,"A",1,"stock res","4741",null,"SO Colissimo(code=SOC) / orig="]
[null,"A",1,null,"20032",null,"SO Colissimo(code=SOC) / orig="]
[null,"A",1,null,"70034",null,"SO Colissimo(code=SOC) / orig="]
[null,"A",1,null,"20032",null,"SO Colissimo(code=SOC) / orig="]
[null,"A",1,null,"26599",null,"SO Colissimo(code=SOC) / orig="]
[null,"A",1,null,"26599",null,"SO Colissimo(code=SOC) / orig="]
[null,"A",1,null,"MECA2869",null,"SO Colissimo(code=SOC) / orig="]
[null,"A",1,null,"153540",null,"SO Colissimo(code=SOC) / orig="]
[null,"A",1,null,"5206",null,"SO Colissimo(code=SOC) / orig="]
[null,"A",1,null,"99999A",null,"SO Colissimo(code=SOC) / orig="]
[null,"A",1,"stock res","99901",null,"SO Colissimo(code=SOC) / orig="]
[null,"A",1,null,"883265459",null,"SO Colissimo(code=SOC) / orig="]
[null,"A",2,null,"24099",null,"SO Colissimo(code=SOC) / orig="]
[null,"A",2,null,"72083",null,"SO Colissimo(code=SOC) / orig="]
[null,"A",2,null,"85081",null,"SO Colissimo(code=SOC) / orig="]
[null,"A",1,null,"80090",null,"SO Colissimo(code=SOC) / orig="]
[null,"A",1,"stock res","42329",null,"Enveloppes Rigides Avec Suivi(code=POS) / orig="]
[null,"A",1,null,"316900",null,"SO Colissimo(code=SOC) / orig="]
[null,"A",1,null,"34516",null,"SO Colissimo(code=SOC) / orig="]
[null,"A",1,null,"MECA2869",null,"SO Colissimo(code=SOC) / orig="]
[null,"A",1,null,"450200",null,"SO Colissimo(code=SOC) / orig="]