{"text_format":"1","workbook":"xlsx","n_sheets":8,"sheets":["Calcul Coef U","Regle Th-U","local 1","local 2","local 3","local 4","local 5","Bilan"],"not_rendered":{"charts":3,"images":1,"macros":0,"external_links":1,"defined_names":179,"comments":6,"pivot_tables":0},"unopened":[],"bounds":{"document_bytes":16777216,"sheet_cells":100000,"rows_first":2000,"rows_last":500,"rows_between":2000,"halvings":0,"cell_chars":16384,"cell_head_chars":4096},"cells_cut":0,"cells_raw":0,"read":"whole","date_system":"1900"}

{"sheet":"Calcul Coef U","index":0,"n_rows":139,"n_cols":12,"rows_kept":139,"cut":false,"hidden":false,"merged":[[93,7,93,10],[112,2,112,10],[113,7,113,10],[129,7,129,10],[135,8,135,10],[12,1,13,1],[17,1,18,1],[74,2,74,10],[75,7,75,10],[92,2,92,10],[56,2,56,10],[57,7,57,10],[37,2,37,10],[38,7,38,10],[22,1,23,1]]}
[]
[]
[]
[null,"RESISTANCE SUPERFICIELLES"]
[null,"Position de la paroi","Face externe","Rsi","Rse","Total"]
[null,"Flux ascendant ↑ cloisons horizontales ","extérieur, passage ouvert, local ouvert",0.1,0.04,{"$f":"SUM(D6:E6)","v":0.14000000000000001}]
[null,"Flux ascendant ↑ cloisons horizontales ","comble, local non chauffé ",0.1,0.1,{"$f":"SUM(D7:E7)","v":0.2},"Flux horizontal ← cloisons verticales     extérieur, local ouvert"]
[null,"Flux horizontal ← cloisons verticales","extérieur, local ouvert",0.13,0.04,0.17,{"$f":"VLOOKUP(Flux,RSIRSE3,2,FALSE)","v":0.17}]
[null,"Flux horizontal ← cloisons verticales","comble, local non chauffé ",0.13,0.13,0.26,"Matériaux non renseigné (Cf.Résistances thermiques)"]
[null,"Flux descendant ↓ cloisons horizontales","extérieur, passage ouvert, local ouvert",0.17,0.04,0.21000000000000002,{"$f":"IFERROR(VLOOKUP(Deper2,'Regle Th-U'!B6:D291,3,FALSE),0)","v":0}]
[null,"Flux descendant ↓ cloisons horizontales","vide sanitaire, local non chauffé ",0.17,0.17,0.34]
[null,null,null,null,null,null,null,null,null,null,null,"Recommandation ACIVF 01-2006; chap. 9.7 :"]
[null,"Flux ascendant ↑ cloisons horizontales"]
[]
[null,"extérieur, passage ouvert, local ouvert",{"$f":"F6","v":0.14000000000000001}]
{"$rows_left_out":125}
{"sheet":"Regle Th-U","index":1,"n_rows":381,"n_cols":13,"rows_kept":381,"cut":false,"hidden":false,"merged":[[2,4,3,4],[2,5,2,6],[2,1,3,1],[2,2,3,2],[2,3,3,3]]}
[null,null,"Terre cuite ρ nominal = 1900"]
[null,null,{"$f":"VLOOKUP(Deper,B6:D291,3,FALSE)","v":0.74}]
[null,"Matériaux ou application ","Masse volumique sèche (ρ)\nen kg/m3","Conductivité\nthermique\nutile (λ)\nen W/(m.K)","Capacité\nthermique\nmassique\n(Cp)\nen J/(kg.K)","Facteur de résistance à la\ndiffusion devapeur d’eau\n(μ)",null,null,null,"Perméabilité type","Coef.","Alpha","Beta"]
[null,null,null,null,null,"sec","humide",null,"Référence","Non renseigné",null,0,0]
[null,"Matériaux non renseigné (Cf.Résistances thermiques)",null,null,null,null,null,null,null,"Entrée d'air module 15",3.4,0.02,0.02]
[1,"Pierres / Roches plutoniques et métamorphiques / Gneiss, porphyres","2 300 ≤ ρ ≤ 2 900",3.5,1000,10000,10000,{"$f":"OFFSET(B6,0,2,1,1)","v":3.5},"Règle Th-U; fasc2 2.1.1. p3","Entrée d'air module 22",5,0.04,0.04]
[2,"Pierres / Roches plutoniques et métamorphiques / Granites","2 500 ≤ ρ ≤ 2 700",2.8,1000,10000,10000,{"$f":"OFFSET(B7,0,2,1,1)","v":2.8},"Règle Th-U; fasc2 2.1.1. p3","Entrée d'air module 30",6.8,0.06,0.06]
[3,"Pierres / Roches plutoniques et métamorphiques / Schistes, ardoises","2 000 ≤ ρ ≤ 2 800",2.2000000000000002,1000,1000,800,2.2000000000000002,"Règle Th-U; fasc2 2.1.1. p3","Entrée d'air module 45",10.199999999999999,0.08,0.08]
[4,"Roches volcaniques / Basaltes","2 700 ≤ ρ ≤ 3 000",1.6,1000,10000,10000,1.6,"Règle Th-U; fasc2 2.1.2. p3","Entrée d'air module 60",13.6,0.1,0.1]
[5,"Roches volcaniques / Trachytes, andésites","2 000 ≤ ρ ≤ 2 700",1.1000000000000001,1000,20,15,1.1000000000000001,"Règle Th-U; fasc2 2.1.2. p3","Simple fenêtre ou porte-fenêtre - classe A3",0.3,0.12,0.11]
[6,"Roches volcaniques / Pierres naturelles poreuses, ex : laves","ρ ≤ 1 600",0.55000000000000004,1000,20,15,0.55000000000000004,"Règle Th-U; fasc2 2.1.2. p3","Simple fenêtre ou porte-fenêtre - classe A2",0.8,0.13,0.12]
[7,"Pierres calcaires / Marbres","2 600 ≤ ρ ≤ 2 800",3.5,1000,10000,10000,3.5,"Règle Th-U; fasc2 2.1.3. p3","Simple fenêtre ou porte-fenêtre - classe A1",2,0.14000000000000001,0.13]
[8,"Pierres calcaires / Pierres froides ou extra-dures","2 200 ≤ ρ ≤ 2 590",2.2999999999999998,1000,250,200,2.2999999999999998,"Règle Th-U; fasc2 2.1.3. p3","Simple fenêtre ou porte-fenêtre - non classée",4,0.15,0.14000000000000001]
[9,"Pierres calcaires / Pierres dures","2 000 ≤ ρ ≤ 2 190",1.7,1000,200,150,1.7,"Règle Th-U; fasc2 2.1.3. p3","Double fenêtre (A3 + quelconque)",0.3,0.16,0.15]
[10,"Pierres calcaires / Pierres fermes, demi-fermes","1 800 ≤ ρ ≤ 1 990",1.4,1000,50,40,1.4,"Règle Th-U; fasc2 2.1.3. p3","Double fenêtre (2 x A2)",0.5,0.17,0.16]
{"$rows_left_out":367}
{"sheet":"local 1","index":2,"n_rows":68,"n_cols":16,"rows_kept":68,"cut":false,"hidden":false,"merged":[[8,6,10,6],[45,0,46,0],[15,15,16,15],[0,1,0,10],[15,1,15,4],[15,6,15,7],[15,8,15,9],[15,10,16,10],[15,11,16,11],[15,12,16,12],[15,5,16,5],[45,1,45,4],[45,8,46,8],[15,13,16,13],[15,14,16,14],[45,5,45,6],[45,7,46,7],[40,7,40,9],[65,8,65,9],[45,14,46,14],[45,15,46,15],[45,9,46,9],[45,10,46,10],[45,11,46,11],[45,12,46,12],[45,13,46,13]]}
[null,{"$f":"RIGHT(CELL(\"nomfichier\",B1),LEN(CELL(\"nomfichier\",B1))-FIND(\"]\",CELL(\"nomfichier\",B1)))","v":{"$error":"#VALUE!"}}]
[null,"Date :",{"$f":"TODAY()","v":"2013-01-28"}]
[null,"Affaire :"]
[null,"Localité :"]
[null,"Hauteur du batiment (en m) :",null,null,null,null,"Température ext. de base (°C) :",-9,"Notes:"]
[null,"Dénivellation yo (en m):",null,null,null,null,"Région (H1,H2,H3) : "]
[null,"Hauteur au sol (en m) :"]
[null,null,null,null,null,null,"Température intérieure (°C) :",19]
[null,"Local :",{"$f":"RIGHT(CELL(\"nomfichier\",B1),LEN(CELL(\"nomfichier\",B1))-FIND(\"]\",CELL(\"nomfichier\",B1)))","v":{"$error":"#VALUE!"}},"Surface (en m²) :",null,50,"Renouvellement d'air :","n en vol/h",2,"tri = "]
[null,"N°:",null,"Hauteur (en m) :",null,2.5,null,"n.V en m3/h",{"$f":"$I$9*$F$11","v":250},"tai = "]
[null,"Type chauffage (C/R)",null,"Volume (en m3) :",null,{"$f":"F9*F10","v":125}]
[]
[]
[null," Pertes statiques :"]
[]
{"$rows_left_out":54}
{"sheet":"local 2","index":3,"n_rows":68,"n_cols":16,"rows_kept":68,"cut":false,"hidden":false,"merged":[[40,7,40,9],[0,1,0,10],[8,6,10,6],[15,1,15,4],[15,5,16,5],[15,6,15,7],[15,8,15,9],[15,10,16,10],[15,11,16,11],[15,12,16,12],[15,13,16,13],[15,14,16,14],[15,15,16,15],[45,14,46,14],[45,15,46,15],[45,0,46,0],[45,1,45,4],[45,5,45,6],[45,7,46,7],[45,8,46,8],[45,9,46,9],[65,8,65,9],[45,10,46,10],[45,11,46,11],[45,12,46,12],[45,13,46,13]]}
[null,{"$f":"RIGHT(CELL(\"nomfichier\",B1),LEN(CELL(\"nomfichier\",B1))-FIND(\"]\",CELL(\"nomfichier\",B1)))","v":{"$error":"#VALUE!"}}]
[null,"Date :",{"$f":"TODAY()","v":"2013-01-28"}]
[null,"Affaire :"]
[null,"Localité :"]
[null,"Hauteur du batiment (en m) :",null,null,null,null,"Température ext. de base (°C) :",-9,"Notes:"]
[null,"Dénivellation yo (en m):",null,null,null,null,"Région (H1,H2,H3) : "]
[null,"Hauteur au sol (en m) :"]
[null,null,null,null,null,null,"Température intérieure (°C) :",19]
[null,"Local :",{"$f":"RIGHT(CELL(\"nomfichier\",B1),LEN(CELL(\"nomfichier\",B1))-FIND(\"]\",CELL(\"nomfichier\",B1)))","v":{"$error":"#VALUE!"}},"Surface (en m²) :",null,15,"Renouvellement d'air :","n en vol/h",2,"tri = "]
[null,"N°:",null,"Hauteur (en m) :",null,2.5,null,"n.V en m3/h",{"$f":"$I$9*$F$11","v":75},"tai = "]
[null,"Type chauffage (C/R)",null,"Volume (en m3) :",null,{"$f":"F9*F10","v":37.5}]
[]
[]
[null," Pertes statiques :"]
[]
{"$rows_left_out":54}
{"sheet":"local 3","index":4,"n_rows":68,"n_cols":16,"rows_kept":68,"cut":false,"hidden":false,"merged":[[40,7,40,9],[0,1,0,10],[8,6,10,6],[15,1,15,4],[15,5,16,5],[15,6,15,7],[15,8,15,9],[15,10,16,10],[15,11,16,11],[15,12,16,12],[15,13,16,13],[15,14,16,14],[15,15,16,15],[45,14,46,14],[45,15,46,15],[45,0,46,0],[45,1,45,4],[45,5,45,6],[45,7,46,7],[45,8,46,8],[45,9,46,9],[65,8,65,9],[45,10,46,10],[45,11,46,11],[45,12,46,12],[45,13,46,13]]}
[null,{"$f":"RIGHT(CELL(\"nomfichier\",B1),LEN(CELL(\"nomfichier\",B1))-FIND(\"]\",CELL(\"nomfichier\",B1)))","v":{"$error":"#VALUE!"}}]
[null,"Date :",{"$f":"TODAY()","v":"2013-01-28"}]
[null,"Affaire :"]
[null,"Localité :"]
[null,"Hauteur du batiment (en m) :",null,null,null,null,"Température ext. de base (°C) :",-9,"Notes:"]
[null,"Dénivellation yo (en m):",null,null,null,null,"Région (H1,H2,H3) : "]
[null,"Hauteur au sol (en m) :"]
[null,null,null,null,null,null,"Température intérieure (°C) :",19]
[null,"Local :",{"$f":"RIGHT(CELL(\"nomfichier\",B1),LEN(CELL(\"nomfichier\",B1))-FIND(\"]\",CELL(\"nomfichier\",B1)))","v":{"$error":"#VALUE!"}},"Surface (en m²) :",null,null,"Renouvellement d'air :","n en vol/h",2,"tri = "]
[null,"N°:",null,"Hauteur (en m) :",null,null,null,"n.V en m3/h",{"$f":"$I$9*$F$11","v":0},"tai = "]
[null,"Type chauffage (C/R)",null,"Volume (en m3) :",null,{"$f":"F9*F10","v":0}]
[]
[]
[null," Pertes statiques :"]
[]
{"$rows_left_out":54}
{"sheet":"local 4","index":5,"n_rows":68,"n_cols":16,"rows_kept":68,"cut":false,"hidden":false,"merged":[[40,7,40,9],[0,1,0,10],[8,6,10,6],[15,1,15,4],[15,5,16,5],[15,6,15,7],[15,8,15,9],[15,10,16,10],[15,11,16,11],[15,12,16,12],[15,13,16,13],[15,14,16,14],[15,15,16,15],[45,14,46,14],[45,15,46,15],[45,0,46,0],[45,1,45,4],[45,5,45,6],[45,7,46,7],[45,8,46,8],[45,9,46,9],[65,8,65,9],[45,10,46,10],[45,11,46,11],[45,12,46,12],[45,13,46,13]]}
[null,{"$f":"RIGHT(CELL(\"nomfichier\",B1),LEN(CELL(\"nomfichier\",B1))-FIND(\"]\",CELL(\"nomfichier\",B1)))","v":{"$error":"#VALUE!"}}]
[null,"Date :",{"$f":"TODAY()","v":"2013-01-28"}]
[null,"Affaire :"]
[null,"Localité :"]
[null,"Hauteur du batiment (en m) :",null,null,null,null,"Température ext. de base (°C) :",-9,"Notes:"]
[null,"Dénivellation yo (en m):",null,null,null,null,"Région (H1,H2,H3) : "]
[null,"Hauteur au sol (en m) :"]
[null,null,null,null,null,null,"Température intérieure (°C) :",19]
[null,"Local :",{"$f":"RIGHT(CELL(\"nomfichier\",B1),LEN(CELL(\"nomfichier\",B1))-FIND(\"]\",CELL(\"nomfichier\",B1)))","v":{"$error":"#VALUE!"}},"Surface (en m²) :",null,null,"Renouvellement d'air :","n en vol/h",2,"tri = "]
[null,"N°:",null,"Hauteur (en m) :",null,null,null,"n.V en m3/h",{"$f":"$I$9*$F$11","v":0},"tai = "]
[null,"Type chauffage (C/R)",null,"Volume (en m3) :",null,{"$f":"F9*F10","v":0}]
[]
[]
[null," Pertes statiques :"]
[]
{"$rows_left_out":54}
{"sheet":"local 5","index":6,"n_rows":68,"n_cols":16,"rows_kept":68,"cut":false,"hidden":false,"merged":[[40,7,40,9],[0,1,0,10],[8,6,10,6],[15,1,15,4],[15,5,16,5],[15,6,15,7],[15,8,15,9],[15,10,16,10],[15,11,16,11],[15,12,16,12],[15,13,16,13],[15,14,16,14],[15,15,16,15],[45,14,46,14],[45,15,46,15],[45,0,46,0],[45,1,45,4],[45,5,45,6],[45,7,46,7],[45,8,46,8],[45,9,46,9],[65,8,65,9],[45,10,46,10],[45,11,46,11],[45,12,46,12],[45,13,46,13]]}
[null,{"$f":"RIGHT(CELL(\"nomfichier\",B1),LEN(CELL(\"nomfichier\",B1))-FIND(\"]\",CELL(\"nomfichier\",B1)))","v":{"$error":"#VALUE!"}}]
[null,"Date :",{"$f":"TODAY()","v":"2013-01-28"}]
[null,"Affaire :"]
[null,"Localité :"]
[null,"Hauteur du batiment (en m) :",null,null,null,null,"Température ext. de base (°C) :",-9,"Notes:"]
[null,"Dénivellation yo (en m):",null,null,null,null,"Région (H1,H2,H3) : "]
[null,"Hauteur au sol (en m) :"]
[null,null,null,null,null,null,"Température intérieure (°C) :",19]
[null,"Local :",{"$f":"RIGHT(CELL(\"nomfichier\",B1),LEN(CELL(\"nomfichier\",B1))-FIND(\"]\",CELL(\"nomfichier\",B1)))","v":{"$error":"#VALUE!"}},"Surface (en m²) :",null,20,"Renouvellement d'air :","n en vol/h",2,"tri = "]
[null,"N°:",null,"Hauteur (en m) :",null,2.5,null,"n.V en m3/h",{"$f":"$I$9*$F$11","v":100},"tai = "]
[null,"Type chauffage (C/R)",null,"Volume (en m3) :",null,{"$f":"F9*F10","v":50}]
[]
[]
[null," Pertes statiques :"]
[]
{"$rows_left_out":54}
{"sheet":"Bilan","index":7,"n_rows":58,"n_cols":20,"rows_kept":58,"cut":false,"hidden":false,"merged":[]}
[]
[]
[null,null,"Pertes statiques ","Pertes Aérauliques","Total","hors pt","pt",null,null,"Déperditions statiques \n(hors ponts thermiques)","Déperditions statiques \n(hors ponts thermiques)","Ratio \nPonts Thermiques","Ratio \nPonts Thermiques"]
[null,{"$f":"'local 1'!B1:K1","v":{"$error":"#VALUE!"}},{"$f":"'local 1'!M43","v":1176.7},{"$f":"'local 1'!M68","v":0},{"$f":"SUM(C4:D4)","v":1176.7},{"$f":"SUM(SUMIF('local 1'!B18:B39,\"ME\",'local 1'!O18:O39),SUMIF('local 1'!B18:B39,\"FE\",'local 1'!O18:O39),SUMIF('local 1'!B18:B39,\"PO\",'local 1'!O18:O39),SUMIF('local 1'!B18:B39,\"PLH\",'local 1'!O18:O39),SUMIF('local 1'!B18:B39,\"PLB\",'local 1'!O18:O39))+$D4","v":1170.3999999999999},{"$f":"SUMIF('local 1'!B18:B39,\"PT\",'local 1'!O18:O39)","v":6.3000000000000007},null,{"$f":"B4","v":{"$error":"#VALUE!"}},{"$f":"IFERROR((SUM(SUMIF('local 1'!B18:B39,\"ME\",'local 1'!O18:O39),SUMIF('local 1'!B18:B39,\"FE\",'local 1'!O18:O39),SUMIF('local 1'!B18:B39,\"PO\",'local 1'!O18:O39),SUMIF('local 1'!B18:B39,\"PLH\",'local 1'!O18:O39),SUMIF('local 1'!B18:B39,\"PLB\",'local 1'!O18:O39)))/'local 1'!$F$9,0)","v":23.407999999999998},{"$f":"IFERROR((SUM(SUMIF('local 1'!B18:B39,\"ME\",'local 1'!O18:O39),SUMIF('local 1'!B18:B39,\"FE\",'local 1'!O18:O39),SUMIF('local 1'!B18:B39,\"PO\",'local 1'!O18:O39),SUMIF('local 1'!B18:B39,\"PLH\",'local 1'!O18:O39),SUMIF('local 1'!B18:B39,\"PLB\",'local 1'!O18:O39)))/'local 1'!$F$11,0)","v":9.3631999999999991},{"$f":"IFERROR(SUMIF('local 1'!B18:B39,\"PT\",'local 1'!O18:O39)/'local 1'!$F$9,0)","v":0.126},{"$f":"IFERROR(SUMIF('local 1'!B18:B39,\"PT\",'local 1'!O18:O39)/'local 1'!$F$11,0)","v":5.0400000000000007E-2}]
[null,{"$f":"'local 2'!B1:K1","v":{"$error":"#VALUE!"}},{"$f":"'local 2'!M43","v":1089.0249999999999},{"$f":"'local 2'!M68","v":0},1089.0249999999999,{"$f":"SUM(SUMIF('local 2'!B18:B39,\"ME\",'local 2'!O18:O39),SUMIF('local 2'!B18:B39,\"FE\",'local 2'!O18:O39),SUMIF('local 2'!B18:B39,\"PO\",'local 2'!O18:O39),SUMIF('local 2'!B18:B39,\"PLH\",'local 2'!O18:O39),SUMIF('local 2'!B18:B39,\"PLB\",'local 2'!O18:O39))+$D5","v":1084.1249999999998},{"$f":"SUMIF('local 2'!B18:B39,\"PT\",'local 2'!O18:O39)","v":4.9000000000000004},null,{"$error":"#VALUE!"},{"$f":"IFERROR((SUM(SUMIF('local 2'!B18:B39,\"ME\",'local 2'!O18:O39),SUMIF('local 2'!B18:B39,\"FE\",'local 2'!O18:O39),SUMIF('local 2'!B18:B39,\"PO\",'local 2'!O18:O39),SUMIF('local 2'!B18:B39,\"PLH\",'local 2'!O18:O39),SUMIF('local 2'!B18:B39,\"PLB\",'local 2'!O18:O39)))/'local 2'!$F$9,0)","v":72.274999999999991},{"$f":"IFERROR((SUM(SUMIF('local 2'!B18:B39,\"ME\",'local 2'!O18:O39),SUMIF('local 2'!B18:B39,\"FE\",'local 2'!O18:O39),SUMIF('local 2'!B18:B39,\"PO\",'local 2'!O18:O39),SUMIF('local 2'!B18:B39,\"PLH\",'local 2'!O18:O39),SUMIF('local 2'!B18:B39,\"PLB\",'local 2'!O18:O39)))/'local 2'!$F$11,0)","v":28.909999999999993},{"$f":"IFERROR(SUMIF('local 2'!B18:B39,\"PT\",'local 2'!O18:O39)/'local 2'!$F$9,0)","v":0.32666666666666672},{"$f":"IFERROR(SUMIF('local 2'!B18:B39,\"PT\",'local 2'!O18:O39)/'local 2'!$F$11,0)","v":0.13066666666666668},null,null,{"$f":"F10","v":"déperditions statiques et aérauliques hors ponts thermiques"},"déperditions linéiques"]
[null,{"$f":"'local 3'!B1:K1","v":{"$error":"#VALUE!"}},{"$f":"'local 3'!M43","v":0},{"$f":"'local 3'!M68","v":0},0,{"$f":"SUM(SUMIF('local 3'!B18:B39,\"ME\",'local 3'!O18:O39),SUMIF('local 3'!B18:B39,\"FE\",'local 3'!O18:O39),SUMIF('local 3'!B18:B39,\"PO\",'local 3'!O18:O39),SUMIF('local 3'!B18:B39,\"PLH\",'local 3'!O18:O39),SUMIF('local 3'!B18:B39,\"PLB\",'local 3'!O18:O39))+$D6","v":0},{"$f":"SUMIF('local 3'!B18:B39,\"PT\",'local 3'!O18:O39)","v":0},null,{"$error":"#VALUE!"},{"$f":"IFERROR((SUM(SUMIF('local 3'!B18:B39,\"ME\",'local 3'!O18:O39),SUMIF('local 3'!B18:B39,\"FE\",'local 3'!O18:O39),SUMIF('local 3'!B18:B39,\"PO\",'local 3'!O18:O39),SUMIF('local 3'!B18:B39,\"PLH\",'local 3'!O18:O39),SUMIF('local 3'!B18:B39,\"PLB\",'local 3'!O18:O39)))/'local 3'!$F$9,0)","v":0},{"$f":"IFERROR((SUM(SUMIF('local 3'!B18:B39,\"ME\",'local 3'!O18:O39),SUMIF('local 3'!B18:B39,\"FE\",'local 3'!O18:O39),SUMIF('local 3'!B18:B39,\"PO\",'local 3'!O18:O39),SUMIF('local 3'!B18:B39,\"PLH\",'local 3'!O18:O39),SUMIF('local 3'!B18:B39,\"PLB\",'local 3'!O18:O39)))/'local 3'!$F$11,0)","v":0},{"$f":"IFERROR(SUMIF('local 3'!B18:B39,\"PT\",'local 3'!O18:O39)/'local 3'!$F$9,0)","v":0},{"$f":"IFERROR(SUMIF('local 3'!B18:B39,\"PT\",'local 3'!O18:O39)/'local 3'!$F$11,0)","v":0},null,null,96.959434033265595,3.0405659667344023]
[null,{"$f":"'local 4'!B1:K1","v":{"$error":"#VALUE!"}},{"$f":"'local 4'!M43","v":0},{"$f":"'local 4'!M68","v":0},0,{"$f":"SUM(SUMIF('local 4'!B18:B39,\"ME\",'local 4'!O18:O39),SUMIF('local 4'!B18:B39,\"FE\",'local 4'!O18:O39),SUMIF('local 4'!B18:B39,\"PO\",'local 4'!O18:O39),SUMIF('local 4'!B18:B39,\"PLH\",'local 4'!O18:O39),SUMIF('local 4'!B18:B39,\"PLB\",'local 4'!O18:O39))+$D7","v":0},{"$f":"SUMIF('local 4'!B18:B39,\"PT\",'local 4'!O18:O39)","v":0},null,{"$error":"#VALUE!"},{"$f":"IFERROR((SUM(SUMIF('local 4'!B18:B39,\"ME\",'local 4'!O18:O39),SUMIF('local 4'!B18:B39,\"FE\",'local 4'!O18:O39),SUMIF('local 4'!B18:B39,\"PO\",'local 4'!O18:O39),SUMIF('local 4'!B18:B39,\"PLH\",'local 4'!O18:O39),SUMIF('local 4'!B18:B39,\"PLB\",'local 4'!O18:O39)))/'local 4'!$F$9,0)","v":0},{"$f":"IFERROR((SUM(SUMIF('local 4'!B18:B39,\"ME\",'local 4'!O18:O39),SUMIF('local 4'!B18:B39,\"FE\",'local 4'!O18:O39),SUMIF('local 4'!B18:B39,\"PO\",'local 4'!O18:O39),SUMIF('local 4'!B18:B39,\"PLH\",'local 4'!O18:O39),SUMIF('local 4'!B18:B39,\"PLB\",'local 4'!O18:O39)))/'local 4'!$F$11,0)","v":0},{"$f":"IFERROR(SUMIF('local 4'!B18:B39,\"PT\",'local 4'!O18:O39)/'local 4'!$F$9,0)","v":0},{"$f":"IFERROR(SUMIF('local 4'!B18:B39,\"PT\",'local 4'!O18:O39)/'local 4'!$F$11,0)","v":0}]
[null,{"$f":"'local 5'!B1:K1","v":{"$error":"#VALUE!"}},{"$f":"'local 5'!M43","v":59.5},{"$f":"'local 5'!M68","v":0},59.5,{"$f":"SUM(SUMIF('local 5'!B18:B39,\"ME\",'local 5'!O18:O39),SUMIF('local 5'!B18:B39,\"FE\",'local 5'!O18:O39),SUMIF('local 5'!B18:B39,\"PO\",'local 5'!O18:O39),SUMIF('local 5'!B18:B39,\"PLH\",'local 5'!O18:O39),SUMIF('local 5'!B18:B39,\"PLB\",'local 5'!O18:O39))+$D8","v":0},{"$f":"SUMIF('local 5'!B18:B39,\"PT\",'local 5'!O18:O39)","v":59.5},null,{"$error":"#VALUE!"},{"$f":"IFERROR((SUM(SUMIF('local 5'!B18:B39,\"ME\",'local 5'!O18:O39),SUMIF('local 5'!B18:B39,\"FE\",'local 5'!O18:O39),SUMIF('local 5'!B18:B39,\"PO\",'local 5'!O18:O39),SUMIF('local 5'!B18:B39,\"PLH\",'local 5'!O18:O39),SUMIF('local 5'!B18:B39,\"PLB\",'local 5'!O18:O39)))/'local 5'!$F$9,0)","v":0},{"$f":"IFERROR((SUM(SUMIF('local 5'!B18:B39,\"ME\",'local 5'!O18:O39),SUMIF('local 5'!B18:B39,\"FE\",'local 5'!O18:O39),SUMIF('local 5'!B18:B39,\"PO\",'local 5'!O18:O39),SUMIF('local 5'!B18:B39,\"PLH\",'local 5'!O18:O39),SUMIF('local 5'!B18:B39,\"PLB\",'local 5'!O18:O39)))/'local 5'!$F$11,0)","v":0},{"$f":"IFERROR(SUMIF('local 5'!B18:B39,\"PT\",'local 5'!O18:O39)/'local 5'!$F$9,0)","v":2.9750000000000001},{"$f":"IFERROR(SUMIF('local 5'!B18:B39,\"PT\",'local 5'!O18:O39)/'local 5'!$F$11,0)","v":1.19}]
[null,"Total ",{"$f":"SUM(C4:C8)","v":2325.2249999999999},{"$f":"SUM(D4:D8)","v":0},2325.2249999999999,{"$f":"SUM(F4:F8)","v":2254.5249999999996},{"$f":"SUM(G4:G8)","v":70.7},null,"Total ",{"$f":"IFERROR((SUM(SUMIF('local 1'!B18:B39,\"ME\",'local 1'!O18:O39),SUMIF('local 1'!B18:B39,\"FE\",'local 1'!O18:O39),SUMIF('local 1'!B18:B39,\"PO\",'local 1'!O18:O39),SUMIF('local 1'!B18:B39,\"PLH\",'local 1'!O18:O39),SUMIF('local 1'!B18:B39,\"PLB\",'local 1'!O18:O39),SUMIF('local 2'!B18:B39,\"ME\",'local 2'!O18:O39),SUMIF('local 2'!B18:B39,\"FE\",'local 2'!O18:O39),SUMIF('local 2'!B18:B39,\"PO\",'local 2'!O18:O39),SUMIF('local 2'!B18:B39,\"PLH\",'local 2'!O18:O39),SUMIF('local 2'!B18:B39,\"PLB\",'local 2'!O18:O39),SUMIF('local 3'!B18:B39,\"ME\",'local 3'!O18:O39),SUMIF('local 3'!B18:B39,\"FE\",'local 3'!O18:O39),SUMIF('local 3'!B18:B39,\"PO\",'local 3'!O18:O39),SUMIF('local 3'!B18:B39,\"PLH\",'local 3'!O18:O39),SUMIF('local 3'!B18:B39,\"PLB\",'local 3'!O18:O39),SUMIF('local 4'!B18:B39,\"ME\",'local 4'!O18:O39),SUMIF('local 4'!B18:B39,\"FE\",'local 4'!O18:O39),SUMIF('local 4'!B18:B39,\"PO\",'local 4'!O18:O39),SUMIF('local 4'!B18:B39,\"PLH\",'local 4'!O18:O39),SUMIF('local 4'!B18:B39,\"PLB\",'local 4'!O18:O39),SUMIF('local 5'!B18:B39,\"ME\",'local 5'!O18:O39),SUMIF('local 5'!B18:B39,\"FE\",'local 5'!O18:O39),SUMIF('local 5'!B18:B39,\"PO\",'local 5'!O18:O39),SUMIF('local 5'!B18:B39,\"PLH\",'local 5'!O18:O39),SUMIF('local 5'!B18:B39,\"PLB\",'local 5'!O18:O39),SUMIF(#REF!,\"ME\",#REF!),SUMIF(#REF!,\"FE\",#REF!),SUMIF(#REF!,\"PO\",#REF!),SUMIF(#REF!,\"PLH\",#REF!),SUMIF(#REF!,\"PLB\",#REF!),SUMIF(#REF!,\"ME\",#REF!),SUMIF(#REF!,\"FE\",#REF!),SUMIF(#REF!,\"PO\",#REF!),SUMIF(#REF!,\"PLH\",#REF!),SUMIF(#REF!,\"PLB\",#REF!),SUMIF(#REF!,\"ME\",#REF!),SUMIF(#REF!,\"FE\",#REF!),SUMIF(#REF!,\"PO\",#REF!),SUMIF(#REF!,\"PLH\",#REF!),SUMIF(#REF!,\"PLB\",#REF!),SUMIF(#REF!,\"ME\",#REF!),SUMIF(#REF!,\"FE\",#REF!),SUMIF(#REF!,\"PO\",#REF!),SUMIF(#REF!,\"PLH\",#REF!),SUMIF(#REF!,\"PLB\",#REF!),SUMIF(#REF!,\"ME\",#REF!),SUMIF(#REF!,\"FE\",#REF!),SUMIF(#REF!,\"PO\",#REF!),SUMIF(#REF!,\"PLH\",#REF!),SUMIF(#REF!,\"PLB\",#REF!)))/(SUM('local 1'!$F$9,'local 2'!$F$9,'local 3'!$F$9,'local 4'!$F$9,'local 5'!$F$9,#REF!,#REF!,#REF!,#REF!,#REF!)),0)","v":0},{"$f":"IFERROR((SUM(SUMIF('local 1'!B18:B39,\"ME\",'local 1'!O18:O39),SUMIF('local 1'!B18:B39,\"FE\",'local 1'!O18:O39),SUMIF('local 1'!B18:B39,\"PO\",'local 1'!O18:O39),SUMIF('local 1'!B18:B39,\"PLH\",'local 1'!O18:O39),SUMIF('local 1'!B18:B39,\"PLB\",'local 1'!O18:O39),SUMIF('local 2'!B18:B39,\"ME\",'local 2'!O18:O39),SUMIF('local 2'!B18:B39,\"FE\",'local 2'!O18:O39),SUMIF('local 2'!B18:B39,\"PO\",'local 2'!O18:O39),SUMIF('local 2'!B18:B39,\"PLH\",'local 2'!O18:O39),SUMIF('local 2'!B18:B39,\"PLB\",'local 2'!O18:O39),SUMIF('local 3'!B18:B39,\"ME\",'local 3'!O18:O39),SUMIF('local 3'!B18:B39,\"FE\",'local 3'!O18:O39),SUMIF('local 3'!B18:B39,\"PO\",'local 3'!O18:O39),SUMIF('local 3'!B18:B39,\"PLH\",'local 3'!O18:O39),SUMIF('local 3'!B18:B39,\"PLB\",'local 3'!O18:O39),SUMIF('local 4'!B18:B39,\"ME\",'local 4'!O18:O39),SUMIF('local 4'!B18:B39,\"FE\",'local 4'!O18:O39),SUMIF('local 4'!B18:B39,\"PO\",'local 4'!O18:O39),SUMIF('local 4'!B18:B39,\"PLH\",'local 4'!O18:O39),SUMIF('local 4'!B18:B39,\"PLB\",'local 4'!O18:O39),SUMIF('local 5'!B18:B39,\"ME\",'local 5'!O18:O39),SUMIF('local 5'!B18:B39,\"FE\",'local 5'!O18:O39),SUMIF('local 5'!B18:B39,\"PO\",'local 5'!O18:O39),SUMIF('local 5'!B18:B39,\"PLH\",'local 5'!O18:O39),SUMIF('local 5'!B18:B39,\"PLB\",'local 5'!O18:O39),SUMIF(#REF!,\"ME\",#REF!),SUMIF(#REF!,\"FE\",#REF!),SUMIF(#REF!,\"PO\",#REF!),SUMIF(#REF!,\"PLH\",#REF!),SUMIF(#REF!,\"PLB\",#REF!),SUMIF(#REF!,\"ME\",#REF!),SUMIF(#REF!,\"FE\",#REF!),SUMIF(#REF!,\"PO\",#REF!),SUMIF(#REF!,\"PLH\",#REF!),SUMIF(#REF!,\"PLB\",#REF!),SUMIF(#REF!,\"ME\",#REF!),SUMIF(#REF!,\"FE\",#REF!),SUMIF(#REF!,\"PO\",#REF!),SUMIF(#REF!,\"PLH\",#REF!),SUMIF(#REF!,\"PLB\",#REF!),SUMIF(#REF!,\"ME\",#REF!),SUMIF(#REF!,\"FE\",#REF!),SUMIF(#REF!,\"PO\",#REF!),SUMIF(#REF!,\"PLH\",#REF!),SUMIF(#REF!,\"PLB\",#REF!),SUMIF(#REF!,\"ME\",#REF!),SUMIF(#REF!,\"FE\",#REF!),SUMIF(#REF!,\"PO\",#REF!),SUMIF(#REF!,\"PLH\",#REF!),SUMIF(#REF!,\"PLB\",#REF!)))/(SUM('local 1'!$F$11,'local 2'!$F$11,'local 3'!$F$11,'local 4'!$F$11,'local 5'!$F$11,#REF!,#REF!,#REF!,#REF!,#REF!)),0)","v":0},{"$f":"IFERROR((SUM(SUMIF('local 1'!B18:B39,\"PT\",'local 1'!O18:O39),SUMIF('local 2'!B18:B39,\"PT\",'local 2'!O18:O39),SUMIF('local 3'!B18:B39,\"PT\",'local 3'!O18:O39),SUMIF('local 4'!B18:B39,\"PT\",'local 4'!O18:O39),SUMIF('local 5'!B18:B39,\"PT\",'local 5'!O18:O39),SUMIF(#REF!,\"PT\",#REF!),SUMIF(#REF!,\"PT\",#REF!),SUMIF(#REF!,\"PT\",#REF!),SUMIF(#REF!,\"PT\",#REF!),SUMIF(#REF!,\"PT\",#REF!)))/(SUM('local 1'!$F$9,'local 2'!$F$9,'local 3'!$F$9,'local 4'!$F$9,'local 5'!$F$9,#REF!,#REF!,#REF!,#REF!,#REF!)),0)","v":0},{"$f":"IFERROR((SUM(SUMIF('local 1'!B18:B39,\"PT\",'local 1'!O18:O39),SUMIF('local 2'!B18:B39,\"PT\",'local 2'!O18:O39),SUMIF('local 3'!B18:B39,\"PT\",'local 3'!O18:O39),SUMIF('local 4'!B18:B39,\"PT\",'local 4'!O18:O39),SUMIF('local 5'!B18:B39,\"PT\",'local 5'!O18:O39),SUMIF(#REF!,\"PT\",#REF!),SUMIF(#REF!,\"PT\",#REF!),SUMIF(#REF!,\"PT\",#REF!),SUMIF(#REF!,\"PT\",#REF!),SUMIF(#REF!,\"PT\",#REF!)))/(SUM('local 1'!$F$11,'local 2'!$F$11,'local 3'!$F$11,'local 4'!$F$11,'local 5'!$F$11,#REF!,#REF!,#REF!,#REF!,#REF!)),0)","v":0}]
[null,null,null,null,null,"déperditions statiques et aérauliques hors ponts thermiques","déperditions linéiques"]
[null,null,null,null,null,{"$f":"(F9*100)/E9","v":96.959434033265595},{"$f":"(G9*100)/E9","v":3.0405659667344023},null,"Proportion des déperditions linéiques du bâtiment :"]
[null,"Déperditions statiques et aérauliques par m² de surface plancher :"]
[null,"Déperditions par m² (en W)",{"$f":"IFERROR(E9/('local 1'!F9+'local 2'!F9+'local 3'!F9+'local 4'!F9+'local 5'!F9+#REF!+#REF!+#REF!+#REF!+#REF!),0)","v":0}]
[]
[null,"Déperditions statiques et aérauliques rapportée au volume :"]
{"$rows_left_out":43}