{"text_format":"1","workbook":"xlsx","n_sheets":4,"sheets":["Fiche contrat classe","Fiche contrat type","Referentiel Bac Pro TMA","Referentiel Bac Pro TFBMA"],"not_rendered":{"charts":0,"images":7,"macros":1,"external_links":0,"defined_names":147,"comments":0,"pivot_tables":0},"unopened":[],"bounds":{"document_bytes":16777216,"sheet_cells":100000,"rows_first":2000,"rows_last":500,"rows_between":2000,"halvings":0,"cell_chars":16384,"cell_head_chars":4096},"cells_cut":0,"cells_raw":0,"read":"whole","date_system":"1900"}

{"sheet":"Fiche contrat classe","index":0,"n_rows":1,"n_cols":2,"rows_kept":1,"cut":false,"hidden":false,"merged":[]}
[null,"Fiche contrat classe"]

{"sheet":"Fiche contrat type","index":1,"n_rows":63,"n_cols":16,"rows_kept":63,"cut":false,"hidden":false,"merged":[[10,0,10,5],[17,0,17,1],[18,0,18,1],[19,0,19,1],[12,2,12,8],[13,2,13,8],[15,0,16,1],[15,2,15,6],[15,7,15,11],[16,2,16,3],[16,4,16,5],[21,7,21,8],[21,0,21,1],[17,3,17,6],[18,3,18,6],[19,2,19,3],[19,4,19,5],[20,0,20,1]]}
[null,"Fiche contrat type"]
[]
[]
[]
[]
[null,null,null,null,null,null,null,null,null,null,null,null,null,null,null,"début"]
["Nom :"]
["Prénom :",null,null,null,"Fiche contrat objet confectionné",{"$f":"COUNTIF(INDIRECT(\"E\" & ROW() & \":$E$5000\"),E8)","v":1}]
["Classe :"]
[]
["Technicien_de_Fabrication_Bois_et_Matériaux_Associés",null,null,null,null,null,null,null,null,null,null,null,null,null,null,"titre"]
[]
["Centre d’intérêt : "]
["Objectif: "]
[]
["ON DONNE",null,"REFERENTIEL",null,null,null,null,"Notation"]
[null,null,"ON DEMANDE",null,"ON EXIGE (critères d’évaluation)",null,"Compétence","A","B","C","D","Coef"]
[null,null,"C_1_F",{"$f":"VLOOKUP(C18,'Referentiel Bac Pro TFBMA'!$A$149:$I$771,2,FALSE)","v":"S’INFORMER, ANALYSER"},null,null,null,null,null,null,null,null,null,null,null,"capacité"]
[null,null,"C_1.1_F",{"$f":"VLOOKUP(C19,'Referentiel Bac Pro TFBMA'!$A$149:$I$771,2,FALSE)","v":"Analyser,étudier les données de définition."},null,null,null,null,null,null,null,null,null,null,null,"compétence"]
[null,null,{"$f":"VLOOKUP(G20,'Referentiel Bac Pro TFBMA'!$A$149:$I$771,2,FALSE)","v":"Identifier et localiser les composants et les liaisons"},null,"_ Vérification qualité, composition",null,"C_1.1.1_F",null,null,null,null,1,null,{"$f":"M20*20/(100*L20)","v":0},null,"sous-compétence"]
[null,null,null,null,null,null,null,null,null,null,null,null,null,null,null,"libre"]
[null,null,null,null,null,null,"Objectif atteint:",{"$f":"L22*0.05","v":0},null,null,"Note sur 20 points:",{"$f":"(SUM(M17:M21)*20)/(SUM(L17:L21)*100)","v":0},null,null,null,"fin"]
[]
[]
[]
[]
[]
[]
[]
[]
[]
[]
[]
[]
[]
[]
[]
[]
[]
[]
[]
[]
[]
[]
[]
[]
[]
[]
[]
[]
[]
[{"$f":"'Referentiel Bac Pro TFBMA'!AV182","v":"Referentiel_pr_Capacités"},{"$f":"'Referentiel Bac Pro TFBMA'!AW182","v":"Technicien_de_Fabrication_Bois_et_Matériaux_Associés"},{"$f":"'Referentiel Bac Pro TFBMA'!AX182","v":"Technicien_Menuisier_Agenceur"}]
[null,{"$f":"'Referentiel Bac Pro TFBMA'!AW183","v":"C_1_F"},{"$f":"'Referentiel Bac Pro TFBMA'!AX183","v":"C_1_A"}]
[null,{"$f":"'Referentiel Bac Pro TFBMA'!AW184","v":"C_2_F"},{"$f":"'Referentiel Bac Pro TFBMA'!AX184","v":"C_2_A"}]
[null,{"$f":"'Referentiel Bac Pro TFBMA'!AW185","v":"C_3_F"},{"$f":"'Referentiel Bac Pro TFBMA'!AX185","v":"C_3_A"}]
[null,{"$f":"'Referentiel Bac Pro TFBMA'!AW186","v":"C_4_F"},{"$f":"'Referentiel Bac Pro TFBMA'!AX186","v":"C_4_A"}]
[null,{"$f":"'Referentiel Bac Pro TFBMA'!AW187","v":"C_5_F"},{"$f":"'Referentiel Bac Pro TFBMA'!AX187","v":"C_5_A"}]
[null,null,{"$f":"'Referentiel Bac Pro TFBMA'!AX188","v":"C_6_A"}]
[]
[]
[]
[{"$f":"'Referentiel Bac Pro TFBMA'!AV192","v":"Tableau intermédiare pour liste déroutante avec variable"},{"$f":"'Referentiel Bac Pro TFBMA'!AW192","v":"Technicien_de_Fabrication_Bois_et_Matériaux_Associés"},"B",{"$f":"VLOOKUP($A$11,B62:C63,2,FALSE)","v":"B"}]
[null,{"$f":"'Referentiel Bac Pro TFBMA'!AW193","v":"Technicien_Menuisier_Agenceur"},"C"]

{"sheet":"Referentiel Bac Pro TMA","index":2,"n_rows":957,"n_cols":6,"rows_kept":957,"cut":false,"hidden":false,"merged":[[950,0,955,0],[950,1,955,4],[956,0,961,0],[956,1,961,4],[932,0,937,0],[932,1,937,4],[938,0,943,0],[938,1,943,4],[944,0,949,0],[944,1,949,4],[914,0,919,0],[914,1,919,4],[920,0,925,0],[920,1,925,4],[926,0,931,0],[926,1,931,4],[896,0,901,0],[896,1,901,4],[902,0,907,0],[902,1,907,4],[908,0,913,0],[908,1,913,4],[878,0,883,0],[878,1,883,4],[884,0,889,0],[884,1,889,4],[890,0,895,0],[890,1,895,4],[860,0,865,0],[860,1,865,4],[866,0,871,0],[866,1,871,4],[872,0,877,0],[872,1,877,4],[842,0,847,0],[842,1,847,4],[848,0,853,0],[848,1,853,4],[854,0,859,0],[854,1,859,4],[824,0,829,0],[824,1,829,4],[830,0,835,0],[830,1,835,4],[836,0,841,0],[836,1,841,4],[806,0,811,0],[806,1,811,4],[812,0,817,0],[812,1,817,4],[818,0,823,0],[818,1,823,4],[788,0,793,0],[788,1,793,4],[794,0,799,0],[794,1,799,4],[800,0,805,0],[800,1,805,4],[770,0,775,0],[770,1,775,4],[776,0,781,0],[776,1,781,4],[782,0,787,0],[782,1,787,4],[752,0,757,0],[752,1,757,4],[758,0,763,0],[758,1,763,4],[764,0,769,0],[764,1,769,4],[734,0,739,0],[734,1,739,4],[740,0,745,0],[740,1,745,4],[746,0,751,0],[746,1,751,4],[716,0,721,0],[716,1,721,4],[722,0,727,0],[722,1,727,4],[728,0,733,0],[728,1,733,4],[698,0,703,0],[698,1,703,4],[704,0,709,0],[704,1,709,4],[710,0,715,0],[710,1,715,4],[680,0,685,0],[680,1,685,4],[686,0,691,0],[686,1,691,4],[692,0,697,0],[692,1,697,4],[662,0,667,0],[662,1,667,4],[668,0,673,0],[668,1,673,4],[674,0,679,0],[674,1,679,4],[644,0,649,0],[644,1,649,4],[650,0,655,0],[650,1,655,4],[656,0,661,0],[656,1,661,4],[638,0,643,0],[638,1,643,4],[620,0,625,0],[620,1,625,4],[626,0,631,0],[626,1,631,4],[632,0,637,0],[632,1,637,4],[602,0,607,0],[602,1,607,4],[608,0,613,0],[608,1,613,4],[614,0,619,0],[614,1,619,4],[584,0,589,0],[584,1,589,4],[590,0,595,0],[590,1,595,4],[596,0,601,0],[596,1,601,4],[566,0,571,0],[566,1,571,4],[572,0,577,0],[572,1,577,4],[578,0,583,0],[578,1,583,4],[548,0,553,0],[548,1,553,4],[554,0,559,0],[554,1,559,4],[560,0,565,0],[560,1,565,4],[530,0,535,0],[530,1,535,4],[536,0,541,0],[536,1,541,4],[542,0,547,0],[542,1,547,4],[512,0,517,0],[512,1,517,4],[518,0,523,0],[518,1,523,4],[524,0,529,0],[524,1,529,4],[494,0,499,0],[494,1,499,4],[500,0,505,0],[500,1,505,4],[506,0,511,0],[506,1,511,4],[476,0,481,0],[476,1,481,4],[482,0,487,0],[482,1,487,4],[488,0,493,0],[488,1,493,4],[458,0,463,0],[458,1,463,4],[464,0,469,0],[464,1,469,4],[470,0,475,0],[470,1,475,4],[440,0,445,0],[440,1,445,4],[446,0,451,0],[446,1,451,4],[452,0,457,0],[452,1,457,4],[422,0,427,0],[422,1,427,4],[428,0,433,0],[428,1,433,4],[434,0,439,0],[434,1,439,4],[404,0,409,0],[404,1,409,4],[410,0,415,0],[410,1,415,4],[416,0,421,0],[416,1,421,4],[386,0,391,0],[386,1,391,4],[392,0,397,0],[392,1,397,4],[398,0,403,0],[398,1,403,4],[368,0,373,0],[368,1,373,4],[374,0,379,0],[374,1,379,4],[380,0,385,0],[380,1,385,4],[345,0,350,0],[345,1,350,4],[356,0,361,0],[356,1,361,4],[362,0,367,0],[362,1,367,4],[327,0,332,0],[327,1,332,4],[333,0,338,0],[333,1,338,4],[339,0,344,0],[339,1,344,4],[309,0,314,0],[309,1,314,4],[315,0,320,0],[315,1,320,4],[321,0,326,0],[321,1,326,4],[291,0,296,0],[291,1,296,4],[297,0,302,0],[297,1,302,4],[303,0,308,0],[303,1,308,4],[273,0,278,0],[273,1,278,4],[279,0,284,0],[279,1,284,4],[285,0,290,0],[285,1,290,4],[261,0,266,0],[261,1,266,4],[267,0,272,0],[267,1,272,4],[237,0,242,0],[237,1,242,4],[243,0,248,0],[243,1,248,4],[249,0,254,0],[249,1,254,4],[225,0,230,0],[225,1,230,4],[231,0,236,0],[231,1,236,4],[207,0,212,0],[207,1,212,4],[213,0,218,0],[213,1,218,4],[255,0,260,0],[255,1,260,4],[163,0,163,8],[1,0,1,7],[2,0,2,4],[24,0,24,4],[46,0,46,4],[87,0,87,4],[132,0,132,4],[147,0,147,4],[219,0,224,0],[219,1,224,4]]}
[null,"Referentiel Bac Pro TMA"]
["CAPACITÉS, Compétences et sous compétences"]
["C1 S’INFORMER, ANALYSER"]
["C1-1 : Décoder et analyser les données de définition"]
[null,"C1.1.1","Identifier le contexte del’intervention lié à la fabrication et à la mise en oeuvre sur le chantier"]
[null,"C1.1.2","Décoder et interpréter des documents."]
[null,"C1.1.3","Extraire et classer les informations."]
[null,"C1.1.4","Identifier les ouvrages, les sous-ensembles, les éléments."]
[null,"C1.1.5","Identifier les caractéristiques géométriques et dimensionnelles."]
[null,"C1.1.6","Identifier et répertorier les liaisons."]
[null,"C1.1.7","Identifier les conditions de fonctionnement (mobilité…)."]
["C1-2 : Décoder et analyser les données opératoires"]
[null,"C1.2.1 ","Identifier et analyser les étapes de fabrication, de pose, de\ndépose, de maintenance"]
[null,"C1.2.2 ","Identifier et classer les tâches ou les interventions des\nsecteurs d’activités connexes"]
[null,"C1.2.3 ","Identifier et recenser les moyens de fabrication et de mise\nen oeuvre."]
["C1-3 : Décoder et analyser les données de gestion"]
[null,"C1.31","Décoder et analyser les documents de gestion."]
[null,"C1.32","Mettre en relation :\n_ les données de définition et les moyens de fabrication et de pose,\n_ la chronologie des opérations et les approvisionnements"]
["C1-4: Relever et réceptionner une situation de chantier"]
[null,"C1.41","Identifier l’environnement du chantier (accès, arrivées des\nénergies, stockage…)."]
[null,"C1.42","Relever les caractéristiques dimensionnelles, géométriques et physiques des supports et des espaces à agencer"]
[null,"C1.43","Réceptionner les supports."]
[null,"C1.44","Relever les positions de l’ouvrage à installer."]
[null,"C1.45","Consigner les contraintes techniques, mécaniques et esthétiques (charges, passage des réseaux….)"]
["C2 TRATER, DÉCIDER, PRÉPARER"]
["C2-1 : Choisir et adapter des solutions techniques"]
[null,"C2.1.1 ","Inventorier les caractéristiques techniques relatives :\n_ aux matériaux, produits, supports et équipements à\ndisposition,\n_ aux ouvrages et à leurs spécificités,\n_ au type de matériel à utiliser,\n_ à la qualité exigée,\n_ à la mise en sécurité du personnel"]
[null,"C2.1.2 ","Comparer  les performances techniques sur le plan :\n_ esthétique,\n_ technologique,\n_ ergonomique,\n_ Économique."]
[null,"C2.1.3","Choisir, proposer et/ou adapter une ou des solutions techniques relatives aux :\n_ matériaux, produits, supports et équipements,\n_ aux ouvrages avec leurs valeurs dimensionnements,\nleurs liaisons et principes de pose,\n_ au type de matériel à utiliser"]
[null,"C2.1.4","Justifier les choix et/ou les solutions techniques."]
["C2-2 : Établir les plans et tracés d’exécution d’un ouvrage"]
[null,"C2.2.1 "," Représenter et réaliser sous forme papier ou informatisée et autres supports :\n_ les relevés de situation de chantiers,\n_ les tracés d’atelier (épure, plan sur règle, gabarit,\nmontage d’usinage…),\n_ les dessins de fabrication,\n_ les tracés des formes complexes (chapeau de\ngendarme, anse de panier, vraies grandeurs, angle de corroyage"]
["C2-3 : Établir les quantitatifs de matériaux et de composants"]
[null,"C2.3.1 ","Répertorier, quantifier produits, matériaux, matériels et/ou composants"]
[null,"C2.3.2 ","Optimiser :\nles débits et les quantités.\n"]
[null,"C2.3.3","Établir et renseigner les documents techniques permettant la fabrication, la pose et/ou le suivi (feuille de débit, bon de commande, plan de calepinage)."]
["C2-4 : Établir le processus de fabrication, de dépose et de pose"]
[null,"C2.4.1 ","Répertorier les phases de la fabrication, de la pose et/ou de la dépose."]
[null,"C2.4.2 ","Recenser les moyens humains et matériels."]
[null,"C2.4.3 ","Établir les antériorités."]
[null,"C2.4.4 ","Élaborer le processus de fabrication de pose ou de dépose.\n- chronologie des opérations\n- références et surfaces d’appui\n- outillages et accessoires associés aux étapes\n- réglages, contrôles et corrections à effectuer\n- prévention des risques professionnels"]
["C2-5 : Établir les documents de suivi de réalisation"]
[null,"C2.5.1","Identifier les différents documents de suivi (planning, fiche\nsuiveuse, fiche de stock, fiche qualité, fiche de maintenance)"]
[null,"C2.5.2","Recenser les données liées :\n_ à la matière d’oeuvre,\n_ aux moyens humains et matériels,\n_ aux processus de fabrication et de mise en oeuvre sur chantier,\n_ aux contraintes de temps,\n_ à la coordination avec les autres corps d’état."]
[null,"C2.5.3","Renseigner les documents."]
[null,"C2.5.4","Proposer des ajustements."]
["C3 FABRIQUER"]
["C3-1 : Organiser et mettre en sécurité les postes de travail"]
[null,"C3.1.1 ","Identifier les risques d’accident et les risques d’atteinte à la santé liés au poste de travail."]
[null,"C3.1.2 ","Mettre en oeuvre les mesures de prévention"]
[null,"C3.1.3 ","Choisir et préparer les machines, matériel, outillages associés et/ou accessoires nécessaires (repérage et débit, usinage, contrôle, montage, mise en forme, finition,\nconditionnement…)."]
[null,"C3.1.4 ","Organiser les cheminements de la matière d'œuvre"]
[null,"C3.1.5 ","Disposer rationnellement les supports et les accessoires en amont et en aval des postes de travail"]
[null,"C3.1.6","Proposer des solutions d'amélioration des postes de travail"]
["C3-2 : Préparer les matériaux, les quincailleries et les accessoires"]
[null,"C3.2.1 ","Sélectionner et contrôler les matériaux, les quincailleries et les accessoires."]
[null,"C3.2.2 ","Approvisionner les matériaux, quincailleries et\naccessoires suivant les postes de travail."]
[null,"C3.2.3 ","Orienter et repérer les pièces et/ou sousensembles à usiner, à monter, à finir."]
["C3-3 : Installer et régler les outillages"]
[null,"C3.3.1 ","Choisir les outils"]
[null,"C3.3.2","Prérégler les outils associés."]
[null,"C3.3.3","Identifier sur la machine les organes de réglage et de commande"]
[null,"C3.3.4","Mettre et maintenir en position le ou les montages d’usinage, le ou les appareillages."]
[null,"C3.3.5","Installer les outils et régler les positions relatives au couple outil/pièce."]
[null,"C3.3.6","Identifier, sélectionner et/ou modifier les données nécessaires à l’opération (vitesse, cycles…)."]
["C3-4 : Conduire les opérations d’usinage : machines conventionnelles,\nPN, CN"]
[null,"C3.4.1 ","Procéder à la mise en route des mouvements nécessaires à l'opération"]
[null,"C3.4.2 ","Usiner les éléments"]
[null,"C3.4.3","Contrôler les éléments usinés"]
[null,"C3.4.4 ","Effectuer les actions correctives nécessaires"]
[null,"C3.4.5 ","Remettre les postes de travail dans leur état initial."]
["C3-5 : Conduire les opérations de mise en forme et de placage"]
[null,"C3.5.1 ","Positionner et régler les systèmes de serrage, de pressage, d’assemblage, de cadrage."]
[null,"C3.5.2","Encoller et/ou insérer les pièces et composants."]
[null,"C3.5.3","Cadrer, presser et solidariser les pièces et les composants."]
[null,"C3.5.4","Contrôler les caractéristiques mécaniques dimensionnelles, géométriques et esthétiques."]
[null,"C3.5.5","Effectuer si nécessaire les actions correctives."]
[null,"C3.5.6","Desserrer et extraire l’ouvrage."]
[null,"C3.5.7","Remettre le poste de travail dans son état initial"]
["C3-6 : Conduire les opérations de montage et de finition"]
{"$rows_left_out":878}
{"sheet":"Referentiel Bac Pro TFBMA","index":3,"n_rows":776,"n_cols":51,"rows_kept":776,"cut":false,"hidden":false,"merged":[[758,0,763,0],[758,1,763,4],[764,0,769,0],[764,1,769,4],[770,0,775,0],[770,1,775,4],[740,0,745,0],[740,1,745,4],[746,0,751,0],[746,1,751,4],[752,0,757,0],[752,1,757,4],[716,0,721,0],[716,1,721,4],[728,0,733,0],[728,1,733,4],[734,0,739,0],[734,1,739,4],[722,0,727,0],[722,1,727,4],[698,0,703,0],[698,1,703,4],[704,0,709,0],[704,1,709,4],[710,0,715,0],[710,1,715,4],[680,0,685,0],[680,1,685,4],[686,0,691,0],[686,1,691,4],[692,0,697,0],[692,1,697,4],[662,0,667,0],[662,1,667,4],[668,0,673,0],[668,1,673,4],[674,0,679,0],[674,1,679,4],[644,0,649,0],[644,1,649,4],[650,0,655,0],[650,1,655,4],[656,0,661,0],[656,1,661,4],[626,0,631,0],[626,1,631,4],[632,0,637,0],[632,1,637,4],[638,0,643,0],[638,1,643,4],[608,0,613,0],[608,1,613,4],[614,0,619,0],[614,1,619,4],[620,0,625,0],[620,1,625,4],[590,0,595,0],[590,1,595,4],[596,0,601,0],[596,1,601,4],[602,0,607,0],[602,1,607,4],[572,0,577,0],[572,1,577,4],[578,0,583,0],[578,1,583,4],[584,0,589,0],[584,1,589,4],[554,0,559,0],[554,1,559,4],[560,0,565,0],[560,1,565,4],[566,0,571,0],[566,1,571,4],[536,0,541,0],[536,1,541,4],[542,0,547,0],[542,1,547,4],[548,0,553,0],[548,1,553,4],[518,0,523,0],[518,1,523,4],[524,0,529,0],[524,1,529,4],[530,0,535,0],[530,1,535,4],[500,0,505,0],[500,1,505,4],[506,0,511,0],[506,1,511,4],[512,0,517,0],[512,1,517,4],[482,0,487,0],[482,1,487,4],[488,0,493,0],[488,1,493,4],[494,0,499,0],[494,1,499,4],[464,0,469,0],[464,1,469,4],[470,0,475,0],[470,1,475,4],[476,0,481,0],[476,1,481,4],[446,0,451,0],[446,1,451,4],[452,0,457,0],[452,1,457,4],[458,0,463,0],[458,1,463,4],[428,0,433,0],[428,1,433,4],[434,0,439,0],[434,1,439,4],[440,0,445,0],[440,1,445,4],[410,0,415,0],[410,1,415,4],[416,0,421,0],[416,1,421,4],[422,0,427,0],[422,1,427,4],[392,0,397,0],[392,1,397,4],[398,0,403,0],[398,1,403,4],[404,0,409,0],[404,1,409,4],[374,0,379,0],[374,1,379,4],[380,0,385,0],[380,1,385,4],[386,0,391,0],[386,1,391,4],[356,0,361,0],[356,1,361,4],[362,0,367,0],[362,1,367,4],[368,0,373,0],[368,1,373,4],[338,0,343,0],[338,1,343,4],[344,0,349,0],[344,1,349,4],[350,0,355,0],[350,1,355,4],[320,0,325,0],[320,1,325,4],[326,0,331,0],[326,1,331,4],[332,0,337,0],[332,1,337,4],[302,0,307,0],[302,1,307,4],[308,0,313,0],[308,1,313,4],[314,0,319,0],[314,1,319,4],[284,0,289,0],[284,1,289,4],[290,0,295,0],[290,1,295,4],[296,0,301,0],[296,1,301,4],[266,0,271,0],[266,1,271,4],[272,0,277,0],[272,1,277,4],[278,0,283,0],[278,1,283,4],[248,0,253,0],[248,1,253,4],[254,0,259,0],[254,1,259,4],[260,0,265,0],[260,1,265,4],[230,0,235,0],[230,1,235,4],[236,0,241,0],[236,1,241,4],[242,0,247,0],[242,1,247,4],[212,0,217,0],[212,1,217,4],[218,0,223,0],[218,1,223,4],[224,0,229,0],[224,1,229,4],[194,0,199,0],[194,1,199,4],[200,0,205,0],[200,1,205,4],[206,0,211,0],[206,1,211,4],[182,1,187,4],[182,0,187,0],[188,0,193,0],[188,1,193,4],[134,0,134,4],[1,0,1,7],[2,0,2,4],[28,0,28,4],[66,0,66,4],[103,0,103,4]]}
[null,"Referentiel Bac Pro TFBMA"]
["CAPACITÉS, Compétences et sous compétences"]
["C1 S’INFORMER, ANALYSER"]
["C1-1 : Analyser,étudier les données de définition."]
[null,"C1.1.1","Identifier et localiser les composants et les liaisons"]
[null,"C1.1.2","Localiser et interpréter les mouvements"]
[null,"C1.1.3","Décrire et justifier une solution technique"]
[null,"C1.1.4","Identifier et interpréter les spécification géométriques, dimensionnelles, les états de surfaces."]
[null,"C1.1.5","Etablir des schémas, des croquis des solutions techniques"]
[null,"C1.1.6","reconnaitre les spécifications des matériaux (carctéristiques dans une base de données ou sur un réseau)"]
["C1-2 : Analyser les données opératoires"]
[null,"C1.2.1 ","Analyser et justifier la chronologie des étapes de production"]
[null,"C1.2.2 ","Identifier et justifier les surfaces de références"]
[null,"C1.2.3 ","reconnaitre l'état de transformation du produit ( de la pièce)"]
[null,"C1.2.4 ","Repérer les machines et les outils nécessaires à la fabrication"]
[null,"C1.2.5 ","Vérifier si les systèmes de transfert et/ou de manutention sont adaptés"]
[null,"C1.2.6","Justifier l’utilisation d’un montage d’usinage et vérifier sa disponibilité."]
[null,"C1.2.7","Vérifier si les opérations de fabrication peuvent être réalisées dans le respect des conditions de sécurité pour les opérateurs."]
["C1-3 : Analyser les données de gestion"]
[null,"C1.31","Analyser et identifier les différents temps prévisionnels du cycle de production."]
[null,"C1.32","Analyser et justifier les éléments de coût relatifs aux indicateurs de production. (délais, temps, quantités de production...)."]
[null,"C1.33","Analyser les éléments de gestion de l’approvisionnement :"]
[null,null," -          nature et quantités"]
[null,null,"-          qualité, composition"]
[null,null," -          périodicité de l’approvisionnement."]
["C1-4: Emettre des propositions d'amélioration"]
[null,"C1.41","Identifier des possibilités de rationalisation et d’optimisation relatives aux procédés, matériels et outils utilisés."]
[null,"C1.42","Identifier des possibilités de rationalisation et d’optimisation relatives aux procédés, matériels et outils utilisés."]
["C2 TRAITER, DECIDER"]
["C2-1 : Etablir le processus de production"]
[null,"C2.1.1 ","Recenser les étapes et les contraintes de production."]
[null,"C2.1.2 ","Choisir un matériel en fonction des taux de charge."]
["C2-2 : Etablir un mode opératoire"]
[null,"C2.2.1 ","Établir le mode opératoire :"]
[null,null,"de montage,"]
[null,null,"de contrôle,"]
[null,null,"de finition,"]
[null,null,"de conditionnement."]
[null,"C2.2.2 ","Définir, pour chaque mode opératoire, la nature, l’ordre chronologique des opérations, et les moyens matériels. "]
[null,"C2.2.3","Définir les moyens humains."]
["C2-3 : Etablir des documents de fabrication"]
[null,"C2.3.1 ","Établir une gamme d’usinage, une planification, un contrat de phase…"]
[null,"C2.3.2 ","Élaborer une fiche de débit."]
[null,"C2.3.3","Proposer des solutions pour optimiser les coûts, les processus, le rendement matière…"]
["C2-4 : Etablir les quantitatifs de matériaux et composants"]
[null,"C2.4.1 ","Lister et quantifier les matériaux, composants, accessoires."]
[null,"C2.4.2 ","Regrouper les composants par famille, processus, formes, matériaux…"]
[null,"C2.4.3 ","Optimiser le rendement matière en fonction :"]
[null,null," - des dimensions commerciales"]
[null,null," - de l’état des stocks"]
[null,"C2.4.4 ","Renseigner le document de suivi de fabrication :"]
[null,null," - les quantités matières"]
[null,null," - les consommables"]
[null,null," - les temps passés"]
["C2-5 : Elaborer un programme avec un logiciel de FAO"]
[null,"C2.5.1","Renseigner les variables dimensionnelles."]
[null,"C2.5.2","Identifier les référentiels. (Prise Origine Machine, Prise RÉFérence, DÉCalage)."]
[null,"C2.5.3","Générer le programme."]
[null,"C2.5.4","Valider par simulation graphique."]
[null,"C2.5.5","Éditer ou afficher les fiches outils si nécessaire."]
["C2-6 : Choisir et prérégler des outils, des apareillages"]
[null,"C2.6.1","Choisir les outils en rapport avec les usinages attendus."]
[null,"C2.6.2","Effectuer les réglages externes."]
[null,"C2.6.3","Déterminer et Mesurer les jauges outils."]
[null,"C2.6.4","Vérifier la disponibilité de l’appareillage spécifique (montage d’usinage…)."]
[null,"C2.6.5","Préparer l’appareillage spécifique (montage d’usinage…)."]
["C3 METTRE EN ŒUVRE"]
["C3-1 : Mettre en œuvre un moyen de fabrication"]
[null,"C3.1.1 ","Introduire les programmes ou paramètres en mémoire."]
[null,"C3.1.2 ","Régler et monter les outils entre-eux."]
[null,"C3.1.3 ","Mettre en position les outils sur les broches, fourreaux, sur les têtes multibroches ou magasins d’outils."]
[null,"C3.1.4 ","Introduire les jauges outils."]
[null,"C3.1.5 ","Régler les référentiels machine ou Prendre les références machines (PREF), décalage d’origine…"]
[null,"C3.1.6","Fabriquer ou modifier les montages d’usinage."]
[null,"C3.1.7","Installer et régler les montages d’usinage."]
[null,"C3.1.8","Installer et régler les dispositifs d’amenage, les systèmes de transfert et d’approvisionnement."]
[null,"C3.1.9","Installer et régler les dispositifs de sécurité."]
[null,"C3.1.10","Tester le cycle d’usinage."]
[null,"C3.1.11","Vérifier la conformité du réglage."]
[null,"C3.1.12","Apporter si nécessaire les modifications."]
{"$rows_left_out":696}