{"text_format":"1","workbook":"xlsx","n_sheets":5,"sheets":["Feuil1","Ouvrier1","Ouvrier2","Ouvrier3","Heures chantier"],"not_rendered":{"charts":0,"images":0,"macros":1,"external_links":0,"defined_names":0,"comments":0,"pivot_tables":0},"unopened":[],"bounds":{"document_bytes":16777216,"sheet_cells":100000,"rows_first":2000,"rows_last":500,"rows_between":2000,"halvings":0,"cell_chars":16384,"cell_head_chars":4096},"cells_cut":0,"cells_raw":0,"read":"whole","date_system":"1900"}

{"sheet":"Feuil1","index":0,"n_rows":1625,"n_cols":2,"rows_kept":1625,"cut":false,"hidden":false,"merged":[]}
["A","Absent"]
["C","Congé"]
["CL00001","Decaluwé"]
["CL00002","SUCRERIE COUPLET"]
["CL00003","Leclercq"]
["CL00004","SAINT BRICE"]
["CL00005","Draux"]
["CL00006","IMPACT CONCEPT"]
["CL00007","PORTAKABIN (Frank Vandermeersch)"]
["CL00008","LIXON"]
["CL00009","CLINIQUE NOTRE DAME"]
["CL00010","FAMECO"]
["CL00011","Theuninck"]
["CL00012","A.I.T. asbl"]
["CL00013","TURKOISE"]
["CL00014","YA.LI."]
["CL00015","Paul"]
["CL00016","Fouré"]
["CL00017","Moulard"]
["CL00018","Ledent"]
["CL00019","EDDY DEVOS CONSTRUCTION"]
["CL00020","Carette"]
["CL00021","GEO PINION"]
["CL00022","GUBIN - DEGRAVE"]
["CL00023","Berte"]
["CL00024","Bauduin"]
["CL00025","ICR GROUPE IMPRIMERIE"]
["CL00026","Spaneut"]
["CL00027","Mitchell"]
["CL00028","PROVINCE DE HAINAUT"]
["CL00029","IPALLE"]
["CL00031","F.G.T.B."]
["CL00032","MAISON DE LA SAINTE UNION"]
["CL00033","LESURE"]
["CL00034","Idéal Logis"]
["CL00035","Desmette"]
["CL00036","Fievet"]
["CL00037","WATTIAUX"]
["CL00038","Collège Notre-Dame de la Tombe"]
["CL00039","MUJEKA SARL"]
["CL00040","adminis. générale de l'infrastructure"]
["CL00041","Casterman"]
["CL00042","U.C.B. PHARMA SA"]
["CL00043","RECYHOC"]
["CL00044","Claus"]
["CL00045","Moumal"]
["CL00046","FREUDENBERG - BAUSYSTEME"]
["CL00047","fabrique d'eglise Saint Etienne"]
["CL00048","Lemoine"]
["CL00049","Bourgois - De Valensart"]
["CL00050","Belpeer"]
["CL00051","SPRLU HAND RESCUE"]
["CL00052","ECOLE DES FRERES"]
["CL00053","CORSICAR"]
["CL00054","OPTIQUE OLIVIER"]
["CL00055","DEMEIRE"]
["CL00056","CUBILOFT"]
["CL00057","Dubus"]
["CL00058","ETHIAS"]
["CL00059","Gobet"]
["CL00060","HOME SAINT JEAN"]
["CL00061","MORLIGHEM"]
["CL00062","HELEU"]
["CL00063","GUILLAUME"]
["CL00064","LOUIS Daniel"]
["CL00066","OPTIQUE OLIVIER"]
["CL00067","GALAPAGOS"]
["CL00068","Buys"]
["CL00069","MAGASIN BLONDEAU"]
["CL00070","Le Renouveau Saint-Joseph"]
["CL00071","Académie des Beaux-Arts"]
["CL00072","GOULEM"]
["CL00074","D'HONT Nicole"]
["CL00075","LEBLON"]
["CL00076","Fabrique d'Eglise St Quentin/St Jacques"]
["CL00077","BENELUX ASSIST"]
["CL00078","Pottiez Sylvie"]
["CL00079","Delneste Olivier"]
["CL00080","OTTEVAERE Thierry"]
["CL00081","Aquitaine"]
["CL00082","Detournay"]
["CL00083","Leclercq Michel"]
["CL00084","Maillet"]
["CL00085","Carlier"]
["CL00086","DELHAYE"]
["CL00087","DESINGE"]
["CL00088","FRANCOIS Philippe"]
["CL00089","Bureau d'architecture Moulin"]
["CL00090","TARKETT"]
["CL00091","Choisez"]
["CL00092","Rousseau"]
["CL00093","SALUC"]
["CL00094","COIFSTYL"]
["CL00095","BLONVAL SARL"]
["CL00096","Devianne"]
["CL00097","BLONDEAU SARL"]
["CL00098","Crèche le Rameau d'Olivier"]
["CL00099","Capenol - Schramme"]
["CL00100","Maes"]
["Cl00100/1","Test"]
["CL00101","IMMO F.H."]
["CL00102","INVEST MANAGEMENT"]
["CL00103","NOTRE DAME DE LA MERCI"]
["CL00104","DEPAUW Michaël"]
["CL00105","HOTEL L'EUROPE"]
["CL00106","SERVIMMO"]
["CL00107","VIDANGE ECLAIR"]
["CL00108","carosserie Lefebvre"]
["CL00109","Holvoet"]
["CL00110","FERRET JEAN-CLAUDE"]
["CL00111","Servais"]
["CL00112","Lannoije"]
["CL00113","CAFE LE SAINT AMAND"]
["CL00114","Communauté des Filles du St Esprit"]
["CL00115","Fays"]
["CL00116","S.I.P. INFORMATIQUE"]
["CL00117","CAMION LOCATION WALLONIE"]
["CL00118","LE FOYER LOUVIEROIS"]
["CL00119","Dufay"]
["CL00121","Delespeaux"]
["CL00122","Debrabant"]
["CL00123","Maillet Céline"]
["CL00124","DELVIN Vincent"]
["CL00125","BEUDIN"]
["CL00126","REDOUTE CATALOGUE BENELUX"]
["CL00127","MAISON DE LA CULTURE DE TOURNAI"]
["CL00128","CENTRE HOSPITALIER HORNU - FRAMERIES"]
["CL00129","Lannoije"]
["CL00130","Hospied Bernard"]
["CL00131","MOBELCO"]
["CL00132","COFIDIS BELGIQUE"]
["CL00133","MALADRY"]
["CL00134","Thémont"]
["CL00135","FOCLAM"]
["CL00136","FRANCOIS - DELSINNE"]
["CL00137","CASTELEYN"]
["CL00138","LESIRE"]
["CL00139","ISTACE"]
["CL00140","LIENARD"]
["CL00141","LANGUY"]
["CL00142","DUBART"]
["CL00143","STD"]
["CL00144","Dupont"]
["CL00145","Gossart"]
["CL00146","Batteauw"]
["CL00147","Delcambe"]
["CL00148","RESIDENCE AMADEUS"]
["CL00149","AU BOIS RUMOIS"]
["CL00150","CLEMENT"]
["CL00151","Henri Michel"]
["CL00152","STELLIAN"]
["CL00153","Gervois"]
["CL00154","Gobin Arnaud"]
["CL00155","WEST-CONSULTING"]
["CL00156","Jurion"]
["CL00157","Losfeld"]
["CL00158","DETOURNAY FRANCIS"]
["CL00159","Allard"]
["CL00160","INITIAL TEXTILES NV/SA"]
["CL00161","GOMAES"]
["CL00162","DEVOCHELLE"]
["CL00163","Ghins"]
["CL00164","Van de pontseele"]
["CL00165","Monseux"]
["CL00166","Walcarius"]
["CL00167","Tysebaert"]
["CL00168","Dendievel"]
["CL00169","Decaluwé"]
["CL00170","Debue"]
["CL00171","Brutin"]
["CL00172","Geiregat"]
["CL00173","Masson"]
["CL00174","EKSTEN"]
["CL00175","Vanbostal"]
["CL00176","Duhaut"]
["CL00177","G.I.T"]
["CL00178","Verbeke"]
["CL00179","Vandepapeliere"]
["CL00180","Bénichou"]
["CL00181","Goulem"]
["CL00182","Vanden Driessche"]
["CL00183","Sagaert Lesur"]
["CL00184","Legrain"]
["CL00185","Vandennieuwenborg"]
["CL00186","Trenchard"]
["CL00187","Poncelet"]
["CL00188","Mullie"]
["CL00189","InBev Belgium"]
["CL00190","DBI"]
["CL00191","Turkoise"]
["CL00192","Beuserie"]
["CL00193","COMPTIMMO"]
["CL00194","Degand"]
["CL00195","Delcroix"]
["CL00196","Liard Chantal"]
["CL00197","Tiston"]
["CL00198","Centre Educatif de la Sainte-Union"]
["CL00199","Duynslager"]
["CL00200","Hotel Alcantara"]
["CL00201","Miroux"]
["CL00202","Gence ( Au Nid Douillé )"]
["CL00203","Cauvin"]
["CL00204","Duhem"]
["CL00205","Secrétariat Social du Tournaisis"]
["CL00206","Eickmayer Ogusta"]
["CL00207","Guevart"]
["CL00208","Huys"]
["CL00209","Val de Brunehaut"]
["CL00210","Qualy"]
["CL00211","IMMO CHANTRY"]
["CL00212","Hellin"]
["CL00213","BUYS MARC"]
["CL00214","Thiébaut"]
["CL00215","Boge"]
["CL00216","Descamps Eric"]
["CL00217","Bonnet - Delory"]
["CL00218","Campener"]
["CL00219","Le Logis Tournaisien"]
["CL00220","CHP \"les Marronniers\""]
["CL00221","Dupont"]
["CL00222","HUVENNE RAPHAEL"]
["CL00223","CITY-RENT"]
["CL00224","PHARMACIE COQUEL"]
["CL00225","Bouvry - Parent"]
["CL00226","Duyck"]
["CL00227","Brouckaert"]
["CL00228","Passagez"]
["CL00229","Ponthieu"]
["CL00230","Parent"]
["CL00231","Decaluwé Jean - Marc"]
["CL00232","DALLA VALLE"]
["CL00233","Couseart - Miniscloux"]
["CL00234","Losfeld - Herbaut"]
["CL00235","Malter"]
["CL00236","Delcambe"]
["CL00237","Delcroix"]
["CL00238","Delecourt - Descamps"]
["CL00239","Bureau conseil"]
["CL00240","AD Pub"]
["CL00241","Tesse"]
["CL00242","Carré"]
["CL00243","administration communale de Brunehaut"]
["CL00244","CHAUFF-ELEC"]
["CL00245","Holvoet"]
["CL00246","Menet"]
["CL00247","Morlighem - Delabre B."]
["CL00248","KONEX"]
["CL00249","Rotsaert"]
["CL00250","Nieuwland J-F"]
["CL00251","Ducoulombier Stéphanie"]
["CL00252","Messiaen"]
["CL00253","Parys"]
["CL00254","Vivier"]
["CL00255","Magain A."]
["CL00256","SEMESOTRA"]
["CL00257","Cabinet de logopédie"]
["CL00258","Six fumaison"]
["CL00259","Leger"]
["CL00260","Vivier Paul-Marie"]
["CL00261","De Cannart"]
["CL00262","Bossut G."]
["CL00263","Liard"]
["CL00264","Delneste F."]
["CL00265","DILLIES"]
["CL00266","Rau"]
["CL00267","Rasson Louis"]
["CL00268","ADel consult"]
["CL00269","Depouhon"]
["CL00270","Docteur Bernard Georges"]
["CL00271","Lange"]
["CL00272","D'hondt"]
["CL00273","Thonnard"]
["CL00274","Atelier d'architecture 3A"]
["CL00275","Daniel"]
["CL00276","Baussy"]
["CL00277","Camaieu"]
["CL00278","Atelier d'architecture Van Oost"]
["CL00279","Lepage"]
["CL00280","Delcourt Isabelle"]
["CL00281","GENICHEM"]
["CL00282","Delrue - Nackart"]
["CL00283","M & M CERAMIC"]
["CL00284","Masquelier"]
["CL00285","Vandeputte"]
["CL00286","EUROLIURE"]
["CL00287","Van Durmen - Gheleyns"]
["CL00288","Bruneel"]
["CL00289","DEGREMONT BELGIQUE"]
["CL00290","Quaron"]
["CL00291","Carlier"]
["CL00292","Vindevogel"]
["CL00293","Vanbostal Jean- Pierre"]
["CL00294","Fromont"]
["CL00295","Les agences Huvenne"]
["CL00296","Monnier"]
["CL00297","Meurisse"]
["CL00298","T'jolle"]
["CL00299","Nackart"]
["CL00300","Cordonier"]
["CL00301","EKSTEN"]
["CL00302","Delmot Anita"]
["CL00303","Caink Optique"]
["CL00304","Dimou"]
["CL00305","Vanynsberg"]
["CL00306","Sabben"]
["CL00307","Ass. copropriété résidence fort rouge"]
["CL00308","Parent Marcel"]
["CL00309","Dubois"]
["CL00310","Hoyaux"]
["CL00311","Moulin Luc"]
["CL00312","Moreau Jean"]
["CL00313","Hespel - Perschenel"]
["CL00314","Brunin Marie - Agnès"]
["CL00315","Duroisin"]
["CL00316","BATESCAUT S.A"]
["CL00317","Michel Jacques"]
["CL00318","Maes"]
["CL00319","Vandenbussche"]
["CL00320","Interconstruct"]
["CL00321","Opsomer Chantal"]
["CL00322","Durieux"]
["CL00323","Dubois Michel"]
["CL00324","Droguerie Gysels"]
["CL00325","Desmytter"]
["CL00326","Lecocq"]
["CL00327","TRADECO"]
["CL00328","Bauters"]
["CL00329","Huvenne Nathalie"]
["CL00330","DB RENOV"]
["CL00331","Parent"]
["CL00332","AU VOILE SUISSE"]
["CL00333","JABE"]
["CL00334","Bonnet Frédéric"]
["CL00335","Delsencerie"]
["CL00336","Loiselet Laurent"]
["CL00337","Hoorman"]
["CL00338","François Constructions"]
["CL00339","Desablin"]
["CL00340","Dewez Jean-Pierre"]
["CL00341","Deceuninck - Dehondt"]
["CL00342","Leroy - O"]
["CL00343","TPF-ECONOLER"]
["CL00344","D'Argembeau Christophe"]
["CL00345","Demeule"]
["CL00346","Les Myosotis"]
["CL00347","François"]
["CL00348","Delpire Jean-Paul"]
["CL00349","Guilbaud"]
["CL00350","Cabinet dentaire DUSSART"]
["CL00351","Leclercq Bénédicte"]
["CL00352","Vermeulen Delphine"]
["CL00353","luyckx"]
["CL00354","DHERTE"]
["CL00355","Haut Escaut"]
["CL00356","Hengbart"]
["CL00357","Gobert Roland"]
["CL00358","Carnoy"]
["CL00359","INPECQ"]
["CL00360","Delescluse Michel"]
["CL00361","Olivier Pascal"]
["CL00362","Reigner"]
["CL00363","ANHELI"]
["CL00364","Les 5 D Horeca"]
["CL00365","Couplet"]
["CL00366","Decock"]
["CL00367","TYMA"]
["CL00368","Herbaut"]
["CL00369","COGERIM"]
["CL00370","Roland"]
["CL00371","Kenzo frit"]
["CL00372","Riollet"]
["CL00373","ITM BELGIUM"]
["CL00374","Landas André"]
["CL00375","Lequenne"]
["CL00376","TRANSPORT DELSENCERIE"]
["CL00377","Freteur"]
["CL00378","Renard"]
["CL00379","Adam"]
["CL00380","Bureau"]
["CL00381","Leturcq Valérie"]
["CL00382","IMMOTEM"]
["CL00383","Beghin Philippe"]
["CL00384","Dambrin"]
["CL00385","Van Der Maren bijouterie"]
["CL00386","Ecole Saint Piat"]
["CL00387","Petit Vincent"]
["CL00388","Gillieaux"]
["CL00389","Feihle - Loiselet"]
["CL00390","Larivière"]
["CL00391","Promotion sociale de Tournai"]
["CL00392","Lichtherte"]
["CL00393","Pyta"]
["CL00394","Janssens Ph."]
["CL00395","Bossu"]
["CL00396","Lunch Garden Restaurant"]
["CL00397","Lebas Bérangère"]
["CL00398","Bonnet"]
["CL00399","Viane"]
["CL00400","Lapierre Jacques"]
["CL00401","CONSTRUCTIF"]
["CL00402","Devalansart"]
["CL00403","Allard"]
["CL00404","Duplat"]
["CL00405","Lemaire"]
["CL00406","Nguyen Minh"]
["CL00407","ABAC Architecture"]
["CL00408","Profil A - Patrick Labit"]
["CL00409","Mattco"]
["CL00410","La Brochette"]
["CL00411","Parent"]
["CL00412","LETOS"]
["CL00413","Geurts"]
["CL00414","Ghiselin Jacques"]
["CL00415","GHELEYNS MAROQUINIER"]
["CL00416","Wiecha"]
["CL00417","Hernould"]
["CL00418","Druart"]
["CL00419","Grafeo Sabrina"]
["CL00420","Leblanc"]
["CL00421","Jaquart Benoît"]
["CL00422","ARBEL"]
["CL00423","BETASCO"]
["CL00424","Pierre Petit"]
["CL00425","Lebas Bérangère"]
["CL00426","Séminaire de Tournai"]
["CL00427","Carette"]
["CL00428","Toulemonde"]
["CL00429","Allard"]
["CL00430","Glorieux"]
["CL00431","CPH Tournai"]
["cl00431/1","CPH Ath"]
["CL00432","Plaquet"]
["CL00433","Dumont"]
["CL00434","Cuvelier Claude"]
["CL00435","Sottiaux"]
["CL00436","Bauvez"]
["CL00437","Fabrique d'église Saint-Eleuthère"]
["CL00438","A3"]
["CL00439","Marc Seynaeve"]
["CL00440","Foulon J-F Bureau d'architecture"]
["CL00441","Renard Francis"]
["CL00442","A.E.S."]
["CL00443","Callais"]
["CL00444","Dumortier"]
["CL00445","Hautcoeur - Lefebvre"]
["CL00446","Dufays"]
["CL00447","L'eau à la bouche"]
["CL00448","SAFRAN"]
["CL00449","Berte"]
["CL00450","Assistance Electrique Service"]
["CL00451","Fiévet"]
["CL00452","Coppenolle"]
["CL00453","Bariseau"]
["CL00454","Soenen Michel"]
["CL00455","Croain"]
["CL00456","Librairie Lenglez"]
["CL00456/1","Libraire façade arrière"]
["CL00457","Bouziane"]
["CL00458","Depotter Pierre"]
["CL00459","JET"]
["CL00460","Carlier - Locatelli"]
["CL00461","Baert Xavier"]
["CL00462","LE BEFFROI"]
["CL00463","Banco"]
["CL00464","Digitoil"]
["CL00465","Renard"]
["CL00466","Collège Technique Saint Henri"]
["CL00467","Dubart"]
["CL00468","Wisniewski"]
["CL00469","Buron"]
["CL00470","Vandenhende - Winders"]
["CL00471","Tulippe"]
["CL00472","Serré - Dubuisson"]
["CL00473","VALOREM"]
["CL00474","Guillaume Xavier"]
["CL00475","JET"]
["CL00476","Flament"]
["CL00477","Coulon"]
["CL00478","Gambiez"]
["CL00479","Lemaire - Leersnyder"]
["CL00480","QUEVIM"]
["CL00481","Givort Michel"]
["CL00482","Vanderstichelen Etienne"]
["CL00483","OTIS (Mr Stellian Simon)"]
["CL00484","SPIE BELGIUM"]
["CL00485","LE LOGIS TOURNAISIEN"]
["CL00486","C.F.A."]
["CL00487","Fockedey Bernard"]
["CL00488","Marquette"]
["CL00489","Hamera"]
["CL00490","Dyle"]
["CL00491","Ladeuze Anne"]
["CL00492","Deramaix - Allard"]
["CL00493","Delhaye - Houzée"]
["CL00494","Stempnick"]
["CL00495","Mulnard"]
["CL00496","Ets Marquette et fils"]
["CL00497","Mercier"]
["CL00498","Ecole Notre-Dame Auxiliatrice"]
["CL00499","Devos"]
["CL00500","Dujardin"]
["CL00501","Notre Dame Auxiliatrice"]
["CL00502","LE SAULCHOIR ASBL"]
["CL00503","Nounckele"]
["CL00504","Tassin"]
["CL00505","Lefranc Boris"]
["CL00506","Mathieu"]
["CL00507","Garage Breda"]
["CL00508","Croquet"]
["CL00509","IGUANIM"]
["CL00510","IMMOWARD"]
["CL00511","Evrard"]
["CL00512","Caillau Didier"]
["CL00513","Morel Dominique"]
["CL00515","Leclercq François"]
["CL00516","Dupriez"]
["CL00517","GEDIT"]
["CL00518","Bodart Andrée"]
["CL00519","Opteor Belgium"]
["CL00520","Rennerie"]
["CL00521","Stallens Jean-Philippe"]
["CL00522","Devalansart"]
["CL00523","Cauchies Henri"]
["CL00524","Rombaut Chantal"]
["CL00525","Vantomme Patrick"]
["CL00526","Dardenne"]
["CL00527","Bel-Gaufre"]
["CL00528","Norga"]
["CL00529","Pompes Funaibres Ladavid"]
["CL00530","Dewitte"]
["CL00531","Nuttens René"]
["CL00532","Ponthieu"]
["CL00533","DUSA IMMO"]
["CL00534","pétrocoal"]
["CL00535","Rousseau Jacques"]
["CL00536","Coppenolle"]
["CL00537","Herwegh"]
["CL00538","Delune"]
["CL00539","Masure"]
["CL00540","Grimonprez"]
["CL00541","Dewasmes"]
["CL00542","Vivier Elise"]
["CL00543","Maisonneuve - Moulin"]
["CL00544","Dussart Marie-Andrée"]
["CL00545","Delsencerie"]
["CL00546","Petit"]
["CL00547","Delangue"]
["CL00548","Vincent Lucas"]
["CL00549","Ronse Michel"]
["CL00550","Europe"]
["CL00551","VIVALDI"]
["CL00552","FITS"]
["CL00553","La Bourse Aux Livres"]
["CL00554","Bacq"]
["CL00555","Société Good Working"]
["CL00556","Stechly"]
["CL00557","Degroot"]
["CL00558","T.E.D Concept"]
["CL00559","Janssens Joël"]
["CL00560","Demontigny - Pollet"]
["CL00561","POULLET"]
["CL00562","Tamo"]
["CL00563","Deleersnyder"]
["CL00564","Meurisse"]
["CL00565","Delbart Frédéric"]
["CL00566","Philippe J-F"]
["CL00567","Kormetal"]
["CL00568","Boudin Pascal"]
["CL00569","Nieuwland C."]
["CL00570","Danniau"]
["CL00571","Debaisieux"]
["CL00572","Caucheteux"]
["CL00573","Lefevre"]
["CL00574","Vanderhaghen"]
["CL00575","Vermeersch"]
["CL00576","Houteman"]
["CL00577","Bureau d'assurances et immobilier"]
["CL00578","Mutombo Felix"]
["CL00579","Valvinc"]
["CL00580","Dhulst"]
["CL00581","Deweer Christine"]
["CL00582","ATE"]
["CL00583","Moulin Bernard"]
["CL00584","Vandevelde"]
["CL00585","Conversano Nicolas"]
["CL00586","Berte Emmanuel"]
["CL00587","Deravet Richard"]
["CL00588","Renard"]
["CL00589","Dewasmes Jean-Clément"]
["CL00590","HUMIVA"]
["CL00591","Hautem"]
["CL00592","Infrastructures scolaires de la"]
["CL00593","Boulangerie Plume"]
["CL00594","Rick"]
["CL00595","Defenain Anne et Philip Péchayre"]
["CL00596","IDETA"]
["CL00597","Lucas"]
["CL00598","E.D.C."]
["CL00599","Duplat Jean-Claude"]
["CL00600","Duplat"]
["CL00601","Les Vins du Sommeliers"]
["CL00602","Henry"]
["CL00603","Thiempondt Jean-François"]
["CL00604","Tribunal du Commerce"]
["CL00605","Debonnet"]
["CL00606","MOL"]
["CL00607","ARCHIPEL"]
["CL00608","Waignein - Horinque"]
["CL00609","Maintenance Industriel Wallonne"]
["CL00610","Noël"]
["CL00611","Rasson"]
["CL00612","Delcourt Christophe"]
["CL00613","Baas"]
["CL00614","SIEMENS"]
["CL00615","THEATRE ROYAL MONS"]
["CL00616","Mitri"]
["CL00617","Wattiaux"]
["CL00618","Leclercq Harold"]
["CL00619","Olivier"]
["CL00620","E.D.C."]
["CL00621","Jonville"]
["CL00622","Stevens"]
["CL00623","Murh Daniel"]
["CL00624","LA FEUILLERIE"]
["CL00625","D-tek"]
["CL00626","Janssens"]
["CL00627","Hellin"]
["CL00628","Tesse Sylvain"]
["CL00629","Deleersnyder Vincent"]
["CL00630","Deminlengreau d'Hembise"]
["CL00631","Decaluwé"]
["CL00632","Dépré Jean-Christophe"]
["CL00633","Caprasse"]
["CL00634","Carbonnelle"]
["CL00635","Goossens (Casimir)"]
["CL00636","CFA"]
["CL00637","Debal"]
["CL00638","Guelton"]
["CL00639","Baelen Joël"]
["CL00640","Derasse"]
["CL00641","Cuvelier"]
["CL00642","Detroye Michel"]
["CL00643","Nuttin"]
["CL00644","Lamborelle"]
["CL00645","Mullier Nadine"]
["CL00646","Lampe"]
["CL00647","Michiels"]
["CL00648","Rousseau"]
["CL00649","Vanheems"]
["CL00650","Meplomt"]
["CL00651","Hubaut travaux publics"]
["CL00652","Bertrand"]
["CL00653","Vertray"]
["CL00654","Louviau"]
["CL00655","Lamant"]
["CL00656","Depré"]
["CL00657","Janssens"]
["CL00658","Brunin"]
["CL00659","Dillies"]
["CL00660","Mahieu"]
["CL00661","C.H.WAPI"]
["CL00662","Dervaux"]
["CL00663","Genin"]
["CL00664","Noulet"]
["CL00665","Lembourg Michel"]
["CL00666","Couvreur - Peirs"]
["CL00667","CARRE IMMOBILIER"]
["CL00668","Meunuiserie Métallique Construction"]
["CL00669","La Maison Sociale"]
["CL00670","Espion Paul"]
["CL00671","Marquant Fredéricq"]
["CL00672","Legast François"]
["CL00673","Libert Anne"]
["CL00674","Pottiez - Nollet"]
["CL00675","Kaplan"]
["CL00676","Barbery Jean-François"]
["CL00677","Vanmeerhaege"]
["CL00678","Wilfart Jean-Philippe"]
["CL00679","Leroy Bernard"]
["CL00680","Clynckemaillie - clément"]
["CL00681","Courouble"]
["CL00682","Devalez"]
["CL00683","Martin Alain"]
["CL00684","Orbie"]
["CL00685","Baudens"]
["CL00686","Rivière"]
["CL00687","Dekeyser"]
["CL00688","Smal"]
["CL00689","Leclercq"]
["CL00690","Moreau Martine"]
["CL00691","Thiéfry"]
["CL00692","Delcroix"]
["CL00693","Mouligneau"]
["CL00694","Liénard - Pottiez"]
["CL00695","Despret Fabienne"]
["CL00696","Vanoverberg  Ludovic"]
["CL00697","Parent Hélène et Péré - Vergé Catherine"]
["CL00698","IMMO-DECA"]
["CL00699","Huin"]
["CL00700","Smoes"]
["CL00701","Vano Immo"]
["CL00702","Leroy"]
["CL00703","MILDES"]
["CL00704","Servimmo"]
["CL00705","Desplanque"]
["CL00706","Diricq"]
["CL00707","Vandecasteele"]
["CL00708","."]
["CL00709","Lambin Audrey"]
["CL00710","Desmette - Maréchal"]
["CL00711","Decobecq"]
["CL00712","Blangenois Caroline"]
["CL00713","Esterman"]
["CL00714","West Consulting"]
["CL00715","Dussart Michel"]
["CL00716","Haute Ecole de la Communauté Française"]
["CL00717","Rochez Sébastien"]
["CL00718","Delrue"]
["CL00719","Huin Giovanni"]
["CL00720","Lecat"]
["CL00721","Duhem"]
["CL00722","Stockman Gaëlle"]
["CL00723","Holderbeke"]
["CL00724","BAGECI"]
["CL00725","Dhont"]
["CL00726","Villée Bertrand"]
["CL00727","Liétard"]
["CL00728","Tondreau - Ninclaus"]
["CL00729","De Pourck"]
["CL00730","Flaam"]
["CL00731","Château d'Arondeau"]
["CL00732","D.T.C."]
["CL00733","Dumortier"]
["CL00734","G.I.P.Y."]
["CL00735","MGD CONSULT"]
["CL00736","Sculier François"]
["CL00737","Vilain"]
["CL00738","Devoet"]
["CL00739","Lamant Mickaël"]
["CL00740","Dumortier Michel"]
["CL00741","Truant Philippe"]
["CL00742","HAUTE ECOLE DU HAINAUT"]
["CL00743","Masson"]
["CL00744","Martin"]
["CL00745","Maison Bossier"]
["CL00746","François"]
["CL00747","Lebon"]
["CL00748","Courtois"]
["CL00749","Gousseau"]
["CL00750","Laurent"]
["CL00751","Vasen"]
["CL00752","Pascal Guillaume"]
["CL00753","Thiry"]
["CL00754","Weytens Edith"]
["CL00755","Colas Belgium - agence Jouret"]
["CL00756","Cornet Pierre"]
["CL00757","Decruyenaere"]
["CL00758","Ducroze - Dagnies"]
["CL00759","Remy"]
["CL00760","Cornez Fabienne"]
["CL00761","Ouvry - Damestoy"]
["CL00762","Carbone +"]
["CL00763","Delahaye"]
["CL00764","Leulier Sylvain"]
["CL00765","Dominique Buyse"]
["CL00766","QUIEVY"]
["CL00767","DECAMAT + SARL"]
["CL00768","Platteau"]
["CL00769","Gillig"]
["CL00770","Legrand"]
["CL00771","Henrotte Charles"]
["CL00772","Veriest Willy"]
["CL00773","Naveau Jacques"]
["CL00774","Gérard"]
["CL00775","Biltresse"]
["CL00776","Degobert Olivier"]
["CL00777","Flament François"]
["CL00778","Parsy -  Sieux"]
["CL00779","Bernard"]
["CL00780","Debaisieux"]
["CL00781","Duchâteau"]
["CL00782","Samain"]
["CL00783","Dehouck"]
["CL00784","Galan"]
["CL00785","Dekeyser"]
["CL00786","Brillon Jean-Paul"]
["CL00787","Dufaye"]
["CL00788","CNIM Sucursale de Belgique"]
["CL00789","Bonnet Stella"]
["CL00790","Thonnard Thierry"]
["CL00791","Detournay Valéry"]
["CL00792","Translomat"]
["CL00793","Glorieux Jean-Baptiste"]
["CL00794","Crabbé Toiture"]
["CL00795","Hovine"]
["CL00796","Campener"]
["CL00797","Leroy"]
["CL00798","Ronse"]
["CL00799","La Tartine Quotidienne"]
["CL00800","Rooryck - Dhaenens"]
["CL00801","GTC management"]
["CL00802","Vanhauwaert Marie-Claire"]
["CL00803","Ladavid Nathalie"]
["CL00804","Frédéricq"]
["CL00805","G.I.P.Y"]
["CL00806","Deceuninck"]
["CL00807","Roussel"]
["CL00808","Canelle - Carette"]
["CL00809","COMED"]
["CL00810","Losfeld Alain"]
["CL00811","Sirjacobs"]
["CL00812","Poncelet"]
["CL00813","Dufay - Roseau"]
["CL00814","Landrieu"]
["CL00815","KBC IMMOLEASE"]
["CL00816","Thiébaut Léon & Cie"]
["CL00817","Boutribati"]
["CL00818","SIMT"]
["CL00819","Duhem Rudi"]
["CL00820","SCRATCH"]
["CL00821","Dussautois Jessica"]
["CL00822","Clays"]
["CL00823","Fontaine Sabine"]
["CL00824","I.E.G."]
["CL00825","Masurelle"]
["CL00826","Margerin Philippe"]
["CL00827","Belgaz"]
["CL00828","Parduyns Xavier"]
["CL00829","Debacker Marie-Anne"]
["CL00830","Locufier Laurent"]
["CL00831","COULON"]
["CL00832","Crop Jean-Michel"]
["CL00833","Maroïl"]
["CL00834","Bilterys"]
["CL00836","Juste Bruno"]
["CL00837","Louis"]
["CL00838","Laurent Robert"]
["CL00839","Marcel Moyart"]
["CL00840","Les Bruyères"]
["CL00841","Grosjean Isabelle"]
["CL00842","Martin - Thiébaut"]
["CL00843","Delneste Alex"]
["CL00844","Batisant"]
["CL00845","Carton"]
["CL00846","Janssens"]
["CL00847","Haubursin"]
["CL00848","Deramaix"]
["CL00849","Duplat Jean-Paul"]
["CL00850","Vanhove - Maladry"]
["CL00851","Therin - Weise"]
["CL00852","Centre P.M.S"]
["CL00853","Parent Jean-Pierre"]
["CL00854","Dubois Quentin"]
["CL00855","Lamant Olivier"]
["CL00856","Tournois"]
["CL00857","Patrick Vion"]
["CL00858","Mahut Olivier"]
["CL00859","Desseyne"]
["CL00860","Solidaris"]
["CL00861","Henrion"]
["CL00862","Flammia"]
["CL00863","Esplanade"]
["CL00864","Ball"]
["CL00865","Spingale"]
["CL00866","Lesne - Tesse"]
["CL00867","Hennegien"]
["CL00868","Peirs"]
["CL00869","Calewir"]
["CL00870","A la Couronne"]
["CL00871","Bocquet"]
["CL00872","Clément"]
["CL00873","Triest"]
["CL00874","Lepain"]
["CL00875","Gosseye"]
["CL00876","Youla"]
["CL00877","EVRART"]
["CL00878","Saint-Ghislain"]
["CL00879","Quiquenpois"]
["CL00880","Quiquenpois"]
["CL00881","Fourmanoir"]
["CL00882","Ballegeer"]
["CL00883","Godderis"]
["CL00884","Verscheure"]
["CL00885","Samain ASP"]
["CL00886","Bouillez"]
["CL00887","Mevis - Masquelier"]
["CL00888","Cardon"]
["CL00889","Raskin"]
["CL00890","Cuvelier"]
["CL00891","Institut Saint André"]
["CL00892","AMB Construct"]
["CL00893","Omniterm Wallonie"]
["CL00894","Delneste"]
["CL00895","Les Orchidées"]
["CL00896","Mac Bride"]
["CL00897","Mortier"]
["CL00898","IFI"]
["CL00899","Au Bonheur du Jour"]
["CL00900","Bouchery"]
["CL00901","Thiébaut"]
["CL00902","Leclercq Marcel"]
["CL00903","Parmentier Dominique"]
["CL00904","Dekeyser"]
["CL00905","Malrait"]
["CL00906","Dupret"]
["CL00907","Glorieux Claudine"]
["CL00908","Daive"]
["CL00909","Moens Patrick"]
["CL00910","Decocq"]
["CL00911","Stevens Anne"]
["CL00912","Vigin"]
["CL00913","Jesson Nathalie"]
["CL00914","Delgutte"]
["CL00915","Deman Chistian"]
["CL00916","Dubart"]
["CL00917","Courtois Jean-Luc"]
["CL00918","Dehon"]
["CL00919","Desmet"]
["CL00920","Parent Michel"]
["CL00921","Créteur"]
["CL00922","Olivier"]
["CL00923","Galan"]
["CL00924","Rosolec"]
["CL00925","Orcq Sandwichs"]
["CL00926","I.D. Coiffure"]
["CL00927","Lambert"]
["CL00928","Desmet"]
["CL00929","Semet"]
["CL00930","Daoudi"]
["CL00931","Clayssens"]
["CL00932","Lemoine"]
["CL00933","Dutilleul Monique"]
["CL00934","Ideal Carrelages"]
["CL00935","Debaes"]
["CL00936","Locatelli-Danbrun"]
["CL00937","De Bruycker"]
["CL00938","Vanboquestal"]
["CL00939","Berton Pierre"]
["CL00940","Roupin"]
["CL00941","Succession  Marie-Thérèse Goeminne"]
["CL00942","Gillig Christian"]
["CL00943","Remy"]
["CL00944","Créatec"]
["CL00945","Prat Gilbert"]
["CL00946","Carbonnelle Laurence"]
["CL00947","Vanparys"]
["CL00948","Goudailler Julie"]
["CL00949","Nader"]
["CL00950","d'Ydewalle"]
["CL00951","J&B INTERNATIONAL (VATEA)"]
["CL00952","Mosselmans"]
["CL00953","Mathé"]
["CL00954","Amorison"]
["CL00955","Dexia Banque"]
["CL00956","Brasserie Friart"]
["CL00957","Saint-Ghislain"]
["CL00958","Jacquart Gérard"]
["CL00959","Van Hulle Guy"]
["CL00960","Derycke"]
["CL00961","Saquet"]
["CL00962","Comblez"]
["CL00963","L'Acceuil Familial"]
["CL00964","Dumortier Gaëtan"]
["CL00965","Moulaert"]
["CL00966","Gadenne"]
["CL00967","Lekeuche Michel"]
["CL00968","PERUDIS"]
["CL00969","Spiroon"]
["CL00970","De Puydt  N.V."]
["CL00971","Duquesne Catherine"]
["CL00972","Renders"]
["CL00973","Lesenne"]
["CL00974","Detournay Daniel"]
["CL00975","Pato - Crombez"]
["CL00976","Cordier"]
["CL00977","Debouverie Jean-Luc"]
["CL00978","J.S. Concept"]
["CL00979","Debrandere"]
["CL00980","Furnari"]
["CL00981","Assurances Deffrenne"]
["CL00982","Nuttin"]
["CL00983","Sturbois"]
["CL00984","Lard Daniel"]
["CL00985","Lambert Richard"]
["CL00986","Coucq Bernadette"]
["CL00987","Dekyndt"]
["CL00988","Stéfanato"]
["CL00989","Shanks Hainaut"]
["CL00990","Duponchelle"]
["CL00991","Meunier Joseph"]
["CL00992","Terlin"]
["CL00993","Kimpe Simone"]
["CL00994","M & C Buro"]
["CL00995","François"]
["CL00996","Fiévet"]
["CL00997","Prévost"]
["CL01000","Lemer Construct"]
["CL01001","Pollet"]
["CL01002","Armignacco"]
["CL01003","Leuleu"]
["CL01004","Euro-Fitness"]
["CL01005","Maladry Nicole"]
["CL01006","Richou"]
["CL01007","Bouvier"]
["CL01008","Ghils"]
["CL01009","Tesse Hugues"]
["CL01010","Fauquenoit Stéphane"]
["CL01011","Petit"]
["CL01012","Constantin"]
["CL01013","Wattiez"]
["CL01014","Malrait"]
["CL01015","Decerf Jacques"]
["CL01016","Duval Ronald"]
["CL01017","delhaye"]
["CL01018","Cluts"]
["CL01019","Vandurmen Christophe"]
["CL01020","Tevesz Stanislas"]
["CL01021","Delannay Anne"]
["CL01022","Favier"]
["CL01023","Nys"]
["CL01024","Dutrannois Jacques"]
["CL01025","Ergo Ghislaine"]
["CL01026","Huvenne Laurent"]
["CL01027","Vangeneberg"]
["CL01028","Decocq"]
["CL01029","Verdonkt"]
["CL01030","Pissart"]
["CL01031","Bourgueil"]
["CL01032","Detournay Jacques"]
["CL01033","Leclercq Gérard"]
["CL01034","Gerard"]
["CL01035","Parcom Intermarché"]
["CL01036","DEMAN Christian"]
["CL01037","STALIFT"]
["CL01038","VAN IMMOB"]
["CL01039","BATI-BELGIUM"]
["CL01040","Agence G-L."]
["CL01041","Euro-Energie"]
["CL01042","Letot - Vancoppenolle"]
["CL01043","Berlanger"]
["CL01044","Lenne"]
["CL01045","Vandendriessche"]
["CL01046","Hennart"]
["CL01047","Monnier Claudine"]
["CL01048","New Concept"]
["CL01049","Brismée - Lemaire"]
["CL01050","Docteur Mathieu Anne"]
["CL01051","Dufour"]
["CL01052","Poncin"]
["CL01053","Lamant David"]
["CL01054","Herbé Bernard"]
["CL01055","TOTAL PROJECT ( Mr Pollet Cédric)"]
["CL01056","PARCOBS"]
["CL01057","Hunt"]
["CL01058","Poels"]
["CL01059","Phoenix Cars"]
["CL01060","Calimé Albert"]
["CL01061","Scratch Europe"]
["CL01062","Vangeneberg"]
["CL01063","Lippinois"]
["CL01064","Cornu Maurice"]
["CL01065","Logic Nature"]
["CL01066","NOWEDIS"]
["CL01067","Crépin"]
["CL01068","Delangre"]
["CL01069","Dubois Anne-Sophie"]
["CL01070","Point de Mire"]
["CL01071","Voets - Cuvelier"]
["CL01072","Lefebvre Norbert"]
["CL01073","Campanella Sandrine"]
["CL01074","Campanella"]
["CL01075","Fermaut"]
["CL01076","Chaussures Maurice Soufflet"]
["CL01077","Deronne Mathieu"]
["CL01078","Orcqim"]
["CL01079","Wilmotte"]
["CL01080","Deronne"]
["CL01081","Parsy"]
["CL01082","Nowakowski Christine"]
["CL01084","Leroux"]
["CL01085","Longchamps Libertas"]
["CL01086","Ets Meyers"]
["CL01087","MEGLIA"]
["CL01088","Flint Group"]
["CL01089","Provis"]
["CL01090","MONSIM"]
["CL01091","Athénée Royal de Dour"]
["CL01092","Hooghe"]
["CL01093","Vindevogel Isabelle"]
["CL01094","Gervois Claude"]
["CL01095","Duchâteau"]
["CL01096","Suarez Siva Frédéric"]
["CL01097","Vanoudewater Gerard"]
["CL01098","Quai 34"]
["CL01099","Montois - Pontegnies"]
["CL01100","Vonck Pauline"]
["CL01101","Debondue - Bastin"]
["CL01102","B. Van Der Wee Architect"]
["CL01103","Sedis"]
["CL01104","Bothuine"]
["CL01105","Decaluwé Adrien"]
["CL01106","Bowling des Bassins"]
["CL01107","Simonet Olivier"]
["CL01108","Boscher"]
["CL01109","Masquelier Patrick"]
["CL01110","Sirjacobs"]
["CL01111","Carton Chantal"]
["CL01112","Cottenier Rosyne"]
["CL01113","Miel Michel"]
["CL01114","Vastrat Rudi"]
["CL01115","Savarino Stéphane"]
["CL01116","Pauwels"]
["CL01117","Reis Sonia"]
["CL01118","Marin Jean-Yves"]
["CL01119","Samain"]
["CL01120","Hopital Psychiatrique St Jean de Dieu"]
["CL01121","Caprasse"]
["CL01122","Ottevaere"]
["CL01123","Brunclair"]
["CL01124","Jauniau"]
["CL01125","Centre de Radiologie du Tournaisis"]
["CL01126","Villée Raphaël"]
["CL01127","Molderez"]
["CL01128","Roger Huguette"]
["CL01129","Cafés 5 Clochers"]
["CL01130","Masquelier"]
["CL01131","Cordier"]
["CL01132","Cuvelier"]
["CL01133","Dhaenens"]
["CL01134","Opsomer"]
["CL01135","Comte H. du Chastel"]
["CL01136","Verschoor"]
["CL01137","OSMOSE"]
["CL01138","Immobilière ECODEL"]
["CL01139","Dewalle Jean-Marie"]
["CL01140","CASA-CHALET"]
["CL01141","Clément"]
["CL01142","Religieuse de Saint André"]
["CL01143","Delmée"]
["CL01144","Ferré"]
["CL01145","Jacquerie"]
["CL01146","Lefebvre"]
["CL01147","Gobert"]
["CL01148","VICTORIA"]
["CL01149","Sulmon"]
["CL01150","Wadin"]
["CL01151","Horeman"]
["CL01152","Leclercq"]
["CL01153","Bouche"]
["CL01154","Dumont"]
["CL01155","Brassart"]
["CL01156","Barbieux"]
["CL01157","Renaut"]
["CL01158","Vandewalle"]
["CL01159","Vanhove"]
["CL01160","Verhaeghe"]
["CL01161","Delplace"]
["CL01162","Jaworski"]
["CL01163","Midol"]
["CL01165","Caby Jean-paul"]
["CL01166","Collège Communal de Beloeil"]
["CL01167","Paeme"]
["CL01168","Cardon"]
["CL01169","Delneste"]
["CL01170","Stellian"]
["CL01171","Dervaux"]
["CL01172","Distri@ction"]
["CL01173","Coppens"]
["CL01174","Huvelle"]
["CL01175","Fieremans Maryse"]
["CL01176","Dubart - Brunin"]
["CL01177","Delmarquette"]
["CL01178","Sainte-Union"]
["CL01179","AIDE ET SOINS A DOMICILE"]
["CL01180","Devochelle"]
["CL01181","Desprez"]
["CL01182","Pharmacie Lanthier"]
["CL01183","Le Domaine \" Le Centenaire\""]
["CL01184","Duart"]
["CL01185","Dubois"]
["CL01186","LKR"]
["CL01187","Mathieu Deronne"]
["CL01188","Monsim"]
["CL01189","Warcoing"]
["CL01190","Dassoneville"]
["CL01191","Picou"]
["CL01192","Hennart"]
["CL01193","Lessens"]
["CL01194","Comblez"]
["CL01195","Pottiez"]
["CL01196","DG Concept"]
["CL01197","Sergic Immobilier"]
["CL01198","ORPEA BELGIUM"]
["CL01199","Joveneau Dominique"]
["CL01200","Nieuwland Jean-Fançois"]
["CL01201","Stiennes"]
["CL01202","Masurelle"]
["CL01203","Picarelle"]
["CL01204","Weystman Agnès"]
["CL01205","Rossey"]
["CL01206","TS Construct"]
["CL01207","Maes Factory"]
["CL01208","Intermarché Loudis"]
["CL01209","Surmont"]
["CL01210","Lericque"]
["CL01211","TARKETT FRANCE"]
["CL01212","administration communale d'antoing"]
["CL01213","Skinterface"]
["CL01214","Rauwers"]
["CL01215","Vanderlin"]
["CL01216","Vandenbossche"]
["CL01217","Vandenbossche"]
["CL01218","Stievenart"]
["CL01219","Libert"]
["CL01220","Haquin"]
["CL01221","Cowez Mathieu"]
["CL01222","Gorin"]
["CL01223","Kennis"]
["CL01224","FGTB"]
["CL01225","Leclercq"]
["CL01226","Andreux Vincent"]
["CL01227","Allard"]
["CL01228","Medirem"]
["CL01229","Myldes N.V"]
["CL01230","Hotel Solvay"]
["CL01231","Bovart"]
["CL01232","Institut Technique Libre"]
["CL01233","Delfosse"]
["CL01234","Ecole libre de Rumes"]
["CL01235","FUSIREF"]
["CL01236","V.H.M."]
["CL01237","Danghien"]
["CL01238","Lindigo - Deco"]
["CL01239","Dhetz Olivier"]
["CL01240","Résidence les 4 coins ACP"]
["CL01241","Architecture Luc Moulin et associé"]
["CL01242","Debusschere"]
["CL01243","Collin"]
["CL01244","Debaes Jean"]
["CL01245","Boussy Jacques"]
["CL01246","Joson"]
["CL01247","C.C.I. Wallonie Picarde"]
["CL01248","Merlin Stéphane"]
["CL01249","Dentinvest"]
["CL01250","STEM"]
["CL01251","DEPHIMMO"]
["CL01252","Galafaro"]
["CL01253","Dumortier Johan"]
["CL01254","Vandeponscele"]
["CL01255","Renard"]
["CL01256","Caby Héliane"]
["CL01257","Dujardin Pierre"]
["CL01258","Landrieu Marie-Christine"]
["CL01259","S.T.T."]
["CL01260","Escouflaire"]
["CL01261","Cousin"]
["CL01262","Verhagen"]
["CL01263","Laurent Nicolas"]
["CL01264","Vandenbeyvanghe colette"]
["CL01265","Blondez"]
["CL01266","Taramis"]
["CL01267","Malghem Luc"]
["CL01268","Coessens Sandrine"]
["CL01269","Nassens"]
["CL01270","Brunain"]
["CL01271","Rizzo"]
["CL01272","Molin"]
["CL01273","Gosse"]
["CL01274","Dhaene"]
["CL01275","Derasse"]
["CL01276","Boland"]
["CL01277","Lecrit Didier"]
["CL01278","Adyns Claudette"]
["CL01279","Dinoir Grégory"]
["CL01280","Jouret Janine"]
["CL01281","Dubois Benoît"]
["CL01282","Evrard Peggy"]
["CL01283","Mazure"]
["CL01284","Maeghe"]
["CL01285","Vanasten Grégory"]
["CL01286","Mignot"]
["CL01287","Hautem"]
["CL01288","Bauters"]
["CL01289","Résidence Mean House"]
["CL01290","Goulem"]
["CL01291","IDELEC"]
["CL01292","Vandenbussche Claudy"]
["CL01293","Ronse Amélie"]
["CL01294","Galoppin"]
["CL01295","Borman"]
["CL01296","Hazebrouck"]
["CL01297","Haras de Cazeau"]
["CL01298","CODITEX"]
["CL01299","Marghem"]
["CL01300","Choteau-Ryckoort"]
["CL01301","Dumortier"]
["CL01302","Van Wynsberghe"]
["CL01303","Gardavoir Arlette"]
["CL01304","Jacquart-Soudan"]
["CL01305","Wantiez"]
["CL01306","Devochelle"]
["CL01307","Résidence Fleurie"]
["CL01308","Delvigne Danielle"]
["CL01309","Flamme"]
["CL01310","Sion"]
["CL01311","Lallemand"]
["CL01312","ECOLE COMMUNALE FRANCAISE"]
["CL01313","Les Charmilles"]
["CL01314","Langerock-De Witte"]
["CL01315","Absin"]
["CL01316","Lysen - Dumont"]
["CL01317","Graveline Christophe"]
["CL01318","Leclercq Bernard - Xavier"]
["CL01319","Févry Marie - France"]
["CL01320","Pary"]
["CL01321","Beys Michel"]
["CL01322","Dewolf"]
["CL01323","Daumerie Edith"]
["CL01324","Decarpentrie"]
["CL01325","Mevis Martine"]
["CL01326","Plaitin"]
["CL01327","Marescaux"]
["CL01328","Trannoy"]
["CL01329","Eelke"]
["CL01330","Brasserie Hollebecq"]
["CL01331","Pontégnie"]
["CL01333","New Technorm International"]
["CL01334","vanderhoost Jimmy"]
["CL01335","Remacle Nicolas"]
["CL01336","2000 Dis"]
["CL01337","Gahylle Michel"]
["CL01338","Laude-Bazin"]
["CL01339","Fournier Bernard"]
["CL01340","Desmet Jan"]
["CL01341","Jacmin Edouard"]
["CL01342","Decerf"]
["CL01343","Gorczak Therèse"]
["CL01344","Lacres Goerges"]
["CL01345","lecercq-deviane"]
["CL01346","CICA"]
["CL01347","3X BIO"]
["CL01348","Athénée"]
["CL01349","Drouillon"]
["CL01350","Mathys"]
["CL01351","Hespel david"]
["CL01352","Dawir Bernadette"]
["CL01353","Bass Frédéric"]
["CL01354","FIT YOUR MIND"]
["CL01355","Fontaine"]
["CL01356","Doutreluingne"]
["CL01357","De Craen"]
["CL01358","Chevalier Gérard"]
["CL01359","Pitta"]
["CL01360","Rooryck"]
["CL01361","La Botte de Lin"]
["CL01362","Claude mathieu"]
["CL01363","Stilite"]
["CL01364","Levau"]
["CL01365","Golestin"]
["CL01366","Laurent"]
["CL01367","Dubois"]
["CL01368","Vandeneede"]
["CL01369","Restaurant Cheng"]
["CL01370","Wuylens"]
["CL01371","Tourbach - Versyck"]
["CL01372","Dancoisne"]
["CL01373","Demulier"]
["CL01374","Bachy"]
["CL01375","Marques"]
["CL01376","Van Neste"]
["CL01377","Vanneste"]
["CL01378","Fourez"]
["CL01379","Rigaut"]
["CL01380","Mahieux sabine"]
["CL01381","Centre \"La pommeraie\" ASBL"]
["CL01382","Vasseur"]
["CL01383","Dujardin"]
["CL01384","Comblez"]
["CL01385","Dangremont-Philippo"]
["CL01386","Monniez"]
["CL01387","Gérin"]
["CL01388","Delvinquière"]
["CL01389","Fontaine"]
["CL01390","Mathieu et Cowez assurances"]
["CL01391","Disy"]
["CL01392","DEGAUQUIER"]
["CL01393","Masquelier François-Xavier"]
["CL01394","Lecocq"]
["CL01395","Moyart"]
["CL01396","De Cubber"]
["CL01397","Leveau"]
["CL01398","Maladry"]
["CL01399","Six"]
["CL01400","Delfosse Pascal"]
["CL01401","Hunt"]
["CL01402","Bougard"]
["CL01403","Wolfs-Descamps"]
["CL01404","Thémont"]
["CL01405","Cabinet Dentaire LEVEQUE"]
["CL01406","Zimbili - Vandaele"]
["CL01407","Bonneel"]
["CL01408","Fjäril ( La Chenille Bleue)"]
["CL01409","Decraene"]
["CL01410","Defontaine"]
["CL01411","Tignon"]
["CL01412","Dumortier"]
["CL01413","Roos"]
["CL01414","JB Van Linthout"]
["CL01415","Watteau"]
["CL01416","Salle Saint Martin"]
["CL01417","Quintard"]
["CL01418","Chamart"]
["CL01419","Intermarché Jurbise"]
["CL01420","LE BARA"]
["CL01421","Dureulx"]
["CL01422","Dupont"]
["CL01423","Deroubaix fabian"]
["CL01424","Business Sport Center"]
["CL01425","Myle"]
["CL01426","Henrotte Nathalie"]
["CL01427","Accueil Familial"]
["CL01428","Simon Ludovick"]
["CL01429","Dupont-Van Der Heijden"]
["CL01430","Ecole Fondamentale Libre Subventionnée"]
["CL01431","Pecquereau Bernard"]
["CL01432","Bargibant Patrick"]
["CL01433","Debondues"]
["CL01434","Régibot"]
["CL01435","IEPS colfontaine"]
["CL01436","Plaitin"]
["CL01437","Dochy"]
["CL01438","Menu"]
["CL01439","Moreels"]
["CL01440","Letangre"]
["CL01441","Guéret-Coupez"]
["CL01442","Mitchelly"]
["CL01443","Droulez - Hespel"]
["CL01444","Ghlinim"]
["CL01445","L' ACIS ASBL hopital psychiatrique Saint-jean de Dieu"]
["CL01446","Gosset"]
["CL01447","Nutte"]
["CL01448","Menu Gérard"]
["CL01449","Deneubourg"]
["CL01450","Ghislain"]
["CL01451","Wibaut-Dumazy"]
["CL01452","Rorijck"]
["CL01453","Hernould"]
["CL01454","Parison"]
["CL01455","Simono David"]
["CL01456","International Business Office"]
["CL01457","Warlop"]
["CL01458","C.I.E.P"]
["CL01459","Vilette"]
["CL01460","CCB Béton"]
["CL01461","Intermarché Celles"]
["CL01462","intermarché frameries"]
["CL01463","Les Filles Celles Picarde"]
["CL01464","Decaluwé"]
["CL01465","JCD Engineering"]
["CL01466","ST INVEST"]
["CL01467","Delangre (Nico chauffage)"]
["CL01468","Nieuwland Nicolas"]
["CL01469","Lebeau"]
["CL01470","Sadin"]
["CL01471","Cuignet"]
["CL01472","Intermarché Givry"]
["CL01473","Migliore"]
["CL01474","Timmerman"]
["CL01475","Copropriété Gérard et Consort"]
["CL01476","Delanghe-Nackart"]
["CL01477","Vandenbroeck patrick"]
["CL01478","Géroux"]
["CL01479","Résidence Marie-Thérèse"]
["CL01480","Vanwynsberghe"]
["CL01481","Caby"]
["CL01482","Delcampe Marie-Henriette"]
["CL01483","Lorent Nicolas"]
["CL01485","Dépelchin"]
["CL01486","Bauduin Jean-Claude"]
["CL01487","Gillain Laurent"]
["CL01488","Ronse Kévin"]
["CL01489","Balteau"]
["CL01490","TRBA S.A. (Mouscron)"]
["CL01491","Self Drink Deffontaine"]
["CL01492","Institut du Bon Pasteur"]
["CL01493","Duroisin"]
["CL01494","BVB Construct SPRL"]
["CL01495","Compact Machinery SPRL"]
["CL01496","Delhuvenne - Lebrun"]
["CL01497","Glorieux Nathalie"]
["CL01498","Van Hulle François"]
["CL01499","Dujardin - Bayet Suzanne"]
["CL01500","Templim"]
["CL01501","Lemoine Christian"]
["CL01502","KBC Immolease"]
["CL01503","Deltenre"]
["CL01504","Eglise Protestante de Tournai"]
["CL01505","Mahia Cécile"]
["CL01506","Pirlet"]
["CL01507","Eraert, Dragages et Entreprises"]
["CL01508","Eglise Protestante de Tournai"]
["CL01509","FRIT'HOUSE L"]
["CL01510","Courouble"]
["CL01511","La Technique"]
["CL01512","Vandenabeele-Maillet"]
["CL01513","Dubois Yvette"]
["CL01514","Dehovre-Debetencourt"]
["CL01515","Nottebart -De Marneffe"]
["CL01516","Wecxteen"]
["CL01517","Dubois"]
["CL01518","Callebeaut Karine"]
["CL01519","Dufour - Hautecoeur"]
["CL01520","Demillecamps"]
["CL01521","Carbon Jean-Vincent"]
["CL01522","Debaisieux"]
["CL01523","Herrier Monique"]
["CL01524","Planchet"]
["CL01525","Boucherie Ok"]
["CL01526","Forestell"]
["CL01527","Natur'Elements Derasse"]
["CL01528","Collin"]
["CL01529","Devianne"]
["CL01530","Debliquy"]
["CL01531","Le Stephen's"]
["CL01532","Detimmerman"]
["CL01533","Vanalderweireld"]
["CL01534","Rubrecht Pascal"]
["CL01535","Rémy Isabelle"]
["CL01536","Marchal"]
["CL01537","Weytsman"]
["CL01538","Lecocq José"]
["CL01540","Garage Guérin"]
["CL01541","Couplet"]
["CL01542","Charlier Nicole"]
["CL01543","ITM IMMO"]
["CL01544","Leblanc"]
["CL01545","Lemaire"]
["CL01546","Coens"]
["CL01547","Notre Dame de la Merci"]
["CL01548","Dan et Dan"]
["CL01549","Dheunissen"]
["CL01550","Lanbin"]
["CL01551","Bracqueveld"]
["CL01552","Les 4 Saisons"]
["CL01553","Mr et Mme De Jaeger"]
["CL01554","Delplace"]
["CL01555","Nollet"]
["CL01556","Debugne"]
["CL01557","Vanpeteghem"]
["CL01558","Lemaitre"]
["CL01559","TRBA (Péruwelz)"]
["CL01560","Nicolas Lorent"]
["CL01561","Leconte"]
["CL01562","Bourget"]
["CL01563","Bauvez Jean"]
["CL01564","Dujardin"]
["CL01565","Ménart Aude"]
["CL01566","zen'itude coiffure"]
["CL01567","Vanovertveldt"]
["CL01568","Levensboom School"]
["CL01569","Debaisieux Luc"]
["CL01570","Sabbe"]
["CL01571","Defenain"]
["CL01572","Dequesne"]
["CL01573","Sénéchal"]
["CL01574","Carpentier"]
["CL01575","Belgo-prism"]
["CL01576","Bogaert"]
["CL01577","Aresu"]
["CL01578","Lamarque Delphine"]
["CL01579","Deveugle"]
["CL01580","Cobelba"]
["CL01581","Vansevenant"]
["CL01582","Parez Jean-Marie"]
["CL01583","Degauquier-Mary"]
["CL01584","Malvaux"]
["CL01585","Lacchia vanessa"]
["CL01586","Kohen"]
["CL01587","Misson"]
["CL01588","Quintard David"]
["CL01589","Stocman René"]
["CL01590","Bourdon Sandrine"]
["CL01591","Tour Immo"]
["CL01592","Cauvin Guy"]
["CL01593","Cordier"]
["CL01594","Cardon"]
["CL01595","Decruyenaere"]
["CL01596","Martens"]
["CL01598","Jouniau-Lakière"]
["CL01599","Dumortier"]
["CL01600","MGD PATRIMONIAL"]
["CL01601","Mariage - Jadot"]
["CL01603","Henrard-Roselaine"]
["cl01603/1","Henrard-Roselaine Proxi Delhaize"]
["CL01604","Duthoit"]
["CL01605","Dufromont"]
["CL01606","Derouck"]
["CL01607","Dewitte Gauthier"]
["CL01608","Delneste Isabelle"]
["CL01609","Seynhaeve"]
["CL01610","Brasserie Haacht"]
["CL01611","A.S.B.L EPATT \" Les Galipettes\""]
["CL01612","Duhem Thierry"]
["CL01613","Dervaux - Luc"]
["CL01614","Desmette - Raviart"]
["CL01615","Khoutabi"]
["CL01616","Marysse"]
["CL01617","Plancq"]
["CL01618","Coulon Benoit"]
["CL01619","Vieren Sylvie"]
["CL01620","Dufour"]
["CL01621","Dewerdt Stéphane"]
["CL01622","GEORGES (POSEUR DE SOL)"]
["CL01623","TRANSLUBEN"]
["CL01624","Bourgeois"]
["CL01625","Mercier Thomas"]
["CL01626","Parent Julien"]
["CL01627","Desmet Pierre"]
["CL01629","Cotton"]
["CL01630","Dupuis Marie-Christine"]
["CL01631","Liétard"]
["CL01632","Delcroix"]
["CL01633","Thuru"]
["CL01634","Centre de radiothérapie Pierre Curie"]
["m","Malade"]

{"sheet":"Ouvrier1","index":1,"n_rows":585,"n_cols":6,"rows_kept":585,"cut":false,"hidden":false,"merged":[[0,4,0,5],[51,4,51,5],[101,4,101,5],[151,4,151,5],[201,4,201,5],[501,4,501,5],[551,4,551,5],[251,4,251,5],[301,4,301,5],[351,4,351,5],[401,4,401,5],[451,4,451,5]]}
["Ouvrier :","Ouvrier 1",null,null,"Janvier"]
[]
["date ","jour ","code","chantier","H. prestées","H. sup."]
["2013-01-01",{"$f":"A4","v":"2013-01-01"},"c",{"$f":"VLOOKUP(C4,Feuil1!$A$1:$B$9999,2)","v":"Congé"},0,0]
["2013-01-02","2013-01-02","cl00431/1",{"$f":"VLOOKUP(C5,Feuil1!$A$1:$B$9999,2)","v":"CPH Ath"},9,9]
["2013-01-03","2013-01-03","cl00431/1",{"$f":"VLOOKUP(C6,Feuil1!$A$1:$B$9999,2)","v":"CPH Ath"},9,9]
["2013-01-04","2013-01-04","cl00431/1",{"$f":"VLOOKUP(C7,Feuil1!$A$1:$B$9999,2)","v":"CPH Ath"},9,9]
["2013-01-05","2013-01-05","cl00431/1",{"$f":"VLOOKUP(C8,Feuil1!$A$1:$B$9999,2)","v":"CPH Ath"},9,9]
["2013-01-06","2013-01-06"]
["2013-01-07","2013-01-07","cl01289",{"$f":"VLOOKUP(C10,Feuil1!$A$1:$B$9999,2)","v":"Résidence Mean House"},8,0]
["2013-01-08","2013-01-08","cl01289",{"$f":"VLOOKUP(C11,Feuil1!$A$1:$B$9999,2)","v":"Résidence Mean House"},8,0]
["2013-01-09","2013-01-09","cl01289",{"$f":"VLOOKUP(C12,Feuil1!$A$1:$B$9999,2)","v":"Résidence Mean House"},8,0]
["2013-01-10","2013-01-10","cl01289",{"$f":"VLOOKUP(C13,Feuil1!$A$1:$B$9999,2)","v":"Résidence Mean House"},8,0]
["2013-01-11","2013-01-11","cl00431/1",{"$f":"VLOOKUP(C14,Feuil1!$A$1:$B$9999,2)","v":"CPH Ath"},7,0]
[null,null,"cl01289",{"$f":"VLOOKUP(C15,Feuil1!$A$1:$B$9999,2)","v":"Résidence Mean House"},1,0]
["2013-01-12","2013-01-12","cl00060",{"$f":"VLOOKUP(C16,Feuil1!$A$1:$B$9999,2)","v":"HOME SAINT JEAN"},8,8]
["2013-01-13","2013-01-13"]
["2013-01-14","2013-01-14","cl01289",{"$f":"VLOOKUP(C18,Feuil1!$A$1:$B$9999,2)","v":"Résidence Mean House"},8,0]
["2013-01-15","2013-01-15",null,"Absent",0,0]
["2013-01-16","2013-01-16","cl01289",{"$f":"VLOOKUP(C20,Feuil1!$A$1:$B$9999,2)","v":"Résidence Mean House"},8,0]
["2013-01-17","2013-01-17","cl01289",{"$f":"VLOOKUP(C21,Feuil1!$A$1:$B$9999,2)","v":"Résidence Mean House"},8,0]
["2013-01-18","2013-01-18","cl00319",{"$f":"VLOOKUP(C22,Feuil1!$A$1:$B$9999,2)","v":"Vandenbussche"},8,0]
["2013-01-19","2013-01-19","cl00319",{"$f":"VLOOKUP(C23,Feuil1!$A$1:$B$9999,2)","v":"Vandenbussche"},8,8]
["2013-01-20","2013-01-20"]
["2013-01-21","2013-01-21",null,"Absent",0,0]
["2013-01-22","2013-01-22",null,"Absent",0,0]
["2013-01-23","2013-01-23",null,"Absent",0,0]
["2013-01-24","2013-01-24",null,"Absent",0,0]
["2013-01-25","2013-01-25",null,"Absent",0,0]
["2013-01-26","2013-01-26",null,null,0,0]
["2013-01-27","2013-01-27"]
["2013-01-28","2013-01-28","cl00431",{"$f":"VLOOKUP(C32,Feuil1!$A$1:$B$9999,2)","v":"CPH Tournai"},8,0]
["2013-01-29","2013-01-29","cl00431",{"$f":"VLOOKUP(C33,Feuil1!$A$1:$B$9999,2)","v":"CPH Tournai"},8,0]
["2013-01-30","2013-01-30","cl00431",{"$f":"VLOOKUP(C34,Feuil1!$A$1:$B$9999,2)","v":"CPH Tournai"},8,0]
["2013-01-31","2013-01-31","cl00431",{"$f":"VLOOKUP(C35,Feuil1!$A$1:$B$9999,2)","v":"CPH Tournai"},8,0]
[]
[]
[]
[]
[]
[]
[]
[]
[]
[]
[]
[]
[]
[]
[]
[]
["Ouvrier :","Ouvrier 1",null,null,"Février"]
[]
["date ","jour ","code","chantier","H. prestées","H. sup."]
["2013-02-01",{"$f":"A55","v":"2013-02-01"},null,{"$f":"VLOOKUP(C55,Feuil1!$A$1:$B$9999,2)","v":{"$error":"#N/A"}}]
["2013-02-02",{"$f":"A56","v":"2013-02-02"},null,{"$f":"VLOOKUP(C56,Feuil1!$A$1:$B$9999,2)","v":{"$error":"#N/A"}}]
["2013-02-03","2013-02-03",null,{"$f":"VLOOKUP(C57,Feuil1!$A$1:$B$9999,2)","v":{"$error":"#N/A"}}]
["2013-02-04","2013-02-04",null,{"$f":"VLOOKUP(C58,Feuil1!$A$1:$B$9999,2)","v":{"$error":"#N/A"}}]
["2013-02-05","2013-02-05",null,{"$f":"VLOOKUP(C59,Feuil1!$A$1:$B$9999,2)","v":{"$error":"#N/A"}}]
["2013-02-06","2013-02-06",null,{"$f":"VLOOKUP(C60,Feuil1!$A$1:$B$9999,2)","v":{"$error":"#N/A"}}]
["2013-02-07","2013-02-07",null,{"$f":"VLOOKUP(C61,Feuil1!$A$1:$B$9999,2)","v":{"$error":"#N/A"}}]
["2013-02-08","2013-02-08",null,{"$f":"VLOOKUP(C62,Feuil1!$A$1:$B$9999,2)","v":{"$error":"#N/A"}}]
["2013-02-09","2013-02-09",null,{"$f":"VLOOKUP(C63,Feuil1!$A$1:$B$9999,2)","v":{"$error":"#N/A"}}]
["2013-02-10","2013-02-10",null,{"$f":"VLOOKUP(C64,Feuil1!$A$1:$B$9999,2)","v":{"$error":"#N/A"}}]
["2013-02-11","2013-02-11",null,{"$f":"VLOOKUP(C65,Feuil1!$A$1:$B$9999,2)","v":{"$error":"#N/A"}}]
["2013-02-12","2013-02-12",null,{"$f":"VLOOKUP(C66,Feuil1!$A$1:$B$9999,2)","v":{"$error":"#N/A"}}]
["2013-02-13","2013-02-13",null,{"$f":"VLOOKUP(C67,Feuil1!$A$1:$B$9999,2)","v":{"$error":"#N/A"}}]
["2013-02-14","2013-02-14",null,{"$f":"VLOOKUP(C68,Feuil1!$A$1:$B$9999,2)","v":{"$error":"#N/A"}}]
["2013-02-15","2013-02-15",null,{"$f":"VLOOKUP(C69,Feuil1!$A$1:$B$9999,2)","v":{"$error":"#N/A"}}]
["2013-02-16","2013-02-16",null,{"$f":"VLOOKUP(C70,Feuil1!$A$1:$B$9999,2)","v":{"$error":"#N/A"}}]
["2013-02-17","2013-02-17",null,{"$f":"VLOOKUP(C71,Feuil1!$A$1:$B$9999,2)","v":{"$error":"#N/A"}}]
["2013-02-18","2013-02-18",null,{"$f":"VLOOKUP(C72,Feuil1!$A$1:$B$9999,2)","v":{"$error":"#N/A"}}]
["2013-02-19","2013-02-19",null,{"$f":"VLOOKUP(C73,Feuil1!$A$1:$B$9999,2)","v":{"$error":"#N/A"}}]
["2013-02-20","2013-02-20",null,{"$f":"VLOOKUP(C74,Feuil1!$A$1:$B$9999,2)","v":{"$error":"#N/A"}}]
["2013-02-21","2013-02-21",null,{"$f":"VLOOKUP(C75,Feuil1!$A$1:$B$9999,2)","v":{"$error":"#N/A"}}]
["2013-02-22","2013-02-22",null,{"$f":"VLOOKUP(C76,Feuil1!$A$1:$B$9999,2)","v":{"$error":"#N/A"}}]
["2013-02-23","2013-02-23",null,{"$f":"VLOOKUP(C77,Feuil1!$A$1:$B$9999,2)","v":{"$error":"#N/A"}}]
["2013-02-24","2013-02-24",null,{"$f":"VLOOKUP(C78,Feuil1!$A$1:$B$9999,2)","v":{"$error":"#N/A"}}]
["2013-02-25","2013-02-25",null,{"$f":"VLOOKUP(C79,Feuil1!$A$1:$B$9999,2)","v":{"$error":"#N/A"}}]
["2013-02-26","2013-02-26",null,{"$f":"VLOOKUP(C80,Feuil1!$A$1:$B$9999,2)","v":{"$error":"#N/A"}}]
["2013-02-27","2013-02-27",null,{"$f":"VLOOKUP(C81,Feuil1!$A$1:$B$9999,2)","v":{"$error":"#N/A"}}]
["2013-02-28","2013-02-28",null,{"$f":"VLOOKUP(C82,Feuil1!$A$1:$B$9999,2)","v":{"$error":"#N/A"}}]
[]
[]
[]
[]
[]
[]
[]
[]
[]
[]
[]
[]
[]
[]
[]
[]
[]
[]
[]
["Ouvrier :","Ouvrier 1",null,null,"Mars"]
[]
["date ","jour ","code","chantier","H. prestées","H. sup."]
["2013-03-01",{"$f":"A105","v":"2013-03-01"},null,{"$f":"VLOOKUP(C105,Feuil1!$A$1:$B$9999,2)","v":{"$error":"#N/A"}}]
["2013-03-02",{"$f":"A106","v":"2013-03-02"},null,{"$f":"VLOOKUP(C106,Feuil1!$A$1:$B$9999,2)","v":{"$error":"#N/A"}}]
["2013-03-03","2013-03-03",null,{"$f":"VLOOKUP(C107,Feuil1!$A$1:$B$9999,2)","v":{"$error":"#N/A"}}]
["2013-03-04","2013-03-04",null,{"$f":"VLOOKUP(C108,Feuil1!$A$1:$B$9999,2)","v":{"$error":"#N/A"}}]
["2013-03-05","2013-03-05",null,{"$f":"VLOOKUP(C109,Feuil1!$A$1:$B$9999,2)","v":{"$error":"#N/A"}}]
["2013-03-06","2013-03-06",null,{"$f":"VLOOKUP(C110,Feuil1!$A$1:$B$9999,2)","v":{"$error":"#N/A"}}]
["2013-03-07","2013-03-07",null,{"$f":"VLOOKUP(C111,Feuil1!$A$1:$B$9999,2)","v":{"$error":"#N/A"}}]
["2013-03-08","2013-03-08",null,{"$f":"VLOOKUP(C112,Feuil1!$A$1:$B$9999,2)","v":{"$error":"#N/A"}}]
["2013-03-09","2013-03-09",null,{"$f":"VLOOKUP(C113,Feuil1!$A$1:$B$9999,2)","v":{"$error":"#N/A"}}]
["2013-03-10","2013-03-10",null,{"$f":"VLOOKUP(C114,Feuil1!$A$1:$B$9999,2)","v":{"$error":"#N/A"}}]
["2013-03-11","2013-03-11",null,{"$f":"VLOOKUP(C115,Feuil1!$A$1:$B$9999,2)","v":{"$error":"#N/A"}}]
["2013-03-12","2013-03-12",null,{"$f":"VLOOKUP(C116,Feuil1!$A$1:$B$9999,2)","v":{"$error":"#N/A"}}]
["2013-03-13","2013-03-13",null,{"$f":"VLOOKUP(C117,Feuil1!$A$1:$B$9999,2)","v":{"$error":"#N/A"}}]
["2013-03-14","2013-03-14",null,{"$f":"VLOOKUP(C118,Feuil1!$A$1:$B$9999,2)","v":{"$error":"#N/A"}}]
["2013-03-15","2013-03-15",null,{"$f":"VLOOKUP(C119,Feuil1!$A$1:$B$9999,2)","v":{"$error":"#N/A"}}]
["2013-03-16","2013-03-16",null,{"$f":"VLOOKUP(C120,Feuil1!$A$1:$B$9999,2)","v":{"$error":"#N/A"}}]
["2013-03-17","2013-03-17",null,{"$f":"VLOOKUP(C121,Feuil1!$A$1:$B$9999,2)","v":{"$error":"#N/A"}}]
["2013-03-18","2013-03-18",null,{"$f":"VLOOKUP(C122,Feuil1!$A$1:$B$9999,2)","v":{"$error":"#N/A"}}]
["2013-03-19","2013-03-19",null,{"$f":"VLOOKUP(C123,Feuil1!$A$1:$B$9999,2)","v":{"$error":"#N/A"}}]
["2013-03-20","2013-03-20",null,{"$f":"VLOOKUP(C124,Feuil1!$A$1:$B$9999,2)","v":{"$error":"#N/A"}}]
["2013-03-21","2013-03-21",null,{"$f":"VLOOKUP(C125,Feuil1!$A$1:$B$9999,2)","v":{"$error":"#N/A"}}]
["2013-03-22","2013-03-22",null,{"$f":"VLOOKUP(C126,Feuil1!$A$1:$B$9999,2)","v":{"$error":"#N/A"}}]
["2013-03-23","2013-03-23",null,{"$f":"VLOOKUP(C127,Feuil1!$A$1:$B$9999,2)","v":{"$error":"#N/A"}}]
["2013-03-24","2013-03-24",null,{"$f":"VLOOKUP(C128,Feuil1!$A$1:$B$9999,2)","v":{"$error":"#N/A"}}]
["2013-03-25","2013-03-25",null,{"$f":"VLOOKUP(C129,Feuil1!$A$1:$B$9999,2)","v":{"$error":"#N/A"}}]
["2013-03-26","2013-03-26",null,{"$f":"VLOOKUP(C130,Feuil1!$A$1:$B$9999,2)","v":{"$error":"#N/A"}}]
["2013-03-27","2013-03-27",null,{"$f":"VLOOKUP(C131,Feuil1!$A$1:$B$9999,2)","v":{"$error":"#N/A"}}]
["2013-03-28","2013-03-28",null,{"$f":"VLOOKUP(C132,Feuil1!$A$1:$B$9999,2)","v":{"$error":"#N/A"}}]
["2013-03-29","2013-03-29",null,{"$f":"VLOOKUP(C133,Feuil1!$A$1:$B$9999,2)","v":{"$error":"#N/A"}}]
["2013-03-30","2013-03-30",null,{"$f":"VLOOKUP(C134,Feuil1!$A$1:$B$9999,2)","v":{"$error":"#N/A"}}]
["2013-03-31","2013-03-31",null,{"$f":"VLOOKUP(C135,Feuil1!$A$1:$B$9999,2)","v":{"$error":"#N/A"}}]
[]
[]
[]
[]
[]
[]
[]
[]
[]
[]
[]
[]
[]
[]
[]
[]
["Ouvrier :","Ouvrier 1",null,null,"Avril"]
[]
[null,"jour ","code","chantier","H. prestées","H. sup."]
["2013-04-01",{"$f":"A155","v":"2013-04-01"},null,{"$f":"VLOOKUP(C155,Feuil1!$A$1:$B$9999,2)","v":{"$error":"#N/A"}}]
["2013-04-02",{"$f":"A156","v":"2013-04-02"},null,{"$f":"VLOOKUP(C156,Feuil1!$A$1:$B$9999,2)","v":{"$error":"#N/A"}}]
["2013-04-03","2013-04-03",null,{"$f":"VLOOKUP(C157,Feuil1!$A$1:$B$9999,2)","v":{"$error":"#N/A"}}]
["2013-04-04","2013-04-04",null,{"$f":"VLOOKUP(C158,Feuil1!$A$1:$B$9999,2)","v":{"$error":"#N/A"}}]
["2013-04-05","2013-04-05",null,{"$f":"VLOOKUP(C159,Feuil1!$A$1:$B$9999,2)","v":{"$error":"#N/A"}}]
["2013-04-06","2013-04-06",null,{"$f":"VLOOKUP(C160,Feuil1!$A$1:$B$9999,2)","v":{"$error":"#N/A"}}]
["2013-04-07","2013-04-07",null,{"$f":"VLOOKUP(C161,Feuil1!$A$1:$B$9999,2)","v":{"$error":"#N/A"}}]
["2013-04-08","2013-04-08",null,{"$f":"VLOOKUP(C162,Feuil1!$A$1:$B$9999,2)","v":{"$error":"#N/A"}}]
["2013-04-09","2013-04-09",null,{"$f":"VLOOKUP(C163,Feuil1!$A$1:$B$9999,2)","v":{"$error":"#N/A"}}]
["2013-04-10","2013-04-10",null,{"$f":"VLOOKUP(C164,Feuil1!$A$1:$B$9999,2)","v":{"$error":"#N/A"}}]
["2013-04-11","2013-04-11",null,{"$f":"VLOOKUP(C165,Feuil1!$A$1:$B$9999,2)","v":{"$error":"#N/A"}}]
["2013-04-12","2013-04-12",null,{"$f":"VLOOKUP(C166,Feuil1!$A$1:$B$9999,2)","v":{"$error":"#N/A"}}]
["2013-04-13","2013-04-13",null,{"$f":"VLOOKUP(C167,Feuil1!$A$1:$B$9999,2)","v":{"$error":"#N/A"}}]
["2013-04-14","2013-04-14",null,{"$f":"VLOOKUP(C168,Feuil1!$A$1:$B$9999,2)","v":{"$error":"#N/A"}}]
["2013-04-15","2013-04-15",null,{"$f":"VLOOKUP(C169,Feuil1!$A$1:$B$9999,2)","v":{"$error":"#N/A"}}]
["2013-04-16","2013-04-16",null,{"$f":"VLOOKUP(C170,Feuil1!$A$1:$B$9999,2)","v":{"$error":"#N/A"}}]
["2013-04-17","2013-04-17",null,{"$f":"VLOOKUP(C171,Feuil1!$A$1:$B$9999,2)","v":{"$error":"#N/A"}}]
["2013-04-18","2013-04-18",null,{"$f":"VLOOKUP(C172,Feuil1!$A$1:$B$9999,2)","v":{"$error":"#N/A"}}]
["2013-04-19","2013-04-19",null,{"$f":"VLOOKUP(C173,Feuil1!$A$1:$B$9999,2)","v":{"$error":"#N/A"}}]
["2013-04-20","2013-04-20",null,{"$f":"VLOOKUP(C174,Feuil1!$A$1:$B$9999,2)","v":{"$error":"#N/A"}}]
["2013-04-21","2013-04-21",null,{"$f":"VLOOKUP(C175,Feuil1!$A$1:$B$9999,2)","v":{"$error":"#N/A"}}]
["2013-04-22","2013-04-22",null,{"$f":"VLOOKUP(C176,Feuil1!$A$1:$B$9999,2)","v":{"$error":"#N/A"}}]
["2013-04-23","2013-04-23",null,{"$f":"VLOOKUP(C177,Feuil1!$A$1:$B$9999,2)","v":{"$error":"#N/A"}}]
["2013-04-24","2013-04-24",null,{"$f":"VLOOKUP(C178,Feuil1!$A$1:$B$9999,2)","v":{"$error":"#N/A"}}]
["2013-04-25","2013-04-25",null,{"$f":"VLOOKUP(C179,Feuil1!$A$1:$B$9999,2)","v":{"$error":"#N/A"}}]
["2013-04-26","2013-04-26",null,{"$f":"VLOOKUP(C180,Feuil1!$A$1:$B$9999,2)","v":{"$error":"#N/A"}}]
["2013-04-27","2013-04-27",null,{"$f":"VLOOKUP(C181,Feuil1!$A$1:$B$9999,2)","v":{"$error":"#N/A"}}]
["2013-04-28","2013-04-28",null,{"$f":"VLOOKUP(C182,Feuil1!$A$1:$B$9999,2)","v":{"$error":"#N/A"}}]
["2013-04-29","2013-04-29",null,{"$f":"VLOOKUP(C183,Feuil1!$A$1:$B$9999,2)","v":{"$error":"#N/A"}}]
["2013-04-30","2013-04-30",null,{"$f":"VLOOKUP(C184,Feuil1!$A$1:$B$9999,2)","v":{"$error":"#N/A"}}]
[]
[]
[]
[]
[]
[]
[]
[]
[]
[]
[]
[]
[]
[]
[]
[]
[]
["Ouvrier :","Ouvrier 1",null,null,"Mai"]
[]
[null,"jour ","code","chantier","H. prestées","H. sup."]
["2013-05-01",{"$f":"A205","v":"2013-05-01"},null,{"$f":"VLOOKUP(C205,Feuil1!$A$1:$B$9999,2)","v":{"$error":"#N/A"}}]
["2013-05-02",{"$f":"A206","v":"2013-05-02"},null,{"$f":"VLOOKUP(C206,Feuil1!$A$1:$B$9999,2)","v":{"$error":"#N/A"}}]
["2013-05-03","2013-05-03",null,{"$f":"VLOOKUP(C207,Feuil1!$A$1:$B$9999,2)","v":{"$error":"#N/A"}}]
["2013-05-04","2013-05-04",null,{"$f":"VLOOKUP(C208,Feuil1!$A$1:$B$9999,2)","v":{"$error":"#N/A"}}]
["2013-05-05","2013-05-05",null,{"$f":"VLOOKUP(C209,Feuil1!$A$1:$B$9999,2)","v":{"$error":"#N/A"}}]
["2013-05-06","2013-05-06",null,{"$f":"VLOOKUP(C210,Feuil1!$A$1:$B$9999,2)","v":{"$error":"#N/A"}}]
["2013-05-07","2013-05-07",null,{"$f":"VLOOKUP(C211,Feuil1!$A$1:$B$9999,2)","v":{"$error":"#N/A"}}]
["2013-05-08","2013-05-08",null,{"$f":"VLOOKUP(C212,Feuil1!$A$1:$B$9999,2)","v":{"$error":"#N/A"}}]
["2013-05-09","2013-05-09",null,{"$f":"VLOOKUP(C213,Feuil1!$A$1:$B$9999,2)","v":{"$error":"#N/A"}}]
["2013-05-10","2013-05-10",null,{"$f":"VLOOKUP(C214,Feuil1!$A$1:$B$9999,2)","v":{"$error":"#N/A"}}]
["2013-05-11","2013-05-11",null,{"$f":"VLOOKUP(C215,Feuil1!$A$1:$B$9999,2)","v":{"$error":"#N/A"}}]
["2013-05-12","2013-05-12",null,{"$f":"VLOOKUP(C216,Feuil1!$A$1:$B$9999,2)","v":{"$error":"#N/A"}}]
["2013-05-13","2013-05-13",null,{"$f":"VLOOKUP(C217,Feuil1!$A$1:$B$9999,2)","v":{"$error":"#N/A"}}]
["2013-05-14","2013-05-14",null,{"$f":"VLOOKUP(C218,Feuil1!$A$1:$B$9999,2)","v":{"$error":"#N/A"}}]
["2013-05-15","2013-05-15",null,{"$f":"VLOOKUP(C219,Feuil1!$A$1:$B$9999,2)","v":{"$error":"#N/A"}}]
["2013-05-16","2013-05-16",null,{"$f":"VLOOKUP(C220,Feuil1!$A$1:$B$9999,2)","v":{"$error":"#N/A"}}]
["2013-05-17","2013-05-17",null,{"$f":"VLOOKUP(C221,Feuil1!$A$1:$B$9999,2)","v":{"$error":"#N/A"}}]
["2013-05-18","2013-05-18",null,{"$f":"VLOOKUP(C222,Feuil1!$A$1:$B$9999,2)","v":{"$error":"#N/A"}}]
["2013-05-19","2013-05-19",null,{"$f":"VLOOKUP(C223,Feuil1!$A$1:$B$9999,2)","v":{"$error":"#N/A"}}]
["2013-05-20","2013-05-20",null,{"$f":"VLOOKUP(C224,Feuil1!$A$1:$B$9999,2)","v":{"$error":"#N/A"}}]
["2013-05-21","2013-05-21",null,{"$f":"VLOOKUP(C225,Feuil1!$A$1:$B$9999,2)","v":{"$error":"#N/A"}}]
["2013-05-22","2013-05-22",null,{"$f":"VLOOKUP(C226,Feuil1!$A$1:$B$9999,2)","v":{"$error":"#N/A"}}]
["2013-05-23","2013-05-23",null,{"$f":"VLOOKUP(C227,Feuil1!$A$1:$B$9999,2)","v":{"$error":"#N/A"}}]
["2013-05-24","2013-05-24",null,{"$f":"VLOOKUP(C228,Feuil1!$A$1:$B$9999,2)","v":{"$error":"#N/A"}}]
["2013-05-25","2013-05-25",null,{"$f":"VLOOKUP(C229,Feuil1!$A$1:$B$9999,2)","v":{"$error":"#N/A"}}]
["2013-05-26","2013-05-26",null,{"$f":"VLOOKUP(C230,Feuil1!$A$1:$B$9999,2)","v":{"$error":"#N/A"}}]
["2013-05-27","2013-05-27",null,{"$f":"VLOOKUP(C231,Feuil1!$A$1:$B$9999,2)","v":{"$error":"#N/A"}}]
["2013-05-28","2013-05-28",null,{"$f":"VLOOKUP(C232,Feuil1!$A$1:$B$9999,2)","v":{"$error":"#N/A"}}]
["2013-05-29","2013-05-29",null,{"$f":"VLOOKUP(C233,Feuil1!$A$1:$B$9999,2)","v":{"$error":"#N/A"}}]
["2013-05-30","2013-05-30",null,{"$f":"VLOOKUP(C234,Feuil1!$A$1:$B$9999,2)","v":{"$error":"#N/A"}}]
["2013-05-31","2013-05-31",null,{"$f":"VLOOKUP(C235,Feuil1!$A$1:$B$9999,2)","v":{"$error":"#N/A"}}]
[]
[]
[]
[]
[]
[]
[]
[]
[]
[]
[]
[]
[]
[]
[]
[]
["Ouvrier :","Ouvrier 1",null,null,"Juin"]
[]
[null,"jour ","code","chantier","H. prestées","H. sup."]
["2013-06-01",{"$f":"A255","v":"2013-06-01"},null,{"$f":"VLOOKUP(C255,Feuil1!$A$1:$B$9999,2)","v":{"$error":"#N/A"}}]
["2013-06-02",{"$f":"A256","v":"2013-06-02"},null,{"$f":"VLOOKUP(C256,Feuil1!$A$1:$B$9999,2)","v":{"$error":"#N/A"}}]
["2013-06-03","2013-06-03",null,{"$f":"VLOOKUP(C257,Feuil1!$A$1:$B$9999,2)","v":{"$error":"#N/A"}}]
["2013-06-04","2013-06-04",null,{"$f":"VLOOKUP(C258,Feuil1!$A$1:$B$9999,2)","v":{"$error":"#N/A"}}]
["2013-06-05","2013-06-05",null,{"$f":"VLOOKUP(C259,Feuil1!$A$1:$B$9999,2)","v":{"$error":"#N/A"}}]
["2013-06-06","2013-06-06",null,{"$f":"VLOOKUP(C260,Feuil1!$A$1:$B$9999,2)","v":{"$error":"#N/A"}}]
["2013-06-07","2013-06-07",null,{"$f":"VLOOKUP(C261,Feuil1!$A$1:$B$9999,2)","v":{"$error":"#N/A"}}]
["2013-06-08","2013-06-08",null,{"$f":"VLOOKUP(C262,Feuil1!$A$1:$B$9999,2)","v":{"$error":"#N/A"}}]
["2013-06-09","2013-06-09",null,{"$f":"VLOOKUP(C263,Feuil1!$A$1:$B$9999,2)","v":{"$error":"#N/A"}}]
["2013-06-10","2013-06-10",null,{"$f":"VLOOKUP(C264,Feuil1!$A$1:$B$9999,2)","v":{"$error":"#N/A"}}]
["2013-06-11","2013-06-11",null,{"$f":"VLOOKUP(C265,Feuil1!$A$1:$B$9999,2)","v":{"$error":"#N/A"}}]
["2013-06-12","2013-06-12",null,{"$f":"VLOOKUP(C266,Feuil1!$A$1:$B$9999,2)","v":{"$error":"#N/A"}}]
["2013-06-13","2013-06-13",null,{"$f":"VLOOKUP(C267,Feuil1!$A$1:$B$9999,2)","v":{"$error":"#N/A"}}]
["2013-06-14","2013-06-14",null,{"$f":"VLOOKUP(C268,Feuil1!$A$1:$B$9999,2)","v":{"$error":"#N/A"}}]
["2013-06-15","2013-06-15",null,{"$f":"VLOOKUP(C269,Feuil1!$A$1:$B$9999,2)","v":{"$error":"#N/A"}}]
["2013-06-16","2013-06-16",null,{"$f":"VLOOKUP(C270,Feuil1!$A$1:$B$9999,2)","v":{"$error":"#N/A"}}]
["2013-06-17","2013-06-17",null,{"$f":"VLOOKUP(C271,Feuil1!$A$1:$B$9999,2)","v":{"$error":"#N/A"}}]
["2013-06-18","2013-06-18",null,{"$f":"VLOOKUP(C272,Feuil1!$A$1:$B$9999,2)","v":{"$error":"#N/A"}}]
["2013-06-19","2013-06-19",null,{"$f":"VLOOKUP(C273,Feuil1!$A$1:$B$9999,2)","v":{"$error":"#N/A"}}]
["2013-06-20","2013-06-20",null,{"$f":"VLOOKUP(C274,Feuil1!$A$1:$B$9999,2)","v":{"$error":"#N/A"}}]
["2013-06-21","2013-06-21",null,{"$f":"VLOOKUP(C275,Feuil1!$A$1:$B$9999,2)","v":{"$error":"#N/A"}}]
["2013-06-22","2013-06-22",null,{"$f":"VLOOKUP(C276,Feuil1!$A$1:$B$9999,2)","v":{"$error":"#N/A"}}]
["2013-06-23","2013-06-23",null,{"$f":"VLOOKUP(C277,Feuil1!$A$1:$B$9999,2)","v":{"$error":"#N/A"}}]
["2013-06-24","2013-06-24",null,{"$f":"VLOOKUP(C278,Feuil1!$A$1:$B$9999,2)","v":{"$error":"#N/A"}}]
["2013-06-25","2013-06-25",null,{"$f":"VLOOKUP(C279,Feuil1!$A$1:$B$9999,2)","v":{"$error":"#N/A"}}]
["2013-06-26","2013-06-26",null,{"$f":"VLOOKUP(C280,Feuil1!$A$1:$B$9999,2)","v":{"$error":"#N/A"}}]
["2013-06-27","2013-06-27",null,{"$f":"VLOOKUP(C281,Feuil1!$A$1:$B$9999,2)","v":{"$error":"#N/A"}}]
["2013-06-28","2013-06-28",null,{"$f":"VLOOKUP(C282,Feuil1!$A$1:$B$9999,2)","v":{"$error":"#N/A"}}]
["2013-06-29","2013-06-29",null,{"$f":"VLOOKUP(C283,Feuil1!$A$1:$B$9999,2)","v":{"$error":"#N/A"}}]
["2013-06-30","2013-06-30",null,{"$f":"VLOOKUP(C284,Feuil1!$A$1:$B$9999,2)","v":{"$error":"#N/A"}}]
[]
[]
[]
[]
[]
[]
[]
[]
[]
[]
[]
[]
[]
[]
[]
[]
[]
["Ouvrier :","Ouvrier 1",null,null,"Juillet"]
[]
[null,"jour ","code","chantier","H. prestées","H. sup."]
["2013-07-01",{"$f":"A305","v":"2013-07-01"},null,{"$f":"VLOOKUP(C305,Feuil1!$A$1:$B$9999,2)","v":{"$error":"#N/A"}}]
["2013-07-02",{"$f":"A306","v":"2013-07-02"},null,{"$f":"VLOOKUP(C306,Feuil1!$A$1:$B$9999,2)","v":{"$error":"#N/A"}}]
["2013-07-03","2013-07-03",null,{"$f":"VLOOKUP(C307,Feuil1!$A$1:$B$9999,2)","v":{"$error":"#N/A"}}]
["2013-07-04","2013-07-04",null,{"$f":"VLOOKUP(C308,Feuil1!$A$1:$B$9999,2)","v":{"$error":"#N/A"}}]
["2013-07-05","2013-07-05",null,{"$f":"VLOOKUP(C309,Feuil1!$A$1:$B$9999,2)","v":{"$error":"#N/A"}}]
["2013-07-06","2013-07-06",null,{"$f":"VLOOKUP(C310,Feuil1!$A$1:$B$9999,2)","v":{"$error":"#N/A"}}]
["2013-07-07","2013-07-07",null,{"$f":"VLOOKUP(C311,Feuil1!$A$1:$B$9999,2)","v":{"$error":"#N/A"}}]
["2013-07-08","2013-07-08",null,{"$f":"VLOOKUP(C312,Feuil1!$A$1:$B$9999,2)","v":{"$error":"#N/A"}}]
["2013-07-09","2013-07-09",null,{"$f":"VLOOKUP(C313,Feuil1!$A$1:$B$9999,2)","v":{"$error":"#N/A"}}]
["2013-07-10","2013-07-10",null,{"$f":"VLOOKUP(C314,Feuil1!$A$1:$B$9999,2)","v":{"$error":"#N/A"}}]
["2013-07-11","2013-07-11",null,{"$f":"VLOOKUP(C315,Feuil1!$A$1:$B$9999,2)","v":{"$error":"#N/A"}}]
["2013-07-12","2013-07-12",null,{"$f":"VLOOKUP(C316,Feuil1!$A$1:$B$9999,2)","v":{"$error":"#N/A"}}]
["2013-07-13","2013-07-13",null,{"$f":"VLOOKUP(C317,Feuil1!$A$1:$B$9999,2)","v":{"$error":"#N/A"}}]
["2013-07-14","2013-07-14",null,{"$f":"VLOOKUP(C318,Feuil1!$A$1:$B$9999,2)","v":{"$error":"#N/A"}}]
["2013-07-15","2013-07-15",null,{"$f":"VLOOKUP(C319,Feuil1!$A$1:$B$9999,2)","v":{"$error":"#N/A"}}]
["2013-07-16","2013-07-16",null,{"$f":"VLOOKUP(C320,Feuil1!$A$1:$B$9999,2)","v":{"$error":"#N/A"}}]
["2013-07-17","2013-07-17",null,{"$f":"VLOOKUP(C321,Feuil1!$A$1:$B$9999,2)","v":{"$error":"#N/A"}}]
["2013-07-18","2013-07-18",null,{"$f":"VLOOKUP(C322,Feuil1!$A$1:$B$9999,2)","v":{"$error":"#N/A"}}]
["2013-07-19","2013-07-19",null,{"$f":"VLOOKUP(C323,Feuil1!$A$1:$B$9999,2)","v":{"$error":"#N/A"}}]
["2013-07-20","2013-07-20",null,{"$f":"VLOOKUP(C324,Feuil1!$A$1:$B$9999,2)","v":{"$error":"#N/A"}}]
["2013-07-21","2013-07-21",null,{"$f":"VLOOKUP(C325,Feuil1!$A$1:$B$9999,2)","v":{"$error":"#N/A"}}]
["2013-07-22","2013-07-22",null,{"$f":"VLOOKUP(C326,Feuil1!$A$1:$B$9999,2)","v":{"$error":"#N/A"}}]
["2013-07-23","2013-07-23",null,{"$f":"VLOOKUP(C327,Feuil1!$A$1:$B$9999,2)","v":{"$error":"#N/A"}}]
["2013-07-24","2013-07-24",null,{"$f":"VLOOKUP(C328,Feuil1!$A$1:$B$9999,2)","v":{"$error":"#N/A"}}]
["2013-07-25","2013-07-25",null,{"$f":"VLOOKUP(C329,Feuil1!$A$1:$B$9999,2)","v":{"$error":"#N/A"}}]
["2013-07-26","2013-07-26",null,{"$f":"VLOOKUP(C330,Feuil1!$A$1:$B$9999,2)","v":{"$error":"#N/A"}}]
["2013-07-27","2013-07-27",null,{"$f":"VLOOKUP(C331,Feuil1!$A$1:$B$9999,2)","v":{"$error":"#N/A"}}]
["2013-07-28","2013-07-28",null,{"$f":"VLOOKUP(C332,Feuil1!$A$1:$B$9999,2)","v":{"$error":"#N/A"}}]
["2013-07-29","2013-07-29",null,{"$f":"VLOOKUP(C333,Feuil1!$A$1:$B$9999,2)","v":{"$error":"#N/A"}}]
["2013-07-30","2013-07-30",null,{"$f":"VLOOKUP(C334,Feuil1!$A$1:$B$9999,2)","v":{"$error":"#N/A"}}]
["2013-07-31","2013-07-31",null,{"$f":"VLOOKUP(C335,Feuil1!$A$1:$B$9999,2)","v":{"$error":"#N/A"}}]
[]
[]
[]
[]
[]
[]
[]
[]
[]
[]
[]
[]
[]
[]
[]
[]
["Ouvrier :","Ouvrier 1",null,null,"Aout"]
[]
[null,"jour ","code","chantier","H. prestées","H. sup."]
["2013-08-01",{"$f":"A355","v":"2013-08-01"},null,{"$f":"VLOOKUP(C355,Feuil1!$A$1:$B$9999,2)","v":{"$error":"#N/A"}}]
["2013-08-02",{"$f":"A356","v":"2013-08-02"},null,{"$f":"VLOOKUP(C356,Feuil1!$A$1:$B$9999,2)","v":{"$error":"#N/A"}}]
["2013-08-03","2013-08-03",null,{"$f":"VLOOKUP(C357,Feuil1!$A$1:$B$9999,2)","v":{"$error":"#N/A"}}]
["2013-08-04","2013-08-04",null,{"$f":"VLOOKUP(C358,Feuil1!$A$1:$B$9999,2)","v":{"$error":"#N/A"}}]
["2013-08-05","2013-08-05",null,{"$f":"VLOOKUP(C359,Feuil1!$A$1:$B$9999,2)","v":{"$error":"#N/A"}}]
["2013-08-06","2013-08-06",null,{"$f":"VLOOKUP(C360,Feuil1!$A$1:$B$9999,2)","v":{"$error":"#N/A"}}]
["2013-08-07","2013-08-07",null,{"$f":"VLOOKUP(C361,Feuil1!$A$1:$B$9999,2)","v":{"$error":"#N/A"}}]
["2013-08-08","2013-08-08",null,{"$f":"VLOOKUP(C362,Feuil1!$A$1:$B$9999,2)","v":{"$error":"#N/A"}}]
["2013-08-09","2013-08-09",null,{"$f":"VLOOKUP(C363,Feuil1!$A$1:$B$9999,2)","v":{"$error":"#N/A"}}]
["2013-08-10","2013-08-10",null,{"$f":"VLOOKUP(C364,Feuil1!$A$1:$B$9999,2)","v":{"$error":"#N/A"}}]
["2013-08-11","2013-08-11",null,{"$f":"VLOOKUP(C365,Feuil1!$A$1:$B$9999,2)","v":{"$error":"#N/A"}}]
["2013-08-12","2013-08-12",null,{"$f":"VLOOKUP(C366,Feuil1!$A$1:$B$9999,2)","v":{"$error":"#N/A"}}]
["2013-08-13","2013-08-13",null,{"$f":"VLOOKUP(C367,Feuil1!$A$1:$B$9999,2)","v":{"$error":"#N/A"}}]
["2013-08-14","2013-08-14",null,{"$f":"VLOOKUP(C368,Feuil1!$A$1:$B$9999,2)","v":{"$error":"#N/A"}}]
["2013-08-15","2013-08-15",null,{"$f":"VLOOKUP(C369,Feuil1!$A$1:$B$9999,2)","v":{"$error":"#N/A"}}]
["2013-08-16","2013-08-16",null,{"$f":"VLOOKUP(C370,Feuil1!$A$1:$B$9999,2)","v":{"$error":"#N/A"}}]
["2013-08-17","2013-08-17",null,{"$f":"VLOOKUP(C371,Feuil1!$A$1:$B$9999,2)","v":{"$error":"#N/A"}}]
["2013-08-18","2013-08-18",null,{"$f":"VLOOKUP(C372,Feuil1!$A$1:$B$9999,2)","v":{"$error":"#N/A"}}]
["2013-08-19","2013-08-19",null,{"$f":"VLOOKUP(C373,Feuil1!$A$1:$B$9999,2)","v":{"$error":"#N/A"}}]
["2013-08-20","2013-08-20",null,{"$f":"VLOOKUP(C374,Feuil1!$A$1:$B$9999,2)","v":{"$error":"#N/A"}}]
["2013-08-21","2013-08-21",null,{"$f":"VLOOKUP(C375,Feuil1!$A$1:$B$9999,2)","v":{"$error":"#N/A"}}]
["2013-08-22","2013-08-22",null,{"$f":"VLOOKUP(C376,Feuil1!$A$1:$B$9999,2)","v":{"$error":"#N/A"}}]
["2013-08-23","2013-08-23",null,{"$f":"VLOOKUP(C377,Feuil1!$A$1:$B$9999,2)","v":{"$error":"#N/A"}}]
["2013-08-24","2013-08-24",null,{"$f":"VLOOKUP(C378,Feuil1!$A$1:$B$9999,2)","v":{"$error":"#N/A"}}]
["2013-08-25","2013-08-25",null,{"$f":"VLOOKUP(C379,Feuil1!$A$1:$B$9999,2)","v":{"$error":"#N/A"}}]
["2013-08-26","2013-08-26",null,{"$f":"VLOOKUP(C380,Feuil1!$A$1:$B$9999,2)","v":{"$error":"#N/A"}}]
["2013-08-27","2013-08-27",null,{"$f":"VLOOKUP(C381,Feuil1!$A$1:$B$9999,2)","v":{"$error":"#N/A"}}]
["2013-08-28","2013-08-28",null,{"$f":"VLOOKUP(C382,Feuil1!$A$1:$B$9999,2)","v":{"$error":"#N/A"}}]
["2013-08-29","2013-08-29",null,{"$f":"VLOOKUP(C383,Feuil1!$A$1:$B$9999,2)","v":{"$error":"#N/A"}}]
["2013-08-30","2013-08-30",null,{"$f":"VLOOKUP(C384,Feuil1!$A$1:$B$9999,2)","v":{"$error":"#N/A"}}]
["2013-08-31","2013-08-31",null,{"$f":"VLOOKUP(C385,Feuil1!$A$1:$B$9999,2)","v":{"$error":"#N/A"}}]
[]
[]
[]
[]
[]
[]
[]
[]
[]
[]
[]
[]
[]
[]
[]
[]
["Ouvrier :","Ouvrier 1",null,null,"Septembre"]
[]
[null,"jour ","code","chantier","H. prestées","H. sup."]
["2013-09-01",{"$f":"A405","v":"2013-09-01"},null,{"$f":"VLOOKUP(C405,Feuil1!$A$1:$B$9999,2)","v":{"$error":"#N/A"}}]
["2013-09-02",{"$f":"A406","v":"2013-09-02"},null,{"$f":"VLOOKUP(C406,Feuil1!$A$1:$B$9999,2)","v":{"$error":"#N/A"}}]
["2013-09-03","2013-09-03",null,{"$f":"VLOOKUP(C407,Feuil1!$A$1:$B$9999,2)","v":{"$error":"#N/A"}}]
["2013-09-04","2013-09-04",null,{"$f":"VLOOKUP(C408,Feuil1!$A$1:$B$9999,2)","v":{"$error":"#N/A"}}]
["2013-09-05","2013-09-05",null,{"$f":"VLOOKUP(C409,Feuil1!$A$1:$B$9999,2)","v":{"$error":"#N/A"}}]
["2013-09-06","2013-09-06",null,{"$f":"VLOOKUP(C410,Feuil1!$A$1:$B$9999,2)","v":{"$error":"#N/A"}}]
["2013-09-07","2013-09-07",null,{"$f":"VLOOKUP(C411,Feuil1!$A$1:$B$9999,2)","v":{"$error":"#N/A"}}]
["2013-09-08","2013-09-08",null,{"$f":"VLOOKUP(C412,Feuil1!$A$1:$B$9999,2)","v":{"$error":"#N/A"}}]
["2013-09-09","2013-09-09",null,{"$f":"VLOOKUP(C413,Feuil1!$A$1:$B$9999,2)","v":{"$error":"#N/A"}}]
["2013-09-10","2013-09-10",null,{"$f":"VLOOKUP(C414,Feuil1!$A$1:$B$9999,2)","v":{"$error":"#N/A"}}]
["2013-09-11","2013-09-11",null,{"$f":"VLOOKUP(C415,Feuil1!$A$1:$B$9999,2)","v":{"$error":"#N/A"}}]
["2013-09-12","2013-09-12",null,{"$f":"VLOOKUP(C416,Feuil1!$A$1:$B$9999,2)","v":{"$error":"#N/A"}}]
["2013-09-13","2013-09-13",null,{"$f":"VLOOKUP(C417,Feuil1!$A$1:$B$9999,2)","v":{"$error":"#N/A"}}]
["2013-09-14","2013-09-14",null,{"$f":"VLOOKUP(C418,Feuil1!$A$1:$B$9999,2)","v":{"$error":"#N/A"}}]
["2013-09-15","2013-09-15",null,{"$f":"VLOOKUP(C419,Feuil1!$A$1:$B$9999,2)","v":{"$error":"#N/A"}}]
["2013-09-16","2013-09-16",null,{"$f":"VLOOKUP(C420,Feuil1!$A$1:$B$9999,2)","v":{"$error":"#N/A"}}]
["2013-09-17","2013-09-17",null,{"$f":"VLOOKUP(C421,Feuil1!$A$1:$B$9999,2)","v":{"$error":"#N/A"}}]
["2013-09-18","2013-09-18",null,{"$f":"VLOOKUP(C422,Feuil1!$A$1:$B$9999,2)","v":{"$error":"#N/A"}}]
["2013-09-19","2013-09-19",null,{"$f":"VLOOKUP(C423,Feuil1!$A$1:$B$9999,2)","v":{"$error":"#N/A"}}]
["2013-09-20","2013-09-20",null,{"$f":"VLOOKUP(C424,Feuil1!$A$1:$B$9999,2)","v":{"$error":"#N/A"}}]
["2013-09-21","2013-09-21",null,{"$f":"VLOOKUP(C425,Feuil1!$A$1:$B$9999,2)","v":{"$error":"#N/A"}}]
["2013-09-22","2013-09-22",null,{"$f":"VLOOKUP(C426,Feuil1!$A$1:$B$9999,2)","v":{"$error":"#N/A"}}]
["2013-09-23","2013-09-23",null,{"$f":"VLOOKUP(C427,Feuil1!$A$1:$B$9999,2)","v":{"$error":"#N/A"}}]
["2013-09-24","2013-09-24",null,{"$f":"VLOOKUP(C428,Feuil1!$A$1:$B$9999,2)","v":{"$error":"#N/A"}}]
["2013-09-25","2013-09-25",null,{"$f":"VLOOKUP(C429,Feuil1!$A$1:$B$9999,2)","v":{"$error":"#N/A"}}]
["2013-09-26","2013-09-26",null,{"$f":"VLOOKUP(C430,Feuil1!$A$1:$B$9999,2)","v":{"$error":"#N/A"}}]
["2013-09-27","2013-09-27",null,{"$f":"VLOOKUP(C431,Feuil1!$A$1:$B$9999,2)","v":{"$error":"#N/A"}}]
["2013-09-28","2013-09-28",null,{"$f":"VLOOKUP(C432,Feuil1!$A$1:$B$9999,2)","v":{"$error":"#N/A"}}]
["2013-09-29","2013-09-29",null,{"$f":"VLOOKUP(C433,Feuil1!$A$1:$B$9999,2)","v":{"$error":"#N/A"}}]
["2013-09-30","2013-09-30",null,{"$f":"VLOOKUP(C434,Feuil1!$A$1:$B$9999,2)","v":{"$error":"#N/A"}}]
[]
[]
[]
[]
[]
[]
[]
[]
[]
[]
[]
[]
[]
[]
[]
[]
[]
["Ouvrier :","Ouvrier 1",null,null,"Octobre"]
[]
[null,"jour ","code","chantier","H. prestées","H. sup."]
["2013-10-01",{"$f":"A455","v":"2013-10-01"},null,{"$f":"VLOOKUP(C455,Feuil1!$A$1:$B$9999,2)","v":{"$error":"#N/A"}}]
["2013-10-02",{"$f":"A456","v":"2013-10-02"},null,{"$f":"VLOOKUP(C456,Feuil1!$A$1:$B$9999,2)","v":{"$error":"#N/A"}}]
["2013-10-03","2013-10-03",null,{"$f":"VLOOKUP(C457,Feuil1!$A$1:$B$9999,2)","v":{"$error":"#N/A"}}]
["2013-10-04","2013-10-04",null,{"$f":"VLOOKUP(C458,Feuil1!$A$1:$B$9999,2)","v":{"$error":"#N/A"}}]
["2013-10-05","2013-10-05",null,{"$f":"VLOOKUP(C459,Feuil1!$A$1:$B$9999,2)","v":{"$error":"#N/A"}}]
["2013-10-06","2013-10-06",null,{"$f":"VLOOKUP(C460,Feuil1!$A$1:$B$9999,2)","v":{"$error":"#N/A"}}]
["2013-10-07","2013-10-07",null,{"$f":"VLOOKUP(C461,Feuil1!$A$1:$B$9999,2)","v":{"$error":"#N/A"}}]
["2013-10-08","2013-10-08",null,{"$f":"VLOOKUP(C462,Feuil1!$A$1:$B$9999,2)","v":{"$error":"#N/A"}}]
["2013-10-09","2013-10-09",null,{"$f":"VLOOKUP(C463,Feuil1!$A$1:$B$9999,2)","v":{"$error":"#N/A"}}]
["2013-10-10","2013-10-10",null,{"$f":"VLOOKUP(C464,Feuil1!$A$1:$B$9999,2)","v":{"$error":"#N/A"}}]
["2013-10-11","2013-10-11",null,{"$f":"VLOOKUP(C465,Feuil1!$A$1:$B$9999,2)","v":{"$error":"#N/A"}}]
["2013-10-12","2013-10-12",null,{"$f":"VLOOKUP(C466,Feuil1!$A$1:$B$9999,2)","v":{"$error":"#N/A"}}]
["2013-10-13","2013-10-13",null,{"$f":"VLOOKUP(C467,Feuil1!$A$1:$B$9999,2)","v":{"$error":"#N/A"}}]
["2013-10-14","2013-10-14",null,{"$f":"VLOOKUP(C468,Feuil1!$A$1:$B$9999,2)","v":{"$error":"#N/A"}}]
["2013-10-15","2013-10-15",null,{"$f":"VLOOKUP(C469,Feuil1!$A$1:$B$9999,2)","v":{"$error":"#N/A"}}]
["2013-10-16","2013-10-16",null,{"$f":"VLOOKUP(C470,Feuil1!$A$1:$B$9999,2)","v":{"$error":"#N/A"}}]
["2013-10-17","2013-10-17",null,{"$f":"VLOOKUP(C471,Feuil1!$A$1:$B$9999,2)","v":{"$error":"#N/A"}}]
["2013-10-18","2013-10-18",null,{"$f":"VLOOKUP(C472,Feuil1!$A$1:$B$9999,2)","v":{"$error":"#N/A"}}]
["2013-10-19","2013-10-19",null,{"$f":"VLOOKUP(C473,Feuil1!$A$1:$B$9999,2)","v":{"$error":"#N/A"}}]
["2013-10-20","2013-10-20",null,{"$f":"VLOOKUP(C474,Feuil1!$A$1:$B$9999,2)","v":{"$error":"#N/A"}}]
["2013-10-21","2013-10-21",null,{"$f":"VLOOKUP(C475,Feuil1!$A$1:$B$9999,2)","v":{"$error":"#N/A"}}]
["2013-10-22","2013-10-22",null,{"$f":"VLOOKUP(C476,Feuil1!$A$1:$B$9999,2)","v":{"$error":"#N/A"}}]
["2013-10-23","2013-10-23",null,{"$f":"VLOOKUP(C477,Feuil1!$A$1:$B$9999,2)","v":{"$error":"#N/A"}}]
["2013-10-24","2013-10-24",null,{"$f":"VLOOKUP(C478,Feuil1!$A$1:$B$9999,2)","v":{"$error":"#N/A"}}]
["2013-10-25","2013-10-25",null,{"$f":"VLOOKUP(C479,Feuil1!$A$1:$B$9999,2)","v":{"$error":"#N/A"}}]
["2013-10-26","2013-10-26",null,{"$f":"VLOOKUP(C480,Feuil1!$A$1:$B$9999,2)","v":{"$error":"#N/A"}}]
["2013-10-27","2013-10-27",null,{"$f":"VLOOKUP(C481,Feuil1!$A$1:$B$9999,2)","v":{"$error":"#N/A"}}]
["2013-10-28","2013-10-28",null,{"$f":"VLOOKUP(C482,Feuil1!$A$1:$B$9999,2)","v":{"$error":"#N/A"}}]
["2013-10-29","2013-10-29",null,{"$f":"VLOOKUP(C483,Feuil1!$A$1:$B$9999,2)","v":{"$error":"#N/A"}}]
["2013-10-30","2013-10-30",null,{"$f":"VLOOKUP(C484,Feuil1!$A$1:$B$9999,2)","v":{"$error":"#N/A"}}]
["2013-10-31","2013-10-31",null,{"$f":"VLOOKUP(C485,Feuil1!$A$1:$B$9999,2)","v":{"$error":"#N/A"}}]
[]
[]
[]
[]
[]
[]
[]
[]
[]
[]
[]
[]
[]
[]
[]
[]
["Ouvrier :","Ouvrier 1",null,null,"Novembre"]
[]
["date ","jour ","code","chantier","H. prestées","H. sup."]
["2013-11-01",{"$f":"A505","v":"2013-11-01"},null,{"$f":"VLOOKUP(C505,Feuil1!$A$1:$B$9999,2)","v":{"$error":"#N/A"}}]
["2013-11-02",{"$f":"A506","v":"2013-11-02"},null,{"$f":"VLOOKUP(C506,Feuil1!$A$1:$B$9999,2)","v":{"$error":"#N/A"}}]
["2013-11-03","2013-11-03",null,{"$f":"VLOOKUP(C507,Feuil1!$A$1:$B$9999,2)","v":{"$error":"#N/A"}}]
["2013-11-04","2013-11-04",null,{"$f":"VLOOKUP(C508,Feuil1!$A$1:$B$9999,2)","v":{"$error":"#N/A"}}]
["2013-11-05","2013-11-05",null,{"$f":"VLOOKUP(C509,Feuil1!$A$1:$B$9999,2)","v":{"$error":"#N/A"}}]
["2013-11-06","2013-11-06",null,{"$f":"VLOOKUP(C510,Feuil1!$A$1:$B$9999,2)","v":{"$error":"#N/A"}}]
["2013-11-07","2013-11-07",null,{"$f":"VLOOKUP(C511,Feuil1!$A$1:$B$9999,2)","v":{"$error":"#N/A"}}]
["2013-11-08","2013-11-08",null,{"$f":"VLOOKUP(C512,Feuil1!$A$1:$B$9999,2)","v":{"$error":"#N/A"}}]
["2013-11-09","2013-11-09",null,{"$f":"VLOOKUP(C513,Feuil1!$A$1:$B$9999,2)","v":{"$error":"#N/A"}}]
["2013-11-10","2013-11-10",null,{"$f":"VLOOKUP(C514,Feuil1!$A$1:$B$9999,2)","v":{"$error":"#N/A"}}]
["2013-11-11","2013-11-11",null,{"$f":"VLOOKUP(C515,Feuil1!$A$1:$B$9999,2)","v":{"$error":"#N/A"}}]
["2013-11-12","2013-11-12",null,{"$f":"VLOOKUP(C516,Feuil1!$A$1:$B$9999,2)","v":{"$error":"#N/A"}}]
["2013-11-13","2013-11-13",null,{"$f":"VLOOKUP(C517,Feuil1!$A$1:$B$9999,2)","v":{"$error":"#N/A"}}]
["2013-11-14","2013-11-14",null,{"$f":"VLOOKUP(C518,Feuil1!$A$1:$B$9999,2)","v":{"$error":"#N/A"}}]
["2013-11-15","2013-11-15",null,{"$f":"VLOOKUP(C519,Feuil1!$A$1:$B$9999,2)","v":{"$error":"#N/A"}}]
["2013-11-16","2013-11-16",null,{"$f":"VLOOKUP(C520,Feuil1!$A$1:$B$9999,2)","v":{"$error":"#N/A"}}]
["2013-11-17","2013-11-17",null,{"$f":"VLOOKUP(C521,Feuil1!$A$1:$B$9999,2)","v":{"$error":"#N/A"}}]
["2013-11-18","2013-11-18",null,{"$f":"VLOOKUP(C522,Feuil1!$A$1:$B$9999,2)","v":{"$error":"#N/A"}}]
["2013-11-19","2013-11-19",null,{"$f":"VLOOKUP(C523,Feuil1!$A$1:$B$9999,2)","v":{"$error":"#N/A"}}]
["2013-11-20","2013-11-20",null,{"$f":"VLOOKUP(C524,Feuil1!$A$1:$B$9999,2)","v":{"$error":"#N/A"}}]
["2013-11-21","2013-11-21",null,{"$f":"VLOOKUP(C525,Feuil1!$A$1:$B$9999,2)","v":{"$error":"#N/A"}}]
["2013-11-22","2013-11-22",null,{"$f":"VLOOKUP(C526,Feuil1!$A$1:$B$9999,2)","v":{"$error":"#N/A"}}]
["2013-11-23","2013-11-23",null,{"$f":"VLOOKUP(C527,Feuil1!$A$1:$B$9999,2)","v":{"$error":"#N/A"}}]
["2013-11-24","2013-11-24",null,{"$f":"VLOOKUP(C528,Feuil1!$A$1:$B$9999,2)","v":{"$error":"#N/A"}}]
["2013-11-25","2013-11-25",null,{"$f":"VLOOKUP(C529,Feuil1!$A$1:$B$9999,2)","v":{"$error":"#N/A"}}]
["2013-11-26","2013-11-26",null,{"$f":"VLOOKUP(C530,Feuil1!$A$1:$B$9999,2)","v":{"$error":"#N/A"}}]
["2013-11-27","2013-11-27",null,{"$f":"VLOOKUP(C531,Feuil1!$A$1:$B$9999,2)","v":{"$error":"#N/A"}}]
["2013-11-28","2013-11-28",null,{"$f":"VLOOKUP(C532,Feuil1!$A$1:$B$9999,2)","v":{"$error":"#N/A"}}]
["2013-11-29","2013-11-29",null,{"$f":"VLOOKUP(C533,Feuil1!$A$1:$B$9999,2)","v":{"$error":"#N/A"}}]
["2013-11-30","2013-11-30",null,{"$f":"VLOOKUP(C534,Feuil1!$A$1:$B$9999,2)","v":{"$error":"#N/A"}}]
[]
[]
[]
[]
[]
[]
[]
[]
[]
[]
[]
[]
[]
[]
[]
[]
[]
["Ouvrier :","Ouvrier 1",null,null,"Décembre"]
[]
["date ","jour ","code","chantier","H. prestées","H. sup."]
["2013-12-01",{"$f":"A555","v":"2013-12-01"},null,{"$f":"VLOOKUP(C555,Feuil1!$A$1:$B$9999,2)","v":{"$error":"#N/A"}}]
["2013-12-02",{"$f":"A556","v":"2013-12-02"},null,{"$f":"VLOOKUP(C556,Feuil1!$A$1:$B$9999,2)","v":{"$error":"#N/A"}}]
["2013-12-03","2013-12-03",null,{"$f":"VLOOKUP(C557,Feuil1!$A$1:$B$9999,2)","v":{"$error":"#N/A"}}]
["2013-12-04","2013-12-04",null,{"$f":"VLOOKUP(C558,Feuil1!$A$1:$B$9999,2)","v":{"$error":"#N/A"}}]
["2013-12-05","2013-12-05",null,{"$f":"VLOOKUP(C559,Feuil1!$A$1:$B$9999,2)","v":{"$error":"#N/A"}}]
["2013-12-06","2013-12-06",null,{"$f":"VLOOKUP(C560,Feuil1!$A$1:$B$9999,2)","v":{"$error":"#N/A"}}]
["2013-12-07","2013-12-07",null,{"$f":"VLOOKUP(C561,Feuil1!$A$1:$B$9999,2)","v":{"$error":"#N/A"}}]
["2013-12-08","2013-12-08",null,{"$f":"VLOOKUP(C562,Feuil1!$A$1:$B$9999,2)","v":{"$error":"#N/A"}}]
["2013-12-09","2013-12-09",null,{"$f":"VLOOKUP(C563,Feuil1!$A$1:$B$9999,2)","v":{"$error":"#N/A"}}]
["2013-12-10","2013-12-10",null,{"$f":"VLOOKUP(C564,Feuil1!$A$1:$B$9999,2)","v":{"$error":"#N/A"}}]
["2013-12-11","2013-12-11",null,{"$f":"VLOOKUP(C565,Feuil1!$A$1:$B$9999,2)","v":{"$error":"#N/A"}}]
["2013-12-12","2013-12-12",null,{"$f":"VLOOKUP(C566,Feuil1!$A$1:$B$9999,2)","v":{"$error":"#N/A"}}]
["2013-12-13","2013-12-13",null,{"$f":"VLOOKUP(C567,Feuil1!$A$1:$B$9999,2)","v":{"$error":"#N/A"}}]
["2013-12-14","2013-12-14",null,{"$f":"VLOOKUP(C568,Feuil1!$A$1:$B$9999,2)","v":{"$error":"#N/A"}}]
["2013-12-15","2013-12-15",null,{"$f":"VLOOKUP(C569,Feuil1!$A$1:$B$9999,2)","v":{"$error":"#N/A"}}]
["2013-12-16","2013-12-16",null,{"$f":"VLOOKUP(C570,Feuil1!$A$1:$B$9999,2)","v":{"$error":"#N/A"}}]
["2013-12-17","2013-12-17",null,{"$f":"VLOOKUP(C571,Feuil1!$A$1:$B$9999,2)","v":{"$error":"#N/A"}}]
["2013-12-18","2013-12-18",null,{"$f":"VLOOKUP(C572,Feuil1!$A$1:$B$9999,2)","v":{"$error":"#N/A"}}]
["2013-12-19","2013-12-19",null,{"$f":"VLOOKUP(C573,Feuil1!$A$1:$B$9999,2)","v":{"$error":"#N/A"}}]
["2013-12-20","2013-12-20",null,{"$f":"VLOOKUP(C574,Feuil1!$A$1:$B$9999,2)","v":{"$error":"#N/A"}}]
["2013-12-21","2013-12-21",null,{"$f":"VLOOKUP(C575,Feuil1!$A$1:$B$9999,2)","v":{"$error":"#N/A"}}]
["2013-12-22","2013-12-22",null,{"$f":"VLOOKUP(C576,Feuil1!$A$1:$B$9999,2)","v":{"$error":"#N/A"}}]
["2013-12-23","2013-12-23",null,{"$f":"VLOOKUP(C577,Feuil1!$A$1:$B$9999,2)","v":{"$error":"#N/A"}}]
["2013-12-24","2013-12-24",null,{"$f":"VLOOKUP(C578,Feuil1!$A$1:$B$9999,2)","v":{"$error":"#N/A"}}]
["2013-12-25","2013-12-25",null,{"$f":"VLOOKUP(C579,Feuil1!$A$1:$B$9999,2)","v":{"$error":"#N/A"}}]
["2013-12-26","2013-12-26",null,{"$f":"VLOOKUP(C580,Feuil1!$A$1:$B$9999,2)","v":{"$error":"#N/A"}}]
["2013-12-27","2013-12-27",null,{"$f":"VLOOKUP(C581,Feuil1!$A$1:$B$9999,2)","v":{"$error":"#N/A"}}]
["2013-12-28","2013-12-28",null,{"$f":"VLOOKUP(C582,Feuil1!$A$1:$B$9999,2)","v":{"$error":"#N/A"}}]
["2013-12-29","2013-12-29",null,{"$f":"VLOOKUP(C583,Feuil1!$A$1:$B$9999,2)","v":{"$error":"#N/A"}}]
["2013-12-30","2013-12-30",null,{"$f":"VLOOKUP(C584,Feuil1!$A$1:$B$9999,2)","v":{"$error":"#N/A"}}]
["2013-12-31","2013-12-31",null,{"$f":"VLOOKUP(C585,Feuil1!$A$1:$B$9999,2)","v":{"$error":"#N/A"}}]

{"sheet":"Ouvrier2","index":2,"n_rows":586,"n_cols":6,"rows_kept":586,"cut":false,"hidden":false,"merged":[[0,4,0,5],[52,4,52,5],[102,4,102,5],[152,4,152,5],[202,4,202,5],[502,4,502,5],[552,4,552,5],[252,4,252,5],[302,4,302,5],[352,4,352,5],[402,4,402,5],[452,4,452,5]]}
["Ouvrier :","Ouvrier 2",null,null,"Janvier"]
[]
["date ","jour ","code","chantier","H. prestées","H. sup."]
["2013-01-01",{"$f":"A4","v":"2013-01-01"},"c",{"$f":"VLOOKUP(C4,Feuil1!$A$1:$B$9999,2)","v":"Congé"},0,0]
["2013-01-02","2013-01-02","A",{"$f":"VLOOKUP(C5,Feuil1!$A$1:$B$9999,2)","v":"Absent"},0,0]
["2013-01-03","2013-01-03","cl00431/1",{"$f":"VLOOKUP(C6,Feuil1!$A$1:$B$9999,2)","v":"CPH Ath"},9,9]
["2013-01-04","2013-01-04","cl00431/1",{"$f":"VLOOKUP(C7,Feuil1!$A$1:$B$9999,2)","v":"CPH Ath"},9,9]
["2013-01-05","2013-01-05","cl00431/1",{"$f":"VLOOKUP(C8,Feuil1!$A$1:$B$9999,2)","v":"CPH Ath"},9,9]
["2013-01-06","2013-01-06"]
["2013-01-07","2013-01-07","cl01289",{"$f":"VLOOKUP(C10,Feuil1!$A$1:$B$9999,2)","v":"Résidence Mean House"},8,8]
["2013-01-08","2013-01-08","cl01289",{"$f":"VLOOKUP(C11,Feuil1!$A$1:$B$9999,2)","v":"Résidence Mean House"},8,8]
["2013-01-09","2013-01-09","cl01289",{"$f":"VLOOKUP(C12,Feuil1!$A$1:$B$9999,2)","v":"Résidence Mean House"},8,8]
["2013-01-10","2013-01-10","cl01289",{"$f":"VLOOKUP(C13,Feuil1!$A$1:$B$9999,2)","v":"Résidence Mean House"},8,8]
["2013-01-11","2013-01-11","cl01289",{"$f":"VLOOKUP(C14,Feuil1!$A$1:$B$9999,2)","v":"Résidence Mean House"},1,1]
[null,null,"cl00431/1","CPH Ath",7,7]
["2013-01-12","2013-01-12"]
["2013-01-13","2013-01-13"]
["2013-01-14","2013-01-14","cl01289",{"$f":"VLOOKUP(C18,Feuil1!$A$1:$B$9999,2)","v":"Résidence Mean House"},8,8]
["2013-01-15","2013-01-15","cl01289",{"$f":"VLOOKUP(C19,Feuil1!$A$1:$B$9999,2)","v":"Résidence Mean House"},8,8]
["2013-01-16","2013-01-16","cl01289",{"$f":"VLOOKUP(C20,Feuil1!$A$1:$B$9999,2)","v":"Résidence Mean House"},8,8]
["2013-01-17","2013-01-17","cl01289",{"$f":"VLOOKUP(C21,Feuil1!$A$1:$B$9999,2)","v":"Résidence Mean House"},8,8]
["2013-01-18","2013-01-18","cl00319",{"$f":"VLOOKUP(C22,Feuil1!$A$1:$B$9999,2)","v":"Vandenbussche"},8,8]
["2013-01-19","2013-01-19","cl00319",{"$f":"VLOOKUP(C23,Feuil1!$A$1:$B$9999,2)","v":"Vandenbussche"},8,8]
["2013-01-20","2013-01-20"]
["2013-01-21","2013-01-21","a",{"$f":"VLOOKUP(C25,Feuil1!$A$1:$B$9999,2)","v":"Absent"},0,0]
["2013-01-22","2013-01-22","cl00060",{"$f":"VLOOKUP(C26,Feuil1!$A$1:$B$9999,2)","v":"HOME SAINT JEAN"},8,8]
["2013-01-23","2013-01-23","cl01603/1",{"$f":"VLOOKUP(C27,Feuil1!$A$1:$B$9999,2)","v":"Henrard-Roselaine Proxi Delhaize"},8,8]
["2013-01-24","2013-01-24","cl00565",{"$f":"VLOOKUP(C28,Feuil1!$A$1:$B$9999,2)","v":"Delbart Frédéric"},8,8]
["2013-01-25","2013-01-25","cl00060",{"$f":"VLOOKUP(C29,Feuil1!$A$1:$B$9999,2)","v":"HOME SAINT JEAN"},3,3]
[null,null,"cl01503",{"$f":"VLOOKUP(C30,Feuil1!$A$1:$B$9999,2)","v":"Deltenre"},5,5]
["2013-01-26","2013-01-26",null,null,0,0]
["2013-01-27","2013-01-27"]
["2013-01-28","2013-01-28","cl00431",{"$f":"VLOOKUP(C33,Feuil1!$A$1:$B$9999,2)","v":"CPH Tournai"},8,8]
["2013-01-29","2013-01-29","cl00431",{"$f":"VLOOKUP(C34,Feuil1!$A$1:$B$9999,2)","v":"CPH Tournai"},8,8]
["2013-01-30","2013-01-30","cl00431",{"$f":"VLOOKUP(C35,Feuil1!$A$1:$B$9999,2)","v":"CPH Tournai"},8,8]
["2013-01-31","2013-01-31","cl00431",{"$f":"VLOOKUP(C36,Feuil1!$A$1:$B$9999,2)","v":"CPH Tournai"},8,8]
[]
[]
[]
[]
[]
[]
[]
[]
[]
[]
[]
[]
[]
[]
[]
[]
["Ouvrier :","Ouvrier 1",null,null,"Février"]
[]
["date ","jour ","code","chantier","H. prestées","H. sup."]
["2013-02-01",{"$f":"A56","v":"2013-02-01"},null,{"$f":"VLOOKUP(C56,Feuil1!$A$1:$B$9999,2)","v":{"$error":"#N/A"}}]
["2013-02-02",{"$f":"A57","v":"2013-02-02"},null,{"$f":"VLOOKUP(C57,Feuil1!$A$1:$B$9999,2)","v":{"$error":"#N/A"}}]
["2013-02-03","2013-02-03",null,{"$f":"VLOOKUP(C58,Feuil1!$A$1:$B$9999,2)","v":{"$error":"#N/A"}}]
["2013-02-04","2013-02-04",null,{"$f":"VLOOKUP(C59,Feuil1!$A$1:$B$9999,2)","v":{"$error":"#N/A"}}]
["2013-02-05","2013-02-05",null,{"$f":"VLOOKUP(C60,Feuil1!$A$1:$B$9999,2)","v":{"$error":"#N/A"}}]
["2013-02-06","2013-02-06",null,{"$f":"VLOOKUP(C61,Feuil1!$A$1:$B$9999,2)","v":{"$error":"#N/A"}}]
["2013-02-07","2013-02-07",null,{"$f":"VLOOKUP(C62,Feuil1!$A$1:$B$9999,2)","v":{"$error":"#N/A"}}]
["2013-02-08","2013-02-08",null,{"$f":"VLOOKUP(C63,Feuil1!$A$1:$B$9999,2)","v":{"$error":"#N/A"}}]
["2013-02-09","2013-02-09",null,{"$f":"VLOOKUP(C64,Feuil1!$A$1:$B$9999,2)","v":{"$error":"#N/A"}}]
["2013-02-10","2013-02-10",null,{"$f":"VLOOKUP(C65,Feuil1!$A$1:$B$9999,2)","v":{"$error":"#N/A"}}]
["2013-02-11","2013-02-11",null,{"$f":"VLOOKUP(C66,Feuil1!$A$1:$B$9999,2)","v":{"$error":"#N/A"}}]
["2013-02-12","2013-02-12",null,{"$f":"VLOOKUP(C67,Feuil1!$A$1:$B$9999,2)","v":{"$error":"#N/A"}}]
["2013-02-13","2013-02-13",null,{"$f":"VLOOKUP(C68,Feuil1!$A$1:$B$9999,2)","v":{"$error":"#N/A"}}]
["2013-02-14","2013-02-14",null,{"$f":"VLOOKUP(C69,Feuil1!$A$1:$B$9999,2)","v":{"$error":"#N/A"}}]
["2013-02-15","2013-02-15",null,{"$f":"VLOOKUP(C70,Feuil1!$A$1:$B$9999,2)","v":{"$error":"#N/A"}}]
["2013-02-16","2013-02-16",null,{"$f":"VLOOKUP(C71,Feuil1!$A$1:$B$9999,2)","v":{"$error":"#N/A"}}]
["2013-02-17","2013-02-17",null,{"$f":"VLOOKUP(C72,Feuil1!$A$1:$B$9999,2)","v":{"$error":"#N/A"}}]
["2013-02-18","2013-02-18",null,{"$f":"VLOOKUP(C73,Feuil1!$A$1:$B$9999,2)","v":{"$error":"#N/A"}}]
["2013-02-19","2013-02-19",null,{"$f":"VLOOKUP(C74,Feuil1!$A$1:$B$9999,2)","v":{"$error":"#N/A"}}]
["2013-02-20","2013-02-20",null,{"$f":"VLOOKUP(C75,Feuil1!$A$1:$B$9999,2)","v":{"$error":"#N/A"}}]
["2013-02-21","2013-02-21",null,{"$f":"VLOOKUP(C76,Feuil1!$A$1:$B$9999,2)","v":{"$error":"#N/A"}}]
["2013-02-22","2013-02-22",null,{"$f":"VLOOKUP(C77,Feuil1!$A$1:$B$9999,2)","v":{"$error":"#N/A"}}]
["2013-02-23","2013-02-23",null,{"$f":"VLOOKUP(C78,Feuil1!$A$1:$B$9999,2)","v":{"$error":"#N/A"}}]
["2013-02-24","2013-02-24",null,{"$f":"VLOOKUP(C79,Feuil1!$A$1:$B$9999,2)","v":{"$error":"#N/A"}}]
["2013-02-25","2013-02-25",null,{"$f":"VLOOKUP(C80,Feuil1!$A$1:$B$9999,2)","v":{"$error":"#N/A"}}]
["2013-02-26","2013-02-26",null,{"$f":"VLOOKUP(C81,Feuil1!$A$1:$B$9999,2)","v":{"$error":"#N/A"}}]
["2013-02-27","2013-02-27",null,{"$f":"VLOOKUP(C82,Feuil1!$A$1:$B$9999,2)","v":{"$error":"#N/A"}}]
["2013-02-28","2013-02-28",null,{"$f":"VLOOKUP(C83,Feuil1!$A$1:$B$9999,2)","v":{"$error":"#N/A"}}]
[]
[]
[]
[]
[]
[]
[]
[]
[]
[]
[]
[]
[]
[]
[]
[]
[]
[]
[]
["Ouvrier :","Ouvrier 1",null,null,"Mars"]
[]
["date ","jour ","code","chantier","H. prestées","H. sup."]
["2013-03-01",{"$f":"A106","v":"2013-03-01"},null,{"$f":"VLOOKUP(C106,Feuil1!$A$1:$B$9999,2)","v":{"$error":"#N/A"}}]
["2013-03-02",{"$f":"A107","v":"2013-03-02"},null,{"$f":"VLOOKUP(C107,Feuil1!$A$1:$B$9999,2)","v":{"$error":"#N/A"}}]
["2013-03-03","2013-03-03",null,{"$f":"VLOOKUP(C108,Feuil1!$A$1:$B$9999,2)","v":{"$error":"#N/A"}}]
["2013-03-04","2013-03-04",null,{"$f":"VLOOKUP(C109,Feuil1!$A$1:$B$9999,2)","v":{"$error":"#N/A"}}]
["2013-03-05","2013-03-05",null,{"$f":"VLOOKUP(C110,Feuil1!$A$1:$B$9999,2)","v":{"$error":"#N/A"}}]
["2013-03-06","2013-03-06",null,{"$f":"VLOOKUP(C111,Feuil1!$A$1:$B$9999,2)","v":{"$error":"#N/A"}}]
["2013-03-07","2013-03-07",null,{"$f":"VLOOKUP(C112,Feuil1!$A$1:$B$9999,2)","v":{"$error":"#N/A"}}]
["2013-03-08","2013-03-08",null,{"$f":"VLOOKUP(C113,Feuil1!$A$1:$B$9999,2)","v":{"$error":"#N/A"}}]
["2013-03-09","2013-03-09",null,{"$f":"VLOOKUP(C114,Feuil1!$A$1:$B$9999,2)","v":{"$error":"#N/A"}}]
["2013-03-10","2013-03-10",null,{"$f":"VLOOKUP(C115,Feuil1!$A$1:$B$9999,2)","v":{"$error":"#N/A"}}]
["2013-03-11","2013-03-11",null,{"$f":"VLOOKUP(C116,Feuil1!$A$1:$B$9999,2)","v":{"$error":"#N/A"}}]
["2013-03-12","2013-03-12",null,{"$f":"VLOOKUP(C117,Feuil1!$A$1:$B$9999,2)","v":{"$error":"#N/A"}}]
["2013-03-13","2013-03-13",null,{"$f":"VLOOKUP(C118,Feuil1!$A$1:$B$9999,2)","v":{"$error":"#N/A"}}]
["2013-03-14","2013-03-14",null,{"$f":"VLOOKUP(C119,Feuil1!$A$1:$B$9999,2)","v":{"$error":"#N/A"}}]
["2013-03-15","2013-03-15",null,{"$f":"VLOOKUP(C120,Feuil1!$A$1:$B$9999,2)","v":{"$error":"#N/A"}}]
["2013-03-16","2013-03-16",null,{"$f":"VLOOKUP(C121,Feuil1!$A$1:$B$9999,2)","v":{"$error":"#N/A"}}]
["2013-03-17","2013-03-17",null,{"$f":"VLOOKUP(C122,Feuil1!$A$1:$B$9999,2)","v":{"$error":"#N/A"}}]
["2013-03-18","2013-03-18",null,{"$f":"VLOOKUP(C123,Feuil1!$A$1:$B$9999,2)","v":{"$error":"#N/A"}}]
["2013-03-19","2013-03-19",null,{"$f":"VLOOKUP(C124,Feuil1!$A$1:$B$9999,2)","v":{"$error":"#N/A"}}]
["2013-03-20","2013-03-20",null,{"$f":"VLOOKUP(C125,Feuil1!$A$1:$B$9999,2)","v":{"$error":"#N/A"}}]
["2013-03-21","2013-03-21",null,{"$f":"VLOOKUP(C126,Feuil1!$A$1:$B$9999,2)","v":{"$error":"#N/A"}}]
["2013-03-22","2013-03-22",null,{"$f":"VLOOKUP(C127,Feuil1!$A$1:$B$9999,2)","v":{"$error":"#N/A"}}]
["2013-03-23","2013-03-23",null,{"$f":"VLOOKUP(C128,Feuil1!$A$1:$B$9999,2)","v":{"$error":"#N/A"}}]
["2013-03-24","2013-03-24",null,{"$f":"VLOOKUP(C129,Feuil1!$A$1:$B$9999,2)","v":{"$error":"#N/A"}}]
["2013-03-25","2013-03-25",null,{"$f":"VLOOKUP(C130,Feuil1!$A$1:$B$9999,2)","v":{"$error":"#N/A"}}]
["2013-03-26","2013-03-26",null,{"$f":"VLOOKUP(C131,Feuil1!$A$1:$B$9999,2)","v":{"$error":"#N/A"}}]
["2013-03-27","2013-03-27",null,{"$f":"VLOOKUP(C132,Feuil1!$A$1:$B$9999,2)","v":{"$error":"#N/A"}}]
["2013-03-28","2013-03-28",null,{"$f":"VLOOKUP(C133,Feuil1!$A$1:$B$9999,2)","v":{"$error":"#N/A"}}]
["2013-03-29","2013-03-29",null,{"$f":"VLOOKUP(C134,Feuil1!$A$1:$B$9999,2)","v":{"$error":"#N/A"}}]
["2013-03-30","2013-03-30",null,{"$f":"VLOOKUP(C135,Feuil1!$A$1:$B$9999,2)","v":{"$error":"#N/A"}}]
["2013-03-31","2013-03-31",null,{"$f":"VLOOKUP(C136,Feuil1!$A$1:$B$9999,2)","v":{"$error":"#N/A"}}]
[]
[]
[]
[]
[]
[]
[]
[]
[]
[]
[]
[]
[]
[]
[]
[]
["Ouvrier :","Ouvrier 1",null,null,"Avril"]
[]
[null,"jour ","code","chantier","H. prestées","H. sup."]
["2013-04-01",{"$f":"A156","v":"2013-04-01"},null,{"$f":"VLOOKUP(C156,Feuil1!$A$1:$B$9999,2)","v":{"$error":"#N/A"}}]
["2013-04-02",{"$f":"A157","v":"2013-04-02"},null,{"$f":"VLOOKUP(C157,Feuil1!$A$1:$B$9999,2)","v":{"$error":"#N/A"}}]
["2013-04-03","2013-04-03",null,{"$f":"VLOOKUP(C158,Feuil1!$A$1:$B$9999,2)","v":{"$error":"#N/A"}}]
["2013-04-04","2013-04-04",null,{"$f":"VLOOKUP(C159,Feuil1!$A$1:$B$9999,2)","v":{"$error":"#N/A"}}]
["2013-04-05","2013-04-05",null,{"$f":"VLOOKUP(C160,Feuil1!$A$1:$B$9999,2)","v":{"$error":"#N/A"}}]
["2013-04-06","2013-04-06",null,{"$f":"VLOOKUP(C161,Feuil1!$A$1:$B$9999,2)","v":{"$error":"#N/A"}}]
["2013-04-07","2013-04-07",null,{"$f":"VLOOKUP(C162,Feuil1!$A$1:$B$9999,2)","v":{"$error":"#N/A"}}]
["2013-04-08","2013-04-08",null,{"$f":"VLOOKUP(C163,Feuil1!$A$1:$B$9999,2)","v":{"$error":"#N/A"}}]
["2013-04-09","2013-04-09",null,{"$f":"VLOOKUP(C164,Feuil1!$A$1:$B$9999,2)","v":{"$error":"#N/A"}}]
["2013-04-10","2013-04-10",null,{"$f":"VLOOKUP(C165,Feuil1!$A$1:$B$9999,2)","v":{"$error":"#N/A"}}]
["2013-04-11","2013-04-11",null,{"$f":"VLOOKUP(C166,Feuil1!$A$1:$B$9999,2)","v":{"$error":"#N/A"}}]
["2013-04-12","2013-04-12",null,{"$f":"VLOOKUP(C167,Feuil1!$A$1:$B$9999,2)","v":{"$error":"#N/A"}}]
["2013-04-13","2013-04-13",null,{"$f":"VLOOKUP(C168,Feuil1!$A$1:$B$9999,2)","v":{"$error":"#N/A"}}]
["2013-04-14","2013-04-14",null,{"$f":"VLOOKUP(C169,Feuil1!$A$1:$B$9999,2)","v":{"$error":"#N/A"}}]
["2013-04-15","2013-04-15",null,{"$f":"VLOOKUP(C170,Feuil1!$A$1:$B$9999,2)","v":{"$error":"#N/A"}}]
["2013-04-16","2013-04-16",null,{"$f":"VLOOKUP(C171,Feuil1!$A$1:$B$9999,2)","v":{"$error":"#N/A"}}]
["2013-04-17","2013-04-17",null,{"$f":"VLOOKUP(C172,Feuil1!$A$1:$B$9999,2)","v":{"$error":"#N/A"}}]
["2013-04-18","2013-04-18",null,{"$f":"VLOOKUP(C173,Feuil1!$A$1:$B$9999,2)","v":{"$error":"#N/A"}}]
["2013-04-19","2013-04-19",null,{"$f":"VLOOKUP(C174,Feuil1!$A$1:$B$9999,2)","v":{"$error":"#N/A"}}]
["2013-04-20","2013-04-20",null,{"$f":"VLOOKUP(C175,Feuil1!$A$1:$B$9999,2)","v":{"$error":"#N/A"}}]
["2013-04-21","2013-04-21",null,{"$f":"VLOOKUP(C176,Feuil1!$A$1:$B$9999,2)","v":{"$error":"#N/A"}}]
["2013-04-22","2013-04-22",null,{"$f":"VLOOKUP(C177,Feuil1!$A$1:$B$9999,2)","v":{"$error":"#N/A"}}]
["2013-04-23","2013-04-23",null,{"$f":"VLOOKUP(C178,Feuil1!$A$1:$B$9999,2)","v":{"$error":"#N/A"}}]
["2013-04-24","2013-04-24",null,{"$f":"VLOOKUP(C179,Feuil1!$A$1:$B$9999,2)","v":{"$error":"#N/A"}}]
["2013-04-25","2013-04-25",null,{"$f":"VLOOKUP(C180,Feuil1!$A$1:$B$9999,2)","v":{"$error":"#N/A"}}]
["2013-04-26","2013-04-26",null,{"$f":"VLOOKUP(C181,Feuil1!$A$1:$B$9999,2)","v":{"$error":"#N/A"}}]
["2013-04-27","2013-04-27",null,{"$f":"VLOOKUP(C182,Feuil1!$A$1:$B$9999,2)","v":{"$error":"#N/A"}}]
["2013-04-28","2013-04-28",null,{"$f":"VLOOKUP(C183,Feuil1!$A$1:$B$9999,2)","v":{"$error":"#N/A"}}]
["2013-04-29","2013-04-29",null,{"$f":"VLOOKUP(C184,Feuil1!$A$1:$B$9999,2)","v":{"$error":"#N/A"}}]
["2013-04-30","2013-04-30",null,{"$f":"VLOOKUP(C185,Feuil1!$A$1:$B$9999,2)","v":{"$error":"#N/A"}}]
[]
[]
[]
[]
[]
[]
[]
[]
[]
[]
[]
[]
[]
[]
[]
[]
[]
["Ouvrier :","Ouvrier 1",null,null,"Mai"]
[]
[null,"jour ","code","chantier","H. prestées","H. sup."]
["2013-05-01",{"$f":"A206","v":"2013-05-01"},null,{"$f":"VLOOKUP(C206,Feuil1!$A$1:$B$9999,2)","v":{"$error":"#N/A"}}]
["2013-05-02",{"$f":"A207","v":"2013-05-02"},null,{"$f":"VLOOKUP(C207,Feuil1!$A$1:$B$9999,2)","v":{"$error":"#N/A"}}]
["2013-05-03","2013-05-03",null,{"$f":"VLOOKUP(C208,Feuil1!$A$1:$B$9999,2)","v":{"$error":"#N/A"}}]
["2013-05-04","2013-05-04",null,{"$f":"VLOOKUP(C209,Feuil1!$A$1:$B$9999,2)","v":{"$error":"#N/A"}}]
["2013-05-05","2013-05-05",null,{"$f":"VLOOKUP(C210,Feuil1!$A$1:$B$9999,2)","v":{"$error":"#N/A"}}]
["2013-05-06","2013-05-06",null,{"$f":"VLOOKUP(C211,Feuil1!$A$1:$B$9999,2)","v":{"$error":"#N/A"}}]
["2013-05-07","2013-05-07",null,{"$f":"VLOOKUP(C212,Feuil1!$A$1:$B$9999,2)","v":{"$error":"#N/A"}}]
["2013-05-08","2013-05-08",null,{"$f":"VLOOKUP(C213,Feuil1!$A$1:$B$9999,2)","v":{"$error":"#N/A"}}]
["2013-05-09","2013-05-09",null,{"$f":"VLOOKUP(C214,Feuil1!$A$1:$B$9999,2)","v":{"$error":"#N/A"}}]
["2013-05-10","2013-05-10",null,{"$f":"VLOOKUP(C215,Feuil1!$A$1:$B$9999,2)","v":{"$error":"#N/A"}}]
["2013-05-11","2013-05-11",null,{"$f":"VLOOKUP(C216,Feuil1!$A$1:$B$9999,2)","v":{"$error":"#N/A"}}]
["2013-05-12","2013-05-12",null,{"$f":"VLOOKUP(C217,Feuil1!$A$1:$B$9999,2)","v":{"$error":"#N/A"}}]
["2013-05-13","2013-05-13",null,{"$f":"VLOOKUP(C218,Feuil1!$A$1:$B$9999,2)","v":{"$error":"#N/A"}}]
["2013-05-14","2013-05-14",null,{"$f":"VLOOKUP(C219,Feuil1!$A$1:$B$9999,2)","v":{"$error":"#N/A"}}]
["2013-05-15","2013-05-15",null,{"$f":"VLOOKUP(C220,Feuil1!$A$1:$B$9999,2)","v":{"$error":"#N/A"}}]
["2013-05-16","2013-05-16",null,{"$f":"VLOOKUP(C221,Feuil1!$A$1:$B$9999,2)","v":{"$error":"#N/A"}}]
["2013-05-17","2013-05-17",null,{"$f":"VLOOKUP(C222,Feuil1!$A$1:$B$9999,2)","v":{"$error":"#N/A"}}]
["2013-05-18","2013-05-18",null,{"$f":"VLOOKUP(C223,Feuil1!$A$1:$B$9999,2)","v":{"$error":"#N/A"}}]
["2013-05-19","2013-05-19",null,{"$f":"VLOOKUP(C224,Feuil1!$A$1:$B$9999,2)","v":{"$error":"#N/A"}}]
["2013-05-20","2013-05-20",null,{"$f":"VLOOKUP(C225,Feuil1!$A$1:$B$9999,2)","v":{"$error":"#N/A"}}]
["2013-05-21","2013-05-21",null,{"$f":"VLOOKUP(C226,Feuil1!$A$1:$B$9999,2)","v":{"$error":"#N/A"}}]
["2013-05-22","2013-05-22",null,{"$f":"VLOOKUP(C227,Feuil1!$A$1:$B$9999,2)","v":{"$error":"#N/A"}}]
["2013-05-23","2013-05-23",null,{"$f":"VLOOKUP(C228,Feuil1!$A$1:$B$9999,2)","v":{"$error":"#N/A"}}]
["2013-05-24","2013-05-24",null,{"$f":"VLOOKUP(C229,Feuil1!$A$1:$B$9999,2)","v":{"$error":"#N/A"}}]
["2013-05-25","2013-05-25",null,{"$f":"VLOOKUP(C230,Feuil1!$A$1:$B$9999,2)","v":{"$error":"#N/A"}}]
["2013-05-26","2013-05-26",null,{"$f":"VLOOKUP(C231,Feuil1!$A$1:$B$9999,2)","v":{"$error":"#N/A"}}]
["2013-05-27","2013-05-27",null,{"$f":"VLOOKUP(C232,Feuil1!$A$1:$B$9999,2)","v":{"$error":"#N/A"}}]
["2013-05-28","2013-05-28",null,{"$f":"VLOOKUP(C233,Feuil1!$A$1:$B$9999,2)","v":{"$error":"#N/A"}}]
["2013-05-29","2013-05-29",null,{"$f":"VLOOKUP(C234,Feuil1!$A$1:$B$9999,2)","v":{"$error":"#N/A"}}]
["2013-05-30","2013-05-30",null,{"$f":"VLOOKUP(C235,Feuil1!$A$1:$B$9999,2)","v":{"$error":"#N/A"}}]
["2013-05-31","2013-05-31",null,{"$f":"VLOOKUP(C236,Feuil1!$A$1:$B$9999,2)","v":{"$error":"#N/A"}}]
[]
[]
[]
[]
[]
[]
[]
[]
[]
[]
[]
[]
[]
[]
[]
[]
["Ouvrier :","Ouvrier 1",null,null,"Juin"]
[]
[null,"jour ","code","chantier","H. prestées","H. sup."]
["2013-06-01",{"$f":"A256","v":"2013-06-01"},null,{"$f":"VLOOKUP(C256,Feuil1!$A$1:$B$9999,2)","v":{"$error":"#N/A"}}]
["2013-06-02",{"$f":"A257","v":"2013-06-02"},null,{"$f":"VLOOKUP(C257,Feuil1!$A$1:$B$9999,2)","v":{"$error":"#N/A"}}]
["2013-06-03","2013-06-03",null,{"$f":"VLOOKUP(C258,Feuil1!$A$1:$B$9999,2)","v":{"$error":"#N/A"}}]
["2013-06-04","2013-06-04",null,{"$f":"VLOOKUP(C259,Feuil1!$A$1:$B$9999,2)","v":{"$error":"#N/A"}}]
["2013-06-05","2013-06-05",null,{"$f":"VLOOKUP(C260,Feuil1!$A$1:$B$9999,2)","v":{"$error":"#N/A"}}]
["2013-06-06","2013-06-06",null,{"$f":"VLOOKUP(C261,Feuil1!$A$1:$B$9999,2)","v":{"$error":"#N/A"}}]
["2013-06-07","2013-06-07",null,{"$f":"VLOOKUP(C262,Feuil1!$A$1:$B$9999,2)","v":{"$error":"#N/A"}}]
["2013-06-08","2013-06-08",null,{"$f":"VLOOKUP(C263,Feuil1!$A$1:$B$9999,2)","v":{"$error":"#N/A"}}]
["2013-06-09","2013-06-09",null,{"$f":"VLOOKUP(C264,Feuil1!$A$1:$B$9999,2)","v":{"$error":"#N/A"}}]
["2013-06-10","2013-06-10",null,{"$f":"VLOOKUP(C265,Feuil1!$A$1:$B$9999,2)","v":{"$error":"#N/A"}}]
["2013-06-11","2013-06-11",null,{"$f":"VLOOKUP(C266,Feuil1!$A$1:$B$9999,2)","v":{"$error":"#N/A"}}]
["2013-06-12","2013-06-12",null,{"$f":"VLOOKUP(C267,Feuil1!$A$1:$B$9999,2)","v":{"$error":"#N/A"}}]
["2013-06-13","2013-06-13",null,{"$f":"VLOOKUP(C268,Feuil1!$A$1:$B$9999,2)","v":{"$error":"#N/A"}}]
["2013-06-14","2013-06-14",null,{"$f":"VLOOKUP(C269,Feuil1!$A$1:$B$9999,2)","v":{"$error":"#N/A"}}]
["2013-06-15","2013-06-15",null,{"$f":"VLOOKUP(C270,Feuil1!$A$1:$B$9999,2)","v":{"$error":"#N/A"}}]
["2013-06-16","2013-06-16",null,{"$f":"VLOOKUP(C271,Feuil1!$A$1:$B$9999,2)","v":{"$error":"#N/A"}}]
["2013-06-17","2013-06-17",null,{"$f":"VLOOKUP(C272,Feuil1!$A$1:$B$9999,2)","v":{"$error":"#N/A"}}]
["2013-06-18","2013-06-18",null,{"$f":"VLOOKUP(C273,Feuil1!$A$1:$B$9999,2)","v":{"$error":"#N/A"}}]
["2013-06-19","2013-06-19",null,{"$f":"VLOOKUP(C274,Feuil1!$A$1:$B$9999,2)","v":{"$error":"#N/A"}}]
["2013-06-20","2013-06-20",null,{"$f":"VLOOKUP(C275,Feuil1!$A$1:$B$9999,2)","v":{"$error":"#N/A"}}]
["2013-06-21","2013-06-21",null,{"$f":"VLOOKUP(C276,Feuil1!$A$1:$B$9999,2)","v":{"$error":"#N/A"}}]
["2013-06-22","2013-06-22",null,{"$f":"VLOOKUP(C277,Feuil1!$A$1:$B$9999,2)","v":{"$error":"#N/A"}}]
["2013-06-23","2013-06-23",null,{"$f":"VLOOKUP(C278,Feuil1!$A$1:$B$9999,2)","v":{"$error":"#N/A"}}]
["2013-06-24","2013-06-24",null,{"$f":"VLOOKUP(C279,Feuil1!$A$1:$B$9999,2)","v":{"$error":"#N/A"}}]
["2013-06-25","2013-06-25",null,{"$f":"VLOOKUP(C280,Feuil1!$A$1:$B$9999,2)","v":{"$error":"#N/A"}}]
["2013-06-26","2013-06-26",null,{"$f":"VLOOKUP(C281,Feuil1!$A$1:$B$9999,2)","v":{"$error":"#N/A"}}]
["2013-06-27","2013-06-27",null,{"$f":"VLOOKUP(C282,Feuil1!$A$1:$B$9999,2)","v":{"$error":"#N/A"}}]
["2013-06-28","2013-06-28",null,{"$f":"VLOOKUP(C283,Feuil1!$A$1:$B$9999,2)","v":{"$error":"#N/A"}}]
["2013-06-29","2013-06-29",null,{"$f":"VLOOKUP(C284,Feuil1!$A$1:$B$9999,2)","v":{"$error":"#N/A"}}]
["2013-06-30","2013-06-30",null,{"$f":"VLOOKUP(C285,Feuil1!$A$1:$B$9999,2)","v":{"$error":"#N/A"}}]
[]
[]
[]
[]
[]
[]
[]
[]
[]
[]
[]
[]
[]
[]
[]
[]
[]
["Ouvrier :","Ouvrier 1",null,null,"Juillet"]
[]
[null,"jour ","code","chantier","H. prestées","H. sup."]
["2013-07-01",{"$f":"A306","v":"2013-07-01"},null,{"$f":"VLOOKUP(C306,Feuil1!$A$1:$B$9999,2)","v":{"$error":"#N/A"}}]
["2013-07-02",{"$f":"A307","v":"2013-07-02"},null,{"$f":"VLOOKUP(C307,Feuil1!$A$1:$B$9999,2)","v":{"$error":"#N/A"}}]
["2013-07-03","2013-07-03",null,{"$f":"VLOOKUP(C308,Feuil1!$A$1:$B$9999,2)","v":{"$error":"#N/A"}}]
["2013-07-04","2013-07-04",null,{"$f":"VLOOKUP(C309,Feuil1!$A$1:$B$9999,2)","v":{"$error":"#N/A"}}]
["2013-07-05","2013-07-05",null,{"$f":"VLOOKUP(C310,Feuil1!$A$1:$B$9999,2)","v":{"$error":"#N/A"}}]
["2013-07-06","2013-07-06",null,{"$f":"VLOOKUP(C311,Feuil1!$A$1:$B$9999,2)","v":{"$error":"#N/A"}}]
["2013-07-07","2013-07-07",null,{"$f":"VLOOKUP(C312,Feuil1!$A$1:$B$9999,2)","v":{"$error":"#N/A"}}]
["2013-07-08","2013-07-08",null,{"$f":"VLOOKUP(C313,Feuil1!$A$1:$B$9999,2)","v":{"$error":"#N/A"}}]
["2013-07-09","2013-07-09",null,{"$f":"VLOOKUP(C314,Feuil1!$A$1:$B$9999,2)","v":{"$error":"#N/A"}}]
["2013-07-10","2013-07-10",null,{"$f":"VLOOKUP(C315,Feuil1!$A$1:$B$9999,2)","v":{"$error":"#N/A"}}]
["2013-07-11","2013-07-11",null,{"$f":"VLOOKUP(C316,Feuil1!$A$1:$B$9999,2)","v":{"$error":"#N/A"}}]
["2013-07-12","2013-07-12",null,{"$f":"VLOOKUP(C317,Feuil1!$A$1:$B$9999,2)","v":{"$error":"#N/A"}}]
["2013-07-13","2013-07-13",null,{"$f":"VLOOKUP(C318,Feuil1!$A$1:$B$9999,2)","v":{"$error":"#N/A"}}]
["2013-07-14","2013-07-14",null,{"$f":"VLOOKUP(C319,Feuil1!$A$1:$B$9999,2)","v":{"$error":"#N/A"}}]
["2013-07-15","2013-07-15",null,{"$f":"VLOOKUP(C320,Feuil1!$A$1:$B$9999,2)","v":{"$error":"#N/A"}}]
["2013-07-16","2013-07-16",null,{"$f":"VLOOKUP(C321,Feuil1!$A$1:$B$9999,2)","v":{"$error":"#N/A"}}]
["2013-07-17","2013-07-17",null,{"$f":"VLOOKUP(C322,Feuil1!$A$1:$B$9999,2)","v":{"$error":"#N/A"}}]
["2013-07-18","2013-07-18",null,{"$f":"VLOOKUP(C323,Feuil1!$A$1:$B$9999,2)","v":{"$error":"#N/A"}}]
["2013-07-19","2013-07-19",null,{"$f":"VLOOKUP(C324,Feuil1!$A$1:$B$9999,2)","v":{"$error":"#N/A"}}]
["2013-07-20","2013-07-20",null,{"$f":"VLOOKUP(C325,Feuil1!$A$1:$B$9999,2)","v":{"$error":"#N/A"}}]
["2013-07-21","2013-07-21",null,{"$f":"VLOOKUP(C326,Feuil1!$A$1:$B$9999,2)","v":{"$error":"#N/A"}}]
["2013-07-22","2013-07-22",null,{"$f":"VLOOKUP(C327,Feuil1!$A$1:$B$9999,2)","v":{"$error":"#N/A"}}]
["2013-07-23","2013-07-23",null,{"$f":"VLOOKUP(C328,Feuil1!$A$1:$B$9999,2)","v":{"$error":"#N/A"}}]
["2013-07-24","2013-07-24",null,{"$f":"VLOOKUP(C329,Feuil1!$A$1:$B$9999,2)","v":{"$error":"#N/A"}}]
["2013-07-25","2013-07-25",null,{"$f":"VLOOKUP(C330,Feuil1!$A$1:$B$9999,2)","v":{"$error":"#N/A"}}]
["2013-07-26","2013-07-26",null,{"$f":"VLOOKUP(C331,Feuil1!$A$1:$B$9999,2)","v":{"$error":"#N/A"}}]
["2013-07-27","2013-07-27",null,{"$f":"VLOOKUP(C332,Feuil1!$A$1:$B$9999,2)","v":{"$error":"#N/A"}}]
["2013-07-28","2013-07-28",null,{"$f":"VLOOKUP(C333,Feuil1!$A$1:$B$9999,2)","v":{"$error":"#N/A"}}]
["2013-07-29","2013-07-29",null,{"$f":"VLOOKUP(C334,Feuil1!$A$1:$B$9999,2)","v":{"$error":"#N/A"}}]
["2013-07-30","2013-07-30",null,{"$f":"VLOOKUP(C335,Feuil1!$A$1:$B$9999,2)","v":{"$error":"#N/A"}}]
["2013-07-31","2013-07-31",null,{"$f":"VLOOKUP(C336,Feuil1!$A$1:$B$9999,2)","v":{"$error":"#N/A"}}]
[]
[]
[]
[]
[]
[]
[]
[]
[]
[]
[]
[]
[]
[]
[]
[]
["Ouvrier :","Ouvrier 1",null,null,"Aout"]
[]
[null,"jour ","code","chantier","H. prestées","H. sup."]
["2013-08-01",{"$f":"A356","v":"2013-08-01"},null,{"$f":"VLOOKUP(C356,Feuil1!$A$1:$B$9999,2)","v":{"$error":"#N/A"}}]
["2013-08-02",{"$f":"A357","v":"2013-08-02"},null,{"$f":"VLOOKUP(C357,Feuil1!$A$1:$B$9999,2)","v":{"$error":"#N/A"}}]
["2013-08-03","2013-08-03",null,{"$f":"VLOOKUP(C358,Feuil1!$A$1:$B$9999,2)","v":{"$error":"#N/A"}}]
["2013-08-04","2013-08-04",null,{"$f":"VLOOKUP(C359,Feuil1!$A$1:$B$9999,2)","v":{"$error":"#N/A"}}]
["2013-08-05","2013-08-05",null,{"$f":"VLOOKUP(C360,Feuil1!$A$1:$B$9999,2)","v":{"$error":"#N/A"}}]
["2013-08-06","2013-08-06",null,{"$f":"VLOOKUP(C361,Feuil1!$A$1:$B$9999,2)","v":{"$error":"#N/A"}}]
["2013-08-07","2013-08-07",null,{"$f":"VLOOKUP(C362,Feuil1!$A$1:$B$9999,2)","v":{"$error":"#N/A"}}]
["2013-08-08","2013-08-08",null,{"$f":"VLOOKUP(C363,Feuil1!$A$1:$B$9999,2)","v":{"$error":"#N/A"}}]
["2013-08-09","2013-08-09",null,{"$f":"VLOOKUP(C364,Feuil1!$A$1:$B$9999,2)","v":{"$error":"#N/A"}}]
["2013-08-10","2013-08-10",null,{"$f":"VLOOKUP(C365,Feuil1!$A$1:$B$9999,2)","v":{"$error":"#N/A"}}]
["2013-08-11","2013-08-11",null,{"$f":"VLOOKUP(C366,Feuil1!$A$1:$B$9999,2)","v":{"$error":"#N/A"}}]
["2013-08-12","2013-08-12",null,{"$f":"VLOOKUP(C367,Feuil1!$A$1:$B$9999,2)","v":{"$error":"#N/A"}}]
["2013-08-13","2013-08-13",null,{"$f":"VLOOKUP(C368,Feuil1!$A$1:$B$9999,2)","v":{"$error":"#N/A"}}]
["2013-08-14","2013-08-14",null,{"$f":"VLOOKUP(C369,Feuil1!$A$1:$B$9999,2)","v":{"$error":"#N/A"}}]
["2013-08-15","2013-08-15",null,{"$f":"VLOOKUP(C370,Feuil1!$A$1:$B$9999,2)","v":{"$error":"#N/A"}}]
["2013-08-16","2013-08-16",null,{"$f":"VLOOKUP(C371,Feuil1!$A$1:$B$9999,2)","v":{"$error":"#N/A"}}]
["2013-08-17","2013-08-17",null,{"$f":"VLOOKUP(C372,Feuil1!$A$1:$B$9999,2)","v":{"$error":"#N/A"}}]
["2013-08-18","2013-08-18",null,{"$f":"VLOOKUP(C373,Feuil1!$A$1:$B$9999,2)","v":{"$error":"#N/A"}}]
["2013-08-19","2013-08-19",null,{"$f":"VLOOKUP(C374,Feuil1!$A$1:$B$9999,2)","v":{"$error":"#N/A"}}]
["2013-08-20","2013-08-20",null,{"$f":"VLOOKUP(C375,Feuil1!$A$1:$B$9999,2)","v":{"$error":"#N/A"}}]
["2013-08-21","2013-08-21",null,{"$f":"VLOOKUP(C376,Feuil1!$A$1:$B$9999,2)","v":{"$error":"#N/A"}}]
["2013-08-22","2013-08-22",null,{"$f":"VLOOKUP(C377,Feuil1!$A$1:$B$9999,2)","v":{"$error":"#N/A"}}]
["2013-08-23","2013-08-23",null,{"$f":"VLOOKUP(C378,Feuil1!$A$1:$B$9999,2)","v":{"$error":"#N/A"}}]
["2013-08-24","2013-08-24",null,{"$f":"VLOOKUP(C379,Feuil1!$A$1:$B$9999,2)","v":{"$error":"#N/A"}}]
["2013-08-25","2013-08-25",null,{"$f":"VLOOKUP(C380,Feuil1!$A$1:$B$9999,2)","v":{"$error":"#N/A"}}]
["2013-08-26","2013-08-26",null,{"$f":"VLOOKUP(C381,Feuil1!$A$1:$B$9999,2)","v":{"$error":"#N/A"}}]
["2013-08-27","2013-08-27",null,{"$f":"VLOOKUP(C382,Feuil1!$A$1:$B$9999,2)","v":{"$error":"#N/A"}}]
["2013-08-28","2013-08-28",null,{"$f":"VLOOKUP(C383,Feuil1!$A$1:$B$9999,2)","v":{"$error":"#N/A"}}]
["2013-08-29","2013-08-29",null,{"$f":"VLOOKUP(C384,Feuil1!$A$1:$B$9999,2)","v":{"$error":"#N/A"}}]
["2013-08-30","2013-08-30",null,{"$f":"VLOOKUP(C385,Feuil1!$A$1:$B$9999,2)","v":{"$error":"#N/A"}}]
["2013-08-31","2013-08-31",null,{"$f":"VLOOKUP(C386,Feuil1!$A$1:$B$9999,2)","v":{"$error":"#N/A"}}]
[]
[]
[]
[]
[]
[]
[]
[]
[]
[]
[]
[]
[]
[]
[]
[]
["Ouvrier :","Ouvrier 1",null,null,"Septembre"]
[]
[null,"jour ","code","chantier","H. prestées","H. sup."]
["2013-09-01",{"$f":"A406","v":"2013-09-01"},null,{"$f":"VLOOKUP(C406,Feuil1!$A$1:$B$9999,2)","v":{"$error":"#N/A"}}]
["2013-09-02",{"$f":"A407","v":"2013-09-02"},null,{"$f":"VLOOKUP(C407,Feuil1!$A$1:$B$9999,2)","v":{"$error":"#N/A"}}]
["2013-09-03","2013-09-03",null,{"$f":"VLOOKUP(C408,Feuil1!$A$1:$B$9999,2)","v":{"$error":"#N/A"}}]
["2013-09-04","2013-09-04",null,{"$f":"VLOOKUP(C409,Feuil1!$A$1:$B$9999,2)","v":{"$error":"#N/A"}}]
["2013-09-05","2013-09-05",null,{"$f":"VLOOKUP(C410,Feuil1!$A$1:$B$9999,2)","v":{"$error":"#N/A"}}]
["2013-09-06","2013-09-06",null,{"$f":"VLOOKUP(C411,Feuil1!$A$1:$B$9999,2)","v":{"$error":"#N/A"}}]
["2013-09-07","2013-09-07",null,{"$f":"VLOOKUP(C412,Feuil1!$A$1:$B$9999,2)","v":{"$error":"#N/A"}}]
["2013-09-08","2013-09-08",null,{"$f":"VLOOKUP(C413,Feuil1!$A$1:$B$9999,2)","v":{"$error":"#N/A"}}]
["2013-09-09","2013-09-09",null,{"$f":"VLOOKUP(C414,Feuil1!$A$1:$B$9999,2)","v":{"$error":"#N/A"}}]
["2013-09-10","2013-09-10",null,{"$f":"VLOOKUP(C415,Feuil1!$A$1:$B$9999,2)","v":{"$error":"#N/A"}}]
["2013-09-11","2013-09-11",null,{"$f":"VLOOKUP(C416,Feuil1!$A$1:$B$9999,2)","v":{"$error":"#N/A"}}]
["2013-09-12","2013-09-12",null,{"$f":"VLOOKUP(C417,Feuil1!$A$1:$B$9999,2)","v":{"$error":"#N/A"}}]
["2013-09-13","2013-09-13",null,{"$f":"VLOOKUP(C418,Feuil1!$A$1:$B$9999,2)","v":{"$error":"#N/A"}}]
["2013-09-14","2013-09-14",null,{"$f":"VLOOKUP(C419,Feuil1!$A$1:$B$9999,2)","v":{"$error":"#N/A"}}]
["2013-09-15","2013-09-15",null,{"$f":"VLOOKUP(C420,Feuil1!$A$1:$B$9999,2)","v":{"$error":"#N/A"}}]
["2013-09-16","2013-09-16",null,{"$f":"VLOOKUP(C421,Feuil1!$A$1:$B$9999,2)","v":{"$error":"#N/A"}}]
["2013-09-17","2013-09-17",null,{"$f":"VLOOKUP(C422,Feuil1!$A$1:$B$9999,2)","v":{"$error":"#N/A"}}]
["2013-09-18","2013-09-18",null,{"$f":"VLOOKUP(C423,Feuil1!$A$1:$B$9999,2)","v":{"$error":"#N/A"}}]
["2013-09-19","2013-09-19",null,{"$f":"VLOOKUP(C424,Feuil1!$A$1:$B$9999,2)","v":{"$error":"#N/A"}}]
["2013-09-20","2013-09-20",null,{"$f":"VLOOKUP(C425,Feuil1!$A$1:$B$9999,2)","v":{"$error":"#N/A"}}]
["2013-09-21","2013-09-21",null,{"$f":"VLOOKUP(C426,Feuil1!$A$1:$B$9999,2)","v":{"$error":"#N/A"}}]
["2013-09-22","2013-09-22",null,{"$f":"VLOOKUP(C427,Feuil1!$A$1:$B$9999,2)","v":{"$error":"#N/A"}}]
["2013-09-23","2013-09-23",null,{"$f":"VLOOKUP(C428,Feuil1!$A$1:$B$9999,2)","v":{"$error":"#N/A"}}]
["2013-09-24","2013-09-24",null,{"$f":"VLOOKUP(C429,Feuil1!$A$1:$B$9999,2)","v":{"$error":"#N/A"}}]
["2013-09-25","2013-09-25",null,{"$f":"VLOOKUP(C430,Feuil1!$A$1:$B$9999,2)","v":{"$error":"#N/A"}}]
["2013-09-26","2013-09-26",null,{"$f":"VLOOKUP(C431,Feuil1!$A$1:$B$9999,2)","v":{"$error":"#N/A"}}]
["2013-09-27","2013-09-27",null,{"$f":"VLOOKUP(C432,Feuil1!$A$1:$B$9999,2)","v":{"$error":"#N/A"}}]
["2013-09-28","2013-09-28",null,{"$f":"VLOOKUP(C433,Feuil1!$A$1:$B$9999,2)","v":{"$error":"#N/A"}}]
["2013-09-29","2013-09-29",null,{"$f":"VLOOKUP(C434,Feuil1!$A$1:$B$9999,2)","v":{"$error":"#N/A"}}]
["2013-09-30","2013-09-30",null,{"$f":"VLOOKUP(C435,Feuil1!$A$1:$B$9999,2)","v":{"$error":"#N/A"}}]
[]
[]
[]
[]
[]
[]
[]
[]
[]
[]
[]
[]
[]
[]
[]
[]
[]
["Ouvrier :","Ouvrier 1",null,null,"Octobre"]
[]
[null,"jour ","code","chantier","H. prestées","H. sup."]
["2013-10-01",{"$f":"A456","v":"2013-10-01"},null,{"$f":"VLOOKUP(C456,Feuil1!$A$1:$B$9999,2)","v":{"$error":"#N/A"}}]
["2013-10-02",{"$f":"A457","v":"2013-10-02"},null,{"$f":"VLOOKUP(C457,Feuil1!$A$1:$B$9999,2)","v":{"$error":"#N/A"}}]
["2013-10-03","2013-10-03",null,{"$f":"VLOOKUP(C458,Feuil1!$A$1:$B$9999,2)","v":{"$error":"#N/A"}}]
["2013-10-04","2013-10-04",null,{"$f":"VLOOKUP(C459,Feuil1!$A$1:$B$9999,2)","v":{"$error":"#N/A"}}]
["2013-10-05","2013-10-05",null,{"$f":"VLOOKUP(C460,Feuil1!$A$1:$B$9999,2)","v":{"$error":"#N/A"}}]
["2013-10-06","2013-10-06",null,{"$f":"VLOOKUP(C461,Feuil1!$A$1:$B$9999,2)","v":{"$error":"#N/A"}}]
["2013-10-07","2013-10-07",null,{"$f":"VLOOKUP(C462,Feuil1!$A$1:$B$9999,2)","v":{"$error":"#N/A"}}]
["2013-10-08","2013-10-08",null,{"$f":"VLOOKUP(C463,Feuil1!$A$1:$B$9999,2)","v":{"$error":"#N/A"}}]
["2013-10-09","2013-10-09",null,{"$f":"VLOOKUP(C464,Feuil1!$A$1:$B$9999,2)","v":{"$error":"#N/A"}}]
["2013-10-10","2013-10-10",null,{"$f":"VLOOKUP(C465,Feuil1!$A$1:$B$9999,2)","v":{"$error":"#N/A"}}]
["2013-10-11","2013-10-11",null,{"$f":"VLOOKUP(C466,Feuil1!$A$1:$B$9999,2)","v":{"$error":"#N/A"}}]
["2013-10-12","2013-10-12",null,{"$f":"VLOOKUP(C467,Feuil1!$A$1:$B$9999,2)","v":{"$error":"#N/A"}}]
["2013-10-13","2013-10-13",null,{"$f":"VLOOKUP(C468,Feuil1!$A$1:$B$9999,2)","v":{"$error":"#N/A"}}]
["2013-10-14","2013-10-14",null,{"$f":"VLOOKUP(C469,Feuil1!$A$1:$B$9999,2)","v":{"$error":"#N/A"}}]
["2013-10-15","2013-10-15",null,{"$f":"VLOOKUP(C470,Feuil1!$A$1:$B$9999,2)","v":{"$error":"#N/A"}}]
["2013-10-16","2013-10-16",null,{"$f":"VLOOKUP(C471,Feuil1!$A$1:$B$9999,2)","v":{"$error":"#N/A"}}]
["2013-10-17","2013-10-17",null,{"$f":"VLOOKUP(C472,Feuil1!$A$1:$B$9999,2)","v":{"$error":"#N/A"}}]
["2013-10-18","2013-10-18",null,{"$f":"VLOOKUP(C473,Feuil1!$A$1:$B$9999,2)","v":{"$error":"#N/A"}}]
["2013-10-19","2013-10-19",null,{"$f":"VLOOKUP(C474,Feuil1!$A$1:$B$9999,2)","v":{"$error":"#N/A"}}]
["2013-10-20","2013-10-20",null,{"$f":"VLOOKUP(C475,Feuil1!$A$1:$B$9999,2)","v":{"$error":"#N/A"}}]
["2013-10-21","2013-10-21",null,{"$f":"VLOOKUP(C476,Feuil1!$A$1:$B$9999,2)","v":{"$error":"#N/A"}}]
["2013-10-22","2013-10-22",null,{"$f":"VLOOKUP(C477,Feuil1!$A$1:$B$9999,2)","v":{"$error":"#N/A"}}]
["2013-10-23","2013-10-23",null,{"$f":"VLOOKUP(C478,Feuil1!$A$1:$B$9999,2)","v":{"$error":"#N/A"}}]
["2013-10-24","2013-10-24",null,{"$f":"VLOOKUP(C479,Feuil1!$A$1:$B$9999,2)","v":{"$error":"#N/A"}}]
["2013-10-25","2013-10-25",null,{"$f":"VLOOKUP(C480,Feuil1!$A$1:$B$9999,2)","v":{"$error":"#N/A"}}]
["2013-10-26","2013-10-26",null,{"$f":"VLOOKUP(C481,Feuil1!$A$1:$B$9999,2)","v":{"$error":"#N/A"}}]
["2013-10-27","2013-10-27",null,{"$f":"VLOOKUP(C482,Feuil1!$A$1:$B$9999,2)","v":{"$error":"#N/A"}}]
["2013-10-28","2013-10-28",null,{"$f":"VLOOKUP(C483,Feuil1!$A$1:$B$9999,2)","v":{"$error":"#N/A"}}]
["2013-10-29","2013-10-29",null,{"$f":"VLOOKUP(C484,Feuil1!$A$1:$B$9999,2)","v":{"$error":"#N/A"}}]
["2013-10-30","2013-10-30",null,{"$f":"VLOOKUP(C485,Feuil1!$A$1:$B$9999,2)","v":{"$error":"#N/A"}}]
["2013-10-31","2013-10-31",null,{"$f":"VLOOKUP(C486,Feuil1!$A$1:$B$9999,2)","v":{"$error":"#N/A"}}]
[]
[]
[]
[]
[]
[]
[]
[]
[]
[]
[]
[]
[]
[]
[]
[]
["Ouvrier :","Ouvrier 1",null,null,"Novembre"]
[]
["date ","jour ","code","chantier","H. prestées","H. sup."]
["2013-11-01",{"$f":"A506","v":"2013-11-01"},null,{"$f":"VLOOKUP(C506,Feuil1!$A$1:$B$9999,2)","v":{"$error":"#N/A"}}]
["2013-11-02",{"$f":"A507","v":"2013-11-02"},null,{"$f":"VLOOKUP(C507,Feuil1!$A$1:$B$9999,2)","v":{"$error":"#N/A"}}]
["2013-11-03","2013-11-03",null,{"$f":"VLOOKUP(C508,Feuil1!$A$1:$B$9999,2)","v":{"$error":"#N/A"}}]
["2013-11-04","2013-11-04",null,{"$f":"VLOOKUP(C509,Feuil1!$A$1:$B$9999,2)","v":{"$error":"#N/A"}}]
["2013-11-05","2013-11-05",null,{"$f":"VLOOKUP(C510,Feuil1!$A$1:$B$9999,2)","v":{"$error":"#N/A"}}]
["2013-11-06","2013-11-06",null,{"$f":"VLOOKUP(C511,Feuil1!$A$1:$B$9999,2)","v":{"$error":"#N/A"}}]
["2013-11-07","2013-11-07",null,{"$f":"VLOOKUP(C512,Feuil1!$A$1:$B$9999,2)","v":{"$error":"#N/A"}}]
["2013-11-08","2013-11-08",null,{"$f":"VLOOKUP(C513,Feuil1!$A$1:$B$9999,2)","v":{"$error":"#N/A"}}]
["2013-11-09","2013-11-09",null,{"$f":"VLOOKUP(C514,Feuil1!$A$1:$B$9999,2)","v":{"$error":"#N/A"}}]
["2013-11-10","2013-11-10",null,{"$f":"VLOOKUP(C515,Feuil1!$A$1:$B$9999,2)","v":{"$error":"#N/A"}}]
["2013-11-11","2013-11-11",null,{"$f":"VLOOKUP(C516,Feuil1!$A$1:$B$9999,2)","v":{"$error":"#N/A"}}]
["2013-11-12","2013-11-12",null,{"$f":"VLOOKUP(C517,Feuil1!$A$1:$B$9999,2)","v":{"$error":"#N/A"}}]
["2013-11-13","2013-11-13",null,{"$f":"VLOOKUP(C518,Feuil1!$A$1:$B$9999,2)","v":{"$error":"#N/A"}}]
["2013-11-14","2013-11-14",null,{"$f":"VLOOKUP(C519,Feuil1!$A$1:$B$9999,2)","v":{"$error":"#N/A"}}]
["2013-11-15","2013-11-15",null,{"$f":"VLOOKUP(C520,Feuil1!$A$1:$B$9999,2)","v":{"$error":"#N/A"}}]
["2013-11-16","2013-11-16",null,{"$f":"VLOOKUP(C521,Feuil1!$A$1:$B$9999,2)","v":{"$error":"#N/A"}}]
["2013-11-17","2013-11-17",null,{"$f":"VLOOKUP(C522,Feuil1!$A$1:$B$9999,2)","v":{"$error":"#N/A"}}]
["2013-11-18","2013-11-18",null,{"$f":"VLOOKUP(C523,Feuil1!$A$1:$B$9999,2)","v":{"$error":"#N/A"}}]
["2013-11-19","2013-11-19",null,{"$f":"VLOOKUP(C524,Feuil1!$A$1:$B$9999,2)","v":{"$error":"#N/A"}}]
["2013-11-20","2013-11-20",null,{"$f":"VLOOKUP(C525,Feuil1!$A$1:$B$9999,2)","v":{"$error":"#N/A"}}]
["2013-11-21","2013-11-21",null,{"$f":"VLOOKUP(C526,Feuil1!$A$1:$B$9999,2)","v":{"$error":"#N/A"}}]
["2013-11-22","2013-11-22",null,{"$f":"VLOOKUP(C527,Feuil1!$A$1:$B$9999,2)","v":{"$error":"#N/A"}}]
["2013-11-23","2013-11-23",null,{"$f":"VLOOKUP(C528,Feuil1!$A$1:$B$9999,2)","v":{"$error":"#N/A"}}]
["2013-11-24","2013-11-24",null,{"$f":"VLOOKUP(C529,Feuil1!$A$1:$B$9999,2)","v":{"$error":"#N/A"}}]
["2013-11-25","2013-11-25",null,{"$f":"VLOOKUP(C530,Feuil1!$A$1:$B$9999,2)","v":{"$error":"#N/A"}}]
["2013-11-26","2013-11-26",null,{"$f":"VLOOKUP(C531,Feuil1!$A$1:$B$9999,2)","v":{"$error":"#N/A"}}]
["2013-11-27","2013-11-27",null,{"$f":"VLOOKUP(C532,Feuil1!$A$1:$B$9999,2)","v":{"$error":"#N/A"}}]
["2013-11-28","2013-11-28",null,{"$f":"VLOOKUP(C533,Feuil1!$A$1:$B$9999,2)","v":{"$error":"#N/A"}}]
["2013-11-29","2013-11-29",null,{"$f":"VLOOKUP(C534,Feuil1!$A$1:$B$9999,2)","v":{"$error":"#N/A"}}]
["2013-11-30","2013-11-30",null,{"$f":"VLOOKUP(C535,Feuil1!$A$1:$B$9999,2)","v":{"$error":"#N/A"}}]
[]
[]
[]
[]
[]
[]
[]
[]
[]
[]
[]
[]
[]
[]
[]
[]
[]
["Ouvrier :","Ouvrier 1",null,null,"Décembre"]
[]
["date ","jour ","code","chantier","H. prestées","H. sup."]
["2013-12-01",{"$f":"A556","v":"2013-12-01"},null,{"$f":"VLOOKUP(C556,Feuil1!$A$1:$B$9999,2)","v":{"$error":"#N/A"}}]
["2013-12-02",{"$f":"A557","v":"2013-12-02"},null,{"$f":"VLOOKUP(C557,Feuil1!$A$1:$B$9999,2)","v":{"$error":"#N/A"}}]
["2013-12-03","2013-12-03",null,{"$f":"VLOOKUP(C558,Feuil1!$A$1:$B$9999,2)","v":{"$error":"#N/A"}}]
["2013-12-04","2013-12-04",null,{"$f":"VLOOKUP(C559,Feuil1!$A$1:$B$9999,2)","v":{"$error":"#N/A"}}]
["2013-12-05","2013-12-05",null,{"$f":"VLOOKUP(C560,Feuil1!$A$1:$B$9999,2)","v":{"$error":"#N/A"}}]
["2013-12-06","2013-12-06",null,{"$f":"VLOOKUP(C561,Feuil1!$A$1:$B$9999,2)","v":{"$error":"#N/A"}}]
["2013-12-07","2013-12-07",null,{"$f":"VLOOKUP(C562,Feuil1!$A$1:$B$9999,2)","v":{"$error":"#N/A"}}]
["2013-12-08","2013-12-08",null,{"$f":"VLOOKUP(C563,Feuil1!$A$1:$B$9999,2)","v":{"$error":"#N/A"}}]
["2013-12-09","2013-12-09",null,{"$f":"VLOOKUP(C564,Feuil1!$A$1:$B$9999,2)","v":{"$error":"#N/A"}}]
["2013-12-10","2013-12-10",null,{"$f":"VLOOKUP(C565,Feuil1!$A$1:$B$9999,2)","v":{"$error":"#N/A"}}]
["2013-12-11","2013-12-11",null,{"$f":"VLOOKUP(C566,Feuil1!$A$1:$B$9999,2)","v":{"$error":"#N/A"}}]
["2013-12-12","2013-12-12",null,{"$f":"VLOOKUP(C567,Feuil1!$A$1:$B$9999,2)","v":{"$error":"#N/A"}}]
["2013-12-13","2013-12-13",null,{"$f":"VLOOKUP(C568,Feuil1!$A$1:$B$9999,2)","v":{"$error":"#N/A"}}]
["2013-12-14","2013-12-14",null,{"$f":"VLOOKUP(C569,Feuil1!$A$1:$B$9999,2)","v":{"$error":"#N/A"}}]
["2013-12-15","2013-12-15",null,{"$f":"VLOOKUP(C570,Feuil1!$A$1:$B$9999,2)","v":{"$error":"#N/A"}}]
["2013-12-16","2013-12-16",null,{"$f":"VLOOKUP(C571,Feuil1!$A$1:$B$9999,2)","v":{"$error":"#N/A"}}]
["2013-12-17","2013-12-17",null,{"$f":"VLOOKUP(C572,Feuil1!$A$1:$B$9999,2)","v":{"$error":"#N/A"}}]
["2013-12-18","2013-12-18",null,{"$f":"VLOOKUP(C573,Feuil1!$A$1:$B$9999,2)","v":{"$error":"#N/A"}}]
["2013-12-19","2013-12-19",null,{"$f":"VLOOKUP(C574,Feuil1!$A$1:$B$9999,2)","v":{"$error":"#N/A"}}]
["2013-12-20","2013-12-20",null,{"$f":"VLOOKUP(C575,Feuil1!$A$1:$B$9999,2)","v":{"$error":"#N/A"}}]
["2013-12-21","2013-12-21",null,{"$f":"VLOOKUP(C576,Feuil1!$A$1:$B$9999,2)","v":{"$error":"#N/A"}}]
["2013-12-22","2013-12-22",null,{"$f":"VLOOKUP(C577,Feuil1!$A$1:$B$9999,2)","v":{"$error":"#N/A"}}]
["2013-12-23","2013-12-23",null,{"$f":"VLOOKUP(C578,Feuil1!$A$1:$B$9999,2)","v":{"$error":"#N/A"}}]
["2013-12-24","2013-12-24",null,{"$f":"VLOOKUP(C579,Feuil1!$A$1:$B$9999,2)","v":{"$error":"#N/A"}}]
["2013-12-25","2013-12-25",null,{"$f":"VLOOKUP(C580,Feuil1!$A$1:$B$9999,2)","v":{"$error":"#N/A"}}]
["2013-12-26","2013-12-26",null,{"$f":"VLOOKUP(C581,Feuil1!$A$1:$B$9999,2)","v":{"$error":"#N/A"}}]
["2013-12-27","2013-12-27",null,{"$f":"VLOOKUP(C582,Feuil1!$A$1:$B$9999,2)","v":{"$error":"#N/A"}}]
["2013-12-28","2013-12-28",null,{"$f":"VLOOKUP(C583,Feuil1!$A$1:$B$9999,2)","v":{"$error":"#N/A"}}]
["2013-12-29","2013-12-29",null,{"$f":"VLOOKUP(C584,Feuil1!$A$1:$B$9999,2)","v":{"$error":"#N/A"}}]
["2013-12-30","2013-12-30",null,{"$f":"VLOOKUP(C585,Feuil1!$A$1:$B$9999,2)","v":{"$error":"#N/A"}}]
["2013-12-31","2013-12-31",null,{"$f":"VLOOKUP(C586,Feuil1!$A$1:$B$9999,2)","v":{"$error":"#N/A"}}]

{"sheet":"Ouvrier3","index":3,"n_rows":584,"n_cols":6,"rows_kept":584,"cut":false,"hidden":false,"merged":[[0,4,0,5],[50,4,50,5],[100,4,100,5],[150,4,150,5],[200,4,200,5],[500,4,500,5],[550,4,550,5],[250,4,250,5],[300,4,300,5],[350,4,350,5],[400,4,400,5],[450,4,450,5]]}
["Ouvrier :","Ouvrier 2",null,null,"Janvier"]
[]
["date ","jour ","code","chantier","H. prestées","H. sup."]
["2013-01-01",{"$f":"A4","v":"2013-01-01"},"c",{"$f":"VLOOKUP(C4,Feuil1!$A$1:$B$9999,2)","v":"Congé"},0,0]
["2013-01-02","2013-01-02","a",{"$f":"VLOOKUP(C5,Feuil1!$A$1:$B$9999,2)","v":"Absent"},0,0]
["2013-01-03","2013-01-03","a",{"$f":"VLOOKUP(C6,Feuil1!$A$1:$B$9999,2)","v":"Absent"},0,0]
["2013-01-04","2013-01-04","a",{"$f":"VLOOKUP(C7,Feuil1!$A$1:$B$9999,2)","v":"Absent"},0,0]
["2013-01-05","2013-01-05",null,null,0,0]
["2013-01-06","2013-01-06"]
["2013-01-07","2013-01-07","Cl00431",{"$f":"VLOOKUP(C10,Feuil1!$A$1:$B$9999,2)","v":"CPH Tournai"},8,0]
["2013-01-08","2013-01-08","cl01289",{"$f":"VLOOKUP(C11,Feuil1!$A$1:$B$9999,2)","v":"Résidence Mean House"},8,0]
["2013-01-09","2013-01-09","cl01289",{"$f":"VLOOKUP(C12,Feuil1!$A$1:$B$9999,2)","v":"Résidence Mean House"},8,0]
["2013-01-10","2013-01-10","cl01289",{"$f":"VLOOKUP(C13,Feuil1!$A$1:$B$9999,2)","v":"Résidence Mean House"},8,0]
["2013-01-11","2013-01-11","Cl01603/1",{"$f":"VLOOKUP(C14,Feuil1!$A$1:$B$9999,2)","v":"Henrard-Roselaine Proxi Delhaize"},8,0]
["2013-01-12","2013-01-12",null,null,0,0]
["2013-01-13","2013-01-13"]
["2013-01-14","2013-01-14","cl00060",{"$f":"VLOOKUP(C17,Feuil1!$A$1:$B$9999,2)","v":"HOME SAINT JEAN"},8,0]
["2013-01-15","2013-01-15","cl00060",{"$f":"VLOOKUP(C18,Feuil1!$A$1:$B$9999,2)","v":"HOME SAINT JEAN"},8,0]
["2013-01-16","2013-01-16","cl00060",{"$f":"VLOOKUP(C19,Feuil1!$A$1:$B$9999,2)","v":"HOME SAINT JEAN"},8,0]
["2013-01-17","2013-01-17","cl01289",{"$f":"VLOOKUP(C20,Feuil1!$A$1:$B$9999,2)","v":"Résidence Mean House"},8,0]
["2013-01-18","2013-01-18","a",{"$f":"VLOOKUP(C21,Feuil1!$A$1:$B$9999,2)","v":"Absent"},0,0]
["2013-01-19","2013-01-19",null,null,0,0]
["2013-01-20","2013-01-20"]
["2013-01-21","2013-01-21","cl00431",{"$f":"VLOOKUP(C24,Feuil1!$A$1:$B$9999,2)","v":"CPH Tournai"},8,0]
["2013-01-22","2013-01-22","cl00431",{"$f":"VLOOKUP(C25,Feuil1!$A$1:$B$9999,2)","v":"CPH Tournai"},8,0]
["2013-01-23","2013-01-23","cl00431",{"$f":"VLOOKUP(C26,Feuil1!$A$1:$B$9999,2)","v":"CPH Tournai"},8,0]
["2013-01-24","2013-01-24","cl00431/1",{"$f":"VLOOKUP(C27,Feuil1!$A$1:$B$9999,2)","v":"CPH Ath"},8,0]
["2013-01-25","2013-01-25","cl00431/1",{"$f":"VLOOKUP(C28,Feuil1!$A$1:$B$9999,2)","v":"CPH Ath"},8,0]
["2013-01-26","2013-01-26",null,null,0,0]
["2013-01-27","2013-01-27"]
["2013-01-28","2013-01-28","m",{"$f":"VLOOKUP(C31,Feuil1!$A$1:$B$9999,2)","v":"Malade"},0,0]
["2013-01-29","2013-01-29","m",{"$f":"VLOOKUP(C32,Feuil1!$A$1:$B$9999,2)","v":"Malade"},0,0]
["2013-01-30","2013-01-30","m",{"$f":"VLOOKUP(C33,Feuil1!$A$1:$B$9999,2)","v":"Malade"},0,0]
["2013-01-31","2013-01-31","m",{"$f":"VLOOKUP(C34,Feuil1!$A$1:$B$9999,2)","v":"Malade"},0,0]
[]
[]
[]
[]
[]
[]
[]
[]
[]
[]
[]
[]
[]
[]
[]
[]
["Ouvrier :","Ouvrier 1",null,null,"Février"]
[]
["date ","jour ","code","chantier","H. prestées","H. sup."]
["2013-02-01",{"$f":"A54","v":"2013-02-01"},null,{"$f":"VLOOKUP(C54,Feuil1!$A$1:$B$9999,2)","v":{"$error":"#N/A"}}]
["2013-02-02",{"$f":"A55","v":"2013-02-02"},null,{"$f":"VLOOKUP(C55,Feuil1!$A$1:$B$9999,2)","v":{"$error":"#N/A"}}]
["2013-02-03","2013-02-03",null,{"$f":"VLOOKUP(C56,Feuil1!$A$1:$B$9999,2)","v":{"$error":"#N/A"}}]
["2013-02-04","2013-02-04",null,{"$f":"VLOOKUP(C57,Feuil1!$A$1:$B$9999,2)","v":{"$error":"#N/A"}}]
["2013-02-05","2013-02-05",null,{"$f":"VLOOKUP(C58,Feuil1!$A$1:$B$9999,2)","v":{"$error":"#N/A"}}]
["2013-02-06","2013-02-06",null,{"$f":"VLOOKUP(C59,Feuil1!$A$1:$B$9999,2)","v":{"$error":"#N/A"}}]
["2013-02-07","2013-02-07",null,{"$f":"VLOOKUP(C60,Feuil1!$A$1:$B$9999,2)","v":{"$error":"#N/A"}}]
["2013-02-08","2013-02-08",null,{"$f":"VLOOKUP(C61,Feuil1!$A$1:$B$9999,2)","v":{"$error":"#N/A"}}]
["2013-02-09","2013-02-09",null,{"$f":"VLOOKUP(C62,Feuil1!$A$1:$B$9999,2)","v":{"$error":"#N/A"}}]
["2013-02-10","2013-02-10",null,{"$f":"VLOOKUP(C63,Feuil1!$A$1:$B$9999,2)","v":{"$error":"#N/A"}}]
["2013-02-11","2013-02-11",null,{"$f":"VLOOKUP(C64,Feuil1!$A$1:$B$9999,2)","v":{"$error":"#N/A"}}]
["2013-02-12","2013-02-12",null,{"$f":"VLOOKUP(C65,Feuil1!$A$1:$B$9999,2)","v":{"$error":"#N/A"}}]
["2013-02-13","2013-02-13",null,{"$f":"VLOOKUP(C66,Feuil1!$A$1:$B$9999,2)","v":{"$error":"#N/A"}}]
["2013-02-14","2013-02-14",null,{"$f":"VLOOKUP(C67,Feuil1!$A$1:$B$9999,2)","v":{"$error":"#N/A"}}]
["2013-02-15","2013-02-15",null,{"$f":"VLOOKUP(C68,Feuil1!$A$1:$B$9999,2)","v":{"$error":"#N/A"}}]
["2013-02-16","2013-02-16",null,{"$f":"VLOOKUP(C69,Feuil1!$A$1:$B$9999,2)","v":{"$error":"#N/A"}}]
["2013-02-17","2013-02-17",null,{"$f":"VLOOKUP(C70,Feuil1!$A$1:$B$9999,2)","v":{"$error":"#N/A"}}]
["2013-02-18","2013-02-18",null,{"$f":"VLOOKUP(C71,Feuil1!$A$1:$B$9999,2)","v":{"$error":"#N/A"}}]
["2013-02-19","2013-02-19",null,{"$f":"VLOOKUP(C72,Feuil1!$A$1:$B$9999,2)","v":{"$error":"#N/A"}}]
["2013-02-20","2013-02-20",null,{"$f":"VLOOKUP(C73,Feuil1!$A$1:$B$9999,2)","v":{"$error":"#N/A"}}]
["2013-02-21","2013-02-21",null,{"$f":"VLOOKUP(C74,Feuil1!$A$1:$B$9999,2)","v":{"$error":"#N/A"}}]
["2013-02-22","2013-02-22",null,{"$f":"VLOOKUP(C75,Feuil1!$A$1:$B$9999,2)","v":{"$error":"#N/A"}}]
["2013-02-23","2013-02-23",null,{"$f":"VLOOKUP(C76,Feuil1!$A$1:$B$9999,2)","v":{"$error":"#N/A"}}]
["2013-02-24","2013-02-24",null,{"$f":"VLOOKUP(C77,Feuil1!$A$1:$B$9999,2)","v":{"$error":"#N/A"}}]
["2013-02-25","2013-02-25",null,{"$f":"VLOOKUP(C78,Feuil1!$A$1:$B$9999,2)","v":{"$error":"#N/A"}}]
["2013-02-26","2013-02-26",null,{"$f":"VLOOKUP(C79,Feuil1!$A$1:$B$9999,2)","v":{"$error":"#N/A"}}]
["2013-02-27","2013-02-27",null,{"$f":"VLOOKUP(C80,Feuil1!$A$1:$B$9999,2)","v":{"$error":"#N/A"}}]
["2013-02-28","2013-02-28",null,{"$f":"VLOOKUP(C81,Feuil1!$A$1:$B$9999,2)","v":{"$error":"#N/A"}}]
[]
[]
[]
[]
[]
[]
[]
[]
[]
[]
[]
[]
[]
[]
[]
[]
[]
[]
[]
["Ouvrier :","Ouvrier 1",null,null,"Mars"]
[]
["date ","jour ","code","chantier","H. prestées","H. sup."]
["2013-03-01",{"$f":"A104","v":"2013-03-01"},null,{"$f":"VLOOKUP(C104,Feuil1!$A$1:$B$9999,2)","v":{"$error":"#N/A"}}]
["2013-03-02",{"$f":"A105","v":"2013-03-02"},null,{"$f":"VLOOKUP(C105,Feuil1!$A$1:$B$9999,2)","v":{"$error":"#N/A"}}]
["2013-03-03","2013-03-03",null,{"$f":"VLOOKUP(C106,Feuil1!$A$1:$B$9999,2)","v":{"$error":"#N/A"}}]
["2013-03-04","2013-03-04",null,{"$f":"VLOOKUP(C107,Feuil1!$A$1:$B$9999,2)","v":{"$error":"#N/A"}}]
["2013-03-05","2013-03-05",null,{"$f":"VLOOKUP(C108,Feuil1!$A$1:$B$9999,2)","v":{"$error":"#N/A"}}]
["2013-03-06","2013-03-06",null,{"$f":"VLOOKUP(C109,Feuil1!$A$1:$B$9999,2)","v":{"$error":"#N/A"}}]
["2013-03-07","2013-03-07",null,{"$f":"VLOOKUP(C110,Feuil1!$A$1:$B$9999,2)","v":{"$error":"#N/A"}}]
["2013-03-08","2013-03-08",null,{"$f":"VLOOKUP(C111,Feuil1!$A$1:$B$9999,2)","v":{"$error":"#N/A"}}]
["2013-03-09","2013-03-09",null,{"$f":"VLOOKUP(C112,Feuil1!$A$1:$B$9999,2)","v":{"$error":"#N/A"}}]
["2013-03-10","2013-03-10",null,{"$f":"VLOOKUP(C113,Feuil1!$A$1:$B$9999,2)","v":{"$error":"#N/A"}}]
["2013-03-11","2013-03-11",null,{"$f":"VLOOKUP(C114,Feuil1!$A$1:$B$9999,2)","v":{"$error":"#N/A"}}]
["2013-03-12","2013-03-12",null,{"$f":"VLOOKUP(C115,Feuil1!$A$1:$B$9999,2)","v":{"$error":"#N/A"}}]
["2013-03-13","2013-03-13",null,{"$f":"VLOOKUP(C116,Feuil1!$A$1:$B$9999,2)","v":{"$error":"#N/A"}}]
["2013-03-14","2013-03-14",null,{"$f":"VLOOKUP(C117,Feuil1!$A$1:$B$9999,2)","v":{"$error":"#N/A"}}]
["2013-03-15","2013-03-15",null,{"$f":"VLOOKUP(C118,Feuil1!$A$1:$B$9999,2)","v":{"$error":"#N/A"}}]
["2013-03-16","2013-03-16",null,{"$f":"VLOOKUP(C119,Feuil1!$A$1:$B$9999,2)","v":{"$error":"#N/A"}}]
["2013-03-17","2013-03-17",null,{"$f":"VLOOKUP(C120,Feuil1!$A$1:$B$9999,2)","v":{"$error":"#N/A"}}]
["2013-03-18","2013-03-18",null,{"$f":"VLOOKUP(C121,Feuil1!$A$1:$B$9999,2)","v":{"$error":"#N/A"}}]
["2013-03-19","2013-03-19",null,{"$f":"VLOOKUP(C122,Feuil1!$A$1:$B$9999,2)","v":{"$error":"#N/A"}}]
["2013-03-20","2013-03-20",null,{"$f":"VLOOKUP(C123,Feuil1!$A$1:$B$9999,2)","v":{"$error":"#N/A"}}]
["2013-03-21","2013-03-21",null,{"$f":"VLOOKUP(C124,Feuil1!$A$1:$B$9999,2)","v":{"$error":"#N/A"}}]
["2013-03-22","2013-03-22",null,{"$f":"VLOOKUP(C125,Feuil1!$A$1:$B$9999,2)","v":{"$error":"#N/A"}}]
["2013-03-23","2013-03-23",null,{"$f":"VLOOKUP(C126,Feuil1!$A$1:$B$9999,2)","v":{"$error":"#N/A"}}]
["2013-03-24","2013-03-24",null,{"$f":"VLOOKUP(C127,Feuil1!$A$1:$B$9999,2)","v":{"$error":"#N/A"}}]
["2013-03-25","2013-03-25",null,{"$f":"VLOOKUP(C128,Feuil1!$A$1:$B$9999,2)","v":{"$error":"#N/A"}}]
["2013-03-26","2013-03-26",null,{"$f":"VLOOKUP(C129,Feuil1!$A$1:$B$9999,2)","v":{"$error":"#N/A"}}]
["2013-03-27","2013-03-27",null,{"$f":"VLOOKUP(C130,Feuil1!$A$1:$B$9999,2)","v":{"$error":"#N/A"}}]
["2013-03-28","2013-03-28",null,{"$f":"VLOOKUP(C131,Feuil1!$A$1:$B$9999,2)","v":{"$error":"#N/A"}}]
["2013-03-29","2013-03-29",null,{"$f":"VLOOKUP(C132,Feuil1!$A$1:$B$9999,2)","v":{"$error":"#N/A"}}]
["2013-03-30","2013-03-30",null,{"$f":"VLOOKUP(C133,Feuil1!$A$1:$B$9999,2)","v":{"$error":"#N/A"}}]
["2013-03-31","2013-03-31",null,{"$f":"VLOOKUP(C134,Feuil1!$A$1:$B$9999,2)","v":{"$error":"#N/A"}}]
[]
[]
[]
[]
[]
[]
[]
[]
[]
[]
[]
[]
[]
[]
[]
[]
["Ouvrier :","Ouvrier 1",null,null,"Avril"]
[]
[null,"jour ","code","chantier","H. prestées","H. sup."]
["2013-04-01",{"$f":"A154","v":"2013-04-01"},null,{"$f":"VLOOKUP(C154,Feuil1!$A$1:$B$9999,2)","v":{"$error":"#N/A"}}]
["2013-04-02",{"$f":"A155","v":"2013-04-02"},null,{"$f":"VLOOKUP(C155,Feuil1!$A$1:$B$9999,2)","v":{"$error":"#N/A"}}]
["2013-04-03","2013-04-03",null,{"$f":"VLOOKUP(C156,Feuil1!$A$1:$B$9999,2)","v":{"$error":"#N/A"}}]
["2013-04-04","2013-04-04",null,{"$f":"VLOOKUP(C157,Feuil1!$A$1:$B$9999,2)","v":{"$error":"#N/A"}}]
["2013-04-05","2013-04-05",null,{"$f":"VLOOKUP(C158,Feuil1!$A$1:$B$9999,2)","v":{"$error":"#N/A"}}]
["2013-04-06","2013-04-06",null,{"$f":"VLOOKUP(C159,Feuil1!$A$1:$B$9999,2)","v":{"$error":"#N/A"}}]
["2013-04-07","2013-04-07",null,{"$f":"VLOOKUP(C160,Feuil1!$A$1:$B$9999,2)","v":{"$error":"#N/A"}}]
["2013-04-08","2013-04-08",null,{"$f":"VLOOKUP(C161,Feuil1!$A$1:$B$9999,2)","v":{"$error":"#N/A"}}]
["2013-04-09","2013-04-09",null,{"$f":"VLOOKUP(C162,Feuil1!$A$1:$B$9999,2)","v":{"$error":"#N/A"}}]
["2013-04-10","2013-04-10",null,{"$f":"VLOOKUP(C163,Feuil1!$A$1:$B$9999,2)","v":{"$error":"#N/A"}}]
["2013-04-11","2013-04-11",null,{"$f":"VLOOKUP(C164,Feuil1!$A$1:$B$9999,2)","v":{"$error":"#N/A"}}]
["2013-04-12","2013-04-12",null,{"$f":"VLOOKUP(C165,Feuil1!$A$1:$B$9999,2)","v":{"$error":"#N/A"}}]
["2013-04-13","2013-04-13",null,{"$f":"VLOOKUP(C166,Feuil1!$A$1:$B$9999,2)","v":{"$error":"#N/A"}}]
["2013-04-14","2013-04-14",null,{"$f":"VLOOKUP(C167,Feuil1!$A$1:$B$9999,2)","v":{"$error":"#N/A"}}]
["2013-04-15","2013-04-15",null,{"$f":"VLOOKUP(C168,Feuil1!$A$1:$B$9999,2)","v":{"$error":"#N/A"}}]
["2013-04-16","2013-04-16",null,{"$f":"VLOOKUP(C169,Feuil1!$A$1:$B$9999,2)","v":{"$error":"#N/A"}}]
["2013-04-17","2013-04-17",null,{"$f":"VLOOKUP(C170,Feuil1!$A$1:$B$9999,2)","v":{"$error":"#N/A"}}]
["2013-04-18","2013-04-18",null,{"$f":"VLOOKUP(C171,Feuil1!$A$1:$B$9999,2)","v":{"$error":"#N/A"}}]
["2013-04-19","2013-04-19",null,{"$f":"VLOOKUP(C172,Feuil1!$A$1:$B$9999,2)","v":{"$error":"#N/A"}}]
["2013-04-20","2013-04-20",null,{"$f":"VLOOKUP(C173,Feuil1!$A$1:$B$9999,2)","v":{"$error":"#N/A"}}]
["2013-04-21","2013-04-21",null,{"$f":"VLOOKUP(C174,Feuil1!$A$1:$B$9999,2)","v":{"$error":"#N/A"}}]
["2013-04-22","2013-04-22",null,{"$f":"VLOOKUP(C175,Feuil1!$A$1:$B$9999,2)","v":{"$error":"#N/A"}}]
["2013-04-23","2013-04-23",null,{"$f":"VLOOKUP(C176,Feuil1!$A$1:$B$9999,2)","v":{"$error":"#N/A"}}]
["2013-04-24","2013-04-24",null,{"$f":"VLOOKUP(C177,Feuil1!$A$1:$B$9999,2)","v":{"$error":"#N/A"}}]
["2013-04-25","2013-04-25",null,{"$f":"VLOOKUP(C178,Feuil1!$A$1:$B$9999,2)","v":{"$error":"#N/A"}}]
["2013-04-26","2013-04-26",null,{"$f":"VLOOKUP(C179,Feuil1!$A$1:$B$9999,2)","v":{"$error":"#N/A"}}]
["2013-04-27","2013-04-27",null,{"$f":"VLOOKUP(C180,Feuil1!$A$1:$B$9999,2)","v":{"$error":"#N/A"}}]
["2013-04-28","2013-04-28",null,{"$f":"VLOOKUP(C181,Feuil1!$A$1:$B$9999,2)","v":{"$error":"#N/A"}}]
["2013-04-29","2013-04-29",null,{"$f":"VLOOKUP(C182,Feuil1!$A$1:$B$9999,2)","v":{"$error":"#N/A"}}]
["2013-04-30","2013-04-30",null,{"$f":"VLOOKUP(C183,Feuil1!$A$1:$B$9999,2)","v":{"$error":"#N/A"}}]
[]
[]
[]
[]
[]
[]
[]
[]
[]
[]
[]
[]
[]
[]
[]
[]
[]
["Ouvrier :","Ouvrier 1",null,null,"Mai"]
[]
[null,"jour ","code","chantier","H. prestées","H. sup."]
["2013-05-01",{"$f":"A204","v":"2013-05-01"},null,{"$f":"VLOOKUP(C204,Feuil1!$A$1:$B$9999,2)","v":{"$error":"#N/A"}}]
["2013-05-02",{"$f":"A205","v":"2013-05-02"},null,{"$f":"VLOOKUP(C205,Feuil1!$A$1:$B$9999,2)","v":{"$error":"#N/A"}}]
["2013-05-03","2013-05-03",null,{"$f":"VLOOKUP(C206,Feuil1!$A$1:$B$9999,2)","v":{"$error":"#N/A"}}]
["2013-05-04","2013-05-04",null,{"$f":"VLOOKUP(C207,Feuil1!$A$1:$B$9999,2)","v":{"$error":"#N/A"}}]
["2013-05-05","2013-05-05",null,{"$f":"VLOOKUP(C208,Feuil1!$A$1:$B$9999,2)","v":{"$error":"#N/A"}}]
["2013-05-06","2013-05-06",null,{"$f":"VLOOKUP(C209,Feuil1!$A$1:$B$9999,2)","v":{"$error":"#N/A"}}]
["2013-05-07","2013-05-07",null,{"$f":"VLOOKUP(C210,Feuil1!$A$1:$B$9999,2)","v":{"$error":"#N/A"}}]
["2013-05-08","2013-05-08",null,{"$f":"VLOOKUP(C211,Feuil1!$A$1:$B$9999,2)","v":{"$error":"#N/A"}}]
["2013-05-09","2013-05-09",null,{"$f":"VLOOKUP(C212,Feuil1!$A$1:$B$9999,2)","v":{"$error":"#N/A"}}]
["2013-05-10","2013-05-10",null,{"$f":"VLOOKUP(C213,Feuil1!$A$1:$B$9999,2)","v":{"$error":"#N/A"}}]
["2013-05-11","2013-05-11",null,{"$f":"VLOOKUP(C214,Feuil1!$A$1:$B$9999,2)","v":{"$error":"#N/A"}}]
["2013-05-12","2013-05-12",null,{"$f":"VLOOKUP(C215,Feuil1!$A$1:$B$9999,2)","v":{"$error":"#N/A"}}]
["2013-05-13","2013-05-13",null,{"$f":"VLOOKUP(C216,Feuil1!$A$1:$B$9999,2)","v":{"$error":"#N/A"}}]
["2013-05-14","2013-05-14",null,{"$f":"VLOOKUP(C217,Feuil1!$A$1:$B$9999,2)","v":{"$error":"#N/A"}}]
["2013-05-15","2013-05-15",null,{"$f":"VLOOKUP(C218,Feuil1!$A$1:$B$9999,2)","v":{"$error":"#N/A"}}]
["2013-05-16","2013-05-16",null,{"$f":"VLOOKUP(C219,Feuil1!$A$1:$B$9999,2)","v":{"$error":"#N/A"}}]
["2013-05-17","2013-05-17",null,{"$f":"VLOOKUP(C220,Feuil1!$A$1:$B$9999,2)","v":{"$error":"#N/A"}}]
["2013-05-18","2013-05-18",null,{"$f":"VLOOKUP(C221,Feuil1!$A$1:$B$9999,2)","v":{"$error":"#N/A"}}]
["2013-05-19","2013-05-19",null,{"$f":"VLOOKUP(C222,Feuil1!$A$1:$B$9999,2)","v":{"$error":"#N/A"}}]
["2013-05-20","2013-05-20",null,{"$f":"VLOOKUP(C223,Feuil1!$A$1:$B$9999,2)","v":{"$error":"#N/A"}}]
["2013-05-21","2013-05-21",null,{"$f":"VLOOKUP(C224,Feuil1!$A$1:$B$9999,2)","v":{"$error":"#N/A"}}]
["2013-05-22","2013-05-22",null,{"$f":"VLOOKUP(C225,Feuil1!$A$1:$B$9999,2)","v":{"$error":"#N/A"}}]
["2013-05-23","2013-05-23",null,{"$f":"VLOOKUP(C226,Feuil1!$A$1:$B$9999,2)","v":{"$error":"#N/A"}}]
["2013-05-24","2013-05-24",null,{"$f":"VLOOKUP(C227,Feuil1!$A$1:$B$9999,2)","v":{"$error":"#N/A"}}]
["2013-05-25","2013-05-25",null,{"$f":"VLOOKUP(C228,Feuil1!$A$1:$B$9999,2)","v":{"$error":"#N/A"}}]
["2013-05-26","2013-05-26",null,{"$f":"VLOOKUP(C229,Feuil1!$A$1:$B$9999,2)","v":{"$error":"#N/A"}}]
["2013-05-27","2013-05-27",null,{"$f":"VLOOKUP(C230,Feuil1!$A$1:$B$9999,2)","v":{"$error":"#N/A"}}]
["2013-05-28","2013-05-28",null,{"$f":"VLOOKUP(C231,Feuil1!$A$1:$B$9999,2)","v":{"$error":"#N/A"}}]
["2013-05-29","2013-05-29",null,{"$f":"VLOOKUP(C232,Feuil1!$A$1:$B$9999,2)","v":{"$error":"#N/A"}}]
["2013-05-30","2013-05-30",null,{"$f":"VLOOKUP(C233,Feuil1!$A$1:$B$9999,2)","v":{"$error":"#N/A"}}]
["2013-05-31","2013-05-31",null,{"$f":"VLOOKUP(C234,Feuil1!$A$1:$B$9999,2)","v":{"$error":"#N/A"}}]
[]
[]
[]
[]
[]
[]
[]
[]
[]
[]
[]
[]
[]
[]
[]
[]
["Ouvrier :","Ouvrier 1",null,null,"Juin"]
[]
[null,"jour ","code","chantier","H. prestées","H. sup."]
["2013-06-01",{"$f":"A254","v":"2013-06-01"},null,{"$f":"VLOOKUP(C254,Feuil1!$A$1:$B$9999,2)","v":{"$error":"#N/A"}}]
["2013-06-02",{"$f":"A255","v":"2013-06-02"},null,{"$f":"VLOOKUP(C255,Feuil1!$A$1:$B$9999,2)","v":{"$error":"#N/A"}}]
["2013-06-03","2013-06-03",null,{"$f":"VLOOKUP(C256,Feuil1!$A$1:$B$9999,2)","v":{"$error":"#N/A"}}]
["2013-06-04","2013-06-04",null,{"$f":"VLOOKUP(C257,Feuil1!$A$1:$B$9999,2)","v":{"$error":"#N/A"}}]
["2013-06-05","2013-06-05",null,{"$f":"VLOOKUP(C258,Feuil1!$A$1:$B$9999,2)","v":{"$error":"#N/A"}}]
["2013-06-06","2013-06-06",null,{"$f":"VLOOKUP(C259,Feuil1!$A$1:$B$9999,2)","v":{"$error":"#N/A"}}]
["2013-06-07","2013-06-07",null,{"$f":"VLOOKUP(C260,Feuil1!$A$1:$B$9999,2)","v":{"$error":"#N/A"}}]
["2013-06-08","2013-06-08",null,{"$f":"VLOOKUP(C261,Feuil1!$A$1:$B$9999,2)","v":{"$error":"#N/A"}}]
["2013-06-09","2013-06-09",null,{"$f":"VLOOKUP(C262,Feuil1!$A$1:$B$9999,2)","v":{"$error":"#N/A"}}]
["2013-06-10","2013-06-10",null,{"$f":"VLOOKUP(C263,Feuil1!$A$1:$B$9999,2)","v":{"$error":"#N/A"}}]
["2013-06-11","2013-06-11",null,{"$f":"VLOOKUP(C264,Feuil1!$A$1:$B$9999,2)","v":{"$error":"#N/A"}}]
["2013-06-12","2013-06-12",null,{"$f":"VLOOKUP(C265,Feuil1!$A$1:$B$9999,2)","v":{"$error":"#N/A"}}]
["2013-06-13","2013-06-13",null,{"$f":"VLOOKUP(C266,Feuil1!$A$1:$B$9999,2)","v":{"$error":"#N/A"}}]
["2013-06-14","2013-06-14",null,{"$f":"VLOOKUP(C267,Feuil1!$A$1:$B$9999,2)","v":{"$error":"#N/A"}}]
["2013-06-15","2013-06-15",null,{"$f":"VLOOKUP(C268,Feuil1!$A$1:$B$9999,2)","v":{"$error":"#N/A"}}]
["2013-06-16","2013-06-16",null,{"$f":"VLOOKUP(C269,Feuil1!$A$1:$B$9999,2)","v":{"$error":"#N/A"}}]
["2013-06-17","2013-06-17",null,{"$f":"VLOOKUP(C270,Feuil1!$A$1:$B$9999,2)","v":{"$error":"#N/A"}}]
["2013-06-18","2013-06-18",null,{"$f":"VLOOKUP(C271,Feuil1!$A$1:$B$9999,2)","v":{"$error":"#N/A"}}]
["2013-06-19","2013-06-19",null,{"$f":"VLOOKUP(C272,Feuil1!$A$1:$B$9999,2)","v":{"$error":"#N/A"}}]
["2013-06-20","2013-06-20",null,{"$f":"VLOOKUP(C273,Feuil1!$A$1:$B$9999,2)","v":{"$error":"#N/A"}}]
["2013-06-21","2013-06-21",null,{"$f":"VLOOKUP(C274,Feuil1!$A$1:$B$9999,2)","v":{"$error":"#N/A"}}]
["2013-06-22","2013-06-22",null,{"$f":"VLOOKUP(C275,Feuil1!$A$1:$B$9999,2)","v":{"$error":"#N/A"}}]
["2013-06-23","2013-06-23",null,{"$f":"VLOOKUP(C276,Feuil1!$A$1:$B$9999,2)","v":{"$error":"#N/A"}}]
["2013-06-24","2013-06-24",null,{"$f":"VLOOKUP(C277,Feuil1!$A$1:$B$9999,2)","v":{"$error":"#N/A"}}]
["2013-06-25","2013-06-25",null,{"$f":"VLOOKUP(C278,Feuil1!$A$1:$B$9999,2)","v":{"$error":"#N/A"}}]
["2013-06-26","2013-06-26",null,{"$f":"VLOOKUP(C279,Feuil1!$A$1:$B$9999,2)","v":{"$error":"#N/A"}}]
["2013-06-27","2013-06-27",null,{"$f":"VLOOKUP(C280,Feuil1!$A$1:$B$9999,2)","v":{"$error":"#N/A"}}]
["2013-06-28","2013-06-28",null,{"$f":"VLOOKUP(C281,Feuil1!$A$1:$B$9999,2)","v":{"$error":"#N/A"}}]
["2013-06-29","2013-06-29",null,{"$f":"VLOOKUP(C282,Feuil1!$A$1:$B$9999,2)","v":{"$error":"#N/A"}}]
["2013-06-30","2013-06-30",null,{"$f":"VLOOKUP(C283,Feuil1!$A$1:$B$9999,2)","v":{"$error":"#N/A"}}]
[]
[]
[]
[]
[]
[]
[]
[]
[]
[]
[]
[]
[]
[]
[]
[]
[]
["Ouvrier :","Ouvrier 1",null,null,"Juillet"]
[]
[null,"jour ","code","chantier","H. prestées","H. sup."]
["2013-07-01",{"$f":"A304","v":"2013-07-01"},null,{"$f":"VLOOKUP(C304,Feuil1!$A$1:$B$9999,2)","v":{"$error":"#N/A"}}]
["2013-07-02",{"$f":"A305","v":"2013-07-02"},null,{"$f":"VLOOKUP(C305,Feuil1!$A$1:$B$9999,2)","v":{"$error":"#N/A"}}]
["2013-07-03","2013-07-03",null,{"$f":"VLOOKUP(C306,Feuil1!$A$1:$B$9999,2)","v":{"$error":"#N/A"}}]
["2013-07-04","2013-07-04",null,{"$f":"VLOOKUP(C307,Feuil1!$A$1:$B$9999,2)","v":{"$error":"#N/A"}}]
["2013-07-05","2013-07-05",null,{"$f":"VLOOKUP(C308,Feuil1!$A$1:$B$9999,2)","v":{"$error":"#N/A"}}]
["2013-07-06","2013-07-06",null,{"$f":"VLOOKUP(C309,Feuil1!$A$1:$B$9999,2)","v":{"$error":"#N/A"}}]
["2013-07-07","2013-07-07",null,{"$f":"VLOOKUP(C310,Feuil1!$A$1:$B$9999,2)","v":{"$error":"#N/A"}}]
["2013-07-08","2013-07-08",null,{"$f":"VLOOKUP(C311,Feuil1!$A$1:$B$9999,2)","v":{"$error":"#N/A"}}]
["2013-07-09","2013-07-09",null,{"$f":"VLOOKUP(C312,Feuil1!$A$1:$B$9999,2)","v":{"$error":"#N/A"}}]
["2013-07-10","2013-07-10",null,{"$f":"VLOOKUP(C313,Feuil1!$A$1:$B$9999,2)","v":{"$error":"#N/A"}}]
["2013-07-11","2013-07-11",null,{"$f":"VLOOKUP(C314,Feuil1!$A$1:$B$9999,2)","v":{"$error":"#N/A"}}]
["2013-07-12","2013-07-12",null,{"$f":"VLOOKUP(C315,Feuil1!$A$1:$B$9999,2)","v":{"$error":"#N/A"}}]
["2013-07-13","2013-07-13",null,{"$f":"VLOOKUP(C316,Feuil1!$A$1:$B$9999,2)","v":{"$error":"#N/A"}}]
["2013-07-14","2013-07-14",null,{"$f":"VLOOKUP(C317,Feuil1!$A$1:$B$9999,2)","v":{"$error":"#N/A"}}]
["2013-07-15","2013-07-15",null,{"$f":"VLOOKUP(C318,Feuil1!$A$1:$B$9999,2)","v":{"$error":"#N/A"}}]
["2013-07-16","2013-07-16",null,{"$f":"VLOOKUP(C319,Feuil1!$A$1:$B$9999,2)","v":{"$error":"#N/A"}}]
["2013-07-17","2013-07-17",null,{"$f":"VLOOKUP(C320,Feuil1!$A$1:$B$9999,2)","v":{"$error":"#N/A"}}]
["2013-07-18","2013-07-18",null,{"$f":"VLOOKUP(C321,Feuil1!$A$1:$B$9999,2)","v":{"$error":"#N/A"}}]
["2013-07-19","2013-07-19",null,{"$f":"VLOOKUP(C322,Feuil1!$A$1:$B$9999,2)","v":{"$error":"#N/A"}}]
["2013-07-20","2013-07-20",null,{"$f":"VLOOKUP(C323,Feuil1!$A$1:$B$9999,2)","v":{"$error":"#N/A"}}]
["2013-07-21","2013-07-21",null,{"$f":"VLOOKUP(C324,Feuil1!$A$1:$B$9999,2)","v":{"$error":"#N/A"}}]
["2013-07-22","2013-07-22",null,{"$f":"VLOOKUP(C325,Feuil1!$A$1:$B$9999,2)","v":{"$error":"#N/A"}}]
["2013-07-23","2013-07-23",null,{"$f":"VLOOKUP(C326,Feuil1!$A$1:$B$9999,2)","v":{"$error":"#N/A"}}]
["2013-07-24","2013-07-24",null,{"$f":"VLOOKUP(C327,Feuil1!$A$1:$B$9999,2)","v":{"$error":"#N/A"}}]
["2013-07-25","2013-07-25",null,{"$f":"VLOOKUP(C328,Feuil1!$A$1:$B$9999,2)","v":{"$error":"#N/A"}}]
["2013-07-26","2013-07-26",null,{"$f":"VLOOKUP(C329,Feuil1!$A$1:$B$9999,2)","v":{"$error":"#N/A"}}]
["2013-07-27","2013-07-27",null,{"$f":"VLOOKUP(C330,Feuil1!$A$1:$B$9999,2)","v":{"$error":"#N/A"}}]
["2013-07-28","2013-07-28",null,{"$f":"VLOOKUP(C331,Feuil1!$A$1:$B$9999,2)","v":{"$error":"#N/A"}}]
["2013-07-29","2013-07-29",null,{"$f":"VLOOKUP(C332,Feuil1!$A$1:$B$9999,2)","v":{"$error":"#N/A"}}]
["2013-07-30","2013-07-30",null,{"$f":"VLOOKUP(C333,Feuil1!$A$1:$B$9999,2)","v":{"$error":"#N/A"}}]
["2013-07-31","2013-07-31",null,{"$f":"VLOOKUP(C334,Feuil1!$A$1:$B$9999,2)","v":{"$error":"#N/A"}}]
[]
[]
[]
[]
[]
[]
[]
[]
[]
[]
[]
[]
[]
[]
[]
[]
["Ouvrier :","Ouvrier 1",null,null,"Aout"]
[]
[null,"jour ","code","chantier","H. prestées","H. sup."]
["2013-08-01",{"$f":"A354","v":"2013-08-01"},null,{"$f":"VLOOKUP(C354,Feuil1!$A$1:$B$9999,2)","v":{"$error":"#N/A"}}]
["2013-08-02",{"$f":"A355","v":"2013-08-02"},null,{"$f":"VLOOKUP(C355,Feuil1!$A$1:$B$9999,2)","v":{"$error":"#N/A"}}]
["2013-08-03","2013-08-03",null,{"$f":"VLOOKUP(C356,Feuil1!$A$1:$B$9999,2)","v":{"$error":"#N/A"}}]
["2013-08-04","2013-08-04",null,{"$f":"VLOOKUP(C357,Feuil1!$A$1:$B$9999,2)","v":{"$error":"#N/A"}}]
["2013-08-05","2013-08-05",null,{"$f":"VLOOKUP(C358,Feuil1!$A$1:$B$9999,2)","v":{"$error":"#N/A"}}]
["2013-08-06","2013-08-06",null,{"$f":"VLOOKUP(C359,Feuil1!$A$1:$B$9999,2)","v":{"$error":"#N/A"}}]
["2013-08-07","2013-08-07",null,{"$f":"VLOOKUP(C360,Feuil1!$A$1:$B$9999,2)","v":{"$error":"#N/A"}}]
["2013-08-08","2013-08-08",null,{"$f":"VLOOKUP(C361,Feuil1!$A$1:$B$9999,2)","v":{"$error":"#N/A"}}]
["2013-08-09","2013-08-09",null,{"$f":"VLOOKUP(C362,Feuil1!$A$1:$B$9999,2)","v":{"$error":"#N/A"}}]
["2013-08-10","2013-08-10",null,{"$f":"VLOOKUP(C363,Feuil1!$A$1:$B$9999,2)","v":{"$error":"#N/A"}}]
["2013-08-11","2013-08-11",null,{"$f":"VLOOKUP(C364,Feuil1!$A$1:$B$9999,2)","v":{"$error":"#N/A"}}]
["2013-08-12","2013-08-12",null,{"$f":"VLOOKUP(C365,Feuil1!$A$1:$B$9999,2)","v":{"$error":"#N/A"}}]
["2013-08-13","2013-08-13",null,{"$f":"VLOOKUP(C366,Feuil1!$A$1:$B$9999,2)","v":{"$error":"#N/A"}}]
["2013-08-14","2013-08-14",null,{"$f":"VLOOKUP(C367,Feuil1!$A$1:$B$9999,2)","v":{"$error":"#N/A"}}]
["2013-08-15","2013-08-15",null,{"$f":"VLOOKUP(C368,Feuil1!$A$1:$B$9999,2)","v":{"$error":"#N/A"}}]
["2013-08-16","2013-08-16",null,{"$f":"VLOOKUP(C369,Feuil1!$A$1:$B$9999,2)","v":{"$error":"#N/A"}}]
["2013-08-17","2013-08-17",null,{"$f":"VLOOKUP(C370,Feuil1!$A$1:$B$9999,2)","v":{"$error":"#N/A"}}]
["2013-08-18","2013-08-18",null,{"$f":"VLOOKUP(C371,Feuil1!$A$1:$B$9999,2)","v":{"$error":"#N/A"}}]
["2013-08-19","2013-08-19",null,{"$f":"VLOOKUP(C372,Feuil1!$A$1:$B$9999,2)","v":{"$error":"#N/A"}}]
["2013-08-20","2013-08-20",null,{"$f":"VLOOKUP(C373,Feuil1!$A$1:$B$9999,2)","v":{"$error":"#N/A"}}]
["2013-08-21","2013-08-21",null,{"$f":"VLOOKUP(C374,Feuil1!$A$1:$B$9999,2)","v":{"$error":"#N/A"}}]
["2013-08-22","2013-08-22",null,{"$f":"VLOOKUP(C375,Feuil1!$A$1:$B$9999,2)","v":{"$error":"#N/A"}}]
["2013-08-23","2013-08-23",null,{"$f":"VLOOKUP(C376,Feuil1!$A$1:$B$9999,2)","v":{"$error":"#N/A"}}]
["2013-08-24","2013-08-24",null,{"$f":"VLOOKUP(C377,Feuil1!$A$1:$B$9999,2)","v":{"$error":"#N/A"}}]
["2013-08-25","2013-08-25",null,{"$f":"VLOOKUP(C378,Feuil1!$A$1:$B$9999,2)","v":{"$error":"#N/A"}}]
["2013-08-26","2013-08-26",null,{"$f":"VLOOKUP(C379,Feuil1!$A$1:$B$9999,2)","v":{"$error":"#N/A"}}]
["2013-08-27","2013-08-27",null,{"$f":"VLOOKUP(C380,Feuil1!$A$1:$B$9999,2)","v":{"$error":"#N/A"}}]
["2013-08-28","2013-08-28",null,{"$f":"VLOOKUP(C381,Feuil1!$A$1:$B$9999,2)","v":{"$error":"#N/A"}}]
["2013-08-29","2013-08-29",null,{"$f":"VLOOKUP(C382,Feuil1!$A$1:$B$9999,2)","v":{"$error":"#N/A"}}]
["2013-08-30","2013-08-30",null,{"$f":"VLOOKUP(C383,Feuil1!$A$1:$B$9999,2)","v":{"$error":"#N/A"}}]
["2013-08-31","2013-08-31",null,{"$f":"VLOOKUP(C384,Feuil1!$A$1:$B$9999,2)","v":{"$error":"#N/A"}}]
[]
[]
[]
[]
[]
[]
[]
[]
[]
[]
[]
[]
[]
[]
[]
[]
["Ouvrier :","Ouvrier 1",null,null,"Septembre"]
[]
[null,"jour ","code","chantier","H. prestées","H. sup."]
["2013-09-01",{"$f":"A404","v":"2013-09-01"},null,{"$f":"VLOOKUP(C404,Feuil1!$A$1:$B$9999,2)","v":{"$error":"#N/A"}}]
["2013-09-02",{"$f":"A405","v":"2013-09-02"},null,{"$f":"VLOOKUP(C405,Feuil1!$A$1:$B$9999,2)","v":{"$error":"#N/A"}}]
["2013-09-03","2013-09-03",null,{"$f":"VLOOKUP(C406,Feuil1!$A$1:$B$9999,2)","v":{"$error":"#N/A"}}]
["2013-09-04","2013-09-04",null,{"$f":"VLOOKUP(C407,Feuil1!$A$1:$B$9999,2)","v":{"$error":"#N/A"}}]
["2013-09-05","2013-09-05",null,{"$f":"VLOOKUP(C408,Feuil1!$A$1:$B$9999,2)","v":{"$error":"#N/A"}}]
["2013-09-06","2013-09-06",null,{"$f":"VLOOKUP(C409,Feuil1!$A$1:$B$9999,2)","v":{"$error":"#N/A"}}]
["2013-09-07","2013-09-07",null,{"$f":"VLOOKUP(C410,Feuil1!$A$1:$B$9999,2)","v":{"$error":"#N/A"}}]
["2013-09-08","2013-09-08",null,{"$f":"VLOOKUP(C411,Feuil1!$A$1:$B$9999,2)","v":{"$error":"#N/A"}}]
["2013-09-09","2013-09-09",null,{"$f":"VLOOKUP(C412,Feuil1!$A$1:$B$9999,2)","v":{"$error":"#N/A"}}]
["2013-09-10","2013-09-10",null,{"$f":"VLOOKUP(C413,Feuil1!$A$1:$B$9999,2)","v":{"$error":"#N/A"}}]
["2013-09-11","2013-09-11",null,{"$f":"VLOOKUP(C414,Feuil1!$A$1:$B$9999,2)","v":{"$error":"#N/A"}}]
["2013-09-12","2013-09-12",null,{"$f":"VLOOKUP(C415,Feuil1!$A$1:$B$9999,2)","v":{"$error":"#N/A"}}]
["2013-09-13","2013-09-13",null,{"$f":"VLOOKUP(C416,Feuil1!$A$1:$B$9999,2)","v":{"$error":"#N/A"}}]
["2013-09-14","2013-09-14",null,{"$f":"VLOOKUP(C417,Feuil1!$A$1:$B$9999,2)","v":{"$error":"#N/A"}}]
["2013-09-15","2013-09-15",null,{"$f":"VLOOKUP(C418,Feuil1!$A$1:$B$9999,2)","v":{"$error":"#N/A"}}]
["2013-09-16","2013-09-16",null,{"$f":"VLOOKUP(C419,Feuil1!$A$1:$B$9999,2)","v":{"$error":"#N/A"}}]
["2013-09-17","2013-09-17",null,{"$f":"VLOOKUP(C420,Feuil1!$A$1:$B$9999,2)","v":{"$error":"#N/A"}}]
["2013-09-18","2013-09-18",null,{"$f":"VLOOKUP(C421,Feuil1!$A$1:$B$9999,2)","v":{"$error":"#N/A"}}]
["2013-09-19","2013-09-19",null,{"$f":"VLOOKUP(C422,Feuil1!$A$1:$B$9999,2)","v":{"$error":"#N/A"}}]
["2013-09-20","2013-09-20",null,{"$f":"VLOOKUP(C423,Feuil1!$A$1:$B$9999,2)","v":{"$error":"#N/A"}}]
["2013-09-21","2013-09-21",null,{"$f":"VLOOKUP(C424,Feuil1!$A$1:$B$9999,2)","v":{"$error":"#N/A"}}]
["2013-09-22","2013-09-22",null,{"$f":"VLOOKUP(C425,Feuil1!$A$1:$B$9999,2)","v":{"$error":"#N/A"}}]
["2013-09-23","2013-09-23",null,{"$f":"VLOOKUP(C426,Feuil1!$A$1:$B$9999,2)","v":{"$error":"#N/A"}}]
["2013-09-24","2013-09-24",null,{"$f":"VLOOKUP(C427,Feuil1!$A$1:$B$9999,2)","v":{"$error":"#N/A"}}]
["2013-09-25","2013-09-25",null,{"$f":"VLOOKUP(C428,Feuil1!$A$1:$B$9999,2)","v":{"$error":"#N/A"}}]
["2013-09-26","2013-09-26",null,{"$f":"VLOOKUP(C429,Feuil1!$A$1:$B$9999,2)","v":{"$error":"#N/A"}}]
["2013-09-27","2013-09-27",null,{"$f":"VLOOKUP(C430,Feuil1!$A$1:$B$9999,2)","v":{"$error":"#N/A"}}]
["2013-09-28","2013-09-28",null,{"$f":"VLOOKUP(C431,Feuil1!$A$1:$B$9999,2)","v":{"$error":"#N/A"}}]
["2013-09-29","2013-09-29",null,{"$f":"VLOOKUP(C432,Feuil1!$A$1:$B$9999,2)","v":{"$error":"#N/A"}}]
["2013-09-30","2013-09-30",null,{"$f":"VLOOKUP(C433,Feuil1!$A$1:$B$9999,2)","v":{"$error":"#N/A"}}]
[]
[]
[]
[]
[]
[]
[]
[]
[]
[]
[]
[]
[]
[]
[]
[]
[]
["Ouvrier :","Ouvrier 1",null,null,"Octobre"]
[]
[null,"jour ","code","chantier","H. prestées","H. sup."]
["2013-10-01",{"$f":"A454","v":"2013-10-01"},null,{"$f":"VLOOKUP(C454,Feuil1!$A$1:$B$9999,2)","v":{"$error":"#N/A"}}]
["2013-10-02",{"$f":"A455","v":"2013-10-02"},null,{"$f":"VLOOKUP(C455,Feuil1!$A$1:$B$9999,2)","v":{"$error":"#N/A"}}]
["2013-10-03","2013-10-03",null,{"$f":"VLOOKUP(C456,Feuil1!$A$1:$B$9999,2)","v":{"$error":"#N/A"}}]
["2013-10-04","2013-10-04",null,{"$f":"VLOOKUP(C457,Feuil1!$A$1:$B$9999,2)","v":{"$error":"#N/A"}}]
["2013-10-05","2013-10-05",null,{"$f":"VLOOKUP(C458,Feuil1!$A$1:$B$9999,2)","v":{"$error":"#N/A"}}]
["2013-10-06","2013-10-06",null,{"$f":"VLOOKUP(C459,Feuil1!$A$1:$B$9999,2)","v":{"$error":"#N/A"}}]
["2013-10-07","2013-10-07",null,{"$f":"VLOOKUP(C460,Feuil1!$A$1:$B$9999,2)","v":{"$error":"#N/A"}}]
["2013-10-08","2013-10-08",null,{"$f":"VLOOKUP(C461,Feuil1!$A$1:$B$9999,2)","v":{"$error":"#N/A"}}]
["2013-10-09","2013-10-09",null,{"$f":"VLOOKUP(C462,Feuil1!$A$1:$B$9999,2)","v":{"$error":"#N/A"}}]
["2013-10-10","2013-10-10",null,{"$f":"VLOOKUP(C463,Feuil1!$A$1:$B$9999,2)","v":{"$error":"#N/A"}}]
["2013-10-11","2013-10-11",null,{"$f":"VLOOKUP(C464,Feuil1!$A$1:$B$9999,2)","v":{"$error":"#N/A"}}]
["2013-10-12","2013-10-12",null,{"$f":"VLOOKUP(C465,Feuil1!$A$1:$B$9999,2)","v":{"$error":"#N/A"}}]
["2013-10-13","2013-10-13",null,{"$f":"VLOOKUP(C466,Feuil1!$A$1:$B$9999,2)","v":{"$error":"#N/A"}}]
["2013-10-14","2013-10-14",null,{"$f":"VLOOKUP(C467,Feuil1!$A$1:$B$9999,2)","v":{"$error":"#N/A"}}]
["2013-10-15","2013-10-15",null,{"$f":"VLOOKUP(C468,Feuil1!$A$1:$B$9999,2)","v":{"$error":"#N/A"}}]
["2013-10-16","2013-10-16",null,{"$f":"VLOOKUP(C469,Feuil1!$A$1:$B$9999,2)","v":{"$error":"#N/A"}}]
["2013-10-17","2013-10-17",null,{"$f":"VLOOKUP(C470,Feuil1!$A$1:$B$9999,2)","v":{"$error":"#N/A"}}]
["2013-10-18","2013-10-18",null,{"$f":"VLOOKUP(C471,Feuil1!$A$1:$B$9999,2)","v":{"$error":"#N/A"}}]
["2013-10-19","2013-10-19",null,{"$f":"VLOOKUP(C472,Feuil1!$A$1:$B$9999,2)","v":{"$error":"#N/A"}}]
["2013-10-20","2013-10-20",null,{"$f":"VLOOKUP(C473,Feuil1!$A$1:$B$9999,2)","v":{"$error":"#N/A"}}]
["2013-10-21","2013-10-21",null,{"$f":"VLOOKUP(C474,Feuil1!$A$1:$B$9999,2)","v":{"$error":"#N/A"}}]
["2013-10-22","2013-10-22",null,{"$f":"VLOOKUP(C475,Feuil1!$A$1:$B$9999,2)","v":{"$error":"#N/A"}}]
["2013-10-23","2013-10-23",null,{"$f":"VLOOKUP(C476,Feuil1!$A$1:$B$9999,2)","v":{"$error":"#N/A"}}]
["2013-10-24","2013-10-24",null,{"$f":"VLOOKUP(C477,Feuil1!$A$1:$B$9999,2)","v":{"$error":"#N/A"}}]
["2013-10-25","2013-10-25",null,{"$f":"VLOOKUP(C478,Feuil1!$A$1:$B$9999,2)","v":{"$error":"#N/A"}}]
["2013-10-26","2013-10-26",null,{"$f":"VLOOKUP(C479,Feuil1!$A$1:$B$9999,2)","v":{"$error":"#N/A"}}]
["2013-10-27","2013-10-27",null,{"$f":"VLOOKUP(C480,Feuil1!$A$1:$B$9999,2)","v":{"$error":"#N/A"}}]
["2013-10-28","2013-10-28",null,{"$f":"VLOOKUP(C481,Feuil1!$A$1:$B$9999,2)","v":{"$error":"#N/A"}}]
["2013-10-29","2013-10-29",null,{"$f":"VLOOKUP(C482,Feuil1!$A$1:$B$9999,2)","v":{"$error":"#N/A"}}]
["2013-10-30","2013-10-30",null,{"$f":"VLOOKUP(C483,Feuil1!$A$1:$B$9999,2)","v":{"$error":"#N/A"}}]
["2013-10-31","2013-10-31",null,{"$f":"VLOOKUP(C484,Feuil1!$A$1:$B$9999,2)","v":{"$error":"#N/A"}}]
[]
[]
[]
[]
[]
[]
[]
[]
[]
[]
[]
[]
[]
[]
[]
[]
["Ouvrier :","Ouvrier 1",null,null,"Novembre"]
[]
["date ","jour ","code","chantier","H. prestées","H. sup."]
["2013-11-01",{"$f":"A504","v":"2013-11-01"},null,{"$f":"VLOOKUP(C504,Feuil1!$A$1:$B$9999,2)","v":{"$error":"#N/A"}}]
["2013-11-02",{"$f":"A505","v":"2013-11-02"},null,{"$f":"VLOOKUP(C505,Feuil1!$A$1:$B$9999,2)","v":{"$error":"#N/A"}}]
["2013-11-03","2013-11-03",null,{"$f":"VLOOKUP(C506,Feuil1!$A$1:$B$9999,2)","v":{"$error":"#N/A"}}]
["2013-11-04","2013-11-04",null,{"$f":"VLOOKUP(C507,Feuil1!$A$1:$B$9999,2)","v":{"$error":"#N/A"}}]
["2013-11-05","2013-11-05",null,{"$f":"VLOOKUP(C508,Feuil1!$A$1:$B$9999,2)","v":{"$error":"#N/A"}}]
["2013-11-06","2013-11-06",null,{"$f":"VLOOKUP(C509,Feuil1!$A$1:$B$9999,2)","v":{"$error":"#N/A"}}]
["2013-11-07","2013-11-07",null,{"$f":"VLOOKUP(C510,Feuil1!$A$1:$B$9999,2)","v":{"$error":"#N/A"}}]
["2013-11-08","2013-11-08",null,{"$f":"VLOOKUP(C511,Feuil1!$A$1:$B$9999,2)","v":{"$error":"#N/A"}}]
["2013-11-09","2013-11-09",null,{"$f":"VLOOKUP(C512,Feuil1!$A$1:$B$9999,2)","v":{"$error":"#N/A"}}]
["2013-11-10","2013-11-10",null,{"$f":"VLOOKUP(C513,Feuil1!$A$1:$B$9999,2)","v":{"$error":"#N/A"}}]
["2013-11-11","2013-11-11",null,{"$f":"VLOOKUP(C514,Feuil1!$A$1:$B$9999,2)","v":{"$error":"#N/A"}}]
["2013-11-12","2013-11-12",null,{"$f":"VLOOKUP(C515,Feuil1!$A$1:$B$9999,2)","v":{"$error":"#N/A"}}]
["2013-11-13","2013-11-13",null,{"$f":"VLOOKUP(C516,Feuil1!$A$1:$B$9999,2)","v":{"$error":"#N/A"}}]
["2013-11-14","2013-11-14",null,{"$f":"VLOOKUP(C517,Feuil1!$A$1:$B$9999,2)","v":{"$error":"#N/A"}}]
["2013-11-15","2013-11-15",null,{"$f":"VLOOKUP(C518,Feuil1!$A$1:$B$9999,2)","v":{"$error":"#N/A"}}]
["2013-11-16","2013-11-16",null,{"$f":"VLOOKUP(C519,Feuil1!$A$1:$B$9999,2)","v":{"$error":"#N/A"}}]
["2013-11-17","2013-11-17",null,{"$f":"VLOOKUP(C520,Feuil1!$A$1:$B$9999,2)","v":{"$error":"#N/A"}}]
["2013-11-18","2013-11-18",null,{"$f":"VLOOKUP(C521,Feuil1!$A$1:$B$9999,2)","v":{"$error":"#N/A"}}]
["2013-11-19","2013-11-19",null,{"$f":"VLOOKUP(C522,Feuil1!$A$1:$B$9999,2)","v":{"$error":"#N/A"}}]
["2013-11-20","2013-11-20",null,{"$f":"VLOOKUP(C523,Feuil1!$A$1:$B$9999,2)","v":{"$error":"#N/A"}}]
["2013-11-21","2013-11-21",null,{"$f":"VLOOKUP(C524,Feuil1!$A$1:$B$9999,2)","v":{"$error":"#N/A"}}]
["2013-11-22","2013-11-22",null,{"$f":"VLOOKUP(C525,Feuil1!$A$1:$B$9999,2)","v":{"$error":"#N/A"}}]
["2013-11-23","2013-11-23",null,{"$f":"VLOOKUP(C526,Feuil1!$A$1:$B$9999,2)","v":{"$error":"#N/A"}}]
["2013-11-24","2013-11-24",null,{"$f":"VLOOKUP(C527,Feuil1!$A$1:$B$9999,2)","v":{"$error":"#N/A"}}]
["2013-11-25","2013-11-25",null,{"$f":"VLOOKUP(C528,Feuil1!$A$1:$B$9999,2)","v":{"$error":"#N/A"}}]
["2013-11-26","2013-11-26",null,{"$f":"VLOOKUP(C529,Feuil1!$A$1:$B$9999,2)","v":{"$error":"#N/A"}}]
["2013-11-27","2013-11-27",null,{"$f":"VLOOKUP(C530,Feuil1!$A$1:$B$9999,2)","v":{"$error":"#N/A"}}]
["2013-11-28","2013-11-28",null,{"$f":"VLOOKUP(C531,Feuil1!$A$1:$B$9999,2)","v":{"$error":"#N/A"}}]
["2013-11-29","2013-11-29",null,{"$f":"VLOOKUP(C532,Feuil1!$A$1:$B$9999,2)","v":{"$error":"#N/A"}}]
["2013-11-30","2013-11-30",null,{"$f":"VLOOKUP(C533,Feuil1!$A$1:$B$9999,2)","v":{"$error":"#N/A"}}]
[]
[]
[]
[]
[]
[]
[]
[]
[]
[]
[]
[]
[]
[]
[]
[]
[]
["Ouvrier :","Ouvrier 1",null,null,"Décembre"]
[]
["date ","jour ","code","chantier","H. prestées","H. sup."]
["2013-12-01",{"$f":"A554","v":"2013-12-01"},null,{"$f":"VLOOKUP(C554,Feuil1!$A$1:$B$9999,2)","v":{"$error":"#N/A"}}]
["2013-12-02",{"$f":"A555","v":"2013-12-02"},null,{"$f":"VLOOKUP(C555,Feuil1!$A$1:$B$9999,2)","v":{"$error":"#N/A"}}]
["2013-12-03","2013-12-03",null,{"$f":"VLOOKUP(C556,Feuil1!$A$1:$B$9999,2)","v":{"$error":"#N/A"}}]
["2013-12-04","2013-12-04",null,{"$f":"VLOOKUP(C557,Feuil1!$A$1:$B$9999,2)","v":{"$error":"#N/A"}}]
["2013-12-05","2013-12-05",null,{"$f":"VLOOKUP(C558,Feuil1!$A$1:$B$9999,2)","v":{"$error":"#N/A"}}]
["2013-12-06","2013-12-06",null,{"$f":"VLOOKUP(C559,Feuil1!$A$1:$B$9999,2)","v":{"$error":"#N/A"}}]
["2013-12-07","2013-12-07",null,{"$f":"VLOOKUP(C560,Feuil1!$A$1:$B$9999,2)","v":{"$error":"#N/A"}}]
["2013-12-08","2013-12-08",null,{"$f":"VLOOKUP(C561,Feuil1!$A$1:$B$9999,2)","v":{"$error":"#N/A"}}]
["2013-12-09","2013-12-09",null,{"$f":"VLOOKUP(C562,Feuil1!$A$1:$B$9999,2)","v":{"$error":"#N/A"}}]
["2013-12-10","2013-12-10",null,{"$f":"VLOOKUP(C563,Feuil1!$A$1:$B$9999,2)","v":{"$error":"#N/A"}}]
["2013-12-11","2013-12-11",null,{"$f":"VLOOKUP(C564,Feuil1!$A$1:$B$9999,2)","v":{"$error":"#N/A"}}]
["2013-12-12","2013-12-12",null,{"$f":"VLOOKUP(C565,Feuil1!$A$1:$B$9999,2)","v":{"$error":"#N/A"}}]
["2013-12-13","2013-12-13",null,{"$f":"VLOOKUP(C566,Feuil1!$A$1:$B$9999,2)","v":{"$error":"#N/A"}}]
["2013-12-14","2013-12-14",null,{"$f":"VLOOKUP(C567,Feuil1!$A$1:$B$9999,2)","v":{"$error":"#N/A"}}]
["2013-12-15","2013-12-15",null,{"$f":"VLOOKUP(C568,Feuil1!$A$1:$B$9999,2)","v":{"$error":"#N/A"}}]
["2013-12-16","2013-12-16",null,{"$f":"VLOOKUP(C569,Feuil1!$A$1:$B$9999,2)","v":{"$error":"#N/A"}}]
["2013-12-17","2013-12-17",null,{"$f":"VLOOKUP(C570,Feuil1!$A$1:$B$9999,2)","v":{"$error":"#N/A"}}]
["2013-12-18","2013-12-18",null,{"$f":"VLOOKUP(C571,Feuil1!$A$1:$B$9999,2)","v":{"$error":"#N/A"}}]
["2013-12-19","2013-12-19",null,{"$f":"VLOOKUP(C572,Feuil1!$A$1:$B$9999,2)","v":{"$error":"#N/A"}}]
["2013-12-20","2013-12-20",null,{"$f":"VLOOKUP(C573,Feuil1!$A$1:$B$9999,2)","v":{"$error":"#N/A"}}]
["2013-12-21","2013-12-21",null,{"$f":"VLOOKUP(C574,Feuil1!$A$1:$B$9999,2)","v":{"$error":"#N/A"}}]
["2013-12-22","2013-12-22",null,{"$f":"VLOOKUP(C575,Feuil1!$A$1:$B$9999,2)","v":{"$error":"#N/A"}}]
["2013-12-23","2013-12-23",null,{"$f":"VLOOKUP(C576,Feuil1!$A$1:$B$9999,2)","v":{"$error":"#N/A"}}]
["2013-12-24","2013-12-24",null,{"$f":"VLOOKUP(C577,Feuil1!$A$1:$B$9999,2)","v":{"$error":"#N/A"}}]
["2013-12-25","2013-12-25",null,{"$f":"VLOOKUP(C578,Feuil1!$A$1:$B$9999,2)","v":{"$error":"#N/A"}}]
["2013-12-26","2013-12-26",null,{"$f":"VLOOKUP(C579,Feuil1!$A$1:$B$9999,2)","v":{"$error":"#N/A"}}]
["2013-12-27","2013-12-27",null,{"$f":"VLOOKUP(C580,Feuil1!$A$1:$B$9999,2)","v":{"$error":"#N/A"}}]
["2013-12-28","2013-12-28",null,{"$f":"VLOOKUP(C581,Feuil1!$A$1:$B$9999,2)","v":{"$error":"#N/A"}}]
["2013-12-29","2013-12-29",null,{"$f":"VLOOKUP(C582,Feuil1!$A$1:$B$9999,2)","v":{"$error":"#N/A"}}]
["2013-12-30","2013-12-30",null,{"$f":"VLOOKUP(C583,Feuil1!$A$1:$B$9999,2)","v":{"$error":"#N/A"}}]
["2013-12-31","2013-12-31",null,{"$f":"VLOOKUP(C584,Feuil1!$A$1:$B$9999,2)","v":{"$error":"#N/A"}}]

{"sheet":"Heures chantier","index":4,"n_rows":13,"n_cols":7,"rows_kept":13,"cut":false,"hidden":false,"merged":[]}
["Choix du lieu","cl00431/1"]
["Feuille","date ","jour ","code","chantier","H. prestées","H. sup."]
["Ouvrier1","2013-01-02",{"$f":"B3","v":"2013-01-02"},"cl00431/1",{"$f":"VLOOKUP(D3,Feuil1!$A$1:$B$9999,2)","v":"CPH Ath"},9,9]
["Ouvrier1","2013-01-03","2013-01-03","cl00431/1",{"$f":"VLOOKUP(D4,Feuil1!$A$1:$B$9999,2)","v":"CPH Ath"},9,9]
["Ouvrier1","2013-01-04","2013-01-04","cl00431/1",{"$f":"VLOOKUP(D5,Feuil1!$A$1:$B$9999,2)","v":"CPH Ath"},9,9]
["Ouvrier1","2013-01-05","2013-01-05","cl00431/1",{"$f":"VLOOKUP(D6,Feuil1!$A$1:$B$9999,2)","v":"CPH Ath"},9,9]
["Ouvrier1","2013-01-11","2013-01-11","cl00431/1",{"$f":"VLOOKUP(D7,Feuil1!$A$1:$B$9999,2)","v":"CPH Ath"},7,0]
["Ouvrier2","2013-01-03","2013-01-03","cl00431/1",{"$f":"VLOOKUP(D8,Feuil1!$A$1:$B$9999,2)","v":"CPH Ath"},9,9]
["Ouvrier2","2013-01-04","2013-01-04","cl00431/1",{"$f":"VLOOKUP(D9,Feuil1!$A$1:$B$9999,2)","v":"CPH Ath"},9,9]
["Ouvrier2","2013-01-05","2013-01-05","cl00431/1",{"$f":"VLOOKUP(D10,Feuil1!$A$1:$B$9999,2)","v":"CPH Ath"},9,9]
["Ouvrier2",null,null,"cl00431/1","CPH Ath",7,7]
["Ouvrier3","2013-01-24",{"$f":"B12","v":"2013-01-24"},"cl00431/1",{"$f":"VLOOKUP(D12,Feuil1!$A$1:$B$9999,2)","v":"CPH Ath"},8,0]
["Ouvrier3","2013-01-25","2013-01-25","cl00431/1",{"$f":"VLOOKUP(D13,Feuil1!$A$1:$B$9999,2)","v":"CPH Ath"},8,0]