{"text_format":"1","workbook":"xlsx","n_sheets":5,"sheets":["Feuil1","Ouvrier1","Ouvrier2","Ouvrier3","Heures chantier"],"not_rendered":{"charts":0,"images":0,"macros":1,"external_links":0,"defined_names":0,"comments":0,"pivot_tables":0},"unopened":[],"bounds":{"document_bytes":16777216,"sheet_cells":100000,"rows_first":2000,"rows_last":500,"rows_between":2000,"halvings":0,"cell_chars":16384,"cell_head_chars":4096},"cells_cut":0,"cells_raw":0,"read":"whole","date_system":"1900"}

{"sheet":"Feuil1","index":0,"n_rows":1625,"n_cols":2,"rows_kept":1625,"cut":false,"hidden":false,"merged":[]}
["A","Absent"]
["C","Congé"]
["CL00001","Decaluwé"]
["CL00002","SUCRERIE COUPLET"]
["CL00003","Leclercq"]
["CL00004","SAINT BRICE"]
["CL00005","Draux"]
["CL00006","IMPACT CONCEPT"]
["CL00007","PORTAKABIN (Frank Vandermeersch)"]
["CL00008","LIXON"]
["CL00009","CLINIQUE NOTRE DAME"]
["CL00010","FAMECO"]
["CL00011","Theuninck"]
["CL00012","A.I.T. asbl"]
["CL00013","TURKOISE"]
["CL00014","YA.LI."]
["CL00015","Paul"]
["CL00016","Fouré"]
["CL00017","Moulard"]
["CL00018","Ledent"]
["CL00019","EDDY DEVOS CONSTRUCTION"]
["CL00020","Carette"]
["CL00021","GEO PINION"]
["CL00022","GUBIN - DEGRAVE"]
["CL00023","Berte"]
["CL00024","Bauduin"]
["CL00025","ICR GROUPE IMPRIMERIE"]
["CL00026","Spaneut"]
["CL00027","Mitchell"]
["CL00028","PROVINCE DE HAINAUT"]
["CL00029","IPALLE"]
["CL00031","F.G.T.B."]
["CL00032","MAISON DE LA SAINTE UNION"]
["CL00033","LESURE"]
["CL00034","Idéal Logis"]
["CL00035","Desmette"]
["CL00036","Fievet"]
["CL00037","WATTIAUX"]
["CL00038","Collège Notre-Dame de la Tombe"]
["CL00039","MUJEKA SARL"]
["CL00040","adminis. générale de l'infrastructure"]
["CL00041","Casterman"]
["CL00042","U.C.B. PHARMA SA"]
["CL00043","RECYHOC"]
["CL00044","Claus"]
["CL00045","Moumal"]
["CL00046","FREUDENBERG - BAUSYSTEME"]
["CL00047","fabrique d'eglise Saint Etienne"]
["CL00048","Lemoine"]
["CL00049","Bourgois - De Valensart"]
["CL00050","Belpeer"]
["CL00051","SPRLU HAND RESCUE"]
["CL00052","ECOLE DES FRERES"]
["CL00053","CORSICAR"]
["CL00054","OPTIQUE OLIVIER"]
["CL00055","DEMEIRE"]
["CL00056","CUBILOFT"]
["CL00057","Dubus"]
["CL00058","ETHIAS"]
["CL00059","Gobet"]
["CL00060","HOME SAINT JEAN"]
["CL00061","MORLIGHEM"]
["CL00062","HELEU"]
["CL00063","GUILLAUME"]
["CL00064","LOUIS Daniel"]
["CL00066","OPTIQUE OLIVIER"]
["CL00067","GALAPAGOS"]
["CL00068","Buys"]
["CL00069","MAGASIN BLONDEAU"]
["CL00070","Le Renouveau Saint-Joseph"]
["CL00071","Académie des Beaux-Arts"]
["CL00072","GOULEM"]
["CL00074","D'HONT Nicole"]
["CL00075","LEBLON"]
["CL00076","Fabrique d'Eglise St Quentin/St Jacques"]
["CL00077","BENELUX ASSIST"]
["CL00078","Pottiez Sylvie"]
["CL00079","Delneste Olivier"]
["CL00080","OTTEVAERE Thierry"]
["CL00081","Aquitaine"]
{"$rows_left_out":1546}
{"sheet":"Ouvrier1","index":1,"n_rows":585,"n_cols":6,"rows_kept":585,"cut":false,"hidden":false,"merged":[[0,4,0,5],[51,4,51,5],[101,4,101,5],[151,4,151,5],[201,4,201,5],[501,4,501,5],[551,4,551,5],[251,4,251,5],[301,4,301,5],[351,4,351,5],[401,4,401,5],[451,4,451,5]]}
["Ouvrier :","Ouvrier 1",null,null,"Janvier"]
[]
["date ","jour ","code","chantier","H. prestées","H. sup."]
["2013-01-01",{"$f":"A4","v":"2013-01-01"},"c",{"$f":"VLOOKUP(C4,Feuil1!$A$1:$B$9999,2)","v":"Congé"},0,0]
["2013-01-02","2013-01-02","cl00431/1",{"$f":"VLOOKUP(C5,Feuil1!$A$1:$B$9999,2)","v":"CPH Ath"},9,9]
["2013-01-03","2013-01-03","cl00431/1",{"$f":"VLOOKUP(C6,Feuil1!$A$1:$B$9999,2)","v":"CPH Ath"},9,9]
["2013-01-04","2013-01-04","cl00431/1",{"$f":"VLOOKUP(C7,Feuil1!$A$1:$B$9999,2)","v":"CPH Ath"},9,9]
["2013-01-05","2013-01-05","cl00431/1",{"$f":"VLOOKUP(C8,Feuil1!$A$1:$B$9999,2)","v":"CPH Ath"},9,9]
["2013-01-06","2013-01-06"]
["2013-01-07","2013-01-07","cl01289",{"$f":"VLOOKUP(C10,Feuil1!$A$1:$B$9999,2)","v":"Résidence Mean House"},8,0]
["2013-01-08","2013-01-08","cl01289",{"$f":"VLOOKUP(C11,Feuil1!$A$1:$B$9999,2)","v":"Résidence Mean House"},8,0]
["2013-01-09","2013-01-09","cl01289",{"$f":"VLOOKUP(C12,Feuil1!$A$1:$B$9999,2)","v":"Résidence Mean House"},8,0]
["2013-01-10","2013-01-10","cl01289",{"$f":"VLOOKUP(C13,Feuil1!$A$1:$B$9999,2)","v":"Résidence Mean House"},8,0]
["2013-01-11","2013-01-11","cl00431/1",{"$f":"VLOOKUP(C14,Feuil1!$A$1:$B$9999,2)","v":"CPH Ath"},7,0]
[null,null,"cl01289",{"$f":"VLOOKUP(C15,Feuil1!$A$1:$B$9999,2)","v":"Résidence Mean House"},1,0]
["2013-01-12","2013-01-12","cl00060",{"$f":"VLOOKUP(C16,Feuil1!$A$1:$B$9999,2)","v":"HOME SAINT JEAN"},8,8]
["2013-01-13","2013-01-13"]
["2013-01-14","2013-01-14","cl01289",{"$f":"VLOOKUP(C18,Feuil1!$A$1:$B$9999,2)","v":"Résidence Mean House"},8,0]
["2013-01-15","2013-01-15",null,"Absent",0,0]
["2013-01-16","2013-01-16","cl01289",{"$f":"VLOOKUP(C20,Feuil1!$A$1:$B$9999,2)","v":"Résidence Mean House"},8,0]
["2013-01-17","2013-01-17","cl01289",{"$f":"VLOOKUP(C21,Feuil1!$A$1:$B$9999,2)","v":"Résidence Mean House"},8,0]
["2013-01-18","2013-01-18","cl00319",{"$f":"VLOOKUP(C22,Feuil1!$A$1:$B$9999,2)","v":"Vandenbussche"},8,0]
["2013-01-19","2013-01-19","cl00319",{"$f":"VLOOKUP(C23,Feuil1!$A$1:$B$9999,2)","v":"Vandenbussche"},8,8]
["2013-01-20","2013-01-20"]
["2013-01-21","2013-01-21",null,"Absent",0,0]
["2013-01-22","2013-01-22",null,"Absent",0,0]
["2013-01-23","2013-01-23",null,"Absent",0,0]
["2013-01-24","2013-01-24",null,"Absent",0,0]
["2013-01-25","2013-01-25",null,"Absent",0,0]
["2013-01-26","2013-01-26",null,null,0,0]
["2013-01-27","2013-01-27"]
["2013-01-28","2013-01-28","cl00431",{"$f":"VLOOKUP(C32,Feuil1!$A$1:$B$9999,2)","v":"CPH Tournai"},8,0]
["2013-01-29","2013-01-29","cl00431",{"$f":"VLOOKUP(C33,Feuil1!$A$1:$B$9999,2)","v":"CPH Tournai"},8,0]
["2013-01-30","2013-01-30","cl00431",{"$f":"VLOOKUP(C34,Feuil1!$A$1:$B$9999,2)","v":"CPH Tournai"},8,0]
["2013-01-31","2013-01-31","cl00431",{"$f":"VLOOKUP(C35,Feuil1!$A$1:$B$9999,2)","v":"CPH Tournai"},8,0]
[]
[]
[]
[]
[]
[]
[]
[]
[]
[]
[]
[]
[]
[]
[]
[]
["Ouvrier :","Ouvrier 1",null,null,"Février"]
[]
["date ","jour ","code","chantier","H. prestées","H. sup."]
["2013-02-01",{"$f":"A55","v":"2013-02-01"},null,{"$f":"VLOOKUP(C55,Feuil1!$A$1:$B$9999,2)","v":{"$error":"#N/A"}}]
["2013-02-02",{"$f":"A56","v":"2013-02-02"},null,{"$f":"VLOOKUP(C56,Feuil1!$A$1:$B$9999,2)","v":{"$error":"#N/A"}}]
["2013-02-03","2013-02-03",null,{"$f":"VLOOKUP(C57,Feuil1!$A$1:$B$9999,2)","v":{"$error":"#N/A"}}]
["2013-02-04","2013-02-04",null,{"$f":"VLOOKUP(C58,Feuil1!$A$1:$B$9999,2)","v":{"$error":"#N/A"}}]
["2013-02-05","2013-02-05",null,{"$f":"VLOOKUP(C59,Feuil1!$A$1:$B$9999,2)","v":{"$error":"#N/A"}}]
["2013-02-06","2013-02-06",null,{"$f":"VLOOKUP(C60,Feuil1!$A$1:$B$9999,2)","v":{"$error":"#N/A"}}]
["2013-02-07","2013-02-07",null,{"$f":"VLOOKUP(C61,Feuil1!$A$1:$B$9999,2)","v":{"$error":"#N/A"}}]
["2013-02-08","2013-02-08",null,{"$f":"VLOOKUP(C62,Feuil1!$A$1:$B$9999,2)","v":{"$error":"#N/A"}}]
["2013-02-09","2013-02-09",null,{"$f":"VLOOKUP(C63,Feuil1!$A$1:$B$9999,2)","v":{"$error":"#N/A"}}]
["2013-02-10","2013-02-10",null,{"$f":"VLOOKUP(C64,Feuil1!$A$1:$B$9999,2)","v":{"$error":"#N/A"}}]
["2013-02-11","2013-02-11",null,{"$f":"VLOOKUP(C65,Feuil1!$A$1:$B$9999,2)","v":{"$error":"#N/A"}}]
["2013-02-12","2013-02-12",null,{"$f":"VLOOKUP(C66,Feuil1!$A$1:$B$9999,2)","v":{"$error":"#N/A"}}]
["2013-02-13","2013-02-13",null,{"$f":"VLOOKUP(C67,Feuil1!$A$1:$B$9999,2)","v":{"$error":"#N/A"}}]
["2013-02-14","2013-02-14",null,{"$f":"VLOOKUP(C68,Feuil1!$A$1:$B$9999,2)","v":{"$error":"#N/A"}}]
["2013-02-15","2013-02-15",null,{"$f":"VLOOKUP(C69,Feuil1!$A$1:$B$9999,2)","v":{"$error":"#N/A"}}]
["2013-02-16","2013-02-16",null,{"$f":"VLOOKUP(C70,Feuil1!$A$1:$B$9999,2)","v":{"$error":"#N/A"}}]
["2013-02-17","2013-02-17",null,{"$f":"VLOOKUP(C71,Feuil1!$A$1:$B$9999,2)","v":{"$error":"#N/A"}}]
["2013-02-18","2013-02-18",null,{"$f":"VLOOKUP(C72,Feuil1!$A$1:$B$9999,2)","v":{"$error":"#N/A"}}]
["2013-02-19","2013-02-19",null,{"$f":"VLOOKUP(C73,Feuil1!$A$1:$B$9999,2)","v":{"$error":"#N/A"}}]
["2013-02-20","2013-02-20",null,{"$f":"VLOOKUP(C74,Feuil1!$A$1:$B$9999,2)","v":{"$error":"#N/A"}}]
["2013-02-21","2013-02-21",null,{"$f":"VLOOKUP(C75,Feuil1!$A$1:$B$9999,2)","v":{"$error":"#N/A"}}]
["2013-02-22","2013-02-22",null,{"$f":"VLOOKUP(C76,Feuil1!$A$1:$B$9999,2)","v":{"$error":"#N/A"}}]
["2013-02-23","2013-02-23",null,{"$f":"VLOOKUP(C77,Feuil1!$A$1:$B$9999,2)","v":{"$error":"#N/A"}}]
["2013-02-24","2013-02-24",null,{"$f":"VLOOKUP(C78,Feuil1!$A$1:$B$9999,2)","v":{"$error":"#N/A"}}]
["2013-02-25","2013-02-25",null,{"$f":"VLOOKUP(C79,Feuil1!$A$1:$B$9999,2)","v":{"$error":"#N/A"}}]
["2013-02-26","2013-02-26",null,{"$f":"VLOOKUP(C80,Feuil1!$A$1:$B$9999,2)","v":{"$error":"#N/A"}}]
{"$rows_left_out":506}
{"sheet":"Ouvrier2","index":2,"n_rows":586,"n_cols":6,"rows_kept":586,"cut":false,"hidden":false,"merged":[[0,4,0,5],[52,4,52,5],[102,4,102,5],[152,4,152,5],[202,4,202,5],[502,4,502,5],[552,4,552,5],[252,4,252,5],[302,4,302,5],[352,4,352,5],[402,4,402,5],[452,4,452,5]]}
["Ouvrier :","Ouvrier 2",null,null,"Janvier"]
[]
["date ","jour ","code","chantier","H. prestées","H. sup."]
["2013-01-01",{"$f":"A4","v":"2013-01-01"},"c",{"$f":"VLOOKUP(C4,Feuil1!$A$1:$B$9999,2)","v":"Congé"},0,0]
["2013-01-02","2013-01-02","A",{"$f":"VLOOKUP(C5,Feuil1!$A$1:$B$9999,2)","v":"Absent"},0,0]
["2013-01-03","2013-01-03","cl00431/1",{"$f":"VLOOKUP(C6,Feuil1!$A$1:$B$9999,2)","v":"CPH Ath"},9,9]
["2013-01-04","2013-01-04","cl00431/1",{"$f":"VLOOKUP(C7,Feuil1!$A$1:$B$9999,2)","v":"CPH Ath"},9,9]
["2013-01-05","2013-01-05","cl00431/1",{"$f":"VLOOKUP(C8,Feuil1!$A$1:$B$9999,2)","v":"CPH Ath"},9,9]
["2013-01-06","2013-01-06"]
["2013-01-07","2013-01-07","cl01289",{"$f":"VLOOKUP(C10,Feuil1!$A$1:$B$9999,2)","v":"Résidence Mean House"},8,8]
["2013-01-08","2013-01-08","cl01289",{"$f":"VLOOKUP(C11,Feuil1!$A$1:$B$9999,2)","v":"Résidence Mean House"},8,8]
["2013-01-09","2013-01-09","cl01289",{"$f":"VLOOKUP(C12,Feuil1!$A$1:$B$9999,2)","v":"Résidence Mean House"},8,8]
["2013-01-10","2013-01-10","cl01289",{"$f":"VLOOKUP(C13,Feuil1!$A$1:$B$9999,2)","v":"Résidence Mean House"},8,8]
["2013-01-11","2013-01-11","cl01289",{"$f":"VLOOKUP(C14,Feuil1!$A$1:$B$9999,2)","v":"Résidence Mean House"},1,1]
[null,null,"cl00431/1","CPH Ath",7,7]
["2013-01-12","2013-01-12"]
["2013-01-13","2013-01-13"]
["2013-01-14","2013-01-14","cl01289",{"$f":"VLOOKUP(C18,Feuil1!$A$1:$B$9999,2)","v":"Résidence Mean House"},8,8]
["2013-01-15","2013-01-15","cl01289",{"$f":"VLOOKUP(C19,Feuil1!$A$1:$B$9999,2)","v":"Résidence Mean House"},8,8]
["2013-01-16","2013-01-16","cl01289",{"$f":"VLOOKUP(C20,Feuil1!$A$1:$B$9999,2)","v":"Résidence Mean House"},8,8]
["2013-01-17","2013-01-17","cl01289",{"$f":"VLOOKUP(C21,Feuil1!$A$1:$B$9999,2)","v":"Résidence Mean House"},8,8]
["2013-01-18","2013-01-18","cl00319",{"$f":"VLOOKUP(C22,Feuil1!$A$1:$B$9999,2)","v":"Vandenbussche"},8,8]
["2013-01-19","2013-01-19","cl00319",{"$f":"VLOOKUP(C23,Feuil1!$A$1:$B$9999,2)","v":"Vandenbussche"},8,8]
["2013-01-20","2013-01-20"]
["2013-01-21","2013-01-21","a",{"$f":"VLOOKUP(C25,Feuil1!$A$1:$B$9999,2)","v":"Absent"},0,0]
["2013-01-22","2013-01-22","cl00060",{"$f":"VLOOKUP(C26,Feuil1!$A$1:$B$9999,2)","v":"HOME SAINT JEAN"},8,8]
["2013-01-23","2013-01-23","cl01603/1",{"$f":"VLOOKUP(C27,Feuil1!$A$1:$B$9999,2)","v":"Henrard-Roselaine Proxi Delhaize"},8,8]
["2013-01-24","2013-01-24","cl00565",{"$f":"VLOOKUP(C28,Feuil1!$A$1:$B$9999,2)","v":"Delbart Frédéric"},8,8]
["2013-01-25","2013-01-25","cl00060",{"$f":"VLOOKUP(C29,Feuil1!$A$1:$B$9999,2)","v":"HOME SAINT JEAN"},3,3]
[null,null,"cl01503",{"$f":"VLOOKUP(C30,Feuil1!$A$1:$B$9999,2)","v":"Deltenre"},5,5]
["2013-01-26","2013-01-26",null,null,0,0]
["2013-01-27","2013-01-27"]
["2013-01-28","2013-01-28","cl00431",{"$f":"VLOOKUP(C33,Feuil1!$A$1:$B$9999,2)","v":"CPH Tournai"},8,8]
["2013-01-29","2013-01-29","cl00431",{"$f":"VLOOKUP(C34,Feuil1!$A$1:$B$9999,2)","v":"CPH Tournai"},8,8]
["2013-01-30","2013-01-30","cl00431",{"$f":"VLOOKUP(C35,Feuil1!$A$1:$B$9999,2)","v":"CPH Tournai"},8,8]
["2013-01-31","2013-01-31","cl00431",{"$f":"VLOOKUP(C36,Feuil1!$A$1:$B$9999,2)","v":"CPH Tournai"},8,8]
[]
[]
[]
[]
[]
[]
[]
[]
[]
[]
[]
[]
[]
[]
[]
[]
["Ouvrier :","Ouvrier 1",null,null,"Février"]
[]
["date ","jour ","code","chantier","H. prestées","H. sup."]
["2013-02-01",{"$f":"A56","v":"2013-02-01"},null,{"$f":"VLOOKUP(C56,Feuil1!$A$1:$B$9999,2)","v":{"$error":"#N/A"}}]
["2013-02-02",{"$f":"A57","v":"2013-02-02"},null,{"$f":"VLOOKUP(C57,Feuil1!$A$1:$B$9999,2)","v":{"$error":"#N/A"}}]
["2013-02-03","2013-02-03",null,{"$f":"VLOOKUP(C58,Feuil1!$A$1:$B$9999,2)","v":{"$error":"#N/A"}}]
["2013-02-04","2013-02-04",null,{"$f":"VLOOKUP(C59,Feuil1!$A$1:$B$9999,2)","v":{"$error":"#N/A"}}]
["2013-02-05","2013-02-05",null,{"$f":"VLOOKUP(C60,Feuil1!$A$1:$B$9999,2)","v":{"$error":"#N/A"}}]
["2013-02-06","2013-02-06",null,{"$f":"VLOOKUP(C61,Feuil1!$A$1:$B$9999,2)","v":{"$error":"#N/A"}}]
["2013-02-07","2013-02-07",null,{"$f":"VLOOKUP(C62,Feuil1!$A$1:$B$9999,2)","v":{"$error":"#N/A"}}]
["2013-02-08","2013-02-08",null,{"$f":"VLOOKUP(C63,Feuil1!$A$1:$B$9999,2)","v":{"$error":"#N/A"}}]
["2013-02-09","2013-02-09",null,{"$f":"VLOOKUP(C64,Feuil1!$A$1:$B$9999,2)","v":{"$error":"#N/A"}}]
["2013-02-10","2013-02-10",null,{"$f":"VLOOKUP(C65,Feuil1!$A$1:$B$9999,2)","v":{"$error":"#N/A"}}]
["2013-02-11","2013-02-11",null,{"$f":"VLOOKUP(C66,Feuil1!$A$1:$B$9999,2)","v":{"$error":"#N/A"}}]
["2013-02-12","2013-02-12",null,{"$f":"VLOOKUP(C67,Feuil1!$A$1:$B$9999,2)","v":{"$error":"#N/A"}}]
["2013-02-13","2013-02-13",null,{"$f":"VLOOKUP(C68,Feuil1!$A$1:$B$9999,2)","v":{"$error":"#N/A"}}]
["2013-02-14","2013-02-14",null,{"$f":"VLOOKUP(C69,Feuil1!$A$1:$B$9999,2)","v":{"$error":"#N/A"}}]
["2013-02-15","2013-02-15",null,{"$f":"VLOOKUP(C70,Feuil1!$A$1:$B$9999,2)","v":{"$error":"#N/A"}}]
["2013-02-16","2013-02-16",null,{"$f":"VLOOKUP(C71,Feuil1!$A$1:$B$9999,2)","v":{"$error":"#N/A"}}]
["2013-02-17","2013-02-17",null,{"$f":"VLOOKUP(C72,Feuil1!$A$1:$B$9999,2)","v":{"$error":"#N/A"}}]
["2013-02-18","2013-02-18",null,{"$f":"VLOOKUP(C73,Feuil1!$A$1:$B$9999,2)","v":{"$error":"#N/A"}}]
["2013-02-19","2013-02-19",null,{"$f":"VLOOKUP(C74,Feuil1!$A$1:$B$9999,2)","v":{"$error":"#N/A"}}]
["2013-02-20","2013-02-20",null,{"$f":"VLOOKUP(C75,Feuil1!$A$1:$B$9999,2)","v":{"$error":"#N/A"}}]
["2013-02-21","2013-02-21",null,{"$f":"VLOOKUP(C76,Feuil1!$A$1:$B$9999,2)","v":{"$error":"#N/A"}}]
["2013-02-22","2013-02-22",null,{"$f":"VLOOKUP(C77,Feuil1!$A$1:$B$9999,2)","v":{"$error":"#N/A"}}]
["2013-02-23","2013-02-23",null,{"$f":"VLOOKUP(C78,Feuil1!$A$1:$B$9999,2)","v":{"$error":"#N/A"}}]
["2013-02-24","2013-02-24",null,{"$f":"VLOOKUP(C79,Feuil1!$A$1:$B$9999,2)","v":{"$error":"#N/A"}}]
["2013-02-25","2013-02-25",null,{"$f":"VLOOKUP(C80,Feuil1!$A$1:$B$9999,2)","v":{"$error":"#N/A"}}]
{"$rows_left_out":507}
{"sheet":"Ouvrier3","index":3,"n_rows":584,"n_cols":6,"rows_kept":584,"cut":false,"hidden":false,"merged":[[0,4,0,5],[50,4,50,5],[100,4,100,5],[150,4,150,5],[200,4,200,5],[500,4,500,5],[550,4,550,5],[250,4,250,5],[300,4,300,5],[350,4,350,5],[400,4,400,5],[450,4,450,5]]}
["Ouvrier :","Ouvrier 2",null,null,"Janvier"]
[]
["date ","jour ","code","chantier","H. prestées","H. sup."]
["2013-01-01",{"$f":"A4","v":"2013-01-01"},"c",{"$f":"VLOOKUP(C4,Feuil1!$A$1:$B$9999,2)","v":"Congé"},0,0]
["2013-01-02","2013-01-02","a",{"$f":"VLOOKUP(C5,Feuil1!$A$1:$B$9999,2)","v":"Absent"},0,0]
["2013-01-03","2013-01-03","a",{"$f":"VLOOKUP(C6,Feuil1!$A$1:$B$9999,2)","v":"Absent"},0,0]
["2013-01-04","2013-01-04","a",{"$f":"VLOOKUP(C7,Feuil1!$A$1:$B$9999,2)","v":"Absent"},0,0]
["2013-01-05","2013-01-05",null,null,0,0]
["2013-01-06","2013-01-06"]
["2013-01-07","2013-01-07","Cl00431",{"$f":"VLOOKUP(C10,Feuil1!$A$1:$B$9999,2)","v":"CPH Tournai"},8,0]
["2013-01-08","2013-01-08","cl01289",{"$f":"VLOOKUP(C11,Feuil1!$A$1:$B$9999,2)","v":"Résidence Mean House"},8,0]
["2013-01-09","2013-01-09","cl01289",{"$f":"VLOOKUP(C12,Feuil1!$A$1:$B$9999,2)","v":"Résidence Mean House"},8,0]
["2013-01-10","2013-01-10","cl01289",{"$f":"VLOOKUP(C13,Feuil1!$A$1:$B$9999,2)","v":"Résidence Mean House"},8,0]
["2013-01-11","2013-01-11","Cl01603/1",{"$f":"VLOOKUP(C14,Feuil1!$A$1:$B$9999,2)","v":"Henrard-Roselaine Proxi Delhaize"},8,0]
["2013-01-12","2013-01-12",null,null,0,0]
["2013-01-13","2013-01-13"]
["2013-01-14","2013-01-14","cl00060",{"$f":"VLOOKUP(C17,Feuil1!$A$1:$B$9999,2)","v":"HOME SAINT JEAN"},8,0]
["2013-01-15","2013-01-15","cl00060",{"$f":"VLOOKUP(C18,Feuil1!$A$1:$B$9999,2)","v":"HOME SAINT JEAN"},8,0]
["2013-01-16","2013-01-16","cl00060",{"$f":"VLOOKUP(C19,Feuil1!$A$1:$B$9999,2)","v":"HOME SAINT JEAN"},8,0]
["2013-01-17","2013-01-17","cl01289",{"$f":"VLOOKUP(C20,Feuil1!$A$1:$B$9999,2)","v":"Résidence Mean House"},8,0]
["2013-01-18","2013-01-18","a",{"$f":"VLOOKUP(C21,Feuil1!$A$1:$B$9999,2)","v":"Absent"},0,0]
["2013-01-19","2013-01-19",null,null,0,0]
["2013-01-20","2013-01-20"]
["2013-01-21","2013-01-21","cl00431",{"$f":"VLOOKUP(C24,Feuil1!$A$1:$B$9999,2)","v":"CPH Tournai"},8,0]
["2013-01-22","2013-01-22","cl00431",{"$f":"VLOOKUP(C25,Feuil1!$A$1:$B$9999,2)","v":"CPH Tournai"},8,0]
["2013-01-23","2013-01-23","cl00431",{"$f":"VLOOKUP(C26,Feuil1!$A$1:$B$9999,2)","v":"CPH Tournai"},8,0]
["2013-01-24","2013-01-24","cl00431/1",{"$f":"VLOOKUP(C27,Feuil1!$A$1:$B$9999,2)","v":"CPH Ath"},8,0]
["2013-01-25","2013-01-25","cl00431/1",{"$f":"VLOOKUP(C28,Feuil1!$A$1:$B$9999,2)","v":"CPH Ath"},8,0]
["2013-01-26","2013-01-26",null,null,0,0]
["2013-01-27","2013-01-27"]
["2013-01-28","2013-01-28","m",{"$f":"VLOOKUP(C31,Feuil1!$A$1:$B$9999,2)","v":"Malade"},0,0]
["2013-01-29","2013-01-29","m",{"$f":"VLOOKUP(C32,Feuil1!$A$1:$B$9999,2)","v":"Malade"},0,0]
["2013-01-30","2013-01-30","m",{"$f":"VLOOKUP(C33,Feuil1!$A$1:$B$9999,2)","v":"Malade"},0,0]
["2013-01-31","2013-01-31","m",{"$f":"VLOOKUP(C34,Feuil1!$A$1:$B$9999,2)","v":"Malade"},0,0]
[]
[]
[]
[]
[]
[]
[]
[]
[]
[]
[]
[]
[]
[]
[]
[]
["Ouvrier :","Ouvrier 1",null,null,"Février"]
[]
["date ","jour ","code","chantier","H. prestées","H. sup."]
["2013-02-01",{"$f":"A54","v":"2013-02-01"},null,{"$f":"VLOOKUP(C54,Feuil1!$A$1:$B$9999,2)","v":{"$error":"#N/A"}}]
["2013-02-02",{"$f":"A55","v":"2013-02-02"},null,{"$f":"VLOOKUP(C55,Feuil1!$A$1:$B$9999,2)","v":{"$error":"#N/A"}}]
["2013-02-03","2013-02-03",null,{"$f":"VLOOKUP(C56,Feuil1!$A$1:$B$9999,2)","v":{"$error":"#N/A"}}]
["2013-02-04","2013-02-04",null,{"$f":"VLOOKUP(C57,Feuil1!$A$1:$B$9999,2)","v":{"$error":"#N/A"}}]
["2013-02-05","2013-02-05",null,{"$f":"VLOOKUP(C58,Feuil1!$A$1:$B$9999,2)","v":{"$error":"#N/A"}}]
["2013-02-06","2013-02-06",null,{"$f":"VLOOKUP(C59,Feuil1!$A$1:$B$9999,2)","v":{"$error":"#N/A"}}]
["2013-02-07","2013-02-07",null,{"$f":"VLOOKUP(C60,Feuil1!$A$1:$B$9999,2)","v":{"$error":"#N/A"}}]
["2013-02-08","2013-02-08",null,{"$f":"VLOOKUP(C61,Feuil1!$A$1:$B$9999,2)","v":{"$error":"#N/A"}}]
["2013-02-09","2013-02-09",null,{"$f":"VLOOKUP(C62,Feuil1!$A$1:$B$9999,2)","v":{"$error":"#N/A"}}]
["2013-02-10","2013-02-10",null,{"$f":"VLOOKUP(C63,Feuil1!$A$1:$B$9999,2)","v":{"$error":"#N/A"}}]
["2013-02-11","2013-02-11",null,{"$f":"VLOOKUP(C64,Feuil1!$A$1:$B$9999,2)","v":{"$error":"#N/A"}}]
["2013-02-12","2013-02-12",null,{"$f":"VLOOKUP(C65,Feuil1!$A$1:$B$9999,2)","v":{"$error":"#N/A"}}]
["2013-02-13","2013-02-13",null,{"$f":"VLOOKUP(C66,Feuil1!$A$1:$B$9999,2)","v":{"$error":"#N/A"}}]
["2013-02-14","2013-02-14",null,{"$f":"VLOOKUP(C67,Feuil1!$A$1:$B$9999,2)","v":{"$error":"#N/A"}}]
["2013-02-15","2013-02-15",null,{"$f":"VLOOKUP(C68,Feuil1!$A$1:$B$9999,2)","v":{"$error":"#N/A"}}]
["2013-02-16","2013-02-16",null,{"$f":"VLOOKUP(C69,Feuil1!$A$1:$B$9999,2)","v":{"$error":"#N/A"}}]
["2013-02-17","2013-02-17",null,{"$f":"VLOOKUP(C70,Feuil1!$A$1:$B$9999,2)","v":{"$error":"#N/A"}}]
["2013-02-18","2013-02-18",null,{"$f":"VLOOKUP(C71,Feuil1!$A$1:$B$9999,2)","v":{"$error":"#N/A"}}]
["2013-02-19","2013-02-19",null,{"$f":"VLOOKUP(C72,Feuil1!$A$1:$B$9999,2)","v":{"$error":"#N/A"}}]
["2013-02-20","2013-02-20",null,{"$f":"VLOOKUP(C73,Feuil1!$A$1:$B$9999,2)","v":{"$error":"#N/A"}}]
["2013-02-21","2013-02-21",null,{"$f":"VLOOKUP(C74,Feuil1!$A$1:$B$9999,2)","v":{"$error":"#N/A"}}]
["2013-02-22","2013-02-22",null,{"$f":"VLOOKUP(C75,Feuil1!$A$1:$B$9999,2)","v":{"$error":"#N/A"}}]
["2013-02-23","2013-02-23",null,{"$f":"VLOOKUP(C76,Feuil1!$A$1:$B$9999,2)","v":{"$error":"#N/A"}}]
["2013-02-24","2013-02-24",null,{"$f":"VLOOKUP(C77,Feuil1!$A$1:$B$9999,2)","v":{"$error":"#N/A"}}]
["2013-02-25","2013-02-25",null,{"$f":"VLOOKUP(C78,Feuil1!$A$1:$B$9999,2)","v":{"$error":"#N/A"}}]
["2013-02-26","2013-02-26",null,{"$f":"VLOOKUP(C79,Feuil1!$A$1:$B$9999,2)","v":{"$error":"#N/A"}}]
["2013-02-27","2013-02-27",null,{"$f":"VLOOKUP(C80,Feuil1!$A$1:$B$9999,2)","v":{"$error":"#N/A"}}]
{"$rows_left_out":505}
{"sheet":"Heures chantier","index":4,"n_rows":13,"n_cols":7,"rows_kept":13,"cut":false,"hidden":false,"merged":[]}
["Choix du lieu","cl00431/1"]
["Feuille","date ","jour ","code","chantier","H. prestées","H. sup."]
["Ouvrier1","2013-01-02",{"$f":"B3","v":"2013-01-02"},"cl00431/1",{"$f":"VLOOKUP(D3,Feuil1!$A$1:$B$9999,2)","v":"CPH Ath"},9,9]
["Ouvrier1","2013-01-03","2013-01-03","cl00431/1",{"$f":"VLOOKUP(D4,Feuil1!$A$1:$B$9999,2)","v":"CPH Ath"},9,9]
["Ouvrier1","2013-01-04","2013-01-04","cl00431/1",{"$f":"VLOOKUP(D5,Feuil1!$A$1:$B$9999,2)","v":"CPH Ath"},9,9]
["Ouvrier1","2013-01-05","2013-01-05","cl00431/1",{"$f":"VLOOKUP(D6,Feuil1!$A$1:$B$9999,2)","v":"CPH Ath"},9,9]
["Ouvrier1","2013-01-11","2013-01-11","cl00431/1",{"$f":"VLOOKUP(D7,Feuil1!$A$1:$B$9999,2)","v":"CPH Ath"},7,0]
["Ouvrier2","2013-01-03","2013-01-03","cl00431/1",{"$f":"VLOOKUP(D8,Feuil1!$A$1:$B$9999,2)","v":"CPH Ath"},9,9]
["Ouvrier2","2013-01-04","2013-01-04","cl00431/1",{"$f":"VLOOKUP(D9,Feuil1!$A$1:$B$9999,2)","v":"CPH Ath"},9,9]
["Ouvrier2","2013-01-05","2013-01-05","cl00431/1",{"$f":"VLOOKUP(D10,Feuil1!$A$1:$B$9999,2)","v":"CPH Ath"},9,9]
["Ouvrier2",null,null,"cl00431/1","CPH Ath",7,7]
["Ouvrier3","2013-01-24",{"$f":"B12","v":"2013-01-24"},"cl00431/1",{"$f":"VLOOKUP(D12,Feuil1!$A$1:$B$9999,2)","v":"CPH Ath"},8,0]
["Ouvrier3","2013-01-25","2013-01-25","cl00431/1",{"$f":"VLOOKUP(D13,Feuil1!$A$1:$B$9999,2)","v":"CPH Ath"},8,0]