{"text_format":"1","workbook":"xlsx","n_sheets":2,"sheets":["Feuil2","Feuil1"],"not_rendered":{"charts":0,"images":0,"macros":0,"external_links":0,"defined_names":0,"comments":0,"pivot_tables":0},"unopened":[],"bounds":{"document_bytes":16777216,"sheet_cells":100000,"rows_first":2000,"rows_last":500,"rows_between":2000,"halvings":0,"cell_chars":16384,"cell_head_chars":4096},"cells_cut":0,"cells_raw":0,"read":"whole","date_system":"1900"}

{"sheet":"Feuil2","index":0,"n_rows":2,"n_cols":13,"rows_kept":2,"cut":false,"hidden":false,"merged":[]}
["2012-12-31",{"$f":"EOMONTH(A1,1)","v":"2013-01-31"},{"$f":"EOMONTH(B1,1)","v":"2013-02-28"},"2013-03-31","2013-04-30","2013-05-31","2013-06-30","2013-07-31","2013-08-31","2013-09-30","2013-10-31","2013-11-30","2013-12-31"]
[3200,4000,1250,400]

{"sheet":"Feuil1","index":1,"n_rows":19,"n_cols":6,"rows_kept":19,"cut":false,"hidden":false,"merged":[]}
[]
[]
[null,null,null,"recherche valeur"]
[null,null,"DATE"]
[]
[null,null,"2013-01-28",{"$f":"IF(COUNTIF(Feuil2!$A$1:$M$1,Feuil1!C6),ROW()-5,\"\")","v":""}]
[null,null,"2013-01-29",{"$f":"IF(COUNTIF(Feuil2!$A$1:$M$1,Feuil1!C7),ROW()-5,\"\")","v":""}]
[null,null,"2013-01-30",{"$f":"IF(COUNTIF(Feuil2!$A$1:$M$1,Feuil1!C8),ROW()-5,\"\")","v":""}]
[null,null,"2013-01-31",{"$f":"IF(COUNTIF(Feuil2!$A$1:$M$1,Feuil1!C9),ROW()-5,\"\")","v":4}]
[null,null,"2013-02-01",{"$f":"IF(COUNTIF(Feuil2!$A$1:$M$1,Feuil1!C10),ROW()-5,\"\")","v":""}]
[null,null,null,{"$f":"IF(COUNTIF(Feuil2!$A$1:$M$1,Feuil1!C11),ROW()-5,\"\")","v":""}]
[null,null,null,{"$f":"IF(COUNTIF(Feuil2!$A$1:$M$1,Feuil1!C12),ROW()-5,\"\")","v":""}]
[null,null,null,{"$f":"IF(COUNTIF(Feuil2!$A$1:$M$1,Feuil1!C13),ROW()-5,\"\")","v":""}]
[null,null,null,{"$f":"IF(COUNTIF(Feuil2!$A$1:$M$1,Feuil1!C14),ROW()-5,\"\")","v":""},{"$f":"INDEX(Feuil2!A2:M2,1,MAX(D:D))","v":400},"< Résultat ici"]
[null,null,null,{"$f":"IF(COUNTIF(Feuil2!$A$1:$M$1,Feuil1!C15),ROW()-5,\"\")","v":""}]
[null,null,null,{"$f":"IF(COUNTIF(Feuil2!$A$1:$M$1,Feuil1!C16),ROW()-5,\"\")","v":""}]
[null,null,null,{"$f":"IF(COUNTIF(Feuil2!$A$1:$M$1,Feuil1!C17),ROW()-5,\"\")","v":""}]
[null,null,null,{"$f":"IF(COUNTIF(Feuil2!$A$1:$M$1,Feuil1!C18),ROW()-5,\"\")","v":""}]
[null,null,null,{"$f":"IF(COUNTIF(Feuil2!$A$1:$M$1,Feuil1!C19),ROW()-5,\"\")","v":""}]