{"text_format":"1","workbook":"xlsx","n_sheets":2,"sheets":["F_1","F_2"],"not_rendered":{"charts":0,"images":0,"macros":0,"external_links":0,"defined_names":0,"comments":0,"pivot_tables":0},"unopened":[],"bounds":{"document_bytes":16777216,"sheet_cells":100000,"rows_first":2000,"rows_last":500,"rows_between":2000,"halvings":0,"cell_chars":16384,"cell_head_chars":4096},"cells_cut":0,"cells_raw":0,"read":"whole","date_system":"1900"}

{"sheet":"F_1","index":0,"n_rows":5,"n_cols":9,"rows_kept":5,"cut":false,"hidden":false,"merged":[]}
["Paris","Lyon","Marseille","Bordeaux","Rennes","Nantes","Calais","Vannes","Biarritz"]
[20000,18105,20002,54555,null,41317,41318,null,41320]
[56000,54301,18110,18115,18120,18125,18130,18135,18140]
[41312,41313,41314,41315,20004,20005,20006,41319,20008]
[18100,20001,54532,20003,41316,null,null,20007]

{"sheet":"F_2","index":1,"n_rows":20,"n_cols":3,"rows_kept":20,"cut":false,"hidden":false,"merged":[]}
["N°",null,"Utilisable dans les zones jaunes"]
[41316,{"$f":"IF(A2=\"\",\"\",INDEX(F_1!$A$1:$Z$1,,SUMPRODUCT((F_1!$A$2:$Z$20=A2)*(COLUMN(F_1!$A$1:$Z$1)))))","v":"Rennes"}]
[54532,{"$f":"IF(A3=\"\",\"\",INDEX(F_1!$A$1:$Z$1,,SUMPRODUCT((F_1!$A$2:$Z$20=A3)*(COLUMN(F_1!$A$1:$Z$1)))))","v":"Marseille"}]
[20005,{"$f":"IF(A4=\"\",\"\",INDEX(F_1!$A$1:$Z$1,,SUMPRODUCT((F_1!$A$2:$Z$20=A4)*(COLUMN(F_1!$A$1:$Z$1)))))","v":"Nantes"}]
[41319,{"$f":"IF(A5=\"\",\"\",INDEX(F_1!$A$1:$Z$1,,SUMPRODUCT((F_1!$A$2:$Z$20=A5)*(COLUMN(F_1!$A$1:$Z$1)))))","v":"Vannes"}]
[20008,{"$f":"IF(A6=\"\",\"\",INDEX(F_1!$A$1:$Z$1,,SUMPRODUCT((F_1!$A$2:$Z$20=A6)*(COLUMN(F_1!$A$1:$Z$1)))))","v":"Biarritz"}]
[null,{"$f":"IF(A7=\"\",\"\",INDEX(F_1!$A$1:$Z$1,,SUMPRODUCT((F_1!$A$2:$Z$20=A7)*(COLUMN(F_1!$A$1:$Z$1)))))","v":""}]
[null,{"$f":"IF(A8=\"\",\"\",INDEX(F_1!$A$1:$Z$1,,SUMPRODUCT((F_1!$A$2:$Z$20=A8)*(COLUMN(F_1!$A$1:$Z$1)))))","v":""}]
[null,{"$f":"IF(A9=\"\",\"\",INDEX(F_1!$A$1:$Z$1,,SUMPRODUCT((F_1!$A$2:$Z$20=A9)*(COLUMN(F_1!$A$1:$Z$1)))))","v":""}]
[null,{"$f":"IF(A10=\"\",\"\",INDEX(F_1!$A$1:$Z$1,,SUMPRODUCT((F_1!$A$2:$Z$20=A10)*(COLUMN(F_1!$A$1:$Z$1)))))","v":""}]
[null,{"$f":"IF(A11=\"\",\"\",INDEX(F_1!$A$1:$Z$1,,SUMPRODUCT((F_1!$A$2:$Z$20=A11)*(COLUMN(F_1!$A$1:$Z$1)))))","v":""}]
[null,{"$f":"IF(A12=\"\",\"\",INDEX(F_1!$A$1:$Z$1,,SUMPRODUCT((F_1!$A$2:$Z$20=A12)*(COLUMN(F_1!$A$1:$Z$1)))))","v":""}]
[null,{"$f":"IF(A13=\"\",\"\",INDEX(F_1!$A$1:$Z$1,,SUMPRODUCT((F_1!$A$2:$Z$20=A13)*(COLUMN(F_1!$A$1:$Z$1)))))","v":""}]
[null,{"$f":"IF(A14=\"\",\"\",INDEX(F_1!$A$1:$Z$1,,SUMPRODUCT((F_1!$A$2:$Z$20=A14)*(COLUMN(F_1!$A$1:$Z$1)))))","v":""}]
[null,{"$f":"IF(A15=\"\",\"\",INDEX(F_1!$A$1:$Z$1,,SUMPRODUCT((F_1!$A$2:$Z$20=A15)*(COLUMN(F_1!$A$1:$Z$1)))))","v":""}]
[null,{"$f":"IF(A16=\"\",\"\",INDEX(F_1!$A$1:$Z$1,,SUMPRODUCT((F_1!$A$2:$Z$20=A16)*(COLUMN(F_1!$A$1:$Z$1)))))","v":""}]
[null,{"$f":"IF(A17=\"\",\"\",INDEX(F_1!$A$1:$Z$1,,SUMPRODUCT((F_1!$A$2:$Z$20=A17)*(COLUMN(F_1!$A$1:$Z$1)))))","v":""}]
[null,{"$f":"IF(A18=\"\",\"\",INDEX(F_1!$A$1:$Z$1,,SUMPRODUCT((F_1!$A$2:$Z$20=A18)*(COLUMN(F_1!$A$1:$Z$1)))))","v":""}]
[null,{"$f":"IF(A19=\"\",\"\",INDEX(F_1!$A$1:$Z$1,,SUMPRODUCT((F_1!$A$2:$Z$20=A19)*(COLUMN(F_1!$A$1:$Z$1)))))","v":""}]
[null,{"$f":"IF(A20=\"\",\"\",INDEX(F_1!$A$1:$Z$1,,SUMPRODUCT((F_1!$A$2:$Z$20=A20)*(COLUMN(F_1!$A$1:$Z$1)))))","v":""}]