{"text_format":"1","workbook":"xlsx","n_sheets":5,"sheets":["DESC.GL","GRAND LIVRE","FOURNISSEURS","LISTE DES RÉQUISITIONS","modèle"],"not_rendered":{"charts":0,"images":0,"macros":1,"external_links":0,"defined_names":3,"comments":1,"pivot_tables":0},"unopened":[],"bounds":{"document_bytes":16777216,"sheet_cells":100000,"rows_first":2000,"rows_last":500,"rows_between":2000,"halvings":0,"cell_chars":16384,"cell_head_chars":4096},"cells_cut":0,"cells_raw":0,"read":"whole","date_system":"1900"}

{"sheet":"DESC.GL","index":0,"n_rows":310,"n_cols":3,"rows_kept":310,"cut":false,"hidden":false,"merged":[[154,0,154,1],[1,0,1,1],[42,0,42,1],[46,0,46,1],[63,0,63,1],[87,0,87,1],[92,0,92,1],[99,0,99,1],[112,0,112,1],[119,0,119,1],[130,0,130,1],[139,0,139,1],[223,0,223,1],[233,0,233,1],[235,0,235,1],[246,0,246,1],[169,0,169,1],[179,0,179,1],[187,0,187,1],[190,0,190,1],[202,0,202,1],[207,0,207,1]]}
["01 23470 000","RECETTES LOISIRS"]
["ADMIN"]
["02 11000 130","REMUNERATION MAIRE CONSEILLERS"]
["02 11000 133","ALLOCATION DEPENSES CONSEIL"]
["02 11000 211","FONDS PENSION (CARRA)"]
["02 11000 310","FRAIS REPRESENTATION  CONSEIL"]
["02 11000 454","FORMATION"]
["02 13000 141","REMUNERATION ADMINISTRATION"]
["02 13000 142","TEMPS SUPPLEMENTAIRE"]
["02 13000 143","INDEMNITES, PRIMES, ALLOCATION"]
["02 13000 212","FONDS PENSION"]
["02 13000 232","ASSURANCE EMPLOI"]
["02 13000 281","ASSURANCE COLLECTIVE"]
["02 13000 310","DEPLACEMENTS CONGRES"]
["02 13000 321","FRAIS DE POSTE"]
["02 13000 322","COURRIER SPECIAL"]
["02 13000 331","TELEPHONE ET TELEAVERTISSEUR"]
["02 13000 345","FRAIS DE PUBLICATION"]
["02 13000 349","PUBLICITE"]
["02 13000 412","SERVICES JURIDIQUES"]
["02 13000 413","COMPTABILITE VERIFICATION"]
["02 13000 452","SERVICE TECHNIQUE INFORMATIQUE"]
["02 13000 454","FORMATION"]
["02 13000 493","RECEPTION"]
["02 13000 494","COTISATION ASSOCIATION ABONNEM"]
["02 13000 517","LOCATION MATERIEL EQUIPEMENT"]
["02 13000 522","ENTRETIEN BÂTIMENTS ADMINIST."]
["02 13000 527","ENT. REP. EQUIPEMENT BUREAU"]
["02 13000 610","ALIMENT, REPAS"]
["02 13000 670","FOURNITURE DE BUREAU"]
["02 13000 671","FOURNITURES ET LOGICIEL"]
["02 13000 681","ELECTRICITE"]
["02 13000 682","GAZ NATUREL EDIFICES MUNICIPAU"]
["02 13000 698","TOURNOI DE GOLF"]
["02 13000 699","DEPENSES DIVERSES"]
["02 13000 940","MAUVAISE CREANCE"]
["02 13000 951","QUOTE PART MRC ADM"]
["02 13000 995","RECLAMATION DOMMAGE INTERET"]
["02 13000 999","NATALITE"]
["02 13001 698","FETE DE LA ST-JEAN"]
["02 13001 999","NOUVEAUX PROPRIETAIRES"]
["02 13002 999","SUBVENTION COUCHES"]
["ÉLECTION"]
["02 14000 141","REMUNERATION ELECTION"]
["02 14000 454","FORMATION ELECTION"]
["02 14000 699","DEPENSES DIVERSES ELECTION"]
["INCENDIE"]
["02 22000 310","FRAIS DE DEPLACEMENT"]
["02 22000 331","TELEPHONE ET TELEAVERTISSEURS"]
["02 22000 454","FORMATION"]
["02 22000 516","LOCATION MATERIEL EQUIPEMENT"]
["02 22000 525","MATERIEL ROULANT REPARATION",22150]
["02 22000 526","ENTRETIEN ET REPARATION EQUIPE",22250]
["02 22000 610","REPAS INCENDIE",22350]
["02 22000 629","DEPENSES DIVERSES",22850]
["02 22000 631","ESSENCE"]
["02 22000 639","ENTRAIDE MUNICIPALE"]
["02 22000 650","VETEMENT CHAUSSURES"]
["02 22000 670","FOURNITURE DE BUREAU"]
["02 22000 681","ELECTRICITE"]
["02 22000 682","GAZ"]
["02 22000 951","QUOTE PART MRC - INCENDIE"]
["02 22000 965","IMMATRICULATION VEHICULE"]
["VOIRIE"]
["02 32000 310","FRAIS DE DEPLACEMENT"]
["02 32000 331","TELEPHONE ET TELEAVERTISSEURS"]
["02 32000 454","FORMATION",32]
["02 32000 459","SERVICES TECHNIQUES"]
["02 32000 515","LOCATION VEHICULES"]
["02 32000 516","LOC. MACHINERIES OUTILLAGE EQU"]
["02 32000 522","ENT ET REPAR. BATIMENT ET TERR"]
["02 32000 524","MATERIAUX DE CONSTRUCTION"]
["02 32000 525","ENTRETIEN ET REP MAT ROULANT"]
["02 32000 526","ENTRETIEN ET REP EQUIPEMENT"]
["02 32000 610","ALIMENT, REPAS"]
["02 32000 621","PIERRE"]
["02 32000 622","SABLE"]
["02 32000 625","ASPHALTE"]
["02 32000 629","AUTRES MATERIAUX"]
["02 32000 631","ESSENCE"]
["02 32000 635","ABAT POUSSIERE"]
["02 32000 641","QUINCAILLERIE"]
["02 32000 643","OUTILS ET EQUIPEMENTS"]
["02 32000 650","VETEMENTS CHAUSSURES ACCESSOIR"]
["02 32000 681","GARAGE ELECTRICITE"]
["02 32000 682","GAZ NATUREL"]
["02 32000 965","IMMATRICULATION VEHICULES"]
["VOIRIE HIVER"]
["02 33000 443","ENLEVEMENT DE LA NEIGE"]
["02 33000 516","LOCATION MACHINERIE"]
["02 33000 622","SABLE"]
["02 33000 629","SEL"]
["VOIRIE ÉCLAIRAGE"]
["02 34000 529","ENTRETIEN RESEAU ECLAIRAGE"]
["02 34000 681","ECLAIRAGE DE RUES"]
["02 35500 521","ENTRETIEN DIVERSES RUES"]
["02 35500 649","ENSEIGNE CIRCULATION ET LIGNES"]
["02-37000-418","CIT DES MOULINS"]
["02-37000-419","TRANSPORT ADAPTE"]
["VOIRIE AQUEDUC"]
["02 41200 141","AQUEDUC GARDE FIN DE SEMAINE"]
["02 41200 331","AQUEDUC PUITS TELEPHONE"]
["02 41200 444","AQUEDUC PUITS SERVICE TECH."]
["02 41200 521","AQUEDUC PUITS REPARATIONS"]
["02 41200 631","AQUEDUC ESSENCE GÉNÉRATRICE"]
["02 41200 635","AQUEDUC PRODUITS CHIMIQUES"]
["02 41200 643","AQUEDUC PUITS PETITS OUTILS"]
["02 41200 648","DOMAINE CHANTELOIS"]
["02 41200 649","AQUEDUC PUITS AUTRES MATERIAUX"]
["02 41200 681","AQUEDUC PUITS ELECTRICITE"]
["02 41200 682","AQUEDUC PUITS GAZ NATUREL"]
["02 41201 648","AQUEDUC DOMAINE DES REVES"]
["VOIRIE RESEAU D'EAU"]
["02 41300 444","RESEAU EAU SERVICES TECHN. TES"]
["02 41300 516","RESEAU EAU LOCATION MACHINERIE"]
["02 41300 521","RESEAU EAU ENT-REP/INFRAS"]
["02 41300 526","RESEAU EAU ENT-RÉPARATION"]
["02 41300 629","RESEAU EAU DEPENSES DIVERSES"]
["02 41300 642","RESEAU EAU ARTICLE TUYAUX MATE"]
["VOIRIE USINE"]
["02 41400 141","USINE GARDE FIN DE SEMAINE"]
["02 41400 331","USINE TELEPHONE"]
["02 41400 444","USINE SERVICES TECHNIQUES"]
["02 41400 521","USINE REP. INFRASTRUCTURE"]
["02 41400 529","USINE  REP. - AUTRES DÉPENSES"]
["02 41400 635","USINE PRODUITS CHIMIQUES"]
["02 41400 649","USINE AUTRES MATERIAUX"]
["02 41400 681","USINE ELECTRICITE"]
["02 41401 331","FOSSE TELEPHONE CITE DES PINS"]
["02 41402 331","FOSSE TELEPHONE PLACE DES PRES"]
["VOIRIE EGOUT"]
["02 41500 331","RÉSEAU ÉGOUT - TÉLÉPHONE"]
["02 41500 445","RESEAU EGOUT SERVICE TECHNIQUE"]
["02 41500 516","RESEAU EGOUT LOCATION MACHINER"]
["02 41500 521","RESEAU EGOUT STATION POMP REPA"]
["02 41500 629","RESEAU EGOUT DEPENSES DIVERSES"]
["02 41500 642","RESEAU EGOUT ARTICLE TUYAUX MA"]
["02 41500 681","RÉSEAU ÉGOUT-STATION ÉLECT."]
["02 41500 999","AUTRES -  SUBV FERMETURE FOSSÉ"]
["E.B.I."]
["02 45110 446","COLL-TRANSP DÉCHETS DOMEST."]
["02 45110 649","ORDURES - ACHAT BACS"]
["02 45210 446","COLL-TRANSP MATIÈRE RECYCLABLE"]
["02 45235 446","COLL-TRANSP MATIÈRE ORGANIQUE"]
["02 45300 141","RÉMUNÉRATION ÉCO-CENTRE"]
["02 45300 446","TRANSPORT-DISP/DÉCHETS"]
["02 45300 516","LOCATION MACHINERIE OUTILLAGE"]
["02 45300 698","PROGRAMME ESCOUADE VERTE"]
["02 45300 699","AUTRE (GRAND MÉNAGE)"]
["02 52000 141","OMHVL REMUNERATION DIRECTEUR C"]
["02 52000 699","LOGEMENT SOCIAL-TRANSP/PRÉLÈV."]
["02 52000 963","OMHVL QUOTE PART"]
["02 59000 992","POLITIQUE FAMILIALE"]
["02 59000 999","PROG.DES AINÉS/MADA  & AUTRE"]
["URBANISME"]
["02 61000 141","REMUNERATION URBANISME"]
["02 61000 143","COMITE CONSULTATIF URBANISME"]
["02 61000 212","FONDS PENSION"]
["02 61000 232","ASSURANCE EMPLOI"]
["02 61000 281","ASSURANCE COLLECTIVE"]
["02 61000 310","FRAIS DE DEPLACEMENT ET CONGRE"]
["02 61000 331","TELEPHONE ET TELEAVERTISSEUR"]
["02 61000 412","SERVICES JURIDIQUES URBANISME"]
["02 61000 453","SERVICE TECHNIQUE URBANISME"]
["02 61000 454","FORMATION"]
["02 61000 525","PIECES ET ACCESSOIRES AUTO"]
["02 61000 699","URBANISME  - AUTRES"]
["02 61000 951","QUOTE-PART MRC (AMENAGEMENT DU"]
["02 61000 965","IMMATRICULATION AUTO"]
["KIOSQUE TOURISTIQUE"]
["02 62200 141","RÉMUNÉRATION KIOSQUE TOURISTIQ"]
["02 62200 310","FRAIS DE DEPLACEMENT KIOSQUE"]
["02 62200 331","TELEPHONE ET INTERNET"]
["02 62200 454","FORMATION KIOSQUE"]
["02 62200 494","COTISATIONS  ASSOC. & ABON"]
["02 62200 681","ELECTRICITE"]
["02 62200 699","AUTRES"]
["02 63900 629","PROG EMBELLISEMENT - AUTRES"]
["02 63900 999","PROGRAMME DE REVITALISATION"]
["PAVILLON DESJARDINS"]
["02 70120 331","TEL PAV BEAUDOIN/DESJARDINS"]
["02 70120 446","ORDURES PAVILLON/CTRE ENTRAIDE"]
["02 70120 522","ENT-REP PAVILLON/SERV ENTRAIDE"]
["02 70120 632","CHAUFFAGE SERV ENTRAIDE-MAZOUT"]
["02 70120 681","ELECT PAVILLON/SERV.ENTRAIDE"]
["02 70120 682","GAZ NATUREL PAVILLON"]
["02 70120 699","DÉPENSES DIVERSES"]
["PATINOIRE"]
["02 70130 511","LOCATION HEURES DE GLACE"]
["02 70130 526","ENTRETIEN PATINOIRE-CAB.PATINS"]
["PISCINE"]
["02 70140 310","FRAIS DE DEPLACEMENT PISCINE"]
["02 70140 331","TELEPHONE PISCINE"]
["02 70140 453","SERVICE TECHNIQUE PISCINE"]
["02 70140 454","FORMATION PISCINE"]
["02 70140 522","ENTRETIEN REPARATION"]
["02 70140 635","PRODUITS CHIMIQUES"]
["02 70140 641","DIVERS MATERIAUX"]
["02 70140 670","FOURNITURE DE BUREAU PISCINE"]
["02 70140 681","ELECTRICITE PISCINE"]
["02 70140 682","GAZ PISCINE"]
["02 70140 699","AUTRE DÉPENSES PISCINE"]
["JEUX D'EAU"]
["02 70142 453","SERVICES TECHNIQUES"]
["02 70142 521","ENTRETIEN JEUX D'EAU"]
["02 70142 635","PRODUITS CHIMIQUES"]
["02 70142 699","JEUX D'EAU -AUTRES"]
["PARC & TERRAIN"]
["02 70150 331","TELEPHONE TERRAIN DE BALLE, PA"]
["02 70150 521","ENTRETIEN REPARATION INFRAS"]
["02 70150 522","ENTRETIEN REPARATION BATISSE"]
["02 70150 529","PARC MATERIAUX"]
["02 70150 631","ESSENCE"]
["02 70150 681","ELECTRICITE PARCS"]
["02 70150 699","DEP DIV PARCS VILLE/RIVIERE"]
["02 70151 699","DEP DIV PARC CLC"]
["02 70152 699","DEP DIV PARC VILMONT ET SANAIR"]
["02 70153 699","DEP DIV PARC CITE DES PINS"]
["02 70154 699","DEP DIV PARC JADE-CHAYER-CÔTÉ"]
["02 70155 699","DEP DIV PARC DOM CHANTELOIS"]
["02 70156 699","DEP PARC MORIN-CHARBON.-LAPIER"]
["02 70157 699","DEP DIV PARC JARDIN  SORBIERS"]
["02 70158 699","DEP DIV PARC DOMAINE GAGNON"]
["LOISIRS"]
["02 70190 310","DÉPLACEMENT/REPAS LOISIRS"]
["02 70190 331","TELEPHONE LOISIRS"]
["02 70190 349","PUBLICITÉ LOISIRS"]
["02 70190 454","FORMATION LOISIRS"]
["02 70190 670","FOURNITURE DE BUREAU"]
["02 70190 698","F.FLOCONS, RELAIS PR VIE ETC."]
["02 70190 699","AUTRES"]
["02 70190 971","SUBVENTION ORG. SANS BUT LUC."]
["02 70190 972","SUBVENTION OSBL SPÉCIALES"]
["SALLE OPALE + CENTRE SPORTIF"]
["02 70220 970","SALLE OPALE + CTRE SPORTIF"]
["BIBLIOTHÈQUES"]
["02 70230 140","SUBVENTION BENEVOLES"]
["02 70230 310","FRAIS DE DEPLACEMENT"]
["02 70230 331","TELEPHONE"]
["02 70230 454","FORMATION"]
["02 70230 459","ANIMATION"]
["02 70230 494","ADHESION C.R.S.B.P."]
["02 70230 522","ENTRETIEN  BIBLIOTHÈQUE"]
["02 70230 526","EQUIPEMENT"]
["02 70230 649","DIVERS MATERIAUX"]
["02 70230 670","ACHAT LIVRES"]
["IMMOBILISATIONS"]
["23 02000 723","ADM GÉN - TERRAIN"]
["23 02000 725","ADM GÉN - INFOR ET ÉQUIP"]
["23 02000 726","ADM GÉN   -AMEUB ET EQUIP"]
["23 02000 727","ADM GÉN   -AMEL. LOCATIVES"]
["23 03000 725","SEC PUB   -MACH, OUTIL, EQUIP"]
["23 03000 726","SÉC PUB - AMEUB BUREAU"]
["23 04000 721","TRANSPORT   -INFRASTRUCTURES"]
["23 04000 723","TRANSPORT - TERRAIN"]
["23 04000 724","TRANSPORT   -VEHICULES"]
["23 04000 725","TRANSPORT   -MACH,OUTIL, EQUIP"]
["23 04000 726","TRANSPORT - AMEUB BUREAU"]
["23 04000 727","TRANSPORT - AMÉL LOCATIVES"]
["23 05000 721","HYGIENE MILIEU - INFRASTRUCTUR"]
["23 05000 725","HYGIÈNE-MACHINERIE-ÉQUIPEMENT"]
["23 08000 721","LOISIR CULT   -INFRASTRUCTURES"]
["23 08000 726","LOISIR CULT   -AMEUB ET EQUIP"]
["23 08000 727","LOISIR CULTURE - AMÉL LOCATIVE"]
["23 61000 000","ACTIVITÉS DE FONCTIONNEMENT"]
["23 71000 000","EXCÉDENT FONCT. NON AFFECTÉ"]
["55 12009 000","EMPRUNT TEMPORAIRE REG 519"]
["55 13100 000","COMPTES FOURNISSEURS"]
["55 13101 001","REMBOURSEMENT TAXES - MAJ- MUT"]
["55 13101 002","DEPOT CERTIFICAT LOCALISATION"]
["55 13101 003","DEPOT RAPPORT INSP  INST SEPT"]
["55 13106 000","FRAIS COURUS"]
["55 13600 000","RETENUES DE GARANTIE (CONTRAT)"]
["55 13804 000","COMPTE PENS. ALIMENTAIRE"]
["55 13805 000","CPTES A PAYER  SYNDICAT VILLE"]
["55 13805 001","CPTES A PAYER SYNDICAT POMPIER"]
["55 13806 000","COMPTES A PAYER ASSURANCE COLL"]
["55 16000 000","REVENUS DIFFERES"]
["55 16001 000","DU AUX INTERESSES R 240 ET 297"]
["55 16002 000","DU AUX INTERESSES REG 065-2003"]
["55 16004 000","REV REPORTÉS FDS PARC/TERR JEU"]
["55 16005 000","REVENUS REPORTÉS MARIAGE"]
["55 16006 000","REV REPORTÉ RELAIS POUR LA VIE"]
["55 16006 001","REV REP C.POP. PRG REVITALISAT"]
["55 16007 000","DROITS CARRIÈRES ET SABLIÈRES"]
["55 16100 000","TAXES PERCUES D'AVANCE"]
["55 91100 000","AVOIR FONDS DE ROULEMENT"]
["55 91400 000","FINANCEMENT - PROJETS EN COURS"]
["55 91411 000","FIN. PROJET EN COURS REG 519"]
["55 91414 000","FIN. PEC REG 558"]
["55 91511 001","S.D.R.E.F.  ÉMISSION 3465000"]
["55 91511 002","SOLDE DISP. REGL. FERME 311"]
["55 91511 008","SOLDE DISP. REGL. FERME 406"]
["55 91511 013","S.D.R.E.F. REG 307"]
["55 91511 014","S.D.R.E.F. REG 486"]
["55 91511 015","S.D.R.E.F. REG 503"]
["55 91511 016","S.D.R.E.F. REG 512"]
["55 91512 000","S.D.R.E.F. ÉMISSION 3419000"]
["55 91514 000","SOLDE DISP. REGL. FERME 298"]
["55 91516 000","SDREF ÉMISSION 2000000"]
["55 91518 000","SOLDE DISP. REGL. FERME 274"]
["55 91520 000","SOLDE DISP. REGL. FERME 478"]
["55 91521 000","SOLDE DISP. REGL. FERME 502"]
["55 91522 000","SOLDE DISP. REGL. FERME 452"]
["55 91526 000","S.D.R.E.F. ÉMISSION 3692000"]
["55 91700 000","FDS RESERVE - FINANC ACT. FIN."]
["55 92000 001","MONTANTS POURVOIR FUTUR-1"]
["55 94000 000","INVEST NET ACTIF LONG TERME"]
["55 99100 000","SURPLUS/DEFICIT"]
["55 99200 000","SURPLUS/RESERVE"]

{"sheet":"GRAND LIVRE","index":1,"n_rows":294,"n_cols":2,"rows_kept":294,"cut":false,"hidden":true,"merged":[[211,0,211,1],[231,0,231,1],[242,0,242,1],[244,0,244,1],[257,0,257,1],[206,0,206,1],[100,0,100,1],[113,0,113,1],[122,0,122,1],[133,0,133,1],[144,0,144,1],[154,0,154,1],[159,0,159,1],[174,0,174,1],[183,0,183,1],[191,0,191,1],[194,0,194,1],[92,0,92,1],[0,0,0,1],[35,0,35,1],[42,0,42,1],[61,0,61,1],[87,0,87,1]]}
["ADMIN"]
[]
["02-13000-331","TELEPHONE ET TELEAVERTISSEUR"]
["02-13000-345","FRAIS DE PUBLICATION"]
["02-13000-349","PUBLICITE"]
["02-13000-412","SERVICES JURIDIQUES"]
["02-13000-454","FORMATION"]
["02-13000-414","SERVICE DE PAIE"]
["02-13000-416","RESSOURCES HUMAINES"]
["02-13000-422","ASSURANCE COMBINEE"]
["02-13000-493","RECEPTION"]
["02-13000-494","COTISATION ASSOCIATION ABONNEMENT"]
["02-13000-517","LOCATION MATERIEL EQUIPEMENT"]
["02-13000-522","ENTRETIEN BÂTIMENTS ADMINIST."]
["02-13000-527","ENT. REP. EQUIPEMENT BUREAU"]
["02-13000-610","ALIMENT, REPAS"]
["02-13000-670","FOURNITURE DE BUREAU"]
["02-13000-671","FOURNITURES ET LOGICIEL"]
["02-13000-681","ELECTRICITE"]
["02-13000-682","GAZ NATUREL EDIFICES MUNICIPAU"]
["02-13000-698","TOURNOI DE GOLF"]
["02-13000-699","DEPENSES DIVERSES"]
["02-13000-310","DEPLACEMENTS CONGRES"]
["02-13000-321","FRAIS DE POSTE"]
["02-13000-322","COURRIER SPECIAL"]
["02-13000-413","COMPTABILITE VERIFICATION"]
["02-13000-452","SERVICE TECHNIQUE INFORMATIQUE"]
["02-13000-940","MAUVAISE CREANCE"]
["02-13000-951","QUOTE PART MRC ADM"]
["02-13000-995","RECLAMATION DOMMAGE INTERET"]
["02-13000-998","AJUSTEMENT FEDERAL ET PROVINCIAL"]
["02-13000-999","NATALITE"]
["02-13001-698","FETE DE LA ST-JEAN"]
["02-13001-999","NOUVEAUX PROPRIETAIRES"]
["02-13002-999","SUBVENTION COUCHES"]
["ÉLECTION"]
["02-14000-345","PUBLICATION"]
["02-14000-412","SERVICE JURIDIQUE"]
["02-14000-417","SERVICES PROFESSIONNELS"]
["02-14000-454","FORMATION ELECTION"]
["02-14000-670","PAPETERIE"]
["02-14000-699","DEPENSES DIVERSES ELECTION"]
["INCENDIE"]
["02-22000-310","FRAIS DE DEPLACEMENT"]
["02-22000-331","TELEPHONE ET TELEAVERTISSEURS"]
["02-22000-422","ASSURANCE POMPIER"]
["02-22000-454","FORMATION"]
["02-22000-516","LOCATION MATERIEL EQUIPEMENT"]
["02-22000-525","MATERIEL ROULANT REPARATION"]
["02-22000-526","ENTRETIEN ET REPARATION EQUIPEMENT"]
["02-22000-610","REPAS INCENDIE"]
["02-22000-629","DEPENSES DIVERSES"]
["02-22000-631","ESSENCE"]
["02-22000-632","HUILE GARAGE INCENDIE"]
["02-22000-639","ENTRAIDE MUNICIPALE"]
["02-22000-650","VETEMENT & CHAUSSURES"]
["02-22000-670","FOURNITURE DE BUREAU"]
["02-22000-681","ELECTRICITE"]
["02-22000-682","GAZ"]
["02-22000-951","QUOTE PART MRC - INCENDIE"]
["02-22000-965","IMMATRICULATION VEHICULE"]
["VOIRIE"]
["02-32000-310","FRAIS DE DEPLACEMENT"]
["02-32000-331","TELEPHONE ET TELEAVERTISSEURS"]
["02-32000-424","ASSURANCE VEHICULE MOTEUR"]
["02-32000-454","FORMATION"]
["02-32000-459","SERVICES TECHNIQUES"]
["02-32000-515","LOCATION VEHICULES"]
["02-32000-516","LOC. MACHINERIES OUTILLAGE EQU"]
["02-32000-522","ENT ET REPAR. BATIMENT ET TERR"]
["02-32000-524","MATERIAUX DE CONSTRUCTION"]
["02-32000-525","ENTRETIEN ET REP MAT ROULANT"]
["02-32000-526","ENTRETIEN ET REP EQUIPEMENT"]
["02-32000-610","ALIMENT, REPAS"]
["02-32000-621","PIERRE"]
["02-32000-622","SABLE"]
["02-32000-625","ASPHALTE"]
["02-32000-629","AUTRES MATERIAUX"]
["02-32000-631","ESSENCE"]
["02-32000-632","GARAGE CHAUFFAGE"]
["02-32000-635","ABAT POUSSIERE"]
["02-32000-641","QUINCAILLERIE"]
["02-32000-643","OUTILS ET EQUIPEMENTS"]
["02-32000-650","VETEMENTS CHAUSSURES ACCESSOIR"]
["02-32000-681","GARAGE ELECTRICITE"]
["02-32000-682","GAZ NATUREL"]
["02-32000-965","IMMATRICULATION VEHICULES"]
["VOIRIE HIVER"]
["02-33000-443","ENLEVEMENT DE LA NEIGE"]
["02-33000-516","LOCATION MACHINERIE"]
["02-33000-622","SABLE"]
["02-33000-629","SEL"]
["VOIRIE ÉCLAIRAGE"]
["02-34000-529","ENTRETIEN RESEAU ECLAIRAGE"]
["02-34000-681","ECLAIRAGE DE RUES"]
["02-35500-521","ENTRETIEN DIVERSES RUES"]
["02-35500-649","ENSEIGNE CIRCULATION ET LIGNES"]
["02-37000-418","CIT DES MOULINS"]
["02-37000-419","TRANSPORT ADAPTE"]
["02-37000-951","QUOTE PART MRC - TRANSPORT"]
["VOIRIE AQUEDUC"]
["02-41200-141","AQUEDUC GARDE FIN DE SEMAINE"]
["02-41200-331","AQUEDUC PUITS TELEPHONE"]
["02-41200-444","AQUEDUC PUITS SERVICE TECH."]
["02-41200-521","AQUEDUC PUITS REPARATIONS"]
["02-41200-631","AQUEDUC ESSENCE GÉNÉRATRICE"]
["02-41200-635","AQUEDUC PRODUITS CHIMIQUES"]
["02-41200-643","AQUEDUC PUITS PETITS OUTILS"]
["02-41200-648","DOMAINE CHANTELOIS"]
["02-41200-649","AQUEDUC PUITS AUTRES MATERIAUX"]
["02-41200-681","AQUEDUC PUITS ELECTRICITE"]
["02-41200-682","AQUEDUC PUITS GAZ NATUREL"]
["02-41201-648","AQUEDUC DOMAINE DES REVES"]
["VOIRIE RESEAU D'EAU"]
["02-41300-444","RESEAU EAU SERVICES TECHN. TES"]
["02-41300-516","RESEAU EAU LOCATION MACHINERIE"]
["02-41300-521","RESEAU EAU ENT-REP/INFRAS"]
["02-41300-526","RESEAU EAU ENT-RÉPARATION"]
["02-41300-629","RESEAU EAU DEPENSES DIVERSES"]
["02-41300-642","RESEAU EAU ARTICLE TUYAUX MATE"]
["02-41300-681","RESEAU EAU ELECTRICITE"]
["02-41300-682","RESEAU EAU GAZ NATUREL"]
["VOIRIE USINE"]
["02-41400-141","USINE GARDE FIN DE SEMAINE"]
["02-41400-331","USINE TELEPHONE"]
["02-41400-444","USINE SERVICES TECHNIQUES"]
["02-41400-516","LOCATION MACHINERIE, OUTILS"]
["02-41400-521","USINE REP. INFRASTRUCTURE"]
["02-41400-529","USINE  REP. - AUTRES DÉPENSES"]
["02-41400-635","USINE PRODUITS CHIMIQUES"]
["02-41400-643","USINE PETITS OUTILS"]
["02-41400-649","USINE AUTRES MATERIAUX"]
["02-41400-681","USINE ELECTRICITE"]
["VOIRIE FOSSE"]
["02-41401-331","FOSSE TELEPHONE CITE DES PINS"]
["02-41401-529","FOSSE CITE DES PINS"]
["02-41401-681","FOSSE ELECTRICITE CITE DES PIN"]
["02-41402-331","FOSSE TELEPHONE PLACE DES PRES"]
["02-41402-529","FOSSE PLACE DES PRES"]
["02-41402-681","FOSSE ELECTRICITE PLACE DES PR"]
["02-41403-529","FOSSE JARDIN DES SORBIERS"]
["02-41403-681","FOSSE ELECTRICITE JARDIN DES S"]
["02-41404-529","FOSSE PORTE DE SAINT LIN"]
["02-41404-681","FOSSE ELECTRICITE PORTE DE SAI"]
["VOIRIE EGOUT"]
["02-41500-331","RÉSEAU ÉGOUT - TÉLÉPHONE"]
["02-41500-445","RESEAU EGOUT SERVICE TECHNIQUE"]
["02-41500-516","RESEAU EGOUT LOCATION MACHINER"]
["02-41500-521","RESEAU EGOUT STATION POMP REPA"]
["02-41500-629","RESEAU EGOUT DEPENSES DIVERSES"]
["02-41500-642","RESEAU EGOUT ARTICLE TUYAUX MA"]
["02-41500-681","RÉSEAU ÉGOUT-STATION ÉLECT."]
["02-41500-999","AUTRES -  SUBV FERMETURE FOSSÉ"]
["02-45000-699","ORDURES - ACHAT BACS"]
["E.B.I."]
["02-45110-446","COLL-TRANSP DÉCHETS DOMEST."]
["02-45110-649","ORDURES - ACHAT BACS"]
["02-45210-446","COLL-TRANSP MATIÈRE RECYCLABLE"]
["02-45235-446","COLL-TRANSP MATIÈRE ORGANIQUE"]
["URBANISME"]
["02-61000-143","COMITÉ CONSULTATIF URBANISME"]
["02-61000-310","FRAIS DE DEPLACEMENT ET CONGRE"]
["02-61000-331","TELEPHONE ET TELEAVERTISSEUR"]
["02-61000-412","SERVICES JURIDIQUES URBANISME"]
["02-61000-419","REGISTRATEUR"]
["02-61000-424","ASSURANCE AUTO"]
["02-61000-453","SERVICE TECHNIQUE URBANISME"]
["02-61000-454","FORMATION"]
["02-61000-525","PIECES ET ACCESSOIRES AUTO"]
["02-61000-631","ESSENCE"]
["02-61000-699","URBANISME  - AUTRES"]
["02-61000-951","QUOTE-PART MRC (AMENAGEMENT DU"]
["02-61000-965","IMMATRICULATION AUTO"]
["02-62100-349","QUOTE-DÉVELOP. ÉCONOMIQUE"]
["KIOSQUE TOURISTIQUE"]
["02-62200-310","FRAIS DE DEPLACEMENT KIOSQUE"]
["02-62200-331","TELEPHONE ET INTERNET"]
["02-62200-454","FORMATION KIOSQUE"]
["02-62200-494","COTISATIONS  ASSOC. & ABON"]
["02-62200-681","ELECTRICITE"]
["02-62200-699","AUTRES"]
["02-63900-629","PROG EMBELLISEMENT - AUTRES"]
["02-63900-999","PROGRAMME DE REVITALISATION"]
["PAVILLON DESJARDINS"]
["02-70120-331","TEL PAV BEAUDOIN/DESJARDINS"]
["02-70120-446","ORDURES PAVILLON/CTRE ENTRAIDE"]
["02-70120-522","ENT-REP PAVILLON/SERV ENTRAIDE"]
["02-70120-632","CHAUFFAGE SERV ENTRAIDE-MAZOUT"]
["02-70120-681","ELECT PAVILLON/SERV.ENTRAIDE"]
["02-70120-682","GAZ NATUREL PAVILLON"]
["02-70120-699","DÉPENSES DIVERSES"]
["PATINOIRE"]
["02-70130-511","LOCATION HEURES DE GLACE"]
["02-70130-526","ENTRETIEN PATINOIRE-CAB.PATINS"]
["PISCINE"]
["02-70140-310","FRAIS DE DEPLACEMENT PISCINE"]
["02-70140-331","TELEPHONE PISCINE"]
["02-70140-453","SERVICE TECHNIQUE PISCINE"]
["02-70140-521","ENTRETIEN INFRASTRUCTURES"]
["02-70140-522","ENTRETIEN REPARATION"]
["02-70140-635","PRODUITS CHIMIQUES"]
["02-70140-641","DIVERS MATERIAUX"]
["02-70140-670","FOURNITURE DE BUREAU PISCINE"]
["02-70140-681","ELECTRICITE PISCINE"]
["02-70140-682","GAZ PISCINE"]
["02-70140-699","AUTRE DÉPENSES PISCINE"]
["JEUX D'EAU"]
["02-70142-453","SERVICES TECHNIQUES"]
["02-70142-521","ENTRETIEN JEUX D'EAU"]
["02-70142-635","PRODUITS CHIMIQUES"]
["02-70142-699","JEUX D'EAU -AUTRES"]
["PARC & TERRAIN"]
["02-70150-331","TELEPHONE TERRAIN DE BALLE, PA"]
["02-70150-446","ENLEVEMENT ORDURES TERRAIN DE"]
["02-70150-453","SERVICE TECHNIQUE PARCS"]
["02-70150-521","ENTRETIEN REPARATION INFRAS"]
["02-70150-522","ENTRETIEN REPARATION BATISSE"]
["02-70150-529","PARC MATERIAUX"]
["02-70150-631","ESSENCE"]
["02-70150-681","ELECTRICITE PARCS"]
["02-70150-699","DÉPENSES DIVERSES PARCS VILLE/RIVIERE"]
["02-70151-681","ELECTRICITE DOMAINE CLC"]
["02-70151-699","DÉPENSES DIVERSES PARC CLC"]
["02-70152-681","ELECTRICITE PARC VILMONT ET SA"]
["02-70152-699","DÉPENSES DIVERSES PARC VILMONT ET SANAIR"]
["02-70153-699","DÉPENSES DIVERSES PARC CITE DES PINS"]
["02-70154-699","DÉPENSES DIVERSES PARC JADE-CHAYER-CÔTÉ"]
["02-70155-699","DÉPENSES DIVERSES PARC DOM CHANTELOIS"]
["02-70156-699","DEP PARC MORIN-CHARBON.-LAPIER"]
["02-70157-699","DÉPENSES DIVERSES PARC JARDIN  SORBIERS"]
["02-70158-699","DÉPENSES DIVERSES PARC DOMAINE GAGNON"]
["LOISIRS"]
["02-70190-310","DÉPLACEMENT/REPAS LOISIRS"]
["02-70190-331","TELEPHONE LOISIRS"]
["02-70190-349","PUBLICITÉ LOISIRS"]
["02-70190-454","FORMATION LOISIRS"]
["02-70190-670","FOURNITURE DE BUREAU"]
["02-70190-698","F.FLOCONS, RELAIS PR VIE ETC."]
["02-70190-699","AUTRES"]
["02-70190-970","FEERIE NOEL"]
["02-70190-971","SUBVENTION ORG. SANS BUT LUC."]
["02-70190-972","SUBVENTION OSBL SPÉCIALES"]
["SALLE OPALE + CENTRE SPORTIF"]
["02-70220-970","SALLE OPALE + CTRE SPORTIF"]
["BIBLIOTHÈQUES"]
["02-70230-310","FRAIS DE DEPLACEMENT"]
["02-70230-331","TELEPHONE"]
["02-70230-335","SERVICE MULTILIST INTERNET"]
["02-70230-454","FORMATION"]
["02-70230-459","ANIMATION"]
["02-70230-493","RECEPTION"]
["02-70230-494","ADHESION C.R.S.B.P."]
["02-70230-519","LIVRES LOCATION"]
["02-70230-522","ENTRETIEN  BIBLIOTHÈQUE"]
["02-70230-526","EQUIPEMENT"]
["02-70230-649","DIVERS MATERIAUX"]
["02-70230-670","ACHAT LIVRES"]
["IMMOBILISATIONS"]
["23-2000-300","ADMINISTRATION GÉNÉRALE"]
["23-2000-722","ADM GÉN - BÂTIMENTS"]
["23-2000-723","ADM GÉN - TERRAIN"]
["23-2000-724","ADM GÉN - VÉHICULES"]
["23-2000-725","ADM GÉN - INFOR ET ÉQUIP"]
["23-2000-726","ADM GÉN   -AMEUB ET EQUIP"]
["23-2000-727","ADM GÉN   -AMEL. LOCATIVES"]
["23-3000-722","SÉC PUB - BÂTIMENTS"]
["23-3000-724","SÉC PUB - VÉHICULES"]
["23-3000-725","SEC PUB   -MACH, OUTIL, EQUIP"]
["23-3000-726","SÉC PUB - AMEUB BUREAU"]
["23-3000-727","SÉC PUB - AMÉL LOCATIVES"]
["23-4000-300","TRANSPORT"]
["23-4000-721","TRANSPORT   -INFRASTRUCTURES"]
["23-4000-722","TRANSPORT   -BATIMENT"]
["23-4000-723","TRANSPORT - TERRAIN"]
["23-4000-724","TRANSPORT   -VEHICULES"]
["23-4000-725","TRANSPORT   -MACH,OUTIL, EQUIP"]
["23-4000-726","TRANSPORT - AMEUB BUREAU"]
["23-4000-727","TRANSPORT - AMÉL LOCATIVES"]
["23-5000-300","HYGIÈNE DU MILIEU"]
["23-5000-721","HYGIENE MILIEU - INFRASTRUCTUR"]
["23-5000-722","HYGIENE -BÂTIMENTS"]
["23-5000-723","HYGIENE - TERRAIN"]
["23-5000-725","HYGIÈNE-MACHINERIE-ÉQUIPEMENT"]
["23-5000-727","HYGIENE - AMÉL LOCATIVES"]
["23-6000-722","SANTE BIEN ETRE   -BATIMENT"]
["23-7000-721","URBANISME - INFRASTRUCTURES"]
["23-7000-724","URBANISME - VÉHICULES"]
["23-7000-726","URBANISME - AMEUB BUREAU"]
["23-8000-721","LOISIR CULT   -INFRASTRUCTURES"]
["23-8000-722","LOISIR CULTURE - BÂTIMENTS"]
["23-8000-723","LOISIR CULTURE - TERRAIN"]
["23-8000-724","LOISIR CULTURE - VÉHICULES"]
["23-8000-726","LOISIR CULT   -AMEUB ET EQUIP"]
["23-8000-727","LOISIR CULTURE - AMÉL LOCATIVE"]

{"sheet":"FOURNISSEURS","index":2,"n_rows":2212,"n_cols":2,"rows_kept":2212,"cut":false,"hidden":true,"merged":[]}
["1740 TAPIS PRÉLARTS INC.","1740TAP"]
["4122682 CANADA INC.","4122682"]
["4170652 CANADA INC.","Q77425"]
["911 PRO INC.","N67901"]
["9161 4321 QUÉBEC INC.","91614321"]
["9176 9885 QUÉBEC INC.","N67903"]
["9276 8316 QUÉBEC INC.","S82250"]
["9276-8316 QUÉBEC INC.","N67905"]
["9284-0313 QUÉBEC INC.","N67908"]
["9299 7121 QUÉBEC INC.","N67910"]
["9303 7844 QUÉBEC INC.","N67920"]
["9306-1380 QUÉBEC INC.","A05850"]
["9317-9638 QUÉBEC INC.","N67921"]
["A.T.P.A. SECTION QUEBEC","A00675"]
["A-1 LIGNES JAUNES","A00750"]
["A25-LE LIEN INTELLIGENT","A00800"]
["ABC ENVIRONNEMENT INC.","A00900"]
["ABC RIVE-NORD INC.","A01000"]
["ABRIS CRYSTAL INC.","A01010"]
["ABS","A01050"]
["ACCES COMMUNICATIONS","A01200"]
["ACCS LE GROUPE","A01220"]
["ACIER D'ARMATURE 2000 INC","A01230"]
["ACMQ","A01260"]
["AD.MATS","A01500"]
["AERZEN CANADA","A02000"]
["AFFAIRES (LES) JOURNAL","A02250"]
["AGRITEX ST-ROCH","A02400"]
["AIR EN FÊTE (L')","A02910"]
["AIR LIQUIDE CANADA INC.","A02925"]
["AIRTEK INC.","A03150"]
["ALAIN BENOIT TRANSPORT INC.","A03600"]
["ALERTE ANIMAL","A03670"]
["ALIMENTATION MANON BÉLANGER INC.","A03700"]
["ALIMPLUS INC.","A03710"]
["ALPHA TABCO INC.","A03720"]
["ALUMINIUM ANDRE GAGNON INC.","A04500"]
["ALUMINIUM NORD-SUD INC.","A04700"]
["ALUMINIUM PIERRE BRIEN INC.","A04800"]
["AMEUBLEMENT USAGE PLUS","A05100"]
["AMIS DU JARDIN BOTANIQUE DE MONTRÉAL","A05150"]
["AMUSEMENTS SPORTEQUE INC.","A05200"]
["ANDRÉ MAJEAU INC.","A05210"]
["ANIMATION DÉCLIC LTÉE","A05230"]
["ANNEX PUBLISHING & PRINTING INC.","A05250"]
["APPAREILS TECHNI PRO ENR.","A05275"]
["APSAM","A05300"]
["APTIKA","A05310"]
["APUR (MARC PILON) URBANISTES-CONSEILS","A05312"]
["AQTR","A05315"]
["AQUA NOVA","A05320"]
["AQUA TECHNO SPÉCIALISTE AQUATIQUE INC","A05325"]
["AQUAM SPÉCIALISTE AQUATIQUE INC.","A05350"]
["ARBITRAGE PIERRE LAMARCHE","A05400"]
["ARENE JEAN-LUC","A05430"]
["AREO-FEU LTEE","A05450"]
["ARTEC ENTREPRENEUR PAYSAGISTE","A05455"]
["ARTS GRAPHIQUES ALPHONSO INC.","A05460"]
["ASCENSEURS INNOVATEC","A05500"]
["ASD PROMOTION","A05520"]
["ASPHALTE DESJARDINS INC.","A05625"]
["ASPHALTE JEAN-LOUIS CAMPEAU INC.","A05860"]
["ASPHALTE LANAUDIERE INC","A05870"]
["ASPIRATEUR 2000 PLUS","A05950"]
["ASS BIBLIOTHÈQUES PUBLIQUES QUÉBEC","A06050"]
["ASS PROPRIETAIRES DOM. VILMONT INC.","A06975"]
["ASSOCIATION AMIS DU FOLKLORE","A07875"]
["ASSOCIATION CANADIENNE DE LA PAIE","A06060"]
["ASSOCIATION CARREFOUR FAMILLE MONTCALM","A06075"]
["ASSOCIATION DES CHEFS","A08325"]
["ASSOCIATION DES GESTIONNAIRES","A06300"]
["ASSOCIATION DES POMPIERS","A08775"]
["ASSOCIATION DES POMPIERS AUXILIAIRES","A08770"]
["ASSOCIATION DIRECTEURS MUNICIPAUX QUÉBEC","A08550"]
["ASSOCIATION HANDAMI","A06525"]
["ASSOCIATION HOCKEY MINEUR","A07900"]
["ASSOCIATION QUÉBÉCOISE D'URBANISME","A08776"]
["ATELIER DE REPARATION POIRIER INC.","A08778"]
["ATELIER MOBYDIK INC","A08785"]
["ATELIER URBAIN INC. (L')","A08780"]
["ATERA ENVIRO INC","A09050"]
["ATTRACTION RADIO (8470286 CANADA INC)","A09100"]
["AU PAYS DES GÉANTS INC.","A09125"]
["AUDIO CINÉ FILMS INC.","A09200"]
["AUTOMATES-PREBEC LTEE","A09675"]
["AUTOMATION R.L. INC.","A09700"]
["AUTOS J.G. PINARD & FILS LTEE","A09500"]
["AXI SECURITE","A09930"]
["B.G. TRANSPLANTATION INC.","B09935"]
["B.I. AUTO GLACE","B09940"]
["BADIO GREGORY","B09970"]
["BALAI LE PERMANENT INC.","B10000"]
["BALAI VAC","B10025"]
["BALAIS NOMAD INC.","B10015"]
["BARRICADEUR (LE)","B10200"]
["BASCH TEXTILES CANADA INC.","B10250"]
["BAUVAL","B10400"]
["BAUVAL TECH-MIX","B10420"]
["BAYARD CANADA","B10430"]
["BAYARD JEUNESSE / LES EXPLORATEURS","B10440"]
["BAYARD JEUNESSE/LES DÉBROUILLARDS","B10435"]
["BAYARD PRESSE CANADA","B10450"]
["BAYARD PRESSE CANADA INC.","B10500"]
["BC2 GROUPE CONSEIL INC.","B10575"]
["BEAUDET MICHEL","B10580"]
["BEAUDOIN HURENS INC.","B10600"]
["BEAUREGARD FOSSES SEPTIQUES","B10700"]
["BEL ÂGE","B10790"]
["BELANGER SAUVÉ","B10900"]
["BÉLANGER TREMBLAY HUISSIERS DE JUSTICE","B10800"]
["BELISLE ET CARRIERE INC.","B10950"]
["BELL CANADA","B11025"]
["BELL CANADA-PUBLIC ACCES","B12150"]
["BELL MOBILITE","B12375"]
["BELL MOBILITE PAGETTE","B12600"]
["BELLEMARE & GILBERT ARCHITECTES INC.","B12625"]
["BELLEROSE JEAN","B12650"]
["BELVÉDÈRE NISSAN","B12800"]
["BERGER DORYANE","B12900"]
["BERNIER KATHERINE","B13000"]
["BERNIER MARJOLAINE","B13050"]
["BERNIER MATHIEU","B13060"]
["BERTRAND ANNIE","B13120"]
["BERTRAND CHANTAL","B13125"]
["BÉTON ADAM INC.","B13150"]
["BÉTON JACTO","B13200"]
["BÉTON RIVE-NORD ENR.","B13250"]
["BFM","B13400"]
["BF-TECH INC.","B13350"]
["BIBLIO PUB LAVAL LAURENTIDES LANAUDIÈRE","B14200"]
["BIBLIO SERVICE 3C INC","B13725"]
["BIBLIOTHEQUE MUNICIPALE","B14175"]
["BIBLIOTHÈQUES PUBLIQUES DU QUÉBEC","B14250"]
["BIJOU LTEE","B14300"]
["BILANGUES INC.","B14350"]
["BIOLAB","B14400"]
["BLACKIP 360","B14500"]
["BOISVERT CHEVROLET BUICK GMC","B15350"]
["BOIVIN & GAUVIN INC.","B15375"]
["BO-ROY NOTIPLEX ALARME INCENDIE","B15000"]
["BROCHU DONALD","B15400"]
["BRODERIE AXÈ CIBLE INC.","B15500"]
["BRUNEAU JULIE","B15630"]
["BRUYÈRE RONALD, DIR. INCENDIES","B15650"]
["BULLETIN DES AGRICULTEURS (LE)","B15800"]
["BUREAU LAURENTIDES INC.","B15975"]
["BURO-DESIGN INTERNATIONAL","B16325"]
["C.L.B. UNIFORMES INC.","C16525"]
["C.M.P. MAYER INC.","C23850"]
["C.R.S.B.P. DES LAURENTIDES INC.","C17100"]
["C.U.R. INC.","C23900"]
["CABANE A SUCRE N. LAFORTUNE INC.","C17200"]
["CAFÉ LANAUDIÈRE INC.","C17510"]
["CAFÉ L'ESSENTIEL LTÉE","C17500"]
["CAISSE POPULAIRE DE MONTCALM","C17775"]
["CAMIONS CARL THIBAULT INC.","C18000"]
["CAMIONS EXCELLENCE PETERBILT INC.","C18010"]
["CAMRICK","C18050"]
["CANSEL","C18075"]
["CAP-AUX-DIAMANTS","C18100"]
["CARA","C18150"]
["CARDIO PLEIN AIR ENTRAÎNEMENT 4 SAISONS","C18180"]
["CARREFOUR DU MATELAS","C18210"]
["CARREFOUR JEUNESSE-EMPLOI","C18225"]
["CARRIÈRES UNI-JAC INC.","C18350"]
["CARROSSERIE J.L. INC.","C18500"]
["CARTOTEK GEO","C18700"]
["CASCADE SUBSCRIPTION SERVICE INC.","C18750"]
["CATSPORTS","C18925"]
["CAYA SERGE","C18950"]
["CAZA MARCEAU + SOUCY BEAUDREAU-AVOCATS","C18960"]
["CAZA MARCEAU + SOUCY BOUDREAU, AVOCATS","C 18960"]
["CDC EXCAVATION","C16650"]
["CDS INC.","C18975"]
["CEGEP DE SAINT-LAURENT","C19000"]
["CELB INC.","C19050"]
["CENTRAIDE LANAUDIERE","C19125"]
["CENTRE ADM. QUALIFICATION PROFESSIONNELL","C19130"]
["CENTRE AQUATIQUE LE GARDEUR","C19150"]
["CENTRE DE CAMION ST-JEROME INC","C19165"]
["CENTRE DE COMPOSTAGE LANAUDIERE","C19170"]
["CENTRE DE FEMMES MONTCALM","C19200"]
["CENTRE DE L'AUTO ET DU CAMION LEVESQUE INC.","C19775"]
["CENTRE DE PNEUS VILLEMAIRE","C20100"]
["CENTRE D'INSPECTION MECANIQUE","C19160"]
["CENTRE DISTRIBUTION ELECTRIQUE","C19350"]
["CENTRE INSPECTION D. VEHICULES","C20475"]
["CENTRE JARDIN EXCELS","C20800"]
["CENTRE SPORTIF","C21150"]
["CERCLE ARC-EN-CIEL, NO 1304","C21225"]
["CERCLES DES JEUNES NATURALISTES (LES)","C21230"]
["CERTIFIED LABORATORIES","C21240"]
["CFH SECURITE INC.","C21250"]
["CHAMBRE DE COMMERCE","C21375"]
["CHAPITEAUX LANAUDIÈRE INC.","C21500"]
["CHARBONNEAU REJEAN","C21825"]
["CHASSÉ ISABELLE","C22150"]
["CHAUFFAGE ERICK TURCOTTE INC.","C22175"]
["CHAUFFAGE SPEC 360 INC.","C22190"]
["CHAUMIERE JEUNESSE","C22200"]
["CHAURETTE ET ASSOCIES","C22210"]
["CHAUSSURES POP","C22240"]
["CHEM ACTION INC.","C22260"]
["CHEMPRO INC.","C22275"]
["CHEMTECH AUTOMATION","C22300"]
["CHEVALIERS DE COLOMB (LES)","C22310"]
["CHEZ SOI","C22400"]
["CHOLACK JENNIFER","C22500"]
["CHRÉTIEN STÉPHANIE","CHRE001"]
["CHRISTIAN R. ROY INC.","C22600"]
["CIMA + S.E.N.C.","C22650"]
["CIMENT LACASSE LTEE","C22700"]
["CIMENT LAVALLÉE","C22710"]
["CIMENTS MPA (LES)","C22715"]
["CINÉ-MÉDIC","C22726"]
["CIRIS","C22727"]
["CJLM","C22729"]
["CLA EXPERTS-CONSEILS INC.","C22730"]
["CLASSEMENT LUC BEAUDOIN INC.","C22740"]
["CLD MONTCALM","C22742"]
["CLEARTECH INDUSTRIES INC.","C22743"]
["CLERMONT MICHAEL","C22745"]
["CLIN D'OEIL","C22748"]
["CLINIQUE D'ASPIRATEUR ENR.","C22750"]
["CLOTURE D.D.F. ENR.","C23125"]
["CLÔTURE OLYMPIQUE","C23180"]
["CLÔTURES LAURENTIDES","C23150"]
["CLÔTURES SPECIALISEES (LES)","C23200"]
["CLUB DE GOLF  MONTCALM INC","C23300"]
["CLUB DE GOLF MASCOUCHE INC.","C23250"]
["CLUB FADOQ ST-LIN-LAURENTIDES-LANAUDIÈRE","B14850"]
["CLUB OPTIMISTE ST-LIN-LAURENTIDES INC.","C23350"]
["COCA-COLA RAFRAICHISSEMENTS","C24000"]
["COFFRES-FORTS MARTINEZ 2000","C24100"]
["COLLEGE MONTMORENCY","C24300"]
["COLMATEC INC.","C24475"]
["COLPRON JESSICA","C24485"]
["COMBEQ","C24500"]
["COMITE DES FETES FIDELITE","C24525"]
["COMITE DES LOISIRS","C24750"]
["COMITE D'EXPANSION ÉCONOMIQUE","C24600"]
["COMITE RECREATIF RIV. ACHIGAN","C25200"]
["COMITE TOURNOI DE GOLF - MRC MONTCALM","C25275"]
["COMM. SCOLAIRE DE LA RIVIÈRE DU NORD","C25420"]
["COMMERCIAL AQUATIC SUPPLIES","C25350"]
["COMMISSION ADMINISTRATIVE DES REGIMES","C25375"]
["COMMISSION DES NORMES DE L'ÉQUITÉ","C28575"]
["COMMISSION SCOLAIRE DE LAVAL","C25423"]
["COMMISSION SCOLAIRE DES SAMARES","C25425"]
["COMMUNICATION TELOSYSTEME INC.","C25650"]
["COMPASS MINERALS CANADA-QUÉBEC","C25660"]
["COMPTEURS LECOMPTE LTÉE (LES)","C25675"]
["CONCEPT NORD-SUD INC.","C26000"]
["CONCEPT VOITURETTE INC.","C26710"]
["CONSEIL RÉGIONAL DE L' ENVIRONNEMENT","C26700"]
["CONSTRUCTION ANOR INC.","C27100"]
["CONSTRUCTION D & G GAGNON INC.","C27150"]
["CONSTRUCTION S.R.B.","C27175"]
["CONSULTANT EDS","C27190"]
["CONTENEURS QUÉBEC","C27205"]
["CONTRÔLES CT ENR. (LES)","C27195"]
["CONTROLES PROVAN ASSOCIES INC.","C27200"]
["CONVERCITÉ","C27240"]
["COOL","C27250"]
["COOP PROFID'OR","C27300"]
["COOPERATIVE DE RADIODIFFUSION","C27400"]
["COPIBEC","C27450"]
["CORPORATION DE LA FÊTE NATIONALE","S84250"]
["CÔTÉ JARDINS","C28576"]
["COUP DE PINCEAU","C28578"]
["COURS AUTODIDACTIQUES DE FRANÇAIS ÉCRIT","C28560"]
["COURSOL SPORTS DIVISION","C28580"]
["COUSINEAU ALEXANDRE","C28590"]
["COUTU AMÉLIE","C28600"]
["COUVREUR C.S.G. INC.","C28620"]
["CPA TOURBILLONS DES LAURENTIDES INC.","C16675"]
["CRAIM","C28500"]
["CRÉATIONS STYLE PLUS INC.","C28510"]
["CROIX-ROUGE CANADIENNE","C28525"]
["CSE INCENDIE ET SECURITE INC.","C28650"]
["CTI CONSTRUCTION (9153-7209 QC INC)","C28660"]
["CYCLONE LIGHTING","C28670"]
["CYR LUC","C28675"]
["D.L.D. EXTERMINATION","D28685"]
["D.P. AUTOMOTIVE","D28700"]
["DAIGNEAULT, PLANTE ET ASSOCIES","D28800"]
["DANIEL GRONDIN, AVOCAT EN FIDUCIE","G45900"]
["DANIS ELIANE","D29000"]
["DAOUST VALÉRIE","D29010"]
["DAVID GINETTE","D29200"]
["DAZE NEVEU, ARPENTEURS-GÉOMÈTRES","D29250"]
["DECOR TAPIS DU NORD LTEE","D29300"]
["DECORATION PAQUETTE ET FILS INC.","D29325"]
["DÉCORMAG","D29305"]
["DELCOM COPISCOPE INC.","D29330"]
["DÉLICES DE ROSA (LES)","D29425"]
["DEMARCOM INC.","D29460"]
["DENEIGEMENT BOTELHO","D29490"]
["DENEIGEMENT D.J.M.N.","D29500"]
["DÉNEIGEMENT FORMULE 1","D29525"]
["DENEIGEMENT STEPHANE LEBEAU ENR.","D29600"]
["DEPANINFO","D30000"]
["DEPANNEUR LA VILLA","D30100"]
["DEPANNEUR LAPIERRE","D30150"]
["DEPANNEUR MA-MI/2947-6751 QUÉBEC INC.","D30175"]
["DÉSERTÉRIC","D30310"]
["DESJARDINS JEAN-PIERRE","D30375"]
["DES-MOTS-O-GALOP","D30250"]
["DESSAU INC.","D30600"]
["DÉVELOTECH INC.","D30700"]
["DICOM EXPRESS","D31000"]
["DIST. RICHARD JETTÉ INC.","D31810"]
["DISTRIBUTION B.L.M. ENR.","D31735"]
["DISTRIBUTION N. ROY","D31790"]
["DISTRIBUTION PRAXAIR","D31800"]
["DISTRIBUTION SPORTS LOISIRS G.P. INC.","D31825"]
["DISTRIBUTIONS ABM INC.","D31725"]
["DISTRIBUTIONS YVES LEROUX","D31875"]
["DIVERS-NON CRÉÉ","*"]
["DONAT BILODEAU EXPERTS-CONSEILS INC.","D31900"]
["DRAPEAU VÉRONICA","D31950"]
["DRL-BEAUDOIN","D32000"]
["DROITS ET LIBERTÉS","D32010"]
["DUBÉ FRANCE","D32025"]
["DUBE ROGER, DISTRIBUTEUR","D32050"]
["DUFORT BEAUCAGE AUDREY","D32075"]
["DUFORT ET LAVIGNE LTÉE","D32100"]
["DUFORT JOCELYNE","D32125"]
["DUFORT RICHARD","D32375"]
["DUFOUR  BOB","D32450"]
["DUGAS CLAUDE","D32500"]
["DUGAS GUILLAUME","D32525"]
["DUNTON RAINVILLE EN FIDUCIE","D32650"]
["DUNTON RAINVILLE, SENC","D32625"]
["DUPONT GILLES, ARPENTEUR","D32700"]
["DUPUIS FANNY","D32725"]
["DUQUETTE DANIEL","D32750"]
["DYSTROPHIE MUSCULAIRE CANADA","D32850"]
["E.B.I. ENVIRONNEMENT INC.","E32910"]
["E.M.P.C.","E34000"]
["EAU-THENTIQUE TRANSPORT INC. (L')","E32905"]
["ECHELLES C.E. THIBAULT INC.","E32925"]
["ECOLE SECONDAIRE DE L'ACHIGAN","E32950"]
["EDDYNET INC.","E33000"]
["EDITIONS YVON BLAIS INC. (LES)","E33525"]
["EFEL EXPERTS-CONSEILS","E33535"]
["ELECTRO-CONCEPT P.B.L INC.","E33800"]
["ELECTROMECANO","E33825"]
["ELECTRONIQUE ADDISON ST-JÉRÔME INC.","E33840"]
["ELECTRONIQUE SECURITE THOMAS LTEE","E33850"]
["ELITE FORD (1978) INC.","E33975"]
["ELITE SECURITE INVESTIGATION INC.","P75910"]
["ELLE QUÉBEC","E33990"]
["EMBALLAGE DANIEL RIVEST INC.","E34100"]
["EMERY ARCHITECTE INC.","E34200"]
["EMOND COLETTE","E34250"]
["EMRN 2008","E34275"]
["ENDRESS + HAUSER CANADA LTEE","E34300"]
["ENLEVEMENT  DE LA NEIGE LAURENTIDE LTEE","E34425"]
["ENTREPOT EN FOLIE","E35325"]
["ENTREPRISE JEAN BEAUREGARD","E35628"]
["ENTREPRISES B. CHAMPAGNE INC.","E35630"]
["ENTREPRISES BOURGET INC. (LES)","E35635"]
["ENTREPRISES DANIEL BEAUCHAMP","E35650"]
["ENTREPRISES DENIS DESJARDINS","E35660"]
["ENTREPRISES F.F.","E35685"]
["ENTREPRISES FRANCOIS ROY","E35675"]
["ENTREPRISES GASPARD INC.","E35700"]
["ENTREPRISES GUY BEAULIEU 2009 INC.","E35705"]
["ENTREPRISES J. & F. CHARLAND INC.","E35710"]
["ENTREPRISES MICHEL BEAUPIED INC.","E35735"]
["ENTREPRISES MICHEL FOREST INC.","E35740"]
["ENTREPRISES OMEX (LES)","E35745"]
["ENTREPRISES R. & S. CHARLAND INC.","E35755"]
["ENTREPRISES ROY S.E.N.C.","E35760"]
["ENTREPRISES STEVE RACETTE ENR. (LES)","E35762"]
["ENTREPRISES YVON HARNOIS INC.","E35765"]
["ENVIRO SANI-NORD","E35850"]
["ENVIRONEX","E36000"]
["ENVIRONOR CANADA INC.","E36075"]
["ENVIROSERVICES","E36100"]
["EQUIP. DE BUREAU ROBERT LEGARE LTEE","E36220"]
["EQUIPEMENTS R. DAOUST LTEE","E36675"]
["EQUIPEMENTS RECREATIFS JAMBETTE INC.","E36750"]
["ESCADRON 879 SAINT-LIN","E36900"]
["ESTIMATEURS PROFESSIONNELS","E37125"]
["EUGENIE TECHNOLOGIE INC.","E37150"]
["EURETECH ENR.","E37200"]
["EXCAVATION C. BEAUCHAMP INC.","E37350"]
["EXCAVATION F. LONGPRÉ LTÉE","E37400"]
["EXCAVATION J. BOTELHO INC.","E37500"]
["EXCAVATION JULES DODON INC.","E37525"]
["EXCAVATION MARC VILLENEUVE INC.","E37600"]
["EXCAVATION PIERRE GIRARD INC.","E37800"]
["EXCAVATION REJEAN ALLAIRE LTEE","E37850"]
["EXCAVATION YVON BENOIT","E38000"]
["EXCAVATIONS GILLES ST-ONGE INC.","E37425"]
["EXHIBIT (L')","E38050"]
["EXPERTISE NEUROSCIENCES","E38100"]
["EXPO RIVE-NORD","E38250"]
["EXPRESS MAG","E38300"]
["F.Q.M.","F38475"]
["FABRIQUE BIENHEUREUSE ÉMILIE-GAMELIN","F38600"]
["FAHEY + ASSOCIÉS","F38700"]
["FÉDÉRATION QUÉBÉCOISE DE L'AUTISME","F38800"]
["FÉLIX SÉCURITÉ INC.","F38850"]
["FERME BASTIEN INC","F38925"]
["FERME EDDY FUOCO","F39200"]
["FERME PIERRE OUELLETTE ENR.","F39650"]
["FERMES GUILBAULT ENR. (LES)","F39575"]
["FESTIVAL ACADIEN DE LA NOUVELLE-ACADIE","F39700"]
["FESTIVAL DE LANAUDIERE","F39825"]
["FIBRE DE VERRE RAWDON","F39827"]
["FIBRES OPTIQUES DU QUEBEC LTEE (LES)","F39828"]
["FINANCIERE BANQUE NATIONALE INC.","F39840"]
["FINANCIÈRE GLOSTAR/CRÉDIT COM. CANADA IN","D29455"]
["FIREFIGHTING IN CANADA","F39845"]
["FIX-AUTO ST-LIN-LAURENTIDES","F39850"]
["FLAGHOUSSE","F39875"]
["FLEURISTE FLEURS D'EPOQUE","F40005"]
["FLEURS PLANTES JARDINS","F40000"]
["FONDATION COLLEGE ESTHER-BLONDIN","F40275"]
["FONDATION DES MALADIES DU COEUR","F40500"]
["FONDATION RUES PRINCIPALES","F40575"]
["FONDS D'INFORMATION SUR LE TERRITOIRE","F40600"]
["FORAGE RC INC.","F40800"]
["FORMATION QUÉBEC","F40925"]
["FORMICIEL INC.","F40950"]
["FORMULES MUNICIPALES INC","F41175"]
["FOSSES SEPTIQUES LORTIE","F41625"]
["FOURNISSEUR OCCASIONNEL","*"]
["FOYERS RUSTIQUES INC. (LES)","F42175"]
["FQOLT","F42180"]
["FRANCOIS DUFORT AUTO ELECTRIQUE","F42200"]
["FREDERIC FRANCOISE, BRIGADIERE","F42300"]
["FUNIO","F42500"]
["G. DOYON CUISINE INC.","G42600"]
["G.P.A. EXPERTS-CONSEILS","G43000"]
["GADBOIS DIÉSEL","G43150"]
["GAGNÉ CLAIRE","G43350"]
["GALARNEAU SAUVÉ INC. EN FIDÉICOMMIS","G43450"]
["GARAGE DIESEL BLAINVILLE","G43500"]
["GARAGE LUSSIER INC.","G44100"]
["GARAGE MARCIL","G44250"]
["GARAGE PRUD'HOMME INC.","G44375"]
["GARIEPY ROBERT","G44450"]
["GARON ALAIN","G44500"]
["GAZ METRO","G44775"]
["GAZONNIERE LAUZON & FRERES INC.","G45000"]
["GENEQ INC.","G45150"]
["GENERAL BEARING SERVICE INC.","G45200"]
["GENERATRICE DRUMMOND","G45225"]
["GÉRALD COLLIN SPORT INC.","G45350"]
["GESTAR INC.","G45460"]
["GESTION D'ACHATS RAM","G45475"]
["GESTION GMS INC.","G45520"]
["GESTION USD INC. (USD LOUBAC)","G45560"]
["GIL-BER INC.","G45570"]
["GILLES DUMONT & FILS","G45700"]
["GILLES RENAUD NOTAIRE","G45650"]
["GIRARD-HÉBERT INC","G45750"]
["GIROUX STÉPHANE, POMPIER","G45760"]
["GIVESCO INC.","G45775"]
["GLOBOCAM (ANJOU) INC.","G45785"]
["GOBEILLE INC.","G45810"]
["GO-ÉLAN","G45805"]
["GRADTEK","G45825"]
["GRANDCHAMP CHAPITEAUX INC.","G45826"]
["GRAVEL DANIELLE","G45827"]
["GRENIER CHEVROLET BUICK GMC","G45830"]
["GRONDIN ET ASSOCIE","G45850"]
["GROUPE BOROY NOTIPLEX","G46010"]
["GROUPE BR MÉTAL","E45869"]
["GROUPE CLR","G45870"]
["GROUPE JCL","G45890"]
["GROUPE LEFEBVRE M.R.P. INC.","G46040"]
["GROUPE LUSSIER INC.","G46050"]
["GROUPE MEUNIER,  ARP.-GÉOMÈTRES INC.","G46100"]
["GROUPE RÉAL JEAN","G46110"]
["GROUPE SECUR PLUS","G46175"]
["GROUPE SECURITE COMMERCIALE S.A. INC.","G46200"]
["GROUPE SÉCURITÉ GARDA SENC","G46250"]
["GROUPE ULTIMA INC","G46400"]
["GROUPE VILLENEUVE INC.","G46410"]
["GRUES GSTL INC.","G46420"]
["GUILLEVIN INTERNATIONAL CIE.","G46450"]
["HD COM","H47250"]
["HÉLOÏSE THIBODEAU, ARCHITECTE","H47400"]
["HEROUX ANDRE, DIR. T. PUBLICS","H47925"]
["HÉROUX DANIEL","H47950"]
["HETEK SOLUTIONS INC.","H48000"]
["HEWITT ÉQUIPEMENT LIMITÉE","H48200"]
["HORIZON MULTIRESSOURCE INC.","H48700"]
["HQ DISTRIBUTION INC.","H48900"]
["HYDRAULUC","H49400"]
["HYDRO SEMENCE ÉLITE","H50450"]
["HYDRO-QUEBEC","H49500"]
["ICO TECHNOLOGIES INC.","I50475"]
["IDÉES DE MON JARDIN (LES)","I50500"]
["ILLUMIN'ACTION","I50700"]
["IMA COULEUR","I50850"]
["IMPRIMERIE MAURICE SIMARD INC.","I51000"]
["IMPRIMES ADMINISTRATIFS CONTINUUM LTEE","I51200"]
["INDUSTRIES A. MERGL INC.","I51410"]
["INDUSTRIES DE TRAITEMENT RIMAC INC","I51475"]
["INDUSTRIES FIPEC INC.","I51420"]
["INDUSTRIES NORMROCK INC.","I51500"]
["INDUSTRIES PERMO INC.","I51550"]
["INFORMATIQUES UNISOFT","I51610"]
["INGEMAX INC.","I51625"]
["INNOTEX INC.","I51650"]
["INNOVATION ROUTIÈRE REFCON INC.","I51675"]
["INNOVISION +","I51685"]
["INSIGHT CANADA INC.","I51700"]
["INSPECTEUR CANIN INC.","I51750"]
["INSPECTION MECANIQUE ST-JEROME","I52000"]
["INSPECTIONS D'ECHELLES DENIS THIBAULT","I52050"]
["INTELIA, UNE DIVISION DE CTAQ","I52100"]
["INTER PROPANE","I52300"]
["INTERNATIONAL PROTECTION INCENDIE INC.","I52400"]
["INTERPEUPLE INC.","I52410"]
["INTERSPORT","I52430"]
["ISOLATION ISOBEC INC.","I52445"]
["ISOTECH INSTRUMENTATION INC.","I52450"]
["IWEB TECHNOLOGIES INC.","I52465"]
["J.B.DESCHAMPS INC.","J52475"]
["J.C. LAPALME INC.","J52480"]
["J.C. PERREAULT, DIVISION ÉCONO","J52485"]
["J.N.A. LEBLANC ÉLECTRIQUE INC.","J52490"]
["J.-RENÉ LAFOND INC.","J52493"]
["J.S. BOISVERT INC.","J52495"]
["JADICE ÉBÉNISTERIE","J52500"]
["JARDINERIE DU CARREFOUR (LA)","J52525"]
["JASON FUOCO ENR.","J52575"]
["JDM GEO INC.","J52600"]
["JEAN LOUE TOUT","J52650"]
["JEAN VILLENEUVE SABLIERE","J52800"]
["JEAN-PIERRE MARTIN INC.","J52750"]
["JETTÉ SYLVAIN, CORNEMUSEUR","J52825"]
["JOHN MEUNIER INC.","J52850"]
["JOLI-COEUR  LACASSE S.E.N.C.R.L.","J52900"]
["JOLIETTE DODGE CHRYSLER LTÉE","J52950"]
["JORDAL INC.","J53100"]
["JUTEAU RUEL INC","J53330"]
["JUTEAU RUEL INC.","J53340"]
["KALITEC","K53360"]
["KEMIRA WATER SOLUTION CANADA INC.","K53400"]
["KENWORTH ST-JÉRÔME","K53425"]
["KIWIGRAPHIK","K53450"]
["KUN-NIPIU FALARDEAU ISABELLE","K53475"]
["L.R. BRIEN ET FILS LTEE","L53550"]
["LA FABRIQUE INC.","L53700"]
["LABORATOIRE CAR-MO 2002 INC.","L53960"]
["LABORATOIRE CONSTRUCTION 2000 INC.","L53975"]
["LACASSE FRANÇOIS","L54025"]
["L'ACTUALITE","L53500"]
["LAFORTUNE TRAITEUR","L54100"]
["LAJEUNESSE ET FILS","L54350"]
["LANAUCO LTEE","L54800"]
["LANTHIER SYLVIE","L54870"]
["LAPIERRE & FRERE ENR.","L54950"]
["LAPOINTE SPORTS","L54975"]
["L'ARCHEVÊQUE & RIVEST LTÉE","L53525"]
["LAROCHE ARCHITECTE","L55100"]
["LATENDRESSE ASPHALTE INC.","L55350"]
["LAURENTIDES EXPERTS CONSEILS","L55450"]
["LAURENTIDES FORD INC (DES)","L55500"]
["LAURENTIDES LOCATION ENR.","L55575"]
["LAURIN LAURIN INC.","L55650"]
["LAVAGE CONCEPT","L55750"]
["LAVAGE MOBILE MULTI TACHES","L55775"]
["LAVALLEE COLETTE","L55800"]
["LC MEDIA INC.","L56000"]
["LCM  ÉLECTRIQUE INC.","L56010"]
["LE 1740 TAPIS PRÉLARTS INC.","L56020"]
["LE CORRE & ASSOCIES","L56025"]
["LE LANAUDOIS INC.","L56050"]
["LE LUNDI","L56075"]
["LEBLANC ILLUMINATIONS-CANADA","L56200"]
["LEGER ERIC, AGRONOME","L56350"]
["LEPAGE PRUD'HOMME SHADE","L56500"]
["LEROUX BEAUDOIN HURENS & ASSOCIÉS","L56650"]
["LETTRAGE ST-LIN","L56925"]
["LEVASSEUR LOUISE","L57200"]
["LEVERT PASCAL, ENTREPRENEUR","L57300"]
["LÉVESQUE & ASSOCIÉS S.E.N.C.R.L.","L57350"]
["LEXIS MÉDIA INC.","L57425"]
["LIBRAIRIE LULU INC.","L58050"]
["LIBRAIRIE MARTIN INC.","L58100"]
["LIBRAIRIE RAFFIN INC.","L58200"]
["LIBRAIRIE RENAUD-BRAY","L58250"]
["LIGNBEC, DIV. ENTREPRISE T.R.A. 2011 INC","L58400"]
["LIGNCO SIGMA INC.","L58425"]
["LIGNES MASKA","L58435"]
["LIGNES PLUS M.L.","L58450"]
["LIMOGES REAL, TRAPPEUR","L58600"]
["LITHO LAURENTIDES 2001 INC.","L58850"]
["LITHOGRAPHIE ANDRÉ LACHANCE INC.","L58800"]
["LOCATION A ET C INC. (LOU-TEC)","L58950"]
["LOCATION D'OUTILS '2000' ENR.","L59175"]
["LOCATION D'OUTILS SIMPLEX","L59180"]
["LOCATION ÉCLAT ROC","L59200"]
["LOCATION HEWITT INC.","L59250"]
["LOCATION PIERRE JETTE INC.","L59300"]
["LOCATION SAVA EN FÊTE","L59310"]
["LOGICIELS SPORT-PLUS INC.","L59500"]
["LOISIR ET SPORT LANAUDIERE","L59700"]
["LORTIE PIERRE","L59875"]
["LOULOU","L59925"]
["LOUTIL DE LA PUB INC.","L60000"]
["LUMEN","L60010"]
["M.& W. THERRIEN INC.","M60025"]
["M.R.C. MONTCALM","M60300"]
["M.R.P.B.M.","M60560"]
["M.S.D.A.","M60575"]
["MABAREX INC.","M60590"]
["MACHINERIES NORDTRAC LTÉE","M60600"]
["MACHINERIES SAINT-JOVITE INC. (LES)","M60610"]
["MAÇONNERIE R.P.C.P. INC.","M60645"]
["MACONNERIE Y. BOUCHARD INC.","M60650"]
["MAGAZINE ANIMAL","M60670"]
["MAGAZINE DELIRE","M60700"]
["MAGAZINE FULL FILLE (AMYLITHO INC.)","M60730"]
["MAGAZINE PARENTS ADOS","M60800"]
["MAGAZINE VITA","M61000"]
["MAGAZINE VIVRE","M61010"]
["MAGIC LIGHT","M61060"]
["MAGIE DES FEUX DU CIEL (LA)","M61100"]
["MAGIN 3798267 CANADA INC.","M61150"]
["MAISON & DEMEURE","M61210"]
["MAISON DES JEUNES ST-LIN/ LAURENTIDES","M61200"]
["MAISONNEUVE MATHIEU","M61225"]
["MAK CONCEPT","M61400"]
["MALLETTE GHISLAIN","M61600"]
["MALOUIN ANDRE","M61650"]
["MANOREX","M61700"]
["MANTHA EMMANUEL, EMONDEUR","M61750"]
["MAPART CORPORATION","M61800"]
["MARAÎCHERS DU RUISSEAU INC.","M61825"]
["MARAÎCHERS MG INC. (LES)","M61850"]
["MARCEAU SOUCY BOUDREAU, AVOCATS","M61860"]
["MARIO CHRETIEN, DISTRICT #3","M62300"]
["MARQUAGE & TRAÇAGE DU QUÉBEC","M62420"]
["MARSOLAIS ROBERT","M62425"]
["MARSOLAIS ROSIANE","M62430"]
["MARTECH INC.","M62450"]
["MARTEL ALAIN","M62500"]
["MARTEL MARCEL","M62525"]
["MARTEL SYLVAIN","M62550"]
["MARTIN CÉRAT EXCAVATION","M62800"]
["MARTIN DOMINIC","M63000"]
["MARTIN GRANGER, INSTRUCTEUR","M63050"]
["MASKIMO CONSTRUCTION INC.","M63140"]
["MASSE PATRICK, MAIRE","M63100"]
["MASSICOTTE MALONEY,  ARTICTECTES","M63150"]
["MAURICE GABRIEL","M63160"]
["MAXI BAC","M63180"]
["MC VENTILATION","M63200"]
["MDF MÉCANIQUE INC.","M63210"]
["MÉCANIQUE CGL INC.","M63260"]
["MÉCA-PRO #31783","M63250"]
["MÉDI SECUR","M63270"]
["MEDIAS TRANSCONTINENTAL S.E.N.C. (RO)","M63280"]
["MEGA-TECH","M63325"]
["MÉNARD ÉVELINE","M63400"]
["MESSAGERIES DYNAMIQUES","M63450"]
["MESSIER CLAUDINE","M63460"]
["METAL POLE LITE","M63470"]
["MFOUAZABANTOU AUDE","M63525"]
["MICHELIN NORTH AMERICA (CANADA) INC","M63600"]
["MICROTEC SECURI-T","M63625"]
["MINES SELEINE","M63690"]
["MINISTERE REVENU DU QUEBEC","M64525"]
["MINISTRE DES FINANCES","M63700"]
["MINISTRE DU REVENU DU QUEBEC","M64575"]
["MIRABAU/SÉRIGRAPHIE","M64650"]
["MOISSON LANAUDIERE","M64800"]
["MOREAU AUTOMOBILE LTÉE","M65250"]
["MOREL ET FILS ST-LIN","M65475"]
["MORIN JONATHAN","M65600"]
["MORIN YVETTE LORTIE","M65700"]
["MORISSETTE LYNDA","M65925"]
["MOTEURS & CONTROLES DESJARDINS","M66050"]
["MOTEURS ÉLECTRIQUES GAUTHIER INC.","M66060"]
["MOTIVPLUS","M66100"]
["MULTI-ROUTES INC.","M66235"]
["MUN. VILLAGE ST-ALEXIS","M67125"]
["MUNICIPALITE  SAINTE-JULIENNE","M66375"]
["MUNICIPALITÉ DE SAINT-ALEXIS","M66575"]
["MUNICIPALITE DE SAINT-CALIXTE","M66825"]
["MUNICIPALITE DE SAINT-CHARLES-BORROMEE","M66850"]
["MUNICIPALITE DE SAINT-ESPRIT","M66600"]
["MUNICIPALITE DE SAINT-JACQUES","M66950"]
["MUNICIPALITE DE ST-ROCH-OUEST","M67050"]
["MUNICIPALITE PAR. ST-LIGUORI","M66300"]
["MUNICIPALITE STE-SOPHIE","M67500"]
["MUTUELLE MUNICIPALITES QUEBEC","M67800"]
["MYLÈNE GILBERT, L. MALENFANT & I. GAGNÉ","M67900"]
["NANCIES","N67925"]
["NATIONAL CAR RENTAL CANADA INC","N67950"]
["NATIONAL VACUUM SERVICES MUNICIPAUX INC.","N68000"]
["NATURE SAUVAGE","N68025"]
["NATURE-ACTION QUÉBEC","N68010"]
["NEDCO DIV. REXEL CANADA INC.","N68050"]
["NEOPOST CANADA LTEE","N68100"]
["NETTOYAGE EXPERTS","N68150"]
["NICOLE ALEXANDRE (MONSIEUR)","N68200"]
["NORDAK MARINE","N68300"]
["NORDIKEAU INC.","N68500"]
["NORTIN INC.","N68575"]
["NOVA ENVIROCOM INC.","N68600"]
["NOVA MOBILIER","N68625"]
["NUIT BLANCHE","N68650"]
["O.M.H. SAINT-LIN-LAURENTIDES","O68875"]
["ODYSSÉE V.O.I.P.","O68890"]
["OFFICE MUNICIPAL D'HABITATION","O68900"]
["OMNI-TECH SPORTS","O69200"]
["ORIZON MOBILE","O69400"]
["O'TEC TECHNOLOGIES","O68750"]
["OUELLET MÉLANIE","O69600"]
["OUELLET STÉPHANE","O69625"]
["OUTILLAGES EXPRESS","O69875"]
["OXYGÈNE MILLÉNAIR INC.","O69890"]
["OZÉ MA BULLE","O69900"]
["P.H. VITRES D'AUTOS INC.","P70200"]
["PAGES JAUNES","P70600"]
["PALAIS DE JUSTICE","P70650"]
["PAPETERIE ALAIN CONTANT INC.","P70875"]
["PAQUIN ANDRE","P71050"]
["PAQUIN GERALD","P71100"]
["PARAFIAMMA SOLUTIONS INC.","P71120"]
["PARÉ MARIE-CLAUDE","P71130"]
["PARIS, LADOUCEUR & ASSOCIÉS INC.","P71150"]
["PAROISSE ST-ROCH-DE-L'ACHIGAN","P71325"]
["PATIO DRUMMOND LTÉE","P71600"]
["PÂTISSERIE CHOCOLATERIE DU POITOU","P71700"]
["PAVAGE DES MOULINS INC.","P71550"]
["PAVAGE E. PERREAULT INC.","P71560"]
["PAVAGES MULTIPRO INC.","P71551"]
["PCG CARMON","P71800"]
["PEINTURE DÉCOR DES MOULINS","P71925"]
["PEINTURE LA DIFFÉRENCE INC.","P71900"]
["PELLETIER EXCAVATION INC.","P72000"]
["PELLETIER LINE","P72050"]
["PÉLOMIX INC.","P72100"]
["PELTI, VITRES TEINTÉES","P72150"]
["PÉPINIÈRE DES HAUTEURS","P72400"]
["PERCUSSIONS SULTANOSTO ENR.","P72500"]
["PETITE CAISSE","P72675"]
["PG SOLUTIONS INC.","P72800"]
["PHARMACIE JEAN-FRANÇOIS LAFRANCE","P73000"]
["PICARD CREVIER GUERTIN ET ASSOCIES INC.","P73200"]
["PIECES D'AUTO J.P. RACETTE INC.","P73575"]
["PIECES D'AUTO MONTCALM INC.","P73578"]
["PIECES D'AUTO PILON INC.","P73580"]
["PIECES DE CAMION REMI LAUZON & FILS INC.","P73350"]
["PIERRE CREVIER ENR.","P73625"]
["PILON MARYSE","P73675"]
["PINARD FORD STE-JULIENNE","P73685"]
["PINARD MOTO","P73690"]
["PISCINE ET SPA LANAUDIÈRE","P73650"]
["PISCINES SOUCY INC.","P73750"]
["PIZZA PICCOLO","P73830"]
["PLANIA INC.","P73832"]
["PLASTIQUES CY-BO INC. (LES)","P73835"]
["PLOMBERIE BRÉBEUF INC.","P73840"]
["PLOMBERIE CHAUFFAGE DU COTEAU","P73900"]
["PLOMBERIE ÉRIC LÉVESQUE INC.","P74025"]
["PLOMBERIE JFH-VÉZINA","P74040"]
["PLOMBERIE J-L MARTIN","P74045"]
["PLOMBERIE MIC INC.","P74050"]
["PLOMBERIE MONTCALM INC.","P74060"]
["PLOMBERIES PDA-VÉZINA","P73850"]
["PLOURDE JÉRÉMY","P74100"]
["PLUME LIBRE MONTCALM","P74125"]
["PNEUS BÉLISLE ST-JÉRÔME","P74175"]
["PNEUS TECH 2000","P74225"]
["POITRAS ASPHALTE & DU NORD","P74300"]
["POLYGRAVURE LAVAL","P74400"]
["POMPES À BÉTON EXCEL INC.","P74450"]
["PORTE DES LAURENTIDES (LA)","P74475"]
["PORTES ET FENÊTRES CONCEPT NORD-SUD","P74495"]
["PORTES ET FENETRES DVR INC.","P74500"]
["PORTES LALIBERTE INC.","P74510"]
["PORTES UNIES ST-MICHEL","P74525"]
["POSTAGE ON CALL (POC)","P74528"]
["POSTES CANADA","P74530"]
["PRECISION 2000 INC.","P74540"]
["PRESSE COMMERCE CORPORATION","P74600"]
["PRÉVOST MARIE-HÉLÈNE","P74760"]
["PREVOYANTS INC. (LES)","P74800"]
["PRO IMPACT DISTRIBUTION INC.","P75000"]
["PROCLEM","P75300"]
["PROCOM","P75400"]
["PRODUCTIONS ACME BENT","P75475"]
["PRODUCTIONS ANIMUSE INC","P75480"]
["PRODUCTIONS IMAGINATION","P75490"]
["PRODUCTIONS MCH INC. (LES)","P75495"]
["PRODUCTIONS MÉGA-ANIMATION INC. (LES)","P75500"]
["PRODUITS RE-PLAST INC.","P75560"]
["PRODUITS SANITAIRES DES PLAINES INC","P75600"]
["PROGRAMME D'ENSEIGNEMENT SPORTBALL","P75715"]
["PROGRAMME KARIBOU","P75700"]
["PROMOTION A-Z","P75800"]
["PROMOTIONS TORNADE","P75805"]
["PROMOTIONS XPRESS INC.","P75825"]
["PRONATURE","P75850"]
["PROTEGEZ-VOUS","P75905"]
["PUBLICATIONS CCH LTEE","P76500"]
["PUBLICATIONS DU QUEBEC (LES)","P76950"]
["PUBLICITE MARCEL BARBIER INC.","P77250"]
["PUITS LAJEUNESSE","P77300"]
["PUROLATOR","P77400"]
["QUÉBEC VERT","Q77475"]
["QUINTAL INC.","Q77575"]
["R & G ARGUIN INC.","R77625"]
["R.M. LEDUC & CIE INC.","R77650"]
["R.S.P.I.","R77680"]
["RABAIS CAMPUS","R77690"]
["RACETTE THERESE","R77700"]
["RADIATEUR LA PLAINE","R77740"]
["RADIATEUR ST-LIN ENR.","R77750"]
["RADIO NORD-JOLI  INC.","R77790"]
["RAINVILLE CHRISTIAN","R77810"]
["RAJOTTE NICOLE","R77815"]
["RAVEN MÉDIA INC.","R77823"]
["RAYMOND BLONDIN TRANS.INC.","R77825"]
["RAYMOND BOUCHARD EXC. INC","R77850"]
["RAYMOND CHABOT GRANT THORNTON","R77875"]
["RCI ENVIRONNEMENT","R77900"]
["REAL HUOT INC.","R78300"]
["RECEVEUR GENERAL DU CANADA","R78525"]
["RÉGIE DE POLICE DE MONTCALM","R78750"]
["REGIE DU BATIMENT DU QUEBEC","R78800"]
["REGROUPEMENT FOLKL. BASSES LAURENTIDES","R78840"]
["REGROUPEMENT QUEBEC OISEAUX","R78850"]
["REGULVAR","R78900"]
["REJEAN ALLAIRE LTEE","R79000"]
["RELATIONS (REVUE)","R79040"]
["REMBOUR-TOUT","R79100"]
["REMORQUAGE MAXIMUM","R79200"]
["REMORQUES MEGCASS INC.","R79300"]
["RÉPARATION N.N. ENR.","R79350"]
["RÉPARATIONS S.M. INC.","R79400"]
["RESIDENCE COOP. QUATRE SOLEILS INC.","R79425"]
["RESIDENCE FUNERAIRE","R79435"]
["RÉSIDENCE LAURIER PHASE 3","R79450"]
["RESSORT MIRABEL INC.","R79475"]
["RESSORTS STE-ANNE INC.","R79500"]
["RESSOURCES ENVIRONNEMENT","R79525"]
["RESSOURCES FORESTIÈRES BIOTIQUES INC.","R79550"]
["RESTAURANT CHEZ LILY","R79600"]
["RH + MEDICAL INC.","R79625"]
["RICARDO MÉDIA INC.","R79640"]
["RICHARD LORTIE & FILS INC.","R79650"]
["RICHELIEU HYDROGÉOLOGIE INC.","R79700"]
["ROBERTLEMIRE","R80100"]
["ROGERS","R80400"]
["ROLLIN PHILIPPE","R80200"]
["ROY GUILLAUME","R80450"]
["ROYAL PYROTECHNIE INC.","R80500"]
["S.D. ÉLECTRONIQUE ENR.","S80560"]
["S.T.I. INC","S80620"]
["S85500","S87250"]
["SABLES FOURNEL & FILS INC. (LES)","S81000"]
["SABLES THOUIN INC. (LES)","S81245"]
["SACS INDUSTRIELS INC.","S81600"]
["SADC, ACHIGAN-MONTCALM","S81700"]
["SAFARIR","S81725"]
["SAINTE-SOPHIE","S81810"]
["SAINT-ROCH-DE-L'ACHIGAN","S81800"]
["SALLE L'OPALE","S81825"]
["SANBEC (1981) LTÉE","S81827"]
["SAUCIER CONSEIL INC.","S81835"]
["SAVOIE MULTI-SERVICES ENR.","S81840"]
["SCIAGE DE BETON d.c. QUEBEC INC.","S81850"]
["SCIERIE SAINTE-SOPHIE INC.","S81875"]
["SCOLART","S81890"]
["SCOURNEAUX STEPHANE","S81900"]
["SEAO-CONSTRUCTO","S82126"]
["SEBCI INC.","S82127"]
["SECURIPRO INTERNATIONAL","S82130"]
["SECURITE DES DEUX-RIVES LTEE","S82150"]
["SECURITE INCENDIE MARTIN MAILLÉ ENR.","S82200"]
["SÉCURITÉ LANAUDIÈRE INC.","S82210"]
["SEL CARGILL LIMITÉE","S82575"]
["SERDY MÉDIA INC.","S83000"]
["SERRES GAUTHIER INC.","S83025"]
["SERRURIER DE LANAUDIÈRE","S83150"]
["SERRURIER LAURENTIEN ENR.","S83175"]
["SERRURIER MRC MONTCALM","S83185"]
["SERVICE DE PISCINE CAROL'EAU INC.","S83250"]
["SERVICE D'ENTRAIDE","S83200"]
["SERVICES D'ÉVÈNEMENTS SPÉCIAUX (SES)","S83210"]
["SERVICES EN TECHNOLOGIE INFORMATIQUE","S83820"]
["SERVICES EXP. INC. (LES)","S83300"]
["SERVICES PREHOSPITALIERS","S83800"]
["SERVICES PRO-SECURITE INC.","S83815"]
["SERVICES SANITAIRES ST-ANTOINE INC.","S83810"]
["SHERIDAN NATHALIE","S83823"]
["SHERIF DE JOLIETTE","S83825"]
["SHOOTER SHOP","S83840"]
["SHRED-IT INTERNATIONAL ULC","S83842"]
["SIFTO CANADA INC.","S83845"]
["SIGNÉ M","S83850"]
["SIGNEL SERVICES INC.","S83875"]
["SINTRA INC. (DIVISION OUEST)","S83925"]
["SM CANADA","S83900"]
["SM ÉVÈNEMENTS SPÉCIAUX INC.","S83910"]
["SOC.  HORTICULTURE & ECOLOGIE","S86625"]
["SOCADIS INC.","S84300"]
["SOCIETE ASSURANCE AUTOMOBILE","S84375"]
["SOCIETE CANADIENNE DES AUTEURS","S85050"]
["SOCIETE CANADIENNE DU CANCER","S85725"]
["SOCIETE DE RECHERCHE SUR LE CANCER","S86175"]
["SOCIÉTÉ DE SAUVETAGE","S86200"]
["SODEM INC.","S86700"]
["SODEP (VIE DES ARTS)","S86725"]
["SOFTCHOICE CORPORATION","S86750"]
["SOLS CHAMPLAIN INC.","S86825"]
["SOLUTION ECO-FITT INC.","S86850"]
["SOPLEC INC.","S86910"]
["SOUDURE CONCEPT PRO","S87025"]
["SOUDURE G.PAQUIN INC.","S87050"]
["SOUDURE JACQUES POULIN INC.","S87075"]
["SOURDIF ÉLISA-ANN","S87080"]
["SOUS-VETEMENTS U.M. INC. (LES)","S87200"]
["SPORT MÉDIA","S87255"]
["SSE ENVIRONNEMENT INC.","S80800"]
["SSQ, SOCIÉTÉ D'ASSURANCE INC.","S87275"]
["STAGELINE SCÈNE MOBILE INC.","S87278"]
["STAR INC.","S87280"]
["STAT. SERVICE R. CHARBONNEAU","S87525"]
["STATION SERVICE TREMBLAY INC.","S87300"]
["STELEM","S88125"]
["ST-HUBERT ST-LIN","S87276"]
["STRUXAR","S88000"]
["STUDIO Y. FOREST ENR.","S88200"]
["SUISSE NORMANDE INC.","S88250"]
["SUN MÉDIA-SERV.FINANCIERS CENTRALISÉS","S88300"]
["SUPERIEUR PROPANE INC.","S88475"]
["SYNDICAT POMP & POMP DU QUEBEC","S89000"]
["SYNDICAT T. & T. SAINT-LIN-LAURENTIDES","S89100"]
["SYNERGIE ILLUMINATIONS","S89125"]
["SYRACO INC.","S89150"]
["SYSTÈME TEC INC.","S89160"]
["SYSTEMES INTERIEURS J.F.P. INC.","S89165"]
["T3I INC.","T89175"]
["TECHNI PLUS","T89780"]
["TECHNITRONIQUE","T90000"]
["TECHNO DIÉSEL INC.","T90025"]
["TECHNOLOGY RAMP DESIGN INC.","T90050"]
["TECHNYFEU PROTECTION INCENDIE","T90150"]
["TECHSPORT INC.","T90225"]
["TELUS MOBILITE","T90320"]
["TENAQUIP LIMITED","T90325"]
["TENNANT SALES & SERVICE COMPANY","T90330"]
["TERRASSEMENTS LIMOGES & FILS","T90340"]
["TERRE DE CHEZ-NOUS (LA)","T90342"]
["TERREBONNE FORD INC.","T90343"]
["TESSIER, RECREO-PARC INC.","T90345"]
["TETREAULT DENISE","T90348"]
["THERRIEN JACQUES","T90360"]
["THIBAULT & ASSOCIÉS","T90365"]
["THIBAULT CHARLES","T90370"]
["TIM HORTONS","T90380"]
["TOILETTE EXPRESS INC.","T90390"]
["TOILETTES LANAUDIÈRE","T90395"]
["TOILETTES QUEBEC","T90400"]
["TOITURE ET RÉNOVATION DAVE CYR INC.","T90425"]
["TOP GRUES INC.","T90450"]
["TOURISME LANAUDIERE","T90600"]
["TOURNOI  PROVINCIAL DE HOCKEY MINEUR","T90800"]
["TOURNOI DE GOLF CENTRE SPORTIF","T90700"]
["TPELOUSE","T90725"]
["TRAITEUR DANIEL CHOQUETTE","T90900"]
["TRANSPORT FERNAND RACETTE INC.","T91300"]
["TRANSPORT YVES FOURNELLE","T91800"]
["TROCFL","T92025"]
["TROPHÉES & GRAVURES EXPERT","T92050"]
["TUYAUX ANDRE JETTE","T92250"]
["TVA PUBLICATIONS","T92260"]
["TVR TECHNOLOGIES INC.","T92270"]
["ULTRA CLAIR ENGINE FLUIDS INC.","U92300"]
["UN VÉLO UNE VILLE","U92325"]
["UNION DES MUNICIPALITÉS DU QUÉBEC","U92340"]
["UNION-VIE (L')","U92350"]
["UNIROC CONSTRUCTION","U92375"]
["UNITED PARCEL SERVICE","U92400"]
["UNITY PRODUCTIONS","U92425"]
["USINAGE YVON DUGAS INC.","U92475"]
["VASCO ST-LIN-LAURENTIDES","V92480"]
["VÉLO DUO","V92490"]
["VELO QUEBEC EDITIONS","V92500"]
["VENNE BENOIT, DISTRICT #5","V92980"]
["VENTILATION G.R. INC.","V92990"]
["VEOLIA","V92850"]
["VERMEER CANADA INC.","V92925"]
["VERT NATURE","V93000"]
["VERTI STORE TERREBONNE","V93020"]
["VÊTEMENTS HOTTE INC","V93050"]
["VEZINA & ASSOCIES LTEE","V93375"]
["VIDÉOTRON LTÉE","V93750"]
["VIE ET SANTÉ","V93775"]
["VILLE DE L'ASSOMPTION","V94275"]
["VILLE DE L'EPIPHANIE","V94325"]
["VILLE DE MASCOUCHE","V94400"]
["VILLE DE SAINT-EUSTACHE","V94450"]
["VILLE DE SAINT-LIN-LAURENTIDES","V94500"]
["VILLE DE STE-ANNE-DES-PLAINES","V94550"]
["VILLE DE TERREBONNE","V94600"]
["VILLEMAIRE CENTRE DE POMPES INC.","V94610"]
["VINACOUSTIK INC.","V94612"]
["VINCENT RADIATEUR INC.","V94613"]
["VISA-VIE","V94615"]
["VITALITÉ QUÉBEC","V94660"]
["VITRERIE LAFORTUNE INC.","V94700"]
["VITRERIE ST-LIN INC.","V94725"]
["VITRO VISION INC.","V94800"]
["VOIR L58100","L58300"]
["VORTEX","V94810"]
["VOTRE SITE.CA","V94850"]
["VOXSUN TELECOM INC.","V94875"]
["WILSON & LAFLEUR INC.","W94950"]
["WM QUEBEC INC.","W94900"]
["WOLTERS KLUWER QUÉBEC LTÉE","W94960"]
["WURTH CANADA LIMITEE","W94980"]
["XPRESSION NUM.ÉRIC","X95150"]
["YOOPA","Y95100"]
["ZONE TECHNOLOGIE ÉLECTRONIQUE INC.","Z98000"]
["*119989 CANADA INC","*1199001"]
["*123405 CANADA INC","*1234001"]
["*153540 CANADA INC, 155102 CANADA","*1535001"]
["*2632 3345 QUEBEC INC","*2632001"]
["*2742 0322 QUEBEC INC","*2742004"]
["*2742 0322 QUEBEC INC, 123405","*2742001"]
["*2742 0322 QUÉBEC INC.","*VILL005"]
["*2746 3587 QUEBEC INC","*2746001"]
["*2857 7146 QUEBEC INC","*2857008"]
["*2857 7146 QUÉBEC INC.","*CONS009"]
["*3086 8277 QUEBEC INC","*3086001"]
["*3087-4549 QUEBEC INC.","*QUEV003"]
["*3093 4459 QUEBEC INC","*3093001"]
["*3093 4459 QUÉBEC INC.","*9207001"]
["*7269285 CANADA INC","*7269001"]
["*7327374 CANADA INC","*7327001"]
["*8470286 CANADA INC.","*8470286"]
["*9023 1671 QUEBEC INC","*9023001"]
["*9099 7081 QUEBEC INC","*9099001"]
["*9103 5121 QUEBEC INC.","*DE L006"]
["*9118 8722 QUEBEC INC","*9118001"]
["*9136-1857 QUEBEC INC","*2857010"]
["*9139 3454 QUEBEC INC / CONST CDM *M12*","*9139001"]
["*9140-4541 QUEBEC INC","*9140001"]
["*9142 6353 QUÉBEC INC.","*RE/M009"]
["*9146 0071 QUEBEC INC","*9146001"]
["*9156-8295 QUEBEC INC","*9156001"]
["*9165 8575 QUEBEC INC","*9165001"]
["*9176 5065 QUEBEC INC","*9176001"]
["*9176 5065 QUÉBEC INC.","*GRON002"]
["*9177 7771 QUEBEC INC","*9177001"]
["*9177-7771 QUEBEC INC","*9177002"]
["*9181 2131 QUEBEC INC, LES","*9181008"]
["*9181-2131 QUEBEC INC","*9181010"]
["*9181-2131 QUEBEC INC, LES","*9181001"]
["*9183 2428 QUEBEC INC","*9183001"]
["*9189-6761 QUEBEC INC","*9189001"]
["*9191-1677 QUEBEC INC","*9191001"]
["*9193-1287 QUEBEC INC","*9193002"]
["*9193-4281 QUEBEC INC","*9193003"]
["*9197-5532 QUEBEC INC","*9197001"]
["*9199-8260 QUEBEC INC","*9199001"]
["*9201-0511 QUEBEC INC","*9201001"]
["*9207-4327 QUEBEC INC","*9207002"]
["*9207-4327 QUEBEC INC, LES","*9207003"]
["*9207-4327 QUÉBEC INC.","*VILL009"]
["*9212-8768 QUEBEC INC","*9212001"]
["*9214-7735 QUÉBEC INC.","*9214773"]
["*9223 9169 QUEBEC INC","*9176004"]
["*9223 9169 QUÉBEC INC.","*9142001"]
["*9223-1919 QUEBEC INC","*9223003"]
["*9223-9169 QUEBEC INC","*9223001"]
["*9225-0794 QUEBEC INC","*9225001"]
["*9225-8946 QUEBEC INC","*DEVI002"]
["*9243-1535 QUEBEC INC","*9243001"]
["*9247-3396 QUEBEC INC","*9247001"]
["*9248-0805 QUÉBEC INC.","*9248001"]
["*9255-8469 QUEBEC INC","*9255001"]
["*9257-6024 QUEBEC INC","*9257001"]
["*9258-4069 QUEBEC INC","*9258002"]
["*9265-5679 QUEBEC INC","*9265001"]
["*9308-7039 QUEBEC INC","*9308001"]
["*9332 6270 QUÉBEC INC.","*MOTT001"]
["*A. B. C. FOSSES SEPTIQUES INC.","*ABC FOS"]
["*ACTION CONSTRUCTION INFRASTRUCTURE INC.","*ACTI001"]
["*ALAGIA CARMELA","*ALAG001"]
["*ALAIN GENDRON","*GEN01"]
["*ALARIE YVES","*ALAR001"]
["*ALBERT DORINE","*ALBE003"]
["*ALBERT JULIEN, CAPITAINE","*ALBE004"]
["*ALEX GIRALDEAU","*GIRA008"]
["*ALEXANDRE NICOLE","*ALEX001"]
["*ALLARD GILLES","*ALLA001"]
["*ALLIE LOUIS, DUPLESSIS VERONIQUE","*ALLI001"]
["*ANGÉLINE TAILLEFER","*KAIR001"]
["*ANGLEHART STEPHANIE, CARON STEVE","*ANGL001"]
["*APRIL FRANCOIS, MARTIN MANON","*APRI001"]
["*ARBOUR DAVID","*ARBO001"]
["*ARCHAMBAULT ANDRE","*ARCH003"]
["*ARCHAMBAULT FRANCOIS, PRIMEAU ANIK","*ARCH004"]
["*ARCHAMBAULT MARCEL","*ARCH002"]
["*ARCHAMBAULT WILLIE, LAVOIE MANON","*ARCH001"]
["*ARENE BERNARD","*AREN001"]
["*ARGUIN YANICK","*ARGU001"]
["*ARNAUD JULIE","*ARNA001"]
["*ARROYO JACKY, BELANGER LUCIE","*ARRO001"]
["*ARSENAULT LAURENT, DAKIN CHRISTYNE","*ARSE001"]
["*ASCENSEURS THYSSENKRUPP","*ASCE001"]
["*ASS DES PROP DU DOM VILMONT INC","*ASS 001"]
["*ASSELIN JACQUES, ALEXANDRE","*ASSE001"]
["*ASSOCIATION PULMONAIRE DU QUÉBEC","*ASSO001"]
["*AUBIN MARIO, HUOT DIANE","*AUBI001"]
["*AUDETTE JULIEN, MORIN CHRISTOPHER","*AUDE001"]
["*AUDIO TSL","*AUDI001"]
["*AUGER ANDRE","*AUGE001"]
["*BABIN DENIS, DUBOIS DIANE","*BABI003"]
["*BABINEAU JULIE","*BABI001"]
["*BACHAND GENEVIEVE","*BACH001"]
["*BAKER NANCY","*BAKE001"]
["*BANQUE CIBC","*GREN002"]
["*BANQUE DE MONTREAL","*CHOQ001"]
["*BANQUE DE MONTRÉAL","*ALBE001"]
["*BANQUE DE MONTRÉAL/PRÊTS HYPOTHÉCAIRES","*MURR002"]
["*BANQUE LAURENTIENNE","*9151001"]
["*BANQUE LAURENTIENNE DU CANADA","*COTE002"]
["*BANQUE NATIONALE","*APPL001"]
["*BANQUE NATIONALE DU CANADA","*BARI001"]
["*BANQUE NATIONALE DU CANADA (03)","*ILLU001"]
["*BANQUE NATIONALE, PRÊTS HYPOTHÉCAIRES","*BELV002"]
["*BANQUE ROYALE","*JACQ002"]
["*BANQUE ROYALE CANADA-PRÊTS HYPOTHÉCAIRES","*ST C002"]
["*BANQUE ROYALE DU CANADA","*BOUD001"]
["*BANQUE ROYALE, A/S MME MELISSA FERREIRA","*TOUS001"]
["*BANQUE SCOTIA","*BEAU011"]
["*BANQUE SCOTTIA","*ROUS002"]
["*BANQUE TD","*FERR001"]
["*BANQUE TD-CREEKSIDE CR ADM.","*LACR001"]
["*BARBEAU CARMEN","*BARB001"]
["*BARIL MARC-ANDRE, LEVESQUE ANNIE","*BARI002"]
["*BARZECHEN ANNIE, BARZECHEN WILLIAM","*BARZ001"]
["*BASTIEN RICHARD","*BAST001"]
["*BASTOS & FILS ENTR GENERAL INC","*BAST005"]
["*BASTOS & FILS ENTRE GENERAL INC,","*BAST002"]
["*BEAUCHAMP CAROLE","*BEAU001"]
["*BEAUCHAMP GILLES","*BEAU017"]
["*BEAUCHAMP NATACHA, LEGAULT PIERRE","*BEAU025"]
["*BEAUCHAMP REMI S.","*BEAU023"]
["*BEAUCHAMP SYLVAIN","*BEAU026"]
["*BEAUCHAMPS YVAN","*BEAU003"]
["*BEAUDIN DANIEL","*BEAU018"]
["*BEAUDOIN ERIC","*BEAU028"]
["*BEAULIEU JEAN FRANCOIS, GARIEPY","*BEAU024"]
["*BEAULIEU PASCAL","*BEAU012"]
["*BEAULIEU PATRICE, BRUECKMANN","*BEAU027"]
["*BEAULIEU REGINALD","*BEAU004"]
["*BEAULIEU ROXANE, HARVEY KEVIN","*BEAU030"]
["*BEAUREGARD BENOIT, LANCTOT JAIMIE","*BEAU008"]
["*BEAUREGARD GHISLAINE","*BEAU009"]
["*BEAUREGARD MARTIN","*BEAU015"]
["*BEAUREGARD MARTIN, MANTHA LINDA","*BEAU002"]
["*BEAUREGARD SERGE","*BEAU014"]
["*BEDARD DANIEL, GREGOIRE DANIEL","*BEDA002"]
["*BELAND LYNE, GUIMOND STEPHANE","*BELA003"]
["*BELANGER CAROLINE","*BELA002"]
["*BELANGER DANIELLE ARCHAMBAULT","*BELA005"]
["*BELANGER JEAN-PHILIPPE","*BELA009"]
["*BELANGER PIERRE FRANCOIS, BELISLE","*BELA008"]
["*BELANGER REMI, MUNGER FRANCINE","*BELA006"]
["*BELANGER VITAL","*BELA001"]
["*BELISLE YVAN","*BELI001"]
["*BELIVEAU ANDRE","*BELI002"]
["*BELLAVANCE SYLVAIN, BELLAVANCE","*BELL008"]
["*BELLEFEUILLE CLAUDIA","*BELL003"]
["*BELLEHUMEUR STEVE","*BELL006"]
["*BELLEMARE COUVERTURES LTÉE","*BELL002"]
["*BELLEVILLE YVES","*BELL001"]
["*BENOÎT & FRÉDÉRICK POULIN","*POUL005"]
["*BENOIT FRANCIS, SANSCARTIER KARINE","*BENO003"]
["*BENOIT JACQUES","*BENO001"]
["*BENOÎT JONCAS & KARINE NAUD","*BEAU010"]
["*BERARD RENE","*BERA002"]
["*BERGER CHARBONNEAU STYVE, CLAING","*BERG001"]
["*BERGERON CHRISTIAN","*BERG002"]
["*BERTEAND CHANTAL","*BERT005"]
["*BERTRAND JONATHAN, THEROUX","*BERT003"]
["*BERTRAND MARTIN, ST GODARD NADIA","*BERT001"]
["*BIARDEAU JEREMY","*BIAR001"]
["*BIENVENUE JEAN MARC","*BIEN001"]
["*BIGRAS MARIO","*BIGR001"]
["*BIJOUTERIE MANTION INC.","*BIJO001"]
["*BILODEAU LUC, GERMAIN DIANE","*BILO002"]
["*BILODEAU SYLVAIN","*BILO001"]
["*BINETTE ALAIN","*BINE003"]
["*BISSONNETTE SOPHIE","*BISS001"]
["*BLAIS LOUIS","*BLAI001"]
["*BLANCHETTE GINETTE","*BLAN001"]
["*BLOUIN DANIEL, PARENT CAROLE,","*BLOU003"]
["*BLOUIN GILLES","*BLOU002"]
["*BLOUIN MELANIE, BELISLE PATRICE","*BLOU001"]
["*BOILY ALAIN","*BOIL001"]
["*BOISCLAIR & FILS INC.","*BOI 001"]
["*BOISCLAIR ADRIEN, BOISCLAIR YVES","*BOIS002"]
["*BOISSONS GAZEUSES ENVIRONNEMENT","*BOIS004"]
["*BOISVERT MARIE-CLAUDE","*BOIS003"]
["*BOISVERT NICOLE","*BOIS001"]
["*BOIVIN BENOIT, PROULX PASCAL","*BOIV002"]
["*BOIVIN CLAUDE, BARBIER DENISE","*BOIV001"]
["*BOIVIN MARC, TREMBLAY CAROLE","*BOIV003"]
["*BOLDUC DENIS","*BOLD002"]
["*BOLDUC MARYSE","*BOLD001"]
["*BOUCHARD CHANTAL","*BOUC013"]
["*BOUCHARD GHISLAINE","*BOUC001"]
["*BOUCHARD GILLES, GENEST LISE,","*BOUC015"]
["*BOUCHARD JEAN GUY, BOILY REINE","*BOUC005"]
["*BOUCHARD JONATHAN","*BOUC007"]
["*BOUCHARD MARTINE","*BOUC010"]
["*BOUCHARD SYLVAIN, BELAND CHANTALE","*BOUC014"]
["*BOUCHER DANIEL","*BOUC009"]
["*BOUCHER GABRIEL","*BOU017"]
["*BOUCHER MARYLENE","*BOUC016"]
["*BOUCHER PASCAL","*BOUC012"]
["*BOUCHER SEBASTIEN","*BOUC002"]
["*BOURASSA JODOIN INC.","*BOUR010"]
["*BOURASSA, JOHANNE (notaire)","*BOUR008"]
["*BOURBONNAIS YANNICK","*BOUR001"]
["*BOURDON FRANCINE, BOURDON ROBERT","*BOUR009"]
["*BOURGET LUC, DESROSIERS MARTINE","*BOUR004"]
["*BOURQUE NELSON, VENNE DANIELLE","*BOUR007"]
["*BOURQUE RICHARD, DION JOHANNE","*BOUR003"]
["*BOURRET LOUISE","*BOUR002"]
["*BOUTIQUE KAFOUILLE","*BOUT003"]
["*BRADETTE MICHEL","*BRAD001"]
["*BRASSARD  FREDERIC","*BRAS001"]
["*BRIN HUGUETTE, CLEMENT LUC A","*BRIN001"]
["*BRISEBOIS PASCAL, LAURIN SONIA","*BRIS005"]
["*BRISEBOIS YANICK","*BRIS002"]
["*BRISSETTE CLAUDE, ALLARD DIANE","*BRIS001"]
["*BRISSON PHILIPPE, LEVESQUE","*BRIS003"]
["*BRITO JASON","*BRIT001"]
["*BROCHU JEAN CLAUDE, LAVOIE HELENE","*BROC002"]
["*BROCHU JEAN-CLAUDE","*BROC001"]
["*BROUILLETTE KEVIN","*BROU001"]
["*BRUNEAU MICHEL, CHARBONNEAU","*BRUN004"]
["*BRUNET HELENE","*BRUN003"]
["*BRUNETTE ROBERT","*BRUN001"]
["*BRUYERE RONALD","*BRUY001"]
["*BUFFET ACCES EMPLOI","*BUFF001"]
["*CADIEUX JEAN, VERCAMMEN MARYLINE","*CADI001"]
["*CAISSE POP DESJARDINS DE MONTCALM","*CAIS001"]
["*CALISTO JOSE, PEREIRA ELIZABETE","*CALI001"]
["*CAMPEAU JEAN-PIERRE","*CAMP001"]
["*CARBONNEAU YANNICK, RICHARD","*CARB002"]
["*CARDILLO ROCCO, POLESE LINDA","*CARD003"]
["*CARDINAL DAVID","*CARD001"]
["*CARDIO CHOC","*CARD002"]
["*CARON CHASSE  JEAN-BAPTISTE","*CARO006"]
["*CARON PAUL J","*CARO001"]
["*CARRIER DANY, POMPIER","*CARR008"]
["*CARRIER GASTON *M7*M9*","*CARR001"]
["*CARRIERE DANIEL, DESMARAIS","*CARR009"]
["*CARRIERE ERIC, MARTEL CYNTHIA","*CARR006"]
["*CARRIERE ROBERT","*CARR002"]
["*CARTIER ANDRE","*CART003"]
["*CASTRO RAFAEL, CARRIERE ISABELLE","*CAST001"]
["*CECYRE NATHALIE, TIBERIO ROBERTO","*CECY001"]
["*CEELL INC.","*COMI001"]
["*CENTRE D'EXPERTISES LÉGALES","*CENTRE"]
["*CENTRES D'ACTIVITES PHYSIQUES","*CENT001"]
["*CERAT MARTIN","*CERA001"]
["*CERCLE DES FERMIÈRES","*CERC001"]
["*CERTOSINI SANDRO","*CERT001"]
["*CHAMAILLARD FREDERIC, TOUPIN","*CHAM001"]
["*CHAMBRE DE COMMERCE & D'INDUSTRIE","*CHAM003"]
["*CHAMPAGNE LOUISE","*CHAM004"]
["*CHAMPS DE BLÉ SENC","*LES 034"]
["*CHAMPS DE BLES SENC","*CHAM005"]
["*CHAPADOS ERIC, HEGYESY ROXANNE","*CHAP001"]
["*CHARBONNEAU ALEXANDRE","*CHAR013"]
["*CHARBONNEAU CLAUDE, COLLIN DIANE","*CHAR002"]
["*CHARBONNEAU LUCIE","*CHAR004"]
["*CHARBONNEAU MICHELINE","*CHAR005"]
["*CHARBONNEAU NICOLE","*CHAR011"]
["*CHARBONNEAU PASCAL","*CHAR012"]
["*CHAREST COLETTE","*CHAR009"]
["*CHARTRAND, PIERRE, Notaire","*CHAR008"]
["*CHAUVETTE MICHEL, DESROCHERS ELISE","*CHAU001"]
["*CHAYER JEANNINE","*CHAY002"]
["*CHAYER LUCIENNE","*CHAY001"]
["*CHAYER PASCAL, HOGUE MARYSE","*CHAY003"]
["*CHESNEL DENIS","*CHES001"]
["*CHIASSON ALAIN","*CHIA001"]
["*CHIASSON MARLEEN","*CHIA002"]
["*CHOQUETTE PASCAL, PORTUGAIS KARINE","*CHOQ003"]
["*CHOUINARD DIANE","*CHOU002"]
["*CHRETIEN STÉPHANIE","*CHRE001"]
["*CIRKAZIUM","*CIRK001"]
["*CLAUDE TREMBLAY","*TREM004"]
["*CLERMONT JEAN, GELINAS DANIELLE","*CLER001"]
["*CLERMONT LORRAINE, TREMBLAY","*CLER002"]
["*CLOUTIER ANDREE","*CLOU002"]
["*CLOUTIER ANGELE","*CLOU003"]
["*CLOUTIER BRUNO","*CLOU001"]
["*CLOUTIER FRANCOIS, POULIN NANCY","*CLOU006"]
["*CLOUTIER MICHEL","*CLOU008"]
["*CLUB AUTO PRESTIGE INC","*CLUB002"]
["*CLUB DE MOTONEIGE BON-AIR INC.","*CLUB001"]
["*CLUB DES BALADEURS","*CLUB003"]
["*CLUB DES PETITS DÉJEUNERS","*CLUB004"]
["*COCCIARDI STEPHANE","*COCC001"]
["*COLLIN JACQUES, PREVOST EDITH","*COLL003"]
["*COLLINS CANADA INC.","*COLL001"]
["*COM D EXPANSION ECO DE ST-LIN LAU","*COM 001"]
["*COMITE D' EXP. ECONOMIQUE DE","*COMI002"]
["*COMPAGNIE DE FIDUCIE AGF","*COUL001"]
["*COMPAGNIE TRUST ROYAL","*HAME004"]
["*CONCEPT NORD-SUD INC","*CONC001"]
["*CONSTR. LAURIN VILLENEUVE INC.","*MESS002"]
["*CONSTR. RTS LTÉE","*MARC001"]
["*CONSTRUCTION BENOÎT COUSINEAU","*2857013"]
["*CONSTRUCTION G-NESIS INC.","*G-NESIS"]
["*CONSTRUCTION JACQUES LEBEAU INC","*CONS027"]
["*CONSTRUCTION LOUIS LEFEBVRE INC","*CONS020"]
["*CONSTRUCTION MARIO DELORME INC","*CONS014"]
["*CONSTRUCTION MICHEL JACQUES INC.","*GEST009"]
["*CONSTRUCTION NOVATEK INC","*CONS026"]
["*CONSTRUCTION R T S LTEE","*CONS010"]
["*CONSTRUCTION R.T.S. LTEE","*CONS003"]
["*CONSTRUCTION RTS LTEE","*9181005"]
["*CONSTRUCTION RTS LTÉE","*9181003"]
["*CONSTRUCTION SOTER INC.","*SOTER00"]
["*CONSTRUCTIONS BENOIT COUSINEAU","*2857002"]
["*COOL ALINE","*COOL001"]
["*CORBEIL SYLVAIN","*CORB001"]
["*CORBIN JEANNOT, AUBE GUYLAINE","*CORB002"]
["*CORMIER MELANIE, MARTIN SUZANNE","*CORM001"]
["*CORNET PRESQUE PARFAIT (LE)","*CORN001"]
["*CORPORATION JEUX DU 3E ÂGE MONTCALM","*CORP001"]
["*COTE JENNIFER, MONTIGNY MARCEL","*COTE001"]
["*COTE KARINE","*COTE004"]
["*COTE SUZANNE","*COTE007"]
["*COTE SYLVIE","*COTE006"]
["*COTTON LOUIS, PARADIS MARIE JOSEE","*COTT001"]
["*COUR MUNICIPALE DE MONTCALM","*COUR001"]
["*COURCHESNE FREDERIC, TREMBLAY","*COUR003"]
["*COURCHESNE NORMAND","*COUR004"]
["*COURSOL PHILIPPE, BRISEBOIS","*COUR002"]
["*COURSOL PHILIPPE, BRISEBOIS MÉLANIE","*COUR007"]
["*COURTEMANCHE MICHEL","*COUR006"]
["*COUTURE ERIC, FERLAND ANNABELLE","*COUT001"]
["*COUTURE GERALD, DESLONGCHAMPS LISE","*COUT003"]
["*COUTURE SYLVIE, BRISEBOIS MICHEL","*COUT002"]
["*COUTURIER ISABELLE, Notaire","*COUT005"]
["*COUVOIR DES LAURENTIDES LTEE","*COUV001"]
["*COVONE KEVIN","*COVO001"]
["*CPPE","*CPPE001"]
["*CROTEAU ROLAND, LAMARCHE CLAIRE","*CROT001"]
["*CURADEAU DANIEL, FONTAINE NATHALIE","*CURA001"]
["*CURLEY DIANE, SCHWEITZER SYLVIE","*CURL001"]
["*CYR ROBERT","*CYR 001"]
["*D. BISSON CONSTRUCTION INC","*D. B001"]
["*DAIGLE LINDA","*DAIG001"]
["*DAIGLE SYLVAIN","*DAIG002"]
["*DALLAIRE JULIE","*DALL001"]
["*DALPE JEAN-CLAUDE","*DALP002"]
["*DALPE ROBERT","*DALP001"]
["*DANIEL CHOQUETTE &  ASSOCIES INC","*DANI001"]
["*DANIEL LEMAY & GENEVIÈVE OTIS","*LEMA002"]
["*DANIEL VACHON","*9073001"]
["*DAOUST RICHARD 40% IND, DAOUST","*DAOU001"]
["*DE L'HORTENSIA S.E.N.C.R.L","*DE L001"]
["*DE L'HORTENSIA S.E.N.C.R.L.","*DE L003"]
["*DE L'HORTENSIA S.E.N.C.R.L.,","*DE L010"]
["*DE LUCA LOUIS, CORBEIL OLIVIER","*DE L012"]
["*DE PALMA STEVEN, GAUTHIER CAROLINE","*DE P001"]
["*DEFAYETTE RENE, SAULNIER CARMEN","*DEFA001"]
["*DEGRANDPRÉ & CHAIT, Avocats","*DEGR001"]
["*DEL BALSO ROSA","*DEL 001"]
["*DELCOL OLIVIER, DESGAGNE MARLENE","*DELC002"]
["*DÉLICES MAISON (LES)","*DÉLI001"]
["*DELISLE STEVE","*DELI002"]
["*DELORME FRANCINE","*DELO001"]
["*DELORME MARIO","*DELO003"]
["*DEMERS MARCIL ALEXIS, COTE","*DEME005"]
["*DEMERS PIERRE","*DEME004"]
["*DEMETRE JOCELYN, CLARK CYNTHIA","*DEME001"]
["*DEMEULE RICHARD, POULIN LOUISETTE","*DEME003"]
["*DENIS MARCEL","*DENI002"]
["*DEPANNEUR K D L INC","*DEPA001"]
["*DERY STEPHANE, LEBLOND MARTINE","*DERY001"]
["*DESCHENES CLEMENT","*DESC002"]
["*DESCHENES JEAN PIERRE, LAPOINTE","*DESC001"]
["*DESJARDINS ANDRE, LEVASSEUR","*DESJ006"]
["*DESJARDINS DANIEL, BENARD MANON","*DESJ010"]
["*DESJARDINS LIONEL, BOURGEOIS","*DESJ005"]
["*DESJARDINS MICHEL","*DESJ001"]
["*DESJARDINS RICHARD","*DESJ003"]
["*DESJARDINS ROGER","*DESJ002"]
["*DESLAURIERS JONATHAN","*DESL002"]
["*DESLAURIERS MANON","*DESL001"]
["*DESMARAIS GUY","*DESM002"]
["*DESMARAIS PIERRE, VALCOURT AUDREY","*DESM003"]
["*DÉSORMEAUX GUY","*DESO002"]
["*DESORMEAUX JEAN GUY","*DESO001"]
["*DESPATIES YOLANDE SUCCESSION","*DESP001"]
["*DESPRES GEORGIANNE, ROSS LEOPOLD","*DESP002"]
["*DESROCHERS JEAN, DESROCHERS","*DESR001"]
["*DESROCHES MICHEL","*DESR002"]
["*DEVELOPPEMENT ST LIN INC","*DEVE001"]
["*DHAISNE JEAN PIERRE","*DHAI001"]
["*DI PASQUALE FARINA ANTONIO","*DI P002"]
["*DI PINTO VITO, ZIELINSKI VANESSA","*DI P001"]
["*DI VICCARO ALESSIO","*DI V001"]
["*DIAMOND NOTAIRE INC","*DIAM001"]
["*DION JESSICA, DUFOUR CHARTRAND","*DION002"]
["*DION YVES, LEROUX COLETTE, MARLEAU","*DION001"]
["*DIONNE RICHARD","*DION004"]
["*DIONNE SYLVAIN, MORIN MANON","*DION006"]
["*DOMAINE JOHANNE","*DOMA001"]
["*DOMAINE M D INC","*DOMA002"]
["*DONAIS LISE, DUGAS JACQUES","*DONA001"]
["*DONTIGNY NANCY","*DONT001"]
["*DORION REAL, BLAIN LUCIE","*DORI001"]
["*DRAINVILLE JEAN-PIERRE, BENARD","*DRAI001"]
["*DROUIN JOCELYN, GRONDIN CHANTAL","*DROU001"]
["*DUBE MARIO, CORMIER JEANNE MANCE","*DUBE001"]
["*DUBOIS STEPHANE, BRIERE ANNICK","*DUBO002"]
["*DUBORD CINDY","*DUBO004"]
["*DUCHESNE RICHARD","*DUCH001"]
["*DUFORT GERMAIN, DUFORT MICHEL","*DUFO001"]
["*DUFOUR CAROLE","*DUFO004"]
["*DUFRESNE JEAN","*DUFR001"]
["*DUFRESNE RAYMOND","*DUFR002"]
["*DUGAS CLEMENT, DUGAS SYLVAIN","*DUGA001"]
["*DUGUAY ALYTIA, DESORMEAUX YANIK","*DUGU003"]
["*DUGUAY GABRIEL","*DUGU004"]
["*DUIVINA MOOIJ JOSINE","*DUIV001"]
["*DUMONT GILLES, GOULET CHARLOTTE","*DUMO001"]
["*DUMOUCHEL CHRISTIAN","*DUMO003"]
["*DUMOULIN ADRIENNE","*DUMO002"]
["*DUNN PIERLUC","*DUNN002"]
["*DUPRAS DIANE, PAYEUR JOCELYN","*DUPR001"]
["*DUPUIS HAROLD, RONDEAU CAROLE","*DUPU001"]
["*DUQUETTE GILLES","*DUQU005"]
["*DUQUETTE GILLES, DESLAURIERS MARIE","*DUQU003"]
["*DUQUETTE MARC","*DUQU002"]
["*DUROCHER CLAUDE, LAVOIE REGIS","*DURO001"]
["*DUROCHER JACQUES","*DUR0002"]
["*DUSSAULT DENIS, BERTRAND GINETTE","*DUSS001"]
["*DUVAL BERNARD","*DUVA001"]
["*DUVAL CLAUDE","*DUVA003"]
["*DUVAL RICHARD","*DUVA002"]
["*E.M.P.C. INC.","*EMPC001"]
["*EDWARDS CATHERINE","*EDWA001"]
["*EGIDIO FUOCO","*9258001"]
["*ELIANE DANIS-INFIRMIÈRE","*DAN001"]
["*EMOND LUC","*EMON001"]
["*ENTREPRISES GUY DESJARDINS INC. (LES)","*ENTR001"]
["*ENTREPRISES P.MARION INC.","*ENTR002"]
["*ENVIRO VIDÉOGRAPHIC","*ENVI001"]
["*ESSIAMBRE CLAUDE, RODGERS MIREILLE","*ESSI001"]
["*ETHIER ROSIANNE","*ETHI001"]
["*ETIENNE MARC","*ETIE001"]
["*EUGÈNE MASSON &","*GING001"]
["*EXCAVATION MARTIN CÉRAT","*EXC MAR"]
["*EXPORAIL","*EXPO001"]
["*FABRIC UNIFORME (LA)","*FABR001"]
["*FAUCHER ALAIN","*FAUC002"]
["*FAUCHER JEAN-FRANÇOIS","*FAUC003"]
["*FCT COMPAGNIE DE TITRES","*FCT 001"]
["*FERLAND ANDRE","*FERL001"]
["*FERME & PAYSAGISTE PIERRE OUELLETTE ENR.","*FERM003"]
["*FERME A HOGUE & FILS INC","*FERM002"]
["*FERME A HOGUE ET FILS INC","*FERM006"]
["*FERME C L MERCIER INC","*FERM001"]
["*FERME DUROSEAU INC","*FERM004"]
["*FERME M MERCIER & FILS INC","*FERM007"]
["*FERRON FERNANDE","*FERR003"]
["*FERRON GAETAN","*FERR002"]
["*FÊTES GOURMANDES DE LANAUDIÈRE","*FÊTE001"]
["*FIGUEIRO SERGE","*FIGU001"]
["*FILIATRAULT VINCENT","*FILI001"]
["*FILLES D'ISABELLE","*FILL003"]
["*FILLION SYLVIE, BOUCHARD DOMINIQUE","*FILL001"]
["*FINITION DE BETON GUY ROY INC","*FINI001"]
["*FIRST LINE","*BRIG002"]
["*FIRST NATIONAL","*9172001"]
["*FIRST NATIONAL FINANCIAL","*BERU001"]
["*FIRST NATIONAL FINANCIAL-PRÊTS HYPO.","*GIRO005"]
["*FLAG SHOP (LE)","*FLA 001"]
["*FLUET ALAIN","*FLUE001"]
["*FNF CANADA","*FOUR004"]
["*FNF CANADA, TAX DEPARTMENT","*FOUR003"]
["*FONDATION HÔPITAL SAINT-EUSTACHE","*FOND001"]
["*FONTAINE ALAIN, BOUCHARD CHANTAL","*FONT004"]
["*FONTAINE RICHARD, GRAVEL SYLVIE","*FONT001"]
["*FOREST RICHARD, DENIS LYNDA","*FORE001"]
["*FOREST SOPHIE","*FORE003"]
["*FORGET CARMEN","*FORG001"]
["*FORGET PIERRE","*FORG004"]
["*FORTIN ERIC","*FORT002"]
["*FOURNIER CLAUDE","*FOUR002"]
["*FOURNIER GILLES","*FOUR001"]
["*FOURNIER MATHIEU","*FOUR005"]
["*FPI PROPRIETES DE CHOIX - DEV QUE","*CP R001"]
["*FRANC HUGUETTE","*FRAN002"]
["*FRANCIS MASSE &","*LAUR002"]
["*FRANCOEUR STEPHANE","*FRAN001"]
["*FRIGON LEON, GODIN RINA","*FRIG001"]
["*FUOCO STEVE","*FUOC001"]
["*GAGNE CHRISTINE","*GAGN018"]
["*GAGNE FRANCOIS, PEPIN MICHELINE","*GAGN015"]
["*GAGNE GINETTE","*GAGN008"]
["*GAGNE JEAN-GUY, BOISSONNEAULT","*GAGN004"]
["*GAGNE MARC, PELLETIER CINDY","*GAGN017"]
["*GAGNE SYLVIE","*GAGN001"]
["*GAGNON ANDRE","*GAGN011"]
["*GAGNON PATRICK","*GAGN003"]
["*GAGNON PIERRE","*GAGN010"]
["*GAGNON REJEAN, LAFONTAINE LOUISE","*GAGN002"]
["*GAGNON REMBOURREUR","*GAGN014"]
["*GAGNON SYLVAIN, GAGNON DOMINIQUE,","*GAGN012"]
["*GALARNEAU ALAIN","*GALA001"]
["*GAREAU CHANTAL","*GARE001"]
["*GARIÉPY DANIEL","*GARI006"]
["*GARIEPY GERALD","*GARI004"]
["*GARIEPY PIERRETTE","*GARI001"]
["*GARIEPY RENE","*GARI002"]
["*GARNEAU FRANCOIS, THERRIAULT","*GARN001"]
["*GARON RICHARD","*GARO002"]
["*GASCON-BRUNEAU VALERIE, LAMOTHE","*GASC001"]
["*GAUTHIER ALINE","*GAUT003"]
["*GAUTHIER GINETTE","*GAUT008"]
["*GAUTHIER MARTIN","*GAUT007"]
["*GAUTHIER NORMAND","*GAUT001"]
["*GAUTHIER ROXANNE","*GAUT005"]
["*GAUTHIER STEPHANE, COOL ALINE","*GAUT002"]
["*GAZONNIERE LAUZON & FRERES","*GAZO001"]
["*GAZONNIERE LAUZON & FRERES INC","*GAZO002"]
["*GELINAS ANDRE, IMBEAULT MONIQUE","*GELI002"]
["*GELINAS CLERMONT KELLY","*GELI003"]
["*GÉNÉRATION HOCKEY / KRÉA","*GÉNÉ001"]
["*GENICOM, GROUPE CONSEIL","*GENI001"]
["*GEOFFROY NORMAND, LABRIE LYNE","*GEOF001"]
["*GERMAIN CLAUDE","*GERM001"]
["*GESTION BENOÎT COUSINEAU","*9136004"]
["*GESTION DANCHO INC","*GEST005"]
["*GESTION DENIS CHESNEL INC.","*GEST001"]
["*GESTION GILLES LAURENCE LTÉE","*VILL004"]
["*GESTION IMMOBILIÈRE MAXVIEW","*2857012"]
["*GESTION IMMOBILIERE S.F. INC","*GEST011"]
["*GESTION IMMOBILIERE SIMALEX INC","*IMMO001"]
["*GESTION IMMOBILIÈRES BORÉALE INC.","*BERT002"]
["*GESTION J LAPRADE","*TROT001"]
["*GESTION JEAN CLAUDE LAPALME INC","*GEST006"]
["*GESTION JEAN-CLAUDE LAPALME INC","*GEST010"]
["*GESTION MAXERIC INC","*GEST004"]
["*GESTION SEB INC.","*CONS017"]
["*GIBOULEAU GHISLAIN, MOISAN DIANE","*GIBO001"]
["*GIGUERE LINE, BEAUDIN MICHEL","*GIGU001"]
["*GILBERT CLARA","*GILB003"]
["*GILBERT MARCEL","*GILB002"]
["*GINETTE ASPIROT","*GREN004"]
["*GINGRAS SYLVAIN","*GING002"]
["*GIRALDEAU ALEX","*GIRA004"]
["*GIRARD ALAIN","*GIRA006"]
["*GIRARD FELIX","*GIRA001"]
["*GIRARD JOSÉE","*GIRA010"]
["*GIRARD LUC","*GIRA009"]
["*GIRARD LUC, LAPIERRE JOSEE","*GIRA002"]
["*GIRARD PIERRE, ASSELIN DIANE","*GIRA003"]
["*GIRARD YVON","*GIRA005"]
["*GIROUARD LORRAINE, BLAIS GEORGES","*GIRO002"]
["*GIROUX ANNIE","*GIRO004"]
["*GIROUX ROBERT *M08*","*GIRO001"]
["*GLOBENSKY LISE","*GLOB001"]
["*GOBEIL MARCEL, GAGNON LYSIA","*GOBE001"]
["*GONCALVES MANUEL","*GONC001"]
["*GOSSELIN DONALD","*GOSS004"]
["*GOUGEON VIANNEY, DUSSAULT MANON","*GOUG002"]
["*GOULET ALAIN","*GOUL002"]
["*GOULET CHARLES, BILODEAU JOSIANNE","*GOUL003"]
["*GOULET GHISLAIN","*GOUL001"]
["*GOYETTE CARL, ARCAND MARIE CLAUDE","*GOYE001"]
["*GRAHNER ERICH, TURCOTTE NATHALIE","*GRAH001"]
["*GRATON EMMANUEL","*GRAT001"]
["*GRAVEL CAMILLE","*GRAV001"]
["*GRENIER MICHELINE","*GREN001"]
["*GRONDIN ANNIE, DESJARDINS GUY","*GRON001"]
["*GRONDIN DANIEL","*GRON003"]
["*GROUPE ABS","*GROUPEA"]
["*GROUPE INVESTORS","*CYR 002"]
["*GROUPE LUSSIER INC","*GROU001"]
["*GROUPE MERCIER INC","*GROU002"]
["*GROUPE PRO-FAB INC","*GROU004"]
["*GROUPE STAR SUITES","*GROU006"]
["*GUALTIERI BRUNO, GUALTIERI","*GUAL001"]
["*GUAY INC.","*GUAY004"]
["*GUENETTE PATRICK, MAGNAN CHANTAL","*GUEN001"]
["*GUERIN CLAUDE","*GUER001"]
["*GUIL PORCS INC","*GUIL001"]
["*GUILBAULT ANITA","*GUIL002"]
["*HABITATION LOGIMAX","*HABI001"]
["*HABITATION LOGIMAX  INC","*HABI002"]
["*HABITATION LOGIMAX INC.","*VILL008"]
["*HABITATIONS CONFORT 2000 INC","*HABI003"]
["*HABITATIONS DES VIGNOBLES  INC","*HABI011"]
["*HABITATIONS DES VIGNOBLES INC","*HABI009"]
["*HABITATIONS DU HAVRE INC","*HABI008"]
["*HABITATIONS V.L. INC","*HABI012"]
["*HAINS MARIE CLAUDE, DALLAIRE JEAN","*HAIN001"]
["*HAMEL ANDRE, GILBERT JOCELYNE","*HAME002"]
["*HANDFIELD JOCELYN","*HAND002"]
["*HANDFIELD JOCELYN, LAFRANCE JOSEE","*HAND001"]
["*HAYES SERGES","*HAYE001"]
["*HEBERT BENOIT, BOUCHER CYNTHIA","*HEBE008"]
["*HEBERT DANIEL","*HEBE004"]
["*HEBERT GAETAN","*HEBE006"]
["*HEBERT MARC, LEGER LAPLANTE","*HEBE003"]
["*HEBERT MARIO","*HEBE007"]
["*HEBERT NORMAND, HEBERT JEAN","*HEBE002"]
["*HEBERT PATRICK, TRUDEL FRANCINE","*HEBE015"]
["*HEBERT SERGE","*HEBE001"]
["*HENRI MAGNAN FRANCIS","*HENR001"]
["*HERREN MARTIN","*HERR001"]
["*HILARIO DAVID","*HILA001"]
["*HOGUE ALPHONSE","*HOGU001"]
["*HORTH MATHIEU","*HORT002"]
["*HORTI-SOLUTION","*HORT001"]
["*HUARD PATRICK, LUSSIER SOPHIE","*HUAR001"]
["*HUARD VALERE, COMEAU MARLENE","*HUAR002"]
["*HUOT OVILA","*HUOT001"]
["*IADISERNIA UMBERTO","*IADI001"]
["*IMMEUBLES D.L. NORD-SUD INC","*IMME001"]
["*INDUSTRIELLE ALLIANCE","*DOUT001"]
["*INDUSTRIELLE ALLIANCE-PRÊTS HYPOTHÉCAIRE","*HAME005"]
["*ING DIRECT","*LES 014"]
["*INSTALLATIONS A.L.","*INST001"]
["*J. DESCHENES (1990) INC","*J. D001"]
["*JACOB BENOIT","*JACO001"]
["*JACQUES BRAULT, NOTAIRE","*JAC 001"]
["*JACQUES MICHEL","*JACQ001"]
["*JADYROC INC","*JADY001"]
["*JASMIN ALAIN","*JASM002"]
["*JASMIN GINETTE","*JASM004"]
["*JEAN MARIE-LISE","*JEAN003"]
["*JESSIE LOPES","*VERM006"]
["*JOHNSON JACQUES, CHAPUT SYLVIE","*JOHN002"]
["*JOLY PIERRE, FILIATRAULT KARINE","*JOLY002"]
["*JOSÉE MAINVILLE &","*THER002"]
["*JOUVET JEAN-LUC, LABROSSE JOHANNE","*JOUV001"]
["*KEM CHAN SAUPHEA, KEM CHAN SOPHEAK","*KEM 001"]
["*KIM DEMETRE","*LAFR001"]
["*KORNECHOOK DAVID","*KORN001"]
["*KRANJEC ROMANA","*KRAN001"]
["*L.Y. GAGNON INC","*MALO002"]
["*LA CAPITALE","*2857001"]
["*LA SOC FERME YVES PIERRE SENC","*LA S001"]
["*LA SUCCESSION GILLES BEAUCHAMP","*BEAU029"]
["*LABELLE CLAUDE","*LABE003"]
["*LABELLE ERIC","*LABE004"]
["*LABELLE JEAN FRANCOIS","*LABE001"]
["*LABELLE MATHIEU","*LABE002"]
["*LABONTE RAYMOND","*LABO002"]
["*LABORATOIRES CAR-MO 2002 INC.","*LAB 001"]
["*LABRIE YVON","*LABR001"]
["*LACHARITE ANDRE, LUSSIER JOHANNE","*LACH002"]
["*LACOSTE JOSIANNE, NOURY YANNICK","*LACO001"]
["*LAFAVE KARINE, LABELLE PATRICK","*LAFA001"]
["*LAFLECHE SYLVIE","*LAFL001"]
["*LAFONTAINE LOUISE","*LAFO006"]
["*LAFORCE JONATHAN","*LAFO002"]
["*LAFORCE RICHARD","*LAFO005"]
["*LAFORTUNE GAETAN","*LAFO003"]
["*LAGACE EMILIA","*LAGA001"]
["*LAJEUNESSE NICOLAS","*LAJE001"]
["*LAJOIE FRANCOISE","*LAJO001"]
["*LALANCETTE RAYNALD, BOILY JACYNTHE","*LALA001"]
["*LALONDE ROBERT, BINETTE NANCY","*LALO001"]
["*LAMARCHE GILLES","*LAMA001"]
["*LAMARCHE RICHARD","*LAMA002"]
["*LAMARRE DANIEL","*LAMA003"]
["*LAMONTAGNE ALAIN","*LAMO001"]
["*LAMONTAGNE FRANCIS, PROVOST YVAN","*LAMO004"]
["*LAMOTHE CHANTAL","*LAMO002"]
["*LANDRY STEPHANE, LE BOUTHILIER","*LAND003"]
["*LAPALME MARTIN","*LAPA001"]
["*LAPALME NATHALIE 1/5 IND, LORTIE","*LAPA002"]
["*LAPIERRE DENIS","*LAPI002"]
["*LAPIERRE MANON, PELLETIER JEAN","*LAPI001"]
["*LAPIERRE MAURICE","*LAPI003"]
["*LAPIERRE ROBERT","*LAPI005"]
["*LAPLANTE PIERRE","*LAPL001"]
["*LAPOINTE CHANTAL","*LAPO001"]
["*LAPOINTE MICHELLE","*LAPO003"]
["*LAPOINTE YOLANDE","*LAPO004"]
["*L'ARCHEVEQUE MERCIER INC","*L'AR002"]
["*L'ARCHÊVEQUE MERCIER INC","*L'AR001"]
["*LARIVIERE ANDRE","*LARI003"]
["*LARIVIERE DANIEL, PERREAULT MAGALI","*LARI002"]
["*LAROCHELLE GILLES","*LARO006"]
["*LAROSE FREDERICK, MARCOTTE AUDREY","*LARO005"]
["*LAROSE ROGER, LANDRY SUZANNE","*LARO001"]
["*LAROSE YVON, KRANJEC ROMANA","*LARO003"]
["*LAROUCHE MARC","*LARO007"]
["*LARRIVEE SIMONE","*LARR001"]
["*LASERA JENNY PHILOMENE","*LASE001"]
["*LASONDE MICHELINE, LASONDE COLETTE","*LASO001"]
["*LASSELLE MARLIN MICHEL","*LASS001"]
["*LATENDRESSE CHRISTIAN","*LATE003"]
["*LATENDRESSE MARCEL","*LATE001"]
["*LATOUR CLAUDE","*LATO001"]
["*LATREILLE YVON","*LATR001"]
["*LAUZON ALFRED","*LAUZ002"]
["*LAUZON CATHERINE, LAUZON VINCENT","*LAUZ006"]
["*LAUZON DENIS, LEBLANC PIERRETTE","*LAUZ005"]
["*LAUZON YVON","*LAUZ001"]
["*LAVIGUEUR PASCAL","*LAVI002"]
["*LAVOIE DAVY, LAVOIE AMELIE","*LAVO002"]
["*LAYETTE FRANCIS","*LAYE001"]
["*LE BARRICADEUR","*BAR 001"]
["*LE CAMPING DE MES REVES","*LE C002"]
["*LE CAMPING DE MES REVES INC","*LE C001"]
["*LE GROUPE BRIAND 2010 INC.","*DE L005"]
["*LE GROUPE PETROLIER OLCO ULC","*LE G001"]
["*LE HOUX AUREA, BOULANGER JOSEE","*LE H001"]
["*LEBLANC PATRICK","*LEBL002"]
["*LECAVALIER DANIEL","*LECA001"]
["*LEFEBVRE ALAIN, FLUET CHANTALE","*LEFE002"]
["*LEFEBVRE CATHERINE","*LEFE006"]
["*LEFEBVRE LUC","*LEFE001"]
["*LEFEBVRE MANON, GAGNON MARTIN","*LEFE009"]
["*LEFEBVRE PIERRE","*LEFE008"]
["*LEFEBVRE RONALD, MEUNIER LOUISE","*LEFE004"]
["*LEFORT MARTIN","*LEFO001"]
["*LÉGARÉ, MICHEL (NOTAIRE)","*LÉGA001"]
["*LEGAULT FREDERICK","*LEGA001"]
["*LEGAULT PIERRE, DUPUIS ISABELLE","*LEGA002"]
["*LEMAIRE FRANCOIS, LAGACE NICOLE","*LEMA004"]
["*LEMAY DANIEL, OTIS GENEVIEVE","*LEMA003"]
["*LEMAY DOMINIQUE, MARQUIS JACQUES","*LEMA001"]
["*LEONARD AUDREY","*LEON001"]
["*LEPAGE GERALD","*LEPA001"]
["*LEPAGE JEAN FRANCOIS","*LEPA004"]
["*LEPAGE LOUIS","*LEPA008"]
["*LEPAGE PASCAL","*LEPA003"]
["*LEPAGE YVON, MENARD JULIE","*LEPA007"]
["*LEPINE MANON, PELLETIER YVAN","*LEPI001"]
["*LEPROHON MONIQUE, ETIENNE ROGER","*LEPR001"]
["*LES AMENAGEMENTS C.L.C. INC","*LES 029"]
["*LES AMENAGEMENTS C.L.C. INC,","*LES 035"]
["*LES AMENAGEMENTS CLC INC","*DE L011"]
["*LES AMENAGEMENTS CLC INC","*LES 013"]
["*LES AMÉNAGEMENTS CLC INC.","*MENA001"]
["*LES AUTOBUS MOREAU INC.","*AUTO001"]
["*LES BELLES FINITIONS INC","*LES 031"]
["*LES CONST BENOIT COUSINEAU INC","*LES 011"]
["*LES ÉDITIONS FLORAISON","*EDI001"]
["*LES ENTREPRISES 3 G.S. INC","*LES 024"]
["*LES ENTREPRISES 3 GS INC.","*CERR001"]
["*LES ENTREPRISES MICHEL FOREST INC","*LES 017"]
["*LES ENTREPRISES MICHEL FOREST INC.","*LES 040"]
["*LES FERMES G.N.C. INC","*LES 041"]
["*LES FERMES J-F & C GAGNON INC","*LES 042"]
["*LES FERMES LORTIE (2006) INC","*LES 023"]
["*LES FERMES LORTIE INC","*LES 001"]
["*LES FERMES LORTIE INC *MP08*","*LES 005"]
["*LES HABITATIONS DEVILLE INC","*CENT003"]
["*LES HABITATIONS DEVILLE INC.","*CENT002"]
["*LES IMMEUBLES MALINA INC","*LES 006"]
["*LES INDUSTRIES BONNEVILLE LTEE","*LES 008"]
["*LES JARDINS G & R LTEE","*LES 002"]
["*LES MARAICHERS M G INC","*LES 016"]
["*LES PATATES TURCOT INC","*LES 025"]
["*LESAGE DENIS, ST-JACQUES HUGUETTE","*LESA001"]
["*LESPERANCE ROBERT","*LESP001"]
["*LESSARD BERNARD","*LESS001"]
["*LEVASSEUR GASTON","*LEVA002"]
["*LEVASSEUR YVON","*LEVA001"]
["*LEVASSEUR YVON, BOILARD LOUISE","*LEVA005"]
["*LEVEILLE ELISE, COUILLARD GEORGES","*LEVE005"]
["*LEVEILLE LUCIENNE DUFORT","*LEVE008"]
["*LEVEILLE YVON, TOUSIGNANT LISON","*LEVE011"]
["*LEVEILLEE ALBERT","*LEVE004"]
["*LEVEILLEE GILLES","*LEVE002"]
["*LEVEILLEE J CLAUDE","*LEVE003"]
["*LEVEILLEE MARIETTE","*LEVE007"]
["*LEVERT JEAN-SIMON","*LEVE012"]
["*LEVESQUE ERIC","*LEVE006"]
["*LEVESQUE JEAN MARC, GERVAIS MARTIN","*LEVE001"]
["*LIEPINAITIS RICHARD","*LIEP001"]
["*LIETTE CHEVALIER","*CHEV001"]
["*LIZOTTE SERGE","*LIZO002"]
["*LOPES JESSIE, LOCAS-JUTEAU DANNY","*LOPE002"]
["*LOPES MARGARIDA","*LOPE001"]
["*LORD FRANCOIS, LAPOINTE SOPHIE","*LORD001"]
["*LORRAIN ROGER SUCC","*LORR001"]
["*LORTIE ROGER, LORTIE ERIC","*LORT001"]
["*LUSIGNAN SERGE, PLAISANCE","*LUSI001"]
["*LUSSIER JEAN CLAUDE, PELCHAT","*LUSS001"]
["*LUSSIER JEAN MARC","*LUSS002"]
["*M GUY DESCHAMBAULT &","*DELO002"]
["*M JOSE LUIS ZAMUDIO LUEVANO","*MASS003"]
["*M MARCELO GONZALEZ  &","*POTV001"]
["*M. DANIEL BOUCHER","*BOUC008"]
["*M. LÉO CLÉMENT &","*LOYE001"]
["*M. MATHIEU LAFORGE &","*CONS005"]
["*M. MICHEL  MONTREUIL &","*LARO002"]
["*MADAME CAROLINE POITRAS","*DIVI001"]
["*MADAME DANIELLE FAVRON","*LAFO007"]
["*MADAME DOMINIQUE BARRIAULT &","*BARR001"]
["*MADAME HÉLÈNE LEFORT","*MERI001"]
["*MADAME JOSÉE ARSENAULT &","*ROBI001"]
["*MADAME NICOLE LAGACÉ","*LAGACÉN"]
["*MADAME SYLVIE BOUDREAU","*BOUD004"]
["*MAGNA GINETTE, LEDUC REJEAN","*MAGN001"]
["*MAHEUX RICHARD, GAGNON ELAINE","*MAHE001"]
["*MAILLOUX DAVID, WRIGHT JOANIE","*MAIL001"]
["*MAISLIN DEREK","*MAIS001"]
["*MAISONS USINEES COTE INC","*MAIS002"]
["*MAJEAU JOCELYN","*MAJE001"]
["*MAJOR BENOIT, BELAIR STEPHANIE","*MAJO001"]
["*MALO GILLES","*MALO004"]
["*MALO LOUISE","*MALO001"]
["*MALONEY DANY, MONZEROLLE MALONEY","*MALO005"]
["*MALOUIN JEAN","*MALO003"]
["*MALOUIN MARIO, BEAUREGARD LOUISE","*MALO006"]
["*MANN KUMAR SUNIL","*MANN001"]
["*MANON ST-GERMAIN &","*HEBE009"]
["*MANTION","*MANT002"]
["*MAPLE TRUST-A/S MME LISA RAMKISSOON","*GIRO003"]
["*MARC BEAUDOIN","*STAV001"]
["*MARCOUX VALERIE","*MARC003"]
["*MARIE-CLAUDE PILON &","*3093005"]
["*MARIEN REJEAN","*MARI001"]
["*MARQUIS INC","*MARQ001"]
["*MARQUIS INC.","*CLOU005"]
["*MARTEL BERNADETTE","*MART004"]
["*MARTEL DANNY","*MART006"]
["*MARTIN ANDRE","*MART008"]
["*MARTIN BOUCHARD","*BOUC003"]
["*MARTIN FREDERIC","*MART005"]
["*MARTIN GEORGETTE","*MART001"]
["*MARTIN THERESE","*MART002"]
["*MARTINEAU SUZANNE, COUSINEAU","*MART003"]
["*MASECCHIA ENRICO","*MASE001"]
["*MASSON DANY","*MASS002"]
["*MASSON ROBERT","*MASS001"]
["*MATTE MICHEL","*MATT002"]
["*MATTEAU MELANIE","*MATT001"]
["*MAURICE YANICK, BLANCHET NICOLE","*MAUR001"]
["*MAXI CANADA INC","*MAXI001"]
["*MC BREARTY JAMES","*MC B001"]
["*MC BREARTY STEPHANE, PARENT","*MC B002"]
["*MC DONALD ERIK","*MC D001"]
["*MC KIBBIN NORMAND, GODON JOHANNE","*MC K001"]
["*MCAP","*BERG004"]
["*MCBREARTY ERIC, BEAULIEU KIM","*MCBR001"]
["*MCMARTIN RICHARD","*MCMA001"]
["*ME CAROLINE BESSETTE","*DESM001"]
["*ME FRANCIS PIERRE RÉMILLARD","*PIGE001"]
["*ME MARTIAL LAVOIE","*LAPI004"]
["*ME MARTIN LEGAULT","*GARO003"]
["*ME NATHALIE DAHAN","*THER005"]
["*ME NATHALIE DUBÉ IN TRUST","*LONG001"]
["*ME PIERRE CHARTIER","*MENI001"]
["*ME RÉAL LAVOIE","*QUE 001"]
["*ME SYLVIE BABIN","*9150001"]
["*ME SYLVIE BABIN, NOTAIRE","*2742003"]
["*MENUISERIE COWBOY JACK INC","*MENU001"]
["*MESSIER HUGUETTE","*MESS001"]
["*METRO QUEBEC IMMOBILIER INC","*METR001"]
["*MICHAUD DENIS, GRAVEL CAROLE","*MICH002"]
["*MICHAUD JACQUELINE","*MICH004"]
["*MICHEL-ANTHONY KUNTA SCHMIT-CRAAN","*MICH001"]
["*MILLETTE MARCEL","*MILL001"]
["*MINISTERE DES TRANSPORTS","*MINI001"]
["*MIVILLE MONIQUE","*MIVI001"]
["*MME CHANTAL PREVOST","*DUGU001"]
["*MME CINDY GILBERT, M. JIMMY GILBERT &","*CADI004"]
["*MME JASMINE LEHOUILLIER","*JOLY001"]
["*MME JULIE LIZOTTE","*LIZO001"]
["*MME MÉLANIE AUDET &","*PINE001"]
["*MME SUZIE CORBEIL","*LEVA004"]
["*MMES NICOLE TREMBLAY & NATHALIE TREMBLAY","*LES 015"]
["*MONETTE ANDRE","*MONE002"]
["*MONETTE SYLVAIN, LANGEVIN GINA","*MONE001"]
["*MONGEAU SYLVAIN, O CONNOR GUYLAINE","*MONG001"]
["*MONSIEUR  ROGER DROUIN &","*LOCA001"]
["*MONSIEUR ALAIN GAGNON","*GAGN007"]
["*MONSIEUR EMMANUEL MANTHA","*MANT001"]
["*MONSIEUR ÉRIC BOUDREAULT","*BOUD002"]
["*MONSIEUR LUC ASSELIN","*GREN006"]
["*MONSIEUR MARCEL VIVIER","*VIVI001"]
["*MONSIEUR MAURICE HÉBERT","*POUL004"]
["*MONSIEUR RÉMI BEAUCHAMP","*REMI001"]
["*MONSIEUR ROBERT ST MARTIN","*ST M001"]
["*MONSIEUR YVON LEVASSEUR &","*LEVA003"]
["*MORANVILLE YVON","*MOR 001"]
["*MOREAU JEAN RENE","*MORE001"]
["*MORIN BINETTE DANIS, HOGUE AMELIE","*MORI015"]
["*MORIN CHRISTIAN, VIVIER","*MORI008"]
["*MORIN DANIEL & PHILIPPON CAROLINE","*AUGE002"]
["*MORIN DIANE","*MORI012"]
["*MORIN EGIDE","*MORI002"]
["*MORIN GINO, MARLEAU ALINE","*MORI005"]
["*MORIN MARITA DAVID","*MORI017"]
["*MORIN PHILIPPE","*MORI014"]
["*MORIN RENE, RIVARD LOUISE","*MORI006"]
["*MORISSETTE STEPHANE, MORISSETTE","*MORI004"]
["*MORNEAU STEVE, RAYNAULD KARINE","*MORN001"]
["*MOUSSETTE YANNICK, PELLETIER","*MOUS001"]
["*MUNICIPALITÉ DE RAWDON","*MUNI002"]
["*MUNICIPALITÉ DE SAINT-COLOMBAN","*MUNI001"]
["*NATHALIE FAUCHER","*FAU 001"]
["*NAULT JEAN PAUL","*NAUL001"]
["*NEAULT FRANCIS, BEAUSEIGLE NADINE","*NEAU001"]
["*NEVEU, MARYSE Notaires","*NEVE001"]
["*NICOLA NUCCIARONE","*NUCC001"]
["*NICOLAS FRANCIS","*NICO001"]
["*NICOLE VAILLANCOURT","*VAIL002"]
["*NOEL COLOMBE","*NOEL001"]
["*NUCCIARONE NICOLA","*NUC0001"]
["*OHDE PETER JENS, BOMBARD ARLETTE","*OHDE001"]
["*OISELLERIE, OISEAUX WOW","*OISE001"]
["*OPTIMA SANTÉ GLOBALE INC.","*OPTI001"]
["*OUELLETTE MANON","*OUEL004"]
["*OUELLETTE NATHALIE, BIBEAU ALAIN","*OUEL003"]
["*OUELLETTE RENE RICHARD JR","*OUEL006"]
["*OUIMET SERGE, LESSARD CHANTAL","*OUIM001"]
["*PAGE SERGE","*PAGE001"]
["*PAGE SERGE, SABOURIN GUYLAINE","*PAGE002"]
["*PALARDY MANON","*PALA001"]
["*PANASIUK MICHAEL, GRENIER","*PANA001"]
["*PAPINEAU MAXIME","*PAPI002"]
["*PAQUETTE HUGUETTE","*PAQU001"]
["*PAQUETTE RICHARD","*PAQU012"]
["*PAQUIN RACHEL","*PAQU006"]
["*PAQUIN RITA","*PAQU007"]
["*PARADIS BRIGITTE","*PARA001"]
["*PARADIS PIERRE, PARADIS PAUL","*PARA002"]
["*PARADIS RAYMOND, LANGLOIS LORRAINE","*PARA003"]
["*PARENT ROBERT, BURROGANO GINA","*PARE001"]
["*PARENT, MICHEL, Notaire","*PARE002"]
["*PAULINE RAYMOND","*RAYM003"]
["*PAVAGES DORVAL INC. (LES)","*PAVA001"]
["*PAYER ALEX","*PAYE001"]
["*PEARSON CAROLINE, BARON STEPHANE","*PEAR001"]
["*PELLETIER ANDRE, GIBEAULT SYLVIE","*PELL004"]
["*PELLETIER BERNARD, MADORE MICHELLE","*PELL002"]
["*PELLETIER ERIC","*PELL003"]
["*PELOSSE MICHEL","*PELO001"]
["*PERREAULT DENIS","*PERR003"]
["*PERREAULT JEAN YVES 50% IND,","*PERR004"]
["*PERREAULT MARC-ANTOINE, POMPIER","*PERR005"]
["*PERREAULT MARIE-CLAIRE","*PERR008"]
["*PERRON CLAUDE, PROVOST JUDITH","*PERR006"]
["*PERRON MICHEL, CHARTRAND NATHALIE","*PERR007"]
["*PERRON SEBASTIEN","*PERR001"]
["*PERSECHINO MARIO","*PERS001"]
["*PESANT FRANCIS, LEBLANC SOPHIE","*PESA003"]
["*PESANT LORAINE","*PESA001"]
["*PETER JANSSEN &","*JANS001"]
["*PHARAND MARTINE","*PHAR001"]
["*PHILIPPE ANDRE, GAGNE JOHANNE","*PHIL005"]
["*PICARD-FOURNIER KEVIN","*PICA001"]
["*PICHETTE DENIS","*PICH002"]
["*PICHETTE LOUISE, PICHETTE","*PICH001"]
["*PICOTTE ROBERT, COUTURIER GISELE","*PICO001"]
["*PIERRE MARTEL","*OUEL005"]
["*PIERRE ROBERT JR","*PIER003"]
["*PIERRE YVES","*PIER001"]
["*PIGEON DANIEL, BLAIN DIANE","*PIGE002"]
["*PIGEON MARTIN","*PIGE003"]
["*PILON ANDRE","*PILO004"]
["*PILON MICHEL","*PILO001"]
["*PITIORET FRANCOIS, FORTIN","*PITI001"]
["*PITRE ANTOINE","*PITR001"]
["*PLANTE LOUIS-PHILIPPE, MARTEL","*PLAN001"]
["*PLOMBERIE DANY DESCOTEAUX INC","*GEST002"]
["*PLOUFFE BRUNO","*PLOU001"]
["*PLOUFFE RENE","*PLOU002"]
["*PLOUFFE, GINETTE, Notaires","*PLOU005"]
["*PME INTER NOTAIRES HÉBERT & ASSOCIÉS","*PME 001"]
["*POUDRET ERIC","*POUD001"]
["*POUDRIER CHANTAL","*POUD002"]
["*POULIN LUCIEN","*POUL002"]
["*POULIN MARIO","*POUL001"]
["*POUPART BRIGITTE","*POUP001"]
["*PROFID'OR COOPERATIVE AGRICOLE","*PROF001"]
["*PROJET D'HABITATION MARCEL LOYER INC","*PROJ001"]
["*PROPRIETES PROVIGO LIMITEE","*PROP001"]
["*PROULX FRANCIS, ROBERT","*PROU001"]
["*PRUD HOMME CARMEN","*PRUD001"]
["*PRUD HOMME NORMAND","*PRUD002"]
["*PRUNEAU BRIGITTE","*PRUN001"]
["*QUENNEVILLE RAYMONDE","*QUEN001"]
["*QUERRY ERIC","*QUER001"]
["*QUEVILLON JEAN, AYOTTE LUCIENNE","*QUEV001"]
["*QUEVILLON MICHEL, BERNIER LOLA","*QUEV004"]
["*QUINTIN YVAN-GUY, MARTINEAU MANON","*QUIN001"]
["*QUIRION GISELE","*QUIR001"]
["*RACETTE STEVE, BOUCHARD MARTINE","*RACE001"]
["*RACINE NOELLA","*RACI001"]
["*RAVARY SYLVAIN L","*RAVA001"]
["*RAYMOND BLONDIN TRANSPORT INC","*RAYM005"]
["*RAYMOND DOMINIQUE","*RAYM001"]
["*RAYMOND PAULINE","*RAYM002"]
["*RAYMOND POTVIN","*POTV002"]
["*RE/MAX EN TETE INC","*RE/M001"]
["*RENAUD ERIC, HARVEY EMMANUELLE","*RENA006"]
["*RENAUD JACQUES","*RENA008"]
["*RENAUD JOHANNE","*RENA001"]
["*RENAUD STEPHANE","*RENA002"]
["*RENAUD, GILLES, Notaire","*RENA007"]
["*RESIDENCE LAURIER","*RESI001"]
["*RÉSIDENCE MÉMOIRE D'ANTAN","*RÉSI001"]
["*RICHARD IRENEE, JULIEN ANDREE","*RICH002"]
["*RICHARD LINE","*RICH001"]
["*RICHARD PASCALE","*RICH007"]
["*RICHARD REAL, GALARNEAU GEORGETTE","*RICH003"]
["*RICHARD STEVE","*RICH005"]
["*RICHARD URSULINE","*RICH004"]
["*RICHER DANIEL, COUTU GENEVIEVE","*RICH006"]
["*RIENDEAU JEAN","*RIEN001"]
["*RIOUX REAL","*RIOU001"]
["*RIQUIER MARTIN","*RIQU001"]
["*RITCHOT DANNY","*RITC001"]
["*RIVARD DANY","*RIVA003"]
["*RIVARD LOUIS","*RIVA001"]
["*RIVARD LOUIS-MARIE","*RIVA002"]
["*RIZZI SYLVANNA","*RIZZ001"]
["*ROBERGE DANIEL","*ROBE003"]
["*ROBIDOUX PASCAL","*ROBI004"]
["*ROBILLARD ERIC, JALETTE SANDRA","*ROBI002"]
["*ROBILLARD TESSA, ARSENAULT JOSEE","*ROBI005"]
["*ROBITAILLE PIERRE","*ROBI003"]
["*RODRIGUE SIMON","*RODR002"]
["*ROGER ERIC, GOULET MARTIN JUNIOR","*ROGE001"]
["*ROGER ROBILLARD","*ROB001"]
["*ROHRBASSER MONIQUE","*ROHR001"]
["*ROMPRE FRANCINE","*ROMP001"]
["*RONDEAU MAXIME","*ROND001"]
["*ROULEAU SYLVAIN","*ROUL001"]
["*ROULOTTES ANDRE SERVANT INC","*ROUL002"]
["*ROUSSEAU CLAUDETTE","*ROUS004"]
["*ROUX MANON","*ROUX001"]
["*ROY CHRISTIAN, BERTRAND MELANIE","*ROY 002"]
["*ROY DANY","*ROY 003"]
["*ROY GUY","*ROY 001"]
["*ROY PHILIPPE, ROBERT LAURENCE","*ROY 005"]
["*RUSSELL CLAUDE, LACHANCE SYLVIE","*RUSS001"]
["*SABOURIN FRANCE, COSSETTE PIERRE","*SABO001"]
["*SAGALA MARC-ANDRE, BINET SONIA","*SAGA001"]
["*SALMAN FRANCE","*SALM001"]
["*SANDER J ABRAHAMS","*ST-L002"]
["*SANDRA SMITH","*VAIL003"]
["*SANON MARIE MARTHE","*SANO001"]
["*SARRAZIN CHAUVETTE SABRINA,","*SARR001"]
["*SAVARD COLOMBE","*SAVA006"]
["*SAVARD MICHELINE","*SAVA002"]
["*SAVOIE BENOIT","*SAVO001"]
["*SCHMIDT RUTH, FOISY MONIQUE","*SCHM001"]
["*SEBASTIEN NARBONNE VALLEE","*COUT004"]
["*SEGUIN CLAUDE, SEGUIN SYLVAIN","*SEGU001"]
["*SERGE LECLERC ENR.","*SERG001"]
["*SERV. IMMOBILIER TRUSTCAN INC.","*HYPO001"]
["*SERVANT GERALD","*SERV002"]
["*SERVANT LUC, SIMARD FRANCINE","*SERV001"]
["*SERVICE HYPOTHECAIRE CIBC","*TURC001"]
["*SIGOUIN PATRICK","*SIGO001"]
["*SIMARD JOSIANNE","*SIMA002"]
["*SIMEXCO","*SIME001"]
["*SIMONEAU ANNE","*SIMO006"]
["*SIMONEAU CLAUDE, FALARDEAU CLAIRE","*SIMO005"]
["*SINCLAIR DENIS","*SINC001"]
["*SINFONIA DE LANAUDIÈRE","*SINF001"]
["*SMITH FRANCIS","*SMIT001"]
["*SNC-LAVALIN GEM QUÉBEC INC.","*SNCL001"]
["*SOC. GESTION D INV. I.G. LTÉE","*BEDA001"]
["*SOC. GESTION D'INV. I.G.","*VILL010"]
["*SOC. GESTION D'INV. I.G. LTEE","*PHIL001"]
["*SOCIÉTÉ ALZHEIMER DE LANAUDIÈRE","*SOCI002"]
["*SOCIÉTÉ DE SERVICE MCAP","*BEAU005"]
["*SOCIETE DE SERVICES MCAP","*PEPI001"]
["*SOCIÉTÉ DE SERVICES MCAP","*BEAU006"]
["*SOCIÉTÉ D'HISTOIRE ET DU PATRIMOINE","*SOCI003"]
["*SOCIÉTÉ D'HSTOIRE ET DU PATRIMOINE","*SOCI004"]
["*SOCIETE D'HYPOTHEQUE CIBC","*BAST003"]
["*SOCIÉTÉ D'HYPOTHÈQUE CIBC","*FISE001"]
["*SOCIÉTÉ DHYPOTHÈQUES CIBC","*MORI016"]
["*SOCIÉTÉ D'HYPOTHÈQUES CIBC","*BELL005"]
["*SOCIÉTÉ D'YPOTHÈQUE CIBC","*GREN003"]
["*SOCIETE IMMOBIL CLUB DES 4 SENC","*SOCI001"]
["*SOLMATECH INC.","*SOLMA"]
["*SOLUTION-DIVISION DE ENGLOBE CORP.","*SOLU001"]
["*SOS AVENTURES INC.","*SOS001"]
["*SOUCY ANDREE","*SOUC001"]
["*SOUCY STEVE, FORGET MYLENE","*SOUC004"]
["*SPCA LANAUDIÈRE BASSES-LAURENTIDES","*SPCA001"]
["*SPENARD STEPHANE","*SPEN001"]
["*SPORTS MONTRÉAL INC.","*SPOR001"]
["*ST AMAND TOBY, PREVILLE SONIA","*ST A001"]
["*ST CYR ANDRE","*ST C001"]
["*ST PIERRE CELINE","*ST P002"]
["*ST PIERRE MARC","*ST P003"]
["*ST-AMAND SYLVIE","*ST-A003"]
["*ST-AMANT CLAUDE, WEDGE CHRISTIANE","*ST-A002"]
["*ST-ARNEAULT DANIEL","*ST-A001"]
["*STATION SERVICE JACQUES TREMBLAY INC","*STAT001"]
["*STEPHAN ROY & ASSOCIES","*STEP001"]
["*STÉPHANE QUIRION &","*9223008"]
["*ST-GEORGES VANESSA, HARNOIS KEVIN","*ST-G001"]
["*ST-HILAIRE HELENE","*ST-H001"]
["*ST-JACQUES, Sophie  NOTAIRE","*ST-J001"]
["*ST-LOUIS ANDRE","*ST-L001"]
["*ST-PIERRE MICHEL","*ST-P001"]
["*STRATÉGIE 360 INC.","*STRA001"]
["*SUCCESSION LAURENT BELISLE","*SUCC001"]
["*SUPERCLUB VIDEOTRON #175","*SUPE001"]
["*SYLVESTRE ROBERT, LAFRENIERE","*SYLV001"]
["*SYND COPRO DU #2191 DOM DE L'EDEN","*SYND001"]
["*T T G CONSTRUCTION INC","*2632003"]
["*T.D. CANADA TRUST","*MAHO001"]
["*T.T.G. CONSTRUCTION INC","*T.T.001"]
["*T.T.G. CONSTRUCTION INC.","*T.T.002"]
["*TARDIF SIMON","*TARD001"]
["*TAYLOR-MADE ENTERPRISES INC.","*TAYL001"]
["*TD CANADA TRUST","*9140002"]
["*TD CANADA TRUST CREEKSIDE ADM.","*BLON001"]
["*TD CANADA TRUST CREEKSIDE CR ADM.","*GAUT006"]
["*TD CANADA TRUST, PROPERTY TAX","*LECL001"]
["*TD CANADA TRUST, PROPERTY TAX DEP.","*LARA002"]
["*TD CANADA TRUST/CREEKSIDE CR. ADM","*LAVO001"]
["*TDFS HOME INC.","*LIRE001"]
["*TELLIER ALAIN, TELLIER SYLVAIN","*TELL001"]
["*TERRAULT SYLVAIN","*TERR001"]
["*TESSIER DENISE, LAGACE YVES","*TESS002"]
["*THEAUDIERE ROGER JUNIOR, DECOSTE","*THEA001"]
["*THEORET, DANIEL, Notaire","*THEO001"]
["*THÉRÈSE L.-VÉZINA","*VEZ001"]
["*THERIEN MICHEL","*THER001"]
["*THERM-AIR CONFORT INC.","*THERM01"]
["*THIBAULT FRANCOIS","*THIB005"]
["*THIBAULT ROBERT","*THIB006"]
["*THIBAULT SIMONE, ORGANISATRICE BÉNÉVOLE","*THI001"]
["*THIBODEAU DENIS WILLIAM, CLAESSENS","*THIB002"]
["*THIBODEAU JACQUES","*THIB001"]
["*THUOTTE GEORGES","*THUO001"]
["*TOITURES DES MOULINS INC","*TOIT001"]
["*TOURANGEAU ARMANDE","*TOUR001"]
["*TOURANGEAU JOSÉE","*TOUR01"]
["*TOUSIGNANT DANIEL","*TOUS003"]
["*TOUSTOU SÉBASTIEN","*TOUS002"]
["*TRANSPORT & EXCAVATION MASCOUCHE INC.","*EXCMAS"]
["*TRAVERSY MARC, POMPIER","*TRAV001"]
["*TREMBLAY DAVE","*TREM013"]
["*TREMBLAY LETOURNEAU FRANCIS","*TREM005"]
["*TREMBLAY MANON, DIONNE LISE","*TREM001"]
["*TREMBLAY MARYSE","*TREM007"]
["*TREMBLAY PAUL-EMILE","*TREM002"]
["*TREMBLAY RAY JEAN, RENAUD LISE","*TREM011"]
["*TREMBLAY RAYMOND","*TREM003"]
["*TREMBLAY VANESSA, CARRIERE SAMUEL","*TREM012"]
["*TREPANIER ANNIE","*TREP002"]
["*TROIS FOIS PAR JOUR","*TROI001"]
["*TROPHÉES JLM INC.","*TROP001"]
["*TRUDEL DANIEL","*TRUD002"]
["*TRUDEL FRANCHE HUGHES","*TRUD005"]
["*TRUDEL JONATHAN","*TRUD001"]
["*TTG CONSTRUCTION INC.","*9243002"]
["*TTG CONSTRUCTIONS","*DUBO001"]
["*TTG CONSTRUCTIONS INC.","*2632002"]
["*TUFFE PASCAL","*TUFF001"]
["*ULRICH CLAIRE","*ULRI001"]
["*VACCA CARMELA","*VACC001"]
["*VAILLANCOURT ERIC","*VAIL001"]
["*VALLEE MARCO, MARTEL FRANCINE","*VALL002"]
["*VALLIERES JOSEE","*VALL001"]
["*VAN GEENHOVEN REJEAN","*VAN 001"]
["*VANDAL SUZANNE","*VAND001"]
["*VANESSA DANEAULT PILOTE","*VANE001"]
["*VEILLETTE LOUISE","*VEIL003"]
["*VEILLETTE RICHARD, DUFAULT LOUISE","*VEIL001"]
["*VEILLEUX RENE, BOISVERT LISETTE","*VEIL002"]
["*VENNE GILBERT, JEAN NADINE","*VENN003"]
["*VENNE HENRI PAUL","*VENN001"]
["*VENNE KENAN, BERGERON JULIE","*VENN002"]
["*VENT2000 REPOUSSAGE DE METAUX INC","*VENT003"]
["*VERMETTE NORMAND","*VERM002"]
["*VERMETTE NORMAND, BELLEROSE CAROLE","*VERM001"]
["*VERREAULT MARC","*VERR001"]
["*VEZINA THERESE L.","*VEZI001"]
["*VIEL MARTINE, HARQUAIL PATRICE","*VIEL001"]
["*VILLE DE NOTRE-DAME-DES-PRAIRIES","*VILL007"]
["*VILLE DE SAINT-JÉRÔME","*VILL006"]
["*VILLENEUVE CHRISTIAN","*VILL001"]
["*VILLENEUVE REJEAN, LEBEL CHRISTINE","*VILL002"]
["*VISE","*VISE001"]
["*VRAC ET CIE","*VRAC001"]
["*VTT DES BASSES LAURENTIDES","*VTT0001"]
["*WACQUIEZ AUDRAY, BELLEY MARIO","*WACQ001"]
["*WARD GUILLAUME","*WARD001"]

{"sheet":"LISTE DES RÉQUISITIONS","index":3,"n_rows":5501,"n_cols":17,"rows_kept":5501,"cut":false,"hidden":false,"merged":[[1,6,1,9],[1,0,10,1],[1,2,1,3],[1,4,1,5]]}
[]
["LÉGENDE",null,"FAIT PAR",null,"DÉPARTEMENT",null,"REQUIS PAR"]
[null,null,1,null,1,null,1,null,1]
[null,null,2,"Lyna Thériault",2,"Administration",2,"Patrick Massé",10,"Ronald Bruyère"]
[null,null,3,"Francine Dugas",3,"Voirie",3,"Richard Dufort",11,"André Paquin"]
[null,null,4,"Marie-Pier Bélanger",4,"Loisirs",4,"Sylvain Martel",12,"André Héroux"]
[null,null,5,"Stéphanie Chrétien",5,"Greffe",5,"Lyna Thériault",13,"Michel Marcoux"]
[null,null,6,"Mélanie Bossé",6,"Urbanisme",6,"Mélanie Bossé",14,"Jessica Colpron"]
[null,null,7,"Johanne Raymond",7,"Bibliothèque",7,"Johanne Raymond",15,"Aude Ruais"]
[null,null,8,"Elisa-Ann Sourdif",8,"Incendie",8,"Élisa-Ann Sourdif",16,"Katherine Bernier",null,null,null,null,null,null,10]
[null,null,9,"Danielle Gravel",9,"Piscine",9,"Danielle Gravel",17,"Conseil Municipale"]
[null,null,10,"Sylvain Martel",null,null,null,null,18,"Daniel Héroux",null,null,"Go à la",null,null,null,15]
["Date","# Réquisition",null,"Fait par",null,"Dept",null,"Requis Par",null,"Nom Fournisseur","# Fournisseur","Descriptions","Réquisition"]
[null,null,null,null,null,null,null,null,null,null,null,null,null,"1740 TAPIS PRÉLARTS INC.","1740TAP",{"$f":"DATE(2017,11,1)","v":"2017-11-01"}]
["2017-11-01","13-5500",2,{"$f":"CHOOSE(C15,\" \",$D$4,$D$5,$D$6,$D$7,$D$8,$D$9,$D$10,$D$11,$D$12)","v":"Lyna Thériault"},2,{"$f":"CHOOSE(E15,\" \",$F$4,$F$5,$F$6,$F$7,$F$8,$F$9,$F$10,$F$11,$F$4,$F$5,$F$6,$F$7,$F$8)","v":"Administration"},11,{"$f":"CHOOSE(G15,\" \",$H$4,$H$5,$H$6,$H$7,$H$8,$H$9,$H$10,$H$11,$J$4,$J$5,$J$6,$J$7,$J$8,$J$9,$J$10,\" \")","v":"André Paquin"},null,"COOP PROFID'OR",{"$f":"VLOOKUP(J15,FOURNISSEURS!$A$1:$B$2212,2,0)","v":"C27300"},"DIVERS POUR DÉCO DE NOËL",null,"4122682 CANADA INC.","4122682",{"$f":"P14+1","v":"2017-11-02"}]
["2017-11-01",null,10,"Sylvain Martel",2,{"$f":"CHOOSE(E16,\" \",$F$4,$F$5,$F$6,$F$7,$F$8,$F$9,$F$10,$F$11,$F$4,$F$5,$F$6,$F$7,$F$8)","v":"Administration"},4,{"$f":"CHOOSE(G16,\" \",$H$4,$H$5,$H$6,$H$7,$H$8,$H$9,$H$10,$H$11,$J$4,$J$5,$J$6,$J$7,$J$8,$J$9,$J$10,\" \")","v":"Sylvain Martel"},null,"PETITE CAISSE",{"$f":"VLOOKUP(J16,FOURNISSEURS!$A$1:$B$2212,2,0)","v":"P72675"},"RENFLOUEMENT PETITE CAISSE",null,"4170652 CANADA INC.","Q77425",{"$f":"P15+1","v":"2017-11-03"}]
["2017-11-01",null,2,{"$f":"CHOOSE(C17,\" \",$D$4,$D$5,$D$6,$D$7,$D$8,$D$9,$D$10,$D$11,$D$12)","v":"Lyna Thériault"},7,"Bibliothèque",9,"Danielle Gravel",null,"*TROIS FOIS PAR JOUR",{"$f":"VLOOKUP(J17,FOURNISSEURS!$A$1:$B$2212,2,0)","v":"*TROI001"},"ABONNEMENT TFPJ JANV @ NOV.2018",null,"911 PRO INC.","N67901",{"$f":"P16+1","v":"2017-11-04"}]
["2017-11-01",null,6,{"$f":"CHOOSE(C18,\" \",$D$4,$D$5,$D$6,$D$7,$D$8,$D$9,$D$10,$D$11,$D$12)","v":"Mélanie Bossé"},2,"Administration",6,"Mélanie Bossé",null,"CAFÉ LANAUDIÈRE INC.",{"$f":"VLOOKUP(J18,FOURNISSEURS!$A$1:$B$2212,2,0)","v":"C17510"},"MÉLANGE À CAFÉ ET SUCRE ÉDULCORANT",null,"9161 4321 QUÉBEC INC.","91614321","2017-11-05"]
["2017-11-01",null,7,"Johanne Raymond",2,"Administration",2,"Patrick Massé",null,"TOILETTES LANAUDIÈRE",{"$f":"VLOOKUP(J19,FOURNISSEURS!$A$1:$B$2212,2,0)","v":"T90395"},"LOCATION TOILETTE HALLOWEEN",null,"9176 9885 QUÉBEC INC.","N67903","2017-11-06"]
[null,null,1," ",1," ",1," ",null,null,{"$f":"VLOOKUP(J20,FOURNISSEURS!$A$1:$B$2212,2,0)","v":{"$error":"#N/A"}},null,null,"9276 8316 QUÉBEC INC.","S82250","2017-11-07"]
[null,null,1," ",1," ",1," ",null,null,{"$f":"VLOOKUP(J21,FOURNISSEURS!$A$1:$B$2212,2,0)","v":{"$error":"#N/A"}},null,null,"9276-8316 QUÉBEC INC.","N67905","2017-11-08"]
[null,null,1," ",1," ",1," ",null,null,{"$f":"VLOOKUP(J22,FOURNISSEURS!$A$1:$B$2212,2,0)","v":{"$error":"#N/A"}},null,null,"9284-0313 QUÉBEC INC.","N67908","2017-11-09"]
[null,null,1," ",1," ",1," ",null,null,{"$f":"VLOOKUP(J23,FOURNISSEURS!$A$1:$B$2212,2,0)","v":{"$error":"#N/A"}},null,null,"9299 7121 QUÉBEC INC.","N67910","2017-11-10"]
[null,null,1," ",1," ",1," ",null,null,{"$f":"VLOOKUP(J24,FOURNISSEURS!$A$1:$B$2212,2,0)","v":{"$error":"#N/A"}},null,null,"9303 7844 QUÉBEC INC.","N67920","2017-11-11"]
[null,null,1," ",1," ",1," ",null,null,{"$f":"VLOOKUP(J25,FOURNISSEURS!$A$1:$B$2212,2,0)","v":{"$error":"#N/A"}},null,null,"9306-1380 QUÉBEC INC.","A05850","2017-11-12"]
[null,null,1," ",1," ",1," ",null,null,{"$f":"VLOOKUP(J26,FOURNISSEURS!$A$1:$B$2212,2,0)","v":{"$error":"#N/A"}},null,null,"9317-9638 QUÉBEC INC.","N67921","2017-11-13"]
[null,null,1," ",1," ",1," ",null,null,{"$f":"VLOOKUP(J27,FOURNISSEURS!$A$1:$B$2212,2,0)","v":{"$error":"#N/A"}},null,null,"A.T.P.A. SECTION QUEBEC","A00675","2017-11-14"]
[null,null,1," ",1," ",1," ",null,null,{"$f":"VLOOKUP(J28,FOURNISSEURS!$A$1:$B$2212,2,0)","v":{"$error":"#N/A"}},null,null,"A-1 LIGNES JAUNES","A00750","2017-11-15"]
[null,null,1," ",1," ",1," ",null,null,{"$f":"VLOOKUP(J29,FOURNISSEURS!$A$1:$B$2212,2,0)","v":{"$error":"#N/A"}},null,null,"A25-LE LIEN INTELLIGENT","A00800","2017-11-16"]
[null,null,1," ",1," ",1," ",null,null,{"$f":"VLOOKUP(J30,FOURNISSEURS!$A$1:$B$2212,2,0)","v":{"$error":"#N/A"}},null,null,"ABC ENVIRONNEMENT INC.","A00900","2017-11-17"]
[null,null,1," ",1," ",1," ",null,null,{"$f":"VLOOKUP(J31,FOURNISSEURS!$A$1:$B$2212,2,0)","v":{"$error":"#N/A"}},null,null,"ABC RIVE-NORD INC.","A01000","2017-11-18"]
[null,null,1," ",1," ",1," ",null,null,{"$f":"VLOOKUP(J32,FOURNISSEURS!$A$1:$B$2212,2,0)","v":{"$error":"#N/A"}},null,null,"ABRIS CRYSTAL INC.","A01010","2017-11-19"]
[null,null,1," ",1," ",1," ",null,null,{"$f":"VLOOKUP(J33,FOURNISSEURS!$A$1:$B$2212,2,0)","v":{"$error":"#N/A"}},null,null,"ABS","A01050","2017-11-20"]
[null,null,1," ",1," ",1," ",null,null,{"$f":"VLOOKUP(J34,FOURNISSEURS!$A$1:$B$2212,2,0)","v":{"$error":"#N/A"}},null,null,"ACCES COMMUNICATIONS","A01200","2017-11-21"]
[null,null,1," ",1," ",1," ",null,null,{"$f":"VLOOKUP(J35,FOURNISSEURS!$A$1:$B$2212,2,0)","v":{"$error":"#N/A"}},null,null,"ACCS LE GROUPE","A01220","2017-11-22"]
[null,null,1," ",1," ",1," ",null,null,{"$f":"VLOOKUP(J36,FOURNISSEURS!$A$1:$B$2212,2,0)","v":{"$error":"#N/A"}},null,null,"ACIER D'ARMATURE 2000 INC","A01230","2017-11-23"]
[null,null,1," ",1," ",1," ",null,null,{"$f":"VLOOKUP(J37,FOURNISSEURS!$A$1:$B$2212,2,0)","v":{"$error":"#N/A"}},null,null,"ACMQ","A01260","2017-11-24"]
[null,null,1," ",1," ",1," ",null,null,{"$f":"VLOOKUP(J38,FOURNISSEURS!$A$1:$B$2212,2,0)","v":{"$error":"#N/A"}},null,null,"AD.MATS","A01500","2017-11-25"]
[null,null,1," ",1," ",1," ",null,null,{"$f":"VLOOKUP(J39,FOURNISSEURS!$A$1:$B$2212,2,0)","v":{"$error":"#N/A"}},null,null,"AERZEN CANADA","A02000","2017-11-26"]
[null,null,1," ",1," ",1," ",null,null,{"$f":"VLOOKUP(J40,FOURNISSEURS!$A$1:$B$2212,2,0)","v":{"$error":"#N/A"}},null,null,"AFFAIRES (LES) JOURNAL","A02250","2017-11-27"]
[null,null,1," ",1," ",1," ",null,null,{"$f":"VLOOKUP(J41,FOURNISSEURS!$A$1:$B$2212,2,0)","v":{"$error":"#N/A"}},null,null,"AGRITEX ST-ROCH","A02400","2017-11-28"]
[null,null,1," ",1," ",1," ",null,null,{"$f":"VLOOKUP(J42,FOURNISSEURS!$A$1:$B$2212,2,0)","v":{"$error":"#N/A"}},null,null,"AIR EN FÊTE (L')","A02910","2017-11-29"]
[null,null,1," ",1,{"$f":"CHOOSE(E43,\" \",$F$4,$F$5,$F$6,$F$7,$F$8,$F$9,$F$10,$F$11,$F$4,$F$5,$F$6,$F$7,$F$8)","v":" "},1,{"$f":"CHOOSE(G43,\" \",$H$4,$H$5,$H$6,$H$7,$H$8,$H$9,$H$10,$H$11,$J$4,$J$5,$J$6,$J$7,$J$8,$J$9,$J$10,\" \")","v":" "},null,null,{"$f":"VLOOKUP(J43,FOURNISSEURS!$A$1:$B$2212,2,0)","v":{"$error":"#N/A"}},null,null,"AIR LIQUIDE CANADA INC.","A02925",{"$f":"P42+1","v":"2017-11-30"}]
[null,null,1," ",1," ",1," ",null,null,{"$f":"VLOOKUP(J44,FOURNISSEURS!$A$1:$B$2212,2,0)","v":{"$error":"#N/A"}},null,null,"AIRTEK INC.","A03150",{"$f":"P43+1","v":"2017-12-01"}]
[null,null,1," ",1," ",1," ",null,null,{"$f":"VLOOKUP(J45,FOURNISSEURS!$A$1:$B$2212,2,0)","v":{"$error":"#N/A"}},null,null,"ALAIN BENOIT TRANSPORT INC.","A03600",{"$f":"P44+1","v":"2017-12-02"}]
[null,null,1," ",1," ",1," ",null,null,{"$f":"VLOOKUP(J46,FOURNISSEURS!$A$1:$B$2212,2,0)","v":{"$error":"#N/A"}},null,null,"ALERTE ANIMAL","A03670","2017-12-03"]
[null,null,1," ",1," ",1," ",null,null,{"$f":"VLOOKUP(J47,FOURNISSEURS!$A$1:$B$2212,2,0)","v":{"$error":"#N/A"}},null,null,"ALIMENTATION MANON BÉLANGER INC.","A03700","2017-12-04"]
[null,null,1," ",1," ",1," ",null,null,{"$f":"VLOOKUP(J48,FOURNISSEURS!$A$1:$B$2212,2,0)","v":{"$error":"#N/A"}},null,null,"ALIMPLUS INC.","A03710","2017-12-05"]
[null,null,1," ",1," ",1," ",null,null,{"$f":"VLOOKUP(J49,FOURNISSEURS!$A$1:$B$2212,2,0)","v":{"$error":"#N/A"}},null,null,"ALPHA TABCO INC.","A03720","2017-12-06"]
[null,null,1," ",1," ",1," ",null,null,{"$f":"VLOOKUP(J50,FOURNISSEURS!$A$1:$B$2212,2,0)","v":{"$error":"#N/A"}},null,null,"ALUMINIUM ANDRE GAGNON INC.","A04500","2017-12-07"]
[null,null,1," ",1," ",1," ",null,null,{"$f":"VLOOKUP(J51,FOURNISSEURS!$A$1:$B$2212,2,0)","v":{"$error":"#N/A"}},null,null,"ALUMINIUM NORD-SUD INC.","A04700","2017-12-08"]
[null,null,1," ",1," ",1," ",null,null,{"$f":"VLOOKUP(J52,FOURNISSEURS!$A$1:$B$2212,2,0)","v":{"$error":"#N/A"}},null,null,"ALUMINIUM PIERRE BRIEN INC.","A04800","2017-12-09"]
[null,null,1," ",1," ",1," ",null,null,{"$f":"VLOOKUP(J53,FOURNISSEURS!$A$1:$B$2212,2,0)","v":{"$error":"#N/A"}},null,null,"AMEUBLEMENT USAGE PLUS","A05100","2017-12-10"]
[null,null,1," ",1," ",1," ",null,null,{"$f":"VLOOKUP(J54,FOURNISSEURS!$A$1:$B$2212,2,0)","v":{"$error":"#N/A"}},null,null,"AMIS DU JARDIN BOTANIQUE DE MONTRÉAL","A05150","2017-12-11"]
[null,null,1," ",1," ",1," ",null,null,{"$f":"VLOOKUP(J55,FOURNISSEURS!$A$1:$B$2212,2,0)","v":{"$error":"#N/A"}},null,null,"AMUSEMENTS SPORTEQUE INC.","A05200","2017-12-12"]
[null,null,1," ",1," ",1," ",null,null,{"$f":"VLOOKUP(J56,FOURNISSEURS!$A$1:$B$2212,2,0)","v":{"$error":"#N/A"}},null,null,"ANDRÉ MAJEAU INC.","A05210","2017-12-13"]
[null,null,1," ",1," ",1," ",null,null,{"$f":"VLOOKUP(J57,FOURNISSEURS!$A$1:$B$2212,2,0)","v":{"$error":"#N/A"}},null,null,"ANIMATION DÉCLIC LTÉE","A05230","2017-12-14"]
[null,null,1," ",1," ",1," ",null,null,{"$f":"VLOOKUP(J58,FOURNISSEURS!$A$1:$B$2212,2,0)","v":{"$error":"#N/A"}},null,null,"ANNEX PUBLISHING & PRINTING INC.","A05250","2017-12-15"]
[null,null,1," ",1," ",1," ",null,null,{"$f":"VLOOKUP(J59,FOURNISSEURS!$A$1:$B$2212,2,0)","v":{"$error":"#N/A"}},null,null,"APPAREILS TECHNI PRO ENR.","A05275","2017-12-16"]
[null,null,1," ",1," ",1," ",null,null,{"$f":"VLOOKUP(J60,FOURNISSEURS!$A$1:$B$2212,2,0)","v":{"$error":"#N/A"}},null,null,"APSAM","A05300","2017-12-17"]
[null,null,1," ",1," ",1," ",null,null,{"$f":"VLOOKUP(J61,FOURNISSEURS!$A$1:$B$2212,2,0)","v":{"$error":"#N/A"}},null,null,"APTIKA","A05310","2017-12-18"]
[null,null,1," ",1," ",1," ",null,null,{"$f":"VLOOKUP(J62,FOURNISSEURS!$A$1:$B$2212,2,0)","v":{"$error":"#N/A"}},null,null,"APUR (MARC PILON) URBANISTES-CONSEILS","A05312","2017-12-19"]
[null,null,1," ",1," ",1," ",null,null,{"$f":"VLOOKUP(J63,FOURNISSEURS!$A$1:$B$2212,2,0)","v":{"$error":"#N/A"}},null,null,"AQTR","A05315","2017-12-20"]
[null,null,1," ",1," ",1," ",null,null,{"$f":"VLOOKUP(J64,FOURNISSEURS!$A$1:$B$2212,2,0)","v":{"$error":"#N/A"}},null,null,"AQUA NOVA","A05320","2017-12-21"]
[null,null,1," ",1," ",1," ",null,null,{"$f":"VLOOKUP(J65,FOURNISSEURS!$A$1:$B$2212,2,0)","v":{"$error":"#N/A"}},null,null,"AQUA TECHNO SPÉCIALISTE AQUATIQUE INC","A05325","2017-12-22"]
[null,null,1," ",1," ",1," ",null,null,{"$f":"VLOOKUP(J66,FOURNISSEURS!$A$1:$B$2212,2,0)","v":{"$error":"#N/A"}},null,null,"AQUAM SPÉCIALISTE AQUATIQUE INC.","A05350","2017-12-23"]
[null,null,1," ",1," ",1," ",null,null,{"$f":"VLOOKUP(J67,FOURNISSEURS!$A$1:$B$2212,2,0)","v":{"$error":"#N/A"}},null,null,"ARBITRAGE PIERRE LAMARCHE","A05400","2017-12-24"]
[null,null,1," ",1," ",1," ",null,null,{"$f":"VLOOKUP(J68,FOURNISSEURS!$A$1:$B$2212,2,0)","v":{"$error":"#N/A"}},null,null,"ARENE JEAN-LUC","A05430","2017-12-25"]
[null,null,1," ",1," ",1," ",null,null,{"$f":"VLOOKUP(J69,FOURNISSEURS!$A$1:$B$2212,2,0)","v":{"$error":"#N/A"}},null,null,"AREO-FEU LTEE","A05450","2017-12-26"]
[null,null,1," ",1," ",1," ",null,null,{"$f":"VLOOKUP(J70,FOURNISSEURS!$A$1:$B$2212,2,0)","v":{"$error":"#N/A"}},null,null,"ARTEC ENTREPRENEUR PAYSAGISTE","A05455","2017-12-27"]
[null,null,1," ",1," ",1," ",null,null,{"$f":"VLOOKUP(J71,FOURNISSEURS!$A$1:$B$2212,2,0)","v":{"$error":"#N/A"}},null,null,"ARTS GRAPHIQUES ALPHONSO INC.","A05460","2017-12-28"]
[null,null,1," ",1," ",1," ",null,null,{"$f":"VLOOKUP(J72,FOURNISSEURS!$A$1:$B$2212,2,0)","v":{"$error":"#N/A"}},null,null,"ASCENSEURS INNOVATEC","A05500","2017-12-29"]
[null,null,1," ",1," ",1," ",null,null,{"$f":"VLOOKUP(J73,FOURNISSEURS!$A$1:$B$2212,2,0)","v":{"$error":"#N/A"}},null,null,"ASD PROMOTION","A05520","2017-12-30"]
[null,null,1," ",1," ",1," ",null,null,{"$f":"VLOOKUP(J74,FOURNISSEURS!$A$1:$B$2212,2,0)","v":{"$error":"#N/A"}},null,null,"ASPHALTE DESJARDINS INC.","A05625","2017-12-31"]
[null,null,1," ",1," ",1," ",null,null,{"$f":"VLOOKUP(J75,FOURNISSEURS!$A$1:$B$2212,2,0)","v":{"$error":"#N/A"}},null,null,"ASPHALTE JEAN-LOUIS CAMPEAU INC.","A05860","2018-01-01"]
[null,null,1," ",1," ",1," ",null,null,{"$f":"VLOOKUP(J76,FOURNISSEURS!$A$1:$B$2212,2,0)","v":{"$error":"#N/A"}},null,null,"ASPHALTE LANAUDIERE INC","A05870","2018-01-02"]
[null,null,1," ",1," ",1," ",null,null,{"$f":"VLOOKUP(J77,FOURNISSEURS!$A$1:$B$2212,2,0)","v":{"$error":"#N/A"}},null,null,"ASPIRATEUR 2000 PLUS","A05950","2018-01-03"]
[null,null,1," ",1," ",1," ",null,null,{"$f":"VLOOKUP(J78,FOURNISSEURS!$A$1:$B$2212,2,0)","v":{"$error":"#N/A"}},null,null,"ASS BIBLIOTHÈQUES PUBLIQUES QUÉBEC","A06050","2018-01-04"]
[null,null,1," ",1," ",1," ",null,null,{"$f":"VLOOKUP(J79,FOURNISSEURS!$A$1:$B$2212,2,0)","v":{"$error":"#N/A"}},null,null,"ASS PROPRIETAIRES DOM. VILMONT INC.","A06975","2018-01-05"]
[null,null,1," ",1," ",1," ",null,null,{"$f":"VLOOKUP(J80,FOURNISSEURS!$A$1:$B$2212,2,0)","v":{"$error":"#N/A"}},null,null,"ASSOCIATION AMIS DU FOLKLORE","A07875","2018-01-06"]
[null,null,1," ",1," ",1," ",null,null,{"$f":"VLOOKUP(J81,FOURNISSEURS!$A$1:$B$2212,2,0)","v":{"$error":"#N/A"}},null,null,"ASSOCIATION CANADIENNE DE LA PAIE","A06060","2018-01-07"]
[null,null,1,{"$f":"CHOOSE(C82,\" \",$D$4,$D$5,$D$6,$D$7,$D$8,$D$9,$D$10,$D$11,$D$12)","v":" "},1," ",1," ",null,null,{"$f":"VLOOKUP(J82,FOURNISSEURS!$A$1:$B$2212,2,0)","v":{"$error":"#N/A"}},null,null,"ASSOCIATION CARREFOUR FAMILLE MONTCALM","A06075","2018-01-08"]
[null,null,1," ",1," ",1," ",null,null,{"$f":"VLOOKUP(J83,FOURNISSEURS!$A$1:$B$2212,2,0)","v":{"$error":"#N/A"}},null,null,"ASSOCIATION DES CHEFS","A08325","2018-01-09"]
[null,null,1," ",1," ",1," ",null,null,{"$f":"VLOOKUP(J84,FOURNISSEURS!$A$1:$B$2212,2,0)","v":{"$error":"#N/A"}},null,null,"ASSOCIATION DES GESTIONNAIRES","A06300","2018-01-10"]
[null,null,1," ",1," ",1," ",null,null,{"$f":"VLOOKUP(J85,FOURNISSEURS!$A$1:$B$2212,2,0)","v":{"$error":"#N/A"}},null,null,"ASSOCIATION DES POMPIERS","A08775","2018-01-11"]
[null,null,1," ",1," ",1," ",null,null,{"$f":"VLOOKUP(J86,FOURNISSEURS!$A$1:$B$2212,2,0)","v":{"$error":"#N/A"}},null,null,"ASSOCIATION DES POMPIERS AUXILIAIRES","A08770","2018-01-12"]
[null,null,1," ",1," ",1," ",null,null,{"$f":"VLOOKUP(J87,FOURNISSEURS!$A$1:$B$2212,2,0)","v":{"$error":"#N/A"}},null,null,"ASSOCIATION DIRECTEURS MUNICIPAUX QUÉBEC","A08550","2018-01-13"]
[null,null,1," ",1," ",1," ",null,null,{"$f":"VLOOKUP(J88,FOURNISSEURS!$A$1:$B$2212,2,0)","v":{"$error":"#N/A"}},null,null,"ASSOCIATION HANDAMI","A06525","2018-01-14"]
[null,null,1," ",1," ",1," ",null,null,{"$f":"VLOOKUP(J89,FOURNISSEURS!$A$1:$B$2212,2,0)","v":{"$error":"#N/A"}},null,null,"ASSOCIATION HOCKEY MINEUR","A07900","2018-01-15"]
[null,null,1," ",1," ",1," ",null,null,{"$f":"VLOOKUP(J90,FOURNISSEURS!$A$1:$B$2212,2,0)","v":{"$error":"#N/A"}},null,null,"ASSOCIATION QUÉBÉCOISE D'URBANISME","A08776","2018-01-16"]
[null,null,1," ",1," ",1," ",null,null,{"$f":"VLOOKUP(J91,FOURNISSEURS!$A$1:$B$2212,2,0)","v":{"$error":"#N/A"}},null,null,"ATELIER DE REPARATION POIRIER INC.","A08778","2018-01-17"]
[null,null,1," ",1," ",1," ",null,null,{"$f":"VLOOKUP(J92,FOURNISSEURS!$A$1:$B$2212,2,0)","v":{"$error":"#N/A"}},null,null,"ATELIER MOBYDIK INC","A08785","2018-01-18"]
[null,null,1," ",1," ",1," ",null,null,{"$f":"VLOOKUP(J93,FOURNISSEURS!$A$1:$B$2212,2,0)","v":{"$error":"#N/A"}},null,null,"ATELIER URBAIN INC. (L')","A08780","2018-01-19"]
[null,null,1," ",1," ",1," ",null,null,{"$f":"VLOOKUP(J94,FOURNISSEURS!$A$1:$B$2212,2,0)","v":{"$error":"#N/A"}},null,null,"ATERA ENVIRO INC","A09050","2018-01-20"]
[null,null,1," ",1," ",1," ",null,null,{"$f":"VLOOKUP(J95,FOURNISSEURS!$A$1:$B$2212,2,0)","v":{"$error":"#N/A"}},null,null,"ATTRACTION RADIO (8470286 CANADA INC)","A09100","2018-01-21"]
[null,null,1," ",1," ",1," ",null,null,{"$f":"VLOOKUP(J96,FOURNISSEURS!$A$1:$B$2212,2,0)","v":{"$error":"#N/A"}},null,null,"AU PAYS DES GÉANTS INC.","A09125","2018-01-22"]
[null,null,1," ",1," ",1," ",null,null,{"$f":"VLOOKUP(J97,FOURNISSEURS!$A$1:$B$2212,2,0)","v":{"$error":"#N/A"}},null,null,"AUDIO CINÉ FILMS INC.","A09200","2018-01-23"]
[null,null,1," ",1," ",1," ",null,null,{"$f":"VLOOKUP(J98,FOURNISSEURS!$A$1:$B$2212,2,0)","v":{"$error":"#N/A"}},null,null,"AUTOMATES-PREBEC LTEE","A09675","2018-01-24"]
[null,null,1," ",1," ",1," ",null,null,{"$f":"VLOOKUP(J99,FOURNISSEURS!$A$1:$B$2212,2,0)","v":{"$error":"#N/A"}},null,null,"AUTOMATION R.L. INC.","A09700","2018-01-25"]
[null,null,1," ",1," ",1," ",null,null,{"$f":"VLOOKUP(J100,FOURNISSEURS!$A$1:$B$2212,2,0)","v":{"$error":"#N/A"}},null,null,"AUTOS J.G. PINARD & FILS LTEE","A09500","2018-01-26"]
[null,null,1,{"$f":"CHOOSE(C101,\" \",$D$4,$D$5,$D$6,$D$7,$D$8,$D$9,$D$10,$D$11,$D$12)","v":" "},1,{"$f":"CHOOSE(E101,\" \",$F$4,$F$5,$F$6,$F$7,$F$8,$F$9,$F$10,$F$11,$F$4,$F$5,$F$6,$F$7,$F$8)","v":" "},1,{"$f":"CHOOSE(G101,\" \",$H$4,$H$5,$H$6,$H$7,$H$8,$H$9,$H$10,$H$11,$J$4,$J$5,$J$6,$J$7,$J$8,$J$9,$J$10,\" \")","v":" "},null,null,{"$f":"VLOOKUP(J101,FOURNISSEURS!$A$1:$B$2212,2,0)","v":{"$error":"#N/A"}},null,null,"AXI SECURITE","A09930","2018-01-27"]
[null,null,1," ",1," ",1," ",null,null,{"$f":"VLOOKUP(J102,FOURNISSEURS!$A$1:$B$2212,2,0)","v":{"$error":"#N/A"}},null,null,"B.G. TRANSPLANTATION INC.","B09935","2018-01-28"]
[null,null,1," ",1," ",1," ",null,null,{"$f":"VLOOKUP(J103,FOURNISSEURS!$A$1:$B$2212,2,0)","v":{"$error":"#N/A"}},null,null,"B.I. AUTO GLACE","B09940","2018-01-29"]
[null,null,1," ",1," ",1," ",null,null,{"$f":"VLOOKUP(J104,FOURNISSEURS!$A$1:$B$2212,2,0)","v":{"$error":"#N/A"}},null,null,"BADIO GREGORY","B09970","2018-01-30"]
[null,null,1," ",1," ",1," ",null,null,{"$f":"VLOOKUP(J105,FOURNISSEURS!$A$1:$B$2212,2,0)","v":{"$error":"#N/A"}},null,null,"BALAI LE PERMANENT INC.","B10000","2018-01-31"]
[null,null,1," ",1," ",1," ",null,null,{"$f":"VLOOKUP(J106,FOURNISSEURS!$A$1:$B$2212,2,0)","v":{"$error":"#N/A"}},null,null,"BALAI VAC","B10025","2018-02-01"]
[null,null,1," ",1," ",1," ",null,null,{"$f":"VLOOKUP(J107,FOURNISSEURS!$A$1:$B$2212,2,0)","v":{"$error":"#N/A"}},null,null,"BALAIS NOMAD INC.","B10015","2018-02-02"]
[null,null,1," ",1," ",1," ",null,null,{"$f":"VLOOKUP(J108,FOURNISSEURS!$A$1:$B$2212,2,0)","v":{"$error":"#N/A"}},null,null,"BARRICADEUR (LE)","B10200","2018-02-03"]
[null,null,1," ",1," ",1," ",null,null,{"$f":"VLOOKUP(J109,FOURNISSEURS!$A$1:$B$2212,2,0)","v":{"$error":"#N/A"}},null,null,"BASCH TEXTILES CANADA INC.","B10250",{"$f":"P108+1","v":"2018-02-04"}]
[null,null,1," ",1," ",1," ",null,null,{"$f":"VLOOKUP(J110,FOURNISSEURS!$A$1:$B$2212,2,0)","v":{"$error":"#N/A"}},null,null,"BAUVAL","B10400","2018-02-05"]
[null,null,1," ",1," ",1," ",null,null,{"$f":"VLOOKUP(J111,FOURNISSEURS!$A$1:$B$2212,2,0)","v":{"$error":"#N/A"}},null,null,"BAUVAL TECH-MIX","B10420","2018-02-06"]
[null,null,1," ",1," ",1," ",null,null,{"$f":"VLOOKUP(J112,FOURNISSEURS!$A$1:$B$2212,2,0)","v":{"$error":"#N/A"}},null,null,"BAYARD CANADA","B10430","2018-02-07"]
[null,null,1," ",1," ",1," ",null,null,{"$f":"VLOOKUP(J113,FOURNISSEURS!$A$1:$B$2212,2,0)","v":{"$error":"#N/A"}},null,null,"BAYARD JEUNESSE / LES EXPLORATEURS","B10440","2018-02-08"]
[null,null,1," ",1," ",1," ",null,null,{"$f":"VLOOKUP(J114,FOURNISSEURS!$A$1:$B$2212,2,0)","v":{"$error":"#N/A"}},null,null,"BAYARD JEUNESSE/LES DÉBROUILLARDS","B10435","2018-02-09"]
[null,null,1," ",1," ",1," ",null,null,{"$f":"VLOOKUP(J115,FOURNISSEURS!$A$1:$B$2212,2,0)","v":{"$error":"#N/A"}},null,null,"BAYARD PRESSE CANADA","B10450","2018-02-10"]
[null,null,1," ",1," ",1," ",null,null,{"$f":"VLOOKUP(J116,FOURNISSEURS!$A$1:$B$2212,2,0)","v":{"$error":"#N/A"}},null,null,"BAYARD PRESSE CANADA INC.","B10500","2018-02-11"]
[null,null,1," ",1," ",1," ",null,null,{"$f":"VLOOKUP(J117,FOURNISSEURS!$A$1:$B$2212,2,0)","v":{"$error":"#N/A"}},null,null,"BC2 GROUPE CONSEIL INC.","B10575","2018-02-12"]
[null,null,1," ",1," ",1," ",null,null,{"$f":"VLOOKUP(J118,FOURNISSEURS!$A$1:$B$2212,2,0)","v":{"$error":"#N/A"}},null,null,"BEAUDET MICHEL","B10580","2018-02-13"]
[null,null,1," ",1," ",1," ",null,null,{"$f":"VLOOKUP(J119,FOURNISSEURS!$A$1:$B$2212,2,0)","v":{"$error":"#N/A"}},null,null,"BEAUDOIN HURENS INC.","B10600","2018-02-14"]
[null,null,1," ",1," ",1," ",null,null,{"$f":"VLOOKUP(J120,FOURNISSEURS!$A$1:$B$2212,2,0)","v":{"$error":"#N/A"}},null,null,"BEAUREGARD FOSSES SEPTIQUES","B10700","2018-02-15"]
[null,null,1," ",1," ",1," ",null,null,{"$f":"VLOOKUP(J121,FOURNISSEURS!$A$1:$B$2212,2,0)","v":{"$error":"#N/A"}},null,null,"BEL ÂGE","B10790","2018-02-16"]
[null,null,1," ",1," ",1," ",null,null,{"$f":"VLOOKUP(J122,FOURNISSEURS!$A$1:$B$2212,2,0)","v":{"$error":"#N/A"}},null,null,"BELANGER SAUVÉ","B10900","2018-02-17"]
[null,null,1," ",1," ",1," ",null,null,{"$f":"VLOOKUP(J123,FOURNISSEURS!$A$1:$B$2212,2,0)","v":{"$error":"#N/A"}},null,null,"BÉLANGER TREMBLAY HUISSIERS DE JUSTICE","B10800","2018-02-18"]
[null,null,1," ",1," ",1," ",null,null,{"$f":"VLOOKUP(J124,FOURNISSEURS!$A$1:$B$2212,2,0)","v":{"$error":"#N/A"}},null,null,"BELISLE ET CARRIERE INC.","B10950","2018-02-19"]
[null,null,1," ",1," ",1," ",null,null,{"$f":"VLOOKUP(J125,FOURNISSEURS!$A$1:$B$2212,2,0)","v":{"$error":"#N/A"}},null,null,"BELL CANADA","B11025","2018-02-20"]
[null,null,1," ",1," ",1," ",null,null,{"$f":"VLOOKUP(J126,FOURNISSEURS!$A$1:$B$2212,2,0)","v":{"$error":"#N/A"}},null,null,"BELL CANADA-PUBLIC ACCES","B12150","2018-02-21"]
[null,null,1," ",1," ",1," ",null,null,{"$f":"VLOOKUP(J127,FOURNISSEURS!$A$1:$B$2212,2,0)","v":{"$error":"#N/A"}},null,null,"BELL MOBILITE","B12375","2018-02-22"]
[null,null,1," ",1," ",1," ",null,null,{"$f":"VLOOKUP(J128,FOURNISSEURS!$A$1:$B$2212,2,0)","v":{"$error":"#N/A"}},null,null,"BELL MOBILITE PAGETTE","B12600","2018-02-23"]
[null,null,1," ",1," ",1," ",null,null,{"$f":"VLOOKUP(J129,FOURNISSEURS!$A$1:$B$2212,2,0)","v":{"$error":"#N/A"}},null,null,"BELLEMARE & GILBERT ARCHITECTES INC.","B12625","2018-02-24"]
[null,null,1," ",1," ",1," ",null,null,{"$f":"VLOOKUP(J130,FOURNISSEURS!$A$1:$B$2212,2,0)","v":{"$error":"#N/A"}},null,null,"BELLEROSE JEAN","B12650","2018-02-25"]
[null,null,1," ",1," ",1," ",null,null,{"$f":"VLOOKUP(J131,FOURNISSEURS!$A$1:$B$2212,2,0)","v":{"$error":"#N/A"}},null,null,"BELVÉDÈRE NISSAN","B12800","2018-02-26"]
[null,null,1," ",1," ",1," ",null,null,{"$f":"VLOOKUP(J132,FOURNISSEURS!$A$1:$B$2212,2,0)","v":{"$error":"#N/A"}},null,null,"BERGER DORYANE","B12900","2018-02-27"]
[null,null,1," ",1," ",1," ",null,null,{"$f":"VLOOKUP(J133,FOURNISSEURS!$A$1:$B$2212,2,0)","v":{"$error":"#N/A"}},null,null,"BERNIER KATHERINE","B13000","2018-02-28"]
[null,null,1," ",1," ",1," ",null,null,{"$f":"VLOOKUP(J134,FOURNISSEURS!$A$1:$B$2212,2,0)","v":{"$error":"#N/A"}},null,null,"BERNIER MARJOLAINE","B13050","2018-03-01"]
[null,null,1," ",1," ",1," ",null,null,{"$f":"VLOOKUP(J135,FOURNISSEURS!$A$1:$B$2212,2,0)","v":{"$error":"#N/A"}},null,null,"BERNIER MATHIEU","B13060","2018-03-02"]
[null,null,1," ",1," ",1," ",null,null,{"$f":"VLOOKUP(J136,FOURNISSEURS!$A$1:$B$2212,2,0)","v":{"$error":"#N/A"}},null,null,"BERTRAND ANNIE","B13120","2018-03-03"]
[null,null,1," ",1," ",1," ",null,null,{"$f":"VLOOKUP(J137,FOURNISSEURS!$A$1:$B$2212,2,0)","v":{"$error":"#N/A"}},null,null,"BERTRAND CHANTAL","B13125","2018-03-04"]
[null,null,1," ",1," ",1," ",null,null,{"$f":"VLOOKUP(J138,FOURNISSEURS!$A$1:$B$2212,2,0)","v":{"$error":"#N/A"}},null,null,"BÉTON ADAM INC.","B13150","2018-03-05"]
[null,null,1," ",1," ",1," ",null,null,{"$f":"VLOOKUP(J139,FOURNISSEURS!$A$1:$B$2212,2,0)","v":{"$error":"#N/A"}},null,null,"BÉTON JACTO","B13200","2018-03-06"]
[null,null,1," ",1," ",1," ",null,null,{"$f":"VLOOKUP(J140,FOURNISSEURS!$A$1:$B$2212,2,0)","v":{"$error":"#N/A"}},null,null,"BÉTON RIVE-NORD ENR.","B13250","2018-03-07"]
[null,null,1," ",1," ",1," ",null,null,{"$f":"VLOOKUP(J141,FOURNISSEURS!$A$1:$B$2212,2,0)","v":{"$error":"#N/A"}},null,null,"BFM","B13400","2018-03-08"]
[null,null,1," ",1," ",1," ",null,null,{"$f":"VLOOKUP(J142,FOURNISSEURS!$A$1:$B$2212,2,0)","v":{"$error":"#N/A"}},null,null,"BF-TECH INC.","B13350","2018-03-09"]
[null,null,1," ",1," ",1," ",null,null,{"$f":"VLOOKUP(J143,FOURNISSEURS!$A$1:$B$2212,2,0)","v":{"$error":"#N/A"}},null,null,"BIBLIO PUB LAVAL LAURENTIDES LANAUDIÈRE","B14200","2018-03-10"]
[null,null,1," ",1," ",1," ",null,null,{"$f":"VLOOKUP(J144,FOURNISSEURS!$A$1:$B$2212,2,0)","v":{"$error":"#N/A"}},null,null,"BIBLIO SERVICE 3C INC","B13725","2018-03-11"]
[null,null,1," ",1," ",1," ",null,null,{"$f":"VLOOKUP(J145,FOURNISSEURS!$A$1:$B$2212,2,0)","v":{"$error":"#N/A"}},null,null,"BIBLIOTHEQUE MUNICIPALE","B14175","2018-03-12"]
[null,null,1," ",1," ",1," ",null,null,{"$f":"VLOOKUP(J146,FOURNISSEURS!$A$1:$B$2212,2,0)","v":{"$error":"#N/A"}},null,null,"BIBLIOTHÈQUES PUBLIQUES DU QUÉBEC","B14250","2018-03-13"]
[null,null,1," ",1," ",1," ",null,null,{"$f":"VLOOKUP(J147,FOURNISSEURS!$A$1:$B$2212,2,0)","v":{"$error":"#N/A"}},null,null,"BIJOU LTEE","B14300","2018-03-14"]
[null,null,1," ",1," ",1," ",null,null,{"$f":"VLOOKUP(J148,FOURNISSEURS!$A$1:$B$2212,2,0)","v":{"$error":"#N/A"}},null,null,"BILANGUES INC.","B14350","2018-03-15"]
[null,null,1," ",1," ",1," ",null,null,{"$f":"VLOOKUP(J149,FOURNISSEURS!$A$1:$B$2212,2,0)","v":{"$error":"#N/A"}},null,null,"BIOLAB","B14400","2018-03-16"]
[null,null,1," ",1," ",1," ",null,null,{"$f":"VLOOKUP(J150,FOURNISSEURS!$A$1:$B$2212,2,0)","v":{"$error":"#N/A"}},null,null,"BLACKIP 360","B14500","2018-03-17"]
[null,null,1," ",1," ",1," ",null,null,{"$f":"VLOOKUP(J151,FOURNISSEURS!$A$1:$B$2212,2,0)","v":{"$error":"#N/A"}},null,null,"BOISVERT CHEVROLET BUICK GMC","B15350","2018-03-18"]
[null,null,1," ",1," ",1," ",null,null,{"$f":"VLOOKUP(J152,FOURNISSEURS!$A$1:$B$2212,2,0)","v":{"$error":"#N/A"}},null,null,"BOIVIN & GAUVIN INC.","B15375","2018-03-19"]
[null,null,1," ",1," ",1," ",null,null,{"$f":"VLOOKUP(J153,FOURNISSEURS!$A$1:$B$2212,2,0)","v":{"$error":"#N/A"}},null,null,"BO-ROY NOTIPLEX ALARME INCENDIE","B15000","2018-03-20"]
[null,null,1," ",1," ",1," ",null,null,{"$f":"VLOOKUP(J154,FOURNISSEURS!$A$1:$B$2212,2,0)","v":{"$error":"#N/A"}},null,null,"BROCHU DONALD","B15400","2018-03-21"]
[null,null,1," ",1," ",1," ",null,null,{"$f":"VLOOKUP(J155,FOURNISSEURS!$A$1:$B$2212,2,0)","v":{"$error":"#N/A"}},null,null,"BRODERIE AXÈ CIBLE INC.","B15500","2018-03-22"]
[null,null,1," ",1," ",1," ",null,null,{"$f":"VLOOKUP(J156,FOURNISSEURS!$A$1:$B$2212,2,0)","v":{"$error":"#N/A"}},null,null,"BRUNEAU JULIE","B15630","2018-03-23"]
[null,null,1," ",1," ",1," ",null,null,{"$f":"VLOOKUP(J157,FOURNISSEURS!$A$1:$B$2212,2,0)","v":{"$error":"#N/A"}},null,null,"BRUYÈRE RONALD, DIR. INCENDIES","B15650","2018-03-24"]
[null,null,1," ",1," ",1," ",null,null,{"$f":"VLOOKUP(J158,FOURNISSEURS!$A$1:$B$2212,2,0)","v":{"$error":"#N/A"}},null,null,"BULLETIN DES AGRICULTEURS (LE)","B15800","2018-03-25"]
[null,null,1," ",1," ",1," ",null,null,{"$f":"VLOOKUP(J159,FOURNISSEURS!$A$1:$B$2212,2,0)","v":{"$error":"#N/A"}},null,null,"BUREAU LAURENTIDES INC.","B15975","2018-03-26"]
[null,null,1," ",1," ",1," ",null,null,{"$f":"VLOOKUP(J160,FOURNISSEURS!$A$1:$B$2212,2,0)","v":{"$error":"#N/A"}},null,null,"BURO-DESIGN INTERNATIONAL","B16325","2018-03-27"]
[null,null,1," ",1," ",1," ",null,null,{"$f":"VLOOKUP(J161,FOURNISSEURS!$A$1:$B$2212,2,0)","v":{"$error":"#N/A"}},null,null,"C.L.B. UNIFORMES INC.","C16525","2018-03-28"]
[null,null,1," ",1," ",1," ",null,null,{"$f":"VLOOKUP(J162,FOURNISSEURS!$A$1:$B$2212,2,0)","v":{"$error":"#N/A"}},null,null,"C.M.P. MAYER INC.","C23850","2018-03-29"]
[null,null,1," ",1," ",1," ",null,null,{"$f":"VLOOKUP(J163,FOURNISSEURS!$A$1:$B$2212,2,0)","v":{"$error":"#N/A"}},null,null,"C.R.S.B.P. DES LAURENTIDES INC.","C17100","2018-03-30"]
[null,null,1," ",1," ",1," ",null,null,{"$f":"VLOOKUP(J164,FOURNISSEURS!$A$1:$B$2212,2,0)","v":{"$error":"#N/A"}},null,null,"C.U.R. INC.","C23900","2018-03-31"]
[null,null,1,{"$f":"CHOOSE(C165,\" \",$D$4,$D$5,$D$6,$D$7,$D$8,$D$9,$D$10,$D$11,$D$12)","v":" "},1,{"$f":"CHOOSE(E165,\" \",$F$4,$F$5,$F$6,$F$7,$F$8,$F$9,$F$10,$F$11,$F$4,$F$5,$F$6,$F$7,$F$8)","v":" "},1,{"$f":"CHOOSE(G165,\" \",$H$4,$H$5,$H$6,$H$7,$H$8,$H$9,$H$10,$H$11,$J$4,$J$5,$J$6,$J$7,$J$8,$J$9,$J$10,\" \")","v":" "},null,null,{"$f":"VLOOKUP(J165,FOURNISSEURS!$A$1:$B$2212,2,0)","v":{"$error":"#N/A"}},null,null,"CABANE A SUCRE N. LAFORTUNE INC.","C17200","2018-04-01"]
[null,null,1," ",1," ",1," ",null,null,{"$f":"VLOOKUP(J166,FOURNISSEURS!$A$1:$B$2212,2,0)","v":{"$error":"#N/A"}},null,null,"CAFÉ LANAUDIÈRE INC.","C17510","2018-04-02"]
[null,null,1," ",1," ",1," ",null,null,{"$f":"VLOOKUP(J167,FOURNISSEURS!$A$1:$B$2212,2,0)","v":{"$error":"#N/A"}},null,null,"CAFÉ L'ESSENTIEL LTÉE","C17500","2018-04-03"]
[null,null,1," ",1," ",1," ",null,null,{"$f":"VLOOKUP(J168,FOURNISSEURS!$A$1:$B$2212,2,0)","v":{"$error":"#N/A"}},null,null,"CAISSE POPULAIRE DE MONTCALM","C17775","2018-04-04"]
[null,null,1," ",1," ",1," ",null,null,{"$f":"VLOOKUP(J169,FOURNISSEURS!$A$1:$B$2212,2,0)","v":{"$error":"#N/A"}},null,null,"CAMIONS CARL THIBAULT INC.","C18000","2018-04-05"]
[null,null,1," ",1," ",1," ",null,null,{"$f":"VLOOKUP(J170,FOURNISSEURS!$A$1:$B$2212,2,0)","v":{"$error":"#N/A"}},null,null,"CAMIONS EXCELLENCE PETERBILT INC.","C18010","2018-04-06"]
[null,null,1," ",1," ",1," ",null,null,{"$f":"VLOOKUP(J171,FOURNISSEURS!$A$1:$B$2212,2,0)","v":{"$error":"#N/A"}},null,null,"CAMRICK","C18050","2018-04-07"]
[null,null,1," ",1," ",1," ",null,null,{"$f":"VLOOKUP(J172,FOURNISSEURS!$A$1:$B$2212,2,0)","v":{"$error":"#N/A"}},null,null,"CANSEL","C18075","2018-04-08"]
[null,null,1," ",1," ",1," ",null,null,{"$f":"VLOOKUP(J173,FOURNISSEURS!$A$1:$B$2212,2,0)","v":{"$error":"#N/A"}},null,null,"CAP-AUX-DIAMANTS","C18100",{"$f":"P172+1","v":"2018-04-09"}]
[null,null,1," ",1," ",1," ",null,null,{"$f":"VLOOKUP(J174,FOURNISSEURS!$A$1:$B$2212,2,0)","v":{"$error":"#N/A"}},null,null,"CARA","C18150","2018-04-10"]
[null,null,1," ",1," ",1," ",null,null,{"$f":"VLOOKUP(J175,FOURNISSEURS!$A$1:$B$2212,2,0)","v":{"$error":"#N/A"}},null,null,"CARDIO PLEIN AIR ENTRAÎNEMENT 4 SAISONS","C18180","2018-04-11"]
[null,null,1," ",1," ",1," ",null,null,{"$f":"VLOOKUP(J176,FOURNISSEURS!$A$1:$B$2212,2,0)","v":{"$error":"#N/A"}},null,null,"CARREFOUR DU MATELAS","C18210","2018-04-12"]
[null,null,1," ",1," ",1," ",null,null,{"$f":"VLOOKUP(J177,FOURNISSEURS!$A$1:$B$2212,2,0)","v":{"$error":"#N/A"}},null,null,"CARREFOUR JEUNESSE-EMPLOI","C18225","2018-04-13"]
[null,null,1," ",1," ",1," ",null,null,{"$f":"VLOOKUP(J178,FOURNISSEURS!$A$1:$B$2212,2,0)","v":{"$error":"#N/A"}},null,null,"CARRIÈRES UNI-JAC INC.","C18350","2018-04-14"]
[null,null,1," ",1," ",1," ",null,null,{"$f":"VLOOKUP(J179,FOURNISSEURS!$A$1:$B$2212,2,0)","v":{"$error":"#N/A"}},null,null,"CARROSSERIE J.L. INC.","C18500","2018-04-15"]
[null,null,1," ",1," ",1," ",null,null,{"$f":"VLOOKUP(J180,FOURNISSEURS!$A$1:$B$2212,2,0)","v":{"$error":"#N/A"}},null,null,"CARTOTEK GEO","C18700","2018-04-16"]
[null,null,1," ",1," ",1," ",null,null,{"$f":"VLOOKUP(J181,FOURNISSEURS!$A$1:$B$2212,2,0)","v":{"$error":"#N/A"}},null,null,"CASCADE SUBSCRIPTION SERVICE INC.","C18750","2018-04-17"]
[null,null,1," ",1," ",1," ",null,null,{"$f":"VLOOKUP(J182,FOURNISSEURS!$A$1:$B$2212,2,0)","v":{"$error":"#N/A"}},null,null,"CATSPORTS","C18925","2018-04-18"]
[null,null,1," ",1," ",1," ",null,null,{"$f":"VLOOKUP(J183,FOURNISSEURS!$A$1:$B$2212,2,0)","v":{"$error":"#N/A"}},null,null,"CAYA SERGE","C18950","2018-04-19"]
[null,null,1," ",1," ",1," ",null,null,{"$f":"VLOOKUP(J184,FOURNISSEURS!$A$1:$B$2212,2,0)","v":{"$error":"#N/A"}},null,null,"CAZA MARCEAU + SOUCY BEAUDREAU-AVOCATS","C18960","2018-04-20"]
[null,null,1," ",1," ",1," ",null,null,{"$f":"VLOOKUP(J185,FOURNISSEURS!$A$1:$B$2212,2,0)","v":{"$error":"#N/A"}},null,null,"CAZA MARCEAU + SOUCY BOUDREAU, AVOCATS","C 18960","2018-04-21"]
[null,null,1," ",1," ",1," ",null,null,{"$f":"VLOOKUP(J186,FOURNISSEURS!$A$1:$B$2212,2,0)","v":{"$error":"#N/A"}},null,null,"CDC EXCAVATION","C16650","2018-04-22"]
[null,null,1," ",1," ",1," ",null,null,{"$f":"VLOOKUP(J187,FOURNISSEURS!$A$1:$B$2212,2,0)","v":{"$error":"#N/A"}},null,null,"CDS INC.","C18975","2018-04-23"]
[null,null,1," ",1," ",1," ",null,null,{"$f":"VLOOKUP(J188,FOURNISSEURS!$A$1:$B$2212,2,0)","v":{"$error":"#N/A"}},null,null,"CEGEP DE SAINT-LAURENT","C19000","2018-04-24"]
[null,null,1," ",1," ",1," ",null,null,{"$f":"VLOOKUP(J189,FOURNISSEURS!$A$1:$B$2212,2,0)","v":{"$error":"#N/A"}},null,null,"CELB INC.","C19050","2018-04-25"]
[null,null,1," ",1," ",1," ",null,null,{"$f":"VLOOKUP(J190,FOURNISSEURS!$A$1:$B$2212,2,0)","v":{"$error":"#N/A"}},null,null,"CENTRAIDE LANAUDIERE","C19125","2018-04-26"]
[null,null,1," ",1," ",1," ",null,null,{"$f":"VLOOKUP(J191,FOURNISSEURS!$A$1:$B$2212,2,0)","v":{"$error":"#N/A"}},null,null,"CENTRE ADM. QUALIFICATION PROFESSIONNELL","C19130","2018-04-27"]
[null,null,1," ",1," ",1," ",null,null,{"$f":"VLOOKUP(J192,FOURNISSEURS!$A$1:$B$2212,2,0)","v":{"$error":"#N/A"}},null,null,"CENTRE AQUATIQUE LE GARDEUR","C19150","2018-04-28"]
[null,null,1," ",1," ",1," ",null,null,{"$f":"VLOOKUP(J193,FOURNISSEURS!$A$1:$B$2212,2,0)","v":{"$error":"#N/A"}},null,null,"CENTRE DE CAMION ST-JEROME INC","C19165","2018-04-29"]
[null,null,1," ",1," ",1," ",null,null,{"$f":"VLOOKUP(J194,FOURNISSEURS!$A$1:$B$2212,2,0)","v":{"$error":"#N/A"}},null,null,"CENTRE DE COMPOSTAGE LANAUDIERE","C19170","2018-04-30"]
[null,null,1," ",1," ",1," ",null,null,{"$f":"VLOOKUP(J195,FOURNISSEURS!$A$1:$B$2212,2,0)","v":{"$error":"#N/A"}},null,null,"CENTRE DE FEMMES MONTCALM","C19200","2018-05-01"]
[null,null,1," ",1," ",1," ",null,null,{"$f":"VLOOKUP(J196,FOURNISSEURS!$A$1:$B$2212,2,0)","v":{"$error":"#N/A"}},null,null,"CENTRE DE L'AUTO ET DU CAMION LEVESQUE INC.","C19775","2018-05-02"]
[null,null,1," ",1," ",1," ",null,null,{"$f":"VLOOKUP(J197,FOURNISSEURS!$A$1:$B$2212,2,0)","v":{"$error":"#N/A"}},null,null,"CENTRE DE PNEUS VILLEMAIRE","C20100","2018-05-03"]
[null,null,1," ",1," ",1," ",null,null,{"$f":"VLOOKUP(J198,FOURNISSEURS!$A$1:$B$2212,2,0)","v":{"$error":"#N/A"}},null,null,"CENTRE D'INSPECTION MECANIQUE","C19160","2018-05-04"]
[null,null,1," ",1," ",1," ",null,null,{"$f":"VLOOKUP(J199,FOURNISSEURS!$A$1:$B$2212,2,0)","v":{"$error":"#N/A"}},null,null,"CENTRE DISTRIBUTION ELECTRIQUE","C19350","2018-05-05"]
[null,null,1," ",1," ",1," ",null,null,{"$f":"VLOOKUP(J200,FOURNISSEURS!$A$1:$B$2212,2,0)","v":{"$error":"#N/A"}},null,null,"CENTRE INSPECTION D. VEHICULES","C20475","2018-05-06"]
[null,null,1," ",1," ",1," ",null,null,{"$f":"VLOOKUP(J201,FOURNISSEURS!$A$1:$B$2212,2,0)","v":{"$error":"#N/A"}},null,null,"CENTRE JARDIN EXCELS","C20800","2018-05-07"]
[null,null,1," ",1," ",1," ",null,null,{"$f":"VLOOKUP(J202,FOURNISSEURS!$A$1:$B$2212,2,0)","v":{"$error":"#N/A"}},null,null,"CENTRE SPORTIF","C21150","2018-05-08"]
[null,null,1," ",1," ",1," ",null,null,{"$f":"VLOOKUP(J203,FOURNISSEURS!$A$1:$B$2212,2,0)","v":{"$error":"#N/A"}},null,null,"CERCLE ARC-EN-CIEL, NO 1304","C21225","2018-05-09"]
[null,null,1," ",1," ",1," ",null,null,{"$f":"VLOOKUP(J204,FOURNISSEURS!$A$1:$B$2212,2,0)","v":{"$error":"#N/A"}},null,null,"CERCLES DES JEUNES NATURALISTES (LES)","C21230","2018-05-10"]
[null,null,1," ",1," ",1," ",null,null,{"$f":"VLOOKUP(J205,FOURNISSEURS!$A$1:$B$2212,2,0)","v":{"$error":"#N/A"}},null,null,"CERTIFIED LABORATORIES","C21240","2018-05-11"]
[null,null,1," ",1," ",1," ",null,null,{"$f":"VLOOKUP(J206,FOURNISSEURS!$A$1:$B$2212,2,0)","v":{"$error":"#N/A"}},null,null,"CFH SECURITE INC.","C21250","2018-05-12"]
[null,null,1," ",1," ",1," ",null,null,{"$f":"VLOOKUP(J207,FOURNISSEURS!$A$1:$B$2212,2,0)","v":{"$error":"#N/A"}},null,null,"CHAMBRE DE COMMERCE","C21375","2018-05-13"]
[null,null,1," ",1," ",1," ",null,null,{"$f":"VLOOKUP(J208,FOURNISSEURS!$A$1:$B$2212,2,0)","v":{"$error":"#N/A"}},null,null,"CHAPITEAUX LANAUDIÈRE INC.","C21500","2018-05-14"]
[null,null,1," ",1," ",1," ",null,null,{"$f":"VLOOKUP(J209,FOURNISSEURS!$A$1:$B$2212,2,0)","v":{"$error":"#N/A"}},null,null,"CHARBONNEAU REJEAN","C21825","2018-05-15"]
[null,null,1," ",1," ",1," ",null,null,{"$f":"VLOOKUP(J210,FOURNISSEURS!$A$1:$B$2212,2,0)","v":{"$error":"#N/A"}},null,null,"CHASSÉ ISABELLE","C22150","2018-05-16"]
[null,null,1," ",1," ",1," ",null,null,{"$f":"VLOOKUP(J211,FOURNISSEURS!$A$1:$B$2212,2,0)","v":{"$error":"#N/A"}},null,null,"CHAUFFAGE ERICK TURCOTTE INC.","C22175","2018-05-17"]
[null,null,1," ",1," ",1," ",null,null,{"$f":"VLOOKUP(J212,FOURNISSEURS!$A$1:$B$2212,2,0)","v":{"$error":"#N/A"}},null,null,"CHAUFFAGE SPEC 360 INC.","C22190","2018-05-18"]
[null,null,1," ",1," ",1," ",null,null,{"$f":"VLOOKUP(J213,FOURNISSEURS!$A$1:$B$2212,2,0)","v":{"$error":"#N/A"}},null,null,"CHAUMIERE JEUNESSE","C22200","2018-05-19"]
[null,null,1," ",1," ",1," ",null,null,{"$f":"VLOOKUP(J214,FOURNISSEURS!$A$1:$B$2212,2,0)","v":{"$error":"#N/A"}},null,null,"CHAURETTE ET ASSOCIES","C22210","2018-05-20"]
[null,null,1," ",1," ",1," ",null,null,{"$f":"VLOOKUP(J215,FOURNISSEURS!$A$1:$B$2212,2,0)","v":{"$error":"#N/A"}},null,null,"CHAUSSURES POP","C22240","2018-05-21"]
[null,null,1," ",1," ",1," ",null,null,{"$f":"VLOOKUP(J216,FOURNISSEURS!$A$1:$B$2212,2,0)","v":{"$error":"#N/A"}},null,null,"CHEM ACTION INC.","C22260","2018-05-22"]
[null,null,1," ",1," ",1," ",null,null,{"$f":"VLOOKUP(J217,FOURNISSEURS!$A$1:$B$2212,2,0)","v":{"$error":"#N/A"}},null,null,"CHEMPRO INC.","C22275","2018-05-23"]
[null,null,1," ",1," ",1," ",null,null,{"$f":"VLOOKUP(J218,FOURNISSEURS!$A$1:$B$2212,2,0)","v":{"$error":"#N/A"}},null,null,"CHEMTECH AUTOMATION","C22300","2018-05-24"]
[null,null,1," ",1," ",1," ",null,null,{"$f":"VLOOKUP(J219,FOURNISSEURS!$A$1:$B$2212,2,0)","v":{"$error":"#N/A"}},null,null,"CHEVALIERS DE COLOMB (LES)","C22310","2018-05-25"]
[null,null,1," ",1," ",1," ",null,null,{"$f":"VLOOKUP(J220,FOURNISSEURS!$A$1:$B$2212,2,0)","v":{"$error":"#N/A"}},null,null,"CHEZ SOI","C22400","2018-05-26"]
[null,null,1," ",1," ",1," ",null,null,{"$f":"VLOOKUP(J221,FOURNISSEURS!$A$1:$B$2212,2,0)","v":{"$error":"#N/A"}},null,null,"CHOLACK JENNIFER","C22500","2018-05-27"]
[null,null,1," ",1," ",1," ",null,null,{"$f":"VLOOKUP(J222,FOURNISSEURS!$A$1:$B$2212,2,0)","v":{"$error":"#N/A"}},null,null,"CHRÉTIEN STÉPHANIE","CHRE001","2018-05-28"]
[null,null,1," ",1," ",1," ",null,null,{"$f":"VLOOKUP(J223,FOURNISSEURS!$A$1:$B$2212,2,0)","v":{"$error":"#N/A"}},null,null,"CHRISTIAN R. ROY INC.","C22600","2018-05-29"]
[null,null,1," ",1," ",1," ",null,null,{"$f":"VLOOKUP(J224,FOURNISSEURS!$A$1:$B$2212,2,0)","v":{"$error":"#N/A"}},null,null,"CIMA + S.E.N.C.","C22650","2018-05-30"]
[null,null,1," ",1," ",1," ",null,null,{"$f":"VLOOKUP(J225,FOURNISSEURS!$A$1:$B$2212,2,0)","v":{"$error":"#N/A"}},null,null,"CIMENT LACASSE LTEE","C22700","2018-05-31"]
[null,null,1," ",1," ",1," ",null,null,{"$f":"VLOOKUP(J226,FOURNISSEURS!$A$1:$B$2212,2,0)","v":{"$error":"#N/A"}},null,null,"CIMENT LAVALLÉE","C22710","2018-06-01"]
[null,null,1," ",1," ",1," ",null,null,{"$f":"VLOOKUP(J227,FOURNISSEURS!$A$1:$B$2212,2,0)","v":{"$error":"#N/A"}},null,null,"CIMENTS MPA (LES)","C22715","2018-06-02"]
[null,null,1," ",1," ",1," ",null,null,{"$f":"VLOOKUP(J228,FOURNISSEURS!$A$1:$B$2212,2,0)","v":{"$error":"#N/A"}},null,null,"CINÉ-MÉDIC","C22726","2018-06-03"]
[null,null,1,{"$f":"CHOOSE(C229,\" \",$D$4,$D$5,$D$6,$D$7,$D$8,$D$9,$D$10,$D$11,$D$12)","v":" "},1,{"$f":"CHOOSE(E229,\" \",$F$4,$F$5,$F$6,$F$7,$F$8,$F$9,$F$10,$F$11,$F$4,$F$5,$F$6,$F$7,$F$8)","v":" "},1,{"$f":"CHOOSE(G229,\" \",$H$4,$H$5,$H$6,$H$7,$H$8,$H$9,$H$10,$H$11,$J$4,$J$5,$J$6,$J$7,$J$8,$J$9,$J$10,\" \")","v":" "},null,null,{"$f":"VLOOKUP(J229,FOURNISSEURS!$A$1:$B$2212,2,0)","v":{"$error":"#N/A"}},null,null,"CIRIS","C22727","2018-06-04"]
[null,null,1," ",1," ",1," ",null,null,{"$f":"VLOOKUP(J230,FOURNISSEURS!$A$1:$B$2212,2,0)","v":{"$error":"#N/A"}},null,null,"CJLM","C22729","2018-06-05"]
[null,null,1," ",1," ",1," ",null,null,{"$f":"VLOOKUP(J231,FOURNISSEURS!$A$1:$B$2212,2,0)","v":{"$error":"#N/A"}},null,null,"CLA EXPERTS-CONSEILS INC.","C22730","2018-06-06"]
[null,null,1," ",1," ",1," ",null,null,{"$f":"VLOOKUP(J232,FOURNISSEURS!$A$1:$B$2212,2,0)","v":{"$error":"#N/A"}},null,null,"CLASSEMENT LUC BEAUDOIN INC.","C22740","2018-06-07"]
[null,null,1," ",1," ",1," ",null,null,{"$f":"VLOOKUP(J233,FOURNISSEURS!$A$1:$B$2212,2,0)","v":{"$error":"#N/A"}},null,null,"CLD MONTCALM","C22742","2018-06-08"]
[null,null,1," ",1," ",1," ",null,null,{"$f":"VLOOKUP(J234,FOURNISSEURS!$A$1:$B$2212,2,0)","v":{"$error":"#N/A"}},null,null,"CLEARTECH INDUSTRIES INC.","C22743","2018-06-09"]
[null,null,1," ",1," ",1," ",null,null,{"$f":"VLOOKUP(J235,FOURNISSEURS!$A$1:$B$2212,2,0)","v":{"$error":"#N/A"}},null,null,"CLERMONT MICHAEL","C22745","2018-06-10"]
[null,null,1," ",1," ",1," ",null,null,{"$f":"VLOOKUP(J236,FOURNISSEURS!$A$1:$B$2212,2,0)","v":{"$error":"#N/A"}},null,null,"CLIN D'OEIL","C22748","2018-06-11"]
[null,null,1," ",1," ",1," ",null,null,{"$f":"VLOOKUP(J237,FOURNISSEURS!$A$1:$B$2212,2,0)","v":{"$error":"#N/A"}},null,null,"CLINIQUE D'ASPIRATEUR ENR.","C22750",{"$f":"P236+1","v":"2018-06-12"}]
[null,null,1," ",1," ",1," ",null,null,{"$f":"VLOOKUP(J238,FOURNISSEURS!$A$1:$B$2212,2,0)","v":{"$error":"#N/A"}},null,null,"CLOTURE D.D.F. ENR.","C23125","2018-06-13"]
[null,null,1," ",1," ",1," ",null,null,{"$f":"VLOOKUP(J239,FOURNISSEURS!$A$1:$B$2212,2,0)","v":{"$error":"#N/A"}},null,null,"CLÔTURE OLYMPIQUE","C23180","2018-06-14"]
[null,null,1," ",1," ",1," ",null,null,{"$f":"VLOOKUP(J240,FOURNISSEURS!$A$1:$B$2212,2,0)","v":{"$error":"#N/A"}},null,null,"CLÔTURES LAURENTIDES","C23150","2018-06-15"]
[null,null,1," ",1," ",1," ",null,null,{"$f":"VLOOKUP(J241,FOURNISSEURS!$A$1:$B$2212,2,0)","v":{"$error":"#N/A"}},null,null,"CLÔTURES SPECIALISEES (LES)","C23200","2018-06-16"]
[null,null,1," ",1," ",1," ",null,null,{"$f":"VLOOKUP(J242,FOURNISSEURS!$A$1:$B$2212,2,0)","v":{"$error":"#N/A"}},null,null,"CLUB DE GOLF  MONTCALM INC","C23300","2018-06-17"]
[null,null,1," ",1," ",1," ",null,null,{"$f":"VLOOKUP(J243,FOURNISSEURS!$A$1:$B$2212,2,0)","v":{"$error":"#N/A"}},null,null,"CLUB DE GOLF MASCOUCHE INC.","C23250","2018-06-18"]
[null,null,1," ",1," ",1," ",null,null,{"$f":"VLOOKUP(J244,FOURNISSEURS!$A$1:$B$2212,2,0)","v":{"$error":"#N/A"}},null,null,"CLUB FADOQ ST-LIN-LAURENTIDES-LANAUDIÈRE","B14850","2018-06-19"]
[null,null,1," ",1," ",1," ",null,null,{"$f":"VLOOKUP(J245,FOURNISSEURS!$A$1:$B$2212,2,0)","v":{"$error":"#N/A"}},null,null,"CLUB OPTIMISTE ST-LIN-LAURENTIDES INC.","C23350","2018-06-20"]
[null,null,1," ",1," ",1," ",null,null,{"$f":"VLOOKUP(J246,FOURNISSEURS!$A$1:$B$2212,2,0)","v":{"$error":"#N/A"}},null,null,"COCA-COLA RAFRAICHISSEMENTS","C24000","2018-06-21"]
[null,null,1," ",1," ",1," ",null,null,{"$f":"VLOOKUP(J247,FOURNISSEURS!$A$1:$B$2212,2,0)","v":{"$error":"#N/A"}},null,null,"COFFRES-FORTS MARTINEZ 2000","C24100","2018-06-22"]
[null,null,1," ",1," ",1," ",null,null,{"$f":"VLOOKUP(J248,FOURNISSEURS!$A$1:$B$2212,2,0)","v":{"$error":"#N/A"}},null,null,"COLLEGE MONTMORENCY","C24300","2018-06-23"]
[null,null,1," ",1," ",1," ",null,null,{"$f":"VLOOKUP(J249,FOURNISSEURS!$A$1:$B$2212,2,0)","v":{"$error":"#N/A"}},null,null,"COLMATEC INC.","C24475","2018-06-24"]
[null,null,1," ",1," ",1," ",null,null,{"$f":"VLOOKUP(J250,FOURNISSEURS!$A$1:$B$2212,2,0)","v":{"$error":"#N/A"}},null,null,"COLPRON JESSICA","C24485","2018-06-25"]
[null,null,1," ",1," ",1," ",null,null,{"$f":"VLOOKUP(J251,FOURNISSEURS!$A$1:$B$2212,2,0)","v":{"$error":"#N/A"}},null,null,"COMBEQ","C24500","2018-06-26"]
[null,null,1," ",1," ",1," ",null,null,{"$f":"VLOOKUP(J252,FOURNISSEURS!$A$1:$B$2212,2,0)","v":{"$error":"#N/A"}},null,null,"COMITE DES FETES FIDELITE","C24525","2018-06-27"]
[null,null,1," ",1," ",1," ",null,null,{"$f":"VLOOKUP(J253,FOURNISSEURS!$A$1:$B$2212,2,0)","v":{"$error":"#N/A"}},null,null,"COMITE DES LOISIRS","C24750","2018-06-28"]
[null,null,1," ",1," ",1," ",null,null,{"$f":"VLOOKUP(J254,FOURNISSEURS!$A$1:$B$2212,2,0)","v":{"$error":"#N/A"}},null,null,"COMITE D'EXPANSION ÉCONOMIQUE","C24600","2018-06-29"]
[null,null,1," ",1," ",1," ",null,null,{"$f":"VLOOKUP(J255,FOURNISSEURS!$A$1:$B$2212,2,0)","v":{"$error":"#N/A"}},null,null,"COMITE RECREATIF RIV. ACHIGAN","C25200","2018-06-30"]
[null,null,1," ",1," ",1," ",null,null,{"$f":"VLOOKUP(J256,FOURNISSEURS!$A$1:$B$2212,2,0)","v":{"$error":"#N/A"}},null,null,"COMITE TOURNOI DE GOLF - MRC MONTCALM","C25275","2018-07-01"]
[null,null,1," ",1," ",1," ",null,null,{"$f":"VLOOKUP(J257,FOURNISSEURS!$A$1:$B$2212,2,0)","v":{"$error":"#N/A"}},null,null,"COMM. SCOLAIRE DE LA RIVIÈRE DU NORD","C25420","2018-07-02"]
[null,null,1," ",1," ",1," ",null,null,{"$f":"VLOOKUP(J258,FOURNISSEURS!$A$1:$B$2212,2,0)","v":{"$error":"#N/A"}},null,null,"COMMERCIAL AQUATIC SUPPLIES","C25350","2018-07-03"]
[null,null,1," ",1," ",1," ",null,null,{"$f":"VLOOKUP(J259,FOURNISSEURS!$A$1:$B$2212,2,0)","v":{"$error":"#N/A"}},null,null,"COMMISSION ADMINISTRATIVE DES REGIMES","C25375","2018-07-04"]
[null,null,1," ",1," ",1," ",null,null,{"$f":"VLOOKUP(J260,FOURNISSEURS!$A$1:$B$2212,2,0)","v":{"$error":"#N/A"}},null,null,"COMMISSION DES NORMES DE L'ÉQUITÉ","C28575","2018-07-05"]
[null,null,1," ",1," ",1," ",null,null,{"$f":"VLOOKUP(J261,FOURNISSEURS!$A$1:$B$2212,2,0)","v":{"$error":"#N/A"}},null,null,"COMMISSION SCOLAIRE DE LAVAL","C25423","2018-07-06"]
[null,null,1," ",1," ",1," ",null,null,{"$f":"VLOOKUP(J262,FOURNISSEURS!$A$1:$B$2212,2,0)","v":{"$error":"#N/A"}},null,null,"COMMISSION SCOLAIRE DES SAMARES","C25425","2018-07-07"]
[null,null,1," ",1," ",1," ",null,null,{"$f":"VLOOKUP(J263,FOURNISSEURS!$A$1:$B$2212,2,0)","v":{"$error":"#N/A"}},null,null,"COMMUNICATION TELOSYSTEME INC.","C25650","2018-07-08"]
[null,null,1," ",1," ",1," ",null,null,{"$f":"VLOOKUP(J264,FOURNISSEURS!$A$1:$B$2212,2,0)","v":{"$error":"#N/A"}},null,null,"COMPASS MINERALS CANADA-QUÉBEC","C25660","2018-07-09"]
[null,null,1," ",1," ",1," ",null,null,{"$f":"VLOOKUP(J265,FOURNISSEURS!$A$1:$B$2212,2,0)","v":{"$error":"#N/A"}},null,null,"COMPTEURS LECOMPTE LTÉE (LES)","C25675","2018-07-10"]
[null,null,1," ",1," ",1," ",null,null,{"$f":"VLOOKUP(J266,FOURNISSEURS!$A$1:$B$2212,2,0)","v":{"$error":"#N/A"}},null,null,"CONCEPT NORD-SUD INC.","C26000","2018-07-11"]
[null,null,1," ",1," ",1," ",null,null,{"$f":"VLOOKUP(J267,FOURNISSEURS!$A$1:$B$2212,2,0)","v":{"$error":"#N/A"}},null,null,"CONCEPT VOITURETTE INC.","C26710","2018-07-12"]
[null,null,1," ",1," ",1," ",null,null,{"$f":"VLOOKUP(J268,FOURNISSEURS!$A$1:$B$2212,2,0)","v":{"$error":"#N/A"}},null,null,"CONSEIL RÉGIONAL DE L' ENVIRONNEMENT","C26700","2018-07-13"]
[null,null,1," ",1," ",1," ",null,null,{"$f":"VLOOKUP(J269,FOURNISSEURS!$A$1:$B$2212,2,0)","v":{"$error":"#N/A"}},null,null,"CONSTRUCTION ANOR INC.","C27100","2018-07-14"]
[null,null,1," ",1," ",1," ",null,null,{"$f":"VLOOKUP(J270,FOURNISSEURS!$A$1:$B$2212,2,0)","v":{"$error":"#N/A"}},null,null,"CONSTRUCTION D & G GAGNON INC.","C27150","2018-07-15"]
[null,null,1," ",1," ",1," ",null,null,{"$f":"VLOOKUP(J271,FOURNISSEURS!$A$1:$B$2212,2,0)","v":{"$error":"#N/A"}},null,null,"CONSTRUCTION S.R.B.","C27175","2018-07-16"]
[null,null,1," ",1," ",1," ",null,null,{"$f":"VLOOKUP(J272,FOURNISSEURS!$A$1:$B$2212,2,0)","v":{"$error":"#N/A"}},null,null,"CONSULTANT EDS","C27190","2018-07-17"]
[null,null,1," ",1," ",1," ",null,null,{"$f":"VLOOKUP(J273,FOURNISSEURS!$A$1:$B$2212,2,0)","v":{"$error":"#N/A"}},null,null,"CONTENEURS QUÉBEC","C27205","2018-07-18"]
[null,null,1," ",1," ",1," ",null,null,{"$f":"VLOOKUP(J274,FOURNISSEURS!$A$1:$B$2212,2,0)","v":{"$error":"#N/A"}},null,null,"CONTRÔLES CT ENR. (LES)","C27195","2018-07-19"]
[null,null,1," ",1," ",1," ",null,null,{"$f":"VLOOKUP(J275,FOURNISSEURS!$A$1:$B$2212,2,0)","v":{"$error":"#N/A"}},null,null,"CONTROLES PROVAN ASSOCIES INC.","C27200","2018-07-20"]
[null,null,1," ",1," ",1," ",null,null,{"$f":"VLOOKUP(J276,FOURNISSEURS!$A$1:$B$2212,2,0)","v":{"$error":"#N/A"}},null,null,"CONVERCITÉ","C27240","2018-07-21"]
[null,null,1," ",1," ",1," ",null,null,{"$f":"VLOOKUP(J277,FOURNISSEURS!$A$1:$B$2212,2,0)","v":{"$error":"#N/A"}},null,null,"COOL","C27250","2018-07-22"]
[null,null,1," ",1," ",1," ",null,null,{"$f":"VLOOKUP(J278,FOURNISSEURS!$A$1:$B$2212,2,0)","v":{"$error":"#N/A"}},null,null,"COOP PROFID'OR","C27300","2018-07-23"]
[null,null,1," ",1," ",1," ",null,null,{"$f":"VLOOKUP(J279,FOURNISSEURS!$A$1:$B$2212,2,0)","v":{"$error":"#N/A"}},null,null,"COOPERATIVE DE RADIODIFFUSION","C27400","2018-07-24"]
[null,null,1," ",1," ",1," ",null,null,{"$f":"VLOOKUP(J280,FOURNISSEURS!$A$1:$B$2212,2,0)","v":{"$error":"#N/A"}},null,null,"COPIBEC","C27450","2018-07-25"]
[null,null,1," ",1," ",1," ",null,null,{"$f":"VLOOKUP(J281,FOURNISSEURS!$A$1:$B$2212,2,0)","v":{"$error":"#N/A"}},null,null,"CORPORATION DE LA FÊTE NATIONALE","S84250","2018-07-26"]
[null,null,1," ",1," ",1," ",null,null,{"$f":"VLOOKUP(J282,FOURNISSEURS!$A$1:$B$2212,2,0)","v":{"$error":"#N/A"}},null,null,"CÔTÉ JARDINS","C28576","2018-07-27"]
[null,null,1," ",1," ",1," ",null,null,{"$f":"VLOOKUP(J283,FOURNISSEURS!$A$1:$B$2212,2,0)","v":{"$error":"#N/A"}},null,null,"COUP DE PINCEAU","C28578","2018-07-28"]
[null,null,1," ",1," ",1," ",null,null,{"$f":"VLOOKUP(J284,FOURNISSEURS!$A$1:$B$2212,2,0)","v":{"$error":"#N/A"}},null,null,"COURS AUTODIDACTIQUES DE FRANÇAIS ÉCRIT","C28560","2018-07-29"]
[null,null,1," ",1," ",1," ",null,null,{"$f":"VLOOKUP(J285,FOURNISSEURS!$A$1:$B$2212,2,0)","v":{"$error":"#N/A"}},null,null,"COURSOL SPORTS DIVISION","C28580","2018-07-30"]
[null,null,1," ",1," ",1," ",null,null,{"$f":"VLOOKUP(J286,FOURNISSEURS!$A$1:$B$2212,2,0)","v":{"$error":"#N/A"}},null,null,"COUSINEAU ALEXANDRE","C28590","2018-07-31"]
[null,null,1," ",1," ",1," ",null,null,{"$f":"VLOOKUP(J287,FOURNISSEURS!$A$1:$B$2212,2,0)","v":{"$error":"#N/A"}},null,null,"COUTU AMÉLIE","C28600","2018-08-01"]
[null,null,1," ",1," ",1," ",null,null,{"$f":"VLOOKUP(J288,FOURNISSEURS!$A$1:$B$2212,2,0)","v":{"$error":"#N/A"}},null,null,"COUVREUR C.S.G. INC.","C28620","2018-08-02"]
[null,null,1," ",1," ",1," ",null,null,{"$f":"VLOOKUP(J289,FOURNISSEURS!$A$1:$B$2212,2,0)","v":{"$error":"#N/A"}},null,null,"CPA TOURBILLONS DES LAURENTIDES INC.","C16675","2018-08-03"]
[null,null,1," ",1," ",1," ",null,null,{"$f":"VLOOKUP(J290,FOURNISSEURS!$A$1:$B$2212,2,0)","v":{"$error":"#N/A"}},null,null,"CRAIM","C28500","2018-08-04"]
[null,null,1," ",1," ",1," ",null,null,{"$f":"VLOOKUP(J291,FOURNISSEURS!$A$1:$B$2212,2,0)","v":{"$error":"#N/A"}},null,null,"CRÉATIONS STYLE PLUS INC.","C28510","2018-08-05"]
[null,null,1," ",1," ",1," ",null,null,{"$f":"VLOOKUP(J292,FOURNISSEURS!$A$1:$B$2212,2,0)","v":{"$error":"#N/A"}},null,null,"CROIX-ROUGE CANADIENNE","C28525","2018-08-06"]
[null,null,1,{"$f":"CHOOSE(C293,\" \",$D$4,$D$5,$D$6,$D$7,$D$8,$D$9,$D$10,$D$11,$D$12)","v":" "},1,{"$f":"CHOOSE(E293,\" \",$F$4,$F$5,$F$6,$F$7,$F$8,$F$9,$F$10,$F$11,$F$4,$F$5,$F$6,$F$7,$F$8)","v":" "},1,{"$f":"CHOOSE(G293,\" \",$H$4,$H$5,$H$6,$H$7,$H$8,$H$9,$H$10,$H$11,$J$4,$J$5,$J$6,$J$7,$J$8,$J$9,$J$10,\" \")","v":" "},null,null,{"$f":"VLOOKUP(J293,FOURNISSEURS!$A$1:$B$2212,2,0)","v":{"$error":"#N/A"}},null,null,"CSE INCENDIE ET SECURITE INC.","C28650","2018-08-07"]
[null,null,1," ",1," ",1," ",null,null,{"$f":"VLOOKUP(J294,FOURNISSEURS!$A$1:$B$2212,2,0)","v":{"$error":"#N/A"}},null,null,"CTI CONSTRUCTION (9153-7209 QC INC)","C28660","2018-08-08"]
[null,null,1," ",1," ",1," ",null,null,{"$f":"VLOOKUP(J295,FOURNISSEURS!$A$1:$B$2212,2,0)","v":{"$error":"#N/A"}},null,null,"CYCLONE LIGHTING","C28670","2018-08-09"]
[null,null,1," ",1," ",1," ",null,null,{"$f":"VLOOKUP(J296,FOURNISSEURS!$A$1:$B$2212,2,0)","v":{"$error":"#N/A"}},null,null,"CYR LUC","C28675","2018-08-10"]
[null,null,1," ",1," ",1," ",null,null,{"$f":"VLOOKUP(J297,FOURNISSEURS!$A$1:$B$2212,2,0)","v":{"$error":"#N/A"}},null,null,"D.L.D. EXTERMINATION","D28685","2018-08-11"]
[null,null,1," ",1," ",1," ",null,null,{"$f":"VLOOKUP(J298,FOURNISSEURS!$A$1:$B$2212,2,0)","v":{"$error":"#N/A"}},null,null,"D.P. AUTOMOTIVE","D28700","2018-08-12"]
[null,null,1," ",1," ",1," ",null,null,{"$f":"VLOOKUP(J299,FOURNISSEURS!$A$1:$B$2212,2,0)","v":{"$error":"#N/A"}},null,null,"DAIGNEAULT, PLANTE ET ASSOCIES","D28800","2018-08-13"]
[null,null,1," ",1," ",1," ",null,null,{"$f":"VLOOKUP(J300,FOURNISSEURS!$A$1:$B$2212,2,0)","v":{"$error":"#N/A"}},null,null,"DANIEL GRONDIN, AVOCAT EN FIDUCIE","G45900","2018-08-14"]
[null,null,1," ",1," ",1," ",null,null,{"$f":"VLOOKUP(J301,FOURNISSEURS!$A$1:$B$2212,2,0)","v":{"$error":"#N/A"}},null,null,"DANIS ELIANE","D29000",{"$f":"P300+1","v":"2018-08-15"}]
[null,null,1," ",1," ",1," ",null,null,{"$f":"VLOOKUP(J302,FOURNISSEURS!$A$1:$B$2212,2,0)","v":{"$error":"#N/A"}},null,null,"DAOUST VALÉRIE","D29010","2018-08-16"]
[null,null,1," ",1," ",1," ",null,null,{"$f":"VLOOKUP(J303,FOURNISSEURS!$A$1:$B$2212,2,0)","v":{"$error":"#N/A"}},null,null,"DAVID GINETTE","D29200","2018-08-17"]
[null,null,1," ",1," ",1," ",null,null,{"$f":"VLOOKUP(J304,FOURNISSEURS!$A$1:$B$2212,2,0)","v":{"$error":"#N/A"}},null,null,"DAZE NEVEU, ARPENTEURS-GÉOMÈTRES","D29250","2018-08-18"]
[null,null,1," ",1," ",1," ",null,null,{"$f":"VLOOKUP(J305,FOURNISSEURS!$A$1:$B$2212,2,0)","v":{"$error":"#N/A"}},null,null,"DECOR TAPIS DU NORD LTEE","D29300","2018-08-19"]
[null,null,1," ",1," ",1," ",null,null,{"$f":"VLOOKUP(J306,FOURNISSEURS!$A$1:$B$2212,2,0)","v":{"$error":"#N/A"}},null,null,"DECORATION PAQUETTE ET FILS INC.","D29325","2018-08-20"]
[null,null,1," ",1," ",1," ",null,null,{"$f":"VLOOKUP(J307,FOURNISSEURS!$A$1:$B$2212,2,0)","v":{"$error":"#N/A"}},null,null,"DÉCORMAG","D29305","2018-08-21"]
[null,null,1," ",1," ",1," ",null,null,{"$f":"VLOOKUP(J308,FOURNISSEURS!$A$1:$B$2212,2,0)","v":{"$error":"#N/A"}},null,null,"DELCOM COPISCOPE INC.","D29330","2018-08-22"]
[null,null,1," ",1," ",1," ",null,null,{"$f":"VLOOKUP(J309,FOURNISSEURS!$A$1:$B$2212,2,0)","v":{"$error":"#N/A"}},null,null,"DÉLICES DE ROSA (LES)","D29425","2018-08-23"]
[null,null,1," ",1," ",1," ",null,null,{"$f":"VLOOKUP(J310,FOURNISSEURS!$A$1:$B$2212,2,0)","v":{"$error":"#N/A"}},null,null,"DEMARCOM INC.","D29460","2018-08-24"]
[null,null,1," ",1," ",1," ",null,null,{"$f":"VLOOKUP(J311,FOURNISSEURS!$A$1:$B$2212,2,0)","v":{"$error":"#N/A"}},null,null,"DENEIGEMENT BOTELHO","D29490","2018-08-25"]
[null,null,1," ",1," ",1," ",null,null,{"$f":"VLOOKUP(J312,FOURNISSEURS!$A$1:$B$2212,2,0)","v":{"$error":"#N/A"}},null,null,"DENEIGEMENT D.J.M.N.","D29500","2018-08-26"]
[null,null,1," ",1," ",1," ",null,null,{"$f":"VLOOKUP(J313,FOURNISSEURS!$A$1:$B$2212,2,0)","v":{"$error":"#N/A"}},null,null,"DÉNEIGEMENT FORMULE 1","D29525","2018-08-27"]
[null,null,1," ",1," ",1," ",null,null,{"$f":"VLOOKUP(J314,FOURNISSEURS!$A$1:$B$2212,2,0)","v":{"$error":"#N/A"}},null,null,"DENEIGEMENT STEPHANE LEBEAU ENR.","D29600","2018-08-28"]
[null,null,1," ",1," ",1," ",null,null,{"$f":"VLOOKUP(J315,FOURNISSEURS!$A$1:$B$2212,2,0)","v":{"$error":"#N/A"}},null,null,"DEPANINFO","D30000","2018-08-29"]
[null,null,1," ",1," ",1," ",null,null,{"$f":"VLOOKUP(J316,FOURNISSEURS!$A$1:$B$2212,2,0)","v":{"$error":"#N/A"}},null,null,"DEPANNEUR LA VILLA","D30100","2018-08-30"]
[null,null,1," ",1," ",1," ",null,null,{"$f":"VLOOKUP(J317,FOURNISSEURS!$A$1:$B$2212,2,0)","v":{"$error":"#N/A"}},null,null,"DEPANNEUR LAPIERRE","D30150","2018-08-31"]
[null,null,1," ",1," ",1," ",null,null,{"$f":"VLOOKUP(J318,FOURNISSEURS!$A$1:$B$2212,2,0)","v":{"$error":"#N/A"}},null,null,"DEPANNEUR MA-MI/2947-6751 QUÉBEC INC.","D30175","2018-09-01"]
[null,null,1," ",1," ",1," ",null,null,{"$f":"VLOOKUP(J319,FOURNISSEURS!$A$1:$B$2212,2,0)","v":{"$error":"#N/A"}},null,null,"DÉSERTÉRIC","D30310","2018-09-02"]
[null,null,1," ",1," ",1," ",null,null,{"$f":"VLOOKUP(J320,FOURNISSEURS!$A$1:$B$2212,2,0)","v":{"$error":"#N/A"}},null,null,"DESJARDINS JEAN-PIERRE","D30375","2018-09-03"]
[null,null,1," ",1," ",1," ",null,null,{"$f":"VLOOKUP(J321,FOURNISSEURS!$A$1:$B$2212,2,0)","v":{"$error":"#N/A"}},null,null,"DES-MOTS-O-GALOP","D30250","2018-09-04"]
[null,null,1," ",1," ",1," ",null,null,{"$f":"VLOOKUP(J322,FOURNISSEURS!$A$1:$B$2212,2,0)","v":{"$error":"#N/A"}},null,null,"DESSAU INC.","D30600","2018-09-05"]
[null,null,1," ",1," ",1," ",null,null,{"$f":"VLOOKUP(J323,FOURNISSEURS!$A$1:$B$2212,2,0)","v":{"$error":"#N/A"}},null,null,"DÉVELOTECH INC.","D30700","2018-09-06"]
[null,null,1," ",1," ",1," ",null,null,{"$f":"VLOOKUP(J324,FOURNISSEURS!$A$1:$B$2212,2,0)","v":{"$error":"#N/A"}},null,null,"DICOM EXPRESS","D31000","2018-09-07"]
[null,null,1," ",1," ",1," ",null,null,{"$f":"VLOOKUP(J325,FOURNISSEURS!$A$1:$B$2212,2,0)","v":{"$error":"#N/A"}},null,null,"DIST. RICHARD JETTÉ INC.","D31810","2018-09-08"]
[null,null,1," ",1," ",1," ",null,null,{"$f":"VLOOKUP(J326,FOURNISSEURS!$A$1:$B$2212,2,0)","v":{"$error":"#N/A"}},null,null,"DISTRIBUTION B.L.M. ENR.","D31735","2018-09-09"]
[null,null,1," ",1," ",1," ",null,null,{"$f":"VLOOKUP(J327,FOURNISSEURS!$A$1:$B$2212,2,0)","v":{"$error":"#N/A"}},null,null,"DISTRIBUTION N. ROY","D31790","2018-09-10"]
[null,null,1," ",1," ",1," ",null,null,{"$f":"VLOOKUP(J328,FOURNISSEURS!$A$1:$B$2212,2,0)","v":{"$error":"#N/A"}},null,null,"DISTRIBUTION PRAXAIR","D31800","2018-09-11"]
[null,null,1," ",1," ",1," ",null,null,{"$f":"VLOOKUP(J329,FOURNISSEURS!$A$1:$B$2212,2,0)","v":{"$error":"#N/A"}},null,null,"DISTRIBUTION SPORTS LOISIRS G.P. INC.","D31825","2018-09-12"]
[null,null,1," ",1," ",1," ",null,null,{"$f":"VLOOKUP(J330,FOURNISSEURS!$A$1:$B$2212,2,0)","v":{"$error":"#N/A"}},null,null,"DISTRIBUTIONS ABM INC.","D31725","2018-09-13"]
[null,null,1," ",1," ",1," ",null,null,{"$f":"VLOOKUP(J331,FOURNISSEURS!$A$1:$B$2212,2,0)","v":{"$error":"#N/A"}},null,null,"DISTRIBUTIONS YVES LEROUX","D31875","2018-09-14"]
[null,null,1," ",1," ",1," ",null,null,{"$f":"VLOOKUP(J332,FOURNISSEURS!$A$1:$B$2212,2,0)","v":{"$error":"#N/A"}},null,null,"DIVERS-NON CRÉÉ","*","2018-09-15"]
[null,null,1," ",1," ",1," ",null,null,{"$f":"VLOOKUP(J333,FOURNISSEURS!$A$1:$B$2212,2,0)","v":{"$error":"#N/A"}},null,null,"DONAT BILODEAU EXPERTS-CONSEILS INC.","D31900","2018-09-16"]
[null,null,1," ",1," ",1," ",null,null,{"$f":"VLOOKUP(J334,FOURNISSEURS!$A$1:$B$2212,2,0)","v":{"$error":"#N/A"}},null,null,"DRAPEAU VÉRONICA","D31950","2018-09-17"]
[null,null,1," ",1," ",1," ",null,null,{"$f":"VLOOKUP(J335,FOURNISSEURS!$A$1:$B$2212,2,0)","v":{"$error":"#N/A"}},null,null,"DRL-BEAUDOIN","D32000","2018-09-18"]
[null,null,1," ",1," ",1," ",null,null,{"$f":"VLOOKUP(J336,FOURNISSEURS!$A$1:$B$2212,2,0)","v":{"$error":"#N/A"}},null,null,"DROITS ET LIBERTÉS","D32010","2018-09-19"]
[null,null,1," ",1," ",1," ",null,null,{"$f":"VLOOKUP(J337,FOURNISSEURS!$A$1:$B$2212,2,0)","v":{"$error":"#N/A"}},null,null,"DUBÉ FRANCE","D32025","2018-09-20"]
[null,null,1," ",1," ",1," ",null,null,{"$f":"VLOOKUP(J338,FOURNISSEURS!$A$1:$B$2212,2,0)","v":{"$error":"#N/A"}},null,null,"DUBE ROGER, DISTRIBUTEUR","D32050","2018-09-21"]
[null,null,1," ",1," ",1," ",null,null,{"$f":"VLOOKUP(J339,FOURNISSEURS!$A$1:$B$2212,2,0)","v":{"$error":"#N/A"}},null,null,"DUFORT BEAUCAGE AUDREY","D32075","2018-09-22"]
[null,null,1," ",1," ",1," ",null,null,{"$f":"VLOOKUP(J340,FOURNISSEURS!$A$1:$B$2212,2,0)","v":{"$error":"#N/A"}},null,null,"DUFORT ET LAVIGNE LTÉE","D32100","2018-09-23"]
[null,null,1," ",1," ",1," ",null,null,{"$f":"VLOOKUP(J341,FOURNISSEURS!$A$1:$B$2212,2,0)","v":{"$error":"#N/A"}},null,null,"DUFORT JOCELYNE","D32125","2018-09-24"]
[null,null,1," ",1," ",1," ",null,null,{"$f":"VLOOKUP(J342,FOURNISSEURS!$A$1:$B$2212,2,0)","v":{"$error":"#N/A"}},null,null,"DUFORT RICHARD","D32375","2018-09-25"]
[null,null,1," ",1," ",1," ",null,null,{"$f":"VLOOKUP(J343,FOURNISSEURS!$A$1:$B$2212,2,0)","v":{"$error":"#N/A"}},null,null,"DUFOUR  BOB","D32450","2018-09-26"]
[null,null,1," ",1," ",1," ",null,null,{"$f":"VLOOKUP(J344,FOURNISSEURS!$A$1:$B$2212,2,0)","v":{"$error":"#N/A"}},null,null,"DUGAS CLAUDE","D32500","2018-09-27"]
[null,null,1," ",1," ",1," ",null,null,{"$f":"VLOOKUP(J345,FOURNISSEURS!$A$1:$B$2212,2,0)","v":{"$error":"#N/A"}},null,null,"DUGAS GUILLAUME","D32525","2018-09-28"]
[null,null,1," ",1," ",1," ",null,null,{"$f":"VLOOKUP(J346,FOURNISSEURS!$A$1:$B$2212,2,0)","v":{"$error":"#N/A"}},null,null,"DUNTON RAINVILLE EN FIDUCIE","D32650","2018-09-29"]
[null,null,1," ",1," ",1," ",null,null,{"$f":"VLOOKUP(J347,FOURNISSEURS!$A$1:$B$2212,2,0)","v":{"$error":"#N/A"}},null,null,"DUNTON RAINVILLE, SENC","D32625","2018-09-30"]
[null,null,1," ",1," ",1," ",null,null,{"$f":"VLOOKUP(J348,FOURNISSEURS!$A$1:$B$2212,2,0)","v":{"$error":"#N/A"}},null,null,"DUPONT GILLES, ARPENTEUR","D32700","2018-10-01"]
[null,null,1," ",1," ",1," ",null,null,{"$f":"VLOOKUP(J349,FOURNISSEURS!$A$1:$B$2212,2,0)","v":{"$error":"#N/A"}},null,null,"DUPUIS FANNY","D32725","2018-10-02"]
[null,null,1," ",1," ",1," ",null,null,{"$f":"VLOOKUP(J350,FOURNISSEURS!$A$1:$B$2212,2,0)","v":{"$error":"#N/A"}},null,null,"DUQUETTE DANIEL","D32750","2018-10-03"]
[null,null,1," ",1," ",1," ",null,null,{"$f":"VLOOKUP(J351,FOURNISSEURS!$A$1:$B$2212,2,0)","v":{"$error":"#N/A"}},null,null,"DYSTROPHIE MUSCULAIRE CANADA","D32850","2018-10-04"]
[null,null,1," ",1," ",1," ",null,null,{"$f":"VLOOKUP(J352,FOURNISSEURS!$A$1:$B$2212,2,0)","v":{"$error":"#N/A"}},null,null,"E.B.I. ENVIRONNEMENT INC.","E32910","2018-10-05"]
[null,null,1," ",1," ",1," ",null,null,{"$f":"VLOOKUP(J353,FOURNISSEURS!$A$1:$B$2212,2,0)","v":{"$error":"#N/A"}},null,null,"E.M.P.C.","E34000","2018-10-06"]
[null,null,1," ",1," ",1," ",null,null,{"$f":"VLOOKUP(J354,FOURNISSEURS!$A$1:$B$2212,2,0)","v":{"$error":"#N/A"}},null,null,"EAU-THENTIQUE TRANSPORT INC. (L')","E32905","2018-10-07"]
[null,null,1," ",1," ",1," ",null,null,{"$f":"VLOOKUP(J355,FOURNISSEURS!$A$1:$B$2212,2,0)","v":{"$error":"#N/A"}},null,null,"ECHELLES C.E. THIBAULT INC.","E32925","2018-10-08"]
[null,null,1," ",1," ",1," ",null,null,{"$f":"VLOOKUP(J356,FOURNISSEURS!$A$1:$B$2212,2,0)","v":{"$error":"#N/A"}},null,null,"ECOLE SECONDAIRE DE L'ACHIGAN","E32950","2018-10-09"]
[null,null,1,{"$f":"CHOOSE(C357,\" \",$D$4,$D$5,$D$6,$D$7,$D$8,$D$9,$D$10,$D$11,$D$12)","v":" "},1,{"$f":"CHOOSE(E357,\" \",$F$4,$F$5,$F$6,$F$7,$F$8,$F$9,$F$10,$F$11,$F$4,$F$5,$F$6,$F$7,$F$8)","v":" "},1,{"$f":"CHOOSE(G357,\" \",$H$4,$H$5,$H$6,$H$7,$H$8,$H$9,$H$10,$H$11,$J$4,$J$5,$J$6,$J$7,$J$8,$J$9,$J$10,\" \")","v":" "},null,null,{"$f":"VLOOKUP(J357,FOURNISSEURS!$A$1:$B$2212,2,0)","v":{"$error":"#N/A"}},null,null,"EDDYNET INC.","E33000","2018-10-10"]
[null,null,1," ",1," ",1," ",null,null,{"$f":"VLOOKUP(J358,FOURNISSEURS!$A$1:$B$2212,2,0)","v":{"$error":"#N/A"}},null,null,"EDITIONS YVON BLAIS INC. (LES)","E33525","2018-10-11"]
[null,null,1," ",1," ",1," ",null,null,{"$f":"VLOOKUP(J359,FOURNISSEURS!$A$1:$B$2212,2,0)","v":{"$error":"#N/A"}},null,null,"EFEL EXPERTS-CONSEILS","E33535","2018-10-12"]
[null,null,1," ",1," ",1," ",null,null,{"$f":"VLOOKUP(J360,FOURNISSEURS!$A$1:$B$2212,2,0)","v":{"$error":"#N/A"}},null,null,"ELECTRO-CONCEPT P.B.L INC.","E33800","2018-10-13"]
[null,null,1," ",1," ",1," ",null,null,{"$f":"VLOOKUP(J361,FOURNISSEURS!$A$1:$B$2212,2,0)","v":{"$error":"#N/A"}},null,null,"ELECTROMECANO","E33825","2018-10-14"]
[null,null,1," ",1," ",1," ",null,null,{"$f":"VLOOKUP(J362,FOURNISSEURS!$A$1:$B$2212,2,0)","v":{"$error":"#N/A"}},null,null,"ELECTRONIQUE ADDISON ST-JÉRÔME INC.","E33840","2018-10-15"]
[null,null,1," ",1," ",1," ",null,null,{"$f":"VLOOKUP(J363,FOURNISSEURS!$A$1:$B$2212,2,0)","v":{"$error":"#N/A"}},null,null,"ELECTRONIQUE SECURITE THOMAS LTEE","E33850","2018-10-16"]
[null,null,1," ",1," ",1," ",null,null,{"$f":"VLOOKUP(J364,FOURNISSEURS!$A$1:$B$2212,2,0)","v":{"$error":"#N/A"}},null,null,"ELITE FORD (1978) INC.","E33975","2018-10-17"]
[null,null,1," ",1," ",1," ",null,null,{"$f":"VLOOKUP(J365,FOURNISSEURS!$A$1:$B$2212,2,0)","v":{"$error":"#N/A"}},null,null,"ELITE SECURITE INVESTIGATION INC.","P75910",{"$f":"P364+1","v":"2018-10-18"}]
[null,null,1," ",1," ",1," ",null,null,{"$f":"VLOOKUP(J366,FOURNISSEURS!$A$1:$B$2212,2,0)","v":{"$error":"#N/A"}},null,null,"ELLE QUÉBEC","E33990","2018-10-19"]
[null,null,1," ",1," ",1," ",null,null,{"$f":"VLOOKUP(J367,FOURNISSEURS!$A$1:$B$2212,2,0)","v":{"$error":"#N/A"}},null,null,"EMBALLAGE DANIEL RIVEST INC.","E34100","2018-10-20"]
[null,null,1," ",1," ",1," ",null,null,{"$f":"VLOOKUP(J368,FOURNISSEURS!$A$1:$B$2212,2,0)","v":{"$error":"#N/A"}},null,null,"EMERY ARCHITECTE INC.","E34200","2018-10-21"]
[null,null,1," ",1," ",1," ",null,null,{"$f":"VLOOKUP(J369,FOURNISSEURS!$A$1:$B$2212,2,0)","v":{"$error":"#N/A"}},null,null,"EMOND COLETTE","E34250","2018-10-22"]
[null,null,1," ",1," ",1," ",null,null,{"$f":"VLOOKUP(J370,FOURNISSEURS!$A$1:$B$2212,2,0)","v":{"$error":"#N/A"}},null,null,"EMRN 2008","E34275","2018-10-23"]
[null,null,1," ",1," ",1," ",null,null,{"$f":"VLOOKUP(J371,FOURNISSEURS!$A$1:$B$2212,2,0)","v":{"$error":"#N/A"}},null,null,"ENDRESS + HAUSER CANADA LTEE","E34300","2018-10-24"]
[null,null,1," ",1," ",1," ",null,null,{"$f":"VLOOKUP(J372,FOURNISSEURS!$A$1:$B$2212,2,0)","v":{"$error":"#N/A"}},null,null,"ENLEVEMENT  DE LA NEIGE LAURENTIDE LTEE","E34425","2018-10-25"]
[null,null,1," ",1," ",1," ",null,null,{"$f":"VLOOKUP(J373,FOURNISSEURS!$A$1:$B$2212,2,0)","v":{"$error":"#N/A"}},null,null,"ENTREPOT EN FOLIE","E35325","2018-10-26"]
[null,null,1," ",1," ",1," ",null,null,{"$f":"VLOOKUP(J374,FOURNISSEURS!$A$1:$B$2212,2,0)","v":{"$error":"#N/A"}},null,null,"ENTREPRISE JEAN BEAUREGARD","E35628","2018-10-27"]
[null,null,1," ",1," ",1," ",null,null,{"$f":"VLOOKUP(J375,FOURNISSEURS!$A$1:$B$2212,2,0)","v":{"$error":"#N/A"}},null,null,"ENTREPRISES B. CHAMPAGNE INC.","E35630","2018-10-28"]
[null,null,1," ",1," ",1," ",null,null,{"$f":"VLOOKUP(J376,FOURNISSEURS!$A$1:$B$2212,2,0)","v":{"$error":"#N/A"}},null,null,"ENTREPRISES BOURGET INC. (LES)","E35635","2018-10-29"]
[null,null,1," ",1," ",1," ",null,null,{"$f":"VLOOKUP(J377,FOURNISSEURS!$A$1:$B$2212,2,0)","v":{"$error":"#N/A"}},null,null,"ENTREPRISES DANIEL BEAUCHAMP","E35650","2018-10-30"]
[null,null,1," ",1," ",1," ",null,null,{"$f":"VLOOKUP(J378,FOURNISSEURS!$A$1:$B$2212,2,0)","v":{"$error":"#N/A"}},null,null,"ENTREPRISES DENIS DESJARDINS","E35660","2018-10-31"]
[null,null,1," ",1," ",1," ",null,null,{"$f":"VLOOKUP(J379,FOURNISSEURS!$A$1:$B$2212,2,0)","v":{"$error":"#N/A"}},null,null,"ENTREPRISES F.F.","E35685","2018-11-01"]
[null,null,1," ",1," ",1," ",null,null,{"$f":"VLOOKUP(J380,FOURNISSEURS!$A$1:$B$2212,2,0)","v":{"$error":"#N/A"}},null,null,"ENTREPRISES FRANCOIS ROY","E35675","2018-11-02"]
[null,null,1," ",1," ",1," ",null,null,{"$f":"VLOOKUP(J381,FOURNISSEURS!$A$1:$B$2212,2,0)","v":{"$error":"#N/A"}},null,null,"ENTREPRISES GASPARD INC.","E35700","2018-11-03"]
[null,null,1," ",1," ",1," ",null,null,{"$f":"VLOOKUP(J382,FOURNISSEURS!$A$1:$B$2212,2,0)","v":{"$error":"#N/A"}},null,null,"ENTREPRISES GUY BEAULIEU 2009 INC.","E35705","2018-11-04"]
[null,null,1," ",1," ",1," ",null,null,{"$f":"VLOOKUP(J383,FOURNISSEURS!$A$1:$B$2212,2,0)","v":{"$error":"#N/A"}},null,null,"ENTREPRISES J. & F. CHARLAND INC.","E35710","2018-11-05"]
[null,null,1," ",1," ",1," ",null,null,{"$f":"VLOOKUP(J384,FOURNISSEURS!$A$1:$B$2212,2,0)","v":{"$error":"#N/A"}},null,null,"ENTREPRISES MICHEL BEAUPIED INC.","E35735","2018-11-06"]
[null,null,1," ",1," ",1," ",null,null,{"$f":"VLOOKUP(J385,FOURNISSEURS!$A$1:$B$2212,2,0)","v":{"$error":"#N/A"}},null,null,"ENTREPRISES MICHEL FOREST INC.","E35740","2018-11-07"]
[null,null,1," ",1," ",1," ",null,null,{"$f":"VLOOKUP(J386,FOURNISSEURS!$A$1:$B$2212,2,0)","v":{"$error":"#N/A"}},null,null,"ENTREPRISES OMEX (LES)","E35745","2018-11-08"]
[null,null,1," ",1," ",1," ",null,null,{"$f":"VLOOKUP(J387,FOURNISSEURS!$A$1:$B$2212,2,0)","v":{"$error":"#N/A"}},null,null,"ENTREPRISES R. & S. CHARLAND INC.","E35755","2018-11-09"]
[null,null,1," ",1," ",1," ",null,null,{"$f":"VLOOKUP(J388,FOURNISSEURS!$A$1:$B$2212,2,0)","v":{"$error":"#N/A"}},null,null,"ENTREPRISES ROY S.E.N.C.","E35760","2018-11-10"]
[null,null,1," ",1," ",1," ",null,null,{"$f":"VLOOKUP(J389,FOURNISSEURS!$A$1:$B$2212,2,0)","v":{"$error":"#N/A"}},null,null,"ENTREPRISES STEVE RACETTE ENR. (LES)","E35762","2018-11-11"]
[null,null,1," ",1," ",1," ",null,null,{"$f":"VLOOKUP(J390,FOURNISSEURS!$A$1:$B$2212,2,0)","v":{"$error":"#N/A"}},null,null,"ENTREPRISES YVON HARNOIS INC.","E35765","2018-11-12"]
[null,null,1," ",1," ",1," ",null,null,{"$f":"VLOOKUP(J391,FOURNISSEURS!$A$1:$B$2212,2,0)","v":{"$error":"#N/A"}},null,null,"ENVIRO SANI-NORD","E35850","2018-11-13"]
[null,null,1," ",1," ",1," ",null,null,{"$f":"VLOOKUP(J392,FOURNISSEURS!$A$1:$B$2212,2,0)","v":{"$error":"#N/A"}},null,null,"ENVIRONEX","E36000","2018-11-14"]
[null,null,1," ",1," ",1," ",null,null,{"$f":"VLOOKUP(J393,FOURNISSEURS!$A$1:$B$2212,2,0)","v":{"$error":"#N/A"}},null,null,"ENVIRONOR CANADA INC.","E36075","2018-11-15"]
[null,null,1," ",1," ",1," ",null,null,{"$f":"VLOOKUP(J394,FOURNISSEURS!$A$1:$B$2212,2,0)","v":{"$error":"#N/A"}},null,null,"ENVIROSERVICES","E36100","2018-11-16"]
[null,null,1," ",1," ",1," ",null,null,{"$f":"VLOOKUP(J395,FOURNISSEURS!$A$1:$B$2212,2,0)","v":{"$error":"#N/A"}},null,null,"EQUIP. DE BUREAU ROBERT LEGARE LTEE","E36220","2018-11-17"]
[null,null,1," ",1," ",1," ",null,null,{"$f":"VLOOKUP(J396,FOURNISSEURS!$A$1:$B$2212,2,0)","v":{"$error":"#N/A"}},null,null,"EQUIPEMENTS R. DAOUST LTEE","E36675","2018-11-18"]
[null,null,1," ",1," ",1," ",null,null,{"$f":"VLOOKUP(J397,FOURNISSEURS!$A$1:$B$2212,2,0)","v":{"$error":"#N/A"}},null,null,"EQUIPEMENTS RECREATIFS JAMBETTE INC.","E36750","2018-11-19"]
[null,null,1," ",1," ",1," ",null,null,{"$f":"VLOOKUP(J398,FOURNISSEURS!$A$1:$B$2212,2,0)","v":{"$error":"#N/A"}},null,null,"ESCADRON 879 SAINT-LIN","E36900","2018-11-20"]
[null,null,1," ",1," ",1," ",null,null,{"$f":"VLOOKUP(J399,FOURNISSEURS!$A$1:$B$2212,2,0)","v":{"$error":"#N/A"}},null,null,"ESTIMATEURS PROFESSIONNELS","E37125","2018-11-21"]
[null,null,1," ",1," ",1," ",null,null,{"$f":"VLOOKUP(J400,FOURNISSEURS!$A$1:$B$2212,2,0)","v":{"$error":"#N/A"}},null,null,"EUGENIE TECHNOLOGIE INC.","E37150","2018-11-22"]
[null,null,1," ",1," ",1," ",null,null,{"$f":"VLOOKUP(J401,FOURNISSEURS!$A$1:$B$2212,2,0)","v":{"$error":"#N/A"}},null,null,"EURETECH ENR.","E37200","2018-11-23"]
[null,null,1," ",1," ",1," ",null,null,{"$f":"VLOOKUP(J402,FOURNISSEURS!$A$1:$B$2212,2,0)","v":{"$error":"#N/A"}},null,null,"EXCAVATION C. BEAUCHAMP INC.","E37350","2018-11-24"]
[null,null,1," ",1," ",1," ",null,null,{"$f":"VLOOKUP(J403,FOURNISSEURS!$A$1:$B$2212,2,0)","v":{"$error":"#N/A"}},null,null,"EXCAVATION F. LONGPRÉ LTÉE","E37400","2018-11-25"]
[null,null,1," ",1," ",1," ",null,null,{"$f":"VLOOKUP(J404,FOURNISSEURS!$A$1:$B$2212,2,0)","v":{"$error":"#N/A"}},null,null,"EXCAVATION J. BOTELHO INC.","E37500","2018-11-26"]
[null,null,1," ",1," ",1," ",null,null,{"$f":"VLOOKUP(J405,FOURNISSEURS!$A$1:$B$2212,2,0)","v":{"$error":"#N/A"}},null,null,"EXCAVATION JULES DODON INC.","E37525","2018-11-27"]
[null,null,1," ",1," ",1," ",null,null,{"$f":"VLOOKUP(J406,FOURNISSEURS!$A$1:$B$2212,2,0)","v":{"$error":"#N/A"}},null,null,"EXCAVATION MARC VILLENEUVE INC.","E37600","2018-11-28"]
[null,null,1," ",1," ",1," ",null,null,{"$f":"VLOOKUP(J407,FOURNISSEURS!$A$1:$B$2212,2,0)","v":{"$error":"#N/A"}},null,null,"EXCAVATION PIERRE GIRARD INC.","E37800","2018-11-29"]
[null,null,1," ",1," ",1," ",null,null,{"$f":"VLOOKUP(J408,FOURNISSEURS!$A$1:$B$2212,2,0)","v":{"$error":"#N/A"}},null,null,"EXCAVATION REJEAN ALLAIRE LTEE","E37850","2018-11-30"]
[null,null,1," ",1," ",1," ",null,null,{"$f":"VLOOKUP(J409,FOURNISSEURS!$A$1:$B$2212,2,0)","v":{"$error":"#N/A"}},null,null,"EXCAVATION YVON BENOIT","E38000","2018-12-01"]
[null,null,1," ",1," ",1," ",null,null,{"$f":"VLOOKUP(J410,FOURNISSEURS!$A$1:$B$2212,2,0)","v":{"$error":"#N/A"}},null,null,"EXCAVATIONS GILLES ST-ONGE INC.","E37425","2018-12-02"]
[null,null,1," ",1," ",1," ",null,null,{"$f":"VLOOKUP(J411,FOURNISSEURS!$A$1:$B$2212,2,0)","v":{"$error":"#N/A"}},null,null,"EXHIBIT (L')","E38050","2018-12-03"]
[null,null,1," ",1," ",1," ",null,null,{"$f":"VLOOKUP(J412,FOURNISSEURS!$A$1:$B$2212,2,0)","v":{"$error":"#N/A"}},null,null,"EXPERTISE NEUROSCIENCES","E38100","2018-12-04"]
[null,null,1," ",1," ",1," ",null,null,{"$f":"VLOOKUP(J413,FOURNISSEURS!$A$1:$B$2212,2,0)","v":{"$error":"#N/A"}},null,null,"EXPO RIVE-NORD","E38250","2018-12-05"]
[null,null,1," ",1," ",1," ",null,null,{"$f":"VLOOKUP(J414,FOURNISSEURS!$A$1:$B$2212,2,0)","v":{"$error":"#N/A"}},null,null,"EXPRESS MAG","E38300","2018-12-06"]
[null,null,1," ",1," ",1," ",null,null,{"$f":"VLOOKUP(J415,FOURNISSEURS!$A$1:$B$2212,2,0)","v":{"$error":"#N/A"}},null,null,"F.Q.M.","F38475","2018-12-07"]
[null,null,1," ",1," ",1," ",null,null,{"$f":"VLOOKUP(J416,FOURNISSEURS!$A$1:$B$2212,2,0)","v":{"$error":"#N/A"}},null,null,"FABRIQUE BIENHEUREUSE ÉMILIE-GAMELIN","F38600","2018-12-08"]
[null,null,1," ",1," ",1," ",null,null,{"$f":"VLOOKUP(J417,FOURNISSEURS!$A$1:$B$2212,2,0)","v":{"$error":"#N/A"}},null,null,"FAHEY + ASSOCIÉS","F38700","2018-12-09"]
[null,null,1," ",1," ",1," ",null,null,{"$f":"VLOOKUP(J418,FOURNISSEURS!$A$1:$B$2212,2,0)","v":{"$error":"#N/A"}},null,null,"FÉDÉRATION QUÉBÉCOISE DE L'AUTISME","F38800","2018-12-10"]
[null,null,1," ",1," ",1," ",null,null,{"$f":"VLOOKUP(J419,FOURNISSEURS!$A$1:$B$2212,2,0)","v":{"$error":"#N/A"}},null,null,"FÉLIX SÉCURITÉ INC.","F38850","2018-12-11"]
[null,null,1," ",1," ",1," ",null,null,{"$f":"VLOOKUP(J420,FOURNISSEURS!$A$1:$B$2212,2,0)","v":{"$error":"#N/A"}},null,null,"FERME BASTIEN INC","F38925","2018-12-12"]
[null,null,1,{"$f":"CHOOSE(C421,\" \",$D$4,$D$5,$D$6,$D$7,$D$8,$D$9,$D$10,$D$11,$D$12)","v":" "},1,{"$f":"CHOOSE(E421,\" \",$F$4,$F$5,$F$6,$F$7,$F$8,$F$9,$F$10,$F$11,$F$4,$F$5,$F$6,$F$7,$F$8)","v":" "},1,{"$f":"CHOOSE(G421,\" \",$H$4,$H$5,$H$6,$H$7,$H$8,$H$9,$H$10,$H$11,$J$4,$J$5,$J$6,$J$7,$J$8,$J$9,$J$10,\" \")","v":" "},null,null,{"$f":"VLOOKUP(J421,FOURNISSEURS!$A$1:$B$2212,2,0)","v":{"$error":"#N/A"}},null,null,"FERME EDDY FUOCO","F39200","2018-12-13"]
[null,null,1," ",1," ",1," ",null,null,{"$f":"VLOOKUP(J422,FOURNISSEURS!$A$1:$B$2212,2,0)","v":{"$error":"#N/A"}},null,null,"FERME PIERRE OUELLETTE ENR.","F39650","2018-12-14"]
[null,null,1," ",1," ",1," ",null,null,{"$f":"VLOOKUP(J423,FOURNISSEURS!$A$1:$B$2212,2,0)","v":{"$error":"#N/A"}},null,null,"FERMES GUILBAULT ENR. (LES)","F39575","2018-12-15"]
[null,null,1," ",1," ",1," ",null,null,{"$f":"VLOOKUP(J424,FOURNISSEURS!$A$1:$B$2212,2,0)","v":{"$error":"#N/A"}},null,null,"FESTIVAL ACADIEN DE LA NOUVELLE-ACADIE","F39700","2018-12-16"]
[null,null,1," ",1," ",1," ",null,null,{"$f":"VLOOKUP(J425,FOURNISSEURS!$A$1:$B$2212,2,0)","v":{"$error":"#N/A"}},null,null,"FESTIVAL DE LANAUDIERE","F39825","2018-12-17"]
[null,null,1," ",1," ",1," ",null,null,{"$f":"VLOOKUP(J426,FOURNISSEURS!$A$1:$B$2212,2,0)","v":{"$error":"#N/A"}},null,null,"FIBRE DE VERRE RAWDON","F39827","2018-12-18"]
[null,null,1," ",1," ",1," ",null,null,{"$f":"VLOOKUP(J427,FOURNISSEURS!$A$1:$B$2212,2,0)","v":{"$error":"#N/A"}},null,null,"FIBRES OPTIQUES DU QUEBEC LTEE (LES)","F39828","2018-12-19"]
[null,null,1," ",1," ",1," ",null,null,{"$f":"VLOOKUP(J428,FOURNISSEURS!$A$1:$B$2212,2,0)","v":{"$error":"#N/A"}},null,null,"FINANCIERE BANQUE NATIONALE INC.","F39840","2018-12-20"]
[null,null,1," ",1," ",1," ",null,null,{"$f":"VLOOKUP(J429,FOURNISSEURS!$A$1:$B$2212,2,0)","v":{"$error":"#N/A"}},null,null,"FINANCIÈRE GLOSTAR/CRÉDIT COM. CANADA IN","D29455",{"$f":"P428+1","v":"2018-12-21"}]
[null,null,1," ",1," ",1," ",null,null,{"$f":"VLOOKUP(J430,FOURNISSEURS!$A$1:$B$2212,2,0)","v":{"$error":"#N/A"}},null,null,"FIREFIGHTING IN CANADA","F39845","2018-12-22"]
[null,null,1," ",1," ",1," ",null,null,{"$f":"VLOOKUP(J431,FOURNISSEURS!$A$1:$B$2212,2,0)","v":{"$error":"#N/A"}},null,null,"FIX-AUTO ST-LIN-LAURENTIDES","F39850","2018-12-23"]
[null,null,1," ",1," ",1," ",null,null,{"$f":"VLOOKUP(J432,FOURNISSEURS!$A$1:$B$2212,2,0)","v":{"$error":"#N/A"}},null,null,"FLAGHOUSSE","F39875","2018-12-24"]
[null,null,1," ",1," ",1," ",null,null,{"$f":"VLOOKUP(J433,FOURNISSEURS!$A$1:$B$2212,2,0)","v":{"$error":"#N/A"}},null,null,"FLEURISTE FLEURS D'EPOQUE","F40005","2018-12-25"]
[null,null,1," ",1," ",1," ",null,null,{"$f":"VLOOKUP(J434,FOURNISSEURS!$A$1:$B$2212,2,0)","v":{"$error":"#N/A"}},null,null,"FLEURS PLANTES JARDINS","F40000","2018-12-26"]
[null,null,1," ",1," ",1," ",null,null,{"$f":"VLOOKUP(J435,FOURNISSEURS!$A$1:$B$2212,2,0)","v":{"$error":"#N/A"}},null,null,"FONDATION COLLEGE ESTHER-BLONDIN","F40275","2018-12-27"]
[null,null,1," ",1," ",1," ",null,null,{"$f":"VLOOKUP(J436,FOURNISSEURS!$A$1:$B$2212,2,0)","v":{"$error":"#N/A"}},null,null,"FONDATION DES MALADIES DU COEUR","F40500","2018-12-28"]
[null,null,1," ",1," ",1," ",null,null,{"$f":"VLOOKUP(J437,FOURNISSEURS!$A$1:$B$2212,2,0)","v":{"$error":"#N/A"}},null,null,"FONDATION RUES PRINCIPALES","F40575","2018-12-29"]
[null,null,1," ",1," ",1," ",null,null,{"$f":"VLOOKUP(J438,FOURNISSEURS!$A$1:$B$2212,2,0)","v":{"$error":"#N/A"}},null,null,"FONDS D'INFORMATION SUR LE TERRITOIRE","F40600","2018-12-30"]
[null,null,1," ",1," ",1," ",null,null,{"$f":"VLOOKUP(J439,FOURNISSEURS!$A$1:$B$2212,2,0)","v":{"$error":"#N/A"}},null,null,"FORAGE RC INC.","F40800","2018-12-31"]
[null,null,1," ",1," ",1," ",null,null,{"$f":"VLOOKUP(J440,FOURNISSEURS!$A$1:$B$2212,2,0)","v":{"$error":"#N/A"}},null,null,"FORMATION QUÉBEC","F40925","2019-01-01"]
[null,null,1," ",1," ",1," ",null,null,{"$f":"VLOOKUP(J441,FOURNISSEURS!$A$1:$B$2212,2,0)","v":{"$error":"#N/A"}},null,null,"FORMICIEL INC.","F40950","2019-01-02"]
[null,null,1," ",1," ",1," ",null,null,{"$f":"VLOOKUP(J442,FOURNISSEURS!$A$1:$B$2212,2,0)","v":{"$error":"#N/A"}},null,null,"FORMULES MUNICIPALES INC","F41175","2019-01-03"]
[null,null,1," ",1," ",1," ",null,null,{"$f":"VLOOKUP(J443,FOURNISSEURS!$A$1:$B$2212,2,0)","v":{"$error":"#N/A"}},null,null,"FOSSES SEPTIQUES LORTIE","F41625","2019-01-04"]
[null,null,1," ",1," ",1," ",null,null,{"$f":"VLOOKUP(J444,FOURNISSEURS!$A$1:$B$2212,2,0)","v":{"$error":"#N/A"}},null,null,"FOURNISSEUR OCCASIONNEL","*","2019-01-05"]
[null,null,1," ",1," ",1," ",null,null,{"$f":"VLOOKUP(J445,FOURNISSEURS!$A$1:$B$2212,2,0)","v":{"$error":"#N/A"}},null,null,"FOYERS RUSTIQUES INC. (LES)","F42175","2019-01-06"]
[null,null,1," ",1," ",1," ",null,null,{"$f":"VLOOKUP(J446,FOURNISSEURS!$A$1:$B$2212,2,0)","v":{"$error":"#N/A"}},null,null,"FQOLT","F42180","2019-01-07"]
[null,null,1," ",1," ",1," ",null,null,{"$f":"VLOOKUP(J447,FOURNISSEURS!$A$1:$B$2212,2,0)","v":{"$error":"#N/A"}},null,null,"FRANCOIS DUFORT AUTO ELECTRIQUE","F42200","2019-01-08"]
[null,null,1," ",1," ",1," ",null,null,{"$f":"VLOOKUP(J448,FOURNISSEURS!$A$1:$B$2212,2,0)","v":{"$error":"#N/A"}},null,null,"FREDERIC FRANCOISE, BRIGADIERE","F42300","2019-01-09"]
[null,null,1," ",1," ",1," ",null,null,{"$f":"VLOOKUP(J449,FOURNISSEURS!$A$1:$B$2212,2,0)","v":{"$error":"#N/A"}},null,null,"FUNIO","F42500","2019-01-10"]
[null,null,1," ",1," ",1," ",null,null,{"$f":"VLOOKUP(J450,FOURNISSEURS!$A$1:$B$2212,2,0)","v":{"$error":"#N/A"}},null,null,"G. DOYON CUISINE INC.","G42600","2019-01-11"]
[null,null,1," ",1," ",1," ",null,null,{"$f":"VLOOKUP(J451,FOURNISSEURS!$A$1:$B$2212,2,0)","v":{"$error":"#N/A"}},null,null,"G.P.A. EXPERTS-CONSEILS","G43000","2019-01-12"]
[null,null,1," ",1," ",1," ",null,null,{"$f":"VLOOKUP(J452,FOURNISSEURS!$A$1:$B$2212,2,0)","v":{"$error":"#N/A"}},null,null,"GADBOIS DIÉSEL","G43150","2019-01-13"]
[null,null,1," ",1," ",1," ",null,null,{"$f":"VLOOKUP(J453,FOURNISSEURS!$A$1:$B$2212,2,0)","v":{"$error":"#N/A"}},null,null,"GAGNÉ CLAIRE","G43350","2019-01-14"]
[null,null,1," ",1," ",1," ",null,null,{"$f":"VLOOKUP(J454,FOURNISSEURS!$A$1:$B$2212,2,0)","v":{"$error":"#N/A"}},null,null,"GALARNEAU SAUVÉ INC. EN FIDÉICOMMIS","G43450","2019-01-15"]
[null,null,1," ",1," ",1," ",null,null,{"$f":"VLOOKUP(J455,FOURNISSEURS!$A$1:$B$2212,2,0)","v":{"$error":"#N/A"}},null,null,"GARAGE DIESEL BLAINVILLE","G43500","2019-01-16"]
[null,null,1," ",1," ",1," ",null,null,{"$f":"VLOOKUP(J456,FOURNISSEURS!$A$1:$B$2212,2,0)","v":{"$error":"#N/A"}},null,null,"GARAGE LUSSIER INC.","G44100","2019-01-17"]
[null,null,1," ",1," ",1," ",null,null,{"$f":"VLOOKUP(J457,FOURNISSEURS!$A$1:$B$2212,2,0)","v":{"$error":"#N/A"}},null,null,"GARAGE MARCIL","G44250","2019-01-18"]
[null,null,1," ",1," ",1," ",null,null,{"$f":"VLOOKUP(J458,FOURNISSEURS!$A$1:$B$2212,2,0)","v":{"$error":"#N/A"}},null,null,"GARAGE PRUD'HOMME INC.","G44375","2019-01-19"]
[null,null,1," ",1," ",1," ",null,null,{"$f":"VLOOKUP(J459,FOURNISSEURS!$A$1:$B$2212,2,0)","v":{"$error":"#N/A"}},null,null,"GARIEPY ROBERT","G44450","2019-01-20"]
[null,null,1," ",1," ",1," ",null,null,{"$f":"VLOOKUP(J460,FOURNISSEURS!$A$1:$B$2212,2,0)","v":{"$error":"#N/A"}},null,null,"GARON ALAIN","G44500","2019-01-21"]
[null,null,1," ",1," ",1," ",null,null,{"$f":"VLOOKUP(J461,FOURNISSEURS!$A$1:$B$2212,2,0)","v":{"$error":"#N/A"}},null,null,"GAZ METRO","G44775","2019-01-22"]
[null,null,1," ",1," ",1," ",null,null,{"$f":"VLOOKUP(J462,FOURNISSEURS!$A$1:$B$2212,2,0)","v":{"$error":"#N/A"}},null,null,"GAZONNIERE LAUZON & FRERES INC.","G45000","2019-01-23"]
[null,null,1," ",1," ",1," ",null,null,{"$f":"VLOOKUP(J463,FOURNISSEURS!$A$1:$B$2212,2,0)","v":{"$error":"#N/A"}},null,null,"GENEQ INC.","G45150","2019-01-24"]
[null,null,1," ",1," ",1," ",null,null,{"$f":"VLOOKUP(J464,FOURNISSEURS!$A$1:$B$2212,2,0)","v":{"$error":"#N/A"}},null,null,"GENERAL BEARING SERVICE INC.","G45200","2019-01-25"]
[null,null,1," ",1," ",1," ",null,null,{"$f":"VLOOKUP(J465,FOURNISSEURS!$A$1:$B$2212,2,0)","v":{"$error":"#N/A"}},null,null,"GENERATRICE DRUMMOND","G45225","2019-01-26"]
[null,null,1," ",1," ",1," ",null,null,{"$f":"VLOOKUP(J466,FOURNISSEURS!$A$1:$B$2212,2,0)","v":{"$error":"#N/A"}},null,null,"GÉRALD COLLIN SPORT INC.","G45350","2019-01-27"]
[null,null,1," ",1," ",1," ",null,null,{"$f":"VLOOKUP(J467,FOURNISSEURS!$A$1:$B$2212,2,0)","v":{"$error":"#N/A"}},null,null,"GESTAR INC.","G45460","2019-01-28"]
[null,null,1," ",1," ",1," ",null,null,{"$f":"VLOOKUP(J468,FOURNISSEURS!$A$1:$B$2212,2,0)","v":{"$error":"#N/A"}},null,null,"GESTION D'ACHATS RAM","G45475","2019-01-29"]
[null,null,1," ",1," ",1," ",null,null,{"$f":"VLOOKUP(J469,FOURNISSEURS!$A$1:$B$2212,2,0)","v":{"$error":"#N/A"}},null,null,"GESTION GMS INC.","G45520","2019-01-30"]
[null,null,1," ",1," ",1," ",null,null,{"$f":"VLOOKUP(J470,FOURNISSEURS!$A$1:$B$2212,2,0)","v":{"$error":"#N/A"}},null,null,"GESTION USD INC. (USD LOUBAC)","G45560","2019-01-31"]
[null,null,1," ",1," ",1," ",null,null,{"$f":"VLOOKUP(J471,FOURNISSEURS!$A$1:$B$2212,2,0)","v":{"$error":"#N/A"}},null,null,"GIL-BER INC.","G45570","2019-02-01"]
[null,null,1," ",1," ",1," ",null,null,{"$f":"VLOOKUP(J472,FOURNISSEURS!$A$1:$B$2212,2,0)","v":{"$error":"#N/A"}},null,null,"GILLES DUMONT & FILS","G45700","2019-02-02"]
[null,null,1," ",1," ",1," ",null,null,{"$f":"VLOOKUP(J473,FOURNISSEURS!$A$1:$B$2212,2,0)","v":{"$error":"#N/A"}},null,null,"GILLES RENAUD NOTAIRE","G45650","2019-02-03"]
[null,null,1," ",1," ",1," ",null,null,{"$f":"VLOOKUP(J474,FOURNISSEURS!$A$1:$B$2212,2,0)","v":{"$error":"#N/A"}},null,null,"GIRARD-HÉBERT INC","G45750","2019-02-04"]
[null,null,1," ",1," ",1," ",null,null,{"$f":"VLOOKUP(J475,FOURNISSEURS!$A$1:$B$2212,2,0)","v":{"$error":"#N/A"}},null,null,"GIROUX STÉPHANE, POMPIER","G45760","2019-02-05"]
[null,null,1," ",1," ",1," ",null,null,{"$f":"VLOOKUP(J476,FOURNISSEURS!$A$1:$B$2212,2,0)","v":{"$error":"#N/A"}},null,null,"GIVESCO INC.","G45775","2019-02-06"]
[null,null,1," ",1," ",1," ",null,null,{"$f":"VLOOKUP(J477,FOURNISSEURS!$A$1:$B$2212,2,0)","v":{"$error":"#N/A"}},null,null,"GLOBOCAM (ANJOU) INC.","G45785","2019-02-07"]
[null,null,1," ",1," ",1," ",null,null,{"$f":"VLOOKUP(J478,FOURNISSEURS!$A$1:$B$2212,2,0)","v":{"$error":"#N/A"}},null,null,"GOBEILLE INC.","G45810","2019-02-08"]
[null,null,1," ",1," ",1," ",null,null,{"$f":"VLOOKUP(J479,FOURNISSEURS!$A$1:$B$2212,2,0)","v":{"$error":"#N/A"}},null,null,"GO-ÉLAN","G45805","2019-02-09"]
[null,null,1," ",1," ",1," ",null,null,{"$f":"VLOOKUP(J480,FOURNISSEURS!$A$1:$B$2212,2,0)","v":{"$error":"#N/A"}},null,null,"GRADTEK","G45825","2019-02-10"]
[null,null,1," ",1," ",1," ",null,null,{"$f":"VLOOKUP(J481,FOURNISSEURS!$A$1:$B$2212,2,0)","v":{"$error":"#N/A"}},null,null,"GRANDCHAMP CHAPITEAUX INC.","G45826","2019-02-11"]
[null,null,1," ",1," ",1," ",null,null,{"$f":"VLOOKUP(J482,FOURNISSEURS!$A$1:$B$2212,2,0)","v":{"$error":"#N/A"}},null,null,"GRAVEL DANIELLE","G45827","2019-02-12"]
[null,null,1," ",1," ",1," ",null,null,{"$f":"VLOOKUP(J483,FOURNISSEURS!$A$1:$B$2212,2,0)","v":{"$error":"#N/A"}},null,null,"GRENIER CHEVROLET BUICK GMC","G45830","2019-02-13"]
[null,null,1," ",1," ",1," ",null,null,{"$f":"VLOOKUP(J484,FOURNISSEURS!$A$1:$B$2212,2,0)","v":{"$error":"#N/A"}},null,null,"GRONDIN ET ASSOCIE","G45850","2019-02-14"]
[null,null,1,{"$f":"CHOOSE(C485,\" \",$D$4,$D$5,$D$6,$D$7,$D$8,$D$9,$D$10,$D$11,$D$12)","v":" "},1,{"$f":"CHOOSE(E485,\" \",$F$4,$F$5,$F$6,$F$7,$F$8,$F$9,$F$10,$F$11,$F$4,$F$5,$F$6,$F$7,$F$8)","v":" "},1,{"$f":"CHOOSE(G485,\" \",$H$4,$H$5,$H$6,$H$7,$H$8,$H$9,$H$10,$H$11,$J$4,$J$5,$J$6,$J$7,$J$8,$J$9,$J$10,\" \")","v":" "},null,null,{"$f":"VLOOKUP(J485,FOURNISSEURS!$A$1:$B$2212,2,0)","v":{"$error":"#N/A"}},null,null,"GROUPE BOROY NOTIPLEX","G46010","2019-02-15"]
[null,null,1," ",1," ",1," ",null,null,{"$f":"VLOOKUP(J486,FOURNISSEURS!$A$1:$B$2212,2,0)","v":{"$error":"#N/A"}},null,null,"GROUPE BR MÉTAL","E45869","2019-02-16"]
[null,null,1," ",1," ",1," ",null,null,{"$f":"VLOOKUP(J487,FOURNISSEURS!$A$1:$B$2212,2,0)","v":{"$error":"#N/A"}},null,null,"GROUPE CLR","G45870","2019-02-17"]
[null,null,1," ",1," ",1," ",null,null,{"$f":"VLOOKUP(J488,FOURNISSEURS!$A$1:$B$2212,2,0)","v":{"$error":"#N/A"}},null,null,"GROUPE JCL","G45890","2019-02-18"]
[null,null,1," ",1," ",1," ",null,null,{"$f":"VLOOKUP(J489,FOURNISSEURS!$A$1:$B$2212,2,0)","v":{"$error":"#N/A"}},null,null,"GROUPE LEFEBVRE M.R.P. INC.","G46040","2019-02-19"]
[null,null,1," ",1," ",1," ",null,null,{"$f":"VLOOKUP(J490,FOURNISSEURS!$A$1:$B$2212,2,0)","v":{"$error":"#N/A"}},null,null,"GROUPE LUSSIER INC.","G46050","2019-02-20"]
[null,null,1," ",1," ",1," ",null,null,{"$f":"VLOOKUP(J491,FOURNISSEURS!$A$1:$B$2212,2,0)","v":{"$error":"#N/A"}},null,null,"GROUPE MEUNIER,  ARP.-GÉOMÈTRES INC.","G46100","2019-02-21"]
[null,null,1," ",1," ",1," ",null,null,{"$f":"VLOOKUP(J492,FOURNISSEURS!$A$1:$B$2212,2,0)","v":{"$error":"#N/A"}},null,null,"GROUPE RÉAL JEAN","G46110","2019-02-22"]
[null,null,1," ",1," ",1," ",null,null,{"$f":"VLOOKUP(J493,FOURNISSEURS!$A$1:$B$2212,2,0)","v":{"$error":"#N/A"}},null,null,"GROUPE SECUR PLUS","G46175",{"$f":"P492+1","v":"2019-02-23"}]
[null,null,1," ",1," ",1," ",null,null,{"$f":"VLOOKUP(J494,FOURNISSEURS!$A$1:$B$2212,2,0)","v":{"$error":"#N/A"}},null,null,"GROUPE SECURITE COMMERCIALE S.A. INC.","G46200","2019-02-24"]
[null,null,1," ",1," ",1," ",null,null,{"$f":"VLOOKUP(J495,FOURNISSEURS!$A$1:$B$2212,2,0)","v":{"$error":"#N/A"}},null,null,"GROUPE SÉCURITÉ GARDA SENC","G46250","2019-02-25"]
[null,null,1," ",1," ",1," ",null,null,{"$f":"VLOOKUP(J496,FOURNISSEURS!$A$1:$B$2212,2,0)","v":{"$error":"#N/A"}},null,null,"GROUPE ULTIMA INC","G46400","2019-02-26"]
[null,null,1," ",1," ",1," ",null,null,{"$f":"VLOOKUP(J497,FOURNISSEURS!$A$1:$B$2212,2,0)","v":{"$error":"#N/A"}},null,null,"GROUPE VILLENEUVE INC.","G46410","2019-02-27"]
[null,null,1," ",1," ",1," ",null,null,{"$f":"VLOOKUP(J498,FOURNISSEURS!$A$1:$B$2212,2,0)","v":{"$error":"#N/A"}},null,null,"GRUES GSTL INC.","G46420","2019-02-28"]
[null,null,1," ",1," ",1," ",null,null,{"$f":"VLOOKUP(J499,FOURNISSEURS!$A$1:$B$2212,2,0)","v":{"$error":"#N/A"}},null,null,"GUILLEVIN INTERNATIONAL CIE.","G46450","2019-03-01"]
[null,null,1," ",1," ",1," ",null,null,{"$f":"VLOOKUP(J500,FOURNISSEURS!$A$1:$B$2212,2,0)","v":{"$error":"#N/A"}},null,null,"HD COM","H47250","2019-03-02"]
[null,null,1," ",1," ",1," ",null,null,{"$f":"VLOOKUP(J501,FOURNISSEURS!$A$1:$B$2212,2,0)","v":{"$error":"#N/A"}},null,null,"HÉLOÏSE THIBODEAU, ARCHITECTE","H47400","2019-03-03"]
[null,null,1," ",1," ",1," ",null,null,{"$f":"VLOOKUP(J502,FOURNISSEURS!$A$1:$B$2212,2,0)","v":{"$error":"#N/A"}},null,null,"HEROUX ANDRE, DIR. T. PUBLICS","H47925","2019-03-04"]
[null,null,1," ",1," ",1," ",null,null,{"$f":"VLOOKUP(J503,FOURNISSEURS!$A$1:$B$2212,2,0)","v":{"$error":"#N/A"}},null,null,"HÉROUX DANIEL","H47950","2019-03-05"]
[null,null,1," ",1," ",1," ",null,null,{"$f":"VLOOKUP(J504,FOURNISSEURS!$A$1:$B$2212,2,0)","v":{"$error":"#N/A"}},null,null,"HETEK SOLUTIONS INC.","H48000","2019-03-06"]
[null,null,1," ",1," ",1," ",null,null,{"$f":"VLOOKUP(J505,FOURNISSEURS!$A$1:$B$2212,2,0)","v":{"$error":"#N/A"}},null,null,"HEWITT ÉQUIPEMENT LIMITÉE","H48200","2019-03-07"]
[null,null,1," ",1," ",1," ",null,null,{"$f":"VLOOKUP(J506,FOURNISSEURS!$A$1:$B$2212,2,0)","v":{"$error":"#N/A"}},null,null,"HORIZON MULTIRESSOURCE INC.","H48700","2019-03-08"]
[null,null,1," ",1," ",1," ",null,null,{"$f":"VLOOKUP(J507,FOURNISSEURS!$A$1:$B$2212,2,0)","v":{"$error":"#N/A"}},null,null,"HQ DISTRIBUTION INC.","H48900","2019-03-09"]
[null,null,1," ",1," ",1," ",null,null,{"$f":"VLOOKUP(J508,FOURNISSEURS!$A$1:$B$2212,2,0)","v":{"$error":"#N/A"}},null,null,"HYDRAULUC","H49400","2019-03-10"]
[null,null,1," ",1," ",1," ",null,null,{"$f":"VLOOKUP(J509,FOURNISSEURS!$A$1:$B$2212,2,0)","v":{"$error":"#N/A"}},null,null,"HYDRO SEMENCE ÉLITE","H50450","2019-03-11"]
[null,null,1," ",1," ",1," ",null,null,{"$f":"VLOOKUP(J510,FOURNISSEURS!$A$1:$B$2212,2,0)","v":{"$error":"#N/A"}},null,null,"HYDRO-QUEBEC","H49500","2019-03-12"]
[null,null,1," ",1," ",1," ",null,null,{"$f":"VLOOKUP(J511,FOURNISSEURS!$A$1:$B$2212,2,0)","v":{"$error":"#N/A"}},null,null,"ICO TECHNOLOGIES INC.","I50475","2019-03-13"]
[null,null,1," ",1," ",1," ",null,null,{"$f":"VLOOKUP(J512,FOURNISSEURS!$A$1:$B$2212,2,0)","v":{"$error":"#N/A"}},null,null,"IDÉES DE MON JARDIN (LES)","I50500","2019-03-14"]
[null,null,1," ",1," ",1," ",null,null,{"$f":"VLOOKUP(J513,FOURNISSEURS!$A$1:$B$2212,2,0)","v":{"$error":"#N/A"}},null,null,"ILLUMIN'ACTION","I50700","2019-03-15"]
[null,null,1," ",1," ",1," ",null,null,{"$f":"VLOOKUP(J514,FOURNISSEURS!$A$1:$B$2212,2,0)","v":{"$error":"#N/A"}},null,null,"IMA COULEUR","I50850","2019-03-16"]
[null,null,1," ",1," ",1," ",null,null,{"$f":"VLOOKUP(J515,FOURNISSEURS!$A$1:$B$2212,2,0)","v":{"$error":"#N/A"}},null,null,"IMPRIMERIE MAURICE SIMARD INC.","I51000","2019-03-17"]
[null,null,1," ",1," ",1," ",null,null,{"$f":"VLOOKUP(J516,FOURNISSEURS!$A$1:$B$2212,2,0)","v":{"$error":"#N/A"}},null,null,"IMPRIMES ADMINISTRATIFS CONTINUUM LTEE","I51200","2019-03-18"]
[null,null,1," ",1," ",1," ",null,null,{"$f":"VLOOKUP(J517,FOURNISSEURS!$A$1:$B$2212,2,0)","v":{"$error":"#N/A"}},null,null,"INDUSTRIES A. MERGL INC.","I51410","2019-03-19"]
[null,null,1," ",1," ",1," ",null,null,{"$f":"VLOOKUP(J518,FOURNISSEURS!$A$1:$B$2212,2,0)","v":{"$error":"#N/A"}},null,null,"INDUSTRIES DE TRAITEMENT RIMAC INC","I51475","2019-03-20"]
[null,null,1," ",1," ",1," ",null,null,{"$f":"VLOOKUP(J519,FOURNISSEURS!$A$1:$B$2212,2,0)","v":{"$error":"#N/A"}},null,null,"INDUSTRIES FIPEC INC.","I51420","2019-03-21"]
[null,null,1," ",1," ",1," ",null,null,{"$f":"VLOOKUP(J520,FOURNISSEURS!$A$1:$B$2212,2,0)","v":{"$error":"#N/A"}},null,null,"INDUSTRIES NORMROCK INC.","I51500","2019-03-22"]
[null,null,1," ",1," ",1," ",null,null,{"$f":"VLOOKUP(J521,FOURNISSEURS!$A$1:$B$2212,2,0)","v":{"$error":"#N/A"}},null,null,"INDUSTRIES PERMO INC.","I51550","2019-03-23"]
[null,null,1," ",1," ",1," ",null,null,{"$f":"VLOOKUP(J522,FOURNISSEURS!$A$1:$B$2212,2,0)","v":{"$error":"#N/A"}},null,null,"INFORMATIQUES UNISOFT","I51610","2019-03-24"]
[null,null,1," ",1," ",1," ",null,null,{"$f":"VLOOKUP(J523,FOURNISSEURS!$A$1:$B$2212,2,0)","v":{"$error":"#N/A"}},null,null,"INGEMAX INC.","I51625","2019-03-25"]
[null,null,1," ",1," ",1," ",null,null,{"$f":"VLOOKUP(J524,FOURNISSEURS!$A$1:$B$2212,2,0)","v":{"$error":"#N/A"}},null,null,"INNOTEX INC.","I51650","2019-03-26"]
[null,null,1," ",1," ",1," ",null,null,{"$f":"VLOOKUP(J525,FOURNISSEURS!$A$1:$B$2212,2,0)","v":{"$error":"#N/A"}},null,null,"INNOVATION ROUTIÈRE REFCON INC.","I51675","2019-03-27"]
[null,null,1," ",1," ",1," ",null,null,{"$f":"VLOOKUP(J526,FOURNISSEURS!$A$1:$B$2212,2,0)","v":{"$error":"#N/A"}},null,null,"INNOVISION +","I51685","2019-03-28"]
[null,null,1," ",1," ",1," ",null,null,{"$f":"VLOOKUP(J527,FOURNISSEURS!$A$1:$B$2212,2,0)","v":{"$error":"#N/A"}},null,null,"INSIGHT CANADA INC.","I51700","2019-03-29"]
[null,null,1," ",1," ",1," ",null,null,{"$f":"VLOOKUP(J528,FOURNISSEURS!$A$1:$B$2212,2,0)","v":{"$error":"#N/A"}},null,null,"INSPECTEUR CANIN INC.","I51750","2019-03-30"]
[null,null,1," ",1," ",1," ",null,null,{"$f":"VLOOKUP(J529,FOURNISSEURS!$A$1:$B$2212,2,0)","v":{"$error":"#N/A"}},null,null,"INSPECTION MECANIQUE ST-JEROME","I52000","2019-03-31"]
[null,null,1," ",1," ",1," ",null,null,{"$f":"VLOOKUP(J530,FOURNISSEURS!$A$1:$B$2212,2,0)","v":{"$error":"#N/A"}},null,null,"INSPECTIONS D'ECHELLES DENIS THIBAULT","I52050","2019-04-01"]
[null,null,1," ",1," ",1," ",null,null,{"$f":"VLOOKUP(J531,FOURNISSEURS!$A$1:$B$2212,2,0)","v":{"$error":"#N/A"}},null,null,"INTELIA, UNE DIVISION DE CTAQ","I52100","2019-04-02"]
[null,null,1," ",1," ",1," ",null,null,{"$f":"VLOOKUP(J532,FOURNISSEURS!$A$1:$B$2212,2,0)","v":{"$error":"#N/A"}},null,null,"INTER PROPANE","I52300","2019-04-03"]
[null,null,1," ",1," ",1," ",null,null,{"$f":"VLOOKUP(J533,FOURNISSEURS!$A$1:$B$2212,2,0)","v":{"$error":"#N/A"}},null,null,"INTERNATIONAL PROTECTION INCENDIE INC.","I52400","2019-04-04"]
[null,null,1," ",1," ",1," ",null,null,{"$f":"VLOOKUP(J534,FOURNISSEURS!$A$1:$B$2212,2,0)","v":{"$error":"#N/A"}},null,null,"INTERPEUPLE INC.","I52410","2019-04-05"]
[null,null,1," ",1," ",1," ",null,null,{"$f":"VLOOKUP(J535,FOURNISSEURS!$A$1:$B$2212,2,0)","v":{"$error":"#N/A"}},null,null,"INTERSPORT","I52430","2019-04-06"]
[null,null,1," ",1," ",1," ",null,null,{"$f":"VLOOKUP(J536,FOURNISSEURS!$A$1:$B$2212,2,0)","v":{"$error":"#N/A"}},null,null,"ISOLATION ISOBEC INC.","I52445","2019-04-07"]
[null,null,1," ",1," ",1," ",null,null,{"$f":"VLOOKUP(J537,FOURNISSEURS!$A$1:$B$2212,2,0)","v":{"$error":"#N/A"}},null,null,"ISOTECH INSTRUMENTATION INC.","I52450","2019-04-08"]
[null,null,1," ",1," ",1," ",null,null,{"$f":"VLOOKUP(J538,FOURNISSEURS!$A$1:$B$2212,2,0)","v":{"$error":"#N/A"}},null,null,"IWEB TECHNOLOGIES INC.","I52465","2019-04-09"]
[null,null,1," ",1," ",1," ",null,null,{"$f":"VLOOKUP(J539,FOURNISSEURS!$A$1:$B$2212,2,0)","v":{"$error":"#N/A"}},null,null,"J.B.DESCHAMPS INC.","J52475","2019-04-10"]
[null,null,1," ",1," ",1," ",null,null,{"$f":"VLOOKUP(J540,FOURNISSEURS!$A$1:$B$2212,2,0)","v":{"$error":"#N/A"}},null,null,"J.C. LAPALME INC.","J52480","2019-04-11"]
[null,null,1," ",1," ",1," ",null,null,{"$f":"VLOOKUP(J541,FOURNISSEURS!$A$1:$B$2212,2,0)","v":{"$error":"#N/A"}},null,null,"J.C. PERREAULT, DIVISION ÉCONO","J52485","2019-04-12"]
[null,null,1," ",1," ",1," ",null,null,{"$f":"VLOOKUP(J542,FOURNISSEURS!$A$1:$B$2212,2,0)","v":{"$error":"#N/A"}},null,null,"J.N.A. LEBLANC ÉLECTRIQUE INC.","J52490","2019-04-13"]
[null,null,1," ",1," ",1," ",null,null,{"$f":"VLOOKUP(J543,FOURNISSEURS!$A$1:$B$2212,2,0)","v":{"$error":"#N/A"}},null,null,"J.-RENÉ LAFOND INC.","J52493","2019-04-14"]
[null,null,1," ",1," ",1," ",null,null,{"$f":"VLOOKUP(J544,FOURNISSEURS!$A$1:$B$2212,2,0)","v":{"$error":"#N/A"}},null,null,"J.S. BOISVERT INC.","J52495","2019-04-15"]
[null,null,1," ",1," ",1," ",null,null,{"$f":"VLOOKUP(J545,FOURNISSEURS!$A$1:$B$2212,2,0)","v":{"$error":"#N/A"}},null,null,"JADICE ÉBÉNISTERIE","J52500","2019-04-16"]
[null,null,1," ",1," ",1," ",null,null,{"$f":"VLOOKUP(J546,FOURNISSEURS!$A$1:$B$2212,2,0)","v":{"$error":"#N/A"}},null,null,"JARDINERIE DU CARREFOUR (LA)","J52525","2019-04-17"]
[null,null,1," ",1," ",1," ",null,null,{"$f":"VLOOKUP(J547,FOURNISSEURS!$A$1:$B$2212,2,0)","v":{"$error":"#N/A"}},null,null,"JASON FUOCO ENR.","J52575","2019-04-18"]
[null,null,1," ",1," ",1," ",null,null,{"$f":"VLOOKUP(J548,FOURNISSEURS!$A$1:$B$2212,2,0)","v":{"$error":"#N/A"}},null,null,"JDM GEO INC.","J52600","2019-04-19"]
[null,null,1,{"$f":"CHOOSE(C549,\" \",$D$4,$D$5,$D$6,$D$7,$D$8,$D$9,$D$10,$D$11,$D$12)","v":" "},1,{"$f":"CHOOSE(E549,\" \",$F$4,$F$5,$F$6,$F$7,$F$8,$F$9,$F$10,$F$11,$F$4,$F$5,$F$6,$F$7,$F$8)","v":" "},1,{"$f":"CHOOSE(G549,\" \",$H$4,$H$5,$H$6,$H$7,$H$8,$H$9,$H$10,$H$11,$J$4,$J$5,$J$6,$J$7,$J$8,$J$9,$J$10,\" \")","v":" "},null,null,{"$f":"VLOOKUP(J549,FOURNISSEURS!$A$1:$B$2212,2,0)","v":{"$error":"#N/A"}},null,null,"JEAN LOUE TOUT","J52650","2019-04-20"]
[null,null,1," ",1," ",1," ",null,null,{"$f":"VLOOKUP(J550,FOURNISSEURS!$A$1:$B$2212,2,0)","v":{"$error":"#N/A"}},null,null,"JEAN VILLENEUVE SABLIERE","J52800","2019-04-21"]
[null,null,1," ",1," ",1," ",null,null,{"$f":"VLOOKUP(J551,FOURNISSEURS!$A$1:$B$2212,2,0)","v":{"$error":"#N/A"}},null,null,"JEAN-PIERRE MARTIN INC.","J52750","2019-04-22"]
[null,null,1," ",1," ",1," ",null,null,{"$f":"VLOOKUP(J552,FOURNISSEURS!$A$1:$B$2212,2,0)","v":{"$error":"#N/A"}},null,null,"JETTÉ SYLVAIN, CORNEMUSEUR","J52825","2019-04-23"]
[null,null,1," ",1," ",1," ",null,null,{"$f":"VLOOKUP(J553,FOURNISSEURS!$A$1:$B$2212,2,0)","v":{"$error":"#N/A"}},null,null,"JOHN MEUNIER INC.","J52850","2019-04-24"]
[null,null,1," ",1," ",1," ",null,null,{"$f":"VLOOKUP(J554,FOURNISSEURS!$A$1:$B$2212,2,0)","v":{"$error":"#N/A"}},null,null,"JOLI-COEUR  LACASSE S.E.N.C.R.L.","J52900","2019-04-25"]
[null,null,1," ",1," ",1," ",null,null,{"$f":"VLOOKUP(J555,FOURNISSEURS!$A$1:$B$2212,2,0)","v":{"$error":"#N/A"}},null,null,"JOLIETTE DODGE CHRYSLER LTÉE","J52950","2019-04-26"]
[null,null,1," ",1," ",1," ",null,null,{"$f":"VLOOKUP(J556,FOURNISSEURS!$A$1:$B$2212,2,0)","v":{"$error":"#N/A"}},null,null,"JORDAL INC.","J53100","2019-04-27"]
[null,null,1," ",1," ",1," ",null,null,{"$f":"VLOOKUP(J557,FOURNISSEURS!$A$1:$B$2212,2,0)","v":{"$error":"#N/A"}},null,null,"JUTEAU RUEL INC","J53330",{"$f":"P556+1","v":"2019-04-28"}]
[null,null,1," ",1," ",1," ",null,null,{"$f":"VLOOKUP(J558,FOURNISSEURS!$A$1:$B$2212,2,0)","v":{"$error":"#N/A"}},null,null,"JUTEAU RUEL INC.","J53340","2019-04-29"]
[null,null,1," ",1," ",1," ",null,null,{"$f":"VLOOKUP(J559,FOURNISSEURS!$A$1:$B$2212,2,0)","v":{"$error":"#N/A"}},null,null,"KALITEC","K53360","2019-04-30"]
[null,null,1," ",1," ",1," ",null,null,{"$f":"VLOOKUP(J560,FOURNISSEURS!$A$1:$B$2212,2,0)","v":{"$error":"#N/A"}},null,null,"KEMIRA WATER SOLUTION CANADA INC.","K53400","2019-05-01"]
[null,null,1," ",1," ",1," ",null,null,{"$f":"VLOOKUP(J561,FOURNISSEURS!$A$1:$B$2212,2,0)","v":{"$error":"#N/A"}},null,null,"KENWORTH ST-JÉRÔME","K53425","2019-05-02"]
[null,null,1," ",1," ",1," ",null,null,{"$f":"VLOOKUP(J562,FOURNISSEURS!$A$1:$B$2212,2,0)","v":{"$error":"#N/A"}},null,null,"KIWIGRAPHIK","K53450","2019-05-03"]
[null,null,1," ",1," ",1," ",null,null,{"$f":"VLOOKUP(J563,FOURNISSEURS!$A$1:$B$2212,2,0)","v":{"$error":"#N/A"}},null,null,"KUN-NIPIU FALARDEAU ISABELLE","K53475","2019-05-04"]
[null,null,1," ",1," ",1," ",null,null,{"$f":"VLOOKUP(J564,FOURNISSEURS!$A$1:$B$2212,2,0)","v":{"$error":"#N/A"}},null,null,"L.R. BRIEN ET FILS LTEE","L53550","2019-05-05"]
[null,null,1," ",1," ",1," ",null,null,{"$f":"VLOOKUP(J565,FOURNISSEURS!$A$1:$B$2212,2,0)","v":{"$error":"#N/A"}},null,null,"LA FABRIQUE INC.","L53700","2019-05-06"]
[null,null,1," ",1," ",1," ",null,null,{"$f":"VLOOKUP(J566,FOURNISSEURS!$A$1:$B$2212,2,0)","v":{"$error":"#N/A"}},null,null,"LABORATOIRE CAR-MO 2002 INC.","L53960","2019-05-07"]
[null,null,1," ",1," ",1," ",null,null,{"$f":"VLOOKUP(J567,FOURNISSEURS!$A$1:$B$2212,2,0)","v":{"$error":"#N/A"}},null,null,"LABORATOIRE CONSTRUCTION 2000 INC.","L53975","2019-05-08"]
[null,null,1," ",1," ",1," ",null,null,{"$f":"VLOOKUP(J568,FOURNISSEURS!$A$1:$B$2212,2,0)","v":{"$error":"#N/A"}},null,null,"LACASSE FRANÇOIS","L54025","2019-05-09"]
[null,null,1," ",1," ",1," ",null,null,{"$f":"VLOOKUP(J569,FOURNISSEURS!$A$1:$B$2212,2,0)","v":{"$error":"#N/A"}},null,null,"L'ACTUALITE","L53500","2019-05-10"]
[null,null,1," ",1," ",1," ",null,null,{"$f":"VLOOKUP(J570,FOURNISSEURS!$A$1:$B$2212,2,0)","v":{"$error":"#N/A"}},null,null,"LAFORTUNE TRAITEUR","L54100","2019-05-11"]
[null,null,1," ",1," ",1," ",null,null,{"$f":"VLOOKUP(J571,FOURNISSEURS!$A$1:$B$2212,2,0)","v":{"$error":"#N/A"}},null,null,"LAJEUNESSE ET FILS","L54350","2019-05-12"]
[null,null,1," ",1," ",1," ",null,null,{"$f":"VLOOKUP(J572,FOURNISSEURS!$A$1:$B$2212,2,0)","v":{"$error":"#N/A"}},null,null,"LANAUCO LTEE","L54800","2019-05-13"]
[null,null,1," ",1," ",1," ",null,null,{"$f":"VLOOKUP(J573,FOURNISSEURS!$A$1:$B$2212,2,0)","v":{"$error":"#N/A"}},null,null,"LANTHIER SYLVIE","L54870","2019-05-14"]
[null,null,1," ",1," ",1," ",null,null,{"$f":"VLOOKUP(J574,FOURNISSEURS!$A$1:$B$2212,2,0)","v":{"$error":"#N/A"}},null,null,"LAPIERRE & FRERE ENR.","L54950","2019-05-15"]
[null,null,1," ",1," ",1," ",null,null,{"$f":"VLOOKUP(J575,FOURNISSEURS!$A$1:$B$2212,2,0)","v":{"$error":"#N/A"}},null,null,"LAPOINTE SPORTS","L54975","2019-05-16"]
[null,null,1," ",1," ",1," ",null,null,{"$f":"VLOOKUP(J576,FOURNISSEURS!$A$1:$B$2212,2,0)","v":{"$error":"#N/A"}},null,null,"L'ARCHEVÊQUE & RIVEST LTÉE","L53525","2019-05-17"]
[null,null,1," ",1," ",1," ",null,null,{"$f":"VLOOKUP(J577,FOURNISSEURS!$A$1:$B$2212,2,0)","v":{"$error":"#N/A"}},null,null,"LAROCHE ARCHITECTE","L55100","2019-05-18"]
[null,null,1," ",1," ",1," ",null,null,{"$f":"VLOOKUP(J578,FOURNISSEURS!$A$1:$B$2212,2,0)","v":{"$error":"#N/A"}},null,null,"LATENDRESSE ASPHALTE INC.","L55350","2019-05-19"]
[null,null,1," ",1," ",1," ",null,null,{"$f":"VLOOKUP(J579,FOURNISSEURS!$A$1:$B$2212,2,0)","v":{"$error":"#N/A"}},null,null,"LAURENTIDES EXPERTS CONSEILS","L55450","2019-05-20"]
[null,null,1," ",1," ",1," ",null,null,{"$f":"VLOOKUP(J580,FOURNISSEURS!$A$1:$B$2212,2,0)","v":{"$error":"#N/A"}},null,null,"LAURENTIDES FORD INC (DES)","L55500","2019-05-21"]
[null,null,1," ",1," ",1," ",null,null,{"$f":"VLOOKUP(J581,FOURNISSEURS!$A$1:$B$2212,2,0)","v":{"$error":"#N/A"}},null,null,"LAURENTIDES LOCATION ENR.","L55575","2019-05-22"]
[null,null,1," ",1," ",1," ",null,null,{"$f":"VLOOKUP(J582,FOURNISSEURS!$A$1:$B$2212,2,0)","v":{"$error":"#N/A"}},null,null,"LAURIN LAURIN INC.","L55650","2019-05-23"]
[null,null,1," ",1," ",1," ",null,null,{"$f":"VLOOKUP(J583,FOURNISSEURS!$A$1:$B$2212,2,0)","v":{"$error":"#N/A"}},null,null,"LAVAGE CONCEPT","L55750","2019-05-24"]
[null,null,1," ",1," ",1," ",null,null,{"$f":"VLOOKUP(J584,FOURNISSEURS!$A$1:$B$2212,2,0)","v":{"$error":"#N/A"}},null,null,"LAVAGE MOBILE MULTI TACHES","L55775","2019-05-25"]
[null,null,1," ",1," ",1," ",null,null,{"$f":"VLOOKUP(J585,FOURNISSEURS!$A$1:$B$2212,2,0)","v":{"$error":"#N/A"}},null,null,"LAVALLEE COLETTE","L55800","2019-05-26"]
[null,null,1," ",1," ",1," ",null,null,{"$f":"VLOOKUP(J586,FOURNISSEURS!$A$1:$B$2212,2,0)","v":{"$error":"#N/A"}},null,null,"LC MEDIA INC.","L56000","2019-05-27"]
[null,null,1," ",1," ",1," ",null,null,{"$f":"VLOOKUP(J587,FOURNISSEURS!$A$1:$B$2212,2,0)","v":{"$error":"#N/A"}},null,null,"LCM  ÉLECTRIQUE INC.","L56010","2019-05-28"]
[null,null,1," ",1," ",1," ",null,null,{"$f":"VLOOKUP(J588,FOURNISSEURS!$A$1:$B$2212,2,0)","v":{"$error":"#N/A"}},null,null,"LE 1740 TAPIS PRÉLARTS INC.","L56020","2019-05-29"]
[null,null,1," ",1," ",1," ",null,null,{"$f":"VLOOKUP(J589,FOURNISSEURS!$A$1:$B$2212,2,0)","v":{"$error":"#N/A"}},null,null,"LE CORRE & ASSOCIES","L56025","2019-05-30"]
[null,null,1," ",1," ",1," ",null,null,{"$f":"VLOOKUP(J590,FOURNISSEURS!$A$1:$B$2212,2,0)","v":{"$error":"#N/A"}},null,null,"LE LANAUDOIS INC.","L56050","2019-05-31"]
[null,null,1," ",1," ",1," ",null,null,{"$f":"VLOOKUP(J591,FOURNISSEURS!$A$1:$B$2212,2,0)","v":{"$error":"#N/A"}},null,null,"LE LUNDI","L56075","2019-06-01"]
[null,null,1," ",1," ",1," ",null,null,{"$f":"VLOOKUP(J592,FOURNISSEURS!$A$1:$B$2212,2,0)","v":{"$error":"#N/A"}},null,null,"LEBLANC ILLUMINATIONS-CANADA","L56200","2019-06-02"]
[null,null,1," ",1," ",1," ",null,null,{"$f":"VLOOKUP(J593,FOURNISSEURS!$A$1:$B$2212,2,0)","v":{"$error":"#N/A"}},null,null,"LEGER ERIC, AGRONOME","L56350","2019-06-03"]
[null,null,1," ",1," ",1," ",null,null,{"$f":"VLOOKUP(J594,FOURNISSEURS!$A$1:$B$2212,2,0)","v":{"$error":"#N/A"}},null,null,"LEPAGE PRUD'HOMME SHADE","L56500","2019-06-04"]
[null,null,1," ",1," ",1," ",null,null,{"$f":"VLOOKUP(J595,FOURNISSEURS!$A$1:$B$2212,2,0)","v":{"$error":"#N/A"}},null,null,"LEROUX BEAUDOIN HURENS & ASSOCIÉS","L56650","2019-06-05"]
[null,null,1," ",1," ",1," ",null,null,{"$f":"VLOOKUP(J596,FOURNISSEURS!$A$1:$B$2212,2,0)","v":{"$error":"#N/A"}},null,null,"LETTRAGE ST-LIN","L56925","2019-06-06"]
[null,null,1," ",1," ",1," ",null,null,{"$f":"VLOOKUP(J597,FOURNISSEURS!$A$1:$B$2212,2,0)","v":{"$error":"#N/A"}},null,null,"LEVASSEUR LOUISE","L57200","2019-06-07"]
[null,null,1," ",1," ",1," ",null,null,{"$f":"VLOOKUP(J598,FOURNISSEURS!$A$1:$B$2212,2,0)","v":{"$error":"#N/A"}},null,null,"LEVERT PASCAL, ENTREPRENEUR","L57300","2019-06-08"]
[null,null,1," ",1," ",1," ",null,null,{"$f":"VLOOKUP(J599,FOURNISSEURS!$A$1:$B$2212,2,0)","v":{"$error":"#N/A"}},null,null,"LÉVESQUE & ASSOCIÉS S.E.N.C.R.L.","L57350","2019-06-09"]
[null,null,1," ",1," ",1," ",null,null,{"$f":"VLOOKUP(J600,FOURNISSEURS!$A$1:$B$2212,2,0)","v":{"$error":"#N/A"}},null,null,"LEXIS MÉDIA INC.","L57425","2019-06-10"]
[null,null,1," ",1," ",1," ",null,null,{"$f":"VLOOKUP(J601,FOURNISSEURS!$A$1:$B$2212,2,0)","v":{"$error":"#N/A"}},null,null,"LIBRAIRIE LULU INC.","L58050","2019-06-11"]
[null,null,1," ",1," ",1," ",null,null,{"$f":"VLOOKUP(J602,FOURNISSEURS!$A$1:$B$2212,2,0)","v":{"$error":"#N/A"}},null,null,"LIBRAIRIE MARTIN INC.","L58100","2019-06-12"]
[null,null,1," ",1," ",1," ",null,null,{"$f":"VLOOKUP(J603,FOURNISSEURS!$A$1:$B$2212,2,0)","v":{"$error":"#N/A"}},null,null,"LIBRAIRIE RAFFIN INC.","L58200","2019-06-13"]
[null,null,1," ",1," ",1," ",null,null,{"$f":"VLOOKUP(J604,FOURNISSEURS!$A$1:$B$2212,2,0)","v":{"$error":"#N/A"}},null,null,"LIBRAIRIE RENAUD-BRAY","L58250","2019-06-14"]
[null,null,1," ",1," ",1," ",null,null,{"$f":"VLOOKUP(J605,FOURNISSEURS!$A$1:$B$2212,2,0)","v":{"$error":"#N/A"}},null,null,"LIGNBEC, DIV. ENTREPRISE T.R.A. 2011 INC","L58400","2019-06-15"]
[null,null,1," ",1," ",1," ",null,null,{"$f":"VLOOKUP(J606,FOURNISSEURS!$A$1:$B$2212,2,0)","v":{"$error":"#N/A"}},null,null,"LIGNCO SIGMA INC.","L58425","2019-06-16"]
[null,null,1," ",1," ",1," ",null,null,{"$f":"VLOOKUP(J607,FOURNISSEURS!$A$1:$B$2212,2,0)","v":{"$error":"#N/A"}},null,null,"LIGNES MASKA","L58435","2019-06-17"]
[null,null,1," ",1," ",1," ",null,null,{"$f":"VLOOKUP(J608,FOURNISSEURS!$A$1:$B$2212,2,0)","v":{"$error":"#N/A"}},null,null,"LIGNES PLUS M.L.","L58450","2019-06-18"]
[null,null,1," ",1," ",1," ",null,null,{"$f":"VLOOKUP(J609,FOURNISSEURS!$A$1:$B$2212,2,0)","v":{"$error":"#N/A"}},null,null,"LIMOGES REAL, TRAPPEUR","L58600","2019-06-19"]
[null,null,1," ",1," ",1," ",null,null,{"$f":"VLOOKUP(J610,FOURNISSEURS!$A$1:$B$2212,2,0)","v":{"$error":"#N/A"}},null,null,"LITHO LAURENTIDES 2001 INC.","L58850","2019-06-20"]
[null,null,1," ",1," ",1," ",null,null,{"$f":"VLOOKUP(J611,FOURNISSEURS!$A$1:$B$2212,2,0)","v":{"$error":"#N/A"}},null,null,"LITHOGRAPHIE ANDRÉ LACHANCE INC.","L58800","2019-06-21"]
[null,null,1," ",1," ",1," ",null,null,{"$f":"VLOOKUP(J612,FOURNISSEURS!$A$1:$B$2212,2,0)","v":{"$error":"#N/A"}},null,null,"LOCATION A ET C INC. (LOU-TEC)","L58950","2019-06-22"]
[null,null,1,{"$f":"CHOOSE(C613,\" \",$D$4,$D$5,$D$6,$D$7,$D$8,$D$9,$D$10,$D$11,$D$12)","v":" "},1,{"$f":"CHOOSE(E613,\" \",$F$4,$F$5,$F$6,$F$7,$F$8,$F$9,$F$10,$F$11,$F$4,$F$5,$F$6,$F$7,$F$8)","v":" "},1,{"$f":"CHOOSE(G613,\" \",$H$4,$H$5,$H$6,$H$7,$H$8,$H$9,$H$10,$H$11,$J$4,$J$5,$J$6,$J$7,$J$8,$J$9,$J$10,\" \")","v":" "},null,null,{"$f":"VLOOKUP(J613,FOURNISSEURS!$A$1:$B$2212,2,0)","v":{"$error":"#N/A"}},null,null,"LOCATION D'OUTILS '2000' ENR.","L59175","2019-06-23"]
[null,null,1," ",1," ",1," ",null,null,{"$f":"VLOOKUP(J614,FOURNISSEURS!$A$1:$B$2212,2,0)","v":{"$error":"#N/A"}},null,null,"LOCATION D'OUTILS SIMPLEX","L59180","2019-06-24"]
[null,null,1," ",1," ",1," ",null,null,{"$f":"VLOOKUP(J615,FOURNISSEURS!$A$1:$B$2212,2,0)","v":{"$error":"#N/A"}},null,null,"LOCATION ÉCLAT ROC","L59200","2019-06-25"]
[null,null,1," ",1," ",1," ",null,null,{"$f":"VLOOKUP(J616,FOURNISSEURS!$A$1:$B$2212,2,0)","v":{"$error":"#N/A"}},null,null,"LOCATION HEWITT INC.","L59250","2019-06-26"]
[null,null,1," ",1," ",1," ",null,null,{"$f":"VLOOKUP(J617,FOURNISSEURS!$A$1:$B$2212,2,0)","v":{"$error":"#N/A"}},null,null,"LOCATION PIERRE JETTE INC.","L59300","2019-06-27"]
[null,null,1," ",1," ",1," ",null,null,{"$f":"VLOOKUP(J618,FOURNISSEURS!$A$1:$B$2212,2,0)","v":{"$error":"#N/A"}},null,null,"LOCATION SAVA EN FÊTE","L59310","2019-06-28"]
[null,null,1," ",1," ",1," ",null,null,{"$f":"VLOOKUP(J619,FOURNISSEURS!$A$1:$B$2212,2,0)","v":{"$error":"#N/A"}},null,null,"LOGICIELS SPORT-PLUS INC.","L59500","2019-06-29"]
[null,null,1," ",1," ",1," ",null,null,{"$f":"VLOOKUP(J620,FOURNISSEURS!$A$1:$B$2212,2,0)","v":{"$error":"#N/A"}},null,null,"LOISIR ET SPORT LANAUDIERE","L59700","2019-06-30"]
[null,null,1," ",1," ",1," ",null,null,{"$f":"VLOOKUP(J621,FOURNISSEURS!$A$1:$B$2212,2,0)","v":{"$error":"#N/A"}},null,null,"LORTIE PIERRE","L59875",{"$f":"P620+1","v":"2019-07-01"}]
[null,null,1," ",1," ",1," ",null,null,{"$f":"VLOOKUP(J622,FOURNISSEURS!$A$1:$B$2212,2,0)","v":{"$error":"#N/A"}},null,null,"LOULOU","L59925","2019-07-02"]
[null,null,1," ",1," ",1," ",null,null,{"$f":"VLOOKUP(J623,FOURNISSEURS!$A$1:$B$2212,2,0)","v":{"$error":"#N/A"}},null,null,"LOUTIL DE LA PUB INC.","L60000","2019-07-03"]
[null,null,1," ",1," ",1," ",null,null,{"$f":"VLOOKUP(J624,FOURNISSEURS!$A$1:$B$2212,2,0)","v":{"$error":"#N/A"}},null,null,"LUMEN","L60010","2019-07-04"]
[null,null,1," ",1," ",1," ",null,null,{"$f":"VLOOKUP(J625,FOURNISSEURS!$A$1:$B$2212,2,0)","v":{"$error":"#N/A"}},null,null,"M.& W. THERRIEN INC.","M60025","2019-07-05"]
[null,null,1," ",1," ",1," ",null,null,{"$f":"VLOOKUP(J626,FOURNISSEURS!$A$1:$B$2212,2,0)","v":{"$error":"#N/A"}},null,null,"M.R.C. MONTCALM","M60300","2019-07-06"]
[null,null,1," ",1," ",1," ",null,null,{"$f":"VLOOKUP(J627,FOURNISSEURS!$A$1:$B$2212,2,0)","v":{"$error":"#N/A"}},null,null,"M.R.P.B.M.","M60560","2019-07-07"]
[null,null,1," ",1," ",1," ",null,null,{"$f":"VLOOKUP(J628,FOURNISSEURS!$A$1:$B$2212,2,0)","v":{"$error":"#N/A"}},null,null,"M.S.D.A.","M60575","2019-07-08"]
[null,null,1," ",1," ",1," ",null,null,{"$f":"VLOOKUP(J629,FOURNISSEURS!$A$1:$B$2212,2,0)","v":{"$error":"#N/A"}},null,null,"MABAREX INC.","M60590","2019-07-09"]
[null,null,1," ",1," ",1," ",null,null,{"$f":"VLOOKUP(J630,FOURNISSEURS!$A$1:$B$2212,2,0)","v":{"$error":"#N/A"}},null,null,"MACHINERIES NORDTRAC LTÉE","M60600","2019-07-10"]
[null,null,1," ",1," ",1," ",null,null,{"$f":"VLOOKUP(J631,FOURNISSEURS!$A$1:$B$2212,2,0)","v":{"$error":"#N/A"}},null,null,"MACHINERIES SAINT-JOVITE INC. (LES)","M60610","2019-07-11"]
[null,null,1," ",1," ",1," ",null,null,{"$f":"VLOOKUP(J632,FOURNISSEURS!$A$1:$B$2212,2,0)","v":{"$error":"#N/A"}},null,null,"MAÇONNERIE R.P.C.P. INC.","M60645","2019-07-12"]
[null,null,1," ",1," ",1," ",null,null,{"$f":"VLOOKUP(J633,FOURNISSEURS!$A$1:$B$2212,2,0)","v":{"$error":"#N/A"}},null,null,"MACONNERIE Y. BOUCHARD INC.","M60650","2019-07-13"]
[null,null,1," ",1," ",1," ",null,null,{"$f":"VLOOKUP(J634,FOURNISSEURS!$A$1:$B$2212,2,0)","v":{"$error":"#N/A"}},null,null,"MAGAZINE ANIMAL","M60670","2019-07-14"]
[null,null,1," ",1," ",1," ",null,null,{"$f":"VLOOKUP(J635,FOURNISSEURS!$A$1:$B$2212,2,0)","v":{"$error":"#N/A"}},null,null,"MAGAZINE DELIRE","M60700","2019-07-15"]
[null,null,1," ",1," ",1," ",null,null,{"$f":"VLOOKUP(J636,FOURNISSEURS!$A$1:$B$2212,2,0)","v":{"$error":"#N/A"}},null,null,"MAGAZINE FULL FILLE (AMYLITHO INC.)","M60730","2019-07-16"]
[null,null,1," ",1," ",1," ",null,null,{"$f":"VLOOKUP(J637,FOURNISSEURS!$A$1:$B$2212,2,0)","v":{"$error":"#N/A"}},null,null,"MAGAZINE PARENTS ADOS","M60800","2019-07-17"]
[null,null,1," ",1," ",1," ",null,null,{"$f":"VLOOKUP(J638,FOURNISSEURS!$A$1:$B$2212,2,0)","v":{"$error":"#N/A"}},null,null,"MAGAZINE VITA","M61000","2019-07-18"]
[null,null,1," ",1," ",1," ",null,null,{"$f":"VLOOKUP(J639,FOURNISSEURS!$A$1:$B$2212,2,0)","v":{"$error":"#N/A"}},null,null,"MAGAZINE VIVRE","M61010","2019-07-19"]
[null,null,1," ",1," ",1," ",null,null,{"$f":"VLOOKUP(J640,FOURNISSEURS!$A$1:$B$2212,2,0)","v":{"$error":"#N/A"}},null,null,"MAGIC LIGHT","M61060","2019-07-20"]
[null,null,1," ",1," ",1," ",null,null,{"$f":"VLOOKUP(J641,FOURNISSEURS!$A$1:$B$2212,2,0)","v":{"$error":"#N/A"}},null,null,"MAGIE DES FEUX DU CIEL (LA)","M61100","2019-07-21"]
[null,null,1," ",1," ",1," ",null,null,{"$f":"VLOOKUP(J642,FOURNISSEURS!$A$1:$B$2212,2,0)","v":{"$error":"#N/A"}},null,null,"MAGIN 3798267 CANADA INC.","M61150","2019-07-22"]
[null,null,1," ",1," ",1," ",null,null,{"$f":"VLOOKUP(J643,FOURNISSEURS!$A$1:$B$2212,2,0)","v":{"$error":"#N/A"}},null,null,"MAISON & DEMEURE","M61210","2019-07-23"]
[null,null,1," ",1," ",1," ",null,null,{"$f":"VLOOKUP(J644,FOURNISSEURS!$A$1:$B$2212,2,0)","v":{"$error":"#N/A"}},null,null,"MAISON DES JEUNES ST-LIN/ LAURENTIDES","M61200","2019-07-24"]
[null,null,1," ",1," ",1," ",null,null,{"$f":"VLOOKUP(J645,FOURNISSEURS!$A$1:$B$2212,2,0)","v":{"$error":"#N/A"}},null,null,"MAISONNEUVE MATHIEU","M61225","2019-07-25"]
[null,null,1," ",1," ",1," ",null,null,{"$f":"VLOOKUP(J646,FOURNISSEURS!$A$1:$B$2212,2,0)","v":{"$error":"#N/A"}},null,null,"MAK CONCEPT","M61400","2019-07-26"]
[null,null,1," ",1," ",1," ",null,null,{"$f":"VLOOKUP(J647,FOURNISSEURS!$A$1:$B$2212,2,0)","v":{"$error":"#N/A"}},null,null,"MALLETTE GHISLAIN","M61600","2019-07-27"]
[null,null,1," ",1," ",1," ",null,null,{"$f":"VLOOKUP(J648,FOURNISSEURS!$A$1:$B$2212,2,0)","v":{"$error":"#N/A"}},null,null,"MALOUIN ANDRE","M61650","2019-07-28"]
[null,null,1," ",1," ",1," ",null,null,{"$f":"VLOOKUP(J649,FOURNISSEURS!$A$1:$B$2212,2,0)","v":{"$error":"#N/A"}},null,null,"MANOREX","M61700","2019-07-29"]
[null,null,1," ",1," ",1," ",null,null,{"$f":"VLOOKUP(J650,FOURNISSEURS!$A$1:$B$2212,2,0)","v":{"$error":"#N/A"}},null,null,"MANTHA EMMANUEL, EMONDEUR","M61750","2019-07-30"]
[null,null,1," ",1," ",1," ",null,null,{"$f":"VLOOKUP(J651,FOURNISSEURS!$A$1:$B$2212,2,0)","v":{"$error":"#N/A"}},null,null,"MAPART CORPORATION","M61800","2019-07-31"]
[null,null,1," ",1," ",1," ",null,null,{"$f":"VLOOKUP(J652,FOURNISSEURS!$A$1:$B$2212,2,0)","v":{"$error":"#N/A"}},null,null,"MARAÎCHERS DU RUISSEAU INC.","M61825","2019-08-01"]
[null,null,1," ",1," ",1," ",null,null,{"$f":"VLOOKUP(J653,FOURNISSEURS!$A$1:$B$2212,2,0)","v":{"$error":"#N/A"}},null,null,"MARAÎCHERS MG INC. (LES)","M61850","2019-08-02"]
[null,null,1," ",1," ",1," ",null,null,{"$f":"VLOOKUP(J654,FOURNISSEURS!$A$1:$B$2212,2,0)","v":{"$error":"#N/A"}},null,null,"MARCEAU SOUCY BOUDREAU, AVOCATS","M61860","2019-08-03"]
[null,null,1," ",1," ",1," ",null,null,{"$f":"VLOOKUP(J655,FOURNISSEURS!$A$1:$B$2212,2,0)","v":{"$error":"#N/A"}},null,null,"MARIO CHRETIEN, DISTRICT #3","M62300","2019-08-04"]
[null,null,1," ",1," ",1," ",null,null,{"$f":"VLOOKUP(J656,FOURNISSEURS!$A$1:$B$2212,2,0)","v":{"$error":"#N/A"}},null,null,"MARQUAGE & TRAÇAGE DU QUÉBEC","M62420","2019-08-05"]
[null,null,1," ",1," ",1," ",null,null,{"$f":"VLOOKUP(J657,FOURNISSEURS!$A$1:$B$2212,2,0)","v":{"$error":"#N/A"}},null,null,"MARSOLAIS ROBERT","M62425","2019-08-06"]
[null,null,1," ",1," ",1," ",null,null,{"$f":"VLOOKUP(J658,FOURNISSEURS!$A$1:$B$2212,2,0)","v":{"$error":"#N/A"}},null,null,"MARSOLAIS ROSIANE","M62430","2019-08-07"]
[null,null,1," ",1," ",1," ",null,null,{"$f":"VLOOKUP(J659,FOURNISSEURS!$A$1:$B$2212,2,0)","v":{"$error":"#N/A"}},null,null,"MARTECH INC.","M62450","2019-08-08"]
[null,null,1," ",1," ",1," ",null,null,{"$f":"VLOOKUP(J660,FOURNISSEURS!$A$1:$B$2212,2,0)","v":{"$error":"#N/A"}},null,null,"MARTEL ALAIN","M62500","2019-08-09"]
[null,null,1," ",1," ",1," ",null,null,{"$f":"VLOOKUP(J661,FOURNISSEURS!$A$1:$B$2212,2,0)","v":{"$error":"#N/A"}},null,null,"MARTEL MARCEL","M62525","2019-08-10"]
[null,null,1," ",1," ",1," ",null,null,{"$f":"VLOOKUP(J662,FOURNISSEURS!$A$1:$B$2212,2,0)","v":{"$error":"#N/A"}},null,null,"MARTEL SYLVAIN","M62550","2019-08-11"]
[null,null,1," ",1," ",1," ",null,null,{"$f":"VLOOKUP(J663,FOURNISSEURS!$A$1:$B$2212,2,0)","v":{"$error":"#N/A"}},null,null,"MARTIN CÉRAT EXCAVATION","M62800","2019-08-12"]
[null,null,1," ",1," ",1," ",null,null,{"$f":"VLOOKUP(J664,FOURNISSEURS!$A$1:$B$2212,2,0)","v":{"$error":"#N/A"}},null,null,"MARTIN DOMINIC","M63000","2019-08-13"]
[null,null,1," ",1," ",1," ",null,null,{"$f":"VLOOKUP(J665,FOURNISSEURS!$A$1:$B$2212,2,0)","v":{"$error":"#N/A"}},null,null,"MARTIN GRANGER, INSTRUCTEUR","M63050","2019-08-14"]
[null,null,1," ",1," ",1," ",null,null,{"$f":"VLOOKUP(J666,FOURNISSEURS!$A$1:$B$2212,2,0)","v":{"$error":"#N/A"}},null,null,"MASKIMO CONSTRUCTION INC.","M63140","2019-08-15"]
[null,null,1," ",1," ",1," ",null,null,{"$f":"VLOOKUP(J667,FOURNISSEURS!$A$1:$B$2212,2,0)","v":{"$error":"#N/A"}},null,null,"MASSE PATRICK, MAIRE","M63100","2019-08-16"]
[null,null,1," ",1," ",1," ",null,null,{"$f":"VLOOKUP(J668,FOURNISSEURS!$A$1:$B$2212,2,0)","v":{"$error":"#N/A"}},null,null,"MASSICOTTE MALONEY,  ARTICTECTES","M63150","2019-08-17"]
[null,null,1," ",1," ",1," ",null,null,{"$f":"VLOOKUP(J669,FOURNISSEURS!$A$1:$B$2212,2,0)","v":{"$error":"#N/A"}},null,null,"MAURICE GABRIEL","M63160","2019-08-18"]
[null,null,1," ",1," ",1," ",null,null,{"$f":"VLOOKUP(J670,FOURNISSEURS!$A$1:$B$2212,2,0)","v":{"$error":"#N/A"}},null,null,"MAXI BAC","M63180","2019-08-19"]
[null,null,1," ",1," ",1," ",null,null,{"$f":"VLOOKUP(J671,FOURNISSEURS!$A$1:$B$2212,2,0)","v":{"$error":"#N/A"}},null,null,"MC VENTILATION","M63200","2019-08-20"]
[null,null,1," ",1," ",1," ",null,null,{"$f":"VLOOKUP(J672,FOURNISSEURS!$A$1:$B$2212,2,0)","v":{"$error":"#N/A"}},null,null,"MDF MÉCANIQUE INC.","M63210","2019-08-21"]
[null,null,1," ",1," ",1," ",null,null,{"$f":"VLOOKUP(J673,FOURNISSEURS!$A$1:$B$2212,2,0)","v":{"$error":"#N/A"}},null,null,"MÉCANIQUE CGL INC.","M63260","2019-08-22"]
[null,null,1," ",1," ",1," ",null,null,{"$f":"VLOOKUP(J674,FOURNISSEURS!$A$1:$B$2212,2,0)","v":{"$error":"#N/A"}},null,null,"MÉCA-PRO #31783","M63250","2019-08-23"]
[null,null,1," ",1," ",1," ",null,null,{"$f":"VLOOKUP(J675,FOURNISSEURS!$A$1:$B$2212,2,0)","v":{"$error":"#N/A"}},null,null,"MÉDI SECUR","M63270","2019-08-24"]
[null,null,1," ",1," ",1," ",null,null,{"$f":"VLOOKUP(J676,FOURNISSEURS!$A$1:$B$2212,2,0)","v":{"$error":"#N/A"}},null,null,"MEDIAS TRANSCONTINENTAL S.E.N.C. (RO)","M63280","2019-08-25"]
[null,null,1,{"$f":"CHOOSE(C677,\" \",$D$4,$D$5,$D$6,$D$7,$D$8,$D$9,$D$10,$D$11,$D$12)","v":" "},1,{"$f":"CHOOSE(E677,\" \",$F$4,$F$5,$F$6,$F$7,$F$8,$F$9,$F$10,$F$11,$F$4,$F$5,$F$6,$F$7,$F$8)","v":" "},1,{"$f":"CHOOSE(G677,\" \",$H$4,$H$5,$H$6,$H$7,$H$8,$H$9,$H$10,$H$11,$J$4,$J$5,$J$6,$J$7,$J$8,$J$9,$J$10,\" \")","v":" "},null,null,{"$f":"VLOOKUP(J677,FOURNISSEURS!$A$1:$B$2212,2,0)","v":{"$error":"#N/A"}},null,null,"MEGA-TECH","M63325","2019-08-26"]
[null,null,1," ",1," ",1," ",null,null,{"$f":"VLOOKUP(J678,FOURNISSEURS!$A$1:$B$2212,2,0)","v":{"$error":"#N/A"}},null,null,"MÉNARD ÉVELINE","M63400","2019-08-27"]
[null,null,1," ",1," ",1," ",null,null,{"$f":"VLOOKUP(J679,FOURNISSEURS!$A$1:$B$2212,2,0)","v":{"$error":"#N/A"}},null,null,"MESSAGERIES DYNAMIQUES","M63450","2019-08-28"]
[null,null,1," ",1," ",1," ",null,null,{"$f":"VLOOKUP(J680,FOURNISSEURS!$A$1:$B$2212,2,0)","v":{"$error":"#N/A"}},null,null,"MESSIER CLAUDINE","M63460","2019-08-29"]
[null,null,1," ",1," ",1," ",null,null,{"$f":"VLOOKUP(J681,FOURNISSEURS!$A$1:$B$2212,2,0)","v":{"$error":"#N/A"}},null,null,"METAL POLE LITE","M63470","2019-08-30"]
[null,null,1," ",1," ",1," ",null,null,{"$f":"VLOOKUP(J682,FOURNISSEURS!$A$1:$B$2212,2,0)","v":{"$error":"#N/A"}},null,null,"MFOUAZABANTOU AUDE","M63525","2019-08-31"]
[null,null,1," ",1," ",1," ",null,null,{"$f":"VLOOKUP(J683,FOURNISSEURS!$A$1:$B$2212,2,0)","v":{"$error":"#N/A"}},null,null,"MICHELIN NORTH AMERICA (CANADA) INC","M63600","2019-09-01"]
[null,null,1," ",1," ",1," ",null,null,{"$f":"VLOOKUP(J684,FOURNISSEURS!$A$1:$B$2212,2,0)","v":{"$error":"#N/A"}},null,null,"MICROTEC SECURI-T","M63625","2019-09-02"]
[null,null,1," ",1," ",1," ",null,null,{"$f":"VLOOKUP(J685,FOURNISSEURS!$A$1:$B$2212,2,0)","v":{"$error":"#N/A"}},null,null,"MINES SELEINE","M63690",{"$f":"P684+1","v":"2019-09-03"}]
[null,null,1," ",1," ",1," ",null,null,{"$f":"VLOOKUP(J686,FOURNISSEURS!$A$1:$B$2212,2,0)","v":{"$error":"#N/A"}},null,null,"MINISTERE REVENU DU QUEBEC","M64525","2019-09-04"]
[null,null,1," ",1," ",1," ",null,null,{"$f":"VLOOKUP(J687,FOURNISSEURS!$A$1:$B$2212,2,0)","v":{"$error":"#N/A"}},null,null,"MINISTRE DES FINANCES","M63700","2019-09-05"]
[null,null,1," ",1," ",1," ",null,null,{"$f":"VLOOKUP(J688,FOURNISSEURS!$A$1:$B$2212,2,0)","v":{"$error":"#N/A"}},null,null,"MINISTRE DU REVENU DU QUEBEC","M64575","2019-09-06"]
[null,null,1," ",1," ",1," ",null,null,{"$f":"VLOOKUP(J689,FOURNISSEURS!$A$1:$B$2212,2,0)","v":{"$error":"#N/A"}},null,null,"MIRABAU/SÉRIGRAPHIE","M64650","2019-09-07"]
[null,null,1," ",1," ",1," ",null,null,{"$f":"VLOOKUP(J690,FOURNISSEURS!$A$1:$B$2212,2,0)","v":{"$error":"#N/A"}},null,null,"MOISSON LANAUDIERE","M64800","2019-09-08"]
[null,null,1," ",1," ",1," ",null,null,{"$f":"VLOOKUP(J691,FOURNISSEURS!$A$1:$B$2212,2,0)","v":{"$error":"#N/A"}},null,null,"MOREAU AUTOMOBILE LTÉE","M65250","2019-09-09"]
[null,null,1," ",1," ",1," ",null,null,{"$f":"VLOOKUP(J692,FOURNISSEURS!$A$1:$B$2212,2,0)","v":{"$error":"#N/A"}},null,null,"MOREL ET FILS ST-LIN","M65475","2019-09-10"]
[null,null,1," ",1," ",1," ",null,null,{"$f":"VLOOKUP(J693,FOURNISSEURS!$A$1:$B$2212,2,0)","v":{"$error":"#N/A"}},null,null,"MORIN JONATHAN","M65600","2019-09-11"]
[null,null,1," ",1," ",1," ",null,null,{"$f":"VLOOKUP(J694,FOURNISSEURS!$A$1:$B$2212,2,0)","v":{"$error":"#N/A"}},null,null,"MORIN YVETTE LORTIE","M65700","2019-09-12"]
[null,null,1," ",1," ",1," ",null,null,{"$f":"VLOOKUP(J695,FOURNISSEURS!$A$1:$B$2212,2,0)","v":{"$error":"#N/A"}},null,null,"MORISSETTE LYNDA","M65925","2019-09-13"]
[null,null,1," ",1," ",1," ",null,null,{"$f":"VLOOKUP(J696,FOURNISSEURS!$A$1:$B$2212,2,0)","v":{"$error":"#N/A"}},null,null,"MOTEURS & CONTROLES DESJARDINS","M66050","2019-09-14"]
[null,null,1," ",1," ",1," ",null,null,{"$f":"VLOOKUP(J697,FOURNISSEURS!$A$1:$B$2212,2,0)","v":{"$error":"#N/A"}},null,null,"MOTEURS ÉLECTRIQUES GAUTHIER INC.","M66060","2019-09-15"]
[null,null,1," ",1," ",1," ",null,null,{"$f":"VLOOKUP(J698,FOURNISSEURS!$A$1:$B$2212,2,0)","v":{"$error":"#N/A"}},null,null,"MOTIVPLUS","M66100","2019-09-16"]
[null,null,1," ",1," ",1," ",null,null,{"$f":"VLOOKUP(J699,FOURNISSEURS!$A$1:$B$2212,2,0)","v":{"$error":"#N/A"}},null,null,"MULTI-ROUTES INC.","M66235","2019-09-17"]
[null,null,1," ",1," ",1," ",null,null,{"$f":"VLOOKUP(J700,FOURNISSEURS!$A$1:$B$2212,2,0)","v":{"$error":"#N/A"}},null,null,"MUN. VILLAGE ST-ALEXIS","M67125","2019-09-18"]
[null,null,1," ",1," ",1," ",null,null,{"$f":"VLOOKUP(J701,FOURNISSEURS!$A$1:$B$2212,2,0)","v":{"$error":"#N/A"}},null,null,"MUNICIPALITE  SAINTE-JULIENNE","M66375","2019-09-19"]
[null,null,1," ",1," ",1," ",null,null,{"$f":"VLOOKUP(J702,FOURNISSEURS!$A$1:$B$2212,2,0)","v":{"$error":"#N/A"}},null,null,"MUNICIPALITÉ DE SAINT-ALEXIS","M66575","2019-09-20"]
[null,null,1," ",1," ",1," ",null,null,{"$f":"VLOOKUP(J703,FOURNISSEURS!$A$1:$B$2212,2,0)","v":{"$error":"#N/A"}},null,null,"MUNICIPALITE DE SAINT-CALIXTE","M66825","2019-09-21"]
[null,null,1," ",1," ",1," ",null,null,{"$f":"VLOOKUP(J704,FOURNISSEURS!$A$1:$B$2212,2,0)","v":{"$error":"#N/A"}},null,null,"MUNICIPALITE DE SAINT-CHARLES-BORROMEE","M66850","2019-09-22"]
[null,null,1," ",1," ",1," ",null,null,{"$f":"VLOOKUP(J705,FOURNISSEURS!$A$1:$B$2212,2,0)","v":{"$error":"#N/A"}},null,null,"MUNICIPALITE DE SAINT-ESPRIT","M66600","2019-09-23"]
[null,null,1," ",1," ",1," ",null,null,{"$f":"VLOOKUP(J706,FOURNISSEURS!$A$1:$B$2212,2,0)","v":{"$error":"#N/A"}},null,null,"MUNICIPALITE DE SAINT-JACQUES","M66950","2019-09-24"]
[null,null,1," ",1," ",1," ",null,null,{"$f":"VLOOKUP(J707,FOURNISSEURS!$A$1:$B$2212,2,0)","v":{"$error":"#N/A"}},null,null,"MUNICIPALITE DE ST-ROCH-OUEST","M67050","2019-09-25"]
[null,null,1," ",1," ",1," ",null,null,{"$f":"VLOOKUP(J708,FOURNISSEURS!$A$1:$B$2212,2,0)","v":{"$error":"#N/A"}},null,null,"MUNICIPALITE PAR. ST-LIGUORI","M66300","2019-09-26"]
[null,null,1," ",1," ",1," ",null,null,{"$f":"VLOOKUP(J709,FOURNISSEURS!$A$1:$B$2212,2,0)","v":{"$error":"#N/A"}},null,null,"MUNICIPALITE STE-SOPHIE","M67500","2019-09-27"]
[null,null,1," ",1," ",1," ",null,null,{"$f":"VLOOKUP(J710,FOURNISSEURS!$A$1:$B$2212,2,0)","v":{"$error":"#N/A"}},null,null,"MUTUELLE MUNICIPALITES QUEBEC","M67800","2019-09-28"]
[null,null,1," ",1," ",1," ",null,null,{"$f":"VLOOKUP(J711,FOURNISSEURS!$A$1:$B$2212,2,0)","v":{"$error":"#N/A"}},null,null,"MYLÈNE GILBERT, L. MALENFANT & I. GAGNÉ","M67900","2019-09-29"]
[null,null,1," ",1," ",1," ",null,null,{"$f":"VLOOKUP(J712,FOURNISSEURS!$A$1:$B$2212,2,0)","v":{"$error":"#N/A"}},null,null,"NANCIES","N67925","2019-09-30"]
[null,null,1," ",1," ",1," ",null,null,{"$f":"VLOOKUP(J713,FOURNISSEURS!$A$1:$B$2212,2,0)","v":{"$error":"#N/A"}},null,null,"NATIONAL CAR RENTAL CANADA INC","N67950","2019-10-01"]
[null,null,1," ",1," ",1," ",null,null,{"$f":"VLOOKUP(J714,FOURNISSEURS!$A$1:$B$2212,2,0)","v":{"$error":"#N/A"}},null,null,"NATIONAL VACUUM SERVICES MUNICIPAUX INC.","N68000","2019-10-02"]
[null,null,1," ",1," ",1," ",null,null,{"$f":"VLOOKUP(J715,FOURNISSEURS!$A$1:$B$2212,2,0)","v":{"$error":"#N/A"}},null,null,"NATURE SAUVAGE","N68025","2019-10-03"]
[null,null,1," ",1," ",1," ",null,null,{"$f":"VLOOKUP(J716,FOURNISSEURS!$A$1:$B$2212,2,0)","v":{"$error":"#N/A"}},null,null,"NATURE-ACTION QUÉBEC","N68010","2019-10-04"]
[null,null,1," ",1," ",1," ",null,null,{"$f":"VLOOKUP(J717,FOURNISSEURS!$A$1:$B$2212,2,0)","v":{"$error":"#N/A"}},null,null,"NEDCO DIV. REXEL CANADA INC.","N68050","2019-10-05"]
[null,null,1," ",1," ",1," ",null,null,{"$f":"VLOOKUP(J718,FOURNISSEURS!$A$1:$B$2212,2,0)","v":{"$error":"#N/A"}},null,null,"NEOPOST CANADA LTEE","N68100","2019-10-06"]
[null,null,1," ",1," ",1," ",null,null,{"$f":"VLOOKUP(J719,FOURNISSEURS!$A$1:$B$2212,2,0)","v":{"$error":"#N/A"}},null,null,"NETTOYAGE EXPERTS","N68150","2019-10-07"]
[null,null,1," ",1," ",1," ",null,null,{"$f":"VLOOKUP(J720,FOURNISSEURS!$A$1:$B$2212,2,0)","v":{"$error":"#N/A"}},null,null,"NICOLE ALEXANDRE (MONSIEUR)","N68200","2019-10-08"]
[null,null,1," ",1," ",1," ",null,null,{"$f":"VLOOKUP(J721,FOURNISSEURS!$A$1:$B$2212,2,0)","v":{"$error":"#N/A"}},null,null,"NORDAK MARINE","N68300","2019-10-09"]
[null,null,1," ",1," ",1," ",null,null,{"$f":"VLOOKUP(J722,FOURNISSEURS!$A$1:$B$2212,2,0)","v":{"$error":"#N/A"}},null,null,"NORDIKEAU INC.","N68500","2019-10-10"]
[null,null,1," ",1," ",1," ",null,null,{"$f":"VLOOKUP(J723,FOURNISSEURS!$A$1:$B$2212,2,0)","v":{"$error":"#N/A"}},null,null,"NORTIN INC.","N68575","2019-10-11"]
[null,null,1," ",1," ",1," ",null,null,{"$f":"VLOOKUP(J724,FOURNISSEURS!$A$1:$B$2212,2,0)","v":{"$error":"#N/A"}},null,null,"NOVA ENVIROCOM INC.","N68600","2019-10-12"]
[null,null,1," ",1," ",1," ",null,null,{"$f":"VLOOKUP(J725,FOURNISSEURS!$A$1:$B$2212,2,0)","v":{"$error":"#N/A"}},null,null,"NOVA MOBILIER","N68625","2019-10-13"]
[null,null,1," ",1," ",1," ",null,null,{"$f":"VLOOKUP(J726,FOURNISSEURS!$A$1:$B$2212,2,0)","v":{"$error":"#N/A"}},null,null,"NUIT BLANCHE","N68650","2019-10-14"]
[null,null,1," ",1," ",1," ",null,null,{"$f":"VLOOKUP(J727,FOURNISSEURS!$A$1:$B$2212,2,0)","v":{"$error":"#N/A"}},null,null,"O.M.H. SAINT-LIN-LAURENTIDES","O68875","2019-10-15"]
[null,null,1," ",1," ",1," ",null,null,{"$f":"VLOOKUP(J728,FOURNISSEURS!$A$1:$B$2212,2,0)","v":{"$error":"#N/A"}},null,null,"ODYSSÉE V.O.I.P.","O68890","2019-10-16"]
[null,null,1," ",1," ",1," ",null,null,{"$f":"VLOOKUP(J729,FOURNISSEURS!$A$1:$B$2212,2,0)","v":{"$error":"#N/A"}},null,null,"OFFICE MUNICIPAL D'HABITATION","O68900","2019-10-17"]
[null,null,1," ",1," ",1," ",null,null,{"$f":"VLOOKUP(J730,FOURNISSEURS!$A$1:$B$2212,2,0)","v":{"$error":"#N/A"}},null,null,"OMNI-TECH SPORTS","O69200","2019-10-18"]
[null,null,1," ",1," ",1," ",null,null,{"$f":"VLOOKUP(J731,FOURNISSEURS!$A$1:$B$2212,2,0)","v":{"$error":"#N/A"}},null,null,"ORIZON MOBILE","O69400","2019-10-19"]
[null,null,1," ",1," ",1," ",null,null,{"$f":"VLOOKUP(J732,FOURNISSEURS!$A$1:$B$2212,2,0)","v":{"$error":"#N/A"}},null,null,"O'TEC TECHNOLOGIES","O68750","2019-10-20"]
[null,null,1," ",1," ",1," ",null,null,{"$f":"VLOOKUP(J733,FOURNISSEURS!$A$1:$B$2212,2,0)","v":{"$error":"#N/A"}},null,null,"OUELLET MÉLANIE","O69600","2019-10-21"]
[null,null,1," ",1," ",1," ",null,null,{"$f":"VLOOKUP(J734,FOURNISSEURS!$A$1:$B$2212,2,0)","v":{"$error":"#N/A"}},null,null,"OUELLET STÉPHANE","O69625","2019-10-22"]
[null,null,1," ",1," ",1," ",null,null,{"$f":"VLOOKUP(J735,FOURNISSEURS!$A$1:$B$2212,2,0)","v":{"$error":"#N/A"}},null,null,"OUTILLAGES EXPRESS","O69875","2019-10-23"]
[null,null,1," ",1," ",1," ",null,null,{"$f":"VLOOKUP(J736,FOURNISSEURS!$A$1:$B$2212,2,0)","v":{"$error":"#N/A"}},null,null,"OXYGÈNE MILLÉNAIR INC.","O69890","2019-10-24"]
[null,null,1," ",1," ",1," ",null,null,{"$f":"VLOOKUP(J737,FOURNISSEURS!$A$1:$B$2212,2,0)","v":{"$error":"#N/A"}},null,null,"OZÉ MA BULLE","O69900","2019-10-25"]
[null,null,1," ",1," ",1," ",null,null,{"$f":"VLOOKUP(J738,FOURNISSEURS!$A$1:$B$2212,2,0)","v":{"$error":"#N/A"}},null,null,"P.H. VITRES D'AUTOS INC.","P70200","2019-10-26"]
[null,null,1," ",1," ",1," ",null,null,{"$f":"VLOOKUP(J739,FOURNISSEURS!$A$1:$B$2212,2,0)","v":{"$error":"#N/A"}},null,null,"PAGES JAUNES","P70600","2019-10-27"]
[null,null,1," ",1," ",1," ",null,null,{"$f":"VLOOKUP(J740,FOURNISSEURS!$A$1:$B$2212,2,0)","v":{"$error":"#N/A"}},null,null,"PALAIS DE JUSTICE","P70650","2019-10-28"]
[null,null,1,{"$f":"CHOOSE(C741,\" \",$D$4,$D$5,$D$6,$D$7,$D$8,$D$9,$D$10,$D$11,$D$12)","v":" "},1,{"$f":"CHOOSE(E741,\" \",$F$4,$F$5,$F$6,$F$7,$F$8,$F$9,$F$10,$F$11,$F$4,$F$5,$F$6,$F$7,$F$8)","v":" "},1,{"$f":"CHOOSE(G741,\" \",$H$4,$H$5,$H$6,$H$7,$H$8,$H$9,$H$10,$H$11,$J$4,$J$5,$J$6,$J$7,$J$8,$J$9,$J$10,\" \")","v":" "},null,null,{"$f":"VLOOKUP(J741,FOURNISSEURS!$A$1:$B$2212,2,0)","v":{"$error":"#N/A"}},null,null,"PAPETERIE ALAIN CONTANT INC.","P70875","2019-10-29"]
[null,null,1," ",1," ",1," ",null,null,{"$f":"VLOOKUP(J742,FOURNISSEURS!$A$1:$B$2212,2,0)","v":{"$error":"#N/A"}},null,null,"PAQUIN ANDRE","P71050","2019-10-30"]
[null,null,1," ",1," ",1," ",null,null,{"$f":"VLOOKUP(J743,FOURNISSEURS!$A$1:$B$2212,2,0)","v":{"$error":"#N/A"}},null,null,"PAQUIN GERALD","P71100","2019-10-31"]
[null,null,1," ",1," ",1," ",null,null,{"$f":"VLOOKUP(J744,FOURNISSEURS!$A$1:$B$2212,2,0)","v":{"$error":"#N/A"}},null,null,"PARAFIAMMA SOLUTIONS INC.","P71120","2019-11-01"]
[null,null,1," ",1," ",1," ",null,null,{"$f":"VLOOKUP(J745,FOURNISSEURS!$A$1:$B$2212,2,0)","v":{"$error":"#N/A"}},null,null,"PARÉ MARIE-CLAUDE","P71130","2019-11-02"]
[null,null,1," ",1," ",1," ",null,null,{"$f":"VLOOKUP(J746,FOURNISSEURS!$A$1:$B$2212,2,0)","v":{"$error":"#N/A"}},null,null,"PARIS, LADOUCEUR & ASSOCIÉS INC.","P71150","2019-11-03"]
[null,null,1," ",1," ",1," ",null,null,{"$f":"VLOOKUP(J747,FOURNISSEURS!$A$1:$B$2212,2,0)","v":{"$error":"#N/A"}},null,null,"PAROISSE ST-ROCH-DE-L'ACHIGAN","P71325","2019-11-04"]
[null,null,1," ",1," ",1," ",null,null,{"$f":"VLOOKUP(J748,FOURNISSEURS!$A$1:$B$2212,2,0)","v":{"$error":"#N/A"}},null,null,"PATIO DRUMMOND LTÉE","P71600","2019-11-05"]
[null,null,1," ",1," ",1," ",null,null,{"$f":"VLOOKUP(J749,FOURNISSEURS!$A$1:$B$2212,2,0)","v":{"$error":"#N/A"}},null,null,"PÂTISSERIE CHOCOLATERIE DU POITOU","P71700",{"$f":"P748+1","v":"2019-11-06"}]
[null,null,1," ",1," ",1," ",null,null,{"$f":"VLOOKUP(J750,FOURNISSEURS!$A$1:$B$2212,2,0)","v":{"$error":"#N/A"}},null,null,"PAVAGE DES MOULINS INC.","P71550","2019-11-07"]
[null,null,1," ",1," ",1," ",null,null,{"$f":"VLOOKUP(J751,FOURNISSEURS!$A$1:$B$2212,2,0)","v":{"$error":"#N/A"}},null,null,"PAVAGE E. PERREAULT INC.","P71560","2019-11-08"]
[null,null,1," ",1," ",1," ",null,null,{"$f":"VLOOKUP(J752,FOURNISSEURS!$A$1:$B$2212,2,0)","v":{"$error":"#N/A"}},null,null,"PAVAGES MULTIPRO INC.","P71551","2019-11-09"]
[null,null,1," ",1," ",1," ",null,null,{"$f":"VLOOKUP(J753,FOURNISSEURS!$A$1:$B$2212,2,0)","v":{"$error":"#N/A"}},null,null,"PCG CARMON","P71800","2019-11-10"]
[null,null,1," ",1," ",1," ",null,null,{"$f":"VLOOKUP(J754,FOURNISSEURS!$A$1:$B$2212,2,0)","v":{"$error":"#N/A"}},null,null,"PEINTURE DÉCOR DES MOULINS","P71925","2019-11-11"]
[null,null,1," ",1," ",1," ",null,null,{"$f":"VLOOKUP(J755,FOURNISSEURS!$A$1:$B$2212,2,0)","v":{"$error":"#N/A"}},null,null,"PEINTURE LA DIFFÉRENCE INC.","P71900","2019-11-12"]
[null,null,1," ",1," ",1," ",null,null,{"$f":"VLOOKUP(J756,FOURNISSEURS!$A$1:$B$2212,2,0)","v":{"$error":"#N/A"}},null,null,"PELLETIER EXCAVATION INC.","P72000","2019-11-13"]
[null,null,1," ",1," ",1," ",null,null,{"$f":"VLOOKUP(J757,FOURNISSEURS!$A$1:$B$2212,2,0)","v":{"$error":"#N/A"}},null,null,"PELLETIER LINE","P72050","2019-11-14"]
[null,null,1," ",1," ",1," ",null,null,{"$f":"VLOOKUP(J758,FOURNISSEURS!$A$1:$B$2212,2,0)","v":{"$error":"#N/A"}},null,null,"PÉLOMIX INC.","P72100","2019-11-15"]
[null,null,1," ",1," ",1," ",null,null,{"$f":"VLOOKUP(J759,FOURNISSEURS!$A$1:$B$2212,2,0)","v":{"$error":"#N/A"}},null,null,"PELTI, VITRES TEINTÉES","P72150","2019-11-16"]
[null,null,1," ",1," ",1," ",null,null,{"$f":"VLOOKUP(J760,FOURNISSEURS!$A$1:$B$2212,2,0)","v":{"$error":"#N/A"}},null,null,"PÉPINIÈRE DES HAUTEURS","P72400","2019-11-17"]
[null,null,1," ",1," ",1," ",null,null,{"$f":"VLOOKUP(J761,FOURNISSEURS!$A$1:$B$2212,2,0)","v":{"$error":"#N/A"}},null,null,"PERCUSSIONS SULTANOSTO ENR.","P72500","2019-11-18"]
[null,null,1," ",1," ",1," ",null,null,{"$f":"VLOOKUP(J762,FOURNISSEURS!$A$1:$B$2212,2,0)","v":{"$error":"#N/A"}},null,null,"PETITE CAISSE","P72675","2019-11-19"]
[null,null,1," ",1," ",1," ",null,null,{"$f":"VLOOKUP(J763,FOURNISSEURS!$A$1:$B$2212,2,0)","v":{"$error":"#N/A"}},null,null,"PG SOLUTIONS INC.","P72800","2019-11-20"]
[null,null,1," ",1," ",1," ",null,null,{"$f":"VLOOKUP(J764,FOURNISSEURS!$A$1:$B$2212,2,0)","v":{"$error":"#N/A"}},null,null,"PHARMACIE JEAN-FRANÇOIS LAFRANCE","P73000","2019-11-21"]
[null,null,1," ",1," ",1," ",null,null,{"$f":"VLOOKUP(J765,FOURNISSEURS!$A$1:$B$2212,2,0)","v":{"$error":"#N/A"}},null,null,"PICARD CREVIER GUERTIN ET ASSOCIES INC.","P73200","2019-11-22"]
[null,null,1," ",1," ",1," ",null,null,{"$f":"VLOOKUP(J766,FOURNISSEURS!$A$1:$B$2212,2,0)","v":{"$error":"#N/A"}},null,null,"PIECES D'AUTO J.P. RACETTE INC.","P73575","2019-11-23"]
[null,null,1," ",1," ",1," ",null,null,{"$f":"VLOOKUP(J767,FOURNISSEURS!$A$1:$B$2212,2,0)","v":{"$error":"#N/A"}},null,null,"PIECES D'AUTO MONTCALM INC.","P73578","2019-11-24"]
[null,null,1," ",1," ",1," ",null,null,{"$f":"VLOOKUP(J768,FOURNISSEURS!$A$1:$B$2212,2,0)","v":{"$error":"#N/A"}},null,null,"PIECES D'AUTO PILON INC.","P73580","2019-11-25"]
[null,null,1," ",1," ",1," ",null,null,{"$f":"VLOOKUP(J769,FOURNISSEURS!$A$1:$B$2212,2,0)","v":{"$error":"#N/A"}},null,null,"PIECES DE CAMION REMI LAUZON & FILS INC.","P73350","2019-11-26"]
[null,null,1," ",1," ",1," ",null,null,{"$f":"VLOOKUP(J770,FOURNISSEURS!$A$1:$B$2212,2,0)","v":{"$error":"#N/A"}},null,null,"PIERRE CREVIER ENR.","P73625","2019-11-27"]
[null,null,1," ",1," ",1," ",null,null,{"$f":"VLOOKUP(J771,FOURNISSEURS!$A$1:$B$2212,2,0)","v":{"$error":"#N/A"}},null,null,"PILON MARYSE","P73675","2019-11-28"]
[null,null,1," ",1," ",1," ",null,null,{"$f":"VLOOKUP(J772,FOURNISSEURS!$A$1:$B$2212,2,0)","v":{"$error":"#N/A"}},null,null,"PINARD FORD STE-JULIENNE","P73685","2019-11-29"]
[null,null,1," ",1," ",1," ",null,null,{"$f":"VLOOKUP(J773,FOURNISSEURS!$A$1:$B$2212,2,0)","v":{"$error":"#N/A"}},null,null,"PINARD MOTO","P73690","2019-11-30"]
[null,null,1," ",1," ",1," ",null,null,{"$f":"VLOOKUP(J774,FOURNISSEURS!$A$1:$B$2212,2,0)","v":{"$error":"#N/A"}},null,null,"PISCINE ET SPA LANAUDIÈRE","P73650","2019-12-01"]
[null,null,1," ",1," ",1," ",null,null,{"$f":"VLOOKUP(J775,FOURNISSEURS!$A$1:$B$2212,2,0)","v":{"$error":"#N/A"}},null,null,"PISCINES SOUCY INC.","P73750","2019-12-02"]
[null,null,1," ",1," ",1," ",null,null,{"$f":"VLOOKUP(J776,FOURNISSEURS!$A$1:$B$2212,2,0)","v":{"$error":"#N/A"}},null,null,"PIZZA PICCOLO","P73830","2019-12-03"]
[null,null,1," ",1," ",1," ",null,null,{"$f":"VLOOKUP(J777,FOURNISSEURS!$A$1:$B$2212,2,0)","v":{"$error":"#N/A"}},null,null,"PLANIA INC.","P73832","2019-12-04"]
[null,null,1," ",1," ",1," ",null,null,{"$f":"VLOOKUP(J778,FOURNISSEURS!$A$1:$B$2212,2,0)","v":{"$error":"#N/A"}},null,null,"PLASTIQUES CY-BO INC. (LES)","P73835","2019-12-05"]
[null,null,1," ",1," ",1," ",null,null,{"$f":"VLOOKUP(J779,FOURNISSEURS!$A$1:$B$2212,2,0)","v":{"$error":"#N/A"}},null,null,"PLOMBERIE BRÉBEUF INC.","P73840","2019-12-06"]
[null,null,1," ",1," ",1," ",null,null,{"$f":"VLOOKUP(J780,FOURNISSEURS!$A$1:$B$2212,2,0)","v":{"$error":"#N/A"}},null,null,"PLOMBERIE CHAUFFAGE DU COTEAU","P73900","2019-12-07"]
[null,null,1," ",1," ",1," ",null,null,{"$f":"VLOOKUP(J781,FOURNISSEURS!$A$1:$B$2212,2,0)","v":{"$error":"#N/A"}},null,null,"PLOMBERIE ÉRIC LÉVESQUE INC.","P74025","2019-12-08"]
[null,null,1," ",1," ",1," ",null,null,{"$f":"VLOOKUP(J782,FOURNISSEURS!$A$1:$B$2212,2,0)","v":{"$error":"#N/A"}},null,null,"PLOMBERIE JFH-VÉZINA","P74040","2019-12-09"]
[null,null,1," ",1," ",1," ",null,null,{"$f":"VLOOKUP(J783,FOURNISSEURS!$A$1:$B$2212,2,0)","v":{"$error":"#N/A"}},null,null,"PLOMBERIE J-L MARTIN","P74045","2019-12-10"]
[null,null,1," ",1," ",1," ",null,null,{"$f":"VLOOKUP(J784,FOURNISSEURS!$A$1:$B$2212,2,0)","v":{"$error":"#N/A"}},null,null,"PLOMBERIE MIC INC.","P74050","2019-12-11"]
[null,null,1," ",1," ",1," ",null,null,{"$f":"VLOOKUP(J785,FOURNISSEURS!$A$1:$B$2212,2,0)","v":{"$error":"#N/A"}},null,null,"PLOMBERIE MONTCALM INC.","P74060","2019-12-12"]
[null,null,1," ",1," ",1," ",null,null,{"$f":"VLOOKUP(J786,FOURNISSEURS!$A$1:$B$2212,2,0)","v":{"$error":"#N/A"}},null,null,"PLOMBERIES PDA-VÉZINA","P73850","2019-12-13"]
[null,null,1," ",1," ",1," ",null,null,{"$f":"VLOOKUP(J787,FOURNISSEURS!$A$1:$B$2212,2,0)","v":{"$error":"#N/A"}},null,null,"PLOURDE JÉRÉMY","P74100","2019-12-14"]
[null,null,1," ",1," ",1," ",null,null,{"$f":"VLOOKUP(J788,FOURNISSEURS!$A$1:$B$2212,2,0)","v":{"$error":"#N/A"}},null,null,"PLUME LIBRE MONTCALM","P74125","2019-12-15"]
[null,null,1," ",1," ",1," ",null,null,{"$f":"VLOOKUP(J789,FOURNISSEURS!$A$1:$B$2212,2,0)","v":{"$error":"#N/A"}},null,null,"PNEUS BÉLISLE ST-JÉRÔME","P74175","2019-12-16"]
[null,null,1," ",1," ",1," ",null,null,{"$f":"VLOOKUP(J790,FOURNISSEURS!$A$1:$B$2212,2,0)","v":{"$error":"#N/A"}},null,null,"PNEUS TECH 2000","P74225","2019-12-17"]
[null,null,1," ",1," ",1," ",null,null,{"$f":"VLOOKUP(J791,FOURNISSEURS!$A$1:$B$2212,2,0)","v":{"$error":"#N/A"}},null,null,"POITRAS ASPHALTE & DU NORD","P74300","2019-12-18"]
[null,null,1," ",1," ",1," ",null,null,{"$f":"VLOOKUP(J792,FOURNISSEURS!$A$1:$B$2212,2,0)","v":{"$error":"#N/A"}},null,null,"POLYGRAVURE LAVAL","P74400","2019-12-19"]
[null,null,1," ",1," ",1," ",null,null,{"$f":"VLOOKUP(J793,FOURNISSEURS!$A$1:$B$2212,2,0)","v":{"$error":"#N/A"}},null,null,"POMPES À BÉTON EXCEL INC.","P74450","2019-12-20"]
[null,null,1," ",1," ",1," ",null,null,{"$f":"VLOOKUP(J794,FOURNISSEURS!$A$1:$B$2212,2,0)","v":{"$error":"#N/A"}},null,null,"PORTE DES LAURENTIDES (LA)","P74475","2019-12-21"]
[null,null,1," ",1," ",1," ",null,null,{"$f":"VLOOKUP(J795,FOURNISSEURS!$A$1:$B$2212,2,0)","v":{"$error":"#N/A"}},null,null,"PORTES ET FENÊTRES CONCEPT NORD-SUD","P74495","2019-12-22"]
[null,null,1," ",1," ",1," ",null,null,{"$f":"VLOOKUP(J796,FOURNISSEURS!$A$1:$B$2212,2,0)","v":{"$error":"#N/A"}},null,null,"PORTES ET FENETRES DVR INC.","P74500","2019-12-23"]
[null,null,1," ",1," ",1," ",null,null,{"$f":"VLOOKUP(J797,FOURNISSEURS!$A$1:$B$2212,2,0)","v":{"$error":"#N/A"}},null,null,"PORTES LALIBERTE INC.","P74510","2019-12-24"]
[null,null,1," ",1," ",1," ",null,null,{"$f":"VLOOKUP(J798,FOURNISSEURS!$A$1:$B$2212,2,0)","v":{"$error":"#N/A"}},null,null,"PORTES UNIES ST-MICHEL","P74525","2019-12-25"]
[null,null,1," ",1," ",1," ",null,null,{"$f":"VLOOKUP(J799,FOURNISSEURS!$A$1:$B$2212,2,0)","v":{"$error":"#N/A"}},null,null,"POSTAGE ON CALL (POC)","P74528","2019-12-26"]
[null,null,1," ",1," ",1," ",null,null,{"$f":"VLOOKUP(J800,FOURNISSEURS!$A$1:$B$2212,2,0)","v":{"$error":"#N/A"}},null,null,"POSTES CANADA","P74530","2019-12-27"]
[null,null,1," ",1," ",1," ",null,null,{"$f":"VLOOKUP(J801,FOURNISSEURS!$A$1:$B$2212,2,0)","v":{"$error":"#N/A"}},null,null,"PRECISION 2000 INC.","P74540","2019-12-28"]
[null,null,1," ",1," ",1," ",null,null,{"$f":"VLOOKUP(J802,FOURNISSEURS!$A$1:$B$2212,2,0)","v":{"$error":"#N/A"}},null,null,"PRESSE COMMERCE CORPORATION","P74600","2019-12-29"]
[null,null,1," ",1," ",1," ",null,null,{"$f":"VLOOKUP(J803,FOURNISSEURS!$A$1:$B$2212,2,0)","v":{"$error":"#N/A"}},null,null,"PRÉVOST MARIE-HÉLÈNE","P74760","2019-12-30"]
[null,null,1," ",1," ",1," ",null,null,{"$f":"VLOOKUP(J804,FOURNISSEURS!$A$1:$B$2212,2,0)","v":{"$error":"#N/A"}},null,null,"PREVOYANTS INC. (LES)","P74800","2019-12-31"]
[null,null,1,{"$f":"CHOOSE(C805,\" \",$D$4,$D$5,$D$6,$D$7,$D$8,$D$9,$D$10,$D$11,$D$12)","v":" "},1,{"$f":"CHOOSE(E805,\" \",$F$4,$F$5,$F$6,$F$7,$F$8,$F$9,$F$10,$F$11,$F$4,$F$5,$F$6,$F$7,$F$8)","v":" "},1,{"$f":"CHOOSE(G805,\" \",$H$4,$H$5,$H$6,$H$7,$H$8,$H$9,$H$10,$H$11,$J$4,$J$5,$J$6,$J$7,$J$8,$J$9,$J$10,\" \")","v":" "},null,null,{"$f":"VLOOKUP(J805,FOURNISSEURS!$A$1:$B$2212,2,0)","v":{"$error":"#N/A"}},null,null,"PRO IMPACT DISTRIBUTION INC.","P75000","2020-01-01"]
[null,null,1," ",1," ",1," ",null,null,{"$f":"VLOOKUP(J806,FOURNISSEURS!$A$1:$B$2212,2,0)","v":{"$error":"#N/A"}},null,null,"PROCLEM","P75300","2020-01-02"]
[null,null,1," ",1," ",1," ",null,null,{"$f":"VLOOKUP(J807,FOURNISSEURS!$A$1:$B$2212,2,0)","v":{"$error":"#N/A"}},null,null,"PROCOM","P75400","2020-01-03"]
[null,null,1," ",1," ",1," ",null,null,{"$f":"VLOOKUP(J808,FOURNISSEURS!$A$1:$B$2212,2,0)","v":{"$error":"#N/A"}},null,null,"PRODUCTIONS ACME BENT","P75475","2020-01-04"]
[null,null,1," ",1," ",1," ",null,null,{"$f":"VLOOKUP(J809,FOURNISSEURS!$A$1:$B$2212,2,0)","v":{"$error":"#N/A"}},null,null,"PRODUCTIONS ANIMUSE INC","P75480","2020-01-05"]
[null,null,1," ",1," ",1," ",null,null,{"$f":"VLOOKUP(J810,FOURNISSEURS!$A$1:$B$2212,2,0)","v":{"$error":"#N/A"}},null,null,"PRODUCTIONS IMAGINATION","P75490","2020-01-06"]
[null,null,1," ",1," ",1," ",null,null,{"$f":"VLOOKUP(J811,FOURNISSEURS!$A$1:$B$2212,2,0)","v":{"$error":"#N/A"}},null,null,"PRODUCTIONS MCH INC. (LES)","P75495","2020-01-07"]
[null,null,1," ",1," ",1," ",null,null,{"$f":"VLOOKUP(J812,FOURNISSEURS!$A$1:$B$2212,2,0)","v":{"$error":"#N/A"}},null,null,"PRODUCTIONS MÉGA-ANIMATION INC. (LES)","P75500","2020-01-08"]
[null,null,1," ",1," ",1," ",null,null,{"$f":"VLOOKUP(J813,FOURNISSEURS!$A$1:$B$2212,2,0)","v":{"$error":"#N/A"}},null,null,"PRODUITS RE-PLAST INC.","P75560",{"$f":"P812+1","v":"2020-01-09"}]
[null,null,1," ",1," ",1," ",null,null,{"$f":"VLOOKUP(J814,FOURNISSEURS!$A$1:$B$2212,2,0)","v":{"$error":"#N/A"}},null,null,"PRODUITS SANITAIRES DES PLAINES INC","P75600","2020-01-10"]
[null,null,1,{"$f":"CHOOSE(C815,\" \",$D$4,$D$5,$D$6,$D$7,$D$8,$D$9,$D$10,$D$11,$D$12)","v":" "},1,{"$f":"CHOOSE(E815,\" \",$F$4,$F$5,$F$6,$F$7,$F$8,$F$9,$F$10,$F$11,$F$4,$F$5,$F$6,$F$7,$F$8)","v":" "},1,{"$f":"CHOOSE(G815,\" \",$H$4,$H$5,$H$6,$H$7,$H$8,$H$9,$H$10,$H$11,$J$4,$J$5,$J$6,$J$7,$J$8,$J$9,$J$10,\" \")","v":" "},null,null,{"$f":"VLOOKUP(J815,FOURNISSEURS!$A$1:$B$2212,2,0)","v":{"$error":"#N/A"}},null,null,"PROGRAMME D'ENSEIGNEMENT SPORTBALL","P75715","2020-01-11"]
[]
[]
[]
[]
[]
[]
[]
[]
[]
[]
[]
[]
[]
[]
[]
[]
[]
[]
[]
[]
[]
[]
[]
[]
[]
[]
[]
[]
[]
[]
[]
[]
[]
[]
[]
[]
[]
[]
[]
[]
[]
[]
[]
[]
[]
[]
[]
[]
[]
[]
[]
[]
[]
[]
[]
[]
[]
[]
[]
[]
[]
[]
[]
[]
[]
[]
[]
[]
[]
[]
[]
[]
[]
[]
[]
[]
[]
[]
[]
[]
[]
[]
[]
[]
[]
[]
[]
[]
[]
[]
[]
[]
[]
[]
[]
[]
[]
[]
[]
[]
[]
[]
[]
[]
[]
[]
[]
[]
[]
[]
[]
[]
[]
[]
[]
[]
[]
[]
[]
[]
[]
[]
[]
[]
[]
[]
[]
[]
[]
[]
[]
[]
[]
[]
[]
[]
[]
[]
[]
[]
[]
[]
[]
[]
[]
[]
[]
[]
[]
[]
[]
[]
[]
[]
[]
[]
[]
[]
[]
[]
[]
[]
[]
[]
[]
[]
[]
[]
[]
[]
[]
[]
[]
[]
[]
[]
[]
[]
[]
[]
[]
[]
[]
[]
[]
[]
[]
[]
[]
[]
[]
[]
[]
[]
[]
[]
[]
[]
[]
[]
[]
[]
[]
[]
[]
[]
[]
[]
[]
[]
[]
[]
[]
[]
[]
[]
[]
[]
[]
[]
[]
[]
[]
[]
[]
[]
[]
[]
[]
[]
[]
[]
[]
[]
[]
[]
[]
[]
[]
[]
[]
[]
[]
[]
[]
[]
[]
[]
[]
[]
[]
[]
[]
[]
[]
[]
[]
[]
[]
[]
[]
[]
[]
[]
[]
[]
[]
[]
[]
[]
[]
[]
[]
[]
[]
[]
[]
[]
[]
[]
[]
[]
[]
[]
[]
[]
[]
[]
[]
[]
[]
[]
[]
[]
[]
[]
[]
[]
[]
[]
[]
[]
[]
[]
[]
[]
[]
[]
[]
[]
[]
[]
[]
[]
[]
[]
[]
[]
[]
[]
[]
[]
[]
[]
[]
[]
[]
[]
[]
[]
[]
[]
[]
[]
[]
[]
[]
[]
[]
[]
[]
[]
[]
[]
[]
[]
[]
[]
[]
[]
[]
[]
[]
[]
[]
[]
[]
[]
[]
[]
[]
[]
[]
[]
[]
[]
[]
[]
[]
[]
[]
[]
[]
[]
[]
[]
[]
[]
[]
[]
[]
[]
[]
[]
[]
[]
[]
[]
[]
[]
[]
[]
[]
[]
[]
[]
[]
[]
[]
[]
[]
[]
[]
[]
[]
[]
[]
[]
[]
[]
[]
[]
[]
[]
[]
[]
[]
[]
[]
[]
[]
[]
[]
[]
[]
[]
[]
[]
[]
[]
[]
[]
[]
[]
[]
[]
[]
[]
[]
[]
[]
[]
[]
[]
[]
[]
[]
[]
[]
[]
[]
[]
[]
[]
[]
[]
[]
[]
[]
[]
[]
[]
[]
[]
[]
[]
[]
[]
[]
[]
[]
[]
[]
[]
[]
[]
[]
[]
[]
[]
[]
[]
[]
[]
[]
[]
[]
[]
[]
[]
[]
[]
[]
[]
[]
[]
[]
[]
[]
[]
[]
[]
[]
[]
[]
[]
[]
[]
[]
[]
[]
[]
[]
[]
[]
[]
[]
[]
[]
[]
[]
[]
[]
[]
[]
[]
[]
[]
[]
[]
[]
[]
[]
[]
[]
[]
[]
[]
[]
[]
[]
[]
[]
[]
[]
[]
[]
[]
[]
[]
[]
[]
[]
[]
[]
[]
[]
[]
[]
[]
[]
[]
[]
[]
[]
[]
[]
[]
[]
[]
[]
[]
[]
[]
[]
[]
[]
[]
[]
[]
[]
[]
[]
[]
[]
[]
[]
[]
[]
[]
[]
[]
[]
[]
[]
[]
[]
[]
[]
[]
[]
[]
[]
[]
[]
[]
[]
[]
[]
[]
[]
[]
[]
[]
[]
[]
[]
[]
[]
[]
[]
[]
[]
[]
[]
[]
[]
[]
[]
[]
[]
[]
[]
[]
[]
[]
[]
[]
[]
[]
[]
[]
[]
[]
[]
[]
[]
[]
[]
[]
[]
[]
[]
[]
[]
[]
[]
[]
[]
[]
[]
[]
[]
[]
[]
[]
[]
[]
[]
[]
[]
[]
[]
[]
[]
[]
[]
[]
[]
[]
[]
[]
[]
[]
[]
[]
[]
[]
[]
[]
[]
[]
[]
[]
[]
[]
[]
[]
[]
[]
[]
[]
[]
[]
[]
[]
[]
[]
[]
[]
[]
[]
[]
[]
[]
[]
[]
[]
[]
[]
[]
[]
[]
[]
[]
[]
[]
[]
[]
[]
[]
[]
[]
[]
[]
[]
[]
[]
[]
[]
[]
[]
[]
[]
[]
[]
[]
[]
[]
[]
[]
[]
[]
[]
[]
[]
[]
[]
[]
[]
[]
[]
[]
[]
[]
[]
[]
[]
[]
[]
[]
[]
[]
[]
[]
[]
[]
[]
[]
[]
[]
[]
[]
[]
[]
[]
[]
[]
[]
[]
[]
[]
[]
[]
[]
[]
[]
[]
[]
[]
[]
[]
[]
[]
[]
[]
[]
[]
[]
[]
[]
[]
[]
[]
[]
[]
[]
[]
[]
[]
[]
[]
[]
[]
[]
[]
[]
[]
[]
[]
[]
[]
[]
[]
[]
[]
[]
[]
[]
[]
[]
[]
[]
[]
[]
[]
[]
[]
[]
[]
[]
[]
[]
[]
[]
[]
[]
[]
[]
[]
[]
[]
[]
[]
[]
[]
[]
[]
[]
[]
[]
[]
[]
[]
[]
[]
[]
[]
[]
[]
[]
[]
[]
[]
[]
[]
[]
[]
[]
[]
[]
[]
[]
[]
[]
[]
[]
[]
[]
[]
[]
[]
[]
[]
[]
[]
[]
[]
[]
[]
[]
[]
[]
[]
[]
[]
[]
[]
[]
[]
[]
[]
[]
[]
[]
[]
[]
[]
[]
[]
[]
[]
[]
[]
[]
[]
[]
[]
[]
[]
[]
[]
[]
[]
[]
[]
[]
[]
[]
[]
[]
[]
[]
[]
[]
[]
[]
[]
[]
[]
[]
[]
[]
[]
[]
[]
[]
[]
[]
[]
[]
[]
[]
[]
[]
[]
[]
[]
[]
[]
[]
[]
[]
[]
[]
[]
[]
[]
[]
[]
[]
[]
[]
[]
[]
[]
[]
[]
[]
[]
[]
[]
[]
[]
[]
[]
[]
[]
[]
[]
[]
[]
[]
[]
[]
[]
[]
[]
[]
[]
[]
[]
[]
[]
[]
[]
[]
[]
[]
[]
[]
[]
[]
[]
[]
[]
[]
[]
[]
[]
[]
[]
[]
[]
[]
[]
[]
[]
[]
[]
[]
[]
[]
[]
[]
[]
[]
[]
[]
[]
[]
[]
[]
[]
[]
[]
[]
[]
[]
[]
[]
[]
[]
[]
[]
[]
[]
[]
[]
[]
[]
[]
[]
[]
[]
[]
[]
[]
[]
[]
[]
[]
[]
[]
[]
[]
[]
[]
[]
[]
[]
[]
[]
[]
[]
[]
[]
[]
[]
[]
[]
[]
[]
[]
[]
[]
[]
[]
[]
[]
[]
[]
[]
[]
[]
[]
[]
[]
[]
[]
[]
[]
[]
[]
[]
[]
[]
[]
[]
[]
[]
[]
[]
[]
[]
[]
[]
[]
[]
[]
[]
[]
[]
[]
[]
[]
[]
[]
[]
[]
[]
[]
[]
[]
[]
[]
[]
[]
[]
[]
[]
[]
[]
[]
[]
[]
[]
[]
[]
[]
[]
[]
[]
[]
[]
[]
[]
[]
[]
[]
[]
[]
[]
[]
[]
[]
[]
[]
[]
[]
[]
[]
[]
[]
[]
[]
[]
[]
[]
[]
[]
[]
[]
[]
[]
[]
[]
[]
[]
[]
[]
[]
[]
[]
[]
[]
[]
[]
[]
[]
[]
[]
[]
[]
[]
[]
[]
[]
[]
[]
[]
[]
[]
[]
[]
[]
[]
[]
[]
[]
[]
[]
[]
[]
[]
[]
[]
[]
[]
[]
[]
[]
[]
[]
[]
[]
[]
[]
[]
[]
[]
[]
[]
[]
[]
[]
[]
[]
[]
[]
[]
[]
[]
[]
[]
[]
[]
[]
[]
[]
[]
[]
[]
[]
[]
[]
[]
[]
[]
[]
[]
[]
[]
[]
[]
[]
[]
[]
[]
[]
[]
[]
[]
[]
[]
[]
[]
[]
[]
[]
[]
[]
[]
[]
[]
[]
[]
[]
[]
[]
[]
[]
[]
[]
[]
[]
[]
[]
[]
[]
[]
[]
[]
[]
[]
[]
[]
[]
[]
[]
[]
[]
[]
[]
[]
[]
[]
[]
[]
[]
[]
[]
[]
[]
[]
[]
[]
[]
[]
[]
[]
[]
[]
[]
[]
[]
[]
[]
[]
[]
[]
[]
[]
[]
[]
[]
[]
[]
[]
[]
[]
[]
[]
[]
[]
[]
[]
[]
[]
[]
[]
[]
[]
[]
[]
[]
[]
[]
[]
[]
[]
[]
[]
[]
[]
[]
[]
[]
[]
[]
[]
[]
[]
[]
[]
[]
[]
[]
[]
[]
[]
[]
[]
[]
[]
[]
[]
[]
[]
[]
[]
[]
[]
[]
[]
[]
[]
[]
[]
[]
[]
[]
[]
[]
[]
[]
[]
[]
[]
[]
[]
[]
[]
[]
[]
[]
[]
[]
[]
[]
[]
[]
[]
[]
[]
[]
[]
[]
[]
[]
[]
[]
[]
[]
[]
[]
[]
[]
[]
[]
[]
[]
[]
[]
[]
[]
[]
[]
[]
[]
[]
[]
[]
[]
[]
[]
[]
[]
[]
[]
[]
[]
[]
[]
[]
[]
[]
[]
[]
[]
[]
[]
[]
[]
[]
[]
[]
[]
[]
[]
[]
[]
[]
[]
[]
[]
[]
[]
[]
[]
[]
[]
[]
[]
[]
[]
[]
[]
[]
[]
[]
[]
[]
[]
[]
[]
[]
[]
[]
[]
[]
[]
[]
[]
[]
[]
[]
[]
[]
[]
[]
[]
[]
[]
[]
[]
[]
[]
[]
[]
[]
[]
[]
[]
[]
[]
[]
[]
[]
[]
[]
[]
[]
[]
[]
[]
[]
[]
[]
[]
[]
[]
[]
[]
[]
[]
[]
[]
[]
[]
[]
[]
[]
[]
[]
[]
[]
[]
[]
[]
[]
[]
[]
[]
[]
[]
[]
[]
[]
[]
[]
[]
[]
[]
[]
[]
[]
[]
[]
[]
[]
[]
[]
[]
[]
[]
[]
[]
[]
[]
[]
[]
[]
[]
[]
[]
[]
[]
[]
[]
[]
[]
[]
[]
[]
[]
[]
[]
[]
[]
[]
[]
[]
[]
[]
[]
[]
[]
[]
[]
[]
[]
[]
[]
[]
[]
[]
[]
[]
[]
[]
[]
[]
[]
[]
[]
[]
[]
[]
[]
[]
[]
[]
[]
[]
[]
[]
[]
[]
[]
[]
[]
[]
[]
[]
[]
[]
[]
[]
[]
[]
[]
[]
[]
[]
[]
[]
[]
[]
[]
[]
[]
[]
[]
[]
[]
[]
[]
[]
[]
[]
[]
[]
[]
[]
[]
[]
[]
[]
[]
[]
[]
[]
[]
[]
[]
[]
[]
[]
[]
[]
[]
[]
[]
[]
[]
[]
[]
[]
[]
[]
[]
[]
[]
[]
[]
[]
[]
[]
[]
[]
[]
[]
[]
[]
[]
[]
[]
[]
[]
[]
[]
[]
[]
[]
[]
[]
[]
[]
[]
[]
[]
[]
[]
[]
[]
[]
[]
[]
[]
[]
[]
[]
[]
[]
[]
[]
[]
[]
[]
[]
[]
[]
[]
[]
[]
[]
[]
[]
[]
[]
[]
[]
[]
[]
[]
[]
[]
[]
[]
[]
[]
[]
[]
[]
[]
[]
[]
[]
[]
[]
[]
[]
[]
[]
[]
[]
[]
[]
[]
[]
[]
[]
[]
[]
[]
[]
[]
[]
[]
[]
[]
[]
[]
[]
[]
[]
[]
[]
[]
[]
[]
[]
[]
[]
[]
[]
[]
[]
[]
[]
[]
[]
[]
[]
[]
[]
[]
[]
[]
[]
[]
[]
[]
[]
[]
[]
[]
[]
[]
[]
[]
[]
[]
[]
[]
[]
[]
[]
[]
[]
[]
[]
[]
[]
[]
[]
[]
[]
[]
[]
[]
[]
[]
[]
[]
[]
[]
[]
[]
[]
[]
[]
[]
[]
[]
[]
[]
[]
[]
[]
[]
[]
[]
[]
[]
[]
[]
[]
[]
[]
[]
[]
[]
[]
[]
[]
[]
[]
[]
[]
[]
[]
[]
[]
[]
[]
[]
[]
[]
[]
[]
[]
[]
[]
[]
[]
[]
[]
[]
[]
[]
[]
[]
[]
[]
[]
[]
[]
[]
[]
[]
[]
[]
[]
[]
[]
[]
[]
[]
[]
[]
[]
[]
[]
[]
[]
[]
[]
[]
[]
[]
[]
[]
[]
[]
[]
[]
[]
[]
[]
[]
[]
[]
[]
[]
[]
[]
[]
[]
[]
[]
[]
[]
[]
[]
[]
[]
[]
[]
[]
[]
[]
[]
[]
[]
[]
[]
[]
[]
[]
[]
[]
[]
[]
[]
[]
[]
[]
[]
[]
[]
[]
[]
[]
[]
[]
[]
[]
[]
[]
[]
[]
[]
[]
[]
[]
[]
[]
[]
[]
[]
[]
[]
[]
[]
[]
[]
[]
[]
[]
[]
[]
[]
[]
[]
[]
[]
[]
[]
[]
[]
[]
[]
[]
[]
[]
[]
[]
[]
[]
[]
[]
[]
[]
[]
[]
[]
[]
[]
[]
[]
[]
[]
[]
[]
[]
[]
[]
[]
[]
[]
[]
[]
[]
[]
[]
[]
[]
[]
[]
[]
[]
[]
[]
[]
[]
[]
[]
[]
[]
[]
[]
[]
[]
[]
[]
[]
[]
[]
[]
[]
[]
[]
[]
[]
[]
[]
[]
[]
[]
[]
[]
[]
[]
[]
[]
[]
[]
[]
[]
[]
[]
[]
[]
[]
[]
[]
[]
[]
[]
[]
[]
[]
[]
[]
[]
[]
[]
[]
[]
[]
[]
[]
[]
[]
[]
[]
[]
[]
[]
[]
[]
[]
[]
[]
[]
[]
[]
[]
[]
[]
[]
[]
[]
[]
[]
[]
[]
[]
[]
[]
[]
[]
[]
[]
[]
[]
[]
[]
[]
[]
[]
[]
[]
[]
[]
[]
[]
[]
[]
[]
[]
[]
[]
[]
[]
[]
[]
[]
[]
[]
[]
[]
[]
[]
[]
[]
[]
[]
[]
[]
[]
[]
[]
[]
[]
[]
[]
[]
[]
[]
[]
[]
[]
[]
[]
[]
[]
[]
[]
[]
[]
[]
[]
[]
[]
[]
[]
[]
[]
[]
[]
[]
[]
[]
[]
[]
[]
[]
[]
[]
[]
[]
[]
[]
[]
[]
[]
[]
[]
[]
[]
[]
[]
[]
[]
[]
[]
[]
[]
[]
[]
[]
[]
[]
[]
[]
[]
[]
[]
[]
[]
[]
[]
[]
[]
[]
[]
[]
[]
[]
[]
[]
[]
[]
[]
[]
[]
[]
[]
[]
[]
[]
[]
[]
[]
[]
[]
[]
[]
[]
[]
[]
[]
[]
[]
[]
[]
[]
[]
[]
[]
[]
[]
[]
[]
[]
[]
[]
[]
[]
[]
[]
[]
[]
[]
[]
[]
[]
[]
[]
[]
[]
[]
[]
[]
[]
[]
[]
[]
[]
[]
[]
[]
[]
[]
[]
[]
[]
[]
[]
[]
[]
[]
[]
[]
[]
[]
[]
[]
[]
[]
[]
[]
[]
[]
[]
[]
[]
[]
[]
[]
[]
[]
[]
[]
[]
[]
[]
[]
[]
[]
[]
[]
[]
[]
[]
[]
[]
[]
[]
[]
[]
[]
[]
[]
[]
[]
[]
[]
[]
[]
[]
[]
[]
[]
[]
[]
[]
[]
[]
[]
[]
[]
[]
[]
[]
[]
[]
[]
[]
[]
[]
[]
[]
[]
[]
[]
[]
[]
[]
[]
[]
[]
[]
[]
[]
[]
[]
[]
[]
[]
[]
[]
[]
[]
[]
[]
[]
[]
[]
[]
[]
[]
[]
[]
[]
[]
[]
[]
[]
[]
[]
[]
[]
[]
[]
[]
[]
[]
[]
[]
[]
[]
[]
[]
[]
[]
[]
[]
[]
[]
[]
[]
[]
[]
[]
[]
[]
[]
[]
[]
[]
[]
[]
[]
[]
[]
[]
[]
[]
[]
[]
[]
[]
[]
[]
[]
[]
[]
[]
[]
[]
[]
[]
[]
[]
[]
[]
[]
[]
[]
[]
[]
[]
[]
[]
[]
[]
[]
[]
[]
[]
[]
[]
[]
[]
[]
[]
[]
[]
[]
[]
[]
[]
[]
[]
[]
[]
[]
[]
[]
[]
[]
[]
[]
[]
[]
[]
[]
[]
[]
[]
[]
[]
[]
[]
[]
[]
[]
[]
[]
[]
[]
[]
[]
[]
[]
[]
[]
[]
[]
[]
[]
[]
[]
[]
[]
[]
[]
[]
[]
[]
[]
[]
[]
[]
[]
[]
[]
[]
[]
[]
[]
[]
[]
[]
[]
[]
[]
[]
[]
[]
[]
[]
[]
[]
[]
[]
[]
[]
[]
[]
[]
[]
[]
[]
[]
[]
[]
[]
[]
[]
[]
[]
[]
[]
[]
[]
[]
[]
[]
[]
[]
[]
[]
[]
[]
[]
[]
[]
[]
[]
[]
[]
[]
[]
[]
[]
[]
[]
[]
[]
[]
[]
[]
[]
[]
[]
[]
[]
[]
[]
[]
[]
[]
[]
[]
[]
[]
[]
[]
[]
[]
[]
[]
[]
[]
[]
[]
[]
[]
[]
[]
[]
[]
[]
[]
[]
[]
[]
[]
[]
[]
[]
[]
[]
[]
[]
[]
[]
[]
[]
[]
[]
[]
[]
[]
[]
[]
[]
[]
[]
[]
[]
[]
[]
[]
[]
[]
[]
[]
[]
[]
[]
[]
[]
[]
[]
[]
[]
[]
[]
[]
[]
[]
[]
[]
[]
[]
[]
[]
[]
[]
[]
[]
[]
[]
[]
[]
[]
[]
[]
[]
[]
[]
[]
[]
[]
[]
[]
[]
[]
[]
[]
[]
[]
[]
[]
[]
[]
[]
[]
[]
[]
[]
[]
[]
[]
[]
[]
[]
[]
[]
[]
[]
[]
[]
[]
[]
[]
[]
[]
[]
[]
[]
[]
[]
[]
[]
[]
[]
[]
[]
[]
[]
[]
[]
[]
[]
[]
[]
[]
[]
[]
[]
[]
[]
[]
[]
[]
[]
[]
[]
[]
[]
[]
[]
[]
[]
[]
[]
[]
[]
[]
[]
[]
[]
[]
[]
[]
[]
[]
[]
[]
[]
[]
[]
[]
[]
[]
[]
[]
[]
[]
[]
[]
[]
[]
[]
[]
[]
[]
[]
[]
[]
[]
[]
[]
[]
[]
[]
[]
[]
[]
[]
[]
[]
[]
[]
[]
[]
[]
[]
[]
[]
[]
[]
[]
[]
[]
[]
[]
[]
[]
[]
[]
[]
[]
[]
[]
[]
[]
[]
[]
[]
[]
[]
[]
[]
[]
[]
[]
[]
[]
[]
[]
[]
[]
[]
[]
[]
[]
[]
[]
[]
[]
[]
[]
[]
[]
[]
[]
[]
[]
[]
[]
[]
[]
[]
[]
[]
[]
[]
[]
[]
[]
[]
[]
[]
[]
[]
[]
[]
[]
[]
[]
[]
[]
[]
[]
[]
[]
[]
[]
[]
[]
[]
[]
[]
[]
[]
[]
[]
[]
[]
[]
[]
[]
[]
[]
[]
[]
[]
[]
[]
[]
[]
[]
[]
[]
[]
[]
[]
[]
[]
[]
[]
[]
[]
[]
[]
[]
[]
[]
[]
[]
[]
[]
[]
[]
[]
[]
[]
[]
[]
[]
[]
[]
[]
[]
[]
[]
[]
[]
[]
[]
[]
[]
[]
[]
[]
[]
[]
[]
[]
[]
[]
[]
[]
[]
[]
[]
[]
[]
[]
[]
[]
[]
[]
[]
[]
[]
[]
[]
[]
[]
[]
[]
[]
[]
[]
[]
[]
[]
[]
[]
[]
[]
[]
[]
[]
[]
[]
[]
[]
[]
[]
[]
[]
[]
[]
[]
[]
[]
[]
[]
[]
[]
[]
[]
[]
[]
[]
[]
[]
[]
[]
[]
[]
[]
[]
[]
[]
[]
[]
[]
[]
[]
[]
[]
[]
[]
[]
[]
[]
[]
[]
[]
[]
[]
[]
[]
[]
[]
[]
[]
[]
[]
[]
[]
[]
[]
[]
[]
[]
[]
[]
[]
[]
[]
[]
[]
[]
[]
[]
[]
[]
[]
[]
[]
[]
[]
[]
[]
[]
[]
[]
[]
[]
[]
[]
[]
[]
[]
[]
[]
[]
[]
[]
[]
[]
[]
[]
[]
[]
[]
[]
[]
[]
[]
[]
[]
[]
[]
[]
[]
[]
[]
[]
[]
[]
[]
[]
[]
[]
[]
[]
[]
[]
[]
[]
[]
[]
[]
[]
[]
[]
[]
[]
[]
[]
[]
[]
[]
[]
[]
[]
[]
[]
[]
[]
[]
[]
[]
[]
[]
[]
[]
[]
[]
[]
[]
[]
[]
[]
[]
[]
[]
[]
[]
[]
[]
[]
[]
[]
[]
[]
[]
[]
[]
[]
[]
[]
[]
[]
[]
[]
[]
[]
[]
[]
[]
[]
[]
[]
[]
[]
[]
[]
[]
[]
[]
[]
[]
[]
[]
[]
[]
[]
[]
[]
[]
[]
[]
[]
[]
[]
[]
[]
[]
[]
[]
[]
[]
[]
[]
[]
[]
[]
[]
[]
[]
[]
[]
[]
[]
[]
[]
[]
[]
[]
[]
[]
[]
[]
[]
[]
[]
[]
[]
[]
[]
[]
[]
[]
[]
[]
[]
[]
[]
[]
[]
[]
[]
[]
[]
[]
[]
[]
[]
[]
[]
[]
[]
[]
[]
[]
[]
[]
[]
[]
[]
[]
[]
[]
[]
[]
[]
[]
[]
[]
[]
[]
[]
[]
[]
[]
[]
[]
[]
[]
[]
[]
[]
[]
[]
[]
[]
[]
[]
[]
[]
[]
[]
[]
[]
[]
[]
[]
[]
[]
[]
[]
[]
[]
[]
[]
[]
[]
[]
[]
[]
[]
[]
[]
[]
[]
[]
[]
[]
[]
[]
[]
[]
[]
[]
[]
[]
[]
[]
[]
[]
[]
[]
[]
[]
[]
[]
[]
[]
[]
[]
[]
[]
[]
[]
[]
[]
[]
[]
[]
[]
[]
[]
[]
[]
[]
[]
[]
[]
[]
[]
[]
[]
[]
[]
[]
[]
[]
[]
[]
[]
[]
[]
[]
[]
[]
[]
[]
[]
[]
[]
[]
[]
[]
[]
[]
[]
[]
[]
[]
[]
[]
[]
[]
[]
[]
[]
[]
[]
[]
[]
[]
[]
[]
[]
[]
[]
[]
[]
[]
[]
[]
[]
[]
[]
[]
[]
[]
[]
[]
[]
[]
[]
[]
[]
[]
[]
[]
[]
[]
[]
[]
[]
[]
[]
[]
[]
[]
[]
[]
[]
[]
[]
[]
[]
[]
[]
[]
[]
[]
[]
[]
[]
[]
[]
[]
[]
[]
[]
[]
[]
[]
[]
[]
[]
[]
[]
[]
[]
[]
[]
[]
[]
[]
[]
[]
[]
[]
[]
[]
[]
[]
[]
[]
[]
[]
[]
[]
[]
[]
[]
[]
[]
[]
[]
[]
[]
[]
[]
[]
[]
[]
[]
[]
[]
[]
[]
[]
[]
[]
[]
[]
[]
[]
[]
[]
[]
[]
[]
[]
[]
[]
[]
[]
[]
[]
[]
[]
[]
[]
[]
[]
[]
[]
[]
[]
[]
[]
[]
[]
[]
[]
[]
[]
[]
[]
[]
[]
[]
[]
[]
[]
[]
[]
[]
[]
[]
[]
[]
[]
[]
[]
[]
[]
[]
[]
[]
[]
[]
[]
[]
[]
[]
[]
[]
[]
[]
[]
[]
[]
[]
[]
[]
[]
[]
[]
[]
[]
[]
[]
[]
[]
[]
[]
[]
[]
[]
[]
[]
[]
[]
[]
[]
[]
[]
[]
[]
[]
[]
[]
[]
[]
[]
[]
[]
[]
[]
[]
[]
[]
[]
[]
[]
[]
[]
[]
[]
[]
[]
[]
[]
[]
[]
[]
[]
[]
[]
[]
[]
[]
[]
[]
[]
[]
[]
[]
[]
[]
[]
[]
[]
[]
[]
[]
[]
[]
[]
[]
[]
[]
[]
[]
[]
[]
[]
[]
[]
[]
[]
[]
[]
[]
[]
[]
[]
[]
[]
[]
[]
[]
[]
[]
[]
[]
[]
[]
[]
[]
[]
[]
[]
[]
[]
[]
[]
[]
[]
[]
[]
[]
[]
[]
[]
[]
[]
[]
[]
[]
[]
[]
[]
[]
[]
[]
[]
[]
[]
[]
[]
[]
[]
[]
[]
[]
[]
[]
[]
[]
[]
[]
[]
[]
[]
[]
[]
[]
[]
[]
[]
[]
[]
[]
[]
[]
[]
[]
[]
[]
[]
[]
[]
[]
[]
[]
[]
[]
[]
[]
[]
[]
[]
[]
[]
[]
[]
[]
[]
[]
[]
[]
[]
[]
[]
[]
[]
[]
[]
[]
[]
[]
[]
[]
[]
[]
[]
[]
[]
[]
[]
[]
[]
[]
[]
[]
[]
[]
[]
[]
[]
[]
[]
[]
[]
[]
[]
[]
[]
[]
[]
[]
[]
[]
[]
[]
[]
[]
[]
[]
[]
[]
[]
[]
[]
[]
[]
[]
[]
[]
[]
[]
[]
[]
[]
[]
[]
[]
[]
[]
[]
[]
[]
[]
[]
[]
[]
[]
[]
[]
[]
[]
[]
[]
[]
[]
[]
[]
[]
[]
[]
[]
[]
[]
[]
[]
[]
[]
[]
[]
[]
[]
[]
[]
[]
[]
[]
[]
[]
[]
[]
[]
[]
[]
[]
[]
[]
[]
[]
[]
[]
[]
[]
[]
[]
[]
[]
[]
[]
[]
[]
[]
[]
[]
[]
[]
[]
[]
[]
[]
[]
[]
[]
[]
[]
[]
[]
[]
[]
[]
[]
[]
[]
[]
[]
[]
[]
[]
[]
[]
[]
[]
[]
[]
[]
[]
[]
[]
[]
[]
[]
[]
[]
[]
[]
[]
[]
[]
[]
[]
[]
[]
[]
[]
[]
[]
[]
[]
[]
[]
[]
[]
[]
[]
[]
[]
[]
[]
[]
[]
[]
[]
[]
[]
[]
[]
[]
[]
[]
[]
[]
[]
[]
[]
[]
[]
[]
[]
[]
[]
[]
[]
[]
[]
[]
[]
[]
[]
[]
[]
[]
[]
[]
[]
[]
[]
[]
[]
[]
[]
[]
[]
[]
[]
[]
[]
[]
[]
[]
[]
[]
[]
[]
[]
[]
[]
[]
[]
[]
[]
[]
[]
[]
[]
[]
[]
[]
[]
[]
[]
[]
[]
[]
[]
[]
[]
[]
[]
[]
[]
[]
[]
[]
[]
[]
[]
[]
[]
[]
[]
[]
[]
[]
[]
[]
[]
[]
[]
[]
[]
[]
[]
[]
[]
[]
[]
[]
[]
[]
[]
[]
[]
[]
[]
[]
[]
[]
[]
[]
[]
[]
[]
[]
[]
[]
[]
[]
[]
[]
[]
[]
[]
[]
[]
[]
[]
[]
[]
[]
[]
[]
[]
[]
[]
[]
[]
[]
[]
[]
[]
[]
[]
[]
[]
[]
[]
[]
[]
[]
[]
[]
[]
[]
[]
[]
[]
[]
[]
[]
[]
[]
[]
[]
[]
[]
[]
[]
[]
[]
[]
[]
[]
[]
[]
[]
[]
[]
[]
[]
[]
[]
[]
[]
[]
[]
[]
[]
[]
[]
[]
[]
[]
[]
[]
[]
[]
[]
[]
[]
[]
[]
[]
[]
[]
[]
[]
[]
[]
[]
[]
[]
[]
[]
[]
[]
[]
[]
[]
[]
[]
[]
[]
[]
[]
[]
[]
[]
[]
[]
[]
[]
[]
[]
[]
[]
[]
[]
[]
[]
[]
[]
[]
[]
[]
[]
[]
[]
[]
[]
[]
[]
[]
[]
[]
[]
[]
[]
[]
[]
[]
[]
[]
[]
[]
[]
[]
[]
[]
[]
[]
[]
[]
[]
[]
[]
[]
[]
[]
[]
[]
[]
[]
[]
[]
[]
[]
[]
[]
[]
[]
[]
[]
[]
[]
[]
[]
[]
[]
[]
[]
[]
[]
[]
[]
[]
[]
[]
[]
[]
[]
[]
[]
[]
[]
[]
[]
[]
[]
[]
[]
[]
[]
[]
[]
[]
[]
[]
[]
[]
[]
[]
[]
[]
[]
[]
[]
[]
[]
[]
[]
[]
[]
[]
[]
[]
[]
[]
[]
[]
[]
[]
[]
[]
[]
[]
[]
[]
[]
[]
[]
[]
[]
[]
[]
[]
[]
[]
[]
[]
[]
[]
[]
[]
[]
[]
[]
[]
[]
[]
[]
[]
[]
[]
[]
[]
[]
[]
[]
[]
[]
[]
[]
[]
[]
[]
[]
[]
[]
[]
[]
[]
[]
[]
[]
[]
[]
[]
[]
[]
[]
[]
[]
[]
[]
[]
[]
[]
[]
[]
[]
[]
[]
[]
[]
[]
[]
[]
[]
[]
[]
[]
[]
[]
[]
[]
[]
[]
[]
[]
[]
[]
[]
[]
[]
[]
[]
[]
[]
[]
[]
[]
[]
[]
[]
[]
[]
[]
[]
[]
[]
[]
[]
[]
[]
[]
[]
[]
[]
[]
[]
[]
[]
[]
[]
[]
[]
[]
[]
[]
[]
[]
[]
[]
[]
[]
[]
[]
[]
[]
[]
[]
[]
[]
[]
[]
[]
[]
[]
[]
[]
[]
[]
[]
[]
[]
[]
[]
[]
[]
[]
[]
[]
[]
[]
[]
[]
[]
[]
[]
[]
[]
[]
[]
[null,null,null,null,null,null,null,null,null,null,null,null,"13-5500"]
[null,null,null,null,null,null,null,null,null,null,null,null,"13-5501"]

{"sheet":"modèle","index":4,"n_rows":47,"n_cols":13,"rows_kept":47,"cut":false,"hidden":false,"merged":[[46,3,48,3],[46,4,48,4],[46,5,48,5],[46,1,48,1],[5,4,5,5],[6,4,6,5],[7,4,7,5],[8,4,8,5],[9,4,9,5],[10,4,10,5],[11,4,11,5],[33,0,33,3],[38,0,38,5],[39,0,39,5],[41,4,41,5],[0,0,0,5],[0,7,1,9],[1,0,1,5],[2,0,2,5],[3,0,3,5],[3,7,3,8]]}
["Ville de Saint-Lin-Laurentides",null,null,null,null,null,null,"CHOISIR VOTRE CODE DANS LA COLONNE BLEU SELON LA DÉPENSE",null,null,"LISTE DES RÉQUISITIONS"]
["900, 12e avenue",null,null,null,null,null,null,null,null,null,null,"Novembre",2017]
["Saint-Lin-Laurentides (Québec) J5M 2W2",null,null,null,null,null,null,null,null,null,null,"Décembre",2018]
["Tél. : (450) 439-3130  -  Fax : (450) 439-1525",null,null,null,null,null,null,"DESCRIPTIONS GRAND LIVRE",null,"CODE G/L"]
[]
[null,null,null,"Mois","Novembre",null,null,1]
["Fournisseur ",{"$f":"'LISTE DES RÉQUISITIONS'!J15","v":"COOP PROFID'OR"},null,"Année",2017,null,null,2,"DEPLACEMENTS CONGRES","02-13000-310"]
[null,null,null,"Réquisition",{"$f":"'LISTE DES RÉQUISITIONS'!B15","v":"13-5500"},null,null,3,"FRAIS DE POSTE","02-13000-321"]
["Adresse ",null,null,"Date ",{"$f":"'LISTE DES RÉQUISITIONS'!A15","v":"2017-11-01"},null,null,4,"COURRIER SPECIAL","02-13000-322"]
[null,null,null,"Département ",{"$f":"'LISTE DES RÉQUISITIONS'!F15","v":"Administration"},null,null,5,"TELEPHONE ET TELEAVERTISSEUR","02-13000-331"]
[null,null,null,"Préparée par",{"$f":"'LISTE DES RÉQUISITIONS'!D15","v":"Lyna Thériault"},null,null,6,"FRAIS DE PUBLICATION","02-13000-345"]
["Téléphone ",null,null,"No fournisseur ",{"$f":"'LISTE DES RÉQUISITIONS'!K15","v":"C27300"},null,null,7,"PUBLICITE","02-13000-349"]
[null,null,null,null,null,null,null,8,"SERVICES JURIDIQUES","02-13000-412"]
["Nb","Description matériel","C","# Code GL","Prix à l’unité","Total",null,9,"COMPTABILITE VERIFICATION","02-13000-413"]
[null,{"$f":"'LISTE DES RÉQUISITIONS'!L15","v":"DIVERS POUR DÉCO DE NOËL"},1,{"$f":"CHOOSE(C15,\" \",$J$7,$J$8,$J$9,$J$10,$J$11,$J$12,$J$13,$J$14,$J$15,$I$16,$J$17,$J$18,$J$19,$J$20,$J$21,$J$22,$J$23,$J$24,$J$25,$J$26,$J$27,$J$28,$J$29,$J$30,$J$31,$J$32,$J$33,$J$34,$J$35)","v":" "},null,{"$f":"SUM(A15*E15)","v":0},null,10,"SERVICE TECHNIQUE INFORMATIQUE","02-13000-452"]
[null,null,1," ",null,{"$f":"SUM(A16*E16)","v":0},null,11,"FORMATION","02-13000-454"]
[null,null,1,{"$f":"CHOOSE(C17,\" \",$J$7,$J$8,$J$9,$J$10,$J$11,$J$12,$J$13,$J$14,$J$15,$I$16,$J$17,$J$18,$J$19,$J$20,$J$21,$J$22,$J$23,$J$24,$J$25,$J$26,$J$27,$J$28,$J$29,$J$30,$J$31,$J$32,$J$33,$J$34,$J$35)","v":" "},null,0,null,12,"RECEPTION","02-13000-493"]
[null,null,1,{"$f":"CHOOSE(C18,\" \",$J$7,$J$8,$J$9,$J$10,$J$11,$J$12,$J$13,$J$14,$J$15,$I$16,$J$17,$J$18,$J$19,$J$20,$J$21,$J$22,$J$23,$J$24,$J$25,$J$26,$J$27,$J$28,$J$29,$J$30,$J$31,$J$32,$J$33,$J$34,$J$35)","v":" "},null,0,null,13,"COTISATION ASSOCIATION ABONNEMENT","02-13000-494"]
[null,null,1," ",null,0,null,14,"LOCATION MATERIEL EQUIPEMENT","02-13000-517"]
[null,null,1," ",null,0,null,15,"ENTRETIEN BÂTIMENTS ADMINIST.","02-13000-522"]
[null,null,1," ",null,0,null,16,"ENT. REP. EQUIPEMENT BUREAU","02-13000-527"]
[null,null,1," ",null,0,null,17,"ALIMENT, REPAS","02-13000-610"]
[null,null,1," ",null,0,null,18,"FOURNITURE DE BUREAU","02-13000-670"]
[null,null,1," ",null,0,null,19,"FOURNITURES ET LOGICIEL","02-13000-671"]
[null,null,1," ",null,{"$f":"SUM(A25*E25)","v":0},null,20,"ELECTRICITE","02-13000-681"]
[null,null,1,{"$f":"CHOOSE(C26,\" \",$J$7,$J$8,$J$9,$J$10,$J$11,$J$12,$J$13,$J$14,$J$15,$J$16,$J$17,$J$18,$J$19,$J$20,$J$21,$J$22,$J$23,$J$24,$J$25,$J$26,$J$27,$J$28,$J$29,$J$30,$J$31,$J$32,$J$33,$J$34,$J$35)","v":" "},null,0,null,21,"GAZ NATUREL EDIFICES MUNICIPAULT","02-13000-682"]
[null,null,1," ",null,0,null,22,"TOURNOI DE GOLF","02-13000-698"]
[null,null,1," ",null,0,null,23,"DEPENSES DIVERSES","02-13000-699"]
[null,null,1," ",null,{"$f":"SUM(A29*E29)","v":0},null,24,"IMPUTER DANS LA VOIRIE","VOIRIE"]
[null,null,1," ",null,{"$f":"SUM(A30*E30)","v":0},null,25,"IMPUTER DANS LES LOISIRS","LOISIRS"]
[null,null,1," ",null,0,null,26,"IMPUTER DANS LA PISCINE","PISCINE"]
[null,null,1," ",null,0,null,27,"IMPUTER DANS L'URBANISME","URBANISME"]
[null,null,1," ",null,0,null,28,"IMPUTER DANS L'INCENDIE","INCENDIE"]
[null,null,null,null,"Sous-total",{"$f":"SUM(F15:F33)","v":0},null,29,"NE TROUVE PAS","NE TROUVE PAS"]
["Requis par :     ",{"$f":"'LISTE DES RÉQUISITIONS'!H15","v":"André Paquin"},null,null,"T.P.S.",{"$f":"SUM(F34*5%)","v":0},null,30,"AUTRES","AUTRES"]
[null,null,null,null,"T.V.Q.",{"$f":"SUM(F34*9.975%)","v":0}]
["Approuvé par :  ",null,null,null,"Grand total",{"$f":"SUM(F34+F35+F36)","v":0}]
[]
["CERTIFICAT DE FONDS DISPONIBLES POUR DÉPENSE PROJETÉE"]
["Je, soussigné, certifie par les présentes, qu’il y a des fonds disponibles pour les fins auxquelles la dépense ci-dessus décrite est projetée par le Conseil."]
[]
["Directeur Des Finances:",null,null,"Date:",{"$f":"NOW()","v":"2017-11-03T22:43:09.100"}]
[]
[]
[]
[null,null,null,"Saisie excel","Comptabilisé","Initiale"]
[null,"SECTION RÉSERVÉ AUX FINANCES"]