{"text_format":"1","workbook":"xlsx","n_sheets":5,"sheets":["DESC.GL","GRAND LIVRE","FOURNISSEURS","LISTE DES RÉQUISITIONS","modèle"],"not_rendered":{"charts":0,"images":0,"macros":1,"external_links":0,"defined_names":3,"comments":1,"pivot_tables":0},"unopened":[],"bounds":{"document_bytes":16777216,"sheet_cells":100000,"rows_first":2000,"rows_last":500,"rows_between":2000,"halvings":0,"cell_chars":16384,"cell_head_chars":4096},"cells_cut":0,"cells_raw":0,"read":"whole","date_system":"1900"}

{"sheet":"DESC.GL","index":0,"n_rows":310,"n_cols":3,"rows_kept":310,"cut":false,"hidden":false,"merged":[[154,0,154,1],[1,0,1,1],[42,0,42,1],[46,0,46,1],[63,0,63,1],[87,0,87,1],[92,0,92,1],[99,0,99,1],[112,0,112,1],[119,0,119,1],[130,0,130,1],[139,0,139,1],[223,0,223,1],[233,0,233,1],[235,0,235,1],[246,0,246,1],[169,0,169,1],[179,0,179,1],[187,0,187,1],[190,0,190,1],[202,0,202,1],[207,0,207,1]]}
["01 23470 000","RECETTES LOISIRS"]
["ADMIN"]
["02 11000 130","REMUNERATION MAIRE CONSEILLERS"]
["02 11000 133","ALLOCATION DEPENSES CONSEIL"]
["02 11000 211","FONDS PENSION (CARRA)"]
["02 11000 310","FRAIS REPRESENTATION  CONSEIL"]
["02 11000 454","FORMATION"]
["02 13000 141","REMUNERATION ADMINISTRATION"]
["02 13000 142","TEMPS SUPPLEMENTAIRE"]
["02 13000 143","INDEMNITES, PRIMES, ALLOCATION"]
["02 13000 212","FONDS PENSION"]
["02 13000 232","ASSURANCE EMPLOI"]
["02 13000 281","ASSURANCE COLLECTIVE"]
["02 13000 310","DEPLACEMENTS CONGRES"]
["02 13000 321","FRAIS DE POSTE"]
["02 13000 322","COURRIER SPECIAL"]
["02 13000 331","TELEPHONE ET TELEAVERTISSEUR"]
["02 13000 345","FRAIS DE PUBLICATION"]
["02 13000 349","PUBLICITE"]
["02 13000 412","SERVICES JURIDIQUES"]
["02 13000 413","COMPTABILITE VERIFICATION"]
["02 13000 452","SERVICE TECHNIQUE INFORMATIQUE"]
["02 13000 454","FORMATION"]
["02 13000 493","RECEPTION"]
["02 13000 494","COTISATION ASSOCIATION ABONNEM"]
["02 13000 517","LOCATION MATERIEL EQUIPEMENT"]
["02 13000 522","ENTRETIEN BÂTIMENTS ADMINIST."]
["02 13000 527","ENT. REP. EQUIPEMENT BUREAU"]
["02 13000 610","ALIMENT, REPAS"]
["02 13000 670","FOURNITURE DE BUREAU"]
["02 13000 671","FOURNITURES ET LOGICIEL"]
["02 13000 681","ELECTRICITE"]
["02 13000 682","GAZ NATUREL EDIFICES MUNICIPAU"]
["02 13000 698","TOURNOI DE GOLF"]
["02 13000 699","DEPENSES DIVERSES"]
["02 13000 940","MAUVAISE CREANCE"]
["02 13000 951","QUOTE PART MRC ADM"]
["02 13000 995","RECLAMATION DOMMAGE INTERET"]
["02 13000 999","NATALITE"]
["02 13001 698","FETE DE LA ST-JEAN"]
["02 13001 999","NOUVEAUX PROPRIETAIRES"]
["02 13002 999","SUBVENTION COUCHES"]
["ÉLECTION"]
["02 14000 141","REMUNERATION ELECTION"]
["02 14000 454","FORMATION ELECTION"]
["02 14000 699","DEPENSES DIVERSES ELECTION"]
["INCENDIE"]
["02 22000 310","FRAIS DE DEPLACEMENT"]
["02 22000 331","TELEPHONE ET TELEAVERTISSEURS"]
["02 22000 454","FORMATION"]
["02 22000 516","LOCATION MATERIEL EQUIPEMENT"]
["02 22000 525","MATERIEL ROULANT REPARATION",22150]
["02 22000 526","ENTRETIEN ET REPARATION EQUIPE",22250]
["02 22000 610","REPAS INCENDIE",22350]
["02 22000 629","DEPENSES DIVERSES",22850]
["02 22000 631","ESSENCE"]
["02 22000 639","ENTRAIDE MUNICIPALE"]
["02 22000 650","VETEMENT CHAUSSURES"]
["02 22000 670","FOURNITURE DE BUREAU"]
["02 22000 681","ELECTRICITE"]
{"$rows_left_out":251}
{"sheet":"GRAND LIVRE","index":1,"n_rows":294,"n_cols":2,"rows_kept":294,"cut":false,"hidden":true,"merged":[[211,0,211,1],[231,0,231,1],[242,0,242,1],[244,0,244,1],[257,0,257,1],[206,0,206,1],[100,0,100,1],[113,0,113,1],[122,0,122,1],[133,0,133,1],[144,0,144,1],[154,0,154,1],[159,0,159,1],[174,0,174,1],[183,0,183,1],[191,0,191,1],[194,0,194,1],[92,0,92,1],[0,0,0,1],[35,0,35,1],[42,0,42,1],[61,0,61,1],[87,0,87,1]]}
["ADMIN"]
[]
["02-13000-331","TELEPHONE ET TELEAVERTISSEUR"]
["02-13000-345","FRAIS DE PUBLICATION"]
["02-13000-349","PUBLICITE"]
["02-13000-412","SERVICES JURIDIQUES"]
["02-13000-454","FORMATION"]
["02-13000-414","SERVICE DE PAIE"]
["02-13000-416","RESSOURCES HUMAINES"]
["02-13000-422","ASSURANCE COMBINEE"]
["02-13000-493","RECEPTION"]
["02-13000-494","COTISATION ASSOCIATION ABONNEMENT"]
["02-13000-517","LOCATION MATERIEL EQUIPEMENT"]
["02-13000-522","ENTRETIEN BÂTIMENTS ADMINIST."]
["02-13000-527","ENT. REP. EQUIPEMENT BUREAU"]
["02-13000-610","ALIMENT, REPAS"]
["02-13000-670","FOURNITURE DE BUREAU"]
["02-13000-671","FOURNITURES ET LOGICIEL"]
["02-13000-681","ELECTRICITE"]
["02-13000-682","GAZ NATUREL EDIFICES MUNICIPAU"]
["02-13000-698","TOURNOI DE GOLF"]
["02-13000-699","DEPENSES DIVERSES"]
["02-13000-310","DEPLACEMENTS CONGRES"]
["02-13000-321","FRAIS DE POSTE"]
["02-13000-322","COURRIER SPECIAL"]
["02-13000-413","COMPTABILITE VERIFICATION"]
["02-13000-452","SERVICE TECHNIQUE INFORMATIQUE"]
["02-13000-940","MAUVAISE CREANCE"]
["02-13000-951","QUOTE PART MRC ADM"]
["02-13000-995","RECLAMATION DOMMAGE INTERET"]
["02-13000-998","AJUSTEMENT FEDERAL ET PROVINCIAL"]
["02-13000-999","NATALITE"]
["02-13001-698","FETE DE LA ST-JEAN"]
["02-13001-999","NOUVEAUX PROPRIETAIRES"]
["02-13002-999","SUBVENTION COUCHES"]
["ÉLECTION"]
["02-14000-345","PUBLICATION"]
["02-14000-412","SERVICE JURIDIQUE"]
["02-14000-417","SERVICES PROFESSIONNELS"]
["02-14000-454","FORMATION ELECTION"]
["02-14000-670","PAPETERIE"]
["02-14000-699","DEPENSES DIVERSES ELECTION"]
["INCENDIE"]
["02-22000-310","FRAIS DE DEPLACEMENT"]
["02-22000-331","TELEPHONE ET TELEAVERTISSEURS"]
["02-22000-422","ASSURANCE POMPIER"]
["02-22000-454","FORMATION"]
["02-22000-516","LOCATION MATERIEL EQUIPEMENT"]
["02-22000-525","MATERIEL ROULANT REPARATION"]
["02-22000-526","ENTRETIEN ET REPARATION EQUIPEMENT"]
["02-22000-610","REPAS INCENDIE"]
["02-22000-629","DEPENSES DIVERSES"]
["02-22000-631","ESSENCE"]
["02-22000-632","HUILE GARAGE INCENDIE"]
["02-22000-639","ENTRAIDE MUNICIPALE"]
["02-22000-650","VETEMENT & CHAUSSURES"]
["02-22000-670","FOURNITURE DE BUREAU"]
["02-22000-681","ELECTRICITE"]
["02-22000-682","GAZ"]
["02-22000-951","QUOTE PART MRC - INCENDIE"]
{"$rows_left_out":235}
{"sheet":"FOURNISSEURS","index":2,"n_rows":2212,"n_cols":2,"rows_kept":2212,"cut":false,"hidden":true,"merged":[]}
["1740 TAPIS PRÉLARTS INC.","1740TAP"]
["4122682 CANADA INC.","4122682"]
["4170652 CANADA INC.","Q77425"]
["911 PRO INC.","N67901"]
["9161 4321 QUÉBEC INC.","91614321"]
["9176 9885 QUÉBEC INC.","N67903"]
["9276 8316 QUÉBEC INC.","S82250"]
["9276-8316 QUÉBEC INC.","N67905"]
["9284-0313 QUÉBEC INC.","N67908"]
["9299 7121 QUÉBEC INC.","N67910"]
["9303 7844 QUÉBEC INC.","N67920"]
["9306-1380 QUÉBEC INC.","A05850"]
["9317-9638 QUÉBEC INC.","N67921"]
["A.T.P.A. SECTION QUEBEC","A00675"]
["A-1 LIGNES JAUNES","A00750"]
["A25-LE LIEN INTELLIGENT","A00800"]
["ABC ENVIRONNEMENT INC.","A00900"]
["ABC RIVE-NORD INC.","A01000"]
["ABRIS CRYSTAL INC.","A01010"]
["ABS","A01050"]
["ACCES COMMUNICATIONS","A01200"]
["ACCS LE GROUPE","A01220"]
["ACIER D'ARMATURE 2000 INC","A01230"]
["ACMQ","A01260"]
["AD.MATS","A01500"]
["AERZEN CANADA","A02000"]
["AFFAIRES (LES) JOURNAL","A02250"]
["AGRITEX ST-ROCH","A02400"]
["AIR EN FÊTE (L')","A02910"]
["AIR LIQUIDE CANADA INC.","A02925"]
["AIRTEK INC.","A03150"]
["ALAIN BENOIT TRANSPORT INC.","A03600"]
["ALERTE ANIMAL","A03670"]
["ALIMENTATION MANON BÉLANGER INC.","A03700"]
["ALIMPLUS INC.","A03710"]
["ALPHA TABCO INC.","A03720"]
["ALUMINIUM ANDRE GAGNON INC.","A04500"]
["ALUMINIUM NORD-SUD INC.","A04700"]
["ALUMINIUM PIERRE BRIEN INC.","A04800"]
["AMEUBLEMENT USAGE PLUS","A05100"]
["AMIS DU JARDIN BOTANIQUE DE MONTRÉAL","A05150"]
["AMUSEMENTS SPORTEQUE INC.","A05200"]
["ANDRÉ MAJEAU INC.","A05210"]
["ANIMATION DÉCLIC LTÉE","A05230"]
["ANNEX PUBLISHING & PRINTING INC.","A05250"]
["APPAREILS TECHNI PRO ENR.","A05275"]
["APSAM","A05300"]
["APTIKA","A05310"]
["APUR (MARC PILON) URBANISTES-CONSEILS","A05312"]
["AQTR","A05315"]
["AQUA NOVA","A05320"]
["AQUA TECHNO SPÉCIALISTE AQUATIQUE INC","A05325"]
["AQUAM SPÉCIALISTE AQUATIQUE INC.","A05350"]
["ARBITRAGE PIERRE LAMARCHE","A05400"]
["ARENE JEAN-LUC","A05430"]
["AREO-FEU LTEE","A05450"]
["ARTEC ENTREPRENEUR PAYSAGISTE","A05455"]
["ARTS GRAPHIQUES ALPHONSO INC.","A05460"]
["ASCENSEURS INNOVATEC","A05500"]
["ASD PROMOTION","A05520"]
{"$rows_left_out":2153}
{"sheet":"LISTE DES RÉQUISITIONS","index":3,"n_rows":5501,"n_cols":17,"rows_kept":5501,"cut":false,"hidden":false,"merged":[[1,6,1,9],[1,0,10,1],[1,2,1,3],[1,4,1,5]]}
[]
["LÉGENDE",null,"FAIT PAR",null,"DÉPARTEMENT",null,"REQUIS PAR"]
[null,null,1,null,1,null,1,null,1]
[null,null,2,"Lyna Thériault",2,"Administration",2,"Patrick Massé",10,"Ronald Bruyère"]
[null,null,3,"Francine Dugas",3,"Voirie",3,"Richard Dufort",11,"André Paquin"]
[null,null,4,"Marie-Pier Bélanger",4,"Loisirs",4,"Sylvain Martel",12,"André Héroux"]
[null,null,5,"Stéphanie Chrétien",5,"Greffe",5,"Lyna Thériault",13,"Michel Marcoux"]
[null,null,6,"Mélanie Bossé",6,"Urbanisme",6,"Mélanie Bossé",14,"Jessica Colpron"]
[null,null,7,"Johanne Raymond",7,"Bibliothèque",7,"Johanne Raymond",15,"Aude Ruais"]
[null,null,8,"Elisa-Ann Sourdif",8,"Incendie",8,"Élisa-Ann Sourdif",16,"Katherine Bernier",null,null,null,null,null,null,10]
[null,null,9,"Danielle Gravel",9,"Piscine",9,"Danielle Gravel",17,"Conseil Municipale"]
[null,null,10,"Sylvain Martel",null,null,null,null,18,"Daniel Héroux",null,null,"Go à la",null,null,null,15]
["Date","# Réquisition",null,"Fait par",null,"Dept",null,"Requis Par",null,"Nom Fournisseur","# Fournisseur","Descriptions","Réquisition"]
[null,null,null,null,null,null,null,null,null,null,null,null,null,"1740 TAPIS PRÉLARTS INC.","1740TAP",{"$f":"DATE(2017,11,1)","v":"2017-11-01"}]
["2017-11-01","13-5500",2,{"$f":"CHOOSE(C15,\" \",$D$4,$D$5,$D$6,$D$7,$D$8,$D$9,$D$10,$D$11,$D$12)","v":"Lyna Thériault"},2,{"$f":"CHOOSE(E15,\" \",$F$4,$F$5,$F$6,$F$7,$F$8,$F$9,$F$10,$F$11,$F$4,$F$5,$F$6,$F$7,$F$8)","v":"Administration"},11,{"$f":"CHOOSE(G15,\" \",$H$4,$H$5,$H$6,$H$7,$H$8,$H$9,$H$10,$H$11,$J$4,$J$5,$J$6,$J$7,$J$8,$J$9,$J$10,\" \")","v":"André Paquin"},null,"COOP PROFID'OR",{"$f":"VLOOKUP(J15,FOURNISSEURS!$A$1:$B$2212,2,0)","v":"C27300"},"DIVERS POUR DÉCO DE NOËL",null,"4122682 CANADA INC.","4122682",{"$f":"P14+1","v":"2017-11-02"}]
["2017-11-01",null,10,"Sylvain Martel",2,{"$f":"CHOOSE(E16,\" \",$F$4,$F$5,$F$6,$F$7,$F$8,$F$9,$F$10,$F$11,$F$4,$F$5,$F$6,$F$7,$F$8)","v":"Administration"},4,{"$f":"CHOOSE(G16,\" \",$H$4,$H$5,$H$6,$H$7,$H$8,$H$9,$H$10,$H$11,$J$4,$J$5,$J$6,$J$7,$J$8,$J$9,$J$10,\" \")","v":"Sylvain Martel"},null,"PETITE CAISSE",{"$f":"VLOOKUP(J16,FOURNISSEURS!$A$1:$B$2212,2,0)","v":"P72675"},"RENFLOUEMENT PETITE CAISSE",null,"4170652 CANADA INC.","Q77425",{"$f":"P15+1","v":"2017-11-03"}]
["2017-11-01",null,2,{"$f":"CHOOSE(C17,\" \",$D$4,$D$5,$D$6,$D$7,$D$8,$D$9,$D$10,$D$11,$D$12)","v":"Lyna Thériault"},7,"Bibliothèque",9,"Danielle Gravel",null,"*TROIS FOIS PAR JOUR",{"$f":"VLOOKUP(J17,FOURNISSEURS!$A$1:$B$2212,2,0)","v":"*TROI001"},"ABONNEMENT TFPJ JANV @ NOV.2018",null,"911 PRO INC.","N67901",{"$f":"P16+1","v":"2017-11-04"}]
["2017-11-01",null,6,{"$f":"CHOOSE(C18,\" \",$D$4,$D$5,$D$6,$D$7,$D$8,$D$9,$D$10,$D$11,$D$12)","v":"Mélanie Bossé"},2,"Administration",6,"Mélanie Bossé",null,"CAFÉ LANAUDIÈRE INC.",{"$f":"VLOOKUP(J18,FOURNISSEURS!$A$1:$B$2212,2,0)","v":"C17510"},"MÉLANGE À CAFÉ ET SUCRE ÉDULCORANT",null,"9161 4321 QUÉBEC INC.","91614321","2017-11-05"]
["2017-11-01",null,7,"Johanne Raymond",2,"Administration",2,"Patrick Massé",null,"TOILETTES LANAUDIÈRE",{"$f":"VLOOKUP(J19,FOURNISSEURS!$A$1:$B$2212,2,0)","v":"T90395"},"LOCATION TOILETTE HALLOWEEN",null,"9176 9885 QUÉBEC INC.","N67903","2017-11-06"]
[null,null,1," ",1," ",1," ",null,null,{"$f":"VLOOKUP(J20,FOURNISSEURS!$A$1:$B$2212,2,0)","v":{"$error":"#N/A"}},null,null,"9276 8316 QUÉBEC INC.","S82250","2017-11-07"]
[null,null,1," ",1," ",1," ",null,null,{"$f":"VLOOKUP(J21,FOURNISSEURS!$A$1:$B$2212,2,0)","v":{"$error":"#N/A"}},null,null,"9276-8316 QUÉBEC INC.","N67905","2017-11-08"]
[null,null,1," ",1," ",1," ",null,null,{"$f":"VLOOKUP(J22,FOURNISSEURS!$A$1:$B$2212,2,0)","v":{"$error":"#N/A"}},null,null,"9284-0313 QUÉBEC INC.","N67908","2017-11-09"]
[null,null,1," ",1," ",1," ",null,null,{"$f":"VLOOKUP(J23,FOURNISSEURS!$A$1:$B$2212,2,0)","v":{"$error":"#N/A"}},null,null,"9299 7121 QUÉBEC INC.","N67910","2017-11-10"]
[null,null,1," ",1," ",1," ",null,null,{"$f":"VLOOKUP(J24,FOURNISSEURS!$A$1:$B$2212,2,0)","v":{"$error":"#N/A"}},null,null,"9303 7844 QUÉBEC INC.","N67920","2017-11-11"]
[null,null,1," ",1," ",1," ",null,null,{"$f":"VLOOKUP(J25,FOURNISSEURS!$A$1:$B$2212,2,0)","v":{"$error":"#N/A"}},null,null,"9306-1380 QUÉBEC INC.","A05850","2017-11-12"]
[null,null,1," ",1," ",1," ",null,null,{"$f":"VLOOKUP(J26,FOURNISSEURS!$A$1:$B$2212,2,0)","v":{"$error":"#N/A"}},null,null,"9317-9638 QUÉBEC INC.","N67921","2017-11-13"]
[null,null,1," ",1," ",1," ",null,null,{"$f":"VLOOKUP(J27,FOURNISSEURS!$A$1:$B$2212,2,0)","v":{"$error":"#N/A"}},null,null,"A.T.P.A. SECTION QUEBEC","A00675","2017-11-14"]
[null,null,1," ",1," ",1," ",null,null,{"$f":"VLOOKUP(J28,FOURNISSEURS!$A$1:$B$2212,2,0)","v":{"$error":"#N/A"}},null,null,"A-1 LIGNES JAUNES","A00750","2017-11-15"]
[null,null,1," ",1," ",1," ",null,null,{"$f":"VLOOKUP(J29,FOURNISSEURS!$A$1:$B$2212,2,0)","v":{"$error":"#N/A"}},null,null,"A25-LE LIEN INTELLIGENT","A00800","2017-11-16"]
[null,null,1," ",1," ",1," ",null,null,{"$f":"VLOOKUP(J30,FOURNISSEURS!$A$1:$B$2212,2,0)","v":{"$error":"#N/A"}},null,null,"ABC ENVIRONNEMENT INC.","A00900","2017-11-17"]
[null,null,1," ",1," ",1," ",null,null,{"$f":"VLOOKUP(J31,FOURNISSEURS!$A$1:$B$2212,2,0)","v":{"$error":"#N/A"}},null,null,"ABC RIVE-NORD INC.","A01000","2017-11-18"]
[null,null,1," ",1," ",1," ",null,null,{"$f":"VLOOKUP(J32,FOURNISSEURS!$A$1:$B$2212,2,0)","v":{"$error":"#N/A"}},null,null,"ABRIS CRYSTAL INC.","A01010","2017-11-19"]
[null,null,1," ",1," ",1," ",null,null,{"$f":"VLOOKUP(J33,FOURNISSEURS!$A$1:$B$2212,2,0)","v":{"$error":"#N/A"}},null,null,"ABS","A01050","2017-11-20"]
[null,null,1," ",1," ",1," ",null,null,{"$f":"VLOOKUP(J34,FOURNISSEURS!$A$1:$B$2212,2,0)","v":{"$error":"#N/A"}},null,null,"ACCES COMMUNICATIONS","A01200","2017-11-21"]
[null,null,1," ",1," ",1," ",null,null,{"$f":"VLOOKUP(J35,FOURNISSEURS!$A$1:$B$2212,2,0)","v":{"$error":"#N/A"}},null,null,"ACCS LE GROUPE","A01220","2017-11-22"]
[null,null,1," ",1," ",1," ",null,null,{"$f":"VLOOKUP(J36,FOURNISSEURS!$A$1:$B$2212,2,0)","v":{"$error":"#N/A"}},null,null,"ACIER D'ARMATURE 2000 INC","A01230","2017-11-23"]
[null,null,1," ",1," ",1," ",null,null,{"$f":"VLOOKUP(J37,FOURNISSEURS!$A$1:$B$2212,2,0)","v":{"$error":"#N/A"}},null,null,"ACMQ","A01260","2017-11-24"]
[null,null,1," ",1," ",1," ",null,null,{"$f":"VLOOKUP(J38,FOURNISSEURS!$A$1:$B$2212,2,0)","v":{"$error":"#N/A"}},null,null,"AD.MATS","A01500","2017-11-25"]
[null,null,1," ",1," ",1," ",null,null,{"$f":"VLOOKUP(J39,FOURNISSEURS!$A$1:$B$2212,2,0)","v":{"$error":"#N/A"}},null,null,"AERZEN CANADA","A02000","2017-11-26"]
[null,null,1," ",1," ",1," ",null,null,{"$f":"VLOOKUP(J40,FOURNISSEURS!$A$1:$B$2212,2,0)","v":{"$error":"#N/A"}},null,null,"AFFAIRES (LES) JOURNAL","A02250","2017-11-27"]
[null,null,1," ",1," ",1," ",null,null,{"$f":"VLOOKUP(J41,FOURNISSEURS!$A$1:$B$2212,2,0)","v":{"$error":"#N/A"}},null,null,"AGRITEX ST-ROCH","A02400","2017-11-28"]
[null,null,1," ",1," ",1," ",null,null,{"$f":"VLOOKUP(J42,FOURNISSEURS!$A$1:$B$2212,2,0)","v":{"$error":"#N/A"}},null,null,"AIR EN FÊTE (L')","A02910","2017-11-29"]
[null,null,1," ",1,{"$f":"CHOOSE(E43,\" \",$F$4,$F$5,$F$6,$F$7,$F$8,$F$9,$F$10,$F$11,$F$4,$F$5,$F$6,$F$7,$F$8)","v":" "},1,{"$f":"CHOOSE(G43,\" \",$H$4,$H$5,$H$6,$H$7,$H$8,$H$9,$H$10,$H$11,$J$4,$J$5,$J$6,$J$7,$J$8,$J$9,$J$10,\" \")","v":" "},null,null,{"$f":"VLOOKUP(J43,FOURNISSEURS!$A$1:$B$2212,2,0)","v":{"$error":"#N/A"}},null,null,"AIR LIQUIDE CANADA INC.","A02925",{"$f":"P42+1","v":"2017-11-30"}]
[null,null,1," ",1," ",1," ",null,null,{"$f":"VLOOKUP(J44,FOURNISSEURS!$A$1:$B$2212,2,0)","v":{"$error":"#N/A"}},null,null,"AIRTEK INC.","A03150",{"$f":"P43+1","v":"2017-12-01"}]
[null,null,1," ",1," ",1," ",null,null,{"$f":"VLOOKUP(J45,FOURNISSEURS!$A$1:$B$2212,2,0)","v":{"$error":"#N/A"}},null,null,"ALAIN BENOIT TRANSPORT INC.","A03600",{"$f":"P44+1","v":"2017-12-02"}]
[null,null,1," ",1," ",1," ",null,null,{"$f":"VLOOKUP(J46,FOURNISSEURS!$A$1:$B$2212,2,0)","v":{"$error":"#N/A"}},null,null,"ALERTE ANIMAL","A03670","2017-12-03"]
[null,null,1," ",1," ",1," ",null,null,{"$f":"VLOOKUP(J47,FOURNISSEURS!$A$1:$B$2212,2,0)","v":{"$error":"#N/A"}},null,null,"ALIMENTATION MANON BÉLANGER INC.","A03700","2017-12-04"]
[null,null,1," ",1," ",1," ",null,null,{"$f":"VLOOKUP(J48,FOURNISSEURS!$A$1:$B$2212,2,0)","v":{"$error":"#N/A"}},null,null,"ALIMPLUS INC.","A03710","2017-12-05"]
[null,null,1," ",1," ",1," ",null,null,{"$f":"VLOOKUP(J49,FOURNISSEURS!$A$1:$B$2212,2,0)","v":{"$error":"#N/A"}},null,null,"ALPHA TABCO INC.","A03720","2017-12-06"]
[null,null,1," ",1," ",1," ",null,null,{"$f":"VLOOKUP(J50,FOURNISSEURS!$A$1:$B$2212,2,0)","v":{"$error":"#N/A"}},null,null,"ALUMINIUM ANDRE GAGNON INC.","A04500","2017-12-07"]
[null,null,1," ",1," ",1," ",null,null,{"$f":"VLOOKUP(J51,FOURNISSEURS!$A$1:$B$2212,2,0)","v":{"$error":"#N/A"}},null,null,"ALUMINIUM NORD-SUD INC.","A04700","2017-12-08"]
[null,null,1," ",1," ",1," ",null,null,{"$f":"VLOOKUP(J52,FOURNISSEURS!$A$1:$B$2212,2,0)","v":{"$error":"#N/A"}},null,null,"ALUMINIUM PIERRE BRIEN INC.","A04800","2017-12-09"]
[null,null,1," ",1," ",1," ",null,null,{"$f":"VLOOKUP(J53,FOURNISSEURS!$A$1:$B$2212,2,0)","v":{"$error":"#N/A"}},null,null,"AMEUBLEMENT USAGE PLUS","A05100","2017-12-10"]
[null,null,1," ",1," ",1," ",null,null,{"$f":"VLOOKUP(J54,FOURNISSEURS!$A$1:$B$2212,2,0)","v":{"$error":"#N/A"}},null,null,"AMIS DU JARDIN BOTANIQUE DE MONTRÉAL","A05150","2017-12-11"]
[null,null,1," ",1," ",1," ",null,null,{"$f":"VLOOKUP(J55,FOURNISSEURS!$A$1:$B$2212,2,0)","v":{"$error":"#N/A"}},null,null,"AMUSEMENTS SPORTEQUE INC.","A05200","2017-12-12"]
[null,null,1," ",1," ",1," ",null,null,{"$f":"VLOOKUP(J56,FOURNISSEURS!$A$1:$B$2212,2,0)","v":{"$error":"#N/A"}},null,null,"ANDRÉ MAJEAU INC.","A05210","2017-12-13"]
[null,null,1," ",1," ",1," ",null,null,{"$f":"VLOOKUP(J57,FOURNISSEURS!$A$1:$B$2212,2,0)","v":{"$error":"#N/A"}},null,null,"ANIMATION DÉCLIC LTÉE","A05230","2017-12-14"]
[null,null,1," ",1," ",1," ",null,null,{"$f":"VLOOKUP(J58,FOURNISSEURS!$A$1:$B$2212,2,0)","v":{"$error":"#N/A"}},null,null,"ANNEX PUBLISHING & PRINTING INC.","A05250","2017-12-15"]
[null,null,1," ",1," ",1," ",null,null,{"$f":"VLOOKUP(J59,FOURNISSEURS!$A$1:$B$2212,2,0)","v":{"$error":"#N/A"}},null,null,"APPAREILS TECHNI PRO ENR.","A05275","2017-12-16"]
[null,null,1," ",1," ",1," ",null,null,{"$f":"VLOOKUP(J60,FOURNISSEURS!$A$1:$B$2212,2,0)","v":{"$error":"#N/A"}},null,null,"APSAM","A05300","2017-12-17"]
{"$rows_left_out":5442}
{"sheet":"modèle","index":4,"n_rows":47,"n_cols":13,"rows_kept":47,"cut":false,"hidden":false,"merged":[[46,3,48,3],[46,4,48,4],[46,5,48,5],[46,1,48,1],[5,4,5,5],[6,4,6,5],[7,4,7,5],[8,4,8,5],[9,4,9,5],[10,4,10,5],[11,4,11,5],[33,0,33,3],[38,0,38,5],[39,0,39,5],[41,4,41,5],[0,0,0,5],[0,7,1,9],[1,0,1,5],[2,0,2,5],[3,0,3,5],[3,7,3,8]]}
["Ville de Saint-Lin-Laurentides",null,null,null,null,null,null,"CHOISIR VOTRE CODE DANS LA COLONNE BLEU SELON LA DÉPENSE",null,null,"LISTE DES RÉQUISITIONS"]
["900, 12e avenue",null,null,null,null,null,null,null,null,null,null,"Novembre",2017]
["Saint-Lin-Laurentides (Québec) J5M 2W2",null,null,null,null,null,null,null,null,null,null,"Décembre",2018]
["Tél. : (450) 439-3130  -  Fax : (450) 439-1525",null,null,null,null,null,null,"DESCRIPTIONS GRAND LIVRE",null,"CODE G/L"]
[]
[null,null,null,"Mois","Novembre",null,null,1]
["Fournisseur ",{"$f":"'LISTE DES RÉQUISITIONS'!J15","v":"COOP PROFID'OR"},null,"Année",2017,null,null,2,"DEPLACEMENTS CONGRES","02-13000-310"]
[null,null,null,"Réquisition",{"$f":"'LISTE DES RÉQUISITIONS'!B15","v":"13-5500"},null,null,3,"FRAIS DE POSTE","02-13000-321"]
["Adresse ",null,null,"Date ",{"$f":"'LISTE DES RÉQUISITIONS'!A15","v":"2017-11-01"},null,null,4,"COURRIER SPECIAL","02-13000-322"]
[null,null,null,"Département ",{"$f":"'LISTE DES RÉQUISITIONS'!F15","v":"Administration"},null,null,5,"TELEPHONE ET TELEAVERTISSEUR","02-13000-331"]
[null,null,null,"Préparée par",{"$f":"'LISTE DES RÉQUISITIONS'!D15","v":"Lyna Thériault"},null,null,6,"FRAIS DE PUBLICATION","02-13000-345"]
["Téléphone ",null,null,"No fournisseur ",{"$f":"'LISTE DES RÉQUISITIONS'!K15","v":"C27300"},null,null,7,"PUBLICITE","02-13000-349"]
[null,null,null,null,null,null,null,8,"SERVICES JURIDIQUES","02-13000-412"]
["Nb","Description matériel","C","# Code GL","Prix à l’unité","Total",null,9,"COMPTABILITE VERIFICATION","02-13000-413"]
[null,{"$f":"'LISTE DES RÉQUISITIONS'!L15","v":"DIVERS POUR DÉCO DE NOËL"},1,{"$f":"CHOOSE(C15,\" \",$J$7,$J$8,$J$9,$J$10,$J$11,$J$12,$J$13,$J$14,$J$15,$I$16,$J$17,$J$18,$J$19,$J$20,$J$21,$J$22,$J$23,$J$24,$J$25,$J$26,$J$27,$J$28,$J$29,$J$30,$J$31,$J$32,$J$33,$J$34,$J$35)","v":" "},null,{"$f":"SUM(A15*E15)","v":0},null,10,"SERVICE TECHNIQUE INFORMATIQUE","02-13000-452"]
[null,null,1," ",null,{"$f":"SUM(A16*E16)","v":0},null,11,"FORMATION","02-13000-454"]
[null,null,1,{"$f":"CHOOSE(C17,\" \",$J$7,$J$8,$J$9,$J$10,$J$11,$J$12,$J$13,$J$14,$J$15,$I$16,$J$17,$J$18,$J$19,$J$20,$J$21,$J$22,$J$23,$J$24,$J$25,$J$26,$J$27,$J$28,$J$29,$J$30,$J$31,$J$32,$J$33,$J$34,$J$35)","v":" "},null,0,null,12,"RECEPTION","02-13000-493"]
[null,null,1,{"$f":"CHOOSE(C18,\" \",$J$7,$J$8,$J$9,$J$10,$J$11,$J$12,$J$13,$J$14,$J$15,$I$16,$J$17,$J$18,$J$19,$J$20,$J$21,$J$22,$J$23,$J$24,$J$25,$J$26,$J$27,$J$28,$J$29,$J$30,$J$31,$J$32,$J$33,$J$34,$J$35)","v":" "},null,0,null,13,"COTISATION ASSOCIATION ABONNEMENT","02-13000-494"]
[null,null,1," ",null,0,null,14,"LOCATION MATERIEL EQUIPEMENT","02-13000-517"]
[null,null,1," ",null,0,null,15,"ENTRETIEN BÂTIMENTS ADMINIST.","02-13000-522"]
[null,null,1," ",null,0,null,16,"ENT. REP. EQUIPEMENT BUREAU","02-13000-527"]
[null,null,1," ",null,0,null,17,"ALIMENT, REPAS","02-13000-610"]
[null,null,1," ",null,0,null,18,"FOURNITURE DE BUREAU","02-13000-670"]
[null,null,1," ",null,0,null,19,"FOURNITURES ET LOGICIEL","02-13000-671"]
[null,null,1," ",null,{"$f":"SUM(A25*E25)","v":0},null,20,"ELECTRICITE","02-13000-681"]
[null,null,1,{"$f":"CHOOSE(C26,\" \",$J$7,$J$8,$J$9,$J$10,$J$11,$J$12,$J$13,$J$14,$J$15,$J$16,$J$17,$J$18,$J$19,$J$20,$J$21,$J$22,$J$23,$J$24,$J$25,$J$26,$J$27,$J$28,$J$29,$J$30,$J$31,$J$32,$J$33,$J$34,$J$35)","v":" "},null,0,null,21,"GAZ NATUREL EDIFICES MUNICIPAULT","02-13000-682"]
[null,null,1," ",null,0,null,22,"TOURNOI DE GOLF","02-13000-698"]
[null,null,1," ",null,0,null,23,"DEPENSES DIVERSES","02-13000-699"]
[null,null,1," ",null,{"$f":"SUM(A29*E29)","v":0},null,24,"IMPUTER DANS LA VOIRIE","VOIRIE"]
[null,null,1," ",null,{"$f":"SUM(A30*E30)","v":0},null,25,"IMPUTER DANS LES LOISIRS","LOISIRS"]
[null,null,1," ",null,0,null,26,"IMPUTER DANS LA PISCINE","PISCINE"]
[null,null,1," ",null,0,null,27,"IMPUTER DANS L'URBANISME","URBANISME"]
[null,null,1," ",null,0,null,28,"IMPUTER DANS L'INCENDIE","INCENDIE"]
[null,null,null,null,"Sous-total",{"$f":"SUM(F15:F33)","v":0},null,29,"NE TROUVE PAS","NE TROUVE PAS"]
["Requis par :     ",{"$f":"'LISTE DES RÉQUISITIONS'!H15","v":"André Paquin"},null,null,"T.P.S.",{"$f":"SUM(F34*5%)","v":0},null,30,"AUTRES","AUTRES"]
[null,null,null,null,"T.V.Q.",{"$f":"SUM(F34*9.975%)","v":0}]
["Approuvé par :  ",null,null,null,"Grand total",{"$f":"SUM(F34+F35+F36)","v":0}]
[]
["CERTIFICAT DE FONDS DISPONIBLES POUR DÉPENSE PROJETÉE"]
["Je, soussigné, certifie par les présentes, qu’il y a des fonds disponibles pour les fins auxquelles la dépense ci-dessus décrite est projetée par le Conseil."]
[]
["Directeur Des Finances:",null,null,"Date:",{"$f":"NOW()","v":"2017-11-03T22:43:09.100"}]
[]
[]
[]
[null,null,null,"Saisie excel","Comptabilisé","Initiale"]
[null,"SECTION RÉSERVÉ AUX FINANCES"]