{"text_format":"1","workbook":"xlsx","n_sheets":4,"sheets":["Entree","Planning","Jours Férié","Mode d'emploi"],"not_rendered":{"charts":0,"images":0,"macros":1,"external_links":0,"defined_names":14,"comments":0,"pivot_tables":0},"unopened":[],"bounds":{"document_bytes":16777216,"sheet_cells":100000,"rows_first":2000,"rows_last":500,"rows_between":2000,"halvings":0,"cell_chars":16384,"cell_head_chars":4096},"cells_cut":0,"cells_raw":0,"read":"whole","date_system":"1900"}

{"sheet":"Entree","index":0,"n_rows":1000,"n_cols":17,"rows_kept":1000,"cut":false,"hidden":false,"merged":[]}
[null,null,null,null,null,null,null,null,null,null,null,null,null,null,null,null,"Codes"]
[null,"Nom","Type","date début","date de fin","Symbol",null,null,null,null,null,null,null,null,null,null,"CP"]
[null,"Alexandre","RHN","2017-01-02","2017-01-05",{"$f":"[Type]","v":"RHN"},null,null,null,null,null,null,null,null,null,null,"RHN"]
[null,"Soraya ","CP","2017-01-12","2017-01-16",{"$f":"[Type]","v":"CP"},null,null,null,null,null,null,null,null,null,null,"RTT"]
[null,"Corinne ","CP","2017-01-24","2017-01-28",{"$f":"[Type]","v":"CP"},null,null,null,null,null,null,null,null,null,null,"RTTI"]
[null,"Alexandre","CP","2017-01-07","2017-01-10",{"$f":"[Type]","v":"CP"},null,null,null,null,null,null,null,null,null,null,"MA"]
[null,"Djamel","RTTI","2017-01-01","2017-01-07",{"$f":"[Type]","v":"RTTI"},null,null,null,null,null,null,null,null,null,null,"AUT"]
[null,"Aurelie","AUT","2017-01-31","2017-01-31",{"$f":"[Type]","v":"AUT"}]
[null,"Sandrine","MA","2017-02-01","2017-02-08",{"$f":"[Type]","v":"MA"}]
[null,"Aurelie","CP","2017-02-10","2017-02-14",{"$f":"[Type]","v":"CP"}]
[null,"Aurelie","MA","2017-03-05","2017-03-08",{"$f":"[Type]","v":"MA"}]
[null,"Corinne ","RHN","2017-02-10","2017-02-10",{"$f":"[Type]","v":"RHN"}]
[null,"Djamel","CP","2017-12-01","2017-12-31",{"$f":"[Type]","v":"CP"}]
[null,"Ayse ","CP","2017-06-06","2017-06-06",{"$f":"[Type]","v":"CP"}]
[null,"Lise","CP","2017-07-03","2017-07-07",{"$f":"[Type]","v":"CP"}]
[null,"Lise","CP","2017-07-10","2017-07-13",{"$f":"[Type]","v":"CP"}]
[null,"Lise","CP","2017-07-17","2017-07-24",{"$f":"[Type]","v":"CP"}]
[null,null,null,null,null,{"$f":"[Type]","v":0}]
[null,null,null,null,null,{"$f":"[Type]","v":0}]
[null,null,null,null,null,{"$f":"[Type]","v":0}]
[null,null,null,null,null,{"$f":"[Type]","v":0}]
[null,null,null,null,null,{"$f":"[Type]","v":0}]
[null,null,null,null,null,{"$f":"[Type]","v":0}]
[null,null,null,null,null,{"$f":"[Type]","v":0}]
[null,null,null,null,null,{"$f":"[Type]","v":0}]
[null,null,null,null,null,{"$f":"[Type]","v":0}]
[null,null,null,null,null,{"$f":"[Type]","v":0}]
[null,null,null,null,null,{"$f":"[Type]","v":0}]
[null,null,null,null,null,{"$f":"[Type]","v":0}]
[null,null,null,null,null,{"$f":"[Type]","v":0}]
[null,null,null,null,null,{"$f":"[Type]","v":0}]
[null,null,null,null,null,{"$f":"[Type]","v":0}]
[null,null,null,null,null,{"$f":"[Type]","v":0}]
[null,null,null,null,null,{"$f":"[Type]","v":0}]
[null,null,null,null,null,{"$f":"[Type]","v":0}]
[null,null,null,null,null,{"$f":"[Type]","v":0}]
[null,null,null,null,null,{"$f":"[Type]","v":0}]
[null,null,null,null,null,{"$f":"[Type]","v":0}]
[null,null,null,null,null,{"$f":"[Type]","v":0}]
[null,null,null,null,null,{"$f":"[Type]","v":0}]
[null,null,null,null,null,{"$f":"[Type]","v":0}]
[null,null,null,null,null,{"$f":"[Type]","v":0}]
[null,null,null,null,null,{"$f":"[Type]","v":0}]
[null,null,null,null,null,{"$f":"[Type]","v":0}]
[null,null,null,null,null,{"$f":"[Type]","v":0}]
[null,null,null,null,null,{"$f":"[Type]","v":0}]
[null,null,null,null,null,{"$f":"[Type]","v":0}]
[null,null,null,null,null,{"$f":"[Type]","v":0}]
[null,null,null,null,null,{"$f":"[Type]","v":0}]
[null,null,null,null,null,{"$f":"[Type]","v":0}]
[null,null,null,null,null,{"$f":"[Type]","v":0}]
[null,null,null,null,null,{"$f":"[Type]","v":0}]
[null,null,null,null,null,{"$f":"[Type]","v":0}]
[null,null,null,null,null,{"$f":"[Type]","v":0}]
[null,null,null,null,null,{"$f":"[Type]","v":0}]
[null,null,null,null,null,{"$f":"[Type]","v":0}]
[null,null,null,null,null,{"$f":"[Type]","v":0}]
[null,null,null,null,null,{"$f":"[Type]","v":0}]
[null,null,null,null,null,{"$f":"[Type]","v":0}]
[null,null,null,null,null,{"$f":"[Type]","v":0}]
[null,null,null,null,null,{"$f":"[Type]","v":0}]
[null,null,null,null,null,{"$f":"[Type]","v":0}]
[null,null,null,null,null,{"$f":"[Type]","v":0}]
[null,null,null,null,null,{"$f":"[Type]","v":0}]
[null,null,null,null,null,{"$f":"[Type]","v":0}]
[null,null,null,null,null,{"$f":"[Type]","v":0}]
[null,null,null,null,null,{"$f":"[Type]","v":0}]
[null,null,null,null,null,{"$f":"[Type]","v":0}]
[null,null,null,null,null,{"$f":"[Type]","v":0}]
[null,null,null,null,null,{"$f":"[Type]","v":0}]
[null,null,null,null,null,{"$f":"[Type]","v":0}]
[null,null,null,null,null,{"$f":"[Type]","v":0}]
[null,null,null,null,null,{"$f":"[Type]","v":0}]
[null,null,null,null,null,{"$f":"[Type]","v":0}]
[null,null,null,null,null,{"$f":"[Type]","v":0}]
[null,null,null,null,null,{"$f":"[Type]","v":0}]
[null,null,null,null,null,{"$f":"[Type]","v":0}]
[null,null,null,null,null,{"$f":"[Type]","v":0}]
[null,null,null,null,null,{"$f":"[Type]","v":0}]
[null,null,null,null,null,{"$f":"[Type]","v":0}]
[null,null,null,null,null,{"$f":"[Type]","v":0}]
[null,null,null,null,null,{"$f":"[Type]","v":0}]
[null,null,null,null,null,{"$f":"[Type]","v":0}]
[null,null,null,null,null,{"$f":"[Type]","v":0}]
[null,null,null,null,null,{"$f":"[Type]","v":0}]
[null,null,null,null,null,{"$f":"[Type]","v":0}]
[null,null,null,null,null,{"$f":"[Type]","v":0}]
[null,null,null,null,null,{"$f":"[Type]","v":0}]
[null,null,null,null,null,{"$f":"[Type]","v":0}]
[null,null,null,null,null,{"$f":"[Type]","v":0}]
[null,null,null,null,null,{"$f":"[Type]","v":0}]
[null,null,null,null,null,{"$f":"[Type]","v":0}]
[null,null,null,null,null,{"$f":"[Type]","v":0}]
[null,null,null,null,null,{"$f":"[Type]","v":0}]
[null,null,null,null,null,{"$f":"[Type]","v":0}]
[null,null,null,null,null,{"$f":"[Type]","v":0}]
[null,null,null,null,null,{"$f":"[Type]","v":0}]
[null,null,null,null,null,{"$f":"[Type]","v":0}]
[null,null,null,null,null,{"$f":"[Type]","v":0}]
[null,null,null,null,null,{"$f":"[Type]","v":0}]
[null,null,null,null,null,{"$f":"[Type]","v":0}]
[null,null,null,null,null,{"$f":"[Type]","v":0}]
[null,null,null,null,null,{"$f":"[Type]","v":0}]
[null,null,null,null,null,{"$f":"[Type]","v":0}]
[null,null,null,null,null,{"$f":"[Type]","v":0}]
[null,null,null,null,null,{"$f":"[Type]","v":0}]
[null,null,null,null,null,{"$f":"[Type]","v":0}]
[null,null,null,null,null,{"$f":"[Type]","v":0}]
[null,null,null,null,null,{"$f":"[Type]","v":0}]
[null,null,null,null,null,{"$f":"[Type]","v":0}]
[null,null,null,null,null,{"$f":"[Type]","v":0}]
[null,null,null,null,null,{"$f":"[Type]","v":0}]
[null,null,null,null,null,{"$f":"[Type]","v":0}]
[null,null,null,null,null,{"$f":"[Type]","v":0}]
[null,null,null,null,null,{"$f":"[Type]","v":0}]
[null,null,null,null,null,{"$f":"[Type]","v":0}]
[null,null,null,null,null,{"$f":"[Type]","v":0}]
[null,null,null,null,null,{"$f":"[Type]","v":0}]
[null,null,null,null,null,{"$f":"[Type]","v":0}]
[null,null,null,null,null,{"$f":"[Type]","v":0}]
[null,null,null,null,null,{"$f":"[Type]","v":0}]
[null,null,null,null,null,{"$f":"[Type]","v":0}]
[null,null,null,null,null,{"$f":"[Type]","v":0}]
[null,null,null,null,null,{"$f":"[Type]","v":0}]
[null,null,null,null,null,{"$f":"[Type]","v":0}]
[null,null,null,null,null,{"$f":"[Type]","v":0}]
[null,null,null,null,null,{"$f":"[Type]","v":0}]
[null,null,null,null,null,{"$f":"[Type]","v":0}]
[null,null,null,null,null,{"$f":"[Type]","v":0}]
[null,null,null,null,null,{"$f":"[Type]","v":0}]
[null,null,null,null,null,{"$f":"[Type]","v":0}]
[null,null,null,null,null,{"$f":"[Type]","v":0}]
[null,null,null,null,null,{"$f":"[Type]","v":0}]
[null,null,null,null,null,{"$f":"[Type]","v":0}]
[null,null,null,null,null,{"$f":"[Type]","v":0}]
[null,null,null,null,null,{"$f":"[Type]","v":0}]
[null,null,null,null,null,{"$f":"[Type]","v":0}]
[null,null,null,null,null,{"$f":"[Type]","v":0}]
[null,null,null,null,null,{"$f":"[Type]","v":0}]
[null,null,null,null,null,{"$f":"[Type]","v":0}]
[null,null,null,null,null,{"$f":"[Type]","v":0}]
[null,null,null,null,null,{"$f":"[Type]","v":0}]
[null,null,null,null,null,{"$f":"[Type]","v":0}]
[null,null,null,null,null,{"$f":"[Type]","v":0}]
[null,null,null,null,null,{"$f":"[Type]","v":0}]
[null,null,null,null,null,{"$f":"[Type]","v":0}]
[null,null,null,null,null,{"$f":"[Type]","v":0}]
[null,null,null,null,null,{"$f":"[Type]","v":0}]
[null,null,null,null,null,{"$f":"[Type]","v":0}]
[null,null,null,null,null,{"$f":"[Type]","v":0}]
[null,null,null,null,null,{"$f":"[Type]","v":0}]
[null,null,null,null,null,{"$f":"[Type]","v":0}]
[null,null,null,null,null,{"$f":"[Type]","v":0}]
[null,null,null,null,null,{"$f":"[Type]","v":0}]
[null,null,null,null,null,{"$f":"[Type]","v":0}]
[null,null,null,null,null,{"$f":"[Type]","v":0}]
[null,null,null,null,null,{"$f":"[Type]","v":0}]
[null,null,null,null,null,{"$f":"[Type]","v":0}]
[null,null,null,null,null,{"$f":"[Type]","v":0}]
[null,null,null,null,null,{"$f":"[Type]","v":0}]
[null,null,null,null,null,{"$f":"[Type]","v":0}]
[null,null,null,null,null,{"$f":"[Type]","v":0}]
[null,null,null,null,null,{"$f":"[Type]","v":0}]
[null,null,null,null,null,{"$f":"[Type]","v":0}]
[null,null,null,null,null,{"$f":"[Type]","v":0}]
[null,null,null,null,null,{"$f":"[Type]","v":0}]
[null,null,null,null,null,{"$f":"[Type]","v":0}]
[null,null,null,null,null,{"$f":"[Type]","v":0}]
[null,null,null,null,null,{"$f":"[Type]","v":0}]
[null,null,null,null,null,{"$f":"[Type]","v":0}]
[null,null,null,null,null,{"$f":"[Type]","v":0}]
[null,null,null,null,null,{"$f":"[Type]","v":0}]
[null,null,null,null,null,{"$f":"[Type]","v":0}]
[null,null,null,null,null,{"$f":"[Type]","v":0}]
[null,null,null,null,null,{"$f":"[Type]","v":0}]
[null,null,null,null,null,{"$f":"[Type]","v":0}]
[null,null,null,null,null,{"$f":"[Type]","v":0}]
[null,null,null,null,null,{"$f":"[Type]","v":0}]
[null,null,null,null,null,{"$f":"[Type]","v":0}]
[null,null,null,null,null,{"$f":"[Type]","v":0}]
[null,null,null,null,null,{"$f":"[Type]","v":0}]
[null,null,null,null,null,{"$f":"[Type]","v":0}]
[null,null,null,null,null,{"$f":"[Type]","v":0}]
[null,null,null,null,null,{"$f":"[Type]","v":0}]
[null,null,null,null,null,{"$f":"[Type]","v":0}]
[null,null,null,null,null,{"$f":"[Type]","v":0}]
[null,null,null,null,null,{"$f":"[Type]","v":0}]
[null,null,null,null,null,{"$f":"[Type]","v":0}]
[null,null,null,null,null,{"$f":"[Type]","v":0}]
[null,null,null,null,null,{"$f":"[Type]","v":0}]
[null,null,null,null,null,{"$f":"[Type]","v":0}]
[null,null,null,null,null,{"$f":"[Type]","v":0}]
[null,null,null,null,null,{"$f":"[Type]","v":0}]
[null,null,null,null,null,{"$f":"[Type]","v":0}]
[null,null,null,null,null,{"$f":"[Type]","v":0}]
[null,null,null,null,null,{"$f":"[Type]","v":0}]
[null,null,null,null,null,{"$f":"[Type]","v":0}]
[null,null,null,null,null,{"$f":"[Type]","v":0}]
[null,null,null,null,null,{"$f":"[Type]","v":0}]
[null,null,null,null,null,{"$f":"[Type]","v":0}]
[null,null,null,null,null,{"$f":"[Type]","v":0}]
[null,null,null,null,null,{"$f":"[Type]","v":0}]
[null,null,null,null,null,{"$f":"[Type]","v":0}]
[null,null,null,null,null,{"$f":"[Type]","v":0}]
[null,null,null,null,null,{"$f":"[Type]","v":0}]
[null,null,null,null,null,{"$f":"[Type]","v":0}]
[null,null,null,null,null,{"$f":"[Type]","v":0}]
[null,null,null,null,null,{"$f":"[Type]","v":0}]
[null,null,null,null,null,{"$f":"[Type]","v":0}]
[null,null,null,null,null,{"$f":"[Type]","v":0}]
[null,null,null,null,null,{"$f":"[Type]","v":0}]
[null,null,null,null,null,{"$f":"[Type]","v":0}]
[null,null,null,null,null,{"$f":"[Type]","v":0}]
[null,null,null,null,null,{"$f":"[Type]","v":0}]
[null,null,null,null,null,{"$f":"[Type]","v":0}]
[null,null,null,null,null,{"$f":"[Type]","v":0}]
[null,null,null,null,null,{"$f":"[Type]","v":0}]
[null,null,null,null,null,{"$f":"[Type]","v":0}]
[null,null,null,null,null,{"$f":"[Type]","v":0}]
[null,null,null,null,null,{"$f":"[Type]","v":0}]
[null,null,null,null,null,{"$f":"[Type]","v":0}]
[null,null,null,null,null,{"$f":"[Type]","v":0}]
[null,null,null,null,null,{"$f":"[Type]","v":0}]
[null,null,null,null,null,{"$f":"[Type]","v":0}]
[null,null,null,null,null,{"$f":"[Type]","v":0}]
[null,null,null,null,null,{"$f":"[Type]","v":0}]
[null,null,null,null,null,{"$f":"[Type]","v":0}]
[null,null,null,null,null,{"$f":"[Type]","v":0}]
[null,null,null,null,null,{"$f":"[Type]","v":0}]
[null,null,null,null,null,{"$f":"[Type]","v":0}]
[null,null,null,null,null,{"$f":"[Type]","v":0}]
[null,null,null,null,null,{"$f":"[Type]","v":0}]
[null,null,null,null,null,{"$f":"[Type]","v":0}]
[null,null,null,null,null,{"$f":"[Type]","v":0}]
[null,null,null,null,null,{"$f":"[Type]","v":0}]
[null,null,null,null,null,{"$f":"[Type]","v":0}]
[null,null,null,null,null,{"$f":"[Type]","v":0}]
[null,null,null,null,null,{"$f":"[Type]","v":0}]
[null,null,null,null,null,{"$f":"[Type]","v":0}]
[null,null,null,null,null,{"$f":"[Type]","v":0}]
[null,null,null,null,null,{"$f":"[Type]","v":0}]
[null,null,null,null,null,{"$f":"[Type]","v":0}]
[null,null,null,null,null,{"$f":"[Type]","v":0}]
[null,null,null,null,null,{"$f":"[Type]","v":0}]
[null,null,null,null,null,{"$f":"[Type]","v":0}]
[null,null,null,null,null,{"$f":"[Type]","v":0}]
[null,null,null,null,null,{"$f":"[Type]","v":0}]
[null,null,null,null,null,{"$f":"[Type]","v":0}]
[null,null,null,null,null,{"$f":"[Type]","v":0}]
[null,null,null,null,null,{"$f":"[Type]","v":0}]
[null,null,null,null,null,{"$f":"[Type]","v":0}]
[null,null,null,null,null,{"$f":"[Type]","v":0}]
[null,null,null,null,null,{"$f":"[Type]","v":0}]
[null,null,null,null,null,{"$f":"[Type]","v":0}]
[null,null,null,null,null,{"$f":"[Type]","v":0}]
[null,null,null,null,null,{"$f":"[Type]","v":0}]
[null,null,null,null,null,{"$f":"[Type]","v":0}]
[null,null,null,null,null,{"$f":"[Type]","v":0}]
[null,null,null,null,null,{"$f":"[Type]","v":0}]
[null,null,null,null,null,{"$f":"[Type]","v":0}]
[null,null,null,null,null,{"$f":"[Type]","v":0}]
[null,null,null,null,null,{"$f":"[Type]","v":0}]
[null,null,null,null,null,{"$f":"[Type]","v":0}]
[null,null,null,null,null,{"$f":"[Type]","v":0}]
[null,null,null,null,null,{"$f":"[Type]","v":0}]
[null,null,null,null,null,{"$f":"[Type]","v":0}]
[null,null,null,null,null,{"$f":"[Type]","v":0}]
[null,null,null,null,null,{"$f":"[Type]","v":0}]
[null,null,null,null,null,{"$f":"[Type]","v":0}]
[null,null,null,null,null,{"$f":"[Type]","v":0}]
[null,null,null,null,null,{"$f":"[Type]","v":0}]
[null,null,null,null,null,{"$f":"[Type]","v":0}]
[null,null,null,null,null,{"$f":"[Type]","v":0}]
[null,null,null,null,null,{"$f":"[Type]","v":0}]
[null,null,null,null,null,{"$f":"[Type]","v":0}]
[null,null,null,null,null,{"$f":"[Type]","v":0}]
[null,null,null,null,null,{"$f":"[Type]","v":0}]
[null,null,null,null,null,{"$f":"[Type]","v":0}]
[null,null,null,null,null,{"$f":"[Type]","v":0}]
[null,null,null,null,null,{"$f":"[Type]","v":0}]
[null,null,null,null,null,{"$f":"[Type]","v":0}]
[null,null,null,null,null,{"$f":"[Type]","v":0}]
[null,null,null,null,null,{"$f":"[Type]","v":0}]
[null,null,null,null,null,{"$f":"[Type]","v":0}]
[null,null,null,null,null,{"$f":"[Type]","v":0}]
[null,null,null,null,null,{"$f":"[Type]","v":0}]
[null,null,null,null,null,{"$f":"[Type]","v":0}]
[null,null,null,null,null,{"$f":"[Type]","v":0}]
[null,null,null,null,null,{"$f":"[Type]","v":0}]
[null,null,null,null,null,{"$f":"[Type]","v":0}]
[null,null,null,null,null,{"$f":"[Type]","v":0}]
[null,null,null,null,null,{"$f":"[Type]","v":0}]
[null,null,null,null,null,{"$f":"[Type]","v":0}]
[null,null,null,null,null,{"$f":"[Type]","v":0}]
[null,null,null,null,null,{"$f":"[Type]","v":0}]
[null,null,null,null,null,{"$f":"[Type]","v":0}]
[null,null,null,null,null,{"$f":"[Type]","v":0}]
[null,null,null,null,null,{"$f":"[Type]","v":0}]
[null,null,null,null,null,{"$f":"[Type]","v":0}]
[null,null,null,null,null,{"$f":"[Type]","v":0}]
[null,null,null,null,null,{"$f":"[Type]","v":0}]
[null,null,null,null,null,{"$f":"[Type]","v":0}]
[null,null,null,null,null,{"$f":"[Type]","v":0}]
[null,null,null,null,null,{"$f":"[Type]","v":0}]
[null,null,null,null,null,{"$f":"[Type]","v":0}]
[null,null,null,null,null,{"$f":"[Type]","v":0}]
[null,null,null,null,null,{"$f":"[Type]","v":0}]
[null,null,null,null,null,{"$f":"[Type]","v":0}]
[null,null,null,null,null,{"$f":"[Type]","v":0}]
[null,null,null,null,null,{"$f":"[Type]","v":0}]
[null,null,null,null,null,{"$f":"[Type]","v":0}]
[null,null,null,null,null,{"$f":"[Type]","v":0}]
[null,null,null,null,null,{"$f":"[Type]","v":0}]
[null,null,null,null,null,{"$f":"[Type]","v":0}]
[null,null,null,null,null,{"$f":"[Type]","v":0}]
[null,null,null,null,null,{"$f":"[Type]","v":0}]
[null,null,null,null,null,{"$f":"[Type]","v":0}]
[null,null,null,null,null,{"$f":"[Type]","v":0}]
[null,null,null,null,null,{"$f":"[Type]","v":0}]
[null,null,null,null,null,{"$f":"[Type]","v":0}]
[null,null,null,null,null,{"$f":"[Type]","v":0}]
[null,null,null,null,null,{"$f":"[Type]","v":0}]
[null,null,null,null,null,{"$f":"[Type]","v":0}]
[null,null,null,null,null,{"$f":"[Type]","v":0}]
[null,null,null,null,null,{"$f":"[Type]","v":0}]
[null,null,null,null,null,{"$f":"[Type]","v":0}]
[null,null,null,null,null,{"$f":"[Type]","v":0}]
[null,null,null,null,null,{"$f":"[Type]","v":0}]
[null,null,null,null,null,{"$f":"[Type]","v":0}]
[null,null,null,null,null,{"$f":"[Type]","v":0}]
[null,null,null,null,null,{"$f":"[Type]","v":0}]
[null,null,null,null,null,{"$f":"[Type]","v":0}]
[null,null,null,null,null,{"$f":"[Type]","v":0}]
[null,null,null,null,null,{"$f":"[Type]","v":0}]
[null,null,null,null,null,{"$f":"[Type]","v":0}]
[null,null,null,null,null,{"$f":"[Type]","v":0}]
[null,null,null,null,null,{"$f":"[Type]","v":0}]
[null,null,null,null,null,{"$f":"[Type]","v":0}]
[null,null,null,null,null,{"$f":"[Type]","v":0}]
[null,null,null,null,null,{"$f":"[Type]","v":0}]
[null,null,null,null,null,{"$f":"[Type]","v":0}]
[null,null,null,null,null,{"$f":"[Type]","v":0}]
[null,null,null,null,null,{"$f":"[Type]","v":0}]
[null,null,null,null,null,{"$f":"[Type]","v":0}]
[null,null,null,null,null,{"$f":"[Type]","v":0}]
[null,null,null,null,null,{"$f":"[Type]","v":0}]
[null,null,null,null,null,{"$f":"[Type]","v":0}]
[null,null,null,null,null,{"$f":"[Type]","v":0}]
[null,null,null,null,null,{"$f":"[Type]","v":0}]
[null,null,null,null,null,{"$f":"[Type]","v":0}]
[null,null,null,null,null,{"$f":"[Type]","v":0}]
[null,null,null,null,null,{"$f":"[Type]","v":0}]
[null,null,null,null,null,{"$f":"[Type]","v":0}]
[null,null,null,null,null,{"$f":"[Type]","v":0}]
[null,null,null,null,null,{"$f":"[Type]","v":0}]
[null,null,null,null,null,{"$f":"[Type]","v":0}]
[null,null,null,null,null,{"$f":"[Type]","v":0}]
[null,null,null,null,null,{"$f":"[Type]","v":0}]
[null,null,null,null,null,{"$f":"[Type]","v":0}]
[null,null,null,null,null,{"$f":"[Type]","v":0}]
[null,null,null,null,null,{"$f":"[Type]","v":0}]
[null,null,null,null,null,{"$f":"[Type]","v":0}]
[null,null,null,null,null,{"$f":"[Type]","v":0}]
[null,null,null,null,null,{"$f":"[Type]","v":0}]
[null,null,null,null,null,{"$f":"[Type]","v":0}]
[null,null,null,null,null,{"$f":"[Type]","v":0}]
[null,null,null,null,null,{"$f":"[Type]","v":0}]
[null,null,null,null,null,{"$f":"[Type]","v":0}]
[null,null,null,null,null,{"$f":"[Type]","v":0}]
[null,null,null,null,null,{"$f":"[Type]","v":0}]
[null,null,null,null,null,{"$f":"[Type]","v":0}]
[null,null,null,null,null,{"$f":"[Type]","v":0}]
[null,null,null,null,null,{"$f":"[Type]","v":0}]
[null,null,null,null,null,{"$f":"[Type]","v":0}]
[null,null,null,null,null,{"$f":"[Type]","v":0}]
[null,null,null,null,null,{"$f":"[Type]","v":0}]
[null,null,null,null,null,{"$f":"[Type]","v":0}]
[null,null,null,null,null,{"$f":"[Type]","v":0}]
[null,null,null,null,null,{"$f":"[Type]","v":0}]
[null,null,null,null,null,{"$f":"[Type]","v":0}]
[null,null,null,null,null,{"$f":"[Type]","v":0}]
[null,null,null,null,null,{"$f":"[Type]","v":0}]
[null,null,null,null,null,{"$f":"[Type]","v":0}]
[null,null,null,null,null,{"$f":"[Type]","v":0}]
[null,null,null,null,null,{"$f":"[Type]","v":0}]
[null,null,null,null,null,{"$f":"[Type]","v":0}]
[null,null,null,null,null,{"$f":"[Type]","v":0}]
[null,null,null,null,null,{"$f":"[Type]","v":0}]
[null,null,null,null,null,{"$f":"[Type]","v":0}]
[null,null,null,null,null,{"$f":"[Type]","v":0}]
[null,null,null,null,null,{"$f":"[Type]","v":0}]
[null,null,null,null,null,{"$f":"[Type]","v":0}]
[null,null,null,null,null,{"$f":"[Type]","v":0}]
[null,null,null,null,null,{"$f":"[Type]","v":0}]
[null,null,null,null,null,{"$f":"[Type]","v":0}]
[null,null,null,null,null,{"$f":"[Type]","v":0}]
[null,null,null,null,null,{"$f":"[Type]","v":0}]
[null,null,null,null,null,{"$f":"[Type]","v":0}]
[null,null,null,null,null,{"$f":"[Type]","v":0}]
[null,null,null,null,null,{"$f":"[Type]","v":0}]
[null,null,null,null,null,{"$f":"[Type]","v":0}]
[null,null,null,null,null,{"$f":"[Type]","v":0}]
[null,null,null,null,null,{"$f":"[Type]","v":0}]
[null,null,null,null,null,{"$f":"[Type]","v":0}]
[null,null,null,null,null,{"$f":"[Type]","v":0}]
[null,null,null,null,null,{"$f":"[Type]","v":0}]
[null,null,null,null,null,{"$f":"[Type]","v":0}]
[null,null,null,null,null,{"$f":"[Type]","v":0}]
[null,null,null,null,null,{"$f":"[Type]","v":0}]
[null,null,null,null,null,{"$f":"[Type]","v":0}]
[null,null,null,null,null,{"$f":"[Type]","v":0}]
[null,null,null,null,null,{"$f":"[Type]","v":0}]
[null,null,null,null,null,{"$f":"[Type]","v":0}]
[null,null,null,null,null,{"$f":"[Type]","v":0}]
[null,null,null,null,null,{"$f":"[Type]","v":0}]
[null,null,null,null,null,{"$f":"[Type]","v":0}]
[null,null,null,null,null,{"$f":"[Type]","v":0}]
[null,null,null,null,null,{"$f":"[Type]","v":0}]
[null,null,null,null,null,{"$f":"[Type]","v":0}]
[null,null,null,null,null,{"$f":"[Type]","v":0}]
[null,null,null,null,null,{"$f":"[Type]","v":0}]
[null,null,null,null,null,{"$f":"[Type]","v":0}]
[null,null,null,null,null,{"$f":"[Type]","v":0}]
[null,null,null,null,null,{"$f":"[Type]","v":0}]
[null,null,null,null,null,{"$f":"[Type]","v":0}]
[null,null,null,null,null,{"$f":"[Type]","v":0}]
[null,null,null,null,null,{"$f":"[Type]","v":0}]
[null,null,null,null,null,{"$f":"[Type]","v":0}]
[null,null,null,null,null,{"$f":"[Type]","v":0}]
[null,null,null,null,null,{"$f":"[Type]","v":0}]
[null,null,null,null,null,{"$f":"[Type]","v":0}]
[null,null,null,null,null,{"$f":"[Type]","v":0}]
[null,null,null,null,null,{"$f":"[Type]","v":0}]
[null,null,null,null,null,{"$f":"[Type]","v":0}]
[null,null,null,null,null,{"$f":"[Type]","v":0}]
[null,null,null,null,null,{"$f":"[Type]","v":0}]
[null,null,null,null,null,{"$f":"[Type]","v":0}]
[null,null,null,null,null,{"$f":"[Type]","v":0}]
[null,null,null,null,null,{"$f":"[Type]","v":0}]
[null,null,null,null,null,{"$f":"[Type]","v":0}]
[null,null,null,null,null,{"$f":"[Type]","v":0}]
[null,null,null,null,null,{"$f":"[Type]","v":0}]
[null,null,null,null,null,{"$f":"[Type]","v":0}]
[null,null,null,null,null,{"$f":"[Type]","v":0}]
[null,null,null,null,null,{"$f":"[Type]","v":0}]
[null,null,null,null,null,{"$f":"[Type]","v":0}]
[null,null,null,null,null,{"$f":"[Type]","v":0}]
[null,null,null,null,null,{"$f":"[Type]","v":0}]
[null,null,null,null,null,{"$f":"[Type]","v":0}]
[null,null,null,null,null,{"$f":"[Type]","v":0}]
[null,null,null,null,null,{"$f":"[Type]","v":0}]
[null,null,null,null,null,{"$f":"[Type]","v":0}]
[null,null,null,null,null,{"$f":"[Type]","v":0}]
[null,null,null,null,null,{"$f":"[Type]","v":0}]
[null,null,null,null,null,{"$f":"[Type]","v":0}]
[null,null,null,null,null,{"$f":"[Type]","v":0}]
[null,null,null,null,null,{"$f":"[Type]","v":0}]
[null,null,null,null,null,{"$f":"[Type]","v":0}]
[null,null,null,null,null,{"$f":"[Type]","v":0}]
[null,null,null,null,null,{"$f":"[Type]","v":0}]
[null,null,null,null,null,{"$f":"[Type]","v":0}]
[null,null,null,null,null,{"$f":"[Type]","v":0}]
[null,null,null,null,null,{"$f":"[Type]","v":0}]
[null,null,null,null,null,{"$f":"[Type]","v":0}]
[null,null,null,null,null,{"$f":"[Type]","v":0}]
[null,null,null,null,null,{"$f":"[Type]","v":0}]
[null,null,null,null,null,{"$f":"[Type]","v":0}]
[null,null,null,null,null,{"$f":"[Type]","v":0}]
[null,null,null,null,null,{"$f":"[Type]","v":0}]
[null,null,null,null,null,{"$f":"[Type]","v":0}]
[null,null,null,null,null,{"$f":"[Type]","v":0}]
[null,null,null,null,null,{"$f":"[Type]","v":0}]
[null,null,null,null,null,{"$f":"[Type]","v":0}]
[null,null,null,null,null,{"$f":"[Type]","v":0}]
[null,null,null,null,null,{"$f":"[Type]","v":0}]
[null,null,null,null,null,{"$f":"[Type]","v":0}]
[null,null,null,null,null,{"$f":"[Type]","v":0}]
[null,null,null,null,null,{"$f":"[Type]","v":0}]
[null,null,null,null,null,{"$f":"[Type]","v":0}]
[null,null,null,null,null,{"$f":"[Type]","v":0}]
[null,null,null,null,null,{"$f":"[Type]","v":0}]
[null,null,null,null,null,{"$f":"[Type]","v":0}]
[null,null,null,null,null,{"$f":"[Type]","v":0}]
[null,null,null,null,null,{"$f":"[Type]","v":0}]
[null,null,null,null,null,{"$f":"[Type]","v":0}]
[null,null,null,null,null,{"$f":"[Type]","v":0}]
[null,null,null,null,null,{"$f":"[Type]","v":0}]
[null,null,null,null,null,{"$f":"[Type]","v":0}]
[null,null,null,null,null,{"$f":"[Type]","v":0}]
[null,null,null,null,null,{"$f":"[Type]","v":0}]
[null,null,null,null,null,{"$f":"[Type]","v":0}]
[null,null,null,null,null,{"$f":"[Type]","v":0}]
[null,null,null,null,null,{"$f":"[Type]","v":0}]
[null,null,null,null,null,{"$f":"[Type]","v":0}]
[null,null,null,null,null,{"$f":"[Type]","v":0}]
[null,null,null,null,null,{"$f":"[Type]","v":0}]
[null,null,null,null,null,{"$f":"[Type]","v":0}]
[null,null,null,null,null,{"$f":"[Type]","v":0}]
[null,null,null,null,null,{"$f":"[Type]","v":0}]
[null,null,null,null,null,{"$f":"[Type]","v":0}]
[null,null,null,null,null,{"$f":"[Type]","v":0}]
[null,null,null,null,null,{"$f":"[Type]","v":0}]
[null,null,null,null,null,{"$f":"[Type]","v":0}]
[null,null,null,null,null,{"$f":"[Type]","v":0}]
[null,null,null,null,null,{"$f":"[Type]","v":0}]
[null,null,null,null,null,{"$f":"[Type]","v":0}]
[null,null,null,null,null,{"$f":"[Type]","v":0}]
[null,null,null,null,null,{"$f":"[Type]","v":0}]
[null,null,null,null,null,{"$f":"[Type]","v":0}]
[null,null,null,null,null,{"$f":"[Type]","v":0}]
[null,null,null,null,null,{"$f":"[Type]","v":0}]
[null,null,null,null,null,{"$f":"[Type]","v":0}]
[null,null,null,null,null,{"$f":"[Type]","v":0}]
[null,null,null,null,null,{"$f":"[Type]","v":0}]
[null,null,null,null,null,{"$f":"[Type]","v":0}]
[null,null,null,null,null,{"$f":"[Type]","v":0}]
[null,null,null,null,null,{"$f":"[Type]","v":0}]
[null,null,null,null,null,{"$f":"[Type]","v":0}]
[null,null,null,null,null,{"$f":"[Type]","v":0}]
[null,null,null,null,null,{"$f":"[Type]","v":0}]
[null,null,null,null,null,{"$f":"[Type]","v":0}]
[null,null,null,null,null,{"$f":"[Type]","v":0}]
[null,null,null,null,null,{"$f":"[Type]","v":0}]
[null,null,null,null,null,{"$f":"[Type]","v":0}]
[null,null,null,null,null,{"$f":"[Type]","v":0}]
[null,null,null,null,null,{"$f":"[Type]","v":0}]
[null,null,null,null,null,{"$f":"[Type]","v":0}]
[null,null,null,null,null,{"$f":"[Type]","v":0}]
[null,null,null,null,null,{"$f":"[Type]","v":0}]
[null,null,null,null,null,{"$f":"[Type]","v":0}]
[null,null,null,null,null,{"$f":"[Type]","v":0}]
[null,null,null,null,null,{"$f":"[Type]","v":0}]
[null,null,null,null,null,{"$f":"[Type]","v":0}]
[null,null,null,null,null,{"$f":"[Type]","v":0}]
[null,null,null,null,null,{"$f":"[Type]","v":0}]
[null,null,null,null,null,{"$f":"[Type]","v":0}]
[null,null,null,null,null,{"$f":"[Type]","v":0}]
[null,null,null,null,null,{"$f":"[Type]","v":0}]
[null,null,null,null,null,{"$f":"[Type]","v":0}]
[null,null,null,null,null,{"$f":"[Type]","v":0}]
[null,null,null,null,null,{"$f":"[Type]","v":0}]
[null,null,null,null,null,{"$f":"[Type]","v":0}]
[null,null,null,null,null,{"$f":"[Type]","v":0}]
[null,null,null,null,null,{"$f":"[Type]","v":0}]
[null,null,null,null,null,{"$f":"[Type]","v":0}]
[null,null,null,null,null,{"$f":"[Type]","v":0}]
[null,null,null,null,null,{"$f":"[Type]","v":0}]
[null,null,null,null,null,{"$f":"[Type]","v":0}]
[null,null,null,null,null,{"$f":"[Type]","v":0}]
[null,null,null,null,null,{"$f":"[Type]","v":0}]
[null,null,null,null,null,{"$f":"[Type]","v":0}]
[null,null,null,null,null,{"$f":"[Type]","v":0}]
[null,null,null,null,null,{"$f":"[Type]","v":0}]
[null,null,null,null,null,{"$f":"[Type]","v":0}]
[null,null,null,null,null,{"$f":"[Type]","v":0}]
[null,null,null,null,null,{"$f":"[Type]","v":0}]
[null,null,null,null,null,{"$f":"[Type]","v":0}]
[null,null,null,null,null,{"$f":"[Type]","v":0}]
[null,null,null,null,null,{"$f":"[Type]","v":0}]
[null,null,null,null,null,{"$f":"[Type]","v":0}]
[null,null,null,null,null,{"$f":"[Type]","v":0}]
[null,null,null,null,null,{"$f":"[Type]","v":0}]
[null,null,null,null,null,{"$f":"[Type]","v":0}]
[null,null,null,null,null,{"$f":"[Type]","v":0}]
[null,null,null,null,null,{"$f":"[Type]","v":0}]
[null,null,null,null,null,{"$f":"[Type]","v":0}]
[null,null,null,null,null,{"$f":"[Type]","v":0}]
[null,null,null,null,null,{"$f":"[Type]","v":0}]
[null,null,null,null,null,{"$f":"[Type]","v":0}]
[null,null,null,null,null,{"$f":"[Type]","v":0}]
[null,null,null,null,null,{"$f":"[Type]","v":0}]
[null,null,null,null,null,{"$f":"[Type]","v":0}]
[null,null,null,null,null,{"$f":"[Type]","v":0}]
[null,null,null,null,null,{"$f":"[Type]","v":0}]
[null,null,null,null,null,{"$f":"[Type]","v":0}]
[null,null,null,null,null,{"$f":"[Type]","v":0}]
[null,null,null,null,null,{"$f":"[Type]","v":0}]
[null,null,null,null,null,{"$f":"[Type]","v":0}]
[null,null,null,null,null,{"$f":"[Type]","v":0}]
[null,null,null,null,null,{"$f":"[Type]","v":0}]
[null,null,null,null,null,{"$f":"[Type]","v":0}]
[null,null,null,null,null,{"$f":"[Type]","v":0}]
[null,null,null,null,null,{"$f":"[Type]","v":0}]
[null,null,null,null,null,{"$f":"[Type]","v":0}]
[null,null,null,null,null,{"$f":"[Type]","v":0}]
[null,null,null,null,null,{"$f":"[Type]","v":0}]
[null,null,null,null,null,{"$f":"[Type]","v":0}]
[null,null,null,null,null,{"$f":"[Type]","v":0}]
[null,null,null,null,null,{"$f":"[Type]","v":0}]
[null,null,null,null,null,{"$f":"[Type]","v":0}]
[null,null,null,null,null,{"$f":"[Type]","v":0}]
[null,null,null,null,null,{"$f":"[Type]","v":0}]
[null,null,null,null,null,{"$f":"[Type]","v":0}]
[null,null,null,null,null,{"$f":"[Type]","v":0}]
[null,null,null,null,null,{"$f":"[Type]","v":0}]
[null,null,null,null,null,{"$f":"[Type]","v":0}]
[null,null,null,null,null,{"$f":"[Type]","v":0}]
[null,null,null,null,null,{"$f":"[Type]","v":0}]
[null,null,null,null,null,{"$f":"[Type]","v":0}]
[null,null,null,null,null,{"$f":"[Type]","v":0}]
[null,null,null,null,null,{"$f":"[Type]","v":0}]
[null,null,null,null,null,{"$f":"[Type]","v":0}]
[null,null,null,null,null,{"$f":"[Type]","v":0}]
[null,null,null,null,null,{"$f":"[Type]","v":0}]
[null,null,null,null,null,{"$f":"[Type]","v":0}]
[null,null,null,null,null,{"$f":"[Type]","v":0}]
[null,null,null,null,null,{"$f":"[Type]","v":0}]
[null,null,null,null,null,{"$f":"[Type]","v":0}]
[null,null,null,null,null,{"$f":"[Type]","v":0}]
[null,null,null,null,null,{"$f":"[Type]","v":0}]
[null,null,null,null,null,{"$f":"[Type]","v":0}]
[null,null,null,null,null,{"$f":"[Type]","v":0}]
[null,null,null,null,null,{"$f":"[Type]","v":0}]
[null,null,null,null,null,{"$f":"[Type]","v":0}]
[null,null,null,null,null,{"$f":"[Type]","v":0}]
[null,null,null,null,null,{"$f":"[Type]","v":0}]
[null,null,null,null,null,{"$f":"[Type]","v":0}]
[null,null,null,null,null,{"$f":"[Type]","v":0}]
[null,null,null,null,null,{"$f":"[Type]","v":0}]
[null,null,null,null,null,{"$f":"[Type]","v":0}]
[null,null,null,null,null,{"$f":"[Type]","v":0}]
[null,null,null,null,null,{"$f":"[Type]","v":0}]
[null,null,null,null,null,{"$f":"[Type]","v":0}]
[null,null,null,null,null,{"$f":"[Type]","v":0}]
[null,null,null,null,null,{"$f":"[Type]","v":0}]
[null,null,null,null,null,{"$f":"[Type]","v":0}]
[null,null,null,null,null,{"$f":"[Type]","v":0}]
[null,null,null,null,null,{"$f":"[Type]","v":0}]
[null,null,null,null,null,{"$f":"[Type]","v":0}]
[null,null,null,null,null,{"$f":"[Type]","v":0}]
[null,null,null,null,null,{"$f":"[Type]","v":0}]
[null,null,null,null,null,{"$f":"[Type]","v":0}]
[null,null,null,null,null,{"$f":"[Type]","v":0}]
[null,null,null,null,null,{"$f":"[Type]","v":0}]
[null,null,null,null,null,{"$f":"[Type]","v":0}]
[null,null,null,null,null,{"$f":"[Type]","v":0}]
[null,null,null,null,null,{"$f":"[Type]","v":0}]
[null,null,null,null,null,{"$f":"[Type]","v":0}]
[null,null,null,null,null,{"$f":"[Type]","v":0}]
[null,null,null,null,null,{"$f":"[Type]","v":0}]
[null,null,null,null,null,{"$f":"[Type]","v":0}]
[null,null,null,null,null,{"$f":"[Type]","v":0}]
[null,null,null,null,null,{"$f":"[Type]","v":0}]
[null,null,null,null,null,{"$f":"[Type]","v":0}]
[null,null,null,null,null,{"$f":"[Type]","v":0}]
[null,null,null,null,null,{"$f":"[Type]","v":0}]
[null,null,null,null,null,{"$f":"[Type]","v":0}]
[null,null,null,null,null,{"$f":"[Type]","v":0}]
[null,null,null,null,null,{"$f":"[Type]","v":0}]
[null,null,null,null,null,{"$f":"[Type]","v":0}]
[null,null,null,null,null,{"$f":"[Type]","v":0}]
[null,null,null,null,null,{"$f":"[Type]","v":0}]
[null,null,null,null,null,{"$f":"[Type]","v":0}]
[null,null,null,null,null,{"$f":"[Type]","v":0}]
[null,null,null,null,null,{"$f":"[Type]","v":0}]
[null,null,null,null,null,{"$f":"[Type]","v":0}]
[null,null,null,null,null,{"$f":"[Type]","v":0}]
[null,null,null,null,null,{"$f":"[Type]","v":0}]
[null,null,null,null,null,{"$f":"[Type]","v":0}]
[null,null,null,null,null,{"$f":"[Type]","v":0}]
[null,null,null,null,null,{"$f":"[Type]","v":0}]
[null,null,null,null,null,{"$f":"[Type]","v":0}]
[null,null,null,null,null,{"$f":"[Type]","v":0}]
[null,null,null,null,null,{"$f":"[Type]","v":0}]
[null,null,null,null,null,{"$f":"[Type]","v":0}]
[null,null,null,null,null,{"$f":"[Type]","v":0}]
[null,null,null,null,null,{"$f":"[Type]","v":0}]
[null,null,null,null,null,{"$f":"[Type]","v":0}]
[null,null,null,null,null,{"$f":"[Type]","v":0}]
[null,null,null,null,null,{"$f":"[Type]","v":0}]
[null,null,null,null,null,{"$f":"[Type]","v":0}]
[null,null,null,null,null,{"$f":"[Type]","v":0}]
[null,null,null,null,null,{"$f":"[Type]","v":0}]
[null,null,null,null,null,{"$f":"[Type]","v":0}]
[null,null,null,null,null,{"$f":"[Type]","v":0}]
[null,null,null,null,null,{"$f":"[Type]","v":0}]
[null,null,null,null,null,{"$f":"[Type]","v":0}]
[null,null,null,null,null,{"$f":"[Type]","v":0}]
[null,null,null,null,null,{"$f":"[Type]","v":0}]
[null,null,null,null,null,{"$f":"[Type]","v":0}]
[null,null,null,null,null,{"$f":"[Type]","v":0}]
[null,null,null,null,null,{"$f":"[Type]","v":0}]
[null,null,null,null,null,{"$f":"[Type]","v":0}]
[null,null,null,null,null,{"$f":"[Type]","v":0}]
[null,null,null,null,null,{"$f":"[Type]","v":0}]
[null,null,null,null,null,{"$f":"[Type]","v":0}]
[null,null,null,null,null,{"$f":"[Type]","v":0}]
[null,null,null,null,null,{"$f":"[Type]","v":0}]
[null,null,null,null,null,{"$f":"[Type]","v":0}]
[null,null,null,null,null,{"$f":"[Type]","v":0}]
[null,null,null,null,null,{"$f":"[Type]","v":0}]
[null,null,null,null,null,{"$f":"[Type]","v":0}]
[null,null,null,null,null,{"$f":"[Type]","v":0}]
[null,null,null,null,null,{"$f":"[Type]","v":0}]
[null,null,null,null,null,{"$f":"[Type]","v":0}]
[null,null,null,null,null,{"$f":"[Type]","v":0}]
[null,null,null,null,null,{"$f":"[Type]","v":0}]
[null,null,null,null,null,{"$f":"[Type]","v":0}]
[null,null,null,null,null,{"$f":"[Type]","v":0}]
[null,null,null,null,null,{"$f":"[Type]","v":0}]
[null,null,null,null,null,{"$f":"[Type]","v":0}]
[null,null,null,null,null,{"$f":"[Type]","v":0}]
[null,null,null,null,null,{"$f":"[Type]","v":0}]
[null,null,null,null,null,{"$f":"[Type]","v":0}]
[null,null,null,null,null,{"$f":"[Type]","v":0}]
[null,null,null,null,null,{"$f":"[Type]","v":0}]
[null,null,null,null,null,{"$f":"[Type]","v":0}]
[null,null,null,null,null,{"$f":"[Type]","v":0}]
[null,null,null,null,null,{"$f":"[Type]","v":0}]
[null,null,null,null,null,{"$f":"[Type]","v":0}]
[null,null,null,null,null,{"$f":"[Type]","v":0}]
[null,null,null,null,null,{"$f":"[Type]","v":0}]
[null,null,null,null,null,{"$f":"[Type]","v":0}]
[null,null,null,null,null,{"$f":"[Type]","v":0}]
[null,null,null,null,null,{"$f":"[Type]","v":0}]
[null,null,null,null,null,{"$f":"[Type]","v":0}]
[null,null,null,null,null,{"$f":"[Type]","v":0}]
[null,null,null,null,null,{"$f":"[Type]","v":0}]
[null,null,null,null,null,{"$f":"[Type]","v":0}]
[null,null,null,null,null,{"$f":"[Type]","v":0}]
[null,null,null,null,null,{"$f":"[Type]","v":0}]
[null,null,null,null,null,{"$f":"[Type]","v":0}]
[null,null,null,null,null,{"$f":"[Type]","v":0}]
[null,null,null,null,null,{"$f":"[Type]","v":0}]
[null,null,null,null,null,{"$f":"[Type]","v":0}]
[null,null,null,null,null,{"$f":"[Type]","v":0}]
[null,null,null,null,null,{"$f":"[Type]","v":0}]
[null,null,null,null,null,{"$f":"[Type]","v":0}]
[null,null,null,null,null,{"$f":"[Type]","v":0}]
[null,null,null,null,null,{"$f":"[Type]","v":0}]
[null,null,null,null,null,{"$f":"[Type]","v":0}]
[null,null,null,null,null,{"$f":"[Type]","v":0}]
[null,null,null,null,null,{"$f":"[Type]","v":0}]
[null,null,null,null,null,{"$f":"[Type]","v":0}]
[null,null,null,null,null,{"$f":"[Type]","v":0}]
[null,null,null,null,null,{"$f":"[Type]","v":0}]
[null,null,null,null,null,{"$f":"[Type]","v":0}]
[null,null,null,null,null,{"$f":"[Type]","v":0}]
[null,null,null,null,null,{"$f":"[Type]","v":0}]
[null,null,null,null,null,{"$f":"[Type]","v":0}]
[null,null,null,null,null,{"$f":"[Type]","v":0}]
[null,null,null,null,null,{"$f":"[Type]","v":0}]
[null,null,null,null,null,{"$f":"[Type]","v":0}]
[null,null,null,null,null,{"$f":"[Type]","v":0}]
[null,null,null,null,null,{"$f":"[Type]","v":0}]
[null,null,null,null,null,{"$f":"[Type]","v":0}]
[null,null,null,null,null,{"$f":"[Type]","v":0}]
[null,null,null,null,null,{"$f":"[Type]","v":0}]
[null,null,null,null,null,{"$f":"[Type]","v":0}]
[null,null,null,null,null,{"$f":"[Type]","v":0}]
[null,null,null,null,null,{"$f":"[Type]","v":0}]
[null,null,null,null,null,{"$f":"[Type]","v":0}]
[null,null,null,null,null,{"$f":"[Type]","v":0}]
[null,null,null,null,null,{"$f":"[Type]","v":0}]
[null,null,null,null,null,{"$f":"[Type]","v":0}]
[null,null,null,null,null,{"$f":"[Type]","v":0}]
[null,null,null,null,null,{"$f":"[Type]","v":0}]
[null,null,null,null,null,{"$f":"[Type]","v":0}]
[null,null,null,null,null,{"$f":"[Type]","v":0}]
[null,null,null,null,null,{"$f":"[Type]","v":0}]
[null,null,null,null,null,{"$f":"[Type]","v":0}]
[null,null,null,null,null,{"$f":"[Type]","v":0}]
[null,null,null,null,null,{"$f":"[Type]","v":0}]
[null,null,null,null,null,{"$f":"[Type]","v":0}]
[null,null,null,null,null,{"$f":"[Type]","v":0}]
[null,null,null,null,null,{"$f":"[Type]","v":0}]
[null,null,null,null,null,{"$f":"[Type]","v":0}]
[null,null,null,null,null,{"$f":"[Type]","v":0}]
[null,null,null,null,null,{"$f":"[Type]","v":0}]
[null,null,null,null,null,{"$f":"[Type]","v":0}]
[null,null,null,null,null,{"$f":"[Type]","v":0}]
[null,null,null,null,null,{"$f":"[Type]","v":0}]
[null,null,null,null,null,{"$f":"[Type]","v":0}]
[null,null,null,null,null,{"$f":"[Type]","v":0}]
[null,null,null,null,null,{"$f":"[Type]","v":0}]
[null,null,null,null,null,{"$f":"[Type]","v":0}]
[null,null,null,null,null,{"$f":"[Type]","v":0}]
[null,null,null,null,null,{"$f":"[Type]","v":0}]
[null,null,null,null,null,{"$f":"[Type]","v":0}]
[null,null,null,null,null,{"$f":"[Type]","v":0}]
[null,null,null,null,null,{"$f":"[Type]","v":0}]
[null,null,null,null,null,{"$f":"[Type]","v":0}]
[null,null,null,null,null,{"$f":"[Type]","v":0}]
[null,null,null,null,null,{"$f":"[Type]","v":0}]
[null,null,null,null,null,{"$f":"[Type]","v":0}]
[null,null,null,null,null,{"$f":"[Type]","v":0}]
[null,null,null,null,null,{"$f":"[Type]","v":0}]
[null,null,null,null,null,{"$f":"[Type]","v":0}]
[null,null,null,null,null,{"$f":"[Type]","v":0}]
[null,null,null,null,null,{"$f":"[Type]","v":0}]
[null,null,null,null,null,{"$f":"[Type]","v":0}]
[null,null,null,null,null,{"$f":"[Type]","v":0}]
[null,null,null,null,null,{"$f":"[Type]","v":0}]
[null,null,null,null,null,{"$f":"[Type]","v":0}]
[null,null,null,null,null,{"$f":"[Type]","v":0}]
[null,null,null,null,null,{"$f":"[Type]","v":0}]
[null,null,null,null,null,{"$f":"[Type]","v":0}]
[null,null,null,null,null,{"$f":"[Type]","v":0}]
[null,null,null,null,null,{"$f":"[Type]","v":0}]
[null,null,null,null,null,{"$f":"[Type]","v":0}]
[null,null,null,null,null,{"$f":"[Type]","v":0}]
[null,null,null,null,null,{"$f":"[Type]","v":0}]
[null,null,null,null,null,{"$f":"[Type]","v":0}]
[null,null,null,null,null,{"$f":"[Type]","v":0}]
[null,null,null,null,null,{"$f":"[Type]","v":0}]
[null,null,null,null,null,{"$f":"[Type]","v":0}]
[null,null,null,null,null,{"$f":"[Type]","v":0}]
[null,null,null,null,null,{"$f":"[Type]","v":0}]
[null,null,null,null,null,{"$f":"[Type]","v":0}]
[null,null,null,null,null,{"$f":"[Type]","v":0}]
[null,null,null,null,null,{"$f":"[Type]","v":0}]
[null,null,null,null,null,{"$f":"[Type]","v":0}]
[null,null,null,null,null,{"$f":"[Type]","v":0}]
[null,null,null,null,null,{"$f":"[Type]","v":0}]
[null,null,null,null,null,{"$f":"[Type]","v":0}]
[null,null,null,null,null,{"$f":"[Type]","v":0}]
[null,null,null,null,null,{"$f":"[Type]","v":0}]
[null,null,null,null,null,{"$f":"[Type]","v":0}]
[null,null,null,null,null,{"$f":"[Type]","v":0}]
[null,null,null,null,null,{"$f":"[Type]","v":0}]
[null,null,null,null,null,{"$f":"[Type]","v":0}]
[null,null,null,null,null,{"$f":"[Type]","v":0}]
[null,null,null,null,null,{"$f":"[Type]","v":0}]
[null,null,null,null,null,{"$f":"[Type]","v":0}]
[null,null,null,null,null,{"$f":"[Type]","v":0}]
[null,null,null,null,null,{"$f":"[Type]","v":0}]
[null,null,null,null,null,{"$f":"[Type]","v":0}]
[null,null,null,null,null,{"$f":"[Type]","v":0}]
[null,null,null,null,null,{"$f":"[Type]","v":0}]
[null,null,null,null,null,{"$f":"[Type]","v":0}]
[null,null,null,null,null,{"$f":"[Type]","v":0}]
[null,null,null,null,null,{"$f":"[Type]","v":0}]
[null,null,null,null,null,{"$f":"[Type]","v":0}]
[null,null,null,null,null,{"$f":"[Type]","v":0}]
[null,null,null,null,null,{"$f":"[Type]","v":0}]
[null,null,null,null,null,{"$f":"[Type]","v":0}]
[null,null,null,null,null,{"$f":"[Type]","v":0}]
[null,null,null,null,null,{"$f":"[Type]","v":0}]
[null,null,null,null,null,{"$f":"[Type]","v":0}]
[null,null,null,null,null,{"$f":"[Type]","v":0}]
[null,null,null,null,null,{"$f":"[Type]","v":0}]
[null,null,null,null,null,{"$f":"[Type]","v":0}]
[null,null,null,null,null,{"$f":"[Type]","v":0}]
[null,null,null,null,null,{"$f":"[Type]","v":0}]
[null,null,null,null,null,{"$f":"[Type]","v":0}]
[null,null,null,null,null,{"$f":"[Type]","v":0}]
[null,null,null,null,null,{"$f":"[Type]","v":0}]
[null,null,null,null,null,{"$f":"[Type]","v":0}]
[null,null,null,null,null,{"$f":"[Type]","v":0}]
[null,null,null,null,null,{"$f":"[Type]","v":0}]
[null,null,null,null,null,{"$f":"[Type]","v":0}]
[null,null,null,null,null,{"$f":"[Type]","v":0}]
[null,null,null,null,null,{"$f":"[Type]","v":0}]
[null,null,null,null,null,{"$f":"[Type]","v":0}]
[null,null,null,null,null,{"$f":"[Type]","v":0}]
[null,null,null,null,null,{"$f":"[Type]","v":0}]
[null,null,null,null,null,{"$f":"[Type]","v":0}]
[null,null,null,null,null,{"$f":"[Type]","v":0}]
[null,null,null,null,null,{"$f":"[Type]","v":0}]
[null,null,null,null,null,{"$f":"[Type]","v":0}]
[null,null,null,null,null,{"$f":"[Type]","v":0}]
[null,null,null,null,null,{"$f":"[Type]","v":0}]
[null,null,null,null,null,{"$f":"[Type]","v":0}]
[null,null,null,null,null,{"$f":"[Type]","v":0}]
[null,null,null,null,null,{"$f":"[Type]","v":0}]
[null,null,null,null,null,{"$f":"[Type]","v":0}]
[null,null,null,null,null,{"$f":"[Type]","v":0}]
[null,null,null,null,null,{"$f":"[Type]","v":0}]
[null,null,null,null,null,{"$f":"[Type]","v":0}]
[null,null,null,null,null,{"$f":"[Type]","v":0}]
[null,null,null,null,null,{"$f":"[Type]","v":0}]
[null,null,null,null,null,{"$f":"[Type]","v":0}]
[null,null,null,null,null,{"$f":"[Type]","v":0}]
[null,null,null,null,null,{"$f":"[Type]","v":0}]
[null,null,null,null,null,{"$f":"[Type]","v":0}]
[null,null,null,null,null,{"$f":"[Type]","v":0}]
[null,null,null,null,null,{"$f":"[Type]","v":0}]
[null,null,null,null,null,{"$f":"[Type]","v":0}]
[null,null,null,null,null,{"$f":"[Type]","v":0}]
[null,null,null,null,null,{"$f":"[Type]","v":0}]
[null,null,null,null,null,{"$f":"[Type]","v":0}]
[null,null,null,null,null,{"$f":"[Type]","v":0}]
[null,null,null,null,null,{"$f":"[Type]","v":0}]
[null,null,null,null,null,{"$f":"[Type]","v":0}]
[null,null,null,null,null,{"$f":"[Type]","v":0}]
[null,null,null,null,null,{"$f":"[Type]","v":0}]
[null,null,null,null,null,{"$f":"[Type]","v":0}]
[null,null,null,null,null,{"$f":"[Type]","v":0}]
[null,null,null,null,null,{"$f":"[Type]","v":0}]
[null,null,null,null,null,{"$f":"[Type]","v":0}]
[null,null,null,null,null,{"$f":"[Type]","v":0}]
[null,null,null,null,null,{"$f":"[Type]","v":0}]
[null,null,null,null,null,{"$f":"[Type]","v":0}]
[null,null,null,null,null,{"$f":"[Type]","v":0}]
[null,null,null,null,null,{"$f":"[Type]","v":0}]
[null,null,null,null,null,{"$f":"[Type]","v":0}]
[null,null,null,null,null,{"$f":"[Type]","v":0}]
[null,null,null,null,null,{"$f":"[Type]","v":0}]
[null,null,null,null,null,{"$f":"[Type]","v":0}]
[null,null,null,null,null,{"$f":"[Type]","v":0}]
[null,null,null,null,null,{"$f":"[Type]","v":0}]
[null,null,null,null,null,{"$f":"[Type]","v":0}]
[null,null,null,null,null,{"$f":"[Type]","v":0}]
[null,null,null,null,null,{"$f":"[Type]","v":0}]
[null,null,null,null,null,{"$f":"[Type]","v":0}]
[null,null,null,null,null,{"$f":"[Type]","v":0}]
[null,null,null,null,null,{"$f":"[Type]","v":0}]
[null,null,null,null,null,{"$f":"[Type]","v":0}]
[null,null,null,null,null,{"$f":"[Type]","v":0}]
[null,null,null,null,null,{"$f":"[Type]","v":0}]
[null,null,null,null,null,{"$f":"[Type]","v":0}]
[null,null,null,null,null,{"$f":"[Type]","v":0}]
[null,null,null,null,null,{"$f":"[Type]","v":0}]
[null,null,null,null,null,{"$f":"[Type]","v":0}]
[null,null,null,null,null,{"$f":"[Type]","v":0}]
[null,null,null,null,null,{"$f":"[Type]","v":0}]
[null,null,null,null,null,{"$f":"[Type]","v":0}]
[null,null,null,null,null,{"$f":"[Type]","v":0}]
[null,null,null,null,null,{"$f":"[Type]","v":0}]
[null,null,null,null,null,{"$f":"[Type]","v":0}]
[null,null,null,null,null,{"$f":"[Type]","v":0}]
[null,null,null,null,null,{"$f":"[Type]","v":0}]
[null,null,null,null,null,{"$f":"[Type]","v":0}]
[null,null,null,null,null,{"$f":"[Type]","v":0}]
[null,null,null,null,null,{"$f":"[Type]","v":0}]
[null,null,null,null,null,{"$f":"[Type]","v":0}]
[null,null,null,null,null,{"$f":"[Type]","v":0}]
[null,null,null,null,null,{"$f":"[Type]","v":0}]
[null,null,null,null,null,{"$f":"[Type]","v":0}]
[null,null,null,null,null,{"$f":"[Type]","v":0}]
[null,null,null,null,null,{"$f":"[Type]","v":0}]
[null,null,null,null,null,{"$f":"[Type]","v":0}]
[null,null,null,null,null,{"$f":"[Type]","v":0}]
[null,null,null,null,null,{"$f":"[Type]","v":0}]
[null,null,null,null,null,{"$f":"[Type]","v":0}]
[null,null,null,null,null,{"$f":"[Type]","v":0}]
[null,null,null,null,null,{"$f":"[Type]","v":0}]
[null,null,null,null,null,{"$f":"[Type]","v":0}]
[null,null,null,null,null,{"$f":"[Type]","v":0}]
[null,null,null,null,null,{"$f":"[Type]","v":0}]
[null,null,null,null,null,{"$f":"[Type]","v":0}]
[null,null,null,null,null,{"$f":"[Type]","v":0}]
[null,null,null,null,null,{"$f":"[Type]","v":0}]
[null,null,null,null,null,{"$f":"[Type]","v":0}]
[null,null,null,null,null,{"$f":"[Type]","v":0}]
[null,null,null,null,null,{"$f":"[Type]","v":0}]
[null,null,null,null,null,{"$f":"[Type]","v":0}]
[null,null,null,null,null,{"$f":"[Type]","v":0}]
[null,null,null,null,null,{"$f":"[Type]","v":0}]
[null,null,null,null,null,{"$f":"[Type]","v":0}]
[null,null,null,null,null,{"$f":"[Type]","v":0}]
[null,null,null,null,null,{"$f":"[Type]","v":0}]
[null,null,null,null,null,{"$f":"[Type]","v":0}]
[null,null,null,null,null,{"$f":"[Type]","v":0}]
[null,null,null,null,null,{"$f":"[Type]","v":0}]
[null,null,null,null,null,{"$f":"[Type]","v":0}]
[null,null,null,null,null,{"$f":"[Type]","v":0}]
[null,null,null,null,null,{"$f":"[Type]","v":0}]
[null,null,null,null,null,{"$f":"[Type]","v":0}]
[null,null,null,null,null,{"$f":"[Type]","v":0}]
[null,null,null,null,null,{"$f":"[Type]","v":0}]
[null,null,null,null,null,{"$f":"[Type]","v":0}]
[null,null,null,null,null,{"$f":"[Type]","v":0}]
[null,null,null,null,null,{"$f":"[Type]","v":0}]
[null,null,null,null,null,{"$f":"[Type]","v":0}]
[null,null,null,null,null,{"$f":"[Type]","v":0}]
[null,null,null,null,null,{"$f":"[Type]","v":0}]
[null,null,null,null,null,{"$f":"[Type]","v":0}]
[null,null,null,null,null,{"$f":"[Type]","v":0}]
[null,null,null,null,null,{"$f":"[Type]","v":0}]
[null,null,null,null,null,{"$f":"[Type]","v":0}]
[null,null,null,null,null,{"$f":"[Type]","v":0}]
[null,null,null,null,null,{"$f":"[Type]","v":0}]
[null,null,null,null,null,{"$f":"[Type]","v":0}]
[null,null,null,null,null,{"$f":"[Type]","v":0}]
[null,null,null,null,null,{"$f":"[Type]","v":0}]
[null,null,null,null,null,{"$f":"[Type]","v":0}]
[null,null,null,null,null,{"$f":"[Type]","v":0}]
[null,null,null,null,null,{"$f":"[Type]","v":0}]
[null,null,null,null,null,{"$f":"[Type]","v":0}]
[null,null,null,null,null,{"$f":"[Type]","v":0}]
[null,null,null,null,null,{"$f":"[Type]","v":0}]
[null,null,null,null,null,{"$f":"[Type]","v":0}]
[null,null,null,null,null,{"$f":"[Type]","v":0}]
[null,null,null,null,null,{"$f":"[Type]","v":0}]
[null,null,null,null,null,{"$f":"[Type]","v":0}]
[null,null,null,null,null,{"$f":"[Type]","v":0}]
[null,null,null,null,null,{"$f":"[Type]","v":0}]
[null,null,null,null,null,{"$f":"[Type]","v":0}]
[null,null,null,null,null,{"$f":"[Type]","v":0}]
[null,null,null,null,null,{"$f":"[Type]","v":0}]
[null,null,null,null,null,{"$f":"[Type]","v":0}]
[null,null,null,null,null,{"$f":"[Type]","v":0}]
[null,null,null,null,null,{"$f":"[Type]","v":0}]
[null,null,null,null,null,{"$f":"[Type]","v":0}]
[null,null,null,null,null,{"$f":"[Type]","v":0}]
[null,null,null,null,null,{"$f":"[Type]","v":0}]
[null,null,null,null,null,{"$f":"[Type]","v":0}]
[null,null,null,null,null,{"$f":"[Type]","v":0}]
[null,null,null,null,null,{"$f":"[Type]","v":0}]

{"sheet":"Planning","index":1,"n_rows":152,"n_cols":377,"rows_kept":152,"cut":false,"hidden":false,"merged":[[0,2,0,8],[8,2,9,2],[8,4,8,10],[1,4,1,8],[2,4,2,8],[3,4,3,8]]}
[null,null,"Gestion des congés"]
[null,null,"Date de début:",null,"2017-01-01"]
[null,null,"Date de fin:",null,{"$f":"DateDebut+364","v":"2017-12-31"}]
[null,null,"Date du jour:",null,{"$f":"TODAY()","v":"2017-03-29"}]
[]
[null,null,null,null,null,null,null,null,null,null,null,{"$f":"DateDebut","v":42736},{"$f":"L6+1","v":42737},{"$f":"M6+1","v":42738},42739,42740,42741,42742,42743,42744,42745,42746,42747,42748,42749,42750,42751,42752,42753,42754,42755,42756,42757,42758,42759,42760,42761,42762,42763,42764,42765,42766,42767,42768,42769,42770,42771,42772,42773,42774,42775,42776,42777,42778,42779,42780,42781,42782,42783,42784,42785,42786,42787,42788,42789,42790,42791,42792,42793,42794,42795,42796,42797,42798,42799,42800,42801,{"$f":"BY6+1","v":42802},42803,42804,42805,42806,42807,42808,42809,42810,42811,42812,42813,42814,42815,42816,42817,42818,42819,42820,42821,42822,42823,42824,42825,42826,42827,42828,42829,42830,42831,42832,42833,42834,42835,42836,42837,42838,42839,42840,42841,42842,42843,42844,42845,42846,42847,42848,42849,42850,42851,42852,42853,42854,42855,42856,42857,42858,42859,42860,42861,42862,42863,42864,42865,{"$f":"EK6+1","v":42866},42867,42868,42869,42870,42871,42872,42873,42874,42875,42876,42877,42878,42879,42880,42881,42882,42883,42884,42885,42886,42887,42888,42889,42890,42891,42892,42893,42894,42895,42896,42897,42898,42899,42900,42901,42902,42903,42904,42905,42906,42907,42908,42909,42910,42911,42912,42913,42914,42915,42916,42917,42918,42919,42920,42921,42922,42923,42924,42925,42926,42927,42928,42929,{"$f":"GW6+1","v":42930},42931,42932,42933,42934,42935,42936,42937,42938,42939,42940,42941,42942,42943,42944,42945,42946,42947,42948,42949,42950,42951,42952,42953,42954,42955,42956,42957,42958,42959,42960,42961,42962,42963,42964,42965,42966,42967,42968,42969,42970,42971,42972,42973,42974,42975,42976,42977,42978,42979,42980,42981,42982,42983,42984,42985,42986,42987,42988,42989,42990,42991,42992,42993,{"$f":"JI6+1","v":42994},42995,42996,42997,42998,42999,43000,43001,43002,43003,43004,43005,43006,43007,43008,43009,43010,43011,43012,43013,43014,43015,43016,43017,43018,43019,43020,43021,43022,43023,43024,43025,43026,43027,43028,43029,43030,43031,43032,43033,43034,43035,43036,43037,43038,43039,43040,43041,43042,43043,43044,43045,43046,43047,43048,43049,43050,43051,43052,43053,43054,43055,43056,43057,{"$f":"LU6+1","v":43058},43059,43060,43061,43062,43063,43064,43065,43066,43067,43068,43069,43070,43071,43072,43073,43074,43075,43076,43077,43078,43079,43080,43081,43082,43083,43084,43085,43086,43087,43088,43089,43090,43091,43092,43093,43094,43095,43096,43097,43098,43099,43100,43101]
[null,null,null,null,null,null,null,null,null,null,null,{"$f":"IF(L9=1,CHOOSE(MONTH(L6),\"Janvier\",\"Février\",\"Mars\",\"Avril\",\"Mai\",\"Juin\",\"Juillet\",\"Août\",\"Septembre\",\"Octobre\",\"Novembre\",\"Décembre\",\"\"),\"\")","v":"Janvier"},{"$f":"IF(M9=1,CHOOSE(MONTH(M6),\"Janvier\",\"Février\",\"Mars\",\"Avril\",\"Mai\",\"Juin\",\"Juillet\",\"Août\",\"Septembre\",\"Octobre\",\"Novembre\",\"Décembre\",\"\"),\"\")","v":""},"","","","",{"$f":"IF(R9=1,CHOOSE(MONTH(R6),\"Janvier\",\"Février\",\"Mars\",\"Avril\",\"Mai\",\"Juin\",\"Juillet\",\"Août\",\"Septembre\",\"Octobre\",\"Novembre\",\"Décembre\",\"\"),\"\")","v":""},{"$f":"IF(S9=1,CHOOSE(MONTH(S6),\"Janvier\",\"Février\",\"Mars\",\"Avril\",\"Mai\",\"Juin\",\"Juillet\",\"Août\",\"Septembre\",\"Octobre\",\"Novembre\",\"Décembre\",\"\"),\"\")","v":""},{"$f":"IF(T9=1,CHOOSE(MONTH(T6),\"Janvier\",\"Février\",\"Mars\",\"Avril\",\"Mai\",\"Juin\",\"Juillet\",\"Août\",\"Septembre\",\"Octobre\",\"Novembre\",\"Décembre\",\"\"),\"\")","v":""},{"$f":"IF(U9=1,CHOOSE(MONTH(U6),\"Janvier\",\"Février\",\"Mars\",\"Avril\",\"Mai\",\"Juin\",\"Juillet\",\"Août\",\"Septembre\",\"Octobre\",\"Novembre\",\"Décembre\",\"\"),\"\")","v":""},"",{"$f":"IF(W9=1,CHOOSE(MONTH(W6),\"Janvier\",\"Février\",\"Mars\",\"Avril\",\"Mai\",\"Juin\",\"Juillet\",\"Août\",\"Septembre\",\"Octobre\",\"Novembre\",\"Décembre\",\"\"),\"\")","v":""},{"$f":"IF(X9=1,CHOOSE(MONTH(X6),\"Janvier\",\"Février\",\"Mars\",\"Avril\",\"Mai\",\"Juin\",\"Juillet\",\"Août\",\"Septembre\",\"Octobre\",\"Novembre\",\"Décembre\",\"\"),\"\")","v":""},{"$f":"IF(Y9=1,CHOOSE(MONTH(Y6),\"Janvier\",\"Février\",\"Mars\",\"Avril\",\"Mai\",\"Juin\",\"Juillet\",\"Août\",\"Septembre\",\"Octobre\",\"Novembre\",\"Décembre\",\"\"),\"\")","v":""},{"$f":"IF(Z9=1,CHOOSE(MONTH(Z6),\"Janvier\",\"Février\",\"Mars\",\"Avril\",\"Mai\",\"Juin\",\"Juillet\",\"Août\",\"Septembre\",\"Octobre\",\"Novembre\",\"Décembre\",\"\"),\"\")","v":""},"",{"$f":"IF(AB9=1,CHOOSE(MONTH(AB6),\"Janvier\",\"Février\",\"Mars\",\"Avril\",\"Mai\",\"Juin\",\"Juillet\",\"Août\",\"Septembre\",\"Octobre\",\"Novembre\",\"Décembre\",\"\"),\"\")","v":""},{"$f":"IF(AC9=1,CHOOSE(MONTH(AC6),\"Janvier\",\"Février\",\"Mars\",\"Avril\",\"Mai\",\"Juin\",\"Juillet\",\"Août\",\"Septembre\",\"Octobre\",\"Novembre\",\"Décembre\",\"\"),\"\")","v":""},{"$f":"IF(AD9=1,CHOOSE(MONTH(AD6),\"Janvier\",\"Février\",\"Mars\",\"Avril\",\"Mai\",\"Juin\",\"Juillet\",\"Août\",\"Septembre\",\"Octobre\",\"Novembre\",\"Décembre\",\"\"),\"\")","v":""},{"$f":"IF(AE9=1,CHOOSE(MONTH(AE6),\"Janvier\",\"Février\",\"Mars\",\"Avril\",\"Mai\",\"Juin\",\"Juillet\",\"Août\",\"Septembre\",\"Octobre\",\"Novembre\",\"Décembre\",\"\"),\"\")","v":""},"",{"$f":"IF(AG9=1,CHOOSE(MONTH(AG6),\"Janvier\",\"Février\",\"Mars\",\"Avril\",\"Mai\",\"Juin\",\"Juillet\",\"Août\",\"Septembre\",\"Octobre\",\"Novembre\",\"Décembre\",\"\"),\"\")","v":""},{"$f":"IF(AH9=1,CHOOSE(MONTH(AH6),\"Janvier\",\"Février\",\"Mars\",\"Avril\",\"Mai\",\"Juin\",\"Juillet\",\"Août\",\"Septembre\",\"Octobre\",\"Novembre\",\"Décembre\",\"\"),\"\")","v":""},{"$f":"IF(AI9=1,CHOOSE(MONTH(AI6),\"Janvier\",\"Février\",\"Mars\",\"Avril\",\"Mai\",\"Juin\",\"Juillet\",\"Août\",\"Septembre\",\"Octobre\",\"Novembre\",\"Décembre\",\"\"),\"\")","v":""},{"$f":"IF(AJ9=1,CHOOSE(MONTH(AJ6),\"Janvier\",\"Février\",\"Mars\",\"Avril\",\"Mai\",\"Juin\",\"Juillet\",\"Août\",\"Septembre\",\"Octobre\",\"Novembre\",\"Décembre\",\"\"),\"\")","v":""},"",{"$f":"IF(AL9=1,CHOOSE(MONTH(AL6),\"Janvier\",\"Février\",\"Mars\",\"Avril\",\"Mai\",\"Juin\",\"Juillet\",\"Août\",\"Septembre\",\"Octobre\",\"Novembre\",\"Décembre\",\"\"),\"\")","v":""},{"$f":"IF(AM9=1,CHOOSE(MONTH(AM6),\"Janvier\",\"Février\",\"Mars\",\"Avril\",\"Mai\",\"Juin\",\"Juillet\",\"Août\",\"Septembre\",\"Octobre\",\"Novembre\",\"Décembre\",\"\"),\"\")","v":""},{"$f":"IF(AN9=1,CHOOSE(MONTH(AN6),\"Janvier\",\"Février\",\"Mars\",\"Avril\",\"Mai\",\"Juin\",\"Juillet\",\"Août\",\"Septembre\",\"Octobre\",\"Novembre\",\"Décembre\",\"\"),\"\")","v":""},{"$f":"IF(AO9=1,CHOOSE(MONTH(AO6),\"Janvier\",\"Février\",\"Mars\",\"Avril\",\"Mai\",\"Juin\",\"Juillet\",\"Août\",\"Septembre\",\"Octobre\",\"Novembre\",\"Décembre\",\"\"),\"\")","v":""},"",{"$f":"IF(AQ9=1,CHOOSE(MONTH(AQ6),\"Janvier\",\"Février\",\"Mars\",\"Avril\",\"Mai\",\"Juin\",\"Juillet\",\"Août\",\"Septembre\",\"Octobre\",\"Novembre\",\"Décembre\",\"\"),\"\")","v":"Février"},"",{"$f":"IF(AS9=1,CHOOSE(MONTH(AS6),\"Janvier\",\"Février\",\"Mars\",\"Avril\",\"Mai\",\"Juin\",\"Juillet\",\"Août\",\"Septembre\",\"Octobre\",\"Novembre\",\"Décembre\",\"\"),\"\")","v":""},{"$f":"IF(AT9=1,CHOOSE(MONTH(AT6),\"Janvier\",\"Février\",\"Mars\",\"Avril\",\"Mai\",\"Juin\",\"Juillet\",\"Août\",\"Septembre\",\"Octobre\",\"Novembre\",\"Décembre\",\"\"),\"\")","v":""},{"$f":"IF(AU9=1,CHOOSE(MONTH(AU6),\"Janvier\",\"Février\",\"Mars\",\"Avril\",\"Mai\",\"Juin\",\"Juillet\",\"Août\",\"Septembre\",\"Octobre\",\"Novembre\",\"Décembre\",\"\"),\"\")","v":""},{"$f":"IF(AV9=1,CHOOSE(MONTH(AV6),\"Janvier\",\"Février\",\"Mars\",\"Avril\",\"Mai\",\"Juin\",\"Juillet\",\"Août\",\"Septembre\",\"Octobre\",\"Novembre\",\"Décembre\",\"\"),\"\")","v":""},{"$f":"IF(AW9=1,CHOOSE(MONTH(AW6),\"Janvier\",\"Février\",\"Mars\",\"Avril\",\"Mai\",\"Juin\",\"Juillet\",\"Août\",\"Septembre\",\"Octobre\",\"Novembre\",\"Décembre\",\"\"),\"\")","v":""},{"$f":"IF(AX9=1,CHOOSE(MONTH(AX6),\"Janvier\",\"Février\",\"Mars\",\"Avril\",\"Mai\",\"Juin\",\"Juillet\",\"Août\",\"Septembre\",\"Octobre\",\"Novembre\",\"Décembre\",\"\"),\"\")","v":""},{"$f":"IF(AY9=1,CHOOSE(MONTH(AY6),\"Janvier\",\"Février\",\"Mars\",\"Avril\",\"Mai\",\"Juin\",\"Juillet\",\"Août\",\"Septembre\",\"Octobre\",\"Novembre\",\"Décembre\",\"\"),\"\")","v":""},{"$f":"IF(AZ9=1,CHOOSE(MONTH(AZ6),\"Janvier\",\"Février\",\"Mars\",\"Avril\",\"Mai\",\"Juin\",\"Juillet\",\"Août\",\"Septembre\",\"Octobre\",\"Novembre\",\"Décembre\",\"\"),\"\")","v":""},{"$f":"IF(BA9=1,CHOOSE(MONTH(BA6),\"Janvier\",\"Février\",\"Mars\",\"Avril\",\"Mai\",\"Juin\",\"Juillet\",\"Août\",\"Septembre\",\"Octobre\",\"Novembre\",\"Décembre\",\"\"),\"\")","v":""},{"$f":"IF(BB9=1,CHOOSE(MONTH(BB6),\"Janvier\",\"Février\",\"Mars\",\"Avril\",\"Mai\",\"Juin\",\"Juillet\",\"Août\",\"Septembre\",\"Octobre\",\"Novembre\",\"Décembre\",\"\"),\"\")","v":""},{"$f":"IF(BC9=1,CHOOSE(MONTH(BC6),\"Janvier\",\"Février\",\"Mars\",\"Avril\",\"Mai\",\"Juin\",\"Juillet\",\"Août\",\"Septembre\",\"Octobre\",\"Novembre\",\"Décembre\",\"\"),\"\")","v":""},{"$f":"IF(BD9=1,CHOOSE(MONTH(BD6),\"Janvier\",\"Février\",\"Mars\",\"Avril\",\"Mai\",\"Juin\",\"Juillet\",\"Août\",\"Septembre\",\"Octobre\",\"Novembre\",\"Décembre\",\"\"),\"\")","v":""},{"$f":"IF(BE9=1,CHOOSE(MONTH(BE6),\"Janvier\",\"Février\",\"Mars\",\"Avril\",\"Mai\",\"Juin\",\"Juillet\",\"Août\",\"Septembre\",\"Octobre\",\"Novembre\",\"Décembre\",\"\"),\"\")","v":""},{"$f":"IF(BF9=1,CHOOSE(MONTH(BF6),\"Janvier\",\"Février\",\"Mars\",\"Avril\",\"Mai\",\"Juin\",\"Juillet\",\"Août\",\"Septembre\",\"Octobre\",\"Novembre\",\"Décembre\",\"\"),\"\")","v":""},{"$f":"IF(BG9=1,CHOOSE(MONTH(BG6),\"Janvier\",\"Février\",\"Mars\",\"Avril\",\"Mai\",\"Juin\",\"Juillet\",\"Août\",\"Septembre\",\"Octobre\",\"Novembre\",\"Décembre\",\"\"),\"\")","v":""},{"$f":"IF(BH9=1,CHOOSE(MONTH(BH6),\"Janvier\",\"Février\",\"Mars\",\"Avril\",\"Mai\",\"Juin\",\"Juillet\",\"Août\",\"Septembre\",\"Octobre\",\"Novembre\",\"Décembre\",\"\"),\"\")","v":""},{"$f":"IF(BI9=1,CHOOSE(MONTH(BI6),\"Janvier\",\"Février\",\"Mars\",\"Avril\",\"Mai\",\"Juin\",\"Juillet\",\"Août\",\"Septembre\",\"Octobre\",\"Novembre\",\"Décembre\",\"\"),\"\")","v":""},{"$f":"IF(BJ9=1,CHOOSE(MONTH(BJ6),\"Janvier\",\"Février\",\"Mars\",\"Avril\",\"Mai\",\"Juin\",\"Juillet\",\"Août\",\"Septembre\",\"Octobre\",\"Novembre\",\"Décembre\",\"\"),\"\")","v":""},{"$f":"IF(BK9=1,CHOOSE(MONTH(BK6),\"Janvier\",\"Février\",\"Mars\",\"Avril\",\"Mai\",\"Juin\",\"Juillet\",\"Août\",\"Septembre\",\"Octobre\",\"Novembre\",\"Décembre\",\"\"),\"\")","v":""},{"$f":"IF(BL9=1,CHOOSE(MONTH(BL6),\"Janvier\",\"Février\",\"Mars\",\"Avril\",\"Mai\",\"Juin\",\"Juillet\",\"Août\",\"Septembre\",\"Octobre\",\"Novembre\",\"Décembre\",\"\"),\"\")","v":""},{"$f":"IF(BM9=1,CHOOSE(MONTH(BM6),\"Janvier\",\"Février\",\"Mars\",\"Avril\",\"Mai\",\"Juin\",\"Juillet\",\"Août\",\"Septembre\",\"Octobre\",\"Novembre\",\"Décembre\",\"\"),\"\")","v":""},{"$f":"IF(BN9=1,CHOOSE(MONTH(BN6),\"Janvier\",\"Février\",\"Mars\",\"Avril\",\"Mai\",\"Juin\",\"Juillet\",\"Août\",\"Septembre\",\"Octobre\",\"Novembre\",\"Décembre\",\"\"),\"\")","v":""},{"$f":"IF(BO9=1,CHOOSE(MONTH(BO6),\"Janvier\",\"Février\",\"Mars\",\"Avril\",\"Mai\",\"Juin\",\"Juillet\",\"Août\",\"Septembre\",\"Octobre\",\"Novembre\",\"Décembre\",\"\"),\"\")","v":""},{"$f":"IF(BP9=1,CHOOSE(MONTH(BP6),\"Janvier\",\"Février\",\"Mars\",\"Avril\",\"Mai\",\"Juin\",\"Juillet\",\"Août\",\"Septembre\",\"Octobre\",\"Novembre\",\"Décembre\",\"\"),\"\")","v":""},{"$f":"IF(BQ9=1,CHOOSE(MONTH(BQ6),\"Janvier\",\"Février\",\"Mars\",\"Avril\",\"Mai\",\"Juin\",\"Juillet\",\"Août\",\"Septembre\",\"Octobre\",\"Novembre\",\"Décembre\",\"\"),\"\")","v":""},{"$f":"IF(BR9=1,CHOOSE(MONTH(BR6),\"Janvier\",\"Février\",\"Mars\",\"Avril\",\"Mai\",\"Juin\",\"Juillet\",\"Août\",\"Septembre\",\"Octobre\",\"Novembre\",\"Décembre\",\"\"),\"\")","v":""},{"$f":"IF(BS9=1,CHOOSE(MONTH(BS6),\"Janvier\",\"Février\",\"Mars\",\"Avril\",\"Mai\",\"Juin\",\"Juillet\",\"Août\",\"Septembre\",\"Octobre\",\"Novembre\",\"Décembre\",\"\"),\"\")","v":"Mars"},{"$f":"IF(BT9=1,CHOOSE(MONTH(BT6),\"Janvier\",\"Février\",\"Mars\",\"Avril\",\"Mai\",\"Juin\",\"Juillet\",\"Août\",\"Septembre\",\"Octobre\",\"Novembre\",\"Décembre\",\"\"),\"\")","v":""},{"$f":"IF(BU9=1,CHOOSE(MONTH(BU6),\"Janvier\",\"Février\",\"Mars\",\"Avril\",\"Mai\",\"Juin\",\"Juillet\",\"Août\",\"Septembre\",\"Octobre\",\"Novembre\",\"Décembre\",\"\"),\"\")","v":""},{"$f":"IF(BV9=1,CHOOSE(MONTH(BV6),\"Janvier\",\"Février\",\"Mars\",\"Avril\",\"Mai\",\"Juin\",\"Juillet\",\"Août\",\"Septembre\",\"Octobre\",\"Novembre\",\"Décembre\",\"\"),\"\")","v":""},{"$f":"IF(BW9=1,CHOOSE(MONTH(BW6),\"Janvier\",\"Février\",\"Mars\",\"Avril\",\"Mai\",\"Juin\",\"Juillet\",\"Août\",\"Septembre\",\"Octobre\",\"Novembre\",\"Décembre\",\"\"),\"\")","v":""},"",{"$f":"IF(BY9=1,CHOOSE(MONTH(BY6),\"Janvier\",\"Février\",\"Mars\",\"Avril\",\"Mai\",\"Juin\",\"Juillet\",\"Août\",\"Septembre\",\"Octobre\",\"Novembre\",\"Décembre\",\"\"),\"\")","v":""},{"$f":"IF(BZ9=1,CHOOSE(MONTH(BZ6),\"Janvier\",\"Février\",\"Mars\",\"Avril\",\"Mai\",\"Juin\",\"Juillet\",\"Août\",\"Septembre\",\"Octobre\",\"Novembre\",\"Décembre\",\"\"),\"\")","v":""},{"$f":"IF(CA9=1,CHOOSE(MONTH(CA6),\"Janvier\",\"Février\",\"Mars\",\"Avril\",\"Mai\",\"Juin\",\"Juillet\",\"Août\",\"Septembre\",\"Octobre\",\"Novembre\",\"Décembre\",\"\"),\"\")","v":""},{"$f":"IF(CB9=1,CHOOSE(MONTH(CB6),\"Janvier\",\"Février\",\"Mars\",\"Avril\",\"Mai\",\"Juin\",\"Juillet\",\"Août\",\"Septembre\",\"Octobre\",\"Novembre\",\"Décembre\",\"\"),\"\")","v":""},{"$f":"IF(CC9=1,CHOOSE(MONTH(CC6),\"Janvier\",\"Février\",\"Mars\",\"Avril\",\"Mai\",\"Juin\",\"Juillet\",\"Août\",\"Septembre\",\"Octobre\",\"Novembre\",\"Décembre\",\"\"),\"\")","v":""},{"$f":"IF(CD9=1,CHOOSE(MONTH(CD6),\"Janvier\",\"Février\",\"Mars\",\"Avril\",\"Mai\",\"Juin\",\"Juillet\",\"Août\",\"Septembre\",\"Octobre\",\"Novembre\",\"Décembre\",\"\"),\"\")","v":""},{"$f":"IF(CE9=1,CHOOSE(MONTH(CE6),\"Janvier\",\"Février\",\"Mars\",\"Avril\",\"Mai\",\"Juin\",\"Juillet\",\"Août\",\"Septembre\",\"Octobre\",\"Novembre\",\"Décembre\",\"\"),\"\")","v":""},{"$f":"IF(CF9=1,CHOOSE(MONTH(CF6),\"Janvier\",\"Février\",\"Mars\",\"Avril\",\"Mai\",\"Juin\",\"Juillet\",\"Août\",\"Septembre\",\"Octobre\",\"Novembre\",\"Décembre\",\"\"),\"\")","v":""},{"$f":"IF(CG9=1,CHOOSE(MONTH(CG6),\"Janvier\",\"Février\",\"Mars\",\"Avril\",\"Mai\",\"Juin\",\"Juillet\",\"Août\",\"Septembre\",\"Octobre\",\"Novembre\",\"Décembre\",\"\"),\"\")","v":""},{"$f":"IF(CH9=1,CHOOSE(MONTH(CH6),\"Janvier\",\"Février\",\"Mars\",\"Avril\",\"Mai\",\"Juin\",\"Juillet\",\"Août\",\"Septembre\",\"Octobre\",\"Novembre\",\"Décembre\",\"\"),\"\")","v":""},{"$f":"IF(CI9=1,CHOOSE(MONTH(CI6),\"Janvier\",\"Février\",\"Mars\",\"Avril\",\"Mai\",\"Juin\",\"Juillet\",\"Août\",\"Septembre\",\"Octobre\",\"Novembre\",\"Décembre\",\"\"),\"\")","v":""},{"$f":"IF(CJ9=1,CHOOSE(MONTH(CJ6),\"Janvier\",\"Février\",\"Mars\",\"Avril\",\"Mai\",\"Juin\",\"Juillet\",\"Août\",\"Septembre\",\"Octobre\",\"Novembre\",\"Décembre\",\"\"),\"\")","v":""},{"$f":"IF(CK9=1,CHOOSE(MONTH(CK6),\"Janvier\",\"Février\",\"Mars\",\"Avril\",\"Mai\",\"Juin\",\"Juillet\",\"Août\",\"Septembre\",\"Octobre\",\"Novembre\",\"Décembre\",\"\"),\"\")","v":""},{"$f":"IF(CL9=1,CHOOSE(MONTH(CL6),\"Janvier\",\"Février\",\"Mars\",\"Avril\",\"Mai\",\"Juin\",\"Juillet\",\"Août\",\"Septembre\",\"Octobre\",\"Novembre\",\"Décembre\",\"\"),\"\")","v":""},{"$f":"IF(CM9=1,CHOOSE(MONTH(CM6),\"Janvier\",\"Février\",\"Mars\",\"Avril\",\"Mai\",\"Juin\",\"Juillet\",\"Août\",\"Septembre\",\"Octobre\",\"Novembre\",\"Décembre\",\"\"),\"\")","v":""},{"$f":"IF(CN9=1,CHOOSE(MONTH(CN6),\"Janvier\",\"Février\",\"Mars\",\"Avril\",\"Mai\",\"Juin\",\"Juillet\",\"Août\",\"Septembre\",\"Octobre\",\"Novembre\",\"Décembre\",\"\"),\"\")","v":""},{"$f":"IF(CO9=1,CHOOSE(MONTH(CO6),\"Janvier\",\"Février\",\"Mars\",\"Avril\",\"Mai\",\"Juin\",\"Juillet\",\"Août\",\"Septembre\",\"Octobre\",\"Novembre\",\"Décembre\",\"\"),\"\")","v":""},{"$f":"IF(CP9=1,CHOOSE(MONTH(CP6),\"Janvier\",\"Février\",\"Mars\",\"Avril\",\"Mai\",\"Juin\",\"Juillet\",\"Août\",\"Septembre\",\"Octobre\",\"Novembre\",\"Décembre\",\"\"),\"\")","v":""},{"$f":"IF(CQ9=1,CHOOSE(MONTH(CQ6),\"Janvier\",\"Février\",\"Mars\",\"Avril\",\"Mai\",\"Juin\",\"Juillet\",\"Août\",\"Septembre\",\"Octobre\",\"Novembre\",\"Décembre\",\"\"),\"\")","v":""},{"$f":"IF(CR9=1,CHOOSE(MONTH(CR6),\"Janvier\",\"Février\",\"Mars\",\"Avril\",\"Mai\",\"Juin\",\"Juillet\",\"Août\",\"Septembre\",\"Octobre\",\"Novembre\",\"Décembre\",\"\"),\"\")","v":""},{"$f":"IF(CS9=1,CHOOSE(MONTH(CS6),\"Janvier\",\"Février\",\"Mars\",\"Avril\",\"Mai\",\"Juin\",\"Juillet\",\"Août\",\"Septembre\",\"Octobre\",\"Novembre\",\"Décembre\",\"\"),\"\")","v":""},{"$f":"IF(CT9=1,CHOOSE(MONTH(CT6),\"Janvier\",\"Février\",\"Mars\",\"Avril\",\"Mai\",\"Juin\",\"Juillet\",\"Août\",\"Septembre\",\"Octobre\",\"Novembre\",\"Décembre\",\"\"),\"\")","v":""},{"$f":"IF(CU9=1,CHOOSE(MONTH(CU6),\"Janvier\",\"Février\",\"Mars\",\"Avril\",\"Mai\",\"Juin\",\"Juillet\",\"Août\",\"Septembre\",\"Octobre\",\"Novembre\",\"Décembre\",\"\"),\"\")","v":""},{"$f":"IF(CV9=1,CHOOSE(MONTH(CV6),\"Janvier\",\"Février\",\"Mars\",\"Avril\",\"Mai\",\"Juin\",\"Juillet\",\"Août\",\"Septembre\",\"Octobre\",\"Novembre\",\"Décembre\",\"\"),\"\")","v":""},{"$f":"IF(CW9=1,CHOOSE(MONTH(CW6),\"Janvier\",\"Février\",\"Mars\",\"Avril\",\"Mai\",\"Juin\",\"Juillet\",\"Août\",\"Septembre\",\"Octobre\",\"Novembre\",\"Décembre\",\"\"),\"\")","v":""},{"$f":"IF(CX9=1,CHOOSE(MONTH(CX6),\"Janvier\",\"Février\",\"Mars\",\"Avril\",\"Mai\",\"Juin\",\"Juillet\",\"Août\",\"Septembre\",\"Octobre\",\"Novembre\",\"Décembre\",\"\"),\"\")","v":"Avril"},{"$f":"IF(CY9=1,CHOOSE(MONTH(CY6),\"Janvier\",\"Février\",\"Mars\",\"Avril\",\"Mai\",\"Juin\",\"Juillet\",\"Août\",\"Septembre\",\"Octobre\",\"Novembre\",\"Décembre\",\"\"),\"\")","v":""},{"$f":"IF(CZ9=1,CHOOSE(MONTH(CZ6),\"Janvier\",\"Février\",\"Mars\",\"Avril\",\"Mai\",\"Juin\",\"Juillet\",\"Août\",\"Septembre\",\"Octobre\",\"Novembre\",\"Décembre\",\"\"),\"\")","v":""},{"$f":"IF(DA9=1,CHOOSE(MONTH(DA6),\"Janvier\",\"Février\",\"Mars\",\"Avril\",\"Mai\",\"Juin\",\"Juillet\",\"Août\",\"Septembre\",\"Octobre\",\"Novembre\",\"Décembre\",\"\"),\"\")","v":""},{"$f":"IF(DB9=1,CHOOSE(MONTH(DB6),\"Janvier\",\"Février\",\"Mars\",\"Avril\",\"Mai\",\"Juin\",\"Juillet\",\"Août\",\"Septembre\",\"Octobre\",\"Novembre\",\"Décembre\",\"\"),\"\")","v":""},{"$f":"IF(DC9=1,CHOOSE(MONTH(DC6),\"Janvier\",\"Février\",\"Mars\",\"Avril\",\"Mai\",\"Juin\",\"Juillet\",\"Août\",\"Septembre\",\"Octobre\",\"Novembre\",\"Décembre\",\"\"),\"\")","v":""},"",{"$f":"IF(DE9=1,CHOOSE(MONTH(DE6),\"Janvier\",\"Février\",\"Mars\",\"Avril\",\"Mai\",\"Juin\",\"Juillet\",\"Août\",\"Septembre\",\"Octobre\",\"Novembre\",\"Décembre\",\"\"),\"\")","v":""},{"$f":"IF(DF9=1,CHOOSE(MONTH(DF6),\"Janvier\",\"Février\",\"Mars\",\"Avril\",\"Mai\",\"Juin\",\"Juillet\",\"Août\",\"Septembre\",\"Octobre\",\"Novembre\",\"Décembre\",\"\"),\"\")","v":""},{"$f":"IF(DG9=1,CHOOSE(MONTH(DG6),\"Janvier\",\"Février\",\"Mars\",\"Avril\",\"Mai\",\"Juin\",\"Juillet\",\"Août\",\"Septembre\",\"Octobre\",\"Novembre\",\"Décembre\",\"\"),\"\")","v":""},{"$f":"IF(DH9=1,CHOOSE(MONTH(DH6),\"Janvier\",\"Février\",\"Mars\",\"Avril\",\"Mai\",\"Juin\",\"Juillet\",\"Août\",\"Septembre\",\"Octobre\",\"Novembre\",\"Décembre\",\"\"),\"\")","v":""},{"$f":"IF(DI9=1,CHOOSE(MONTH(DI6),\"Janvier\",\"Février\",\"Mars\",\"Avril\",\"Mai\",\"Juin\",\"Juillet\",\"Août\",\"Septembre\",\"Octobre\",\"Novembre\",\"Décembre\",\"\"),\"\")","v":""},{"$f":"IF(DJ9=1,CHOOSE(MONTH(DJ6),\"Janvier\",\"Février\",\"Mars\",\"Avril\",\"Mai\",\"Juin\",\"Juillet\",\"Août\",\"Septembre\",\"Octobre\",\"Novembre\",\"Décembre\",\"\"),\"\")","v":""},{"$f":"IF(DK9=1,CHOOSE(MONTH(DK6),\"Janvier\",\"Février\",\"Mars\",\"Avril\",\"Mai\",\"Juin\",\"Juillet\",\"Août\",\"Septembre\",\"Octobre\",\"Novembre\",\"Décembre\",\"\"),\"\")","v":""},{"$f":"IF(DL9=1,CHOOSE(MONTH(DL6),\"Janvier\",\"Février\",\"Mars\",\"Avril\",\"Mai\",\"Juin\",\"Juillet\",\"Août\",\"Septembre\",\"Octobre\",\"Novembre\",\"Décembre\",\"\"),\"\")","v":""},{"$f":"IF(DM9=1,CHOOSE(MONTH(DM6),\"Janvier\",\"Février\",\"Mars\",\"Avril\",\"Mai\",\"Juin\",\"Juillet\",\"Août\",\"Septembre\",\"Octobre\",\"Novembre\",\"Décembre\",\"\"),\"\")","v":""},{"$f":"IF(DN9=1,CHOOSE(MONTH(DN6),\"Janvier\",\"Février\",\"Mars\",\"Avril\",\"Mai\",\"Juin\",\"Juillet\",\"Août\",\"Septembre\",\"Octobre\",\"Novembre\",\"Décembre\",\"\"),\"\")","v":""},{"$f":"IF(DO9=1,CHOOSE(MONTH(DO6),\"Janvier\",\"Février\",\"Mars\",\"Avril\",\"Mai\",\"Juin\",\"Juillet\",\"Août\",\"Septembre\",\"Octobre\",\"Novembre\",\"Décembre\",\"\"),\"\")","v":""},{"$f":"IF(DP9=1,CHOOSE(MONTH(DP6),\"Janvier\",\"Février\",\"Mars\",\"Avril\",\"Mai\",\"Juin\",\"Juillet\",\"Août\",\"Septembre\",\"Octobre\",\"Novembre\",\"Décembre\",\"\"),\"\")","v":""},{"$f":"IF(DQ9=1,CHOOSE(MONTH(DQ6),\"Janvier\",\"Février\",\"Mars\",\"Avril\",\"Mai\",\"Juin\",\"Juillet\",\"Août\",\"Septembre\",\"Octobre\",\"Novembre\",\"Décembre\",\"\"),\"\")","v":""},{"$f":"IF(DR9=1,CHOOSE(MONTH(DR6),\"Janvier\",\"Février\",\"Mars\",\"Avril\",\"Mai\",\"Juin\",\"Juillet\",\"Août\",\"Septembre\",\"Octobre\",\"Novembre\",\"Décembre\",\"\"),\"\")","v":""},{"$f":"IF(DS9=1,CHOOSE(MONTH(DS6),\"Janvier\",\"Février\",\"Mars\",\"Avril\",\"Mai\",\"Juin\",\"Juillet\",\"Août\",\"Septembre\",\"Octobre\",\"Novembre\",\"Décembre\",\"\"),\"\")","v":""},{"$f":"IF(DT9=1,CHOOSE(MONTH(DT6),\"Janvier\",\"Février\",\"Mars\",\"Avril\",\"Mai\",\"Juin\",\"Juillet\",\"Août\",\"Septembre\",\"Octobre\",\"Novembre\",\"Décembre\",\"\"),\"\")","v":""},{"$f":"IF(DU9=1,CHOOSE(MONTH(DU6),\"Janvier\",\"Février\",\"Mars\",\"Avril\",\"Mai\",\"Juin\",\"Juillet\",\"Août\",\"Septembre\",\"Octobre\",\"Novembre\",\"Décembre\",\"\"),\"\")","v":""},{"$f":"IF(DV9=1,CHOOSE(MONTH(DV6),\"Janvier\",\"Février\",\"Mars\",\"Avril\",\"Mai\",\"Juin\",\"Juillet\",\"Août\",\"Septembre\",\"Octobre\",\"Novembre\",\"Décembre\",\"\"),\"\")","v":""},{"$f":"IF(DW9=1,CHOOSE(MONTH(DW6),\"Janvier\",\"Février\",\"Mars\",\"Avril\",\"Mai\",\"Juin\",\"Juillet\",\"Août\",\"Septembre\",\"Octobre\",\"Novembre\",\"Décembre\",\"\"),\"\")","v":""},{"$f":"IF(DX9=1,CHOOSE(MONTH(DX6),\"Janvier\",\"Février\",\"Mars\",\"Avril\",\"Mai\",\"Juin\",\"Juillet\",\"Août\",\"Septembre\",\"Octobre\",\"Novembre\",\"Décembre\",\"\"),\"\")","v":""},{"$f":"IF(DY9=1,CHOOSE(MONTH(DY6),\"Janvier\",\"Février\",\"Mars\",\"Avril\",\"Mai\",\"Juin\",\"Juillet\",\"Août\",\"Septembre\",\"Octobre\",\"Novembre\",\"Décembre\",\"\"),\"\")","v":""},{"$f":"IF(DZ9=1,CHOOSE(MONTH(DZ6),\"Janvier\",\"Février\",\"Mars\",\"Avril\",\"Mai\",\"Juin\",\"Juillet\",\"Août\",\"Septembre\",\"Octobre\",\"Novembre\",\"Décembre\",\"\"),\"\")","v":""},{"$f":"IF(EA9=1,CHOOSE(MONTH(EA6),\"Janvier\",\"Février\",\"Mars\",\"Avril\",\"Mai\",\"Juin\",\"Juillet\",\"Août\",\"Septembre\",\"Octobre\",\"Novembre\",\"Décembre\",\"\"),\"\")","v":""},{"$f":"IF(EB9=1,CHOOSE(MONTH(EB6),\"Janvier\",\"Février\",\"Mars\",\"Avril\",\"Mai\",\"Juin\",\"Juillet\",\"Août\",\"Septembre\",\"Octobre\",\"Novembre\",\"Décembre\",\"\"),\"\")","v":"Mai"},{"$f":"IF(EC9=1,CHOOSE(MONTH(EC6),\"Janvier\",\"Février\",\"Mars\",\"Avril\",\"Mai\",\"Juin\",\"Juillet\",\"Août\",\"Septembre\",\"Octobre\",\"Novembre\",\"Décembre\",\"\"),\"\")","v":""},{"$f":"IF(ED9=1,CHOOSE(MONTH(ED6),\"Janvier\",\"Février\",\"Mars\",\"Avril\",\"Mai\",\"Juin\",\"Juillet\",\"Août\",\"Septembre\",\"Octobre\",\"Novembre\",\"Décembre\",\"\"),\"\")","v":""},{"$f":"IF(EE9=1,CHOOSE(MONTH(EE6),\"Janvier\",\"Février\",\"Mars\",\"Avril\",\"Mai\",\"Juin\",\"Juillet\",\"Août\",\"Septembre\",\"Octobre\",\"Novembre\",\"Décembre\",\"\"),\"\")","v":""},{"$f":"IF(EF9=1,CHOOSE(MONTH(EF6),\"Janvier\",\"Février\",\"Mars\",\"Avril\",\"Mai\",\"Juin\",\"Juillet\",\"Août\",\"Septembre\",\"Octobre\",\"Novembre\",\"Décembre\",\"\"),\"\")","v":""},{"$f":"IF(EG9=1,CHOOSE(MONTH(EG6),\"Janvier\",\"Février\",\"Mars\",\"Avril\",\"Mai\",\"Juin\",\"Juillet\",\"Août\",\"Septembre\",\"Octobre\",\"Novembre\",\"Décembre\",\"\"),\"\")","v":""},{"$f":"IF(EH9=1,CHOOSE(MONTH(EH6),\"Janvier\",\"Février\",\"Mars\",\"Avril\",\"Mai\",\"Juin\",\"Juillet\",\"Août\",\"Septembre\",\"Octobre\",\"Novembre\",\"Décembre\",\"\"),\"\")","v":""},{"$f":"IF(EI9=1,CHOOSE(MONTH(EI6),\"Janvier\",\"Février\",\"Mars\",\"Avril\",\"Mai\",\"Juin\",\"Juillet\",\"Août\",\"Septembre\",\"Octobre\",\"Novembre\",\"Décembre\",\"\"),\"\")","v":""},"",{"$f":"IF(EK9=1,CHOOSE(MONTH(EK6),\"Janvier\",\"Février\",\"Mars\",\"Avril\",\"Mai\",\"Juin\",\"Juillet\",\"Août\",\"Septembre\",\"Octobre\",\"Novembre\",\"Décembre\",\"\"),\"\")","v":""},{"$f":"IF(EL9=1,CHOOSE(MONTH(EL6),\"Janvier\",\"Février\",\"Mars\",\"Avril\",\"Mai\",\"Juin\",\"Juillet\",\"Août\",\"Septembre\",\"Octobre\",\"Novembre\",\"Décembre\",\"\"),\"\")","v":""},{"$f":"IF(EM9=1,CHOOSE(MONTH(EM6),\"Janvier\",\"Février\",\"Mars\",\"Avril\",\"Mai\",\"Juin\",\"Juillet\",\"Août\",\"Septembre\",\"Octobre\",\"Novembre\",\"Décembre\",\"\"),\"\")","v":""},{"$f":"IF(EN9=1,CHOOSE(MONTH(EN6),\"Janvier\",\"Février\",\"Mars\",\"Avril\",\"Mai\",\"Juin\",\"Juillet\",\"Août\",\"Septembre\",\"Octobre\",\"Novembre\",\"Décembre\",\"\"),\"\")","v":""},{"$f":"IF(EO9=1,CHOOSE(MONTH(EO6),\"Janvier\",\"Février\",\"Mars\",\"Avril\",\"Mai\",\"Juin\",\"Juillet\",\"Août\",\"Septembre\",\"Octobre\",\"Novembre\",\"Décembre\",\"\"),\"\")","v":""},{"$f":"IF(EP9=1,CHOOSE(MONTH(EP6),\"Janvier\",\"Février\",\"Mars\",\"Avril\",\"Mai\",\"Juin\",\"Juillet\",\"Août\",\"Septembre\",\"Octobre\",\"Novembre\",\"Décembre\",\"\"),\"\")","v":""},{"$f":"IF(EQ9=1,CHOOSE(MONTH(EQ6),\"Janvier\",\"Février\",\"Mars\",\"Avril\",\"Mai\",\"Juin\",\"Juillet\",\"Août\",\"Septembre\",\"Octobre\",\"Novembre\",\"Décembre\",\"\"),\"\")","v":""},{"$f":"IF(ER9=1,CHOOSE(MONTH(ER6),\"Janvier\",\"Février\",\"Mars\",\"Avril\",\"Mai\",\"Juin\",\"Juillet\",\"Août\",\"Septembre\",\"Octobre\",\"Novembre\",\"Décembre\",\"\"),\"\")","v":""},{"$f":"IF(ES9=1,CHOOSE(MONTH(ES6),\"Janvier\",\"Février\",\"Mars\",\"Avril\",\"Mai\",\"Juin\",\"Juillet\",\"Août\",\"Septembre\",\"Octobre\",\"Novembre\",\"Décembre\",\"\"),\"\")","v":""},{"$f":"IF(ET9=1,CHOOSE(MONTH(ET6),\"Janvier\",\"Février\",\"Mars\",\"Avril\",\"Mai\",\"Juin\",\"Juillet\",\"Août\",\"Septembre\",\"Octobre\",\"Novembre\",\"Décembre\",\"\"),\"\")","v":""},{"$f":"IF(EU9=1,CHOOSE(MONTH(EU6),\"Janvier\",\"Février\",\"Mars\",\"Avril\",\"Mai\",\"Juin\",\"Juillet\",\"Août\",\"Septembre\",\"Octobre\",\"Novembre\",\"Décembre\",\"\"),\"\")","v":""},{"$f":"IF(EV9=1,CHOOSE(MONTH(EV6),\"Janvier\",\"Février\",\"Mars\",\"Avril\",\"Mai\",\"Juin\",\"Juillet\",\"Août\",\"Septembre\",\"Octobre\",\"Novembre\",\"Décembre\",\"\"),\"\")","v":""},{"$f":"IF(EW9=1,CHOOSE(MONTH(EW6),\"Janvier\",\"Février\",\"Mars\",\"Avril\",\"Mai\",\"Juin\",\"Juillet\",\"Août\",\"Septembre\",\"Octobre\",\"Novembre\",\"Décembre\",\"\"),\"\")","v":""},{"$f":"IF(EX9=1,CHOOSE(MONTH(EX6),\"Janvier\",\"Février\",\"Mars\",\"Avril\",\"Mai\",\"Juin\",\"Juillet\",\"Août\",\"Septembre\",\"Octobre\",\"Novembre\",\"Décembre\",\"\"),\"\")","v":""},{"$f":"IF(EY9=1,CHOOSE(MONTH(EY6),\"Janvier\",\"Février\",\"Mars\",\"Avril\",\"Mai\",\"Juin\",\"Juillet\",\"Août\",\"Septembre\",\"Octobre\",\"Novembre\",\"Décembre\",\"\"),\"\")","v":""},{"$f":"IF(EZ9=1,CHOOSE(MONTH(EZ6),\"Janvier\",\"Février\",\"Mars\",\"Avril\",\"Mai\",\"Juin\",\"Juillet\",\"Août\",\"Septembre\",\"Octobre\",\"Novembre\",\"Décembre\",\"\"),\"\")","v":""},{"$f":"IF(FA9=1,CHOOSE(MONTH(FA6),\"Janvier\",\"Février\",\"Mars\",\"Avril\",\"Mai\",\"Juin\",\"Juillet\",\"Août\",\"Septembre\",\"Octobre\",\"Novembre\",\"Décembre\",\"\"),\"\")","v":""},{"$f":"IF(FB9=1,CHOOSE(MONTH(FB6),\"Janvier\",\"Février\",\"Mars\",\"Avril\",\"Mai\",\"Juin\",\"Juillet\",\"Août\",\"Septembre\",\"Octobre\",\"Novembre\",\"Décembre\",\"\"),\"\")","v":""},{"$f":"IF(FC9=1,CHOOSE(MONTH(FC6),\"Janvier\",\"Février\",\"Mars\",\"Avril\",\"Mai\",\"Juin\",\"Juillet\",\"Août\",\"Septembre\",\"Octobre\",\"Novembre\",\"Décembre\",\"\"),\"\")","v":""},{"$f":"IF(FD9=1,CHOOSE(MONTH(FD6),\"Janvier\",\"Février\",\"Mars\",\"Avril\",\"Mai\",\"Juin\",\"Juillet\",\"Août\",\"Septembre\",\"Octobre\",\"Novembre\",\"Décembre\",\"\"),\"\")","v":""},{"$f":"IF(FE9=1,CHOOSE(MONTH(FE6),\"Janvier\",\"Février\",\"Mars\",\"Avril\",\"Mai\",\"Juin\",\"Juillet\",\"Août\",\"Septembre\",\"Octobre\",\"Novembre\",\"Décembre\",\"\"),\"\")","v":""},{"$f":"IF(FF9=1,CHOOSE(MONTH(FF6),\"Janvier\",\"Février\",\"Mars\",\"Avril\",\"Mai\",\"Juin\",\"Juillet\",\"Août\",\"Septembre\",\"Octobre\",\"Novembre\",\"Décembre\",\"\"),\"\")","v":""},{"$f":"IF(FG9=1,CHOOSE(MONTH(FG6),\"Janvier\",\"Février\",\"Mars\",\"Avril\",\"Mai\",\"Juin\",\"Juillet\",\"Août\",\"Septembre\",\"Octobre\",\"Novembre\",\"Décembre\",\"\"),\"\")","v":"Juin"},{"$f":"IF(FH9=1,CHOOSE(MONTH(FH6),\"Janvier\",\"Février\",\"Mars\",\"Avril\",\"Mai\",\"Juin\",\"Juillet\",\"Août\",\"Septembre\",\"Octobre\",\"Novembre\",\"Décembre\",\"\"),\"\")","v":""},{"$f":"IF(FI9=1,CHOOSE(MONTH(FI6),\"Janvier\",\"Février\",\"Mars\",\"Avril\",\"Mai\",\"Juin\",\"Juillet\",\"Août\",\"Septembre\",\"Octobre\",\"Novembre\",\"Décembre\",\"\"),\"\")","v":""},{"$f":"IF(FJ9=1,CHOOSE(MONTH(FJ6),\"Janvier\",\"Février\",\"Mars\",\"Avril\",\"Mai\",\"Juin\",\"Juillet\",\"Août\",\"Septembre\",\"Octobre\",\"Novembre\",\"Décembre\",\"\"),\"\")","v":""},{"$f":"IF(FK9=1,CHOOSE(MONTH(FK6),\"Janvier\",\"Février\",\"Mars\",\"Avril\",\"Mai\",\"Juin\",\"Juillet\",\"Août\",\"Septembre\",\"Octobre\",\"Novembre\",\"Décembre\",\"\"),\"\")","v":""},{"$f":"IF(FL9=1,CHOOSE(MONTH(FL6),\"Janvier\",\"Février\",\"Mars\",\"Avril\",\"Mai\",\"Juin\",\"Juillet\",\"Août\",\"Septembre\",\"Octobre\",\"Novembre\",\"Décembre\",\"\"),\"\")","v":""},{"$f":"IF(FM9=1,CHOOSE(MONTH(FM6),\"Janvier\",\"Février\",\"Mars\",\"Avril\",\"Mai\",\"Juin\",\"Juillet\",\"Août\",\"Septembre\",\"Octobre\",\"Novembre\",\"Décembre\",\"\"),\"\")","v":""},{"$f":"IF(FN9=1,CHOOSE(MONTH(FN6),\"Janvier\",\"Février\",\"Mars\",\"Avril\",\"Mai\",\"Juin\",\"Juillet\",\"Août\",\"Septembre\",\"Octobre\",\"Novembre\",\"Décembre\",\"\"),\"\")","v":""},{"$f":"IF(FO9=1,CHOOSE(MONTH(FO6),\"Janvier\",\"Février\",\"Mars\",\"Avril\",\"Mai\",\"Juin\",\"Juillet\",\"Août\",\"Septembre\",\"Octobre\",\"Novembre\",\"Décembre\",\"\"),\"\")","v":""},"",{"$f":"IF(FQ9=1,CHOOSE(MONTH(FQ6),\"Janvier\",\"Février\",\"Mars\",\"Avril\",\"Mai\",\"Juin\",\"Juillet\",\"Août\",\"Septembre\",\"Octobre\",\"Novembre\",\"Décembre\",\"\"),\"\")","v":""},{"$f":"IF(FR9=1,CHOOSE(MONTH(FR6),\"Janvier\",\"Février\",\"Mars\",\"Avril\",\"Mai\",\"Juin\",\"Juillet\",\"Août\",\"Septembre\",\"Octobre\",\"Novembre\",\"Décembre\",\"\"),\"\")","v":""},{"$f":"IF(FS9=1,CHOOSE(MONTH(FS6),\"Janvier\",\"Février\",\"Mars\",\"Avril\",\"Mai\",\"Juin\",\"Juillet\",\"Août\",\"Septembre\",\"Octobre\",\"Novembre\",\"Décembre\",\"\"),\"\")","v":""},{"$f":"IF(FT9=1,CHOOSE(MONTH(FT6),\"Janvier\",\"Février\",\"Mars\",\"Avril\",\"Mai\",\"Juin\",\"Juillet\",\"Août\",\"Septembre\",\"Octobre\",\"Novembre\",\"Décembre\",\"\"),\"\")","v":""},{"$f":"IF(FU9=1,CHOOSE(MONTH(FU6),\"Janvier\",\"Février\",\"Mars\",\"Avril\",\"Mai\",\"Juin\",\"Juillet\",\"Août\",\"Septembre\",\"Octobre\",\"Novembre\",\"Décembre\",\"\"),\"\")","v":""},{"$f":"IF(FV9=1,CHOOSE(MONTH(FV6),\"Janvier\",\"Février\",\"Mars\",\"Avril\",\"Mai\",\"Juin\",\"Juillet\",\"Août\",\"Septembre\",\"Octobre\",\"Novembre\",\"Décembre\",\"\"),\"\")","v":""},{"$f":"IF(FW9=1,CHOOSE(MONTH(FW6),\"Janvier\",\"Février\",\"Mars\",\"Avril\",\"Mai\",\"Juin\",\"Juillet\",\"Août\",\"Septembre\",\"Octobre\",\"Novembre\",\"Décembre\",\"\"),\"\")","v":""},{"$f":"IF(FX9=1,CHOOSE(MONTH(FX6),\"Janvier\",\"Février\",\"Mars\",\"Avril\",\"Mai\",\"Juin\",\"Juillet\",\"Août\",\"Septembre\",\"Octobre\",\"Novembre\",\"Décembre\",\"\"),\"\")","v":""},{"$f":"IF(FY9=1,CHOOSE(MONTH(FY6),\"Janvier\",\"Février\",\"Mars\",\"Avril\",\"Mai\",\"Juin\",\"Juillet\",\"Août\",\"Septembre\",\"Octobre\",\"Novembre\",\"Décembre\",\"\"),\"\")","v":""},{"$f":"IF(FZ9=1,CHOOSE(MONTH(FZ6),\"Janvier\",\"Février\",\"Mars\",\"Avril\",\"Mai\",\"Juin\",\"Juillet\",\"Août\",\"Septembre\",\"Octobre\",\"Novembre\",\"Décembre\",\"\"),\"\")","v":""},{"$f":"IF(GA9=1,CHOOSE(MONTH(GA6),\"Janvier\",\"Février\",\"Mars\",\"Avril\",\"Mai\",\"Juin\",\"Juillet\",\"Août\",\"Septembre\",\"Octobre\",\"Novembre\",\"Décembre\",\"\"),\"\")","v":""},{"$f":"IF(GB9=1,CHOOSE(MONTH(GB6),\"Janvier\",\"Février\",\"Mars\",\"Avril\",\"Mai\",\"Juin\",\"Juillet\",\"Août\",\"Septembre\",\"Octobre\",\"Novembre\",\"Décembre\",\"\"),\"\")","v":""},{"$f":"IF(GC9=1,CHOOSE(MONTH(GC6),\"Janvier\",\"Février\",\"Mars\",\"Avril\",\"Mai\",\"Juin\",\"Juillet\",\"Août\",\"Septembre\",\"Octobre\",\"Novembre\",\"Décembre\",\"\"),\"\")","v":""},{"$f":"IF(GD9=1,CHOOSE(MONTH(GD6),\"Janvier\",\"Février\",\"Mars\",\"Avril\",\"Mai\",\"Juin\",\"Juillet\",\"Août\",\"Septembre\",\"Octobre\",\"Novembre\",\"Décembre\",\"\"),\"\")","v":""},{"$f":"IF(GE9=1,CHOOSE(MONTH(GE6),\"Janvier\",\"Février\",\"Mars\",\"Avril\",\"Mai\",\"Juin\",\"Juillet\",\"Août\",\"Septembre\",\"Octobre\",\"Novembre\",\"Décembre\",\"\"),\"\")","v":""},{"$f":"IF(GF9=1,CHOOSE(MONTH(GF6),\"Janvier\",\"Février\",\"Mars\",\"Avril\",\"Mai\",\"Juin\",\"Juillet\",\"Août\",\"Septembre\",\"Octobre\",\"Novembre\",\"Décembre\",\"\"),\"\")","v":""},{"$f":"IF(GG9=1,CHOOSE(MONTH(GG6),\"Janvier\",\"Février\",\"Mars\",\"Avril\",\"Mai\",\"Juin\",\"Juillet\",\"Août\",\"Septembre\",\"Octobre\",\"Novembre\",\"Décembre\",\"\"),\"\")","v":""},{"$f":"IF(GH9=1,CHOOSE(MONTH(GH6),\"Janvier\",\"Février\",\"Mars\",\"Avril\",\"Mai\",\"Juin\",\"Juillet\",\"Août\",\"Septembre\",\"Octobre\",\"Novembre\",\"Décembre\",\"\"),\"\")","v":""},{"$f":"IF(GI9=1,CHOOSE(MONTH(GI6),\"Janvier\",\"Février\",\"Mars\",\"Avril\",\"Mai\",\"Juin\",\"Juillet\",\"Août\",\"Septembre\",\"Octobre\",\"Novembre\",\"Décembre\",\"\"),\"\")","v":""},{"$f":"IF(GJ9=1,CHOOSE(MONTH(GJ6),\"Janvier\",\"Février\",\"Mars\",\"Avril\",\"Mai\",\"Juin\",\"Juillet\",\"Août\",\"Septembre\",\"Octobre\",\"Novembre\",\"Décembre\",\"\"),\"\")","v":""},{"$f":"IF(GK9=1,CHOOSE(MONTH(GK6),\"Janvier\",\"Février\",\"Mars\",\"Avril\",\"Mai\",\"Juin\",\"Juillet\",\"Août\",\"Septembre\",\"Octobre\",\"Novembre\",\"Décembre\",\"\"),\"\")","v":"Juillet"},{"$f":"IF(GL9=1,CHOOSE(MONTH(GL6),\"Janvier\",\"Février\",\"Mars\",\"Avril\",\"Mai\",\"Juin\",\"Juillet\",\"Août\",\"Septembre\",\"Octobre\",\"Novembre\",\"Décembre\",\"\"),\"\")","v":""},{"$f":"IF(GM9=1,CHOOSE(MONTH(GM6),\"Janvier\",\"Février\",\"Mars\",\"Avril\",\"Mai\",\"Juin\",\"Juillet\",\"Août\",\"Septembre\",\"Octobre\",\"Novembre\",\"Décembre\",\"\"),\"\")","v":""},{"$f":"IF(GN9=1,CHOOSE(MONTH(GN6),\"Janvier\",\"Février\",\"Mars\",\"Avril\",\"Mai\",\"Juin\",\"Juillet\",\"Août\",\"Septembre\",\"Octobre\",\"Novembre\",\"Décembre\",\"\"),\"\")","v":""},{"$f":"IF(GO9=1,CHOOSE(MONTH(GO6),\"Janvier\",\"Février\",\"Mars\",\"Avril\",\"Mai\",\"Juin\",\"Juillet\",\"Août\",\"Septembre\",\"Octobre\",\"Novembre\",\"Décembre\",\"\"),\"\")","v":""},{"$f":"IF(GP9=1,CHOOSE(MONTH(GP6),\"Janvier\",\"Février\",\"Mars\",\"Avril\",\"Mai\",\"Juin\",\"Juillet\",\"Août\",\"Septembre\",\"Octobre\",\"Novembre\",\"Décembre\",\"\"),\"\")","v":""},{"$f":"IF(GQ9=1,CHOOSE(MONTH(GQ6),\"Janvier\",\"Février\",\"Mars\",\"Avril\",\"Mai\",\"Juin\",\"Juillet\",\"Août\",\"Septembre\",\"Octobre\",\"Novembre\",\"Décembre\",\"\"),\"\")","v":""},{"$f":"IF(GR9=1,CHOOSE(MONTH(GR6),\"Janvier\",\"Février\",\"Mars\",\"Avril\",\"Mai\",\"Juin\",\"Juillet\",\"Août\",\"Septembre\",\"Octobre\",\"Novembre\",\"Décembre\",\"\"),\"\")","v":""},{"$f":"IF(GS9=1,CHOOSE(MONTH(GS6),\"Janvier\",\"Février\",\"Mars\",\"Avril\",\"Mai\",\"Juin\",\"Juillet\",\"Août\",\"Septembre\",\"Octobre\",\"Novembre\",\"Décembre\",\"\"),\"\")","v":""},{"$f":"IF(GT9=1,CHOOSE(MONTH(GT6),\"Janvier\",\"Février\",\"Mars\",\"Avril\",\"Mai\",\"Juin\",\"Juillet\",\"Août\",\"Septembre\",\"Octobre\",\"Novembre\",\"Décembre\",\"\"),\"\")","v":""},{"$f":"IF(GU9=1,CHOOSE(MONTH(GU6),\"Janvier\",\"Février\",\"Mars\",\"Avril\",\"Mai\",\"Juin\",\"Juillet\",\"Août\",\"Septembre\",\"Octobre\",\"Novembre\",\"Décembre\",\"\"),\"\")","v":""},"",{"$f":"IF(GW9=1,CHOOSE(MONTH(GW6),\"Janvier\",\"Février\",\"Mars\",\"Avril\",\"Mai\",\"Juin\",\"Juillet\",\"Août\",\"Septembre\",\"Octobre\",\"Novembre\",\"Décembre\",\"\"),\"\")","v":""},{"$f":"IF(GX9=1,CHOOSE(MONTH(GX6),\"Janvier\",\"Février\",\"Mars\",\"Avril\",\"Mai\",\"Juin\",\"Juillet\",\"Août\",\"Septembre\",\"Octobre\",\"Novembre\",\"Décembre\",\"\"),\"\")","v":""},{"$f":"IF(GY9=1,CHOOSE(MONTH(GY6),\"Janvier\",\"Février\",\"Mars\",\"Avril\",\"Mai\",\"Juin\",\"Juillet\",\"Août\",\"Septembre\",\"Octobre\",\"Novembre\",\"Décembre\",\"\"),\"\")","v":""},{"$f":"IF(GZ9=1,CHOOSE(MONTH(GZ6),\"Janvier\",\"Février\",\"Mars\",\"Avril\",\"Mai\",\"Juin\",\"Juillet\",\"Août\",\"Septembre\",\"Octobre\",\"Novembre\",\"Décembre\",\"\"),\"\")","v":""},{"$f":"IF(HA9=1,CHOOSE(MONTH(HA6),\"Janvier\",\"Février\",\"Mars\",\"Avril\",\"Mai\",\"Juin\",\"Juillet\",\"Août\",\"Septembre\",\"Octobre\",\"Novembre\",\"Décembre\",\"\"),\"\")","v":""},{"$f":"IF(HB9=1,CHOOSE(MONTH(HB6),\"Janvier\",\"Février\",\"Mars\",\"Avril\",\"Mai\",\"Juin\",\"Juillet\",\"Août\",\"Septembre\",\"Octobre\",\"Novembre\",\"Décembre\",\"\"),\"\")","v":""},{"$f":"IF(HC9=1,CHOOSE(MONTH(HC6),\"Janvier\",\"Février\",\"Mars\",\"Avril\",\"Mai\",\"Juin\",\"Juillet\",\"Août\",\"Septembre\",\"Octobre\",\"Novembre\",\"Décembre\",\"\"),\"\")","v":""},{"$f":"IF(HD9=1,CHOOSE(MONTH(HD6),\"Janvier\",\"Février\",\"Mars\",\"Avril\",\"Mai\",\"Juin\",\"Juillet\",\"Août\",\"Septembre\",\"Octobre\",\"Novembre\",\"Décembre\",\"\"),\"\")","v":""},{"$f":"IF(HE9=1,CHOOSE(MONTH(HE6),\"Janvier\",\"Février\",\"Mars\",\"Avril\",\"Mai\",\"Juin\",\"Juillet\",\"Août\",\"Septembre\",\"Octobre\",\"Novembre\",\"Décembre\",\"\"),\"\")","v":""},{"$f":"IF(HF9=1,CHOOSE(MONTH(HF6),\"Janvier\",\"Février\",\"Mars\",\"Avril\",\"Mai\",\"Juin\",\"Juillet\",\"Août\",\"Septembre\",\"Octobre\",\"Novembre\",\"Décembre\",\"\"),\"\")","v":""},{"$f":"IF(HG9=1,CHOOSE(MONTH(HG6),\"Janvier\",\"Février\",\"Mars\",\"Avril\",\"Mai\",\"Juin\",\"Juillet\",\"Août\",\"Septembre\",\"Octobre\",\"Novembre\",\"Décembre\",\"\"),\"\")","v":""},{"$f":"IF(HH9=1,CHOOSE(MONTH(HH6),\"Janvier\",\"Février\",\"Mars\",\"Avril\",\"Mai\",\"Juin\",\"Juillet\",\"Août\",\"Septembre\",\"Octobre\",\"Novembre\",\"Décembre\",\"\"),\"\")","v":""},{"$f":"IF(HI9=1,CHOOSE(MONTH(HI6),\"Janvier\",\"Février\",\"Mars\",\"Avril\",\"Mai\",\"Juin\",\"Juillet\",\"Août\",\"Septembre\",\"Octobre\",\"Novembre\",\"Décembre\",\"\"),\"\")","v":""},{"$f":"IF(HJ9=1,CHOOSE(MONTH(HJ6),\"Janvier\",\"Février\",\"Mars\",\"Avril\",\"Mai\",\"Juin\",\"Juillet\",\"Août\",\"Septembre\",\"Octobre\",\"Novembre\",\"Décembre\",\"\"),\"\")","v":""},{"$f":"IF(HK9=1,CHOOSE(MONTH(HK6),\"Janvier\",\"Février\",\"Mars\",\"Avril\",\"Mai\",\"Juin\",\"Juillet\",\"Août\",\"Septembre\",\"Octobre\",\"Novembre\",\"Décembre\",\"\"),\"\")","v":""},{"$f":"IF(HL9=1,CHOOSE(MONTH(HL6),\"Janvier\",\"Février\",\"Mars\",\"Avril\",\"Mai\",\"Juin\",\"Juillet\",\"Août\",\"Septembre\",\"Octobre\",\"Novembre\",\"Décembre\",\"\"),\"\")","v":""},{"$f":"IF(HM9=1,CHOOSE(MONTH(HM6),\"Janvier\",\"Février\",\"Mars\",\"Avril\",\"Mai\",\"Juin\",\"Juillet\",\"Août\",\"Septembre\",\"Octobre\",\"Novembre\",\"Décembre\",\"\"),\"\")","v":""},{"$f":"IF(HN9=1,CHOOSE(MONTH(HN6),\"Janvier\",\"Février\",\"Mars\",\"Avril\",\"Mai\",\"Juin\",\"Juillet\",\"Août\",\"Septembre\",\"Octobre\",\"Novembre\",\"Décembre\",\"\"),\"\")","v":""},{"$f":"IF(HO9=1,CHOOSE(MONTH(HO6),\"Janvier\",\"Février\",\"Mars\",\"Avril\",\"Mai\",\"Juin\",\"Juillet\",\"Août\",\"Septembre\",\"Octobre\",\"Novembre\",\"Décembre\",\"\"),\"\")","v":""},{"$f":"IF(HP9=1,CHOOSE(MONTH(HP6),\"Janvier\",\"Février\",\"Mars\",\"Avril\",\"Mai\",\"Juin\",\"Juillet\",\"Août\",\"Septembre\",\"Octobre\",\"Novembre\",\"Décembre\",\"\"),\"\")","v":"Août"},{"$f":"IF(HQ9=1,CHOOSE(MONTH(HQ6),\"Janvier\",\"Février\",\"Mars\",\"Avril\",\"Mai\",\"Juin\",\"Juillet\",\"Août\",\"Septembre\",\"Octobre\",\"Novembre\",\"Décembre\",\"\"),\"\")","v":""},{"$f":"IF(HR9=1,CHOOSE(MONTH(HR6),\"Janvier\",\"Février\",\"Mars\",\"Avril\",\"Mai\",\"Juin\",\"Juillet\",\"Août\",\"Septembre\",\"Octobre\",\"Novembre\",\"Décembre\",\"\"),\"\")","v":""},{"$f":"IF(HS9=1,CHOOSE(MONTH(HS6),\"Janvier\",\"Février\",\"Mars\",\"Avril\",\"Mai\",\"Juin\",\"Juillet\",\"Août\",\"Septembre\",\"Octobre\",\"Novembre\",\"Décembre\",\"\"),\"\")","v":""},{"$f":"IF(HT9=1,CHOOSE(MONTH(HT6),\"Janvier\",\"Février\",\"Mars\",\"Avril\",\"Mai\",\"Juin\",\"Juillet\",\"Août\",\"Septembre\",\"Octobre\",\"Novembre\",\"Décembre\",\"\"),\"\")","v":""},{"$f":"IF(HU9=1,CHOOSE(MONTH(HU6),\"Janvier\",\"Février\",\"Mars\",\"Avril\",\"Mai\",\"Juin\",\"Juillet\",\"Août\",\"Septembre\",\"Octobre\",\"Novembre\",\"Décembre\",\"\"),\"\")","v":""},{"$f":"IF(HV9=1,CHOOSE(MONTH(HV6),\"Janvier\",\"Février\",\"Mars\",\"Avril\",\"Mai\",\"Juin\",\"Juillet\",\"Août\",\"Septembre\",\"Octobre\",\"Novembre\",\"Décembre\",\"\"),\"\")","v":""},{"$f":"IF(HW9=1,CHOOSE(MONTH(HW6),\"Janvier\",\"Février\",\"Mars\",\"Avril\",\"Mai\",\"Juin\",\"Juillet\",\"Août\",\"Septembre\",\"Octobre\",\"Novembre\",\"Décembre\",\"\"),\"\")","v":""},{"$f":"IF(HX9=1,CHOOSE(MONTH(HX6),\"Janvier\",\"Février\",\"Mars\",\"Avril\",\"Mai\",\"Juin\",\"Juillet\",\"Août\",\"Septembre\",\"Octobre\",\"Novembre\",\"Décembre\",\"\"),\"\")","v":""},{"$f":"IF(HY9=1,CHOOSE(MONTH(HY6),\"Janvier\",\"Février\",\"Mars\",\"Avril\",\"Mai\",\"Juin\",\"Juillet\",\"Août\",\"Septembre\",\"Octobre\",\"Novembre\",\"Décembre\",\"\"),\"\")","v":""},{"$f":"IF(HZ9=1,CHOOSE(MONTH(HZ6),\"Janvier\",\"Février\",\"Mars\",\"Avril\",\"Mai\",\"Juin\",\"Juillet\",\"Août\",\"Septembre\",\"Octobre\",\"Novembre\",\"Décembre\",\"\"),\"\")","v":""},{"$f":"IF(IA9=1,CHOOSE(MONTH(IA6),\"Janvier\",\"Février\",\"Mars\",\"Avril\",\"Mai\",\"Juin\",\"Juillet\",\"Août\",\"Septembre\",\"Octobre\",\"Novembre\",\"Décembre\",\"\"),\"\")","v":""},"",{"$f":"IF(IC9=1,CHOOSE(MONTH(IC6),\"Janvier\",\"Février\",\"Mars\",\"Avril\",\"Mai\",\"Juin\",\"Juillet\",\"Août\",\"Septembre\",\"Octobre\",\"Novembre\",\"Décembre\",\"\"),\"\")","v":""},{"$f":"IF(ID9=1,CHOOSE(MONTH(ID6),\"Janvier\",\"Février\",\"Mars\",\"Avril\",\"Mai\",\"Juin\",\"Juillet\",\"Août\",\"Septembre\",\"Octobre\",\"Novembre\",\"Décembre\",\"\"),\"\")","v":""},{"$f":"IF(IE9=1,CHOOSE(MONTH(IE6),\"Janvier\",\"Février\",\"Mars\",\"Avril\",\"Mai\",\"Juin\",\"Juillet\",\"Août\",\"Septembre\",\"Octobre\",\"Novembre\",\"Décembre\",\"\"),\"\")","v":""},{"$f":"IF(IF9=1,CHOOSE(MONTH(IF6),\"Janvier\",\"Février\",\"Mars\",\"Avril\",\"Mai\",\"Juin\",\"Juillet\",\"Août\",\"Septembre\",\"Octobre\",\"Novembre\",\"Décembre\",\"\"),\"\")","v":""},{"$f":"IF(IG9=1,CHOOSE(MONTH(IG6),\"Janvier\",\"Février\",\"Mars\",\"Avril\",\"Mai\",\"Juin\",\"Juillet\",\"Août\",\"Septembre\",\"Octobre\",\"Novembre\",\"Décembre\",\"\"),\"\")","v":""},{"$f":"IF(IH9=1,CHOOSE(MONTH(IH6),\"Janvier\",\"Février\",\"Mars\",\"Avril\",\"Mai\",\"Juin\",\"Juillet\",\"Août\",\"Septembre\",\"Octobre\",\"Novembre\",\"Décembre\",\"\"),\"\")","v":""},{"$f":"IF(II9=1,CHOOSE(MONTH(II6),\"Janvier\",\"Février\",\"Mars\",\"Avril\",\"Mai\",\"Juin\",\"Juillet\",\"Août\",\"Septembre\",\"Octobre\",\"Novembre\",\"Décembre\",\"\"),\"\")","v":""},{"$f":"IF(IJ9=1,CHOOSE(MONTH(IJ6),\"Janvier\",\"Février\",\"Mars\",\"Avril\",\"Mai\",\"Juin\",\"Juillet\",\"Août\",\"Septembre\",\"Octobre\",\"Novembre\",\"Décembre\",\"\"),\"\")","v":""},{"$f":"IF(IK9=1,CHOOSE(MONTH(IK6),\"Janvier\",\"Février\",\"Mars\",\"Avril\",\"Mai\",\"Juin\",\"Juillet\",\"Août\",\"Septembre\",\"Octobre\",\"Novembre\",\"Décembre\",\"\"),\"\")","v":""},{"$f":"IF(IL9=1,CHOOSE(MONTH(IL6),\"Janvier\",\"Février\",\"Mars\",\"Avril\",\"Mai\",\"Juin\",\"Juillet\",\"Août\",\"Septembre\",\"Octobre\",\"Novembre\",\"Décembre\",\"\"),\"\")","v":""},{"$f":"IF(IM9=1,CHOOSE(MONTH(IM6),\"Janvier\",\"Février\",\"Mars\",\"Avril\",\"Mai\",\"Juin\",\"Juillet\",\"Août\",\"Septembre\",\"Octobre\",\"Novembre\",\"Décembre\",\"\"),\"\")","v":""},{"$f":"IF(IN9=1,CHOOSE(MONTH(IN6),\"Janvier\",\"Février\",\"Mars\",\"Avril\",\"Mai\",\"Juin\",\"Juillet\",\"Août\",\"Septembre\",\"Octobre\",\"Novembre\",\"Décembre\",\"\"),\"\")","v":""},{"$f":"IF(IO9=1,CHOOSE(MONTH(IO6),\"Janvier\",\"Février\",\"Mars\",\"Avril\",\"Mai\",\"Juin\",\"Juillet\",\"Août\",\"Septembre\",\"Octobre\",\"Novembre\",\"Décembre\",\"\"),\"\")","v":""},{"$f":"IF(IP9=1,CHOOSE(MONTH(IP6),\"Janvier\",\"Février\",\"Mars\",\"Avril\",\"Mai\",\"Juin\",\"Juillet\",\"Août\",\"Septembre\",\"Octobre\",\"Novembre\",\"Décembre\",\"\"),\"\")","v":""},{"$f":"IF(IQ9=1,CHOOSE(MONTH(IQ6),\"Janvier\",\"Février\",\"Mars\",\"Avril\",\"Mai\",\"Juin\",\"Juillet\",\"Août\",\"Septembre\",\"Octobre\",\"Novembre\",\"Décembre\",\"\"),\"\")","v":""},{"$f":"IF(IR9=1,CHOOSE(MONTH(IR6),\"Janvier\",\"Février\",\"Mars\",\"Avril\",\"Mai\",\"Juin\",\"Juillet\",\"Août\",\"Septembre\",\"Octobre\",\"Novembre\",\"Décembre\",\"\"),\"\")","v":""},{"$f":"IF(IS9=1,CHOOSE(MONTH(IS6),\"Janvier\",\"Février\",\"Mars\",\"Avril\",\"Mai\",\"Juin\",\"Juillet\",\"Août\",\"Septembre\",\"Octobre\",\"Novembre\",\"Décembre\",\"\"),\"\")","v":""},{"$f":"IF(IT9=1,CHOOSE(MONTH(IT6),\"Janvier\",\"Février\",\"Mars\",\"Avril\",\"Mai\",\"Juin\",\"Juillet\",\"Août\",\"Septembre\",\"Octobre\",\"Novembre\",\"Décembre\",\"\"),\"\")","v":""},{"$f":"IF(IU9=1,CHOOSE(MONTH(IU6),\"Janvier\",\"Février\",\"Mars\",\"Avril\",\"Mai\",\"Juin\",\"Juillet\",\"Août\",\"Septembre\",\"Octobre\",\"Novembre\",\"Décembre\",\"\"),\"\")","v":"Septembre"},{"$f":"IF(IV9=1,CHOOSE(MONTH(IV6),\"Janvier\",\"Février\",\"Mars\",\"Avril\",\"Mai\",\"Juin\",\"Juillet\",\"Août\",\"Septembre\",\"Octobre\",\"Novembre\",\"Décembre\",\"\"),\"\")","v":""},{"$f":"IF(IW9=1,CHOOSE(MONTH(IW6),\"Janvier\",\"Février\",\"Mars\",\"Avril\",\"Mai\",\"Juin\",\"Juillet\",\"Août\",\"Septembre\",\"Octobre\",\"Novembre\",\"Décembre\",\"\"),\"\")","v":""},{"$f":"IF(IX9=1,CHOOSE(MONTH(IX6),\"Janvier\",\"Février\",\"Mars\",\"Avril\",\"Mai\",\"Juin\",\"Juillet\",\"Août\",\"Septembre\",\"Octobre\",\"Novembre\",\"Décembre\",\"\"),\"\")","v":""},{"$f":"IF(IY9=1,CHOOSE(MONTH(IY6),\"Janvier\",\"Février\",\"Mars\",\"Avril\",\"Mai\",\"Juin\",\"Juillet\",\"Août\",\"Septembre\",\"Octobre\",\"Novembre\",\"Décembre\",\"\"),\"\")","v":""},{"$f":"IF(IZ9=1,CHOOSE(MONTH(IZ6),\"Janvier\",\"Février\",\"Mars\",\"Avril\",\"Mai\",\"Juin\",\"Juillet\",\"Août\",\"Septembre\",\"Octobre\",\"Novembre\",\"Décembre\",\"\"),\"\")","v":""},{"$f":"IF(JA9=1,CHOOSE(MONTH(JA6),\"Janvier\",\"Février\",\"Mars\",\"Avril\",\"Mai\",\"Juin\",\"Juillet\",\"Août\",\"Septembre\",\"Octobre\",\"Novembre\",\"Décembre\",\"\"),\"\")","v":""},{"$f":"IF(JB9=1,CHOOSE(MONTH(JB6),\"Janvier\",\"Février\",\"Mars\",\"Avril\",\"Mai\",\"Juin\",\"Juillet\",\"Août\",\"Septembre\",\"Octobre\",\"Novembre\",\"Décembre\",\"\"),\"\")","v":""},{"$f":"IF(JC9=1,CHOOSE(MONTH(JC6),\"Janvier\",\"Février\",\"Mars\",\"Avril\",\"Mai\",\"Juin\",\"Juillet\",\"Août\",\"Septembre\",\"Octobre\",\"Novembre\",\"Décembre\",\"\"),\"\")","v":""},{"$f":"IF(JD9=1,CHOOSE(MONTH(JD6),\"Janvier\",\"Février\",\"Mars\",\"Avril\",\"Mai\",\"Juin\",\"Juillet\",\"Août\",\"Septembre\",\"Octobre\",\"Novembre\",\"Décembre\",\"\"),\"\")","v":""},{"$f":"IF(JE9=1,CHOOSE(MONTH(JE6),\"Janvier\",\"Février\",\"Mars\",\"Avril\",\"Mai\",\"Juin\",\"Juillet\",\"Août\",\"Septembre\",\"Octobre\",\"Novembre\",\"Décembre\",\"\"),\"\")","v":""},{"$f":"IF(JF9=1,CHOOSE(MONTH(JF6),\"Janvier\",\"Février\",\"Mars\",\"Avril\",\"Mai\",\"Juin\",\"Juillet\",\"Août\",\"Septembre\",\"Octobre\",\"Novembre\",\"Décembre\",\"\"),\"\")","v":""},{"$f":"IF(JG9=1,CHOOSE(MONTH(JG6),\"Janvier\",\"Février\",\"Mars\",\"Avril\",\"Mai\",\"Juin\",\"Juillet\",\"Août\",\"Septembre\",\"Octobre\",\"Novembre\",\"Décembre\",\"\"),\"\")","v":""},"",{"$f":"IF(JI9=1,CHOOSE(MONTH(JI6),\"Janvier\",\"Février\",\"Mars\",\"Avril\",\"Mai\",\"Juin\",\"Juillet\",\"Août\",\"Septembre\",\"Octobre\",\"Novembre\",\"Décembre\",\"\"),\"\")","v":""},{"$f":"IF(JJ9=1,CHOOSE(MONTH(JJ6),\"Janvier\",\"Février\",\"Mars\",\"Avril\",\"Mai\",\"Juin\",\"Juillet\",\"Août\",\"Septembre\",\"Octobre\",\"Novembre\",\"Décembre\",\"\"),\"\")","v":""},{"$f":"IF(JK9=1,CHOOSE(MONTH(JK6),\"Janvier\",\"Février\",\"Mars\",\"Avril\",\"Mai\",\"Juin\",\"Juillet\",\"Août\",\"Septembre\",\"Octobre\",\"Novembre\",\"Décembre\",\"\"),\"\")","v":""},{"$f":"IF(JL9=1,CHOOSE(MONTH(JL6),\"Janvier\",\"Février\",\"Mars\",\"Avril\",\"Mai\",\"Juin\",\"Juillet\",\"Août\",\"Septembre\",\"Octobre\",\"Novembre\",\"Décembre\",\"\"),\"\")","v":""},{"$f":"IF(JM9=1,CHOOSE(MONTH(JM6),\"Janvier\",\"Février\",\"Mars\",\"Avril\",\"Mai\",\"Juin\",\"Juillet\",\"Août\",\"Septembre\",\"Octobre\",\"Novembre\",\"Décembre\",\"\"),\"\")","v":""},{"$f":"IF(JN9=1,CHOOSE(MONTH(JN6),\"Janvier\",\"Février\",\"Mars\",\"Avril\",\"Mai\",\"Juin\",\"Juillet\",\"Août\",\"Septembre\",\"Octobre\",\"Novembre\",\"Décembre\",\"\"),\"\")","v":""},{"$f":"IF(JO9=1,CHOOSE(MONTH(JO6),\"Janvier\",\"Février\",\"Mars\",\"Avril\",\"Mai\",\"Juin\",\"Juillet\",\"Août\",\"Septembre\",\"Octobre\",\"Novembre\",\"Décembre\",\"\"),\"\")","v":""},{"$f":"IF(JP9=1,CHOOSE(MONTH(JP6),\"Janvier\",\"Février\",\"Mars\",\"Avril\",\"Mai\",\"Juin\",\"Juillet\",\"Août\",\"Septembre\",\"Octobre\",\"Novembre\",\"Décembre\",\"\"),\"\")","v":""},{"$f":"IF(JQ9=1,CHOOSE(MONTH(JQ6),\"Janvier\",\"Février\",\"Mars\",\"Avril\",\"Mai\",\"Juin\",\"Juillet\",\"Août\",\"Septembre\",\"Octobre\",\"Novembre\",\"Décembre\",\"\"),\"\")","v":""},{"$f":"IF(JR9=1,CHOOSE(MONTH(JR6),\"Janvier\",\"Février\",\"Mars\",\"Avril\",\"Mai\",\"Juin\",\"Juillet\",\"Août\",\"Septembre\",\"Octobre\",\"Novembre\",\"Décembre\",\"\"),\"\")","v":""},{"$f":"IF(JS9=1,CHOOSE(MONTH(JS6),\"Janvier\",\"Février\",\"Mars\",\"Avril\",\"Mai\",\"Juin\",\"Juillet\",\"Août\",\"Septembre\",\"Octobre\",\"Novembre\",\"Décembre\",\"\"),\"\")","v":""},{"$f":"IF(JT9=1,CHOOSE(MONTH(JT6),\"Janvier\",\"Février\",\"Mars\",\"Avril\",\"Mai\",\"Juin\",\"Juillet\",\"Août\",\"Septembre\",\"Octobre\",\"Novembre\",\"Décembre\",\"\"),\"\")","v":""},{"$f":"IF(JU9=1,CHOOSE(MONTH(JU6),\"Janvier\",\"Février\",\"Mars\",\"Avril\",\"Mai\",\"Juin\",\"Juillet\",\"Août\",\"Septembre\",\"Octobre\",\"Novembre\",\"Décembre\",\"\"),\"\")","v":""},{"$f":"IF(JV9=1,CHOOSE(MONTH(JV6),\"Janvier\",\"Février\",\"Mars\",\"Avril\",\"Mai\",\"Juin\",\"Juillet\",\"Août\",\"Septembre\",\"Octobre\",\"Novembre\",\"Décembre\",\"\"),\"\")","v":""},{"$f":"IF(JW9=1,CHOOSE(MONTH(JW6),\"Janvier\",\"Février\",\"Mars\",\"Avril\",\"Mai\",\"Juin\",\"Juillet\",\"Août\",\"Septembre\",\"Octobre\",\"Novembre\",\"Décembre\",\"\"),\"\")","v":""},{"$f":"IF(JX9=1,CHOOSE(MONTH(JX6),\"Janvier\",\"Février\",\"Mars\",\"Avril\",\"Mai\",\"Juin\",\"Juillet\",\"Août\",\"Septembre\",\"Octobre\",\"Novembre\",\"Décembre\",\"\"),\"\")","v":""},{"$f":"IF(JY9=1,CHOOSE(MONTH(JY6),\"Janvier\",\"Février\",\"Mars\",\"Avril\",\"Mai\",\"Juin\",\"Juillet\",\"Août\",\"Septembre\",\"Octobre\",\"Novembre\",\"Décembre\",\"\"),\"\")","v":"Octobre"},{"$f":"IF(JZ9=1,CHOOSE(MONTH(JZ6),\"Janvier\",\"Février\",\"Mars\",\"Avril\",\"Mai\",\"Juin\",\"Juillet\",\"Août\",\"Septembre\",\"Octobre\",\"Novembre\",\"Décembre\",\"\"),\"\")","v":""},{"$f":"IF(KA9=1,CHOOSE(MONTH(KA6),\"Janvier\",\"Février\",\"Mars\",\"Avril\",\"Mai\",\"Juin\",\"Juillet\",\"Août\",\"Septembre\",\"Octobre\",\"Novembre\",\"Décembre\",\"\"),\"\")","v":""},{"$f":"IF(KB9=1,CHOOSE(MONTH(KB6),\"Janvier\",\"Février\",\"Mars\",\"Avril\",\"Mai\",\"Juin\",\"Juillet\",\"Août\",\"Septembre\",\"Octobre\",\"Novembre\",\"Décembre\",\"\"),\"\")","v":""},{"$f":"IF(KC9=1,CHOOSE(MONTH(KC6),\"Janvier\",\"Février\",\"Mars\",\"Avril\",\"Mai\",\"Juin\",\"Juillet\",\"Août\",\"Septembre\",\"Octobre\",\"Novembre\",\"Décembre\",\"\"),\"\")","v":""},{"$f":"IF(KD9=1,CHOOSE(MONTH(KD6),\"Janvier\",\"Février\",\"Mars\",\"Avril\",\"Mai\",\"Juin\",\"Juillet\",\"Août\",\"Septembre\",\"Octobre\",\"Novembre\",\"Décembre\",\"\"),\"\")","v":""},{"$f":"IF(KE9=1,CHOOSE(MONTH(KE6),\"Janvier\",\"Février\",\"Mars\",\"Avril\",\"Mai\",\"Juin\",\"Juillet\",\"Août\",\"Septembre\",\"Octobre\",\"Novembre\",\"Décembre\",\"\"),\"\")","v":""},{"$f":"IF(KF9=1,CHOOSE(MONTH(KF6),\"Janvier\",\"Février\",\"Mars\",\"Avril\",\"Mai\",\"Juin\",\"Juillet\",\"Août\",\"Septembre\",\"Octobre\",\"Novembre\",\"Décembre\",\"\"),\"\")","v":""},{"$f":"IF(KG9=1,CHOOSE(MONTH(KG6),\"Janvier\",\"Février\",\"Mars\",\"Avril\",\"Mai\",\"Juin\",\"Juillet\",\"Août\",\"Septembre\",\"Octobre\",\"Novembre\",\"Décembre\",\"\"),\"\")","v":""},{"$f":"IF(KH9=1,CHOOSE(MONTH(KH6),\"Janvier\",\"Février\",\"Mars\",\"Avril\",\"Mai\",\"Juin\",\"Juillet\",\"Août\",\"Septembre\",\"Octobre\",\"Novembre\",\"Décembre\",\"\"),\"\")","v":""},{"$f":"IF(KI9=1,CHOOSE(MONTH(KI6),\"Janvier\",\"Février\",\"Mars\",\"Avril\",\"Mai\",\"Juin\",\"Juillet\",\"Août\",\"Septembre\",\"Octobre\",\"Novembre\",\"Décembre\",\"\"),\"\")","v":""},{"$f":"IF(KJ9=1,CHOOSE(MONTH(KJ6),\"Janvier\",\"Février\",\"Mars\",\"Avril\",\"Mai\",\"Juin\",\"Juillet\",\"Août\",\"Septembre\",\"Octobre\",\"Novembre\",\"Décembre\",\"\"),\"\")","v":""},{"$f":"IF(KK9=1,CHOOSE(MONTH(KK6),\"Janvier\",\"Février\",\"Mars\",\"Avril\",\"Mai\",\"Juin\",\"Juillet\",\"Août\",\"Septembre\",\"Octobre\",\"Novembre\",\"Décembre\",\"\"),\"\")","v":""},{"$f":"IF(KL9=1,CHOOSE(MONTH(KL6),\"Janvier\",\"Février\",\"Mars\",\"Avril\",\"Mai\",\"Juin\",\"Juillet\",\"Août\",\"Septembre\",\"Octobre\",\"Novembre\",\"Décembre\",\"\"),\"\")","v":""},{"$f":"IF(KM9=1,CHOOSE(MONTH(KM6),\"Janvier\",\"Février\",\"Mars\",\"Avril\",\"Mai\",\"Juin\",\"Juillet\",\"Août\",\"Septembre\",\"Octobre\",\"Novembre\",\"Décembre\",\"\"),\"\")","v":""},"",{"$f":"IF(KO9=1,CHOOSE(MONTH(KO6),\"Janvier\",\"Février\",\"Mars\",\"Avril\",\"Mai\",\"Juin\",\"Juillet\",\"Août\",\"Septembre\",\"Octobre\",\"Novembre\",\"Décembre\",\"\"),\"\")","v":""},{"$f":"IF(KP9=1,CHOOSE(MONTH(KP6),\"Janvier\",\"Février\",\"Mars\",\"Avril\",\"Mai\",\"Juin\",\"Juillet\",\"Août\",\"Septembre\",\"Octobre\",\"Novembre\",\"Décembre\",\"\"),\"\")","v":""},{"$f":"IF(KQ9=1,CHOOSE(MONTH(KQ6),\"Janvier\",\"Février\",\"Mars\",\"Avril\",\"Mai\",\"Juin\",\"Juillet\",\"Août\",\"Septembre\",\"Octobre\",\"Novembre\",\"Décembre\",\"\"),\"\")","v":""},{"$f":"IF(KR9=1,CHOOSE(MONTH(KR6),\"Janvier\",\"Février\",\"Mars\",\"Avril\",\"Mai\",\"Juin\",\"Juillet\",\"Août\",\"Septembre\",\"Octobre\",\"Novembre\",\"Décembre\",\"\"),\"\")","v":""},{"$f":"IF(KS9=1,CHOOSE(MONTH(KS6),\"Janvier\",\"Février\",\"Mars\",\"Avril\",\"Mai\",\"Juin\",\"Juillet\",\"Août\",\"Septembre\",\"Octobre\",\"Novembre\",\"Décembre\",\"\"),\"\")","v":""},{"$f":"IF(KT9=1,CHOOSE(MONTH(KT6),\"Janvier\",\"Février\",\"Mars\",\"Avril\",\"Mai\",\"Juin\",\"Juillet\",\"Août\",\"Septembre\",\"Octobre\",\"Novembre\",\"Décembre\",\"\"),\"\")","v":""},{"$f":"IF(KU9=1,CHOOSE(MONTH(KU6),\"Janvier\",\"Février\",\"Mars\",\"Avril\",\"Mai\",\"Juin\",\"Juillet\",\"Août\",\"Septembre\",\"Octobre\",\"Novembre\",\"Décembre\",\"\"),\"\")","v":""},{"$f":"IF(KV9=1,CHOOSE(MONTH(KV6),\"Janvier\",\"Février\",\"Mars\",\"Avril\",\"Mai\",\"Juin\",\"Juillet\",\"Août\",\"Septembre\",\"Octobre\",\"Novembre\",\"Décembre\",\"\"),\"\")","v":""},{"$f":"IF(KW9=1,CHOOSE(MONTH(KW6),\"Janvier\",\"Février\",\"Mars\",\"Avril\",\"Mai\",\"Juin\",\"Juillet\",\"Août\",\"Septembre\",\"Octobre\",\"Novembre\",\"Décembre\",\"\"),\"\")","v":""},{"$f":"IF(KX9=1,CHOOSE(MONTH(KX6),\"Janvier\",\"Février\",\"Mars\",\"Avril\",\"Mai\",\"Juin\",\"Juillet\",\"Août\",\"Septembre\",\"Octobre\",\"Novembre\",\"Décembre\",\"\"),\"\")","v":""},{"$f":"IF(KY9=1,CHOOSE(MONTH(KY6),\"Janvier\",\"Février\",\"Mars\",\"Avril\",\"Mai\",\"Juin\",\"Juillet\",\"Août\",\"Septembre\",\"Octobre\",\"Novembre\",\"Décembre\",\"\"),\"\")","v":""},{"$f":"IF(KZ9=1,CHOOSE(MONTH(KZ6),\"Janvier\",\"Février\",\"Mars\",\"Avril\",\"Mai\",\"Juin\",\"Juillet\",\"Août\",\"Septembre\",\"Octobre\",\"Novembre\",\"Décembre\",\"\"),\"\")","v":""},{"$f":"IF(LA9=1,CHOOSE(MONTH(LA6),\"Janvier\",\"Février\",\"Mars\",\"Avril\",\"Mai\",\"Juin\",\"Juillet\",\"Août\",\"Septembre\",\"Octobre\",\"Novembre\",\"Décembre\",\"\"),\"\")","v":""},{"$f":"IF(LB9=1,CHOOSE(MONTH(LB6),\"Janvier\",\"Février\",\"Mars\",\"Avril\",\"Mai\",\"Juin\",\"Juillet\",\"Août\",\"Septembre\",\"Octobre\",\"Novembre\",\"Décembre\",\"\"),\"\")","v":""},{"$f":"IF(LC9=1,CHOOSE(MONTH(LC6),\"Janvier\",\"Février\",\"Mars\",\"Avril\",\"Mai\",\"Juin\",\"Juillet\",\"Août\",\"Septembre\",\"Octobre\",\"Novembre\",\"Décembre\",\"\"),\"\")","v":""},{"$f":"IF(LD9=1,CHOOSE(MONTH(LD6),\"Janvier\",\"Février\",\"Mars\",\"Avril\",\"Mai\",\"Juin\",\"Juillet\",\"Août\",\"Septembre\",\"Octobre\",\"Novembre\",\"Décembre\",\"\"),\"\")","v":"Novembre"},{"$f":"IF(LE9=1,CHOOSE(MONTH(LE6),\"Janvier\",\"Février\",\"Mars\",\"Avril\",\"Mai\",\"Juin\",\"Juillet\",\"Août\",\"Septembre\",\"Octobre\",\"Novembre\",\"Décembre\",\"\"),\"\")","v":""},{"$f":"IF(LF9=1,CHOOSE(MONTH(LF6),\"Janvier\",\"Février\",\"Mars\",\"Avril\",\"Mai\",\"Juin\",\"Juillet\",\"Août\",\"Septembre\",\"Octobre\",\"Novembre\",\"Décembre\",\"\"),\"\")","v":""},{"$f":"IF(LG9=1,CHOOSE(MONTH(LG6),\"Janvier\",\"Février\",\"Mars\",\"Avril\",\"Mai\",\"Juin\",\"Juillet\",\"Août\",\"Septembre\",\"Octobre\",\"Novembre\",\"Décembre\",\"\"),\"\")","v":""},{"$f":"IF(LH9=1,CHOOSE(MONTH(LH6),\"Janvier\",\"Février\",\"Mars\",\"Avril\",\"Mai\",\"Juin\",\"Juillet\",\"Août\",\"Septembre\",\"Octobre\",\"Novembre\",\"Décembre\",\"\"),\"\")","v":""},{"$f":"IF(LI9=1,CHOOSE(MONTH(LI6),\"Janvier\",\"Février\",\"Mars\",\"Avril\",\"Mai\",\"Juin\",\"Juillet\",\"Août\",\"Septembre\",\"Octobre\",\"Novembre\",\"Décembre\",\"\"),\"\")","v":""},{"$f":"IF(LJ9=1,CHOOSE(MONTH(LJ6),\"Janvier\",\"Février\",\"Mars\",\"Avril\",\"Mai\",\"Juin\",\"Juillet\",\"Août\",\"Septembre\",\"Octobre\",\"Novembre\",\"Décembre\",\"\"),\"\")","v":""},{"$f":"IF(LK9=1,CHOOSE(MONTH(LK6),\"Janvier\",\"Février\",\"Mars\",\"Avril\",\"Mai\",\"Juin\",\"Juillet\",\"Août\",\"Septembre\",\"Octobre\",\"Novembre\",\"Décembre\",\"\"),\"\")","v":""},{"$f":"IF(LL9=1,CHOOSE(MONTH(LL6),\"Janvier\",\"Février\",\"Mars\",\"Avril\",\"Mai\",\"Juin\",\"Juillet\",\"Août\",\"Septembre\",\"Octobre\",\"Novembre\",\"Décembre\",\"\"),\"\")","v":""},{"$f":"IF(LM9=1,CHOOSE(MONTH(LM6),\"Janvier\",\"Février\",\"Mars\",\"Avril\",\"Mai\",\"Juin\",\"Juillet\",\"Août\",\"Septembre\",\"Octobre\",\"Novembre\",\"Décembre\",\"\"),\"\")","v":""},{"$f":"IF(LN9=1,CHOOSE(MONTH(LN6),\"Janvier\",\"Février\",\"Mars\",\"Avril\",\"Mai\",\"Juin\",\"Juillet\",\"Août\",\"Septembre\",\"Octobre\",\"Novembre\",\"Décembre\",\"\"),\"\")","v":""},{"$f":"IF(LO9=1,CHOOSE(MONTH(LO6),\"Janvier\",\"Février\",\"Mars\",\"Avril\",\"Mai\",\"Juin\",\"Juillet\",\"Août\",\"Septembre\",\"Octobre\",\"Novembre\",\"Décembre\",\"\"),\"\")","v":""},{"$f":"IF(LP9=1,CHOOSE(MONTH(LP6),\"Janvier\",\"Février\",\"Mars\",\"Avril\",\"Mai\",\"Juin\",\"Juillet\",\"Août\",\"Septembre\",\"Octobre\",\"Novembre\",\"Décembre\",\"\"),\"\")","v":""},{"$f":"IF(LQ9=1,CHOOSE(MONTH(LQ6),\"Janvier\",\"Février\",\"Mars\",\"Avril\",\"Mai\",\"Juin\",\"Juillet\",\"Août\",\"Septembre\",\"Octobre\",\"Novembre\",\"Décembre\",\"\"),\"\")","v":""},{"$f":"IF(LR9=1,CHOOSE(MONTH(LR6),\"Janvier\",\"Février\",\"Mars\",\"Avril\",\"Mai\",\"Juin\",\"Juillet\",\"Août\",\"Septembre\",\"Octobre\",\"Novembre\",\"Décembre\",\"\"),\"\")","v":""},{"$f":"IF(LS9=1,CHOOSE(MONTH(LS6),\"Janvier\",\"Février\",\"Mars\",\"Avril\",\"Mai\",\"Juin\",\"Juillet\",\"Août\",\"Septembre\",\"Octobre\",\"Novembre\",\"Décembre\",\"\"),\"\")","v":""},"",{"$f":"IF(LU9=1,CHOOSE(MONTH(LU6),\"Janvier\",\"Février\",\"Mars\",\"Avril\",\"Mai\",\"Juin\",\"Juillet\",\"Août\",\"Septembre\",\"Octobre\",\"Novembre\",\"Décembre\",\"\"),\"\")","v":""},{"$f":"IF(LV9=1,CHOOSE(MONTH(LV6),\"Janvier\",\"Février\",\"Mars\",\"Avril\",\"Mai\",\"Juin\",\"Juillet\",\"Août\",\"Septembre\",\"Octobre\",\"Novembre\",\"Décembre\",\"\"),\"\")","v":""},{"$f":"IF(LW9=1,CHOOSE(MONTH(LW6),\"Janvier\",\"Février\",\"Mars\",\"Avril\",\"Mai\",\"Juin\",\"Juillet\",\"Août\",\"Septembre\",\"Octobre\",\"Novembre\",\"Décembre\",\"\"),\"\")","v":""},{"$f":"IF(LX9=1,CHOOSE(MONTH(LX6),\"Janvier\",\"Février\",\"Mars\",\"Avril\",\"Mai\",\"Juin\",\"Juillet\",\"Août\",\"Septembre\",\"Octobre\",\"Novembre\",\"Décembre\",\"\"),\"\")","v":""},{"$f":"IF(LY9=1,CHOOSE(MONTH(LY6),\"Janvier\",\"Février\",\"Mars\",\"Avril\",\"Mai\",\"Juin\",\"Juillet\",\"Août\",\"Septembre\",\"Octobre\",\"Novembre\",\"Décembre\",\"\"),\"\")","v":""},{"$f":"IF(LZ9=1,CHOOSE(MONTH(LZ6),\"Janvier\",\"Février\",\"Mars\",\"Avril\",\"Mai\",\"Juin\",\"Juillet\",\"Août\",\"Septembre\",\"Octobre\",\"Novembre\",\"Décembre\",\"\"),\"\")","v":""},{"$f":"IF(MA9=1,CHOOSE(MONTH(MA6),\"Janvier\",\"Février\",\"Mars\",\"Avril\",\"Mai\",\"Juin\",\"Juillet\",\"Août\",\"Septembre\",\"Octobre\",\"Novembre\",\"Décembre\",\"\"),\"\")","v":""},{"$f":"IF(MB9=1,CHOOSE(MONTH(MB6),\"Janvier\",\"Février\",\"Mars\",\"Avril\",\"Mai\",\"Juin\",\"Juillet\",\"Août\",\"Septembre\",\"Octobre\",\"Novembre\",\"Décembre\",\"\"),\"\")","v":""},{"$f":"IF(MC9=1,CHOOSE(MONTH(MC6),\"Janvier\",\"Février\",\"Mars\",\"Avril\",\"Mai\",\"Juin\",\"Juillet\",\"Août\",\"Septembre\",\"Octobre\",\"Novembre\",\"Décembre\",\"\"),\"\")","v":""},{"$f":"IF(MD9=1,CHOOSE(MONTH(MD6),\"Janvier\",\"Février\",\"Mars\",\"Avril\",\"Mai\",\"Juin\",\"Juillet\",\"Août\",\"Septembre\",\"Octobre\",\"Novembre\",\"Décembre\",\"\"),\"\")","v":""},{"$f":"IF(ME9=1,CHOOSE(MONTH(ME6),\"Janvier\",\"Février\",\"Mars\",\"Avril\",\"Mai\",\"Juin\",\"Juillet\",\"Août\",\"Septembre\",\"Octobre\",\"Novembre\",\"Décembre\",\"\"),\"\")","v":""},{"$f":"IF(MF9=1,CHOOSE(MONTH(MF6),\"Janvier\",\"Février\",\"Mars\",\"Avril\",\"Mai\",\"Juin\",\"Juillet\",\"Août\",\"Septembre\",\"Octobre\",\"Novembre\",\"Décembre\",\"\"),\"\")","v":""},{"$f":"IF(MG9=1,CHOOSE(MONTH(MG6),\"Janvier\",\"Février\",\"Mars\",\"Avril\",\"Mai\",\"Juin\",\"Juillet\",\"Août\",\"Septembre\",\"Octobre\",\"Novembre\",\"Décembre\",\"\"),\"\")","v":""},{"$f":"IF(MH9=1,CHOOSE(MONTH(MH6),\"Janvier\",\"Février\",\"Mars\",\"Avril\",\"Mai\",\"Juin\",\"Juillet\",\"Août\",\"Septembre\",\"Octobre\",\"Novembre\",\"Décembre\",\"\"),\"\")","v":"Décembre"},{"$f":"IF(MI9=1,CHOOSE(MONTH(MI6),\"Janvier\",\"Février\",\"Mars\",\"Avril\",\"Mai\",\"Juin\",\"Juillet\",\"Août\",\"Septembre\",\"Octobre\",\"Novembre\",\"Décembre\",\"\"),\"\")","v":""},{"$f":"IF(MJ9=1,CHOOSE(MONTH(MJ6),\"Janvier\",\"Février\",\"Mars\",\"Avril\",\"Mai\",\"Juin\",\"Juillet\",\"Août\",\"Septembre\",\"Octobre\",\"Novembre\",\"Décembre\",\"\"),\"\")","v":""},{"$f":"IF(MK9=1,CHOOSE(MONTH(MK6),\"Janvier\",\"Février\",\"Mars\",\"Avril\",\"Mai\",\"Juin\",\"Juillet\",\"Août\",\"Septembre\",\"Octobre\",\"Novembre\",\"Décembre\",\"\"),\"\")","v":""},{"$f":"IF(ML9=1,CHOOSE(MONTH(ML6),\"Janvier\",\"Février\",\"Mars\",\"Avril\",\"Mai\",\"Juin\",\"Juillet\",\"Août\",\"Septembre\",\"Octobre\",\"Novembre\",\"Décembre\",\"\"),\"\")","v":""},{"$f":"IF(MM9=1,CHOOSE(MONTH(MM6),\"Janvier\",\"Février\",\"Mars\",\"Avril\",\"Mai\",\"Juin\",\"Juillet\",\"Août\",\"Septembre\",\"Octobre\",\"Novembre\",\"Décembre\",\"\"),\"\")","v":""},{"$f":"IF(MN9=1,CHOOSE(MONTH(MN6),\"Janvier\",\"Février\",\"Mars\",\"Avril\",\"Mai\",\"Juin\",\"Juillet\",\"Août\",\"Septembre\",\"Octobre\",\"Novembre\",\"Décembre\",\"\"),\"\")","v":""},{"$f":"IF(MO9=1,CHOOSE(MONTH(MO6),\"Janvier\",\"Février\",\"Mars\",\"Avril\",\"Mai\",\"Juin\",\"Juillet\",\"Août\",\"Septembre\",\"Octobre\",\"Novembre\",\"Décembre\",\"\"),\"\")","v":""},{"$f":"IF(MP9=1,CHOOSE(MONTH(MP6),\"Janvier\",\"Février\",\"Mars\",\"Avril\",\"Mai\",\"Juin\",\"Juillet\",\"Août\",\"Septembre\",\"Octobre\",\"Novembre\",\"Décembre\",\"\"),\"\")","v":""},{"$f":"IF(MQ9=1,CHOOSE(MONTH(MQ6),\"Janvier\",\"Février\",\"Mars\",\"Avril\",\"Mai\",\"Juin\",\"Juillet\",\"Août\",\"Septembre\",\"Octobre\",\"Novembre\",\"Décembre\",\"\"),\"\")","v":""},{"$f":"IF(MR9=1,CHOOSE(MONTH(MR6),\"Janvier\",\"Février\",\"Mars\",\"Avril\",\"Mai\",\"Juin\",\"Juillet\",\"Août\",\"Septembre\",\"Octobre\",\"Novembre\",\"Décembre\",\"\"),\"\")","v":""},{"$f":"IF(MS9=1,CHOOSE(MONTH(MS6),\"Janvier\",\"Février\",\"Mars\",\"Avril\",\"Mai\",\"Juin\",\"Juillet\",\"Août\",\"Septembre\",\"Octobre\",\"Novembre\",\"Décembre\",\"\"),\"\")","v":""},{"$f":"IF(MT9=1,CHOOSE(MONTH(MT6),\"Janvier\",\"Février\",\"Mars\",\"Avril\",\"Mai\",\"Juin\",\"Juillet\",\"Août\",\"Septembre\",\"Octobre\",\"Novembre\",\"Décembre\",\"\"),\"\")","v":""},{"$f":"IF(MU9=1,CHOOSE(MONTH(MU6),\"Janvier\",\"Février\",\"Mars\",\"Avril\",\"Mai\",\"Juin\",\"Juillet\",\"Août\",\"Septembre\",\"Octobre\",\"Novembre\",\"Décembre\",\"\"),\"\")","v":""},{"$f":"IF(MV9=1,CHOOSE(MONTH(MV6),\"Janvier\",\"Février\",\"Mars\",\"Avril\",\"Mai\",\"Juin\",\"Juillet\",\"Août\",\"Septembre\",\"Octobre\",\"Novembre\",\"Décembre\",\"\"),\"\")","v":""},{"$f":"IF(MW9=1,CHOOSE(MONTH(MW6),\"Janvier\",\"Février\",\"Mars\",\"Avril\",\"Mai\",\"Juin\",\"Juillet\",\"Août\",\"Septembre\",\"Octobre\",\"Novembre\",\"Décembre\",\"\"),\"\")","v":""},{"$f":"IF(MX9=1,CHOOSE(MONTH(MX6),\"Janvier\",\"Février\",\"Mars\",\"Avril\",\"Mai\",\"Juin\",\"Juillet\",\"Août\",\"Septembre\",\"Octobre\",\"Novembre\",\"Décembre\",\"\"),\"\")","v":""},{"$f":"IF(MY9=1,CHOOSE(MONTH(MY6),\"Janvier\",\"Février\",\"Mars\",\"Avril\",\"Mai\",\"Juin\",\"Juillet\",\"Août\",\"Septembre\",\"Octobre\",\"Novembre\",\"Décembre\",\"\"),\"\")","v":""},"",{"$f":"IF(NA9=1,CHOOSE(MONTH(NA6),\"Janvier\",\"Février\",\"Mars\",\"Avril\",\"Mai\",\"Juin\",\"Juillet\",\"Août\",\"Septembre\",\"Octobre\",\"Novembre\",\"Décembre\",\"\"),\"\")","v":""},{"$f":"IF(NB9=1,CHOOSE(MONTH(NB6),\"Janvier\",\"Février\",\"Mars\",\"Avril\",\"Mai\",\"Juin\",\"Juillet\",\"Août\",\"Septembre\",\"Octobre\",\"Novembre\",\"Décembre\",\"\"),\"\")","v":""},{"$f":"IF(NC9=1,CHOOSE(MONTH(NC6),\"Janvier\",\"Février\",\"Mars\",\"Avril\",\"Mai\",\"Juin\",\"Juillet\",\"Août\",\"Septembre\",\"Octobre\",\"Novembre\",\"Décembre\",\"\"),\"\")","v":""},{"$f":"IF(ND9=1,CHOOSE(MONTH(ND6),\"Janvier\",\"Février\",\"Mars\",\"Avril\",\"Mai\",\"Juin\",\"Juillet\",\"Août\",\"Septembre\",\"Octobre\",\"Novembre\",\"Décembre\",\"\"),\"\")","v":""},{"$f":"IF(NE9=1,CHOOSE(MONTH(NE6),\"Janvier\",\"Février\",\"Mars\",\"Avril\",\"Mai\",\"Juin\",\"Juillet\",\"Août\",\"Septembre\",\"Octobre\",\"Novembre\",\"Décembre\",\"\"),\"\")","v":""},{"$f":"IF(NF9=1,CHOOSE(MONTH(NF6),\"Janvier\",\"Février\",\"Mars\",\"Avril\",\"Mai\",\"Juin\",\"Juillet\",\"Août\",\"Septembre\",\"Octobre\",\"Novembre\",\"Décembre\",\"\"),\"\")","v":""},{"$f":"IF(NG9=1,CHOOSE(MONTH(NG6),\"Janvier\",\"Février\",\"Mars\",\"Avril\",\"Mai\",\"Juin\",\"Juillet\",\"Août\",\"Septembre\",\"Octobre\",\"Novembre\",\"Décembre\",\"\"),\"\")","v":""},{"$f":"IF(NH9=1,CHOOSE(MONTH(NH6),\"Janvier\",\"Février\",\"Mars\",\"Avril\",\"Mai\",\"Juin\",\"Juillet\",\"Août\",\"Septembre\",\"Octobre\",\"Novembre\",\"Décembre\",\"\"),\"\")","v":""},{"$f":"IF(NI9=1,CHOOSE(MONTH(NI6),\"Janvier\",\"Février\",\"Mars\",\"Avril\",\"Mai\",\"Juin\",\"Juillet\",\"Août\",\"Septembre\",\"Octobre\",\"Novembre\",\"Décembre\",\"\"),\"\")","v":""},{"$f":"IF(NJ9=1,CHOOSE(MONTH(NJ6),\"Janvier\",\"Février\",\"Mars\",\"Avril\",\"Mai\",\"Juin\",\"Juillet\",\"Août\",\"Septembre\",\"Octobre\",\"Novembre\",\"Décembre\",\"\"),\"\")","v":""},{"$f":"IF(NK9=1,CHOOSE(MONTH(NK6),\"Janvier\",\"Février\",\"Mars\",\"Avril\",\"Mai\",\"Juin\",\"Juillet\",\"Août\",\"Septembre\",\"Octobre\",\"Novembre\",\"Décembre\",\"\"),\"\")","v":""},{"$f":"IF(NL9=1,CHOOSE(MONTH(NL6),\"Janvier\",\"Février\",\"Mars\",\"Avril\",\"Mai\",\"Juin\",\"Juillet\",\"Août\",\"Septembre\",\"Octobre\",\"Novembre\",\"Décembre\",\"\"),\"\")","v":""},{"$f":"IF(NM9=1,CHOOSE(MONTH(NM6),\"Janvier\",\"Février\",\"Mars\",\"Avril\",\"Mai\",\"Juin\",\"Juillet\",\"Août\",\"Septembre\",\"Octobre\",\"Novembre\",\"Décembre\",\"\"),\"\")","v":"Janvier"}]
[null,null,1,2,3,4,5,6,7,8,null,{"$f":"IF(L10=\"L\",\"S\" & WEEKNUM(L6),\"\")","v":""},"S1","","","","","","","S2","","","","","","","S3","","","","","","","S4","","","","","","","S5","","","","","","","S6","","","","","","","S7","","","","","","","S8","","","","","","","S9","","","","","","",{"$f":"IF(BX10=\"L\",\"S\" & WEEKNUM(BX6),\"\")","v":"S10"},"","","","","","","S11","","","","","","","S12","","","","","","","S13","","","","","","","S14","","","","","","","S15","","","","","","","S16","","","","","","","S17","","","","","","","S18","","","","","","","S19",{"$f":"IF(EJ10=\"L\",\"S\" & WEEKNUM(EJ6),\"\")","v":""},"","","","","","S20","","","","","","","S21","","","","","","","S22","","","","","","","S23","","","","","","","S24","","","","","","","S25","","","","","","","S26","","","","","","","S27","","","","","","","S28","",{"$f":"IF(GV10=\"L\",\"S\" & WEEKNUM(GV6),\"\")","v":""},"","","","","S29","","","","","","","S30","","","","","","","S31","","","","","","","S32","","","","","","","S33","","","","","","","S34","","","","","","","S35","","","","","","","S36","","","","","","","S37","","",{"$f":"IF(JH10=\"L\",\"S\" & WEEKNUM(JH6),\"\")","v":""},"","","","S38","","","","","","","S39","","","","","","","S40","","","","","","","S41","","","","","","","S42","","","","","","","S43","","","","","","","S44","","","","","","","S45","","","","","","","S46","","","",{"$f":"IF(LT10=\"L\",\"S\" & WEEKNUM(LT6),\"\")","v":""},"","","S47","","","","","","","S48","","","","","","","S49","","","","","","","S50","","","","","","","S51","","","","","","","S52","","","","",""]
[null,null,"Listes des salariés",null,null,null,null,null,null,null,null,{"$f":"DAY(L6)","v":1},2,3,4,5,6,7,8,9,10,11,12,13,14,15,16,17,18,19,20,21,22,23,24,25,26,27,28,29,30,31,1,2,3,4,5,6,7,8,9,10,11,12,13,14,15,16,17,18,19,20,21,22,23,24,25,26,27,28,1,2,3,4,5,{"$f":"DAY(BX6)","v":6},7,8,9,10,11,12,13,14,15,16,17,18,19,20,21,22,23,24,25,26,27,28,29,30,31,1,2,3,4,5,6,7,8,9,10,11,12,13,14,15,16,17,18,19,20,21,22,23,24,25,26,27,28,29,30,1,2,3,4,5,6,7,8,{"$f":"DAY(EJ6)","v":9},10,11,12,13,14,15,16,17,18,19,20,21,22,23,24,25,26,27,28,29,30,31,1,2,3,4,5,6,7,8,9,10,11,12,13,14,15,16,17,18,19,20,21,22,23,24,25,26,27,28,29,30,1,2,3,4,5,6,7,8,9,10,11,{"$f":"DAY(GV6)","v":12},13,14,15,16,17,18,19,20,21,22,23,24,25,26,27,28,29,30,31,1,2,3,4,5,6,7,8,9,10,11,12,13,14,15,16,17,18,19,20,21,22,23,24,25,26,27,28,29,30,31,1,2,3,4,5,6,7,8,9,10,11,12,13,{"$f":"DAY(JH6)","v":14},15,16,17,18,19,20,21,22,23,24,25,26,27,28,29,30,1,2,3,4,5,6,7,8,9,10,11,12,13,14,15,16,17,18,19,20,21,22,23,24,25,26,27,28,29,30,31,1,2,3,4,5,6,7,8,9,10,11,12,13,14,15,16,{"$f":"DAY(LT6)","v":17},18,19,20,21,22,23,24,25,26,27,28,29,30,1,2,3,4,5,6,7,8,9,10,11,12,13,14,15,16,17,18,19,20,21,22,23,24,25,26,27,28,29,30,31,{"$f":"DAY(NM6)","v":1}]
["RTT","RTTI",null,null,"CP","RHN","RTT","RTTI","MA","AUT","JT",{"$f":"CHOOSE(WEEKDAY(L6),\"D\",\"L\",\"M\",\"Me\",\"J\",\"V\",\"S\")","v":"D"},"L","M","Me","J","V","S","D","L","M","Me","J","V","S","D","L","M","Me","J","V","S","D","L","M","Me","J","V","S","D","L","M","Me","J","V","S","D","L","M","Me","J","V","S","D","L","M","Me","J","V","S","D","L","M","Me","J","V","S","D","L","M","Me","J","V","S","D",{"$f":"CHOOSE(WEEKDAY(BX6),\"D\",\"L\",\"M\",\"Me\",\"J\",\"V\",\"S\")","v":"L"},"M","Me","J","V","S","D","L","M","Me","J","V","S","D","L","M","Me","J","V","S","D","L","M","Me","J","V","S","D","L","M","Me","J","V","S","D","L","M","Me","J","V","S","D","L","M","Me","J","V","S","D","L","M","Me","J","V","S","D","L","M","Me","J","V","S","D","L",{"$f":"CHOOSE(WEEKDAY(EJ6),\"D\",\"L\",\"M\",\"Me\",\"J\",\"V\",\"S\")","v":"M"},"Me","J","V","S","D","L","M","Me","J","V","S","D","L","M","Me","J","V","S","D","L","M","Me","J","V","S","D","L","M","Me","J","V","S","D","L","M","Me","J","V","S","D","L","M","Me","J","V","S","D","L","M","Me","J","V","S","D","L","M","Me","J","V","S","D","L","M",{"$f":"CHOOSE(WEEKDAY(GV6),\"D\",\"L\",\"M\",\"Me\",\"J\",\"V\",\"S\")","v":"Me"},"J","V","S","D","L","M","Me","J","V","S","D","L","M","Me","J","V","S","D","L","M","Me","J","V","S","D","L","M","Me","J","V","S","D","L","M","Me","J","V","S","D","L","M","Me","J","V","S","D","L","M","Me","J","V","S","D","L","M","Me","J","V","S","D","L","M","Me",{"$f":"CHOOSE(WEEKDAY(JH6),\"D\",\"L\",\"M\",\"Me\",\"J\",\"V\",\"S\")","v":"J"},"V","S","D","L","M","Me","J","V","S","D","L","M","Me","J","V","S","D","L","M","Me","J","V","S","D","L","M","Me","J","V","S","D","L","M","Me","J","V","S","D","L","M","Me","J","V","S","D","L","M","Me","J","V","S","D","L","M","Me","J","V","S","D","L","M","Me","J",{"$f":"CHOOSE(WEEKDAY(LT6),\"D\",\"L\",\"M\",\"Me\",\"J\",\"V\",\"S\")","v":"V"},"S","D","L","M","Me","J","V","S","D","L","M","Me","J","V","S","D","L","M","Me","J","V","S","D","L","M","Me","J","V","S","D","L","M","Me","J","V","S","D","L","M","Me","J","V","S","D",{"$f":"CHOOSE(WEEKDAY(NM6),\"D\",\"L\",\"M\",\"Me\",\"J\",\"V\",\"S\")","v":"L"}]
[{"$f":"IFERROR($G11/($G11+$H11),\"\")","v":""},{"$f":"IFERROR($H11/($G11+$H11),\"\")","v":""},"Alexandre","CP",{"$f":"COUNTIF($L11:$NL11,$E$10)","v":4},{"$f":"COUNTIF($L11:$NL11,$F$10)","v":4},{"$f":"COUNTIF($L11:$NL11,$G$10)","v":0},{"$f":"COUNTIF($L11:$NL11,$H$10)","v":0},{"$f":"COUNTIF($L11:$NL11,$I$10)","v":0},{"$f":"COUNTIF($L11:$NL11,$J$10)","v":0},{"$f":"NETWORKDAYS(DateDebut,Datefin,jourferie)-($E11+$F11+$G11+$H11+$I11+$J11)","v":243},null,"RHN","RHN","RHN","RHN",null,"CP","CP","CP","CP"]
["","","Aurelie","DQ",5,0,0,0,4,1,241,null,null,null,null,null,null,null,null,null,null,null,null,null,null,null,null,null,null,null,null,null,null,null,null,null,null,null,null,null,null,"AUT",null,null,null,null,null,null,null,null,null,"CP","CP","CP","CP","CP",null,null,null,null,null,null,null,null,null,null,null,null,null,null,null,null,null,null,"MA","MA","MA","MA"]
["","","Ayse ","OP",1,0,0,0,0,0,250,null,null,null,null,null,null,null,null,null,null,null,null,null,null,null,null,null,null,null,null,null,null,null,null,null,null,null,null,null,null,null,null,null,null,null,null,null,null,null,null,null,null,null,null,null,null,null,null,null,null,null,null,null,null,null,null,null,null,null,null,null,null,null,null,null,null,null,null,null,null,null,null,null,null,null,null,null,null,null,null,null,null,null,null,null,null,null,null,null,null,null,null,null,null,null,null,null,null,null,null,null,null,null,null,null,null,null,null,null,null,null,null,null,null,null,null,null,null,null,null,null,null,null,null,null,null,null,null,null,null,null,null,null,null,null,null,null,null,null,null,null,null,null,null,null,null,null,null,null,null,null,null,null,null,null,null,"CP"]
["","","Corinne ","DQ",5,1,0,0,0,0,245,null,null,null,null,null,null,null,null,null,null,null,null,null,null,null,null,null,null,null,null,null,null,null,"CP","CP","CP","CP","CP",null,null,null,null,null,null,null,null,null,null,null,null,"RHN"]
[0,1,"Djamel","FP",31,0,0,7,0,0,"RTTI","RTTI","RTTI","RTTI","RTTI","RTTI","RTTI","RTTI",null,null,null,null,null,null,null,null,null,null,null,null,null,null,null,null,null,null,null,null,null,null,null,null,null,null,null,null,null,null,null,null,null,null,null,null,null,null,null,null,null,null,null,null,null,null,null,null,null,null,null,null,null,null,null,null,null,null,null,null,null,null,null,null,null,null,null,null,null,null,null,null,null,null,null,null,null,null,null,null,null,null,null,null,null,null,null,null,null,null,null,null,null,null,null,null,null,null,null,null,null,null,null,null,null,null,null,null,null,null,null,null,null,null,null,null,null,null,null,null,null,null,null,null,null,null,null,null,null,null,null,null,null,null,null,null,null,null,null,null,null,null,null,null,null,null,null,null,null,null,null,null,null,null,null,null,null,null,null,null,null,null,null,null,null,null,null,null,null,null,null,null,null,null,null,null,null,null,null,null,null,null,null,null,null,null,null,null,null,null,null,null,null,null,null,null,null,null,null,null,null,null,null,null,null,null,null,null,null,null,null,null,null,null,null,null,null,null,null,null,null,null,null,null,null,null,null,null,null,null,null,null,null,null,null,null,null,null,null,null,null,null,null,null,null,null,null,null,null,null,null,null,null,null,null,null,null,null,null,null,null,null,null,null,null,null,null,null,null,null,null,null,null,null,null,null,null,null,null,null,null,null,null,null,null,null,null,null,null,null,null,null,null,null,null,null,null,null,null,null,null,null,null,null,null,null,null,null,null,null,null,null,null,null,null,null,null,null,null,null,null,null,null,null,null,null,null,"CP","CP","CP","CP","CP","CP","CP","CP","CP","CP","CP","CP","CP","CP","CP","CP","CP","CP","CP","CP","CP","CP","CP","CP","CP","CP","CP","CP","CP","CP","CP"]
["","","Georges","FF",0,0,0,0,0,0,251]
["","","gerard ","FF",0,0,0,0,0,0,251]
["","","Lise","CF",17,0,0,0,0,0,234,null,null,null,null,null,null,null,null,null,null,null,null,null,null,null,null,null,null,null,null,null,null,null,null,null,null,null,null,null,null,null,null,null,null,null,null,null,null,null,null,null,null,null,null,null,null,null,null,null,null,null,null,null,null,null,null,null,null,null,null,null,null,null,null,null,null,null,null,null,null,null,null,null,null,null,null,null,null,null,null,null,null,null,null,null,null,null,null,null,null,null,null,null,null,null,null,null,null,null,null,null,null,null,null,null,null,null,null,null,null,null,null,null,null,null,null,null,null,null,null,null,null,null,null,null,null,null,null,null,null,null,null,null,null,null,null,null,null,null,null,null,null,null,null,null,null,null,null,null,null,null,null,null,null,null,null,null,null,null,null,null,null,null,null,null,null,null,null,null,null,null,null,null,null,null,null,null,null,null,null,null,null,null,"CP","CP","CP","CP","CP",null,null,"CP","CP","CP","CP",null,null,null,"CP","CP","CP","CP","CP","CP","CP","CP"]
["","","Mohamed","ROB",0,0,0,0,0,0,251]
["","","Sandrine","DQ",0,0,0,0,8,0,243,null,null,null,null,null,null,null,null,null,null,null,null,null,null,null,null,null,null,null,null,null,null,null,null,null,null,null,null,null,null,null,"MA","MA","MA","MA","MA","MA","MA","MA"]
["","","Soraya ","OP",5,0,0,0,0,0,246,null,null,null,null,null,null,null,null,null,null,null,"CP","CP","CP","CP","CP"]
["","",null,null,0,0,0,0,0,0,251]
["","",null,null,{"$f":"COUNTIF($L23:$NL23,$E$10)","v":0},{"$f":"COUNTIF($L23:$NL23,$F$10)","v":0},{"$f":"COUNTIF($L23:$NL23,$G$10)","v":0},{"$f":"COUNTIF($L23:$NL23,$H$10)","v":0},{"$f":"COUNTIF($L23:$NL23,$I$10)","v":0},{"$f":"COUNTIF($L23:$NL23,$J$10)","v":0},{"$f":"NETWORKDAYS(DateDebut,Datefin,jourferie)-($E23+$F23+$G23+$H23+$I23+$J23)","v":251}]
["","",null,null,0,0,0,0,0,0,251]
["","",null,null,0,0,0,0,0,0,251]
["","",null,null,0,0,0,0,0,0,251]
["","",null,null,0,0,0,0,0,0,251]
["","",null,null,0,0,0,0,0,0,251]
["","",null,null,0,0,0,0,0,0,251]
["","",null,null,0,0,0,0,0,0,251]
["","",null,null,0,0,0,0,0,0,251]
["","",null,null,0,0,0,0,0,0,251]
["","",null,null,0,0,0,0,0,0,251]
["","",null,null,0,0,0,0,0,0,251]
["","",null,null,0,0,0,0,0,0,251]
["","",null,null,0,0,0,0,0,0,251]
["","",null,null,0,0,0,0,0,0,251]
["","",null,null,0,0,0,0,0,0,251]
["","",null,null,0,0,0,0,0,0,251]
["","",null,null,0,0,0,0,0,0,251]
["","",null,null,0,0,0,0,0,0,251]
["","",null,null,0,0,0,0,0,0,251]
[{"$f":"IFERROR($G43/($G43+$H43),\"\")","v":""},{"$f":"IFERROR($H43/($G43+$H43),\"\")","v":""},null,null,0,0,0,0,0,0,251]
["","",null,null,0,0,0,0,0,0,{"$f":"NETWORKDAYS(DateDebut,Datefin,jourferie)-($E44+$F44+$G44+$H44+$I44+$J44)","v":251}]
["","",null,null,0,0,0,0,0,0,251]
["","",null,null,0,0,0,0,0,0,251]
["","",null,null,0,0,0,0,0,0,251]
["","",null,null,0,0,0,0,0,0,251]
["","",null,null,0,0,0,0,0,0,251]
["","",null,null,0,0,0,0,0,0,251]
["","",null,null,0,0,0,0,0,0,251]
["","",null,null,0,0,0,0,0,0,251]
["","",null,null,0,0,0,0,0,0,251]
["","",null,null,0,0,0,0,0,0,251]
["","",null,null,0,0,0,0,0,0,251]
["","",null,null,0,0,0,0,0,0,251]
["","",null,null,0,0,0,0,0,0,251]
["","",null,null,0,0,0,0,0,0,251]
["","",null,null,0,0,0,0,0,0,251]
["","",null,null,0,0,0,0,0,0,251]
["","",null,null,0,0,0,0,0,0,251]
["","",null,null,0,0,0,0,0,0,251]
["","",null,null,0,0,0,0,0,0,251]
["","",null,null,0,0,0,0,0,0,251]
["","",null,null,0,0,0,0,0,0,251]
["","",null,null,0,0,0,0,0,0,251]
["","",null,null,0,0,0,0,0,0,251]
["","",null,null,0,0,0,0,0,0,251]
["","",null,null,0,0,0,0,0,0,251]
["","",null,null,0,0,0,0,0,0,251]
["","",null,null,0,0,0,0,0,0,251]
["","",null,null,0,0,0,0,0,0,251]
["","",null,null,0,0,0,0,0,0,251]
["","",null,null,0,0,0,0,0,0,251]
[{"$f":"IFERROR($G75/($G75+$H75),\"\")","v":""},{"$f":"IFERROR($H75/($G75+$H75),\"\")","v":""},null,null,0,0,0,0,0,0,251]
["","",null,null,{"$f":"COUNTIF($L76:$NL76,$E$10)","v":0},{"$f":"COUNTIF($L76:$NL76,$F$10)","v":0},{"$f":"COUNTIF($L76:$NL76,$G$10)","v":0},{"$f":"COUNTIF($L76:$NL76,$H$10)","v":0},{"$f":"COUNTIF($L76:$NL76,$I$10)","v":0},{"$f":"COUNTIF($L76:$NL76,$J$10)","v":0},{"$f":"NETWORKDAYS(DateDebut,Datefin,jourferie)-($E76+$F76+$G76+$H76+$I76+$J76)","v":251}]
["","",null,null,0,0,0,0,0,0,251]
["","",null,null,0,0,0,0,0,0,251]
["","",null,null,0,0,0,0,0,0,251]
["","",null,null,0,0,0,0,0,0,251]
["","",null,null,0,0,0,0,0,0,251]
["","",null,null,0,0,0,0,0,0,251]
["","",null,null,0,0,0,0,0,0,251]
["","",null,null,0,0,0,0,0,0,251]
["","",null,null,0,0,0,0,0,0,251]
["","",null,null,0,0,0,0,0,0,251]
["","",null,null,0,0,0,0,0,0,251]
["","",null,null,0,0,0,0,0,0,251]
["","",null,null,0,0,0,0,0,0,251]
["","",null,null,0,0,0,0,0,0,251]
["","",null,null,0,0,0,0,0,0,251]
["","",null,null,0,0,0,0,0,0,251]
["","",null,null,0,0,0,0,0,0,251]
["","",null,null,0,0,0,0,0,0,251]
["","",null,null,0,0,0,0,0,0,251]
["","",null,null,0,0,0,0,0,0,251]
["","",null,null,0,0,0,0,0,0,251]
["","",null,null,0,0,0,0,0,0,251]
["","",null,null,0,0,0,0,0,0,251]
["","",null,null,0,0,0,0,0,0,251]
["","",null,null,0,0,0,0,0,0,251]
["","",null,null,0,0,0,0,0,0,251]
["","",null,null,0,0,0,0,0,0,251]
["","",null,null,0,0,0,0,0,0,251]
["","",null,null,0,0,0,0,0,0,251]
["","",null,null,0,0,0,0,0,0,251]
[{"$f":"IFERROR($G107/($G107+$H107),\"\")","v":""},{"$f":"IFERROR($H107/($G107+$H107),\"\")","v":""},null,null,0,0,0,0,0,0,251]
["","",null,null,0,0,0,0,0,0,{"$f":"NETWORKDAYS(DateDebut,Datefin,jourferie)-($E108+$F108+$G108+$H108+$I108+$J108)","v":251}]
["","",null,null,0,0,0,0,0,0,251]
["","",null,null,0,0,0,0,0,0,251]
["","",null,null,0,0,0,0,0,0,251]
["","",null,null,0,0,0,0,0,0,251]
["","",null,null,0,0,0,0,0,0,251]
["","",null,null,0,0,0,0,0,0,251]
["","",null,null,0,0,0,0,0,0,251]
["","",null,null,0,0,0,0,0,0,251]
["","",null,null,0,0,0,0,0,0,251]
["","",null,null,0,0,0,0,0,0,251]
["","",null,null,0,0,0,0,0,0,251]
["","",null,null,0,0,0,0,0,0,251]
["","",null,null,0,0,0,0,0,0,251]
["","",null,null,0,0,0,0,0,0,251]
["","",null,null,0,0,0,0,0,0,251]
["","",null,null,0,0,0,0,0,0,251]
["","",null,null,0,0,0,0,0,0,251]
["","",null,null,0,0,0,0,0,0,251]
["","",null,null,0,0,0,0,0,0,251]
["","",null,null,0,0,0,0,0,0,251]
["","",null,null,0,0,0,0,0,0,251]
["","",null,null,0,0,0,0,0,0,251]
["","",null,null,0,0,0,0,0,0,251]
["","",null,null,0,0,0,0,0,0,251]
["","",null,null,0,0,0,0,0,0,251]
["","",null,null,0,0,0,0,0,0,251]
["","",null,null,0,0,0,0,0,0,251]
["","",null,null,0,0,0,0,0,0,251]
["","",null,null,0,0,0,0,0,0,251]
["","",null,null,0,0,0,0,0,0,251]
[{"$f":"IFERROR($G139/($G139+$H139),\"\")","v":""},{"$f":"IFERROR($H139/($G139+$H139),\"\")","v":""},null,null,0,0,0,0,0,0,251]
["","",null,null,{"$f":"COUNTIF($L140:$NL140,$E$10)","v":0},{"$f":"COUNTIF($L140:$NL140,$F$10)","v":0},{"$f":"COUNTIF($L140:$NL140,$G$10)","v":0},{"$f":"COUNTIF($L140:$NL140,$H$10)","v":0},{"$f":"COUNTIF($L140:$NL140,$I$10)","v":0},{"$f":"COUNTIF($L140:$NL140,$J$10)","v":0},{"$f":"NETWORKDAYS(DateDebut,Datefin,jourferie)-($E140+$F140+$G140+$H140+$I140+$J140)","v":251}]
["","",null,null,0,0,0,0,0,0,251]
["","",null,null,0,0,0,0,0,0,251]
["","",null,null,0,0,0,0,0,0,251]
["","",null,null,0,0,0,0,0,0,251]
["","",null,null,0,0,0,0,0,0,251]
["","",null,null,0,0,0,0,0,0,251]
["","",null,null,0,0,0,0,0,0,251]
["","",null,null,0,0,0,0,0,0,251]
["","",null,null,0,0,0,0,0,0,251]
["","",null,null,0,0,0,0,0,0,251]
["","",null,null,0,0,0,0,0,0,251]
["","",null,null,0,0,0,0,0,0,251]

{"sheet":"Jours Férié","index":2,"n_rows":15,"n_cols":3,"rows_kept":15,"cut":false,"hidden":false,"merged":[[0,1,1,1],[14,2,14,3],[0,2,1,3],[2,2,2,3],[3,2,3,3],[4,2,4,3],[5,2,5,3],[6,2,6,3],[7,2,7,3],[8,2,8,3],[9,2,9,3],[10,2,10,3],[11,2,11,3],[12,2,12,3],[13,2,13,3]]}
[null,{"$f":"TEXT(Planning!E2,\"AAAA\")","v":"2017"},{"$f":"annee+1","v":2018}]
[]
["Jour de l'an",{"$f":"DATE(annee,1,1)","v":"2017-01-01"},{"$f":"DATE(annee+1,1,1)","v":"2018-01-01"}]
["Pâques",{"$f":"ROUND(DATE(annee,4,MOD(234-11*MOD(annee,19),30))/7,0)*7-6","v":"2017-04-16"},{"$f":"ROUND(DATE(annee+1,4,MOD(234-11*MOD(annee+1,19),30))/7,0)*7-6","v":"2018-04-01"}]
["Lundi de Pâques",{"$f":"Paques+1","v":"2017-04-17"},{"$f":"(ROUND(DATE(annee+1,4,MOD(234-11*MOD(annee+1,19),30))/7,0)*7-6)+1","v":"2018-04-02"}]
["Fête du Travail",{"$f":"DATE(annee,5,1)","v":"2017-05-01"},{"$f":"DATE(annee+1,5,1)","v":"2018-05-01"}]
["1945-05-08",{"$f":"DATE(annee,5,8)","v":"2017-05-08"},{"$f":"DATE(annee+1,5,8)","v":"2018-05-08"}]
["Jeudi de l'Ascension",{"$f":"Paques+39","v":"2017-05-25"},{"$f":"Paques1+39","v":"2018-05-10"}]
["Pentecôte",{"$f":"Paques+49","v":"2017-06-04"},{"$f":"Paques1+49","v":"2018-05-20"}]
["Lundi de Pentecôte",{"$f":"Paques+50","v":"2017-06-05"},{"$f":"Paques1+50","v":"2018-05-21"}]
["Fête Nationale",{"$f":"DATE(annee,7,14)","v":"2017-07-14"},{"$f":"DATE(annee+1,7,14)","v":"2018-07-14"}]
["Assomption",{"$f":"DATE(annee,8,15)","v":"2017-08-15"},{"$f":"DATE(annee+1,8,15)","v":"2018-08-15"}]
["La Toussaint",{"$f":"DATE(annee,11,1)","v":"2017-11-01"},{"$f":"DATE(annee+1,11,1)","v":"2018-11-01"}]
["Armistice",{"$f":"DATE(annee,11,11)","v":"2017-11-11"},{"$f":"DATE(annee+1,11,11)","v":"2018-11-11"}]
["Noël",{"$f":"DATE(annee,12,25)","v":"2017-12-25"},{"$f":"DATE(annee+1,12,25)","v":"2018-12-25"}]

{"sheet":"Mode d'emploi","index":3,"n_rows":7,"n_cols":2,"rows_kept":7,"cut":false,"hidden":false,"merged":[]}
["Mode d'emploi"]
[1,"Compléter l'onglet \"Entrée\" au fur et à mesure des absences\nRemarque : je pense qu'il serait utile de ne pas indiquer de date lorsque l'absence se passe un WE sinon on va fausser les calculs de nombre de jours d'absences puisque les WE ne comptent en principe pas.  Cela veut dire que si l'absence se passe à cheval sur un ou plusieurs WE, il faudra faire autant de lignes dans l'onglet \"Entrée\" que de WE !! Voir exemple pour les CP de Lise.  Autre solution serait d'adapter les calculs pour qu'ils ne comptent pas les WE et Jours fériés (possible mais pas simple).  Dis moi ce que tu en pe,ses et si tu as besoin d'aide."]
[2,"Appuyer sur le bouton Macro \"MAJ DU PLANNING\" pour lancer le programme de mise à jour de l'onglet \"Planning\".\nRemarque : il aurait été possible de provoquer la MAJ automatiquement dès qu'une modification de l'onglet \"Entrée\" aurait été faite mais avec l'inconvénient que si l'on a plusieurs entrées à faire, cela aurait perturber l'opérateur de devoir être chaque fois interrompu pour la MAJ.  C'est pourquoi j'ai opté pour un bouton manuel à activer pour lancer la MAJ"]
[3,"J'ai masqué la ligne 6 de l'onglet \"Planning\" qui n'avait pas d'utilité pour l'opérateur d'autant plus que, pour des raisons techniques, j'ai du la formaté en \"Standard\" càd que les dates se mettent sous la forme de numéro (seule façon de pouvoir faire un MATCH pour trouver la colonne à mettre à jour)"]
[4,"Jai, par contre, ajouté une ligne7  pour indiquer le mois (chaque premier du mois)"]
[5,"De même j'ai ajouté une colonne dans l'onglet \"Planning\" pour traiter les années bissextiles.\nRemarque : on pourrait, à l'aide de la mise en forme conditionnelle, rendre cette dernière colonne inutilisable pour les années \"normales\" en mettant en noir par exemple si année à trater diviser par 4 donne un reste.  Toutefois cela ne m'a pas semblé utile car voir apparaître le premier jour de l'année suivante n'est pas perturbante."]
[6,"J'ai nommé la liste des noms à partir de l'onglet \"Planning\" afin de pouvoir créer une listre de choix dans l'onglet \"Entrée\""]