{"text_format":"1","workbook":"xlsx","n_sheets":3,"sheets":["Jaugeage","BDDG","Base"],"not_rendered":{"charts":0,"images":0,"macros":1,"external_links":0,"defined_names":11,"comments":0,"pivot_tables":0},"unopened":[],"bounds":{"document_bytes":16777216,"sheet_cells":100000,"rows_first":2000,"rows_last":500,"rows_between":2000,"halvings":0,"cell_chars":16384,"cell_head_chars":4096},"cells_cut":0,"cells_raw":0,"read":"whole","date_system":"1900"}

{"sheet":"Jaugeage","index":0,"n_rows":40,"n_cols":32,"rows_kept":40,"cut":false,"hidden":false,"merged":[]}
["Date","Météo","Code","peche","pomme","prune","citron","poire","kiwi","truc1","Vol 1","Temps 1","M3 /J 1","truc2","Vol 2","Temps 2","M3 /J 2","truc3","Vol 3","Temps 3","M3 /J 3","truc4","Vol 4","Temps 4","M3 /J 4","Seuil alerte","Total général M3 /jrs","Mois","Année","Différence en M3/J entre 2 saisies ","Observations","5,3 Sec"]
["2013-10-15",null,856,{"$f":"IF(ISNA(VLOOKUP(C2,BDDG!$C$2:$H$47,2,FALSE)),\"\",VLOOKUP(C2,BDDG!$C$2:$H$47,2,FALSE))","v":0},{"$f":"IF(ISNA(VLOOKUP(C2,BDDG!$C$3:$P$49,3,FALSE)),\"\",VLOOKUP(C2,BDDG!$C$3:$P$49,3,FALSE))","v":"pates"},{"$f":"IF(ISNA(VLOOKUP(C2,BDDG!$C$3:$P$49,4,FALSE)),\"\",VLOOKUP(C2,BDDG!$C$3:$P$49,4,FALSE))","v":106},{"$f":"IF(ISNA(VLOOKUP(C2,BDDG!$C$2:$H$47,5,FALSE)),\"\",VLOOKUP(C2,BDDG!$C$2:$H$47,5,FALSE))","v":"noisettes"},{"$f":"IF(ISNA(VLOOKUP(C2,BDDG!$C$2:$H$47,6,FALSE)),\"\",VLOOKUP(C2,BDDG!$C$2:$H$47,6,FALSE))","v":"iris"},{"$f":"IF(ISERROR(VLOOKUP(C2,BDDG!$C$2:$I$47,7,FALSE)),\"\",VLOOKUP(C2,BDDG!$C$2:$I$47,7,FALSE))","v":2},{"$f":"IF(ISERROR(VLOOKUP(C2,BDDG!$C$2:$W$6,8,FALSE)),\"\",VLOOKUP(C2,BDDG!$C$2:$W$6,8,FALSE))","v":"iris1"},10,57.5,{"$f":" IF(ISERROR(K2/L2*86.4),\"xxxxxxxxxx\",K2/L2*86.4)","v":15.026086956521739},{"$f":"IF(ISERROR(VLOOKUP(C2,BDDG!$C$2:$W$6,11,FALSE)),\"\",VLOOKUP(C2,BDDG!$C$2:$W$6,11,FALSE))","v":"iris2"},10,7.5,{"$f":" IF(ISERROR(O2/P2*86.4),\"xxxxxxxxxx\",O2/P2*86.4)","v":115.2},{"$f":"IF(ISERROR(VLOOKUP(C2,BDDG!$C$2:$W$6,14,FALSE)),\"\",VLOOKUP(C2,BDDG!$C$2:$W$6,14,FALSE))","v":"xxxxxxxxxxxxxxxxxxxxxxxxxxxxxxxxxxxx"},"xxxxxxxxxx",{"$f":" IF(ISERROR(R2/S2*86.4),\"xxxxxxxxxx\",R2/S2*86.4)","v":"xxxxxxxxxx"},{"$f":" IF(ISERROR(S2/T2*86.4),\"xxxxxxxxxx\",S2/T2*86.4)","v":"xxxxxxxxxx"},{"$f":"IF(ISERROR(VLOOKUP(C2,BDDG!$C$2:$W$6,17,FALSE)),\"\",VLOOKUP(C2,BDDG!$C$2:$W$6,17,FALSE))","v":"xxxxxxxxxxxxxxxxxxxxxxxx"},"xxxxxxxxxx",{"$f":" IF(ISERROR(V2/W2*86.4),\"xxxxxxxxxx\",V2/W2*86.4)","v":"xxxxxxxxxx"},{"$f":" IF(ISERROR(W2/X2*86.4),\"xxxxxxxxxx\",W2/X2*86.4)","v":"xxxxxxxxxx"},{"$f":"IF(ISERROR(VLOOKUP(C2,BDDG!$C$2:$W$6,20,FALSE)),\"\",VLOOKUP(C2,BDDG!$C$2:$W$6,20,FALSE))","v":"xxxxxxxxxx"},{"$f":"IF(ISERROR(SUM(M2,Q2,U2)),\"\",SUM(M2,Q2,U2))","v":130.22608695652175},{"$f":"MONTH(A:A)","v":10},{"$f":"YEAR(A:A)","v":2013},{"$f":"IFERROR((INDEX($AA$2:AA2,MATCH(H2&MAX(IF($H$1:H1=H2,$A$1:A1)),$H$2:H2&$A$2:A2,0))-AA2)*-1,\"\")","v":""},{"$f":"IF(ISERROR(VLOOKUP(C2,BDDG!$C$2:$W$6,21,FALSE)),\"\",VLOOKUP(C2,BDDG!$C$2:$W$6,21,FALSE))","v":0}]
["2013-12-20",null,823,{"$f":"IF(ISNA(VLOOKUP(C3,BDDG!$C$2:$H$47,2,FALSE)),\"\",VLOOKUP(C3,BDDG!$C$2:$H$47,2,FALSE))","v":0},{"$f":"IF(ISNA(VLOOKUP(C3,BDDG!$C$3:$P$49,3,FALSE)),\"\",VLOOKUP(C3,BDDG!$C$3:$P$49,3,FALSE))","v":"frites"},{"$f":"IF(ISNA(VLOOKUP(C3,BDDG!$C$3:$P$49,4,FALSE)),\"\",VLOOKUP(C3,BDDG!$C$3:$P$49,4,FALSE))","v":104},{"$f":"IF(ISNA(VLOOKUP(C3,BDDG!$C$2:$H$47,5,FALSE)),\"\",VLOOKUP(C3,BDDG!$C$2:$H$47,5,FALSE))","v":"noix"},{"$f":"IF(ISNA(VLOOKUP(C3,BDDG!$C$2:$H$47,6,FALSE)),\"\",VLOOKUP(C3,BDDG!$C$2:$H$47,6,FALSE))","v":"rose"},{"$f":"IF(ISERROR(VLOOKUP(C3,BDDG!$C$2:$I$47,7,FALSE)),\"\",VLOOKUP(C3,BDDG!$C$2:$I$47,7,FALSE))","v":1},{"$f":"IF(ISERROR(VLOOKUP(C3,BDDG!$C$2:$W$6,8,FALSE)),\"\",VLOOKUP(C3,BDDG!$C$2:$W$6,8,FALSE))","v":"rose1"},2,13,{"$f":" IF(ISERROR(K3/L3*86.4),\"xxxxxxxxxx\",K3/L3*86.4)","v":13.292307692307693},{"$f":"IF(ISERROR(VLOOKUP(C3,BDDG!$C$2:$W$6,11,FALSE)),\"\",VLOOKUP(C3,BDDG!$C$2:$W$6,11,FALSE))","v":"xxxxxxxxxxxxxxxxxxxxxxxxxxxxxxxxxxxxxxxxxxxxxxx"},"xxxxxxxxxx",{"$f":" IF(ISERROR(N3/O3*86.4),\"xxxxxxxxxx\",N3/O3*86.4)","v":"xxxxxxxxxx"},{"$f":" IF(ISERROR(O3/P3*86.4),\"xxxxxxxxxx\",O3/P3*86.4)","v":"xxxxxxxxxx"},{"$f":"IF(ISERROR(VLOOKUP(C3,BDDG!$C$2:$W$6,14,FALSE)),\"\",VLOOKUP(C3,BDDG!$C$2:$W$6,14,FALSE))","v":"xxxxxxxxxxxxxxxxxxxxxxxxxxxxxxxxxxxx"},"xxxxxxxxxx",{"$f":" IF(ISERROR(R3/S3*86.4),\"xxxxxxxxxx\",R3/S3*86.4)","v":"xxxxxxxxxx"},{"$f":" IF(ISERROR(S3/T3*86.4),\"xxxxxxxxxx\",S3/T3*86.4)","v":"xxxxxxxxxx"},{"$f":"IF(ISERROR(VLOOKUP(C3,BDDG!$C$2:$W$6,17,FALSE)),\"\",VLOOKUP(C3,BDDG!$C$2:$W$6,17,FALSE))","v":"xxxxxxxxxxxxxxxxxxxxxxxx"},"xxxxxxxxxx",{"$f":" IF(ISERROR(V3/W3*86.4),\"xxxxxxxxxx\",V3/W3*86.4)","v":"xxxxxxxxxx"},{"$f":" IF(ISERROR(W3/X3*86.4),\"xxxxxxxxxx\",W3/X3*86.4)","v":"xxxxxxxxxx"},{"$f":"IF(ISERROR(VLOOKUP(C3,BDDG!$C$2:$W$6,20,FALSE)),\"\",VLOOKUP(C3,BDDG!$C$2:$W$6,20,FALSE))","v":3},{"$f":"IF(ISERROR(SUM(M3,Q3,U3)),\"\",SUM(M3,Q3,U3))","v":13.292307692307693},{"$f":"MONTH(A:A)","v":12},{"$f":"YEAR(A:A)","v":2013},{"$f":"IFERROR((INDEX($AA$2:AA3,MATCH(H3&MAX(IF($H$1:H2=H3,$A$1:A2)),$H$2:H3&$A$2:A3,0))-AA3)*-1,\"\")","v":""},{"$f":"IF(ISERROR(VLOOKUP(C3,BDDG!$C$2:$W$6,21,FALSE)),\"\",VLOOKUP(C3,BDDG!$C$2:$W$6,21,FALSE))","v":0}]
["2014-03-12",null,823,{"$f":"IF(ISNA(VLOOKUP(C4,BDDG!$C$2:$H$47,2,FALSE)),\"\",VLOOKUP(C4,BDDG!$C$2:$H$47,2,FALSE))","v":0},{"$f":"IF(ISNA(VLOOKUP(C4,BDDG!$C$3:$P$49,3,FALSE)),\"\",VLOOKUP(C4,BDDG!$C$3:$P$49,3,FALSE))","v":"frites"},{"$f":"IF(ISNA(VLOOKUP(C4,BDDG!$C$3:$P$49,4,FALSE)),\"\",VLOOKUP(C4,BDDG!$C$3:$P$49,4,FALSE))","v":104},{"$f":"IF(ISNA(VLOOKUP(C4,BDDG!$C$2:$H$47,5,FALSE)),\"\",VLOOKUP(C4,BDDG!$C$2:$H$47,5,FALSE))","v":"noix"},{"$f":"IF(ISNA(VLOOKUP(C4,BDDG!$C$2:$H$47,6,FALSE)),\"\",VLOOKUP(C4,BDDG!$C$2:$H$47,6,FALSE))","v":"rose"},{"$f":"IF(ISERROR(VLOOKUP(C4,BDDG!$C$2:$I$47,7,FALSE)),\"\",VLOOKUP(C4,BDDG!$C$2:$I$47,7,FALSE))","v":1},{"$f":"IF(ISERROR(VLOOKUP(C4,BDDG!$C$2:$W$6,8,FALSE)),\"\",VLOOKUP(C4,BDDG!$C$2:$W$6,8,FALSE))","v":"rose1"},10,11,{"$f":" IF(ISERROR(K4/L4*86.4),\"xxxxxxxxxx\",K4/L4*86.4)","v":78.545454545454547},{"$f":"IF(ISERROR(VLOOKUP(C4,BDDG!$C$2:$W$6,11,FALSE)),\"\",VLOOKUP(C4,BDDG!$C$2:$W$6,11,FALSE))","v":"xxxxxxxxxxxxxxxxxxxxxxxxxxxxxxxxxxxxxxxxxxxxxxx"},"xxxxxxxxxx",{"$f":" IF(ISERROR(N4/O4*86.4),\"xxxxxxxxxx\",N4/O4*86.4)","v":"xxxxxxxxxx"},{"$f":" IF(ISERROR(O4/P4*86.4),\"xxxxxxxxxx\",O4/P4*86.4)","v":"xxxxxxxxxx"},{"$f":"IF(ISERROR(VLOOKUP(C4,BDDG!$C$2:$W$6,14,FALSE)),\"\",VLOOKUP(C4,BDDG!$C$2:$W$6,14,FALSE))","v":"xxxxxxxxxxxxxxxxxxxxxxxxxxxxxxxxxxxx"},"xxxxxxxxxx",{"$f":" IF(ISERROR(R4/S4*86.4),\"xxxxxxxxxx\",R4/S4*86.4)","v":"xxxxxxxxxx"},{"$f":" IF(ISERROR(S4/T4*86.4),\"xxxxxxxxxx\",S4/T4*86.4)","v":"xxxxxxxxxx"},{"$f":"IF(ISERROR(VLOOKUP(C4,BDDG!$C$2:$W$6,17,FALSE)),\"\",VLOOKUP(C4,BDDG!$C$2:$W$6,17,FALSE))","v":"xxxxxxxxxxxxxxxxxxxxxxxx"},"xxxxxxxxxx",{"$f":" IF(ISERROR(V4/W4*86.4),\"xxxxxxxxxx\",V4/W4*86.4)","v":"xxxxxxxxxx"},{"$f":" IF(ISERROR(W4/X4*86.4),\"xxxxxxxxxx\",W4/X4*86.4)","v":"xxxxxxxxxx"},{"$f":"IF(ISERROR(VLOOKUP(C4,BDDG!$C$2:$W$6,20,FALSE)),\"\",VLOOKUP(C4,BDDG!$C$2:$W$6,20,FALSE))","v":3},{"$f":"IF(ISERROR(SUM(M4,Q4,U4)),\"\",SUM(M4,Q4,U4))","v":78.545454545454547},{"$f":"MONTH(A:A)","v":3},{"$f":"YEAR(A:A)","v":2014},{"$f":"IFERROR((INDEX($AA$2:AA4,MATCH(H4&MAX(IF($H$1:H3=H4,$A$1:A3)),$H$2:H4&$A$2:A4,0))-AA4)*-1,\"\")","v":65.253146853146859},{"$f":"IF(ISERROR(VLOOKUP(C4,BDDG!$C$2:$W$6,21,FALSE)),\"\",VLOOKUP(C4,BDDG!$C$2:$W$6,21,FALSE))","v":0}]
["2014-04-10",null,856,{"$f":"IF(ISNA(VLOOKUP(C5,BDDG!$C$2:$H$47,2,FALSE)),\"\",VLOOKUP(C5,BDDG!$C$2:$H$47,2,FALSE))","v":0},{"$f":"IF(ISNA(VLOOKUP(C5,BDDG!$C$3:$P$49,3,FALSE)),\"\",VLOOKUP(C5,BDDG!$C$3:$P$49,3,FALSE))","v":"pates"},{"$f":"IF(ISNA(VLOOKUP(C5,BDDG!$C$3:$P$49,4,FALSE)),\"\",VLOOKUP(C5,BDDG!$C$3:$P$49,4,FALSE))","v":106},{"$f":"IF(ISNA(VLOOKUP(C5,BDDG!$C$2:$H$47,5,FALSE)),\"\",VLOOKUP(C5,BDDG!$C$2:$H$47,5,FALSE))","v":"noisettes"},{"$f":"IF(ISNA(VLOOKUP(C5,BDDG!$C$2:$H$47,6,FALSE)),\"\",VLOOKUP(C5,BDDG!$C$2:$H$47,6,FALSE))","v":"iris"},{"$f":"IF(ISERROR(VLOOKUP(C5,BDDG!$C$2:$I$47,7,FALSE)),\"\",VLOOKUP(C5,BDDG!$C$2:$I$47,7,FALSE))","v":2},{"$f":"IF(ISERROR(VLOOKUP(C5,BDDG!$C$2:$W$6,8,FALSE)),\"\",VLOOKUP(C5,BDDG!$C$2:$W$6,8,FALSE))","v":"iris1"},10,28,{"$f":" IF(ISERROR(K5/L5*86.4),\"xxxxxxxxxx\",K5/L5*86.4)","v":30.857142857142861},{"$f":"IF(ISERROR(VLOOKUP(C5,BDDG!$C$2:$W$6,11,FALSE)),\"\",VLOOKUP(C5,BDDG!$C$2:$W$6,11,FALSE))","v":"iris2"},10,2,{"$f":" IF(ISERROR(O5/P5*86.4),\"xxxxxxxxxx\",O5/P5*86.4)","v":432},{"$f":"IF(ISERROR(VLOOKUP(C5,BDDG!$C$2:$W$6,14,FALSE)),\"\",VLOOKUP(C5,BDDG!$C$2:$W$6,14,FALSE))","v":"xxxxxxxxxxxxxxxxxxxxxxxxxxxxxxxxxxxx"},"xxxxxxxxxx",{"$f":" IF(ISERROR(R5/S5*86.4),\"xxxxxxxxxx\",R5/S5*86.4)","v":"xxxxxxxxxx"},{"$f":" IF(ISERROR(S5/T5*86.4),\"xxxxxxxxxx\",S5/T5*86.4)","v":"xxxxxxxxxx"},{"$f":"IF(ISERROR(VLOOKUP(C5,BDDG!$C$2:$W$6,17,FALSE)),\"\",VLOOKUP(C5,BDDG!$C$2:$W$6,17,FALSE))","v":"xxxxxxxxxxxxxxxxxxxxxxxx"},"xxxxxxxxxx",{"$f":" IF(ISERROR(V5/W5*86.4),\"xxxxxxxxxx\",V5/W5*86.4)","v":"xxxxxxxxxx"},{"$f":" IF(ISERROR(W5/X5*86.4),\"xxxxxxxxxx\",W5/X5*86.4)","v":"xxxxxxxxxx"},{"$f":"IF(ISERROR(VLOOKUP(C5,BDDG!$C$2:$W$6,20,FALSE)),\"\",VLOOKUP(C5,BDDG!$C$2:$W$6,20,FALSE))","v":"xxxxxxxxxx"},{"$f":"IF(ISERROR(SUM(M5,Q5,U5)),\"\",SUM(M5,Q5,U5))","v":462.85714285714289},{"$f":"MONTH(A:A)","v":4},{"$f":"YEAR(A:A)","v":2014},{"$f":"IFERROR((INDEX($AA$2:AA5,MATCH(H5&MAX(IF($H$1:H4=H5,$A$1:A4)),$H$2:H5&$A$2:A5,0))-AA5)*-1,\"\")","v":332.63105590062116},{"$f":"IF(ISERROR(VLOOKUP(C5,BDDG!$C$2:$W$6,21,FALSE)),\"\",VLOOKUP(C5,BDDG!$C$2:$W$6,21,FALSE))","v":0}]
["2014-06-03",null,823,{"$f":"IF(ISNA(VLOOKUP(C6,BDDG!$C$2:$H$47,2,FALSE)),\"\",VLOOKUP(C6,BDDG!$C$2:$H$47,2,FALSE))","v":0},{"$f":"IF(ISNA(VLOOKUP(C6,BDDG!$C$3:$P$49,3,FALSE)),\"\",VLOOKUP(C6,BDDG!$C$3:$P$49,3,FALSE))","v":"frites"},{"$f":"IF(ISNA(VLOOKUP(C6,BDDG!$C$3:$P$49,4,FALSE)),\"\",VLOOKUP(C6,BDDG!$C$3:$P$49,4,FALSE))","v":104},{"$f":"IF(ISNA(VLOOKUP(C6,BDDG!$C$2:$H$47,5,FALSE)),\"\",VLOOKUP(C6,BDDG!$C$2:$H$47,5,FALSE))","v":"noix"},{"$f":"IF(ISNA(VLOOKUP(C6,BDDG!$C$2:$H$47,6,FALSE)),\"\",VLOOKUP(C6,BDDG!$C$2:$H$47,6,FALSE))","v":"rose"},{"$f":"IF(ISERROR(VLOOKUP(C6,BDDG!$C$2:$I$47,7,FALSE)),\"\",VLOOKUP(C6,BDDG!$C$2:$I$47,7,FALSE))","v":1},{"$f":"IF(ISERROR(VLOOKUP(C6,BDDG!$C$2:$W$6,8,FALSE)),\"\",VLOOKUP(C6,BDDG!$C$2:$W$6,8,FALSE))","v":"rose1"},10,29,{"$f":" IF(ISERROR(K6/L6*86.4),\"xxxxxxxxxx\",K6/L6*86.4)","v":29.793103448275865},{"$f":"IF(ISERROR(VLOOKUP(C6,BDDG!$C$2:$W$6,11,FALSE)),\"\",VLOOKUP(C6,BDDG!$C$2:$W$6,11,FALSE))","v":"xxxxxxxxxxxxxxxxxxxxxxxxxxxxxxxxxxxxxxxxxxxxxxx"},"xxxxxxxxxx",{"$f":" IF(ISERROR(N6/O6*86.4),\"xxxxxxxxxx\",N6/O6*86.4)","v":"xxxxxxxxxx"},{"$f":" IF(ISERROR(O6/P6*86.4),\"xxxxxxxxxx\",O6/P6*86.4)","v":"xxxxxxxxxx"},{"$f":"IF(ISERROR(VLOOKUP(C6,BDDG!$C$2:$W$6,14,FALSE)),\"\",VLOOKUP(C6,BDDG!$C$2:$W$6,14,FALSE))","v":"xxxxxxxxxxxxxxxxxxxxxxxxxxxxxxxxxxxx"},"xxxxxxxxxx",{"$f":" IF(ISERROR(R6/S6*86.4),\"xxxxxxxxxx\",R6/S6*86.4)","v":"xxxxxxxxxx"},{"$f":" IF(ISERROR(S6/T6*86.4),\"xxxxxxxxxx\",S6/T6*86.4)","v":"xxxxxxxxxx"},{"$f":"IF(ISERROR(VLOOKUP(C6,BDDG!$C$2:$W$6,17,FALSE)),\"\",VLOOKUP(C6,BDDG!$C$2:$W$6,17,FALSE))","v":"xxxxxxxxxxxxxxxxxxxxxxxx"},"xxxxxxxxxx",{"$f":" IF(ISERROR(V6/W6*86.4),\"xxxxxxxxxx\",V6/W6*86.4)","v":"xxxxxxxxxx"},{"$f":" IF(ISERROR(W6/X6*86.4),\"xxxxxxxxxx\",W6/X6*86.4)","v":"xxxxxxxxxx"},{"$f":"IF(ISERROR(VLOOKUP(C6,BDDG!$C$2:$W$6,20,FALSE)),\"\",VLOOKUP(C6,BDDG!$C$2:$W$6,20,FALSE))","v":3},{"$f":"IF(ISERROR(SUM(M6,Q6,U6)),\"\",SUM(M6,Q6,U6))","v":29.793103448275865},{"$f":"MONTH(A:A)","v":6},{"$f":"YEAR(A:A)","v":2014},{"$f":"IFERROR((INDEX($AA$2:AA6,MATCH(H6&MAX(IF($H$1:H5=H6,$A$1:A5)),$H$2:H6&$A$2:A6,0))-AA6)*-1,\"\")","v":-48.752351097178682},{"$f":"IF(ISERROR(VLOOKUP(C6,BDDG!$C$2:$W$6,21,FALSE)),\"\",VLOOKUP(C6,BDDG!$C$2:$W$6,21,FALSE))","v":0}]
["2014-06-04",null,856,{"$f":"IF(ISNA(VLOOKUP(C7,BDDG!$C$2:$H$47,2,FALSE)),\"\",VLOOKUP(C7,BDDG!$C$2:$H$47,2,FALSE))","v":0},{"$f":"IF(ISNA(VLOOKUP(C7,BDDG!$C$3:$P$49,3,FALSE)),\"\",VLOOKUP(C7,BDDG!$C$3:$P$49,3,FALSE))","v":"pates"},{"$f":"IF(ISNA(VLOOKUP(C7,BDDG!$C$3:$P$49,4,FALSE)),\"\",VLOOKUP(C7,BDDG!$C$3:$P$49,4,FALSE))","v":106},{"$f":"IF(ISNA(VLOOKUP(C7,BDDG!$C$2:$H$47,5,FALSE)),\"\",VLOOKUP(C7,BDDG!$C$2:$H$47,5,FALSE))","v":"noisettes"},{"$f":"IF(ISNA(VLOOKUP(C7,BDDG!$C$2:$H$47,6,FALSE)),\"\",VLOOKUP(C7,BDDG!$C$2:$H$47,6,FALSE))","v":"iris"},{"$f":"IF(ISERROR(VLOOKUP(C7,BDDG!$C$2:$I$47,7,FALSE)),\"\",VLOOKUP(C7,BDDG!$C$2:$I$47,7,FALSE))","v":2},{"$f":"IF(ISERROR(VLOOKUP(C7,BDDG!$C$2:$W$6,8,FALSE)),\"\",VLOOKUP(C7,BDDG!$C$2:$W$6,8,FALSE))","v":"iris1"},10,55,{"$f":" IF(ISERROR(K7/L7*86.4),\"xxxxxxxxxx\",K7/L7*86.4)","v":15.709090909090911},{"$f":"IF(ISERROR(VLOOKUP(C7,BDDG!$C$2:$W$6,11,FALSE)),\"\",VLOOKUP(C7,BDDG!$C$2:$W$6,11,FALSE))","v":"iris2"},10,4.5,{"$f":" IF(ISERROR(O7/P7*86.4),\"xxxxxxxxxx\",O7/P7*86.4)","v":192.00000000000003},{"$f":"IF(ISERROR(VLOOKUP(C7,BDDG!$C$2:$W$6,14,FALSE)),\"\",VLOOKUP(C7,BDDG!$C$2:$W$6,14,FALSE))","v":"xxxxxxxxxxxxxxxxxxxxxxxxxxxxxxxxxxxx"},"xxxxxxxxxx",{"$f":" IF(ISERROR(R7/S7*86.4),\"xxxxxxxxxx\",R7/S7*86.4)","v":"xxxxxxxxxx"},{"$f":" IF(ISERROR(S7/T7*86.4),\"xxxxxxxxxx\",S7/T7*86.4)","v":"xxxxxxxxxx"},{"$f":"IF(ISERROR(VLOOKUP(C7,BDDG!$C$2:$W$6,17,FALSE)),\"\",VLOOKUP(C7,BDDG!$C$2:$W$6,17,FALSE))","v":"xxxxxxxxxxxxxxxxxxxxxxxx"},"xxxxxxxxxx",{"$f":" IF(ISERROR(V7/W7*86.4),\"xxxxxxxxxx\",V7/W7*86.4)","v":"xxxxxxxxxx"},{"$f":" IF(ISERROR(W7/X7*86.4),\"xxxxxxxxxx\",W7/X7*86.4)","v":"xxxxxxxxxx"},{"$f":"IF(ISERROR(VLOOKUP(C7,BDDG!$C$2:$W$6,20,FALSE)),\"\",VLOOKUP(C7,BDDG!$C$2:$W$6,20,FALSE))","v":"xxxxxxxxxx"},{"$f":"IF(ISERROR(SUM(M7,Q7,U7)),\"\",SUM(M7,Q7,U7))","v":207.70909090909095},{"$f":"MONTH(A:A)","v":6},{"$f":"YEAR(A:A)","v":2014},{"$f":"IFERROR((INDEX($AA$2:AA7,MATCH(H7&MAX(IF($H$1:H6=H7,$A$1:A6)),$H$2:H7&$A$2:A7,0))-AA7)*-1,\"\")","v":-255.14805194805194},{"$f":"IF(ISERROR(VLOOKUP(C7,BDDG!$C$2:$W$6,21,FALSE)),\"\",VLOOKUP(C7,BDDG!$C$2:$W$6,21,FALSE))","v":0}]
["2014-07-08",null,823,{"$f":"IF(ISNA(VLOOKUP(C8,BDDG!$C$2:$H$47,2,FALSE)),\"\",VLOOKUP(C8,BDDG!$C$2:$H$47,2,FALSE))","v":0},{"$f":"IF(ISNA(VLOOKUP(C8,BDDG!$C$3:$P$49,3,FALSE)),\"\",VLOOKUP(C8,BDDG!$C$3:$P$49,3,FALSE))","v":"frites"},{"$f":"IF(ISNA(VLOOKUP(C8,BDDG!$C$3:$P$49,4,FALSE)),\"\",VLOOKUP(C8,BDDG!$C$3:$P$49,4,FALSE))","v":104},{"$f":"IF(ISNA(VLOOKUP(C8,BDDG!$C$2:$H$47,5,FALSE)),\"\",VLOOKUP(C8,BDDG!$C$2:$H$47,5,FALSE))","v":"noix"},{"$f":"IF(ISNA(VLOOKUP(C8,BDDG!$C$2:$H$47,6,FALSE)),\"\",VLOOKUP(C8,BDDG!$C$2:$H$47,6,FALSE))","v":"rose"},{"$f":"IF(ISERROR(VLOOKUP(C8,BDDG!$C$2:$I$47,7,FALSE)),\"\",VLOOKUP(C8,BDDG!$C$2:$I$47,7,FALSE))","v":1},{"$f":"IF(ISERROR(VLOOKUP(C8,BDDG!$C$2:$W$6,8,FALSE)),\"\",VLOOKUP(C8,BDDG!$C$2:$W$6,8,FALSE))","v":"rose1"},10,18.7,{"$f":" IF(ISERROR(K8/L8*86.4),\"xxxxxxxxxx\",K8/L8*86.4)","v":46.20320855614974},{"$f":"IF(ISERROR(VLOOKUP(C8,BDDG!$C$2:$W$6,11,FALSE)),\"\",VLOOKUP(C8,BDDG!$C$2:$W$6,11,FALSE))","v":"xxxxxxxxxxxxxxxxxxxxxxxxxxxxxxxxxxxxxxxxxxxxxxx"},"xxxxxxxxxx",{"$f":" IF(ISERROR(N8/O8*86.4),\"xxxxxxxxxx\",N8/O8*86.4)","v":"xxxxxxxxxx"},{"$f":" IF(ISERROR(O8/P8*86.4),\"xxxxxxxxxx\",O8/P8*86.4)","v":"xxxxxxxxxx"},{"$f":"IF(ISERROR(VLOOKUP(C8,BDDG!$C$2:$W$6,14,FALSE)),\"\",VLOOKUP(C8,BDDG!$C$2:$W$6,14,FALSE))","v":"xxxxxxxxxxxxxxxxxxxxxxxxxxxxxxxxxxxx"},"xxxxxxxxxx",{"$f":" IF(ISERROR(R8/S8*86.4),\"xxxxxxxxxx\",R8/S8*86.4)","v":"xxxxxxxxxx"},{"$f":" IF(ISERROR(S8/T8*86.4),\"xxxxxxxxxx\",S8/T8*86.4)","v":"xxxxxxxxxx"},{"$f":"IF(ISERROR(VLOOKUP(C8,BDDG!$C$2:$W$6,17,FALSE)),\"\",VLOOKUP(C8,BDDG!$C$2:$W$6,17,FALSE))","v":"xxxxxxxxxxxxxxxxxxxxxxxx"},"xxxxxxxxxx",{"$f":" IF(ISERROR(V8/W8*86.4),\"xxxxxxxxxx\",V8/W8*86.4)","v":"xxxxxxxxxx"},{"$f":" IF(ISERROR(W8/X8*86.4),\"xxxxxxxxxx\",W8/X8*86.4)","v":"xxxxxxxxxx"},{"$f":"IF(ISERROR(VLOOKUP(C8,BDDG!$C$2:$W$6,20,FALSE)),\"\",VLOOKUP(C8,BDDG!$C$2:$W$6,20,FALSE))","v":3},{"$f":"IF(ISERROR(SUM(M8,Q8,U8)),\"\",SUM(M8,Q8,U8))","v":46.20320855614974},{"$f":"MONTH(A:A)","v":7},{"$f":"YEAR(A:A)","v":2014},{"$f":"IFERROR((INDEX($AA$2:AA8,MATCH(H8&MAX(IF($H$1:H7=H8,$A$1:A7)),$H$2:H8&$A$2:A8,0))-AA8)*-1,\"\")","v":16.410105107873875},{"$f":"IF(ISERROR(VLOOKUP(C8,BDDG!$C$2:$W$6,21,FALSE)),\"\",VLOOKUP(C8,BDDG!$C$2:$W$6,21,FALSE))","v":0}]
["2014-11-12",null,823,{"$f":"IF(ISNA(VLOOKUP(C9,BDDG!$C$2:$H$47,2,FALSE)),\"\",VLOOKUP(C9,BDDG!$C$2:$H$47,2,FALSE))","v":0},{"$f":"IF(ISNA(VLOOKUP(C9,BDDG!$C$3:$P$49,3,FALSE)),\"\",VLOOKUP(C9,BDDG!$C$3:$P$49,3,FALSE))","v":"frites"},{"$f":"IF(ISNA(VLOOKUP(C9,BDDG!$C$3:$P$49,4,FALSE)),\"\",VLOOKUP(C9,BDDG!$C$3:$P$49,4,FALSE))","v":104},{"$f":"IF(ISNA(VLOOKUP(C9,BDDG!$C$2:$H$47,5,FALSE)),\"\",VLOOKUP(C9,BDDG!$C$2:$H$47,5,FALSE))","v":"noix"},{"$f":"IF(ISNA(VLOOKUP(C9,BDDG!$C$2:$H$47,6,FALSE)),\"\",VLOOKUP(C9,BDDG!$C$2:$H$47,6,FALSE))","v":"rose"},{"$f":"IF(ISERROR(VLOOKUP(C9,BDDG!$C$2:$I$47,7,FALSE)),\"\",VLOOKUP(C9,BDDG!$C$2:$I$47,7,FALSE))","v":1},{"$f":"IF(ISERROR(VLOOKUP(C9,BDDG!$C$2:$W$6,8,FALSE)),\"\",VLOOKUP(C9,BDDG!$C$2:$W$6,8,FALSE))","v":"rose1"},10,30,{"$f":" IF(ISERROR(K9/L9*86.4),\"xxxxxxxxxx\",K9/L9*86.4)","v":28.8},{"$f":"IF(ISERROR(VLOOKUP(C9,BDDG!$C$2:$W$6,11,FALSE)),\"\",VLOOKUP(C9,BDDG!$C$2:$W$6,11,FALSE))","v":"xxxxxxxxxxxxxxxxxxxxxxxxxxxxxxxxxxxxxxxxxxxxxxx"},"xxxxxxxxxx",{"$f":" IF(ISERROR(N9/O9*86.4),\"xxxxxxxxxx\",N9/O9*86.4)","v":"xxxxxxxxxx"},{"$f":" IF(ISERROR(O9/P9*86.4),\"xxxxxxxxxx\",O9/P9*86.4)","v":"xxxxxxxxxx"},{"$f":"IF(ISERROR(VLOOKUP(C9,BDDG!$C$2:$W$6,14,FALSE)),\"\",VLOOKUP(C9,BDDG!$C$2:$W$6,14,FALSE))","v":"xxxxxxxxxxxxxxxxxxxxxxxxxxxxxxxxxxxx"},"xxxxxxxxxx",{"$f":" IF(ISERROR(R9/S9*86.4),\"xxxxxxxxxx\",R9/S9*86.4)","v":"xxxxxxxxxx"},{"$f":" IF(ISERROR(S9/T9*86.4),\"xxxxxxxxxx\",S9/T9*86.4)","v":"xxxxxxxxxx"},{"$f":"IF(ISERROR(VLOOKUP(C9,BDDG!$C$2:$W$6,17,FALSE)),\"\",VLOOKUP(C9,BDDG!$C$2:$W$6,17,FALSE))","v":"xxxxxxxxxxxxxxxxxxxxxxxx"},"xxxxxxxxxx",{"$f":" IF(ISERROR(V9/W9*86.4),\"xxxxxxxxxx\",V9/W9*86.4)","v":"xxxxxxxxxx"},{"$f":" IF(ISERROR(W9/X9*86.4),\"xxxxxxxxxx\",W9/X9*86.4)","v":"xxxxxxxxxx"},{"$f":"IF(ISERROR(VLOOKUP(C9,BDDG!$C$2:$W$6,20,FALSE)),\"\",VLOOKUP(C9,BDDG!$C$2:$W$6,20,FALSE))","v":3},{"$f":"IF(ISERROR(SUM(M9,Q9,U9)),\"\",SUM(M9,Q9,U9))","v":28.8},{"$f":"MONTH(A:A)","v":11},{"$f":"YEAR(A:A)","v":2014},{"$f":"IFERROR((INDEX($AA$2:AA9,MATCH(H9&MAX(IF($H$1:H8=H9,$A$1:A8)),$H$2:H9&$A$2:A9,0))-AA9)*-1,\"\")","v":-17.403208556149739},{"$f":"IF(ISERROR(VLOOKUP(C9,BDDG!$C$2:$W$6,21,FALSE)),\"\",VLOOKUP(C9,BDDG!$C$2:$W$6,21,FALSE))","v":0}]
["2014-12-19",null,823,{"$f":"IF(ISNA(VLOOKUP(C10,BDDG!$C$2:$H$47,2,FALSE)),\"\",VLOOKUP(C10,BDDG!$C$2:$H$47,2,FALSE))","v":0},{"$f":"IF(ISNA(VLOOKUP(C10,BDDG!$C$3:$P$49,3,FALSE)),\"\",VLOOKUP(C10,BDDG!$C$3:$P$49,3,FALSE))","v":"frites"},{"$f":"IF(ISNA(VLOOKUP(C10,BDDG!$C$3:$P$49,4,FALSE)),\"\",VLOOKUP(C10,BDDG!$C$3:$P$49,4,FALSE))","v":104},{"$f":"IF(ISNA(VLOOKUP(C10,BDDG!$C$2:$H$47,5,FALSE)),\"\",VLOOKUP(C10,BDDG!$C$2:$H$47,5,FALSE))","v":"noix"},{"$f":"IF(ISNA(VLOOKUP(C10,BDDG!$C$2:$H$47,6,FALSE)),\"\",VLOOKUP(C10,BDDG!$C$2:$H$47,6,FALSE))","v":"rose"},{"$f":"IF(ISERROR(VLOOKUP(C10,BDDG!$C$2:$I$47,7,FALSE)),\"\",VLOOKUP(C10,BDDG!$C$2:$I$47,7,FALSE))","v":1},{"$f":"IF(ISERROR(VLOOKUP(C10,BDDG!$C$2:$W$6,8,FALSE)),\"\",VLOOKUP(C10,BDDG!$C$2:$W$6,8,FALSE))","v":"rose1"},10,7,{"$f":" IF(ISERROR(K10/L10*86.4),\"xxxxxxxxxx\",K10/L10*86.4)","v":123.42857142857144},{"$f":"IF(ISERROR(VLOOKUP(C10,BDDG!$C$2:$W$6,11,FALSE)),\"\",VLOOKUP(C10,BDDG!$C$2:$W$6,11,FALSE))","v":"xxxxxxxxxxxxxxxxxxxxxxxxxxxxxxxxxxxxxxxxxxxxxxx"},"xxxxxxxxxx",{"$f":" IF(ISERROR(N10/O10*86.4),\"xxxxxxxxxx\",N10/O10*86.4)","v":"xxxxxxxxxx"},{"$f":" IF(ISERROR(O10/P10*86.4),\"xxxxxxxxxx\",O10/P10*86.4)","v":"xxxxxxxxxx"},{"$f":"IF(ISERROR(VLOOKUP(C10,BDDG!$C$2:$W$6,14,FALSE)),\"\",VLOOKUP(C10,BDDG!$C$2:$W$6,14,FALSE))","v":"xxxxxxxxxxxxxxxxxxxxxxxxxxxxxxxxxxxx"},"xxxxxxxxxx",{"$f":" IF(ISERROR(R10/S10*86.4),\"xxxxxxxxxx\",R10/S10*86.4)","v":"xxxxxxxxxx"},{"$f":" IF(ISERROR(S10/T10*86.4),\"xxxxxxxxxx\",S10/T10*86.4)","v":"xxxxxxxxxx"},{"$f":"IF(ISERROR(VLOOKUP(C10,BDDG!$C$2:$W$6,17,FALSE)),\"\",VLOOKUP(C10,BDDG!$C$2:$W$6,17,FALSE))","v":"xxxxxxxxxxxxxxxxxxxxxxxx"},"xxxxxxxxxx",{"$f":" IF(ISERROR(V10/W10*86.4),\"xxxxxxxxxx\",V10/W10*86.4)","v":"xxxxxxxxxx"},{"$f":" IF(ISERROR(W10/X10*86.4),\"xxxxxxxxxx\",W10/X10*86.4)","v":"xxxxxxxxxx"},{"$f":"IF(ISERROR(VLOOKUP(C10,BDDG!$C$2:$W$6,20,FALSE)),\"\",VLOOKUP(C10,BDDG!$C$2:$W$6,20,FALSE))","v":3},{"$f":"IF(ISERROR(SUM(M10,Q10,U10)),\"\",SUM(M10,Q10,U10))","v":123.42857142857144},{"$f":"MONTH(A:A)","v":12},{"$f":"YEAR(A:A)","v":2014},{"$f":"IFERROR((INDEX($AA$2:AA10,MATCH(H10&MAX(IF($H$1:H9=H10,$A$1:A9)),$H$2:H10&$A$2:A10,0))-AA10)*-1,\"\")","v":94.628571428571448},{"$f":"IF(ISERROR(VLOOKUP(C10,BDDG!$C$2:$W$6,21,FALSE)),\"\",VLOOKUP(C10,BDDG!$C$2:$W$6,21,FALSE))","v":0}]
["2015-04-03",null,823,{"$f":"IF(ISNA(VLOOKUP(C11,BDDG!$C$2:$H$47,2,FALSE)),\"\",VLOOKUP(C11,BDDG!$C$2:$H$47,2,FALSE))","v":0},{"$f":"IF(ISNA(VLOOKUP(C11,BDDG!$C$3:$P$49,3,FALSE)),\"\",VLOOKUP(C11,BDDG!$C$3:$P$49,3,FALSE))","v":"frites"},{"$f":"IF(ISNA(VLOOKUP(C11,BDDG!$C$3:$P$49,4,FALSE)),\"\",VLOOKUP(C11,BDDG!$C$3:$P$49,4,FALSE))","v":104},{"$f":"IF(ISNA(VLOOKUP(C11,BDDG!$C$2:$H$47,5,FALSE)),\"\",VLOOKUP(C11,BDDG!$C$2:$H$47,5,FALSE))","v":"noix"},{"$f":"IF(ISNA(VLOOKUP(C11,BDDG!$C$2:$H$47,6,FALSE)),\"\",VLOOKUP(C11,BDDG!$C$2:$H$47,6,FALSE))","v":"rose"},{"$f":"IF(ISERROR(VLOOKUP(C11,BDDG!$C$2:$I$47,7,FALSE)),\"\",VLOOKUP(C11,BDDG!$C$2:$I$47,7,FALSE))","v":1},{"$f":"IF(ISERROR(VLOOKUP(C11,BDDG!$C$2:$W$6,8,FALSE)),\"\",VLOOKUP(C11,BDDG!$C$2:$W$6,8,FALSE))","v":"rose1"},10,15,{"$f":" IF(ISERROR(K11/L11*86.4),\"xxxxxxxxxx\",K11/L11*86.4)","v":57.6},{"$f":"IF(ISERROR(VLOOKUP(C11,BDDG!$C$2:$W$6,11,FALSE)),\"\",VLOOKUP(C11,BDDG!$C$2:$W$6,11,FALSE))","v":"xxxxxxxxxxxxxxxxxxxxxxxxxxxxxxxxxxxxxxxxxxxxxxx"},"xxxxxxxxxx",{"$f":" IF(ISERROR(N11/O11*86.4),\"xxxxxxxxxx\",N11/O11*86.4)","v":"xxxxxxxxxx"},{"$f":" IF(ISERROR(O11/P11*86.4),\"xxxxxxxxxx\",O11/P11*86.4)","v":"xxxxxxxxxx"},{"$f":"IF(ISERROR(VLOOKUP(C11,BDDG!$C$2:$W$6,14,FALSE)),\"\",VLOOKUP(C11,BDDG!$C$2:$W$6,14,FALSE))","v":"xxxxxxxxxxxxxxxxxxxxxxxxxxxxxxxxxxxx"},"xxxxxxxxxx",{"$f":" IF(ISERROR(R11/S11*86.4),\"xxxxxxxxxx\",R11/S11*86.4)","v":"xxxxxxxxxx"},{"$f":" IF(ISERROR(S11/T11*86.4),\"xxxxxxxxxx\",S11/T11*86.4)","v":"xxxxxxxxxx"},{"$f":"IF(ISERROR(VLOOKUP(C11,BDDG!$C$2:$W$6,17,FALSE)),\"\",VLOOKUP(C11,BDDG!$C$2:$W$6,17,FALSE))","v":"xxxxxxxxxxxxxxxxxxxxxxxx"},"xxxxxxxxxx",{"$f":" IF(ISERROR(V11/W11*86.4),\"xxxxxxxxxx\",V11/W11*86.4)","v":"xxxxxxxxxx"},{"$f":" IF(ISERROR(W11/X11*86.4),\"xxxxxxxxxx\",W11/X11*86.4)","v":"xxxxxxxxxx"},{"$f":"IF(ISERROR(VLOOKUP(C11,BDDG!$C$2:$W$6,20,FALSE)),\"\",VLOOKUP(C11,BDDG!$C$2:$W$6,20,FALSE))","v":3},{"$f":"IF(ISERROR(SUM(M11,Q11,U11)),\"\",SUM(M11,Q11,U11))","v":57.6},{"$f":"MONTH(A:A)","v":4},{"$f":"YEAR(A:A)","v":2015},{"$f":"IFERROR((INDEX($AA$2:AA11,MATCH(H11&MAX(IF($H$1:H10=H11,$A$1:A10)),$H$2:H11&$A$2:A11,0))-AA11)*-1,\"\")","v":-65.82857142857145},{"$f":"IF(ISERROR(VLOOKUP(C11,BDDG!$C$2:$W$6,21,FALSE)),\"\",VLOOKUP(C11,BDDG!$C$2:$W$6,21,FALSE))","v":0}]
["2015-04-07",null,856,{"$f":"IF(ISNA(VLOOKUP(C12,BDDG!$C$2:$H$47,2,FALSE)),\"\",VLOOKUP(C12,BDDG!$C$2:$H$47,2,FALSE))","v":0},{"$f":"IF(ISNA(VLOOKUP(C12,BDDG!$C$3:$P$49,3,FALSE)),\"\",VLOOKUP(C12,BDDG!$C$3:$P$49,3,FALSE))","v":"pates"},{"$f":"IF(ISNA(VLOOKUP(C12,BDDG!$C$3:$P$49,4,FALSE)),\"\",VLOOKUP(C12,BDDG!$C$3:$P$49,4,FALSE))","v":106},{"$f":"IF(ISNA(VLOOKUP(C12,BDDG!$C$2:$H$47,5,FALSE)),\"\",VLOOKUP(C12,BDDG!$C$2:$H$47,5,FALSE))","v":"noisettes"},{"$f":"IF(ISNA(VLOOKUP(C12,BDDG!$C$2:$H$47,6,FALSE)),\"\",VLOOKUP(C12,BDDG!$C$2:$H$47,6,FALSE))","v":"iris"},{"$f":"IF(ISERROR(VLOOKUP(C12,BDDG!$C$2:$I$47,7,FALSE)),\"\",VLOOKUP(C12,BDDG!$C$2:$I$47,7,FALSE))","v":2},{"$f":"IF(ISERROR(VLOOKUP(C12,BDDG!$C$2:$W$6,8,FALSE)),\"\",VLOOKUP(C12,BDDG!$C$2:$W$6,8,FALSE))","v":"iris1"},10,15,{"$f":" IF(ISERROR(K12/L12*86.4),\"xxxxxxxxxx\",K12/L12*86.4)","v":57.6},{"$f":"IF(ISERROR(VLOOKUP(C12,BDDG!$C$2:$W$6,11,FALSE)),\"\",VLOOKUP(C12,BDDG!$C$2:$W$6,11,FALSE))","v":"iris2"},10,1,{"$f":" IF(ISERROR(O12/P12*86.4),\"xxxxxxxxxx\",O12/P12*86.4)","v":864},{"$f":"IF(ISERROR(VLOOKUP(C12,BDDG!$C$2:$W$6,14,FALSE)),\"\",VLOOKUP(C12,BDDG!$C$2:$W$6,14,FALSE))","v":"xxxxxxxxxxxxxxxxxxxxxxxxxxxxxxxxxxxx"},"xxxxxxxxxx",{"$f":" IF(ISERROR(R12/S12*86.4),\"xxxxxxxxxx\",R12/S12*86.4)","v":"xxxxxxxxxx"},{"$f":" IF(ISERROR(S12/T12*86.4),\"xxxxxxxxxx\",S12/T12*86.4)","v":"xxxxxxxxxx"},{"$f":"IF(ISERROR(VLOOKUP(C12,BDDG!$C$2:$W$6,17,FALSE)),\"\",VLOOKUP(C12,BDDG!$C$2:$W$6,17,FALSE))","v":"xxxxxxxxxxxxxxxxxxxxxxxx"},"xxxxxxxxxx",{"$f":" IF(ISERROR(V12/W12*86.4),\"xxxxxxxxxx\",V12/W12*86.4)","v":"xxxxxxxxxx"},{"$f":" IF(ISERROR(W12/X12*86.4),\"xxxxxxxxxx\",W12/X12*86.4)","v":"xxxxxxxxxx"},{"$f":"IF(ISERROR(VLOOKUP(C12,BDDG!$C$2:$W$6,20,FALSE)),\"\",VLOOKUP(C12,BDDG!$C$2:$W$6,20,FALSE))","v":"xxxxxxxxxx"},{"$f":"IF(ISERROR(SUM(M12,Q12,U12)),\"\",SUM(M12,Q12,U12))","v":921.6},{"$f":"MONTH(A:A)","v":4},{"$f":"YEAR(A:A)","v":2015},{"$f":"IFERROR((INDEX($AA$2:AA12,MATCH(H12&MAX(IF($H$1:H11=H12,$A$1:A11)),$H$2:H12&$A$2:A12,0))-AA12)*-1,\"\")","v":713.89090909090908},{"$f":"IF(ISERROR(VLOOKUP(C12,BDDG!$C$2:$W$6,21,FALSE)),\"\",VLOOKUP(C12,BDDG!$C$2:$W$6,21,FALSE))","v":0}]
["2015-05-26",null,823,{"$f":"IF(ISNA(VLOOKUP(C13,BDDG!$C$2:$H$47,2,FALSE)),\"\",VLOOKUP(C13,BDDG!$C$2:$H$47,2,FALSE))","v":0},{"$f":"IF(ISNA(VLOOKUP(C13,BDDG!$C$3:$P$49,3,FALSE)),\"\",VLOOKUP(C13,BDDG!$C$3:$P$49,3,FALSE))","v":"frites"},{"$f":"IF(ISNA(VLOOKUP(C13,BDDG!$C$3:$P$49,4,FALSE)),\"\",VLOOKUP(C13,BDDG!$C$3:$P$49,4,FALSE))","v":104},{"$f":"IF(ISNA(VLOOKUP(C13,BDDG!$C$2:$H$47,5,FALSE)),\"\",VLOOKUP(C13,BDDG!$C$2:$H$47,5,FALSE))","v":"noix"},{"$f":"IF(ISNA(VLOOKUP(C13,BDDG!$C$2:$H$47,6,FALSE)),\"\",VLOOKUP(C13,BDDG!$C$2:$H$47,6,FALSE))","v":"rose"},{"$f":"IF(ISERROR(VLOOKUP(C13,BDDG!$C$2:$I$47,7,FALSE)),\"\",VLOOKUP(C13,BDDG!$C$2:$I$47,7,FALSE))","v":1},{"$f":"IF(ISERROR(VLOOKUP(C13,BDDG!$C$2:$W$6,8,FALSE)),\"\",VLOOKUP(C13,BDDG!$C$2:$W$6,8,FALSE))","v":"rose1"},10,22,{"$f":" IF(ISERROR(K13/L13*86.4),\"xxxxxxxxxx\",K13/L13*86.4)","v":39.272727272727273},{"$f":"IF(ISERROR(VLOOKUP(C13,BDDG!$C$2:$W$6,11,FALSE)),\"\",VLOOKUP(C13,BDDG!$C$2:$W$6,11,FALSE))","v":"xxxxxxxxxxxxxxxxxxxxxxxxxxxxxxxxxxxxxxxxxxxxxxx"},"xxxxxxxxxx",{"$f":" IF(ISERROR(N13/O13*86.4),\"xxxxxxxxxx\",N13/O13*86.4)","v":"xxxxxxxxxx"},{"$f":" IF(ISERROR(O13/P13*86.4),\"xxxxxxxxxx\",O13/P13*86.4)","v":"xxxxxxxxxx"},{"$f":"IF(ISERROR(VLOOKUP(C13,BDDG!$C$2:$W$6,14,FALSE)),\"\",VLOOKUP(C13,BDDG!$C$2:$W$6,14,FALSE))","v":"xxxxxxxxxxxxxxxxxxxxxxxxxxxxxxxxxxxx"},"xxxxxxxxxx",{"$f":" IF(ISERROR(R13/S13*86.4),\"xxxxxxxxxx\",R13/S13*86.4)","v":"xxxxxxxxxx"},{"$f":" IF(ISERROR(S13/T13*86.4),\"xxxxxxxxxx\",S13/T13*86.4)","v":"xxxxxxxxxx"},{"$f":"IF(ISERROR(VLOOKUP(C13,BDDG!$C$2:$W$6,17,FALSE)),\"\",VLOOKUP(C13,BDDG!$C$2:$W$6,17,FALSE))","v":"xxxxxxxxxxxxxxxxxxxxxxxx"},"xxxxxxxxxx",{"$f":" IF(ISERROR(V13/W13*86.4),\"xxxxxxxxxx\",V13/W13*86.4)","v":"xxxxxxxxxx"},{"$f":" IF(ISERROR(W13/X13*86.4),\"xxxxxxxxxx\",W13/X13*86.4)","v":"xxxxxxxxxx"},{"$f":"IF(ISERROR(VLOOKUP(C13,BDDG!$C$2:$W$6,20,FALSE)),\"\",VLOOKUP(C13,BDDG!$C$2:$W$6,20,FALSE))","v":3},{"$f":"IF(ISERROR(SUM(M13,Q13,U13)),\"\",SUM(M13,Q13,U13))","v":39.272727272727273},{"$f":"MONTH(A:A)","v":5},{"$f":"YEAR(A:A)","v":2015},{"$f":"IFERROR((INDEX($AA$2:AA13,MATCH(H13&MAX(IF($H$1:H12=H13,$A$1:A12)),$H$2:H13&$A$2:A13,0))-AA13)*-1,\"\")","v":-18.327272727272728},{"$f":"IF(ISERROR(VLOOKUP(C13,BDDG!$C$2:$W$6,21,FALSE)),\"\",VLOOKUP(C13,BDDG!$C$2:$W$6,21,FALSE))","v":0}]
["2015-06-12",null,856,{"$f":"IF(ISNA(VLOOKUP(C14,BDDG!$C$2:$H$47,2,FALSE)),\"\",VLOOKUP(C14,BDDG!$C$2:$H$47,2,FALSE))","v":0},{"$f":"IF(ISNA(VLOOKUP(C14,BDDG!$C$3:$P$49,3,FALSE)),\"\",VLOOKUP(C14,BDDG!$C$3:$P$49,3,FALSE))","v":"pates"},{"$f":"IF(ISNA(VLOOKUP(C14,BDDG!$C$3:$P$49,4,FALSE)),\"\",VLOOKUP(C14,BDDG!$C$3:$P$49,4,FALSE))","v":106},{"$f":"IF(ISNA(VLOOKUP(C14,BDDG!$C$2:$H$47,5,FALSE)),\"\",VLOOKUP(C14,BDDG!$C$2:$H$47,5,FALSE))","v":"noisettes"},{"$f":"IF(ISNA(VLOOKUP(C14,BDDG!$C$2:$H$47,6,FALSE)),\"\",VLOOKUP(C14,BDDG!$C$2:$H$47,6,FALSE))","v":"iris"},{"$f":"IF(ISERROR(VLOOKUP(C14,BDDG!$C$2:$I$47,7,FALSE)),\"\",VLOOKUP(C14,BDDG!$C$2:$I$47,7,FALSE))","v":2},{"$f":"IF(ISERROR(VLOOKUP(C14,BDDG!$C$2:$W$6,8,FALSE)),\"\",VLOOKUP(C14,BDDG!$C$2:$W$6,8,FALSE))","v":"iris1"},10,57,{"$f":" IF(ISERROR(K14/L14*86.4),\"xxxxxxxxxx\",K14/L14*86.4)","v":15.157894736842106},{"$f":"IF(ISERROR(VLOOKUP(C14,BDDG!$C$2:$W$6,11,FALSE)),\"\",VLOOKUP(C14,BDDG!$C$2:$W$6,11,FALSE))","v":"iris2"},10,5,{"$f":" IF(ISERROR(O14/P14*86.4),\"xxxxxxxxxx\",O14/P14*86.4)","v":172.8},{"$f":"IF(ISERROR(VLOOKUP(C14,BDDG!$C$2:$W$6,14,FALSE)),\"\",VLOOKUP(C14,BDDG!$C$2:$W$6,14,FALSE))","v":"xxxxxxxxxxxxxxxxxxxxxxxxxxxxxxxxxxxx"},"xxxxxxxxxx",{"$f":" IF(ISERROR(R14/S14*86.4),\"xxxxxxxxxx\",R14/S14*86.4)","v":"xxxxxxxxxx"},{"$f":" IF(ISERROR(S14/T14*86.4),\"xxxxxxxxxx\",S14/T14*86.4)","v":"xxxxxxxxxx"},{"$f":"IF(ISERROR(VLOOKUP(C14,BDDG!$C$2:$W$6,17,FALSE)),\"\",VLOOKUP(C14,BDDG!$C$2:$W$6,17,FALSE))","v":"xxxxxxxxxxxxxxxxxxxxxxxx"},"xxxxxxxxxx",{"$f":" IF(ISERROR(V14/W14*86.4),\"xxxxxxxxxx\",V14/W14*86.4)","v":"xxxxxxxxxx"},{"$f":" IF(ISERROR(W14/X14*86.4),\"xxxxxxxxxx\",W14/X14*86.4)","v":"xxxxxxxxxx"},{"$f":"IF(ISERROR(VLOOKUP(C14,BDDG!$C$2:$W$6,20,FALSE)),\"\",VLOOKUP(C14,BDDG!$C$2:$W$6,20,FALSE))","v":"xxxxxxxxxx"},{"$f":"IF(ISERROR(SUM(M14,Q14,U14)),\"\",SUM(M14,Q14,U14))","v":187.95789473684212},{"$f":"MONTH(A:A)","v":6},{"$f":"YEAR(A:A)","v":2015},{"$f":"IFERROR((INDEX($AA$2:AA14,MATCH(H14&MAX(IF($H$1:H13=H14,$A$1:A13)),$H$2:H14&$A$2:A14,0))-AA14)*-1,\"\")","v":-733.64210526315787},{"$f":"IF(ISERROR(VLOOKUP(C14,BDDG!$C$2:$W$6,21,FALSE)),\"\",VLOOKUP(C14,BDDG!$C$2:$W$6,21,FALSE))","v":0}]
["2015-06-26",null,823,{"$f":"IF(ISNA(VLOOKUP(C15,BDDG!$C$2:$H$47,2,FALSE)),\"\",VLOOKUP(C15,BDDG!$C$2:$H$47,2,FALSE))","v":0},{"$f":"IF(ISNA(VLOOKUP(C15,BDDG!$C$3:$P$49,3,FALSE)),\"\",VLOOKUP(C15,BDDG!$C$3:$P$49,3,FALSE))","v":"frites"},{"$f":"IF(ISNA(VLOOKUP(C15,BDDG!$C$3:$P$49,4,FALSE)),\"\",VLOOKUP(C15,BDDG!$C$3:$P$49,4,FALSE))","v":104},{"$f":"IF(ISNA(VLOOKUP(C15,BDDG!$C$2:$H$47,5,FALSE)),\"\",VLOOKUP(C15,BDDG!$C$2:$H$47,5,FALSE))","v":"noix"},{"$f":"IF(ISNA(VLOOKUP(C15,BDDG!$C$2:$H$47,6,FALSE)),\"\",VLOOKUP(C15,BDDG!$C$2:$H$47,6,FALSE))","v":"rose"},{"$f":"IF(ISERROR(VLOOKUP(C15,BDDG!$C$2:$I$47,7,FALSE)),\"\",VLOOKUP(C15,BDDG!$C$2:$I$47,7,FALSE))","v":1},{"$f":"IF(ISERROR(VLOOKUP(C15,BDDG!$C$2:$W$6,8,FALSE)),\"\",VLOOKUP(C15,BDDG!$C$2:$W$6,8,FALSE))","v":"rose1"},10,33,{"$f":" IF(ISERROR(K15/L15*86.4),\"xxxxxxxxxx\",K15/L15*86.4)","v":26.181818181818183},{"$f":"IF(ISERROR(VLOOKUP(C15,BDDG!$C$2:$W$6,11,FALSE)),\"\",VLOOKUP(C15,BDDG!$C$2:$W$6,11,FALSE))","v":"xxxxxxxxxxxxxxxxxxxxxxxxxxxxxxxxxxxxxxxxxxxxxxx"},"xxxxxxxxxx",{"$f":" IF(ISERROR(N15/O15*86.4),\"xxxxxxxxxx\",N15/O15*86.4)","v":"xxxxxxxxxx"},{"$f":" IF(ISERROR(O15/P15*86.4),\"xxxxxxxxxx\",O15/P15*86.4)","v":"xxxxxxxxxx"},{"$f":"IF(ISERROR(VLOOKUP(C15,BDDG!$C$2:$W$6,14,FALSE)),\"\",VLOOKUP(C15,BDDG!$C$2:$W$6,14,FALSE))","v":"xxxxxxxxxxxxxxxxxxxxxxxxxxxxxxxxxxxx"},"xxxxxxxxxx",{"$f":" IF(ISERROR(R15/S15*86.4),\"xxxxxxxxxx\",R15/S15*86.4)","v":"xxxxxxxxxx"},{"$f":" IF(ISERROR(S15/T15*86.4),\"xxxxxxxxxx\",S15/T15*86.4)","v":"xxxxxxxxxx"},{"$f":"IF(ISERROR(VLOOKUP(C15,BDDG!$C$2:$W$6,17,FALSE)),\"\",VLOOKUP(C15,BDDG!$C$2:$W$6,17,FALSE))","v":"xxxxxxxxxxxxxxxxxxxxxxxx"},"xxxxxxxxxx",{"$f":" IF(ISERROR(V15/W15*86.4),\"xxxxxxxxxx\",V15/W15*86.4)","v":"xxxxxxxxxx"},{"$f":" IF(ISERROR(W15/X15*86.4),\"xxxxxxxxxx\",W15/X15*86.4)","v":"xxxxxxxxxx"},{"$f":"IF(ISERROR(VLOOKUP(C15,BDDG!$C$2:$W$6,20,FALSE)),\"\",VLOOKUP(C15,BDDG!$C$2:$W$6,20,FALSE))","v":3},{"$f":"IF(ISERROR(SUM(M15,Q15,U15)),\"\",SUM(M15,Q15,U15))","v":26.181818181818183},{"$f":"MONTH(A:A)","v":6},{"$f":"YEAR(A:A)","v":2015},{"$f":"IFERROR((INDEX($AA$2:AA15,MATCH(H15&MAX(IF($H$1:H14=H15,$A$1:A14)),$H$2:H15&$A$2:A15,0))-AA15)*-1,\"\")","v":-13.09090909090909},{"$f":"IF(ISERROR(VLOOKUP(C15,BDDG!$C$2:$W$6,21,FALSE)),\"\",VLOOKUP(C15,BDDG!$C$2:$W$6,21,FALSE))","v":0}]
["2015-06-29",null,856,{"$f":"IF(ISNA(VLOOKUP(C16,BDDG!$C$2:$H$47,2,FALSE)),\"\",VLOOKUP(C16,BDDG!$C$2:$H$47,2,FALSE))","v":0},{"$f":"IF(ISNA(VLOOKUP(C16,BDDG!$C$3:$P$49,3,FALSE)),\"\",VLOOKUP(C16,BDDG!$C$3:$P$49,3,FALSE))","v":"pates"},{"$f":"IF(ISNA(VLOOKUP(C16,BDDG!$C$3:$P$49,4,FALSE)),\"\",VLOOKUP(C16,BDDG!$C$3:$P$49,4,FALSE))","v":106},{"$f":"IF(ISNA(VLOOKUP(C16,BDDG!$C$2:$H$47,5,FALSE)),\"\",VLOOKUP(C16,BDDG!$C$2:$H$47,5,FALSE))","v":"noisettes"},{"$f":"IF(ISNA(VLOOKUP(C16,BDDG!$C$2:$H$47,6,FALSE)),\"\",VLOOKUP(C16,BDDG!$C$2:$H$47,6,FALSE))","v":"iris"},{"$f":"IF(ISERROR(VLOOKUP(C16,BDDG!$C$2:$I$47,7,FALSE)),\"\",VLOOKUP(C16,BDDG!$C$2:$I$47,7,FALSE))","v":2},{"$f":"IF(ISERROR(VLOOKUP(C16,BDDG!$C$2:$W$6,8,FALSE)),\"\",VLOOKUP(C16,BDDG!$C$2:$W$6,8,FALSE))","v":"iris1"},10,64,{"$f":" IF(ISERROR(K16/L16*86.4),\"xxxxxxxxxx\",K16/L16*86.4)","v":13.5},{"$f":"IF(ISERROR(VLOOKUP(C16,BDDG!$C$2:$W$6,11,FALSE)),\"\",VLOOKUP(C16,BDDG!$C$2:$W$6,11,FALSE))","v":"iris2"},10,5,{"$f":" IF(ISERROR(O16/P16*86.4),\"xxxxxxxxxx\",O16/P16*86.4)","v":172.8},{"$f":"IF(ISERROR(VLOOKUP(C16,BDDG!$C$2:$W$6,14,FALSE)),\"\",VLOOKUP(C16,BDDG!$C$2:$W$6,14,FALSE))","v":"xxxxxxxxxxxxxxxxxxxxxxxxxxxxxxxxxxxx"},"xxxxxxxxxx",{"$f":" IF(ISERROR(R16/S16*86.4),\"xxxxxxxxxx\",R16/S16*86.4)","v":"xxxxxxxxxx"},{"$f":" IF(ISERROR(S16/T16*86.4),\"xxxxxxxxxx\",S16/T16*86.4)","v":"xxxxxxxxxx"},{"$f":"IF(ISERROR(VLOOKUP(C16,BDDG!$C$2:$W$6,17,FALSE)),\"\",VLOOKUP(C16,BDDG!$C$2:$W$6,17,FALSE))","v":"xxxxxxxxxxxxxxxxxxxxxxxx"},"xxxxxxxxxx",{"$f":" IF(ISERROR(V16/W16*86.4),\"xxxxxxxxxx\",V16/W16*86.4)","v":"xxxxxxxxxx"},{"$f":" IF(ISERROR(W16/X16*86.4),\"xxxxxxxxxx\",W16/X16*86.4)","v":"xxxxxxxxxx"},{"$f":"IF(ISERROR(VLOOKUP(C16,BDDG!$C$2:$W$6,20,FALSE)),\"\",VLOOKUP(C16,BDDG!$C$2:$W$6,20,FALSE))","v":"xxxxxxxxxx"},{"$f":"IF(ISERROR(SUM(M16,Q16,U16)),\"\",SUM(M16,Q16,U16))","v":186.3},{"$f":"MONTH(A:A)","v":6},{"$f":"YEAR(A:A)","v":2015},{"$f":"IFERROR((INDEX($AA$2:AA16,MATCH(H16&MAX(IF($H$1:H15=H16,$A$1:A15)),$H$2:H16&$A$2:A16,0))-AA16)*-1,\"\")","v":-1.6578947368421098},{"$f":"IF(ISERROR(VLOOKUP(C16,BDDG!$C$2:$W$6,21,FALSE)),\"\",VLOOKUP(C16,BDDG!$C$2:$W$6,21,FALSE))","v":0}]
["2015-07-13","sècheresse",823,{"$f":"IF(ISNA(VLOOKUP(C17,BDDG!$C$2:$H$47,2,FALSE)),\"\",VLOOKUP(C17,BDDG!$C$2:$H$47,2,FALSE))","v":0},{"$f":"IF(ISNA(VLOOKUP(C17,BDDG!$C$3:$P$49,3,FALSE)),\"\",VLOOKUP(C17,BDDG!$C$3:$P$49,3,FALSE))","v":"frites"},{"$f":"IF(ISNA(VLOOKUP(C17,BDDG!$C$3:$P$49,4,FALSE)),\"\",VLOOKUP(C17,BDDG!$C$3:$P$49,4,FALSE))","v":104},{"$f":"IF(ISNA(VLOOKUP(C17,BDDG!$C$2:$H$47,5,FALSE)),\"\",VLOOKUP(C17,BDDG!$C$2:$H$47,5,FALSE))","v":"noix"},{"$f":"IF(ISNA(VLOOKUP(C17,BDDG!$C$2:$H$47,6,FALSE)),\"\",VLOOKUP(C17,BDDG!$C$2:$H$47,6,FALSE))","v":"rose"},{"$f":"IF(ISERROR(VLOOKUP(C17,BDDG!$C$2:$I$47,7,FALSE)),\"\",VLOOKUP(C17,BDDG!$C$2:$I$47,7,FALSE))","v":1},{"$f":"IF(ISERROR(VLOOKUP(C17,BDDG!$C$2:$W$6,8,FALSE)),\"\",VLOOKUP(C17,BDDG!$C$2:$W$6,8,FALSE))","v":"rose1"},10,44,{"$f":" IF(ISERROR(K17/L17*86.4),\"xxxxxxxxxx\",K17/L17*86.4)","v":19.636363636363637},{"$f":"IF(ISERROR(VLOOKUP(C17,BDDG!$C$2:$W$6,11,FALSE)),\"\",VLOOKUP(C17,BDDG!$C$2:$W$6,11,FALSE))","v":"xxxxxxxxxxxxxxxxxxxxxxxxxxxxxxxxxxxxxxxxxxxxxxx"},"xxxxxxxxxx",{"$f":" IF(ISERROR(N17/O17*86.4),\"xxxxxxxxxx\",N17/O17*86.4)","v":"xxxxxxxxxx"},{"$f":" IF(ISERROR(O17/P17*86.4),\"xxxxxxxxxx\",O17/P17*86.4)","v":"xxxxxxxxxx"},{"$f":"IF(ISERROR(VLOOKUP(C17,BDDG!$C$2:$W$6,14,FALSE)),\"\",VLOOKUP(C17,BDDG!$C$2:$W$6,14,FALSE))","v":"xxxxxxxxxxxxxxxxxxxxxxxxxxxxxxxxxxxx"},"xxxxxxxxxx",{"$f":" IF(ISERROR(R17/S17*86.4),\"xxxxxxxxxx\",R17/S17*86.4)","v":"xxxxxxxxxx"},{"$f":" IF(ISERROR(S17/T17*86.4),\"xxxxxxxxxx\",S17/T17*86.4)","v":"xxxxxxxxxx"},{"$f":"IF(ISERROR(VLOOKUP(C17,BDDG!$C$2:$W$6,17,FALSE)),\"\",VLOOKUP(C17,BDDG!$C$2:$W$6,17,FALSE))","v":"xxxxxxxxxxxxxxxxxxxxxxxx"},"xxxxxxxxxx",{"$f":" IF(ISERROR(V17/W17*86.4),\"xxxxxxxxxx\",V17/W17*86.4)","v":"xxxxxxxxxx"},{"$f":" IF(ISERROR(W17/X17*86.4),\"xxxxxxxxxx\",W17/X17*86.4)","v":"xxxxxxxxxx"},{"$f":"IF(ISERROR(VLOOKUP(C17,BDDG!$C$2:$W$6,20,FALSE)),\"\",VLOOKUP(C17,BDDG!$C$2:$W$6,20,FALSE))","v":3},{"$f":"IF(ISERROR(SUM(M17,Q17,U17)),\"\",SUM(M17,Q17,U17))","v":19.636363636363637},{"$f":"MONTH(A:A)","v":7},{"$f":"YEAR(A:A)","v":2015},{"$f":"IFERROR((INDEX($AA$2:AA17,MATCH(H17&MAX(IF($H$1:H16=H17,$A$1:A16)),$H$2:H17&$A$2:A17,0))-AA17)*-1,\"\")","v":-6.5454545454545467},{"$f":"IF(ISERROR(VLOOKUP(C17,BDDG!$C$2:$W$6,21,FALSE)),\"\",VLOOKUP(C17,BDDG!$C$2:$W$6,21,FALSE))","v":0}]
["2015-07-21","sècheresse",856,{"$f":"IF(ISNA(VLOOKUP(C18,BDDG!$C$2:$H$47,2,FALSE)),\"\",VLOOKUP(C18,BDDG!$C$2:$H$47,2,FALSE))","v":0},{"$f":"IF(ISNA(VLOOKUP(C18,BDDG!$C$3:$P$49,3,FALSE)),\"\",VLOOKUP(C18,BDDG!$C$3:$P$49,3,FALSE))","v":"pates"},{"$f":"IF(ISNA(VLOOKUP(C18,BDDG!$C$3:$P$49,4,FALSE)),\"\",VLOOKUP(C18,BDDG!$C$3:$P$49,4,FALSE))","v":106},{"$f":"IF(ISNA(VLOOKUP(C18,BDDG!$C$2:$H$47,5,FALSE)),\"\",VLOOKUP(C18,BDDG!$C$2:$H$47,5,FALSE))","v":"noisettes"},{"$f":"IF(ISNA(VLOOKUP(C18,BDDG!$C$2:$H$47,6,FALSE)),\"\",VLOOKUP(C18,BDDG!$C$2:$H$47,6,FALSE))","v":"iris"},{"$f":"IF(ISERROR(VLOOKUP(C18,BDDG!$C$2:$I$47,7,FALSE)),\"\",VLOOKUP(C18,BDDG!$C$2:$I$47,7,FALSE))","v":2},{"$f":"IF(ISERROR(VLOOKUP(C18,BDDG!$C$2:$W$6,8,FALSE)),\"\",VLOOKUP(C18,BDDG!$C$2:$W$6,8,FALSE))","v":"iris1"},2,15.98,{"$f":" IF(ISERROR(K18/L18*86.4),\"xxxxxxxxxx\",K18/L18*86.4)","v":10.813516896120152},{"$f":"IF(ISERROR(VLOOKUP(C18,BDDG!$C$2:$W$6,11,FALSE)),\"\",VLOOKUP(C18,BDDG!$C$2:$W$6,11,FALSE))","v":"iris2"},10,8.81,{"$f":" IF(ISERROR(O18/P18*86.4),\"xxxxxxxxxx\",O18/P18*86.4)","v":98.070374574347341},{"$f":"IF(ISERROR(VLOOKUP(C18,BDDG!$C$2:$W$6,14,FALSE)),\"\",VLOOKUP(C18,BDDG!$C$2:$W$6,14,FALSE))","v":"xxxxxxxxxxxxxxxxxxxxxxxxxxxxxxxxxxxx"},"xxxxxxxxxx",{"$f":" IF(ISERROR(R18/S18*86.4),\"xxxxxxxxxx\",R18/S18*86.4)","v":"xxxxxxxxxx"},{"$f":" IF(ISERROR(S18/T18*86.4),\"xxxxxxxxxx\",S18/T18*86.4)","v":"xxxxxxxxxx"},{"$f":"IF(ISERROR(VLOOKUP(C18,BDDG!$C$2:$W$6,17,FALSE)),\"\",VLOOKUP(C18,BDDG!$C$2:$W$6,17,FALSE))","v":"xxxxxxxxxxxxxxxxxxxxxxxx"},"xxxxxxxxxx",{"$f":" IF(ISERROR(V18/W18*86.4),\"xxxxxxxxxx\",V18/W18*86.4)","v":"xxxxxxxxxx"},{"$f":" IF(ISERROR(W18/X18*86.4),\"xxxxxxxxxx\",W18/X18*86.4)","v":"xxxxxxxxxx"},{"$f":"IF(ISERROR(VLOOKUP(C18,BDDG!$C$2:$W$6,20,FALSE)),\"\",VLOOKUP(C18,BDDG!$C$2:$W$6,20,FALSE))","v":"xxxxxxxxxx"},{"$f":"IF(ISERROR(SUM(M18,Q18,U18)),\"\",SUM(M18,Q18,U18))","v":108.88389147046749},{"$f":"MONTH(A:A)","v":7},{"$f":"YEAR(A:A)","v":2015},{"$f":"IFERROR((INDEX($AA$2:AA18,MATCH(H18&MAX(IF($H$1:H17=H18,$A$1:A17)),$H$2:H18&$A$2:A18,0))-AA18)*-1,\"\")","v":-77.416108529532522},{"$f":"IF(ISERROR(VLOOKUP(C18,BDDG!$C$2:$W$6,21,FALSE)),\"\",VLOOKUP(C18,BDDG!$C$2:$W$6,21,FALSE))","v":0}]
["2015-08-07","sècheresse",823,{"$f":"IF(ISNA(VLOOKUP(C19,BDDG!$C$2:$H$47,2,FALSE)),\"\",VLOOKUP(C19,BDDG!$C$2:$H$47,2,FALSE))","v":0},{"$f":"IF(ISNA(VLOOKUP(C19,BDDG!$C$3:$P$49,3,FALSE)),\"\",VLOOKUP(C19,BDDG!$C$3:$P$49,3,FALSE))","v":"frites"},{"$f":"IF(ISNA(VLOOKUP(C19,BDDG!$C$3:$P$49,4,FALSE)),\"\",VLOOKUP(C19,BDDG!$C$3:$P$49,4,FALSE))","v":104},{"$f":"IF(ISNA(VLOOKUP(C19,BDDG!$C$2:$H$47,5,FALSE)),\"\",VLOOKUP(C19,BDDG!$C$2:$H$47,5,FALSE))","v":"noix"},{"$f":"IF(ISNA(VLOOKUP(C19,BDDG!$C$2:$H$47,6,FALSE)),\"\",VLOOKUP(C19,BDDG!$C$2:$H$47,6,FALSE))","v":"rose"},{"$f":"IF(ISERROR(VLOOKUP(C19,BDDG!$C$2:$I$47,7,FALSE)),\"\",VLOOKUP(C19,BDDG!$C$2:$I$47,7,FALSE))","v":1},{"$f":"IF(ISERROR(VLOOKUP(C19,BDDG!$C$2:$W$6,8,FALSE)),\"\",VLOOKUP(C19,BDDG!$C$2:$W$6,8,FALSE))","v":"rose1"},2,9,{"$f":" IF(ISERROR(K19/L19*86.4),\"xxxxxxxxxx\",K19/L19*86.4)","v":19.2},{"$f":"IF(ISERROR(VLOOKUP(C19,BDDG!$C$2:$W$6,11,FALSE)),\"\",VLOOKUP(C19,BDDG!$C$2:$W$6,11,FALSE))","v":"xxxxxxxxxxxxxxxxxxxxxxxxxxxxxxxxxxxxxxxxxxxxxxx"},"xxxxxxxxxx",{"$f":" IF(ISERROR(N19/O19*86.4),\"xxxxxxxxxx\",N19/O19*86.4)","v":"xxxxxxxxxx"},{"$f":" IF(ISERROR(O19/P19*86.4),\"xxxxxxxxxx\",O19/P19*86.4)","v":"xxxxxxxxxx"},{"$f":"IF(ISERROR(VLOOKUP(C19,BDDG!$C$2:$W$6,14,FALSE)),\"\",VLOOKUP(C19,BDDG!$C$2:$W$6,14,FALSE))","v":"xxxxxxxxxxxxxxxxxxxxxxxxxxxxxxxxxxxx"},"xxxxxxxxxx",{"$f":" IF(ISERROR(R19/S19*86.4),\"xxxxxxxxxx\",R19/S19*86.4)","v":"xxxxxxxxxx"},{"$f":" IF(ISERROR(S19/T19*86.4),\"xxxxxxxxxx\",S19/T19*86.4)","v":"xxxxxxxxxx"},{"$f":"IF(ISERROR(VLOOKUP(C19,BDDG!$C$2:$W$6,17,FALSE)),\"\",VLOOKUP(C19,BDDG!$C$2:$W$6,17,FALSE))","v":"xxxxxxxxxxxxxxxxxxxxxxxx"},"xxxxxxxxxx",{"$f":" IF(ISERROR(V19/W19*86.4),\"xxxxxxxxxx\",V19/W19*86.4)","v":"xxxxxxxxxx"},{"$f":" IF(ISERROR(W19/X19*86.4),\"xxxxxxxxxx\",W19/X19*86.4)","v":"xxxxxxxxxx"},{"$f":"IF(ISERROR(VLOOKUP(C19,BDDG!$C$2:$W$6,20,FALSE)),\"\",VLOOKUP(C19,BDDG!$C$2:$W$6,20,FALSE))","v":3},{"$f":"IF(ISERROR(SUM(M19,Q19,U19)),\"\",SUM(M19,Q19,U19))","v":19.2},{"$f":"MONTH(A:A)","v":8},{"$f":"YEAR(A:A)","v":2015},{"$f":"IFERROR((INDEX($AA$2:AA19,MATCH(H19&MAX(IF($H$1:H18=H19,$A$1:A18)),$H$2:H19&$A$2:A19,0))-AA19)*-1,\"\")","v":-0.4363636363636374},{"$f":"IF(ISERROR(VLOOKUP(C19,BDDG!$C$2:$W$6,21,FALSE)),\"\",VLOOKUP(C19,BDDG!$C$2:$W$6,21,FALSE))","v":0}]
["2015-09-01","Pluie",856,{"$f":"IF(ISNA(VLOOKUP(C20,BDDG!$C$2:$H$47,2,FALSE)),\"\",VLOOKUP(C20,BDDG!$C$2:$H$47,2,FALSE))","v":0},{"$f":"IF(ISNA(VLOOKUP(C20,BDDG!$C$3:$P$49,3,FALSE)),\"\",VLOOKUP(C20,BDDG!$C$3:$P$49,3,FALSE))","v":"pates"},{"$f":"IF(ISNA(VLOOKUP(C20,BDDG!$C$3:$P$49,4,FALSE)),\"\",VLOOKUP(C20,BDDG!$C$3:$P$49,4,FALSE))","v":106},{"$f":"IF(ISNA(VLOOKUP(C20,BDDG!$C$2:$H$47,5,FALSE)),\"\",VLOOKUP(C20,BDDG!$C$2:$H$47,5,FALSE))","v":"noisettes"},{"$f":"IF(ISNA(VLOOKUP(C20,BDDG!$C$2:$H$47,6,FALSE)),\"\",VLOOKUP(C20,BDDG!$C$2:$H$47,6,FALSE))","v":"iris"},{"$f":"IF(ISERROR(VLOOKUP(C20,BDDG!$C$2:$I$47,7,FALSE)),\"\",VLOOKUP(C20,BDDG!$C$2:$I$47,7,FALSE))","v":2},{"$f":"IF(ISERROR(VLOOKUP(C20,BDDG!$C$2:$W$6,8,FALSE)),\"\",VLOOKUP(C20,BDDG!$C$2:$W$6,8,FALSE))","v":"iris1"},5,54,{"$f":" IF(ISERROR(K20/L20*86.4),\"xxxxxxxxxx\",K20/L20*86.4)","v":8},{"$f":"IF(ISERROR(VLOOKUP(C20,BDDG!$C$2:$W$6,11,FALSE)),\"\",VLOOKUP(C20,BDDG!$C$2:$W$6,11,FALSE))","v":"iris2"},10,11.55,{"$f":" IF(ISERROR(O20/P20*86.4),\"xxxxxxxxxx\",O20/P20*86.4)","v":74.805194805194816},{"$f":"IF(ISERROR(VLOOKUP(C20,BDDG!$C$2:$W$6,14,FALSE)),\"\",VLOOKUP(C20,BDDG!$C$2:$W$6,14,FALSE))","v":"xxxxxxxxxxxxxxxxxxxxxxxxxxxxxxxxxxxx"},"xxxxxxxxxx",{"$f":" IF(ISERROR(R20/S20*86.4),\"xxxxxxxxxx\",R20/S20*86.4)","v":"xxxxxxxxxx"},{"$f":" IF(ISERROR(S20/T20*86.4),\"xxxxxxxxxx\",S20/T20*86.4)","v":"xxxxxxxxxx"},{"$f":"IF(ISERROR(VLOOKUP(C20,BDDG!$C$2:$W$6,17,FALSE)),\"\",VLOOKUP(C20,BDDG!$C$2:$W$6,17,FALSE))","v":"xxxxxxxxxxxxxxxxxxxxxxxx"},"xxxxxxxxxx",{"$f":" IF(ISERROR(V20/W20*86.4),\"xxxxxxxxxx\",V20/W20*86.4)","v":"xxxxxxxxxx"},{"$f":" IF(ISERROR(W20/X20*86.4),\"xxxxxxxxxx\",W20/X20*86.4)","v":"xxxxxxxxxx"},{"$f":"IF(ISERROR(VLOOKUP(C20,BDDG!$C$2:$W$6,20,FALSE)),\"\",VLOOKUP(C20,BDDG!$C$2:$W$6,20,FALSE))","v":"xxxxxxxxxx"},{"$f":"IF(ISERROR(SUM(M20,Q20,U20)),\"\",SUM(M20,Q20,U20))","v":82.805194805194816},{"$f":"MONTH(A:A)","v":9},{"$f":"YEAR(A:A)","v":2015},{"$f":"IFERROR((INDEX($AA$2:AA20,MATCH(H20&MAX(IF($H$1:H19=H20,$A$1:A19)),$H$2:H20&$A$2:A20,0))-AA20)*-1,\"\")","v":-26.078696665272673},{"$f":"IF(ISERROR(VLOOKUP(C20,BDDG!$C$2:$W$6,21,FALSE)),\"\",VLOOKUP(C20,BDDG!$C$2:$W$6,21,FALSE))","v":0}]
["2015-09-03","couvert",823,{"$f":"IF(ISNA(VLOOKUP(C21,BDDG!$C$2:$H$47,2,FALSE)),\"\",VLOOKUP(C21,BDDG!$C$2:$H$47,2,FALSE))","v":0},{"$f":"IF(ISNA(VLOOKUP(C21,BDDG!$C$3:$P$49,3,FALSE)),\"\",VLOOKUP(C21,BDDG!$C$3:$P$49,3,FALSE))","v":"frites"},{"$f":"IF(ISNA(VLOOKUP(C21,BDDG!$C$3:$P$49,4,FALSE)),\"\",VLOOKUP(C21,BDDG!$C$3:$P$49,4,FALSE))","v":104},{"$f":"IF(ISNA(VLOOKUP(C21,BDDG!$C$2:$H$47,5,FALSE)),\"\",VLOOKUP(C21,BDDG!$C$2:$H$47,5,FALSE))","v":"noix"},{"$f":"IF(ISNA(VLOOKUP(C21,BDDG!$C$2:$H$47,6,FALSE)),\"\",VLOOKUP(C21,BDDG!$C$2:$H$47,6,FALSE))","v":"rose"},{"$f":"IF(ISERROR(VLOOKUP(C21,BDDG!$C$2:$I$47,7,FALSE)),\"\",VLOOKUP(C21,BDDG!$C$2:$I$47,7,FALSE))","v":1},{"$f":"IF(ISERROR(VLOOKUP(C21,BDDG!$C$2:$W$6,8,FALSE)),\"\",VLOOKUP(C21,BDDG!$C$2:$W$6,8,FALSE))","v":"rose1"},5,28.35,{"$f":" IF(ISERROR(K21/L21*86.4),\"xxxxxxxxxx\",K21/L21*86.4)","v":15.238095238095239},{"$f":"IF(ISERROR(VLOOKUP(C21,BDDG!$C$2:$W$6,11,FALSE)),\"\",VLOOKUP(C21,BDDG!$C$2:$W$6,11,FALSE))","v":"xxxxxxxxxxxxxxxxxxxxxxxxxxxxxxxxxxxxxxxxxxxxxxx"},"xxxxxxxxxx",{"$f":" IF(ISERROR(N21/O21*86.4),\"xxxxxxxxxx\",N21/O21*86.4)","v":"xxxxxxxxxx"},{"$f":" IF(ISERROR(O21/P21*86.4),\"xxxxxxxxxx\",O21/P21*86.4)","v":"xxxxxxxxxx"},{"$f":"IF(ISERROR(VLOOKUP(C21,BDDG!$C$2:$W$6,14,FALSE)),\"\",VLOOKUP(C21,BDDG!$C$2:$W$6,14,FALSE))","v":"xxxxxxxxxxxxxxxxxxxxxxxxxxxxxxxxxxxx"},"xxxxxxxxxx",{"$f":" IF(ISERROR(R21/S21*86.4),\"xxxxxxxxxx\",R21/S21*86.4)","v":"xxxxxxxxxx"},{"$f":" IF(ISERROR(S21/T21*86.4),\"xxxxxxxxxx\",S21/T21*86.4)","v":"xxxxxxxxxx"},{"$f":"IF(ISERROR(VLOOKUP(C21,BDDG!$C$2:$W$6,17,FALSE)),\"\",VLOOKUP(C21,BDDG!$C$2:$W$6,17,FALSE))","v":"xxxxxxxxxxxxxxxxxxxxxxxx"},"xxxxxxxxxx",{"$f":" IF(ISERROR(V21/W21*86.4),\"xxxxxxxxxx\",V21/W21*86.4)","v":"xxxxxxxxxx"},{"$f":" IF(ISERROR(W21/X21*86.4),\"xxxxxxxxxx\",W21/X21*86.4)","v":"xxxxxxxxxx"},{"$f":"IF(ISERROR(VLOOKUP(C21,BDDG!$C$2:$W$6,20,FALSE)),\"\",VLOOKUP(C21,BDDG!$C$2:$W$6,20,FALSE))","v":3},{"$f":"IF(ISERROR(SUM(M21,Q21,U21)),\"\",SUM(M21,Q21,U21))","v":15.238095238095239},{"$f":"MONTH(A:A)","v":9},{"$f":"YEAR(A:A)","v":2015},{"$f":"IFERROR((INDEX($AA$2:AA21,MATCH(H21&MAX(IF($H$1:H20=H21,$A$1:A20)),$H$2:H21&$A$2:A21,0))-AA21)*-1,\"\")","v":-3.9619047619047603},{"$f":"IF(ISERROR(VLOOKUP(C21,BDDG!$C$2:$W$6,21,FALSE)),\"\",VLOOKUP(C21,BDDG!$C$2:$W$6,21,FALSE))","v":0}]
["2015-09-22","couvert",856,{"$f":"IF(ISNA(VLOOKUP(C22,BDDG!$C$2:$H$47,2,FALSE)),\"\",VLOOKUP(C22,BDDG!$C$2:$H$47,2,FALSE))","v":0},{"$f":"IF(ISNA(VLOOKUP(C22,BDDG!$C$3:$P$49,3,FALSE)),\"\",VLOOKUP(C22,BDDG!$C$3:$P$49,3,FALSE))","v":"pates"},{"$f":"IF(ISNA(VLOOKUP(C22,BDDG!$C$3:$P$49,4,FALSE)),\"\",VLOOKUP(C22,BDDG!$C$3:$P$49,4,FALSE))","v":106},{"$f":"IF(ISNA(VLOOKUP(C22,BDDG!$C$2:$H$47,5,FALSE)),\"\",VLOOKUP(C22,BDDG!$C$2:$H$47,5,FALSE))","v":"noisettes"},{"$f":"IF(ISNA(VLOOKUP(C22,BDDG!$C$2:$H$47,6,FALSE)),\"\",VLOOKUP(C22,BDDG!$C$2:$H$47,6,FALSE))","v":"iris"},{"$f":"IF(ISERROR(VLOOKUP(C22,BDDG!$C$2:$I$47,7,FALSE)),\"\",VLOOKUP(C22,BDDG!$C$2:$I$47,7,FALSE))","v":2},{"$f":"IF(ISERROR(VLOOKUP(C22,BDDG!$C$2:$W$6,8,FALSE)),\"\",VLOOKUP(C22,BDDG!$C$2:$W$6,8,FALSE))","v":"iris1"},2,19.75,{"$f":" IF(ISERROR(K22/L22*86.4),\"xxxxxxxxxx\",K22/L22*86.4)","v":8.7493670886075954},{"$f":"IF(ISERROR(VLOOKUP(C22,BDDG!$C$2:$W$6,11,FALSE)),\"\",VLOOKUP(C22,BDDG!$C$2:$W$6,11,FALSE))","v":"iris2"},10,11.72,{"$f":" IF(ISERROR(O22/P22*86.4),\"xxxxxxxxxx\",O22/P22*86.4)","v":73.720136518771326},{"$f":"IF(ISERROR(VLOOKUP(C22,BDDG!$C$2:$W$6,14,FALSE)),\"\",VLOOKUP(C22,BDDG!$C$2:$W$6,14,FALSE))","v":"xxxxxxxxxxxxxxxxxxxxxxxxxxxxxxxxxxxx"},"xxxxxxxxxx",{"$f":" IF(ISERROR(R22/S22*86.4),\"xxxxxxxxxx\",R22/S22*86.4)","v":"xxxxxxxxxx"},{"$f":" IF(ISERROR(S22/T22*86.4),\"xxxxxxxxxx\",S22/T22*86.4)","v":"xxxxxxxxxx"},{"$f":"IF(ISERROR(VLOOKUP(C22,BDDG!$C$2:$W$6,17,FALSE)),\"\",VLOOKUP(C22,BDDG!$C$2:$W$6,17,FALSE))","v":"xxxxxxxxxxxxxxxxxxxxxxxx"},"xxxxxxxxxx",{"$f":" IF(ISERROR(V22/W22*86.4),\"xxxxxxxxxx\",V22/W22*86.4)","v":"xxxxxxxxxx"},{"$f":" IF(ISERROR(W22/X22*86.4),\"xxxxxxxxxx\",W22/X22*86.4)","v":"xxxxxxxxxx"},{"$f":"IF(ISERROR(VLOOKUP(C22,BDDG!$C$2:$W$6,20,FALSE)),\"\",VLOOKUP(C22,BDDG!$C$2:$W$6,20,FALSE))","v":"xxxxxxxxxx"},{"$f":"IF(ISERROR(SUM(M22,Q22,U22)),\"\",SUM(M22,Q22,U22))","v":82.469503607378925},{"$f":"MONTH(A:A)","v":9},{"$f":"YEAR(A:A)","v":2015},{"$f":"IFERROR((INDEX($AA$2:AA22,MATCH(H22&MAX(IF($H$1:H21=H22,$A$1:A21)),$H$2:H22&$A$2:A22,0))-AA22)*-1,\"\")","v":-0.33569119781589052},{"$f":"IF(ISERROR(VLOOKUP(C22,BDDG!$C$2:$W$6,21,FALSE)),\"\",VLOOKUP(C22,BDDG!$C$2:$W$6,21,FALSE))","v":0}]
["2015-09-25","couvert",823,{"$f":"IF(ISNA(VLOOKUP(C23,BDDG!$C$2:$H$47,2,FALSE)),\"\",VLOOKUP(C23,BDDG!$C$2:$H$47,2,FALSE))","v":0},{"$f":"IF(ISNA(VLOOKUP(C23,BDDG!$C$3:$P$49,3,FALSE)),\"\",VLOOKUP(C23,BDDG!$C$3:$P$49,3,FALSE))","v":"frites"},{"$f":"IF(ISNA(VLOOKUP(C23,BDDG!$C$3:$P$49,4,FALSE)),\"\",VLOOKUP(C23,BDDG!$C$3:$P$49,4,FALSE))","v":104},{"$f":"IF(ISNA(VLOOKUP(C23,BDDG!$C$2:$H$47,5,FALSE)),\"\",VLOOKUP(C23,BDDG!$C$2:$H$47,5,FALSE))","v":"noix"},{"$f":"IF(ISNA(VLOOKUP(C23,BDDG!$C$2:$H$47,6,FALSE)),\"\",VLOOKUP(C23,BDDG!$C$2:$H$47,6,FALSE))","v":"rose"},{"$f":"IF(ISERROR(VLOOKUP(C23,BDDG!$C$2:$I$47,7,FALSE)),\"\",VLOOKUP(C23,BDDG!$C$2:$I$47,7,FALSE))","v":1},{"$f":"IF(ISERROR(VLOOKUP(C23,BDDG!$C$2:$W$6,8,FALSE)),\"\",VLOOKUP(C23,BDDG!$C$2:$W$6,8,FALSE))","v":"rose1"},10,41.5,{"$f":" IF(ISERROR(K23/L23*86.4),\"xxxxxxxxxx\",K23/L23*86.4)","v":20.819277108433734},{"$f":"IF(ISERROR(VLOOKUP(C23,BDDG!$C$2:$W$6,11,FALSE)),\"\",VLOOKUP(C23,BDDG!$C$2:$W$6,11,FALSE))","v":"xxxxxxxxxxxxxxxxxxxxxxxxxxxxxxxxxxxxxxxxxxxxxxx"},"xxxxxxxxxx",{"$f":" IF(ISERROR(N23/O23*86.4),\"xxxxxxxxxx\",N23/O23*86.4)","v":"xxxxxxxxxx"},{"$f":" IF(ISERROR(O23/P23*86.4),\"xxxxxxxxxx\",O23/P23*86.4)","v":"xxxxxxxxxx"},{"$f":"IF(ISERROR(VLOOKUP(C23,BDDG!$C$2:$W$6,14,FALSE)),\"\",VLOOKUP(C23,BDDG!$C$2:$W$6,14,FALSE))","v":"xxxxxxxxxxxxxxxxxxxxxxxxxxxxxxxxxxxx"},"xxxxxxxxxx",{"$f":" IF(ISERROR(R23/S23*86.4),\"xxxxxxxxxx\",R23/S23*86.4)","v":"xxxxxxxxxx"},{"$f":" IF(ISERROR(S23/T23*86.4),\"xxxxxxxxxx\",S23/T23*86.4)","v":"xxxxxxxxxx"},{"$f":"IF(ISERROR(VLOOKUP(C23,BDDG!$C$2:$W$6,17,FALSE)),\"\",VLOOKUP(C23,BDDG!$C$2:$W$6,17,FALSE))","v":"xxxxxxxxxxxxxxxxxxxxxxxx"},"xxxxxxxxxx",{"$f":" IF(ISERROR(V23/W23*86.4),\"xxxxxxxxxx\",V23/W23*86.4)","v":"xxxxxxxxxx"},{"$f":" IF(ISERROR(W23/X23*86.4),\"xxxxxxxxxx\",W23/X23*86.4)","v":"xxxxxxxxxx"},{"$f":"IF(ISERROR(VLOOKUP(C23,BDDG!$C$2:$W$6,20,FALSE)),\"\",VLOOKUP(C23,BDDG!$C$2:$W$6,20,FALSE))","v":3},{"$f":"IF(ISERROR(SUM(M23,Q23,U23)),\"\",SUM(M23,Q23,U23))","v":20.819277108433734},{"$f":"MONTH(A:A)","v":9},{"$f":"YEAR(A:A)","v":2015},{"$f":"IFERROR((INDEX($AA$2:AA23,MATCH(H23&MAX(IF($H$1:H22=H23,$A$1:A22)),$H$2:H23&$A$2:A23,0))-AA23)*-1,\"\")","v":5.5811818703384954},{"$f":"IF(ISERROR(VLOOKUP(C23,BDDG!$C$2:$W$6,21,FALSE)),\"\",VLOOKUP(C23,BDDG!$C$2:$W$6,21,FALSE))","v":0}]
["2015-11-12","Couvert",856,{"$f":"IF(ISNA(VLOOKUP(C24,BDDG!$C$2:$H$47,2,FALSE)),\"\",VLOOKUP(C24,BDDG!$C$2:$H$47,2,FALSE))","v":0},{"$f":"IF(ISNA(VLOOKUP(C24,BDDG!$C$3:$P$49,3,FALSE)),\"\",VLOOKUP(C24,BDDG!$C$3:$P$49,3,FALSE))","v":"pates"},{"$f":"IF(ISNA(VLOOKUP(C24,BDDG!$C$3:$P$49,4,FALSE)),\"\",VLOOKUP(C24,BDDG!$C$3:$P$49,4,FALSE))","v":106},{"$f":"IF(ISNA(VLOOKUP(C24,BDDG!$C$2:$H$47,5,FALSE)),\"\",VLOOKUP(C24,BDDG!$C$2:$H$47,5,FALSE))","v":"noisettes"},{"$f":"IF(ISNA(VLOOKUP(C24,BDDG!$C$2:$H$47,6,FALSE)),\"\",VLOOKUP(C24,BDDG!$C$2:$H$47,6,FALSE))","v":"iris"},{"$f":"IF(ISERROR(VLOOKUP(C24,BDDG!$C$2:$I$47,7,FALSE)),\"\",VLOOKUP(C24,BDDG!$C$2:$I$47,7,FALSE))","v":2},{"$f":"IF(ISERROR(VLOOKUP(C24,BDDG!$C$2:$W$6,8,FALSE)),\"\",VLOOKUP(C24,BDDG!$C$2:$W$6,8,FALSE))","v":"iris1"},0.1,1,{"$f":" IF(ISERROR(K24/L24*86.4),\"xxxxxxxxxx\",K24/L24*86.4)","v":8.64},{"$f":"IF(ISERROR(VLOOKUP(C24,BDDG!$C$2:$W$6,11,FALSE)),\"\",VLOOKUP(C24,BDDG!$C$2:$W$6,11,FALSE))","v":"iris2"},0.7,1,{"$f":" IF(ISERROR(O24/P24*86.4),\"xxxxxxxxxx\",O24/P24*86.4)","v":60.48},{"$f":"IF(ISERROR(VLOOKUP(C24,BDDG!$C$2:$W$6,14,FALSE)),\"\",VLOOKUP(C24,BDDG!$C$2:$W$6,14,FALSE))","v":"xxxxxxxxxxxxxxxxxxxxxxxxxxxxxxxxxxxx"},"xxxxxxxxxx",{"$f":" IF(ISERROR(R24/S24*86.4),\"xxxxxxxxxx\",R24/S24*86.4)","v":"xxxxxxxxxx"},{"$f":" IF(ISERROR(S24/T24*86.4),\"xxxxxxxxxx\",S24/T24*86.4)","v":"xxxxxxxxxx"},{"$f":"IF(ISERROR(VLOOKUP(C24,BDDG!$C$2:$W$6,17,FALSE)),\"\",VLOOKUP(C24,BDDG!$C$2:$W$6,17,FALSE))","v":"xxxxxxxxxxxxxxxxxxxxxxxx"},"xxxxxxxxxx",{"$f":" IF(ISERROR(V24/W24*86.4),\"xxxxxxxxxx\",V24/W24*86.4)","v":"xxxxxxxxxx"},{"$f":" IF(ISERROR(W24/X24*86.4),\"xxxxxxxxxx\",W24/X24*86.4)","v":"xxxxxxxxxx"},{"$f":"IF(ISERROR(VLOOKUP(C24,BDDG!$C$2:$W$6,20,FALSE)),\"\",VLOOKUP(C24,BDDG!$C$2:$W$6,20,FALSE))","v":"xxxxxxxxxx"},{"$f":"IF(ISERROR(SUM(M24,Q24,U24)),\"\",SUM(M24,Q24,U24))","v":69.12},{"$f":"MONTH(A:A)","v":11},{"$f":"YEAR(A:A)","v":2015},{"$f":"IFERROR((INDEX($AA$2:AA24,MATCH(H24&MAX(IF($H$1:H23=H24,$A$1:A23)),$H$2:H24&$A$2:A24,0))-AA24)*-1,\"\")","v":-13.349503607378921},{"$f":"IF(ISERROR(VLOOKUP(C24,BDDG!$C$2:$W$6,21,FALSE)),\"\",VLOOKUP(C24,BDDG!$C$2:$W$6,21,FALSE))","v":0}]
["2015-12-15","Couvert",856,{"$f":"IF(ISNA(VLOOKUP(C25,BDDG!$C$2:$H$47,2,FALSE)),\"\",VLOOKUP(C25,BDDG!$C$2:$H$47,2,FALSE))","v":0},{"$f":"IF(ISNA(VLOOKUP(C25,BDDG!$C$3:$P$49,3,FALSE)),\"\",VLOOKUP(C25,BDDG!$C$3:$P$49,3,FALSE))","v":"pates"},{"$f":"IF(ISNA(VLOOKUP(C25,BDDG!$C$3:$P$49,4,FALSE)),\"\",VLOOKUP(C25,BDDG!$C$3:$P$49,4,FALSE))","v":106},{"$f":"IF(ISNA(VLOOKUP(C25,BDDG!$C$2:$H$47,5,FALSE)),\"\",VLOOKUP(C25,BDDG!$C$2:$H$47,5,FALSE))","v":"noisettes"},{"$f":"IF(ISNA(VLOOKUP(C25,BDDG!$C$2:$H$47,6,FALSE)),\"\",VLOOKUP(C25,BDDG!$C$2:$H$47,6,FALSE))","v":"iris"},{"$f":"IF(ISERROR(VLOOKUP(C25,BDDG!$C$2:$I$47,7,FALSE)),\"\",VLOOKUP(C25,BDDG!$C$2:$I$47,7,FALSE))","v":2},{"$f":"IF(ISERROR(VLOOKUP(C25,BDDG!$C$2:$W$6,8,FALSE)),\"\",VLOOKUP(C25,BDDG!$C$2:$W$6,8,FALSE))","v":"iris1"},5,33.22,{"$f":" IF(ISERROR(K25/L25*86.4),\"xxxxxxxxxx\",K25/L25*86.4)","v":13.004214328717641},{"$f":"IF(ISERROR(VLOOKUP(C25,BDDG!$C$2:$W$6,11,FALSE)),\"\",VLOOKUP(C25,BDDG!$C$2:$W$6,11,FALSE))","v":"iris2"},10,13.16,{"$f":" IF(ISERROR(O25/P25*86.4),\"xxxxxxxxxx\",O25/P25*86.4)","v":65.653495440729486},{"$f":"IF(ISERROR(VLOOKUP(C25,BDDG!$C$2:$W$6,14,FALSE)),\"\",VLOOKUP(C25,BDDG!$C$2:$W$6,14,FALSE))","v":"xxxxxxxxxxxxxxxxxxxxxxxxxxxxxxxxxxxx"},"xxxxxxxxxx",{"$f":" IF(ISERROR(R25/S25*86.4),\"xxxxxxxxxx\",R25/S25*86.4)","v":"xxxxxxxxxx"},{"$f":" IF(ISERROR(S25/T25*86.4),\"xxxxxxxxxx\",S25/T25*86.4)","v":"xxxxxxxxxx"},{"$f":"IF(ISERROR(VLOOKUP(C25,BDDG!$C$2:$W$6,17,FALSE)),\"\",VLOOKUP(C25,BDDG!$C$2:$W$6,17,FALSE))","v":"xxxxxxxxxxxxxxxxxxxxxxxx"},"xxxxxxxxxx",{"$f":" IF(ISERROR(V25/W25*86.4),\"xxxxxxxxxx\",V25/W25*86.4)","v":"xxxxxxxxxx"},{"$f":" IF(ISERROR(W25/X25*86.4),\"xxxxxxxxxx\",W25/X25*86.4)","v":"xxxxxxxxxx"},{"$f":"IF(ISERROR(VLOOKUP(C25,BDDG!$C$2:$W$6,20,FALSE)),\"\",VLOOKUP(C25,BDDG!$C$2:$W$6,20,FALSE))","v":"xxxxxxxxxx"},{"$f":"IF(ISERROR(SUM(M25,Q25,U25)),\"\",SUM(M25,Q25,U25))","v":78.657709769447123},{"$f":"MONTH(A:A)","v":12},{"$f":"YEAR(A:A)","v":2015},{"$f":"IFERROR((INDEX($AA$2:AA25,MATCH(H25&MAX(IF($H$1:H24=H25,$A$1:A24)),$H$2:H25&$A$2:A25,0))-AA25)*-1,\"\")","v":9.5377097694471189},{"$f":"IF(ISERROR(VLOOKUP(C25,BDDG!$C$2:$W$6,21,FALSE)),\"\",VLOOKUP(C25,BDDG!$C$2:$W$6,21,FALSE))","v":0}]
["2015-12-18","Couvert",823,{"$f":"IF(ISNA(VLOOKUP(C26,BDDG!$C$2:$H$47,2,FALSE)),\"\",VLOOKUP(C26,BDDG!$C$2:$H$47,2,FALSE))","v":0},{"$f":"IF(ISNA(VLOOKUP(C26,BDDG!$C$3:$P$49,3,FALSE)),\"\",VLOOKUP(C26,BDDG!$C$3:$P$49,3,FALSE))","v":"frites"},{"$f":"IF(ISNA(VLOOKUP(C26,BDDG!$C$3:$P$49,4,FALSE)),\"\",VLOOKUP(C26,BDDG!$C$3:$P$49,4,FALSE))","v":104},{"$f":"IF(ISNA(VLOOKUP(C26,BDDG!$C$2:$H$47,5,FALSE)),\"\",VLOOKUP(C26,BDDG!$C$2:$H$47,5,FALSE))","v":"noix"},{"$f":"IF(ISNA(VLOOKUP(C26,BDDG!$C$2:$H$47,6,FALSE)),\"\",VLOOKUP(C26,BDDG!$C$2:$H$47,6,FALSE))","v":"rose"},{"$f":"IF(ISERROR(VLOOKUP(C26,BDDG!$C$2:$I$47,7,FALSE)),\"\",VLOOKUP(C26,BDDG!$C$2:$I$47,7,FALSE))","v":1},{"$f":"IF(ISERROR(VLOOKUP(C26,BDDG!$C$2:$W$6,8,FALSE)),\"\",VLOOKUP(C26,BDDG!$C$2:$W$6,8,FALSE))","v":"rose1"},5,27.84,{"$f":" IF(ISERROR(K26/L26*86.4),\"xxxxxxxxxx\",K26/L26*86.4)","v":15.517241379310345},{"$f":"IF(ISERROR(VLOOKUP(C26,BDDG!$C$2:$W$6,11,FALSE)),\"\",VLOOKUP(C26,BDDG!$C$2:$W$6,11,FALSE))","v":"xxxxxxxxxxxxxxxxxxxxxxxxxxxxxxxxxxxxxxxxxxxxxxx"},"xxxxxxxxxx",{"$f":" IF(ISERROR(N26/O26*86.4),\"xxxxxxxxxx\",N26/O26*86.4)","v":"xxxxxxxxxx"},{"$f":" IF(ISERROR(O26/P26*86.4),\"xxxxxxxxxx\",O26/P26*86.4)","v":"xxxxxxxxxx"},{"$f":"IF(ISERROR(VLOOKUP(C26,BDDG!$C$2:$W$6,14,FALSE)),\"\",VLOOKUP(C26,BDDG!$C$2:$W$6,14,FALSE))","v":"xxxxxxxxxxxxxxxxxxxxxxxxxxxxxxxxxxxx"},"xxxxxxxxxx",{"$f":" IF(ISERROR(R26/S26*86.4),\"xxxxxxxxxx\",R26/S26*86.4)","v":"xxxxxxxxxx"},{"$f":" IF(ISERROR(S26/T26*86.4),\"xxxxxxxxxx\",S26/T26*86.4)","v":"xxxxxxxxxx"},{"$f":"IF(ISERROR(VLOOKUP(C26,BDDG!$C$2:$W$6,17,FALSE)),\"\",VLOOKUP(C26,BDDG!$C$2:$W$6,17,FALSE))","v":"xxxxxxxxxxxxxxxxxxxxxxxx"},"xxxxxxxxxx",{"$f":" IF(ISERROR(V26/W26*86.4),\"xxxxxxxxxx\",V26/W26*86.4)","v":"xxxxxxxxxx"},{"$f":" IF(ISERROR(W26/X26*86.4),\"xxxxxxxxxx\",W26/X26*86.4)","v":"xxxxxxxxxx"},{"$f":"IF(ISERROR(VLOOKUP(C26,BDDG!$C$2:$W$6,20,FALSE)),\"\",VLOOKUP(C26,BDDG!$C$2:$W$6,20,FALSE))","v":3},{"$f":"IF(ISERROR(SUM(M26,Q26,U26)),\"\",SUM(M26,Q26,U26))","v":15.517241379310345},{"$f":"MONTH(A:A)","v":12},{"$f":"YEAR(A:A)","v":2015},{"$f":"IFERROR((INDEX($AA$2:AA26,MATCH(H26&MAX(IF($H$1:H25=H26,$A$1:A25)),$H$2:H26&$A$2:A26,0))-AA26)*-1,\"\")","v":-5.3020357291233893},{"$f":"IF(ISERROR(VLOOKUP(C26,BDDG!$C$2:$W$6,21,FALSE)),\"\",VLOOKUP(C26,BDDG!$C$2:$W$6,21,FALSE))","v":0}]
["2015-12-31","Couvert",823,{"$f":"IF(ISNA(VLOOKUP(C27,BDDG!$C$2:$H$47,2,FALSE)),\"\",VLOOKUP(C27,BDDG!$C$2:$H$47,2,FALSE))","v":0},{"$f":"IF(ISNA(VLOOKUP(C27,BDDG!$C$3:$P$49,3,FALSE)),\"\",VLOOKUP(C27,BDDG!$C$3:$P$49,3,FALSE))","v":"frites"},{"$f":"IF(ISNA(VLOOKUP(C27,BDDG!$C$3:$P$49,4,FALSE)),\"\",VLOOKUP(C27,BDDG!$C$3:$P$49,4,FALSE))","v":104},{"$f":"IF(ISNA(VLOOKUP(C27,BDDG!$C$2:$H$47,5,FALSE)),\"\",VLOOKUP(C27,BDDG!$C$2:$H$47,5,FALSE))","v":"noix"},{"$f":"IF(ISNA(VLOOKUP(C27,BDDG!$C$2:$H$47,6,FALSE)),\"\",VLOOKUP(C27,BDDG!$C$2:$H$47,6,FALSE))","v":"rose"},{"$f":"IF(ISERROR(VLOOKUP(C27,BDDG!$C$2:$I$47,7,FALSE)),\"\",VLOOKUP(C27,BDDG!$C$2:$I$47,7,FALSE))","v":1},{"$f":"IF(ISERROR(VLOOKUP(C27,BDDG!$C$2:$W$6,8,FALSE)),\"\",VLOOKUP(C27,BDDG!$C$2:$W$6,8,FALSE))","v":"rose1"},12,70.400000000000006,{"$f":" IF(ISERROR(K27/L27*86.4),\"xxxxxxxxxx\",K27/L27*86.4)","v":14.727272727272727},{"$f":"IF(ISERROR(VLOOKUP(C27,BDDG!$C$2:$W$6,11,FALSE)),\"\",VLOOKUP(C27,BDDG!$C$2:$W$6,11,FALSE))","v":"xxxxxxxxxxxxxxxxxxxxxxxxxxxxxxxxxxxxxxxxxxxxxxx"},"xxxxxxxxxx",{"$f":" IF(ISERROR(N27/O27*86.4),\"xxxxxxxxxx\",N27/O27*86.4)","v":"xxxxxxxxxx"},{"$f":" IF(ISERROR(O27/P27*86.4),\"xxxxxxxxxx\",O27/P27*86.4)","v":"xxxxxxxxxx"},{"$f":"IF(ISERROR(VLOOKUP(C27,BDDG!$C$2:$W$6,14,FALSE)),\"\",VLOOKUP(C27,BDDG!$C$2:$W$6,14,FALSE))","v":"xxxxxxxxxxxxxxxxxxxxxxxxxxxxxxxxxxxx"},"xxxxxxxxxx",{"$f":" IF(ISERROR(R27/S27*86.4),\"xxxxxxxxxx\",R27/S27*86.4)","v":"xxxxxxxxxx"},{"$f":" IF(ISERROR(S27/T27*86.4),\"xxxxxxxxxx\",S27/T27*86.4)","v":"xxxxxxxxxx"},{"$f":"IF(ISERROR(VLOOKUP(C27,BDDG!$C$2:$W$6,17,FALSE)),\"\",VLOOKUP(C27,BDDG!$C$2:$W$6,17,FALSE))","v":"xxxxxxxxxxxxxxxxxxxxxxxx"},"xxxxxxxxxx",{"$f":" IF(ISERROR(V27/W27*86.4),\"xxxxxxxxxx\",V27/W27*86.4)","v":"xxxxxxxxxx"},{"$f":" IF(ISERROR(W27/X27*86.4),\"xxxxxxxxxx\",W27/X27*86.4)","v":"xxxxxxxxxx"},{"$f":"IF(ISERROR(VLOOKUP(C27,BDDG!$C$2:$W$6,20,FALSE)),\"\",VLOOKUP(C27,BDDG!$C$2:$W$6,20,FALSE))","v":3},{"$f":"IF(ISERROR(SUM(M27,Q27,U27)),\"\",SUM(M27,Q27,U27))","v":14.727272727272727},{"$f":"MONTH(A:A)","v":12},{"$f":"YEAR(A:A)","v":2015},{"$f":"IFERROR((INDEX($AA$2:AA27,MATCH(H27&MAX(IF($H$1:H26=H27,$A$1:A26)),$H$2:H27&$A$2:A27,0))-AA27)*-1,\"\")","v":-0.78996865203761857},{"$f":"IF(ISERROR(VLOOKUP(C27,BDDG!$C$2:$W$6,21,FALSE)),\"\",VLOOKUP(C27,BDDG!$C$2:$W$6,21,FALSE))","v":0}]
["2016-01-27","?",856,{"$f":"IF(ISNA(VLOOKUP(C28,BDDG!$C$2:$H$47,2,FALSE)),\"\",VLOOKUP(C28,BDDG!$C$2:$H$47,2,FALSE))","v":0},{"$f":"IF(ISNA(VLOOKUP(C28,BDDG!$C$3:$P$49,3,FALSE)),\"\",VLOOKUP(C28,BDDG!$C$3:$P$49,3,FALSE))","v":"pates"},{"$f":"IF(ISNA(VLOOKUP(C28,BDDG!$C$3:$P$49,4,FALSE)),\"\",VLOOKUP(C28,BDDG!$C$3:$P$49,4,FALSE))","v":106},{"$f":"IF(ISNA(VLOOKUP(C28,BDDG!$C$2:$H$47,5,FALSE)),\"\",VLOOKUP(C28,BDDG!$C$2:$H$47,5,FALSE))","v":"noisettes"},{"$f":"IF(ISNA(VLOOKUP(C28,BDDG!$C$2:$H$47,6,FALSE)),\"\",VLOOKUP(C28,BDDG!$C$2:$H$47,6,FALSE))","v":"iris"},{"$f":"IF(ISERROR(VLOOKUP(C28,BDDG!$C$2:$I$47,7,FALSE)),\"\",VLOOKUP(C28,BDDG!$C$2:$I$47,7,FALSE))","v":2},{"$f":"IF(ISERROR(VLOOKUP(C28,BDDG!$C$2:$W$6,8,FALSE)),\"\",VLOOKUP(C28,BDDG!$C$2:$W$6,8,FALSE))","v":"iris1"},12,36,{"$f":" IF(ISERROR(K28/L28*86.4),\"xxxxxxxxxx\",K28/L28*86.4)","v":28.8},{"$f":"IF(ISERROR(VLOOKUP(C28,BDDG!$C$2:$W$6,11,FALSE)),\"\",VLOOKUP(C28,BDDG!$C$2:$W$6,11,FALSE))","v":"iris2"},10,2.1,{"$f":" IF(ISERROR(O28/P28*86.4),\"xxxxxxxxxx\",O28/P28*86.4)","v":411.42857142857144},{"$f":"IF(ISERROR(VLOOKUP(C28,BDDG!$C$2:$W$6,14,FALSE)),\"\",VLOOKUP(C28,BDDG!$C$2:$W$6,14,FALSE))","v":"xxxxxxxxxxxxxxxxxxxxxxxxxxxxxxxxxxxx"},"xxxxxxxxxx",{"$f":" IF(ISERROR(R28/S28*86.4),\"xxxxxxxxxx\",R28/S28*86.4)","v":"xxxxxxxxxx"},{"$f":" IF(ISERROR(S28/T28*86.4),\"xxxxxxxxxx\",S28/T28*86.4)","v":"xxxxxxxxxx"},{"$f":"IF(ISERROR(VLOOKUP(C28,BDDG!$C$2:$W$6,17,FALSE)),\"\",VLOOKUP(C28,BDDG!$C$2:$W$6,17,FALSE))","v":"xxxxxxxxxxxxxxxxxxxxxxxx"},"xxxxxxxxxx",{"$f":" IF(ISERROR(V28/W28*86.4),\"xxxxxxxxxx\",V28/W28*86.4)","v":"xxxxxxxxxx"},{"$f":" IF(ISERROR(W28/X28*86.4),\"xxxxxxxxxx\",W28/X28*86.4)","v":"xxxxxxxxxx"},{"$f":"IF(ISERROR(VLOOKUP(C28,BDDG!$C$2:$W$6,20,FALSE)),\"\",VLOOKUP(C28,BDDG!$C$2:$W$6,20,FALSE))","v":"xxxxxxxxxx"},{"$f":"IF(ISERROR(SUM(M28,Q28,U28)),\"\",SUM(M28,Q28,U28))","v":440.22857142857146},{"$f":"MONTH(A:A)","v":1},{"$f":"YEAR(A:A)","v":2016},{"$f":"IFERROR((INDEX($AA$2:AA28,MATCH(H28&MAX(IF($H$1:H27=H28,$A$1:A27)),$H$2:H28&$A$2:A28,0))-AA28)*-1,\"\")","v":361.57086165912432},{"$f":"IF(ISERROR(VLOOKUP(C28,BDDG!$C$2:$W$6,21,FALSE)),\"\",VLOOKUP(C28,BDDG!$C$2:$W$6,21,FALSE))","v":0}]
["2016-02-24","Couvert",823,{"$f":"IF(ISNA(VLOOKUP(C29,BDDG!$C$2:$H$47,2,FALSE)),\"\",VLOOKUP(C29,BDDG!$C$2:$H$47,2,FALSE))","v":0},{"$f":"IF(ISNA(VLOOKUP(C29,BDDG!$C$3:$P$49,3,FALSE)),\"\",VLOOKUP(C29,BDDG!$C$3:$P$49,3,FALSE))","v":"frites"},{"$f":"IF(ISNA(VLOOKUP(C29,BDDG!$C$3:$P$49,4,FALSE)),\"\",VLOOKUP(C29,BDDG!$C$3:$P$49,4,FALSE))","v":104},{"$f":"IF(ISNA(VLOOKUP(C29,BDDG!$C$2:$H$47,5,FALSE)),\"\",VLOOKUP(C29,BDDG!$C$2:$H$47,5,FALSE))","v":"noix"},{"$f":"IF(ISNA(VLOOKUP(C29,BDDG!$C$2:$H$47,6,FALSE)),\"\",VLOOKUP(C29,BDDG!$C$2:$H$47,6,FALSE))","v":"rose"},{"$f":"IF(ISERROR(VLOOKUP(C29,BDDG!$C$2:$I$47,7,FALSE)),\"\",VLOOKUP(C29,BDDG!$C$2:$I$47,7,FALSE))","v":1},{"$f":"IF(ISERROR(VLOOKUP(C29,BDDG!$C$2:$W$6,8,FALSE)),\"\",VLOOKUP(C29,BDDG!$C$2:$W$6,8,FALSE))","v":"rose1"},12,19.13,{"$f":" IF(ISERROR(K29/L29*86.4),\"xxxxxxxxxx\",K29/L29*86.4)","v":54.197595399895462},{"$f":"IF(ISERROR(VLOOKUP(C29,BDDG!$C$2:$W$6,11,FALSE)),\"\",VLOOKUP(C29,BDDG!$C$2:$W$6,11,FALSE))","v":"xxxxxxxxxxxxxxxxxxxxxxxxxxxxxxxxxxxxxxxxxxxxxxx"},"xxxxxxxxxx",{"$f":" IF(ISERROR(N29/O29*86.4),\"xxxxxxxxxx\",N29/O29*86.4)","v":"xxxxxxxxxx"},{"$f":" IF(ISERROR(O29/P29*86.4),\"xxxxxxxxxx\",O29/P29*86.4)","v":"xxxxxxxxxx"},{"$f":"IF(ISERROR(VLOOKUP(C29,BDDG!$C$2:$W$6,14,FALSE)),\"\",VLOOKUP(C29,BDDG!$C$2:$W$6,14,FALSE))","v":"xxxxxxxxxxxxxxxxxxxxxxxxxxxxxxxxxxxx"},"xxxxxxxxxx",{"$f":" IF(ISERROR(R29/S29*86.4),\"xxxxxxxxxx\",R29/S29*86.4)","v":"xxxxxxxxxx"},{"$f":" IF(ISERROR(S29/T29*86.4),\"xxxxxxxxxx\",S29/T29*86.4)","v":"xxxxxxxxxx"},{"$f":"IF(ISERROR(VLOOKUP(C29,BDDG!$C$2:$W$6,17,FALSE)),\"\",VLOOKUP(C29,BDDG!$C$2:$W$6,17,FALSE))","v":"xxxxxxxxxxxxxxxxxxxxxxxx"},"xxxxxxxxxx",{"$f":" IF(ISERROR(V29/W29*86.4),\"xxxxxxxxxx\",V29/W29*86.4)","v":"xxxxxxxxxx"},{"$f":" IF(ISERROR(W29/X29*86.4),\"xxxxxxxxxx\",W29/X29*86.4)","v":"xxxxxxxxxx"},{"$f":"IF(ISERROR(VLOOKUP(C29,BDDG!$C$2:$W$6,20,FALSE)),\"\",VLOOKUP(C29,BDDG!$C$2:$W$6,20,FALSE))","v":3},{"$f":"IF(ISERROR(SUM(M29,Q29,U29)),\"\",SUM(M29,Q29,U29))","v":54.197595399895462},{"$f":"MONTH(A:A)","v":2},{"$f":"YEAR(A:A)","v":2016},{"$f":"IFERROR((INDEX($AA$2:AA29,MATCH(H29&MAX(IF($H$1:H28=H29,$A$1:A28)),$H$2:H29&$A$2:A29,0))-AA29)*-1,\"\")","v":39.470322672622736},{"$f":"IF(ISERROR(VLOOKUP(C29,BDDG!$C$2:$W$6,21,FALSE)),\"\",VLOOKUP(C29,BDDG!$C$2:$W$6,21,FALSE))","v":0}]
["2016-03-01","Froid",856,{"$f":"IF(ISNA(VLOOKUP(C30,BDDG!$C$2:$H$47,2,FALSE)),\"\",VLOOKUP(C30,BDDG!$C$2:$H$47,2,FALSE))","v":0},{"$f":"IF(ISNA(VLOOKUP(C30,BDDG!$C$3:$P$49,3,FALSE)),\"\",VLOOKUP(C30,BDDG!$C$3:$P$49,3,FALSE))","v":"pates"},{"$f":"IF(ISNA(VLOOKUP(C30,BDDG!$C$3:$P$49,4,FALSE)),\"\",VLOOKUP(C30,BDDG!$C$3:$P$49,4,FALSE))","v":106},{"$f":"IF(ISNA(VLOOKUP(C30,BDDG!$C$2:$H$47,5,FALSE)),\"\",VLOOKUP(C30,BDDG!$C$2:$H$47,5,FALSE))","v":"noisettes"},{"$f":"IF(ISNA(VLOOKUP(C30,BDDG!$C$2:$H$47,6,FALSE)),\"\",VLOOKUP(C30,BDDG!$C$2:$H$47,6,FALSE))","v":"iris"},{"$f":"IF(ISERROR(VLOOKUP(C30,BDDG!$C$2:$I$47,7,FALSE)),\"\",VLOOKUP(C30,BDDG!$C$2:$I$47,7,FALSE))","v":2},{"$f":"IF(ISERROR(VLOOKUP(C30,BDDG!$C$2:$W$6,8,FALSE)),\"\",VLOOKUP(C30,BDDG!$C$2:$W$6,8,FALSE))","v":"iris1"},12,14.72,{"$f":" IF(ISERROR(K30/L30*86.4),\"xxxxxxxxxx\",K30/L30*86.4)","v":70.434782608695656},{"$f":"IF(ISERROR(VLOOKUP(C30,BDDG!$C$2:$W$6,11,FALSE)),\"\",VLOOKUP(C30,BDDG!$C$2:$W$6,11,FALSE))","v":"iris2"},12,1.48,{"$f":" IF(ISERROR(O30/P30*86.4),\"xxxxxxxxxx\",O30/P30*86.4)","v":700.54054054054063},{"$f":"IF(ISERROR(VLOOKUP(C30,BDDG!$C$2:$W$6,14,FALSE)),\"\",VLOOKUP(C30,BDDG!$C$2:$W$6,14,FALSE))","v":"xxxxxxxxxxxxxxxxxxxxxxxxxxxxxxxxxxxx"},"xxxxxxxxxx",{"$f":" IF(ISERROR(R30/S30*86.4),\"xxxxxxxxxx\",R30/S30*86.4)","v":"xxxxxxxxxx"},{"$f":" IF(ISERROR(S30/T30*86.4),\"xxxxxxxxxx\",S30/T30*86.4)","v":"xxxxxxxxxx"},{"$f":"IF(ISERROR(VLOOKUP(C30,BDDG!$C$2:$W$6,17,FALSE)),\"\",VLOOKUP(C30,BDDG!$C$2:$W$6,17,FALSE))","v":"xxxxxxxxxxxxxxxxxxxxxxxx"},"xxxxxxxxxx",{"$f":" IF(ISERROR(V30/W30*86.4),\"xxxxxxxxxx\",V30/W30*86.4)","v":"xxxxxxxxxx"},{"$f":" IF(ISERROR(W30/X30*86.4),\"xxxxxxxxxx\",W30/X30*86.4)","v":"xxxxxxxxxx"},{"$f":"IF(ISERROR(VLOOKUP(C30,BDDG!$C$2:$W$6,20,FALSE)),\"\",VLOOKUP(C30,BDDG!$C$2:$W$6,20,FALSE))","v":"xxxxxxxxxx"},{"$f":"IF(ISERROR(SUM(M30,Q30,U30)),\"\",SUM(M30,Q30,U30))","v":770.97532314923626},{"$f":"MONTH(A:A)","v":3},{"$f":"YEAR(A:A)","v":2016},{"$f":"IFERROR((INDEX($AA$2:AA30,MATCH(H30&MAX(IF($H$1:H29=H30,$A$1:A29)),$H$2:H30&$A$2:A30,0))-AA30)*-1,\"\")","v":330.7467517206648},{"$f":"IF(ISERROR(VLOOKUP(C30,BDDG!$C$2:$W$6,21,FALSE)),\"\",VLOOKUP(C30,BDDG!$C$2:$W$6,21,FALSE))","v":0}]
["2016-05-10","Soleil",856,{"$f":"IF(ISNA(VLOOKUP(C31,BDDG!$C$2:$H$47,2,FALSE)),\"\",VLOOKUP(C31,BDDG!$C$2:$H$47,2,FALSE))","v":0},{"$f":"IF(ISNA(VLOOKUP(C31,BDDG!$C$3:$P$49,3,FALSE)),\"\",VLOOKUP(C31,BDDG!$C$3:$P$49,3,FALSE))","v":"pates"},{"$f":"IF(ISNA(VLOOKUP(C31,BDDG!$C$3:$P$49,4,FALSE)),\"\",VLOOKUP(C31,BDDG!$C$3:$P$49,4,FALSE))","v":106},{"$f":"IF(ISNA(VLOOKUP(C31,BDDG!$C$2:$H$47,5,FALSE)),\"\",VLOOKUP(C31,BDDG!$C$2:$H$47,5,FALSE))","v":"noisettes"},{"$f":"IF(ISNA(VLOOKUP(C31,BDDG!$C$2:$H$47,6,FALSE)),\"\",VLOOKUP(C31,BDDG!$C$2:$H$47,6,FALSE))","v":"iris"},{"$f":"IF(ISERROR(VLOOKUP(C31,BDDG!$C$2:$I$47,7,FALSE)),\"\",VLOOKUP(C31,BDDG!$C$2:$I$47,7,FALSE))","v":2},{"$f":"IF(ISERROR(VLOOKUP(C31,BDDG!$C$2:$W$6,8,FALSE)),\"\",VLOOKUP(C31,BDDG!$C$2:$W$6,8,FALSE))","v":"iris1"},12,33.47,{"$f":" IF(ISERROR(K31/L31*86.4),\"xxxxxxxxxx\",K31/L31*86.4)","v":30.976994323274578},{"$f":"IF(ISERROR(VLOOKUP(C31,BDDG!$C$2:$W$6,11,FALSE)),\"\",VLOOKUP(C31,BDDG!$C$2:$W$6,11,FALSE))","v":"iris2"},12,2.81,{"$f":" IF(ISERROR(O31/P31*86.4),\"xxxxxxxxxx\",O31/P31*86.4)","v":368.96797153024909},{"$f":"IF(ISERROR(VLOOKUP(C31,BDDG!$C$2:$W$6,14,FALSE)),\"\",VLOOKUP(C31,BDDG!$C$2:$W$6,14,FALSE))","v":"xxxxxxxxxxxxxxxxxxxxxxxxxxxxxxxxxxxx"},"xxxxxxxxxx",{"$f":" IF(ISERROR(R31/S31*86.4),\"xxxxxxxxxx\",R31/S31*86.4)","v":"xxxxxxxxxx"},{"$f":" IF(ISERROR(S31/T31*86.4),\"xxxxxxxxxx\",S31/T31*86.4)","v":"xxxxxxxxxx"},{"$f":"IF(ISERROR(VLOOKUP(C31,BDDG!$C$2:$W$6,17,FALSE)),\"\",VLOOKUP(C31,BDDG!$C$2:$W$6,17,FALSE))","v":"xxxxxxxxxxxxxxxxxxxxxxxx"},"xxxxxxxxxx",{"$f":" IF(ISERROR(V31/W31*86.4),\"xxxxxxxxxx\",V31/W31*86.4)","v":"xxxxxxxxxx"},{"$f":" IF(ISERROR(W31/X31*86.4),\"xxxxxxxxxx\",W31/X31*86.4)","v":"xxxxxxxxxx"},{"$f":"IF(ISERROR(VLOOKUP(C31,BDDG!$C$2:$W$6,20,FALSE)),\"\",VLOOKUP(C31,BDDG!$C$2:$W$6,20,FALSE))","v":"xxxxxxxxxx"},{"$f":"IF(ISERROR(SUM(M31,Q31,U31)),\"\",SUM(M31,Q31,U31))","v":399.94496585352368},{"$f":"MONTH(A:A)","v":5},{"$f":"YEAR(A:A)","v":2016},{"$f":"IFERROR((INDEX($AA$2:AA31,MATCH(H31&MAX(IF($H$1:H30=H31,$A$1:A30)),$H$2:H31&$A$2:A31,0))-AA31)*-1,\"\")","v":-371.03035729571258},{"$f":"IF(ISERROR(VLOOKUP(C31,BDDG!$C$2:$W$6,21,FALSE)),\"\",VLOOKUP(C31,BDDG!$C$2:$W$6,21,FALSE))","v":0}]
["2016-05-13","Pluie",823,{"$f":"IF(ISNA(VLOOKUP(C32,BDDG!$C$2:$H$47,2,FALSE)),\"\",VLOOKUP(C32,BDDG!$C$2:$H$47,2,FALSE))","v":0},{"$f":"IF(ISNA(VLOOKUP(C32,BDDG!$C$3:$P$49,3,FALSE)),\"\",VLOOKUP(C32,BDDG!$C$3:$P$49,3,FALSE))","v":"frites"},{"$f":"IF(ISNA(VLOOKUP(C32,BDDG!$C$3:$P$49,4,FALSE)),\"\",VLOOKUP(C32,BDDG!$C$3:$P$49,4,FALSE))","v":104},{"$f":"IF(ISNA(VLOOKUP(C32,BDDG!$C$2:$H$47,5,FALSE)),\"\",VLOOKUP(C32,BDDG!$C$2:$H$47,5,FALSE))","v":"noix"},{"$f":"IF(ISNA(VLOOKUP(C32,BDDG!$C$2:$H$47,6,FALSE)),\"\",VLOOKUP(C32,BDDG!$C$2:$H$47,6,FALSE))","v":"rose"},{"$f":"IF(ISERROR(VLOOKUP(C32,BDDG!$C$2:$I$47,7,FALSE)),\"\",VLOOKUP(C32,BDDG!$C$2:$I$47,7,FALSE))","v":1},{"$f":"IF(ISERROR(VLOOKUP(C32,BDDG!$C$2:$W$6,8,FALSE)),\"\",VLOOKUP(C32,BDDG!$C$2:$W$6,8,FALSE))","v":"rose1"},12,15.34,{"$f":" IF(ISERROR(K32/L32*86.4),\"xxxxxxxxxx\",K32/L32*86.4)","v":67.588005215123857},{"$f":"IF(ISERROR(VLOOKUP(C32,BDDG!$C$2:$W$6,11,FALSE)),\"\",VLOOKUP(C32,BDDG!$C$2:$W$6,11,FALSE))","v":"xxxxxxxxxxxxxxxxxxxxxxxxxxxxxxxxxxxxxxxxxxxxxxx"},"xxxxxxxxxx",{"$f":" IF(ISERROR(N32/O32*86.4),\"xxxxxxxxxx\",N32/O32*86.4)","v":"xxxxxxxxxx"},{"$f":" IF(ISERROR(O32/P32*86.4),\"xxxxxxxxxx\",O32/P32*86.4)","v":"xxxxxxxxxx"},{"$f":"IF(ISERROR(VLOOKUP(C32,BDDG!$C$2:$W$6,14,FALSE)),\"\",VLOOKUP(C32,BDDG!$C$2:$W$6,14,FALSE))","v":"xxxxxxxxxxxxxxxxxxxxxxxxxxxxxxxxxxxx"},"xxxxxxxxxx",{"$f":" IF(ISERROR(R32/S32*86.4),\"xxxxxxxxxx\",R32/S32*86.4)","v":"xxxxxxxxxx"},{"$f":" IF(ISERROR(S32/T32*86.4),\"xxxxxxxxxx\",S32/T32*86.4)","v":"xxxxxxxxxx"},{"$f":"IF(ISERROR(VLOOKUP(C32,BDDG!$C$2:$W$6,17,FALSE)),\"\",VLOOKUP(C32,BDDG!$C$2:$W$6,17,FALSE))","v":"xxxxxxxxxxxxxxxxxxxxxxxx"},"xxxxxxxxxx",{"$f":" IF(ISERROR(V32/W32*86.4),\"xxxxxxxxxx\",V32/W32*86.4)","v":"xxxxxxxxxx"},{"$f":" IF(ISERROR(W32/X32*86.4),\"xxxxxxxxxx\",W32/X32*86.4)","v":"xxxxxxxxxx"},{"$f":"IF(ISERROR(VLOOKUP(C32,BDDG!$C$2:$W$6,20,FALSE)),\"\",VLOOKUP(C32,BDDG!$C$2:$W$6,20,FALSE))","v":3},{"$f":"IF(ISERROR(SUM(M32,Q32,U32)),\"\",SUM(M32,Q32,U32))","v":67.588005215123857},{"$f":"MONTH(A:A)","v":5},{"$f":"YEAR(A:A)","v":2016},{"$f":"IFERROR((INDEX($AA$2:AA32,MATCH(H32&MAX(IF($H$1:H31=H32,$A$1:A31)),$H$2:H32&$A$2:A32,0))-AA32)*-1,\"\")","v":13.390409815228395},{"$f":"IF(ISERROR(VLOOKUP(C32,BDDG!$C$2:$W$6,21,FALSE)),\"\",VLOOKUP(C32,BDDG!$C$2:$W$6,21,FALSE))","v":0}]
["2016-07-01","Soleil",823,{"$f":"IF(ISNA(VLOOKUP(C33,BDDG!$C$2:$H$47,2,FALSE)),\"\",VLOOKUP(C33,BDDG!$C$2:$H$47,2,FALSE))","v":0},{"$f":"IF(ISNA(VLOOKUP(C33,BDDG!$C$3:$P$49,3,FALSE)),\"\",VLOOKUP(C33,BDDG!$C$3:$P$49,3,FALSE))","v":"frites"},{"$f":"IF(ISNA(VLOOKUP(C33,BDDG!$C$3:$P$49,4,FALSE)),\"\",VLOOKUP(C33,BDDG!$C$3:$P$49,4,FALSE))","v":104},{"$f":"IF(ISNA(VLOOKUP(C33,BDDG!$C$2:$H$47,5,FALSE)),\"\",VLOOKUP(C33,BDDG!$C$2:$H$47,5,FALSE))","v":"noix"},{"$f":"IF(ISNA(VLOOKUP(C33,BDDG!$C$2:$H$47,6,FALSE)),\"\",VLOOKUP(C33,BDDG!$C$2:$H$47,6,FALSE))","v":"rose"},{"$f":"IF(ISERROR(VLOOKUP(C33,BDDG!$C$2:$I$47,7,FALSE)),\"\",VLOOKUP(C33,BDDG!$C$2:$I$47,7,FALSE))","v":1},{"$f":"IF(ISERROR(VLOOKUP(C33,BDDG!$C$2:$W$6,8,FALSE)),\"\",VLOOKUP(C33,BDDG!$C$2:$W$6,8,FALSE))","v":"rose1"},12,15.47,{"$f":" IF(ISERROR(K33/L33*86.4),\"xxxxxxxxxx\",K33/L33*86.4)","v":67.020038784744671},{"$f":"IF(ISERROR(VLOOKUP(C33,BDDG!$C$2:$W$6,11,FALSE)),\"\",VLOOKUP(C33,BDDG!$C$2:$W$6,11,FALSE))","v":"xxxxxxxxxxxxxxxxxxxxxxxxxxxxxxxxxxxxxxxxxxxxxxx"},"xxxxxxxxxx",{"$f":" IF(ISERROR(N33/O33*86.4),\"xxxxxxxxxx\",N33/O33*86.4)","v":"xxxxxxxxxx"},{"$f":" IF(ISERROR(O33/P33*86.4),\"xxxxxxxxxx\",O33/P33*86.4)","v":"xxxxxxxxxx"},{"$f":"IF(ISERROR(VLOOKUP(C33,BDDG!$C$2:$W$6,14,FALSE)),\"\",VLOOKUP(C33,BDDG!$C$2:$W$6,14,FALSE))","v":"xxxxxxxxxxxxxxxxxxxxxxxxxxxxxxxxxxxx"},"xxxxxxxxxx",{"$f":" IF(ISERROR(R33/S33*86.4),\"xxxxxxxxxx\",R33/S33*86.4)","v":"xxxxxxxxxx"},{"$f":" IF(ISERROR(S33/T33*86.4),\"xxxxxxxxxx\",S33/T33*86.4)","v":"xxxxxxxxxx"},{"$f":"IF(ISERROR(VLOOKUP(C33,BDDG!$C$2:$W$6,17,FALSE)),\"\",VLOOKUP(C33,BDDG!$C$2:$W$6,17,FALSE))","v":"xxxxxxxxxxxxxxxxxxxxxxxx"},"xxxxxxxxxx",{"$f":" IF(ISERROR(V33/W33*86.4),\"xxxxxxxxxx\",V33/W33*86.4)","v":"xxxxxxxxxx"},{"$f":" IF(ISERROR(W33/X33*86.4),\"xxxxxxxxxx\",W33/X33*86.4)","v":"xxxxxxxxxx"},{"$f":"IF(ISERROR(VLOOKUP(C33,BDDG!$C$2:$W$6,20,FALSE)),\"\",VLOOKUP(C33,BDDG!$C$2:$W$6,20,FALSE))","v":3},{"$f":"IF(ISERROR(SUM(M33,Q33,U33)),\"\",SUM(M33,Q33,U33))","v":67.020038784744671},{"$f":"MONTH(A:A)","v":7},{"$f":"YEAR(A:A)","v":2016},{"$f":"IFERROR((INDEX($AA$2:AA33,MATCH(H33&MAX(IF($H$1:H32=H33,$A$1:A32)),$H$2:H33&$A$2:A33,0))-AA33)*-1,\"\")","v":-0.5679664303791867},{"$f":"IF(ISERROR(VLOOKUP(C33,BDDG!$C$2:$W$6,21,FALSE)),\"\",VLOOKUP(C33,BDDG!$C$2:$W$6,21,FALSE))","v":0}]
["2016-07-05","Soleil",856,{"$f":"IF(ISNA(VLOOKUP(C34,BDDG!$C$2:$H$47,2,FALSE)),\"\",VLOOKUP(C34,BDDG!$C$2:$H$47,2,FALSE))","v":0},{"$f":"IF(ISNA(VLOOKUP(C34,BDDG!$C$3:$P$49,3,FALSE)),\"\",VLOOKUP(C34,BDDG!$C$3:$P$49,3,FALSE))","v":"pates"},{"$f":"IF(ISNA(VLOOKUP(C34,BDDG!$C$3:$P$49,4,FALSE)),\"\",VLOOKUP(C34,BDDG!$C$3:$P$49,4,FALSE))","v":106},{"$f":"IF(ISNA(VLOOKUP(C34,BDDG!$C$2:$H$47,5,FALSE)),\"\",VLOOKUP(C34,BDDG!$C$2:$H$47,5,FALSE))","v":"noisettes"},{"$f":"IF(ISNA(VLOOKUP(C34,BDDG!$C$2:$H$47,6,FALSE)),\"\",VLOOKUP(C34,BDDG!$C$2:$H$47,6,FALSE))","v":"iris"},{"$f":"IF(ISERROR(VLOOKUP(C34,BDDG!$C$2:$I$47,7,FALSE)),\"\",VLOOKUP(C34,BDDG!$C$2:$I$47,7,FALSE))","v":2},{"$f":"IF(ISERROR(VLOOKUP(C34,BDDG!$C$2:$W$6,8,FALSE)),\"\",VLOOKUP(C34,BDDG!$C$2:$W$6,8,FALSE))","v":"iris1"},12,42.35,{"$f":" IF(ISERROR(K34/L34*86.4),\"xxxxxxxxxx\",K34/L34*86.4)","v":24.481700118063753},{"$f":"IF(ISERROR(VLOOKUP(C34,BDDG!$C$2:$W$6,11,FALSE)),\"\",VLOOKUP(C34,BDDG!$C$2:$W$6,11,FALSE))","v":"iris2"},12,3.12,{"$f":" IF(ISERROR(O34/P34*86.4),\"xxxxxxxxxx\",O34/P34*86.4)","v":332.30769230769232},{"$f":"IF(ISERROR(VLOOKUP(C34,BDDG!$C$2:$W$6,14,FALSE)),\"\",VLOOKUP(C34,BDDG!$C$2:$W$6,14,FALSE))","v":"xxxxxxxxxxxxxxxxxxxxxxxxxxxxxxxxxxxx"},"xxxxxxxxxx",{"$f":" IF(ISERROR(R34/S34*86.4),\"xxxxxxxxxx\",R34/S34*86.4)","v":"xxxxxxxxxx"},{"$f":" IF(ISERROR(S34/T34*86.4),\"xxxxxxxxxx\",S34/T34*86.4)","v":"xxxxxxxxxx"},{"$f":"IF(ISERROR(VLOOKUP(C34,BDDG!$C$2:$W$6,17,FALSE)),\"\",VLOOKUP(C34,BDDG!$C$2:$W$6,17,FALSE))","v":"xxxxxxxxxxxxxxxxxxxxxxxx"},"xxxxxxxxxx",{"$f":" IF(ISERROR(V34/W34*86.4),\"xxxxxxxxxx\",V34/W34*86.4)","v":"xxxxxxxxxx"},{"$f":" IF(ISERROR(W34/X34*86.4),\"xxxxxxxxxx\",W34/X34*86.4)","v":"xxxxxxxxxx"},{"$f":"IF(ISERROR(VLOOKUP(C34,BDDG!$C$2:$W$6,20,FALSE)),\"\",VLOOKUP(C34,BDDG!$C$2:$W$6,20,FALSE))","v":"xxxxxxxxxx"},{"$f":"IF(ISERROR(SUM(M34,Q34,U34)),\"\",SUM(M34,Q34,U34))","v":356.78939242575609},{"$f":"MONTH(A:A)","v":7},{"$f":"YEAR(A:A)","v":2016},{"$f":"IFERROR((INDEX($AA$2:AA34,MATCH(H34&MAX(IF($H$1:H33=H34,$A$1:A33)),$H$2:H34&$A$2:A34,0))-AA34)*-1,\"\")","v":-43.155573427767592},{"$f":"IF(ISERROR(VLOOKUP(C34,BDDG!$C$2:$W$6,21,FALSE)),\"\",VLOOKUP(C34,BDDG!$C$2:$W$6,21,FALSE))","v":0}]
["2016-08-03","Soleil",856,{"$f":"IF(ISNA(VLOOKUP(C35,BDDG!$C$2:$H$47,2,FALSE)),\"\",VLOOKUP(C35,BDDG!$C$2:$H$47,2,FALSE))","v":0},{"$f":"IF(ISNA(VLOOKUP(C35,BDDG!$C$3:$P$49,3,FALSE)),\"\",VLOOKUP(C35,BDDG!$C$3:$P$49,3,FALSE))","v":"pates"},{"$f":"IF(ISNA(VLOOKUP(C35,BDDG!$C$3:$P$49,4,FALSE)),\"\",VLOOKUP(C35,BDDG!$C$3:$P$49,4,FALSE))","v":106},{"$f":"IF(ISNA(VLOOKUP(C35,BDDG!$C$2:$H$47,5,FALSE)),\"\",VLOOKUP(C35,BDDG!$C$2:$H$47,5,FALSE))","v":"noisettes"},{"$f":"IF(ISNA(VLOOKUP(C35,BDDG!$C$2:$H$47,6,FALSE)),\"\",VLOOKUP(C35,BDDG!$C$2:$H$47,6,FALSE))","v":"iris"},{"$f":"IF(ISERROR(VLOOKUP(C35,BDDG!$C$2:$I$47,7,FALSE)),\"\",VLOOKUP(C35,BDDG!$C$2:$I$47,7,FALSE))","v":2},{"$f":"IF(ISERROR(VLOOKUP(C35,BDDG!$C$2:$W$6,8,FALSE)),\"\",VLOOKUP(C35,BDDG!$C$2:$W$6,8,FALSE))","v":"iris1"},5,34.69,{"$f":" IF(ISERROR(K35/L35*86.4),\"xxxxxxxxxx\",K35/L35*86.4)","v":12.453156529259154},{"$f":"IF(ISERROR(VLOOKUP(C35,BDDG!$C$2:$W$6,11,FALSE)),\"\",VLOOKUP(C35,BDDG!$C$2:$W$6,11,FALSE))","v":"iris2"},12,6.59,{"$f":" IF(ISERROR(O35/P35*86.4),\"xxxxxxxxxx\",O35/P35*86.4)","v":157.32928679817906},{"$f":"IF(ISERROR(VLOOKUP(C35,BDDG!$C$2:$W$6,14,FALSE)),\"\",VLOOKUP(C35,BDDG!$C$2:$W$6,14,FALSE))","v":"xxxxxxxxxxxxxxxxxxxxxxxxxxxxxxxxxxxx"},"xxxxxxxxxx",{"$f":" IF(ISERROR(R35/S35*86.4),\"xxxxxxxxxx\",R35/S35*86.4)","v":"xxxxxxxxxx"},{"$f":" IF(ISERROR(S35/T35*86.4),\"xxxxxxxxxx\",S35/T35*86.4)","v":"xxxxxxxxxx"},{"$f":"IF(ISERROR(VLOOKUP(C35,BDDG!$C$2:$W$6,17,FALSE)),\"\",VLOOKUP(C35,BDDG!$C$2:$W$6,17,FALSE))","v":"xxxxxxxxxxxxxxxxxxxxxxxx"},"xxxxxxxxxx",{"$f":" IF(ISERROR(V35/W35*86.4),\"xxxxxxxxxx\",V35/W35*86.4)","v":"xxxxxxxxxx"},{"$f":" IF(ISERROR(W35/X35*86.4),\"xxxxxxxxxx\",W35/X35*86.4)","v":"xxxxxxxxxx"},{"$f":"IF(ISERROR(VLOOKUP(C35,BDDG!$C$2:$W$6,20,FALSE)),\"\",VLOOKUP(C35,BDDG!$C$2:$W$6,20,FALSE))","v":"xxxxxxxxxx"},{"$f":"IF(ISERROR(SUM(M35,Q35,U35)),\"\",SUM(M35,Q35,U35))","v":169.78244332743822},{"$f":"MONTH(A:A)","v":8},{"$f":"YEAR(A:A)","v":2016},{"$f":"IFERROR((INDEX($AA$2:AA35,MATCH(H35&MAX(IF($H$1:H34=H35,$A$1:A34)),$H$2:H35&$A$2:A35,0))-AA35)*-1,\"\")","v":-187.00694909831788},{"$f":"IF(ISERROR(VLOOKUP(C35,BDDG!$C$2:$W$6,21,FALSE)),\"\",VLOOKUP(C35,BDDG!$C$2:$W$6,21,FALSE))","v":0}]
["2016-08-05","Couvert",823,{"$f":"IF(ISNA(VLOOKUP(C36,BDDG!$C$2:$H$47,2,FALSE)),\"\",VLOOKUP(C36,BDDG!$C$2:$H$47,2,FALSE))","v":0},{"$f":"IF(ISNA(VLOOKUP(C36,BDDG!$C$3:$P$49,3,FALSE)),\"\",VLOOKUP(C36,BDDG!$C$3:$P$49,3,FALSE))","v":"frites"},{"$f":"IF(ISNA(VLOOKUP(C36,BDDG!$C$3:$P$49,4,FALSE)),\"\",VLOOKUP(C36,BDDG!$C$3:$P$49,4,FALSE))","v":104},{"$f":"IF(ISNA(VLOOKUP(C36,BDDG!$C$2:$H$47,5,FALSE)),\"\",VLOOKUP(C36,BDDG!$C$2:$H$47,5,FALSE))","v":"noix"},{"$f":"IF(ISNA(VLOOKUP(C36,BDDG!$C$2:$H$47,6,FALSE)),\"\",VLOOKUP(C36,BDDG!$C$2:$H$47,6,FALSE))","v":"rose"},{"$f":"IF(ISERROR(VLOOKUP(C36,BDDG!$C$2:$I$47,7,FALSE)),\"\",VLOOKUP(C36,BDDG!$C$2:$I$47,7,FALSE))","v":1},{"$f":"IF(ISERROR(VLOOKUP(C36,BDDG!$C$2:$W$6,8,FALSE)),\"\",VLOOKUP(C36,BDDG!$C$2:$W$6,8,FALSE))","v":"rose1"},12,40.22,{"$f":" IF(ISERROR(K36/L36*86.4),\"xxxxxxxxxx\",K36/L36*86.4)","v":25.778219791148686},{"$f":"IF(ISERROR(VLOOKUP(C36,BDDG!$C$2:$W$6,11,FALSE)),\"\",VLOOKUP(C36,BDDG!$C$2:$W$6,11,FALSE))","v":"xxxxxxxxxxxxxxxxxxxxxxxxxxxxxxxxxxxxxxxxxxxxxxx"},"xxxxxxxxxx",{"$f":" IF(ISERROR(N36/O36*86.4),\"xxxxxxxxxx\",N36/O36*86.4)","v":"xxxxxxxxxx"},{"$f":" IF(ISERROR(O36/P36*86.4),\"xxxxxxxxxx\",O36/P36*86.4)","v":"xxxxxxxxxx"},{"$f":"IF(ISERROR(VLOOKUP(C36,BDDG!$C$2:$W$6,14,FALSE)),\"\",VLOOKUP(C36,BDDG!$C$2:$W$6,14,FALSE))","v":"xxxxxxxxxxxxxxxxxxxxxxxxxxxxxxxxxxxx"},"xxxxxxxxxx",{"$f":" IF(ISERROR(R36/S36*86.4),\"xxxxxxxxxx\",R36/S36*86.4)","v":"xxxxxxxxxx"},{"$f":" IF(ISERROR(S36/T36*86.4),\"xxxxxxxxxx\",S36/T36*86.4)","v":"xxxxxxxxxx"},{"$f":"IF(ISERROR(VLOOKUP(C36,BDDG!$C$2:$W$6,17,FALSE)),\"\",VLOOKUP(C36,BDDG!$C$2:$W$6,17,FALSE))","v":"xxxxxxxxxxxxxxxxxxxxxxxx"},"xxxxxxxxxx",{"$f":" IF(ISERROR(V36/W36*86.4),\"xxxxxxxxxx\",V36/W36*86.4)","v":"xxxxxxxxxx"},{"$f":" IF(ISERROR(W36/X36*86.4),\"xxxxxxxxxx\",W36/X36*86.4)","v":"xxxxxxxxxx"},{"$f":"IF(ISERROR(VLOOKUP(C36,BDDG!$C$2:$W$6,20,FALSE)),\"\",VLOOKUP(C36,BDDG!$C$2:$W$6,20,FALSE))","v":3},{"$f":"IF(ISERROR(SUM(M36,Q36,U36,Y29)),\"\",SUM(M36,Q36,U36,Y29))","v":25.778219791148686},{"$f":"MONTH(A:A)","v":8},{"$f":"YEAR(A:A)","v":2016},{"$f":"IFERROR((INDEX($AA$2:AA36,MATCH(H36&MAX(IF($H$1:H35=H36,$A$1:A35)),$H$2:H36&$A$2:A36,0))-AA36)*-1,\"\")","v":-41.241818993595984},{"$f":"IF(ISERROR(VLOOKUP(C36,BDDG!$C$2:$W$6,21,FALSE)),\"\",VLOOKUP(C36,BDDG!$C$2:$W$6,21,FALSE))","v":0}]
["2016-08-26","Sécheresse",823,{"$f":"IF(ISNA(VLOOKUP(C37,BDDG!$C$2:$H$47,2,FALSE)),\"\",VLOOKUP(C37,BDDG!$C$2:$H$47,2,FALSE))","v":0},{"$f":"IF(ISNA(VLOOKUP(C37,BDDG!$C$3:$P$49,3,FALSE)),\"\",VLOOKUP(C37,BDDG!$C$3:$P$49,3,FALSE))","v":"frites"},{"$f":"IF(ISNA(VLOOKUP(C37,BDDG!$C$3:$P$49,4,FALSE)),\"\",VLOOKUP(C37,BDDG!$C$3:$P$49,4,FALSE))","v":104},{"$f":"IF(ISNA(VLOOKUP(C37,BDDG!$C$2:$H$47,5,FALSE)),\"\",VLOOKUP(C37,BDDG!$C$2:$H$47,5,FALSE))","v":"noix"},{"$f":"IF(ISNA(VLOOKUP(C37,BDDG!$C$2:$H$47,6,FALSE)),\"\",VLOOKUP(C37,BDDG!$C$2:$H$47,6,FALSE))","v":"rose"},{"$f":"IF(ISERROR(VLOOKUP(C37,BDDG!$C$2:$I$47,7,FALSE)),\"\",VLOOKUP(C37,BDDG!$C$2:$I$47,7,FALSE))","v":1},{"$f":"IF(ISERROR(VLOOKUP(C37,BDDG!$C$2:$W$6,8,FALSE)),\"\",VLOOKUP(C37,BDDG!$C$2:$W$6,8,FALSE))","v":"rose1"},12,48,{"$f":" IF(ISERROR(K37/L37*86.4),\"xxxxxxxxxx\",K37/L37*86.4)","v":21.6},{"$f":"IF(ISERROR(VLOOKUP(C37,BDDG!$C$2:$W$6,11,FALSE)),\"\",VLOOKUP(C37,BDDG!$C$2:$W$6,11,FALSE))","v":"xxxxxxxxxxxxxxxxxxxxxxxxxxxxxxxxxxxxxxxxxxxxxxx"},"xxxxxxxxxx",{"$f":" IF(ISERROR(N37/O37*86.4),\"xxxxxxxxxx\",N37/O37*86.4)","v":"xxxxxxxxxx"},{"$f":" IF(ISERROR(O37/P37*86.4),\"xxxxxxxxxx\",O37/P37*86.4)","v":"xxxxxxxxxx"},{"$f":"IF(ISERROR(VLOOKUP(C37,BDDG!$C$2:$W$6,14,FALSE)),\"\",VLOOKUP(C37,BDDG!$C$2:$W$6,14,FALSE))","v":"xxxxxxxxxxxxxxxxxxxxxxxxxxxxxxxxxxxx"},"xxxxxxxxxx",{"$f":" IF(ISERROR(R37/S37*86.4),\"xxxxxxxxxx\",R37/S37*86.4)","v":"xxxxxxxxxx"},{"$f":" IF(ISERROR(S37/T37*86.4),\"xxxxxxxxxx\",S37/T37*86.4)","v":"xxxxxxxxxx"},{"$f":"IF(ISERROR(VLOOKUP(C37,BDDG!$C$2:$W$6,17,FALSE)),\"\",VLOOKUP(C37,BDDG!$C$2:$W$6,17,FALSE))","v":"xxxxxxxxxxxxxxxxxxxxxxxx"},"xxxxxxxxxx",{"$f":" IF(ISERROR(V37/W37*86.4),\"xxxxxxxxxx\",V37/W37*86.4)","v":"xxxxxxxxxx"},{"$f":" IF(ISERROR(W37/X37*86.4),\"xxxxxxxxxx\",W37/X37*86.4)","v":"xxxxxxxxxx"},{"$f":"IF(ISERROR(VLOOKUP(C37,BDDG!$C$2:$W$6,20,FALSE)),\"\",VLOOKUP(C37,BDDG!$C$2:$W$6,20,FALSE))","v":3},{"$f":"IF(ISERROR(SUM(M37,Q37,U37,Y30)),\"\",SUM(M37,Q37,U37,Y30))","v":21.6},{"$f":"MONTH(A:A)","v":8},{"$f":"YEAR(A:A)","v":2016},{"$f":"IFERROR((INDEX($AA$2:AA37,MATCH(H37&MAX(IF($H$1:H36=H37,$A$1:A36)),$H$2:H37&$A$2:A37,0))-AA37)*-1,\"\")","v":-4.1782197911486847},{"$f":"IF(ISERROR(VLOOKUP(C37,BDDG!$C$2:$W$6,21,FALSE)),\"\",VLOOKUP(C37,BDDG!$C$2:$W$6,21,FALSE))","v":0}]
["2016-08-31","Sécheresse",856,{"$f":"IF(ISNA(VLOOKUP(C38,BDDG!$C$2:$H$47,2,FALSE)),\"\",VLOOKUP(C38,BDDG!$C$2:$H$47,2,FALSE))","v":0},{"$f":"IF(ISNA(VLOOKUP(C38,BDDG!$C$3:$P$49,3,FALSE)),\"\",VLOOKUP(C38,BDDG!$C$3:$P$49,3,FALSE))","v":"pates"},{"$f":"IF(ISNA(VLOOKUP(C38,BDDG!$C$3:$P$49,4,FALSE)),\"\",VLOOKUP(C38,BDDG!$C$3:$P$49,4,FALSE))","v":106},{"$f":"IF(ISNA(VLOOKUP(C38,BDDG!$C$2:$H$47,5,FALSE)),\"\",VLOOKUP(C38,BDDG!$C$2:$H$47,5,FALSE))","v":"noisettes"},{"$f":"IF(ISNA(VLOOKUP(C38,BDDG!$C$2:$H$47,6,FALSE)),\"\",VLOOKUP(C38,BDDG!$C$2:$H$47,6,FALSE))","v":"iris"},{"$f":"IF(ISERROR(VLOOKUP(C38,BDDG!$C$2:$I$47,7,FALSE)),\"\",VLOOKUP(C38,BDDG!$C$2:$I$47,7,FALSE))","v":2},{"$f":"IF(ISERROR(VLOOKUP(C38,BDDG!$C$2:$W$6,8,FALSE)),\"\",VLOOKUP(C38,BDDG!$C$2:$W$6,8,FALSE))","v":"iris1"},5,45.47,{"$f":" IF(ISERROR(K38/L38*86.4),\"xxxxxxxxxx\",K38/L38*86.4)","v":9.5007697382889837},{"$f":"IF(ISERROR(VLOOKUP(C38,BDDG!$C$2:$W$6,11,FALSE)),\"\",VLOOKUP(C38,BDDG!$C$2:$W$6,11,FALSE))","v":"iris2"},12,8.25,{"$f":" IF(ISERROR(O38/P38*86.4),\"xxxxxxxxxx\",O38/P38*86.4)","v":125.67272727272729},{"$f":"IF(ISERROR(VLOOKUP(C38,BDDG!$C$2:$W$6,14,FALSE)),\"\",VLOOKUP(C38,BDDG!$C$2:$W$6,14,FALSE))","v":"xxxxxxxxxxxxxxxxxxxxxxxxxxxxxxxxxxxx"},"xxxxxxxxxx",{"$f":" IF(ISERROR(R38/S38*86.4),\"xxxxxxxxxx\",R38/S38*86.4)","v":"xxxxxxxxxx"},{"$f":" IF(ISERROR(S38/T38*86.4),\"xxxxxxxxxx\",S38/T38*86.4)","v":"xxxxxxxxxx"},{"$f":"IF(ISERROR(VLOOKUP(C38,BDDG!$C$2:$W$6,17,FALSE)),\"\",VLOOKUP(C38,BDDG!$C$2:$W$6,17,FALSE))","v":"xxxxxxxxxxxxxxxxxxxxxxxx"},"xxxxxxxxxx",{"$f":" IF(ISERROR(V38/W38*86.4),\"xxxxxxxxxx\",V38/W38*86.4)","v":"xxxxxxxxxx"},{"$f":" IF(ISERROR(W38/X38*86.4),\"xxxxxxxxxx\",W38/X38*86.4)","v":"xxxxxxxxxx"},{"$f":"IF(ISERROR(VLOOKUP(C38,BDDG!$C$2:$W$6,20,FALSE)),\"\",VLOOKUP(C38,BDDG!$C$2:$W$6,20,FALSE))","v":"xxxxxxxxxx"},{"$f":"IF(ISERROR(SUM(M38,Q38,U38)),\"\",SUM(M38,Q38,U38))","v":135.17349701101628},{"$f":"MONTH(A:A)","v":8},{"$f":"YEAR(A:A)","v":2016},{"$f":"IFERROR((INDEX($AA$2:AA38,MATCH(H38&MAX(IF($H$1:H37=H38,$A$1:A37)),$H$2:H38&$A$2:A38,0))-AA38)*-1,\"\")","v":-34.608946316421935},{"$f":"IF(ISERROR(VLOOKUP(C38,BDDG!$C$2:$W$6,21,FALSE)),\"\",VLOOKUP(C38,BDDG!$C$2:$W$6,21,FALSE))","v":0}]
["2016-11-15","Froid",823,{"$f":"IF(ISNA(VLOOKUP(C39,BDDG!$C$2:$H$47,2,FALSE)),\"\",VLOOKUP(C39,BDDG!$C$2:$H$47,2,FALSE))","v":0},{"$f":"IF(ISNA(VLOOKUP(C39,BDDG!$C$3:$P$49,3,FALSE)),\"\",VLOOKUP(C39,BDDG!$C$3:$P$49,3,FALSE))","v":"frites"},{"$f":"IF(ISNA(VLOOKUP(C39,BDDG!$C$3:$P$49,4,FALSE)),\"\",VLOOKUP(C39,BDDG!$C$3:$P$49,4,FALSE))","v":104},{"$f":"IF(ISNA(VLOOKUP(C39,BDDG!$C$2:$H$47,5,FALSE)),\"\",VLOOKUP(C39,BDDG!$C$2:$H$47,5,FALSE))","v":"noix"},{"$f":"IF(ISNA(VLOOKUP(C39,BDDG!$C$2:$H$47,6,FALSE)),\"\",VLOOKUP(C39,BDDG!$C$2:$H$47,6,FALSE))","v":"rose"},{"$f":"IF(ISERROR(VLOOKUP(C39,BDDG!$C$2:$I$47,7,FALSE)),\"\",VLOOKUP(C39,BDDG!$C$2:$I$47,7,FALSE))","v":1},{"$f":"IF(ISERROR(VLOOKUP(C39,BDDG!$C$2:$W$6,8,FALSE)),\"\",VLOOKUP(C39,BDDG!$C$2:$W$6,8,FALSE))","v":"rose1"},5,26.96,{"$f":" IF(ISERROR(K39/L39*86.4),\"xxxxxxxxxx\",K39/L39*86.4)","v":16.023738872403563},{"$f":"IF(ISERROR(VLOOKUP(C39,BDDG!$C$2:$W$6,11,FALSE)),\"\",VLOOKUP(C39,BDDG!$C$2:$W$6,11,FALSE))","v":"xxxxxxxxxxxxxxxxxxxxxxxxxxxxxxxxxxxxxxxxxxxxxxx"},"xxxxxxxxx","xxxxxxxxx",{"$f":" IF(ISERROR(O39/P39*86.4),\"xxxxxxxxxx\",O39/P39*86.4)","v":"xxxxxxxxxx"},{"$f":"IF(ISERROR(VLOOKUP(C39,BDDG!$C$2:$W$6,14,FALSE)),\"\",VLOOKUP(C39,BDDG!$C$2:$W$6,14,FALSE))","v":"xxxxxxxxxxxxxxxxxxxxxxxxxxxxxxxxxxxx"},"xxxxxxxxx","xxxxxxxxx",{"$f":" IF(ISERROR(S39/T39*86.4),\"xxxxxxxxxx\",S39/T39*86.4)","v":"xxxxxxxxxx"},{"$f":"IF(ISERROR(VLOOKUP(C39,BDDG!$C$2:$W$6,17,FALSE)),\"\",VLOOKUP(C39,BDDG!$C$2:$W$6,17,FALSE))","v":"xxxxxxxxxxxxxxxxxxxxxxxx"},"xxxxxxxxx","xxxxxxxxx",{"$f":" IF(ISERROR(W39/X39*86.4),\"xxxxxxxxxx\",W39/X39*86.4)","v":"xxxxxxxxxx"},{"$f":"IF(ISERROR(VLOOKUP(C39,BDDG!$C$2:$W$6,20,FALSE)),\"\",VLOOKUP(C39,BDDG!$C$2:$W$6,20,FALSE))","v":3},{"$f":"IF(ISERROR(SUM(M39,Q39,U39,Y32)),\"\",SUM(M39,Q39,U39,Y32))","v":16.023738872403563},{"$f":"MONTH(A:A)","v":11},{"$f":"YEAR(A:A)","v":2016},{"$f":"IFERROR((INDEX($AA$2:AA40,MATCH(H39&MAX(IF($H$1:H38=H39,$A$1:A38)),$H$2:H40&$A$2:A40,0))-AA39)*-1,\"\")","v":-5.5762611275964389}]
["2016-11-24","froid",823,{"$f":"IF(ISNA(VLOOKUP(C40,BDDG!$C$2:$H$47,2,FALSE)),\"\",VLOOKUP(C40,BDDG!$C$2:$H$47,2,FALSE))","v":0},{"$f":"IF(ISNA(VLOOKUP(C40,BDDG!$C$3:$P$49,3,FALSE)),\"\",VLOOKUP(C40,BDDG!$C$3:$P$49,3,FALSE))","v":"frites"},{"$f":"IF(ISNA(VLOOKUP(C40,BDDG!$C$3:$P$49,4,FALSE)),\"\",VLOOKUP(C40,BDDG!$C$3:$P$49,4,FALSE))","v":104},{"$f":"IF(ISNA(VLOOKUP(C40,BDDG!$C$2:$H$47,5,FALSE)),\"\",VLOOKUP(C40,BDDG!$C$2:$H$47,5,FALSE))","v":"noix"},{"$f":"IF(ISNA(VLOOKUP(C40,BDDG!$C$2:$H$47,6,FALSE)),\"\",VLOOKUP(C40,BDDG!$C$2:$H$47,6,FALSE))","v":"rose"},{"$f":"IF(ISERROR(VLOOKUP(C40,BDDG!$C$2:$I$47,7,FALSE)),\"\",VLOOKUP(C40,BDDG!$C$2:$I$47,7,FALSE))","v":1},{"$f":"IF(ISERROR(VLOOKUP(C40,BDDG!$C$2:$W$6,8,FALSE)),\"\",VLOOKUP(C40,BDDG!$C$2:$W$6,8,FALSE))","v":"rose1"},null,null,{"$f":" IF(ISERROR(K40/L40*86.4),\"xxxxxxxxxx\",K40/L40*86.4)","v":"xxxxxxxxxx"},{"$f":"IF(ISERROR(VLOOKUP(C40,BDDG!$C$2:$W$6,11,FALSE)),\"\",VLOOKUP(C40,BDDG!$C$2:$W$6,11,FALSE))","v":"xxxxxxxxxxxxxxxxxxxxxxxxxxxxxxxxxxxxxxxxxxxxxxx"},"xxxxxxxxx","xxxxxxxxx",{"$f":" IF(ISERROR(O40/P40*86.4),\"xxxxxxxxxx\",O40/P40*86.4)","v":"xxxxxxxxxx"},{"$f":"IF(ISERROR(VLOOKUP(C40,BDDG!$C$2:$W$6,14,FALSE)),\"\",VLOOKUP(C40,BDDG!$C$2:$W$6,14,FALSE))","v":"xxxxxxxxxxxxxxxxxxxxxxxxxxxxxxxxxxxx"},"xxxxxxxxx","xxxxxxxxx",{"$f":" IF(ISERROR(S40/T40*86.4),\"xxxxxxxxxx\",S40/T40*86.4)","v":"xxxxxxxxxx"},{"$f":"IF(ISERROR(VLOOKUP(C40,BDDG!$C$2:$W$6,17,FALSE)),\"\",VLOOKUP(C40,BDDG!$C$2:$W$6,17,FALSE))","v":"xxxxxxxxxxxxxxxxxxxxxxxx"},"xxxxxxxxx","xxxxxxxxx",{"$f":" IF(ISERROR(W40/X40*86.4),\"xxxxxxxxxx\",W40/X40*86.4)","v":"xxxxxxxxxx"},{"$f":"IF(ISERROR(VLOOKUP(C40,BDDG!$C$2:$W$6,20,FALSE)),\"\",VLOOKUP(C40,BDDG!$C$2:$W$6,20,FALSE))","v":3},null,{"$f":"MONTH(A:A)","v":11},{"$f":"YEAR(A:A)","v":2016},{"$f":"IFERROR((INDEX($AA$2:AA40,MATCH(H40&MAX(IF($H$1:H39=H40,$A$1:A39)),$H$2:H40&$A$2:A40,0))-AA40)*-1,\"\")","v":-16.023738872403563}]

{"sheet":"BDDG","index":1,"n_rows":1611,"n_cols":24,"rows_kept":1611,"cut":false,"hidden":false,"merged":[]}
[null,null,1,2,3,4,5,6,7,8,9,10,11,12,13,14,15,16,17,18,19,20,21]
["Date "," Météo","Code","peche","pomme","prune","citron","poire","kiwi","truc1","Vol 1","Temps 1","truc2","Vol 2","Temps 2","truc3","Vol 3","Temps 3","truc4","Vol 4","Temps 4","Seuil alerte","Observation(s) "]
[null,null,823,0,"frites",104,"noix","rose",1,"rose1",null,null,"xxxxxxxxxxxxxxxxxxxxxxxxxxxxxxxxxxxxxxxxxxxxxxx","xxxxxxxxx","xxxxxxxxx","xxxxxxxxxxxxxxxxxxxxxxxxxxxxxxxxxxxx","xxxxxxxxx","xxxxxxxxx","xxxxxxxxxxxxxxxxxxxxxxxx","xxxxxxxxx","xxxxxxxxx",3]
[null,null,856,0,"pates",106,"noisettes","iris",2,"iris1",null,null,"iris2",null,null,"xxxxxxxxxxxxxxxxxxxxxxxxxxxxxxxxxxxx","xxxxxxxxx","xxxxxxxxx","xxxxxxxxxxxxxxxxxxxxxxxx","xxxxxxxxx","xxxxxxxxx","xxxxxxxxxx"]
[]
[]
[]
[]
[]
[]
[]
[]
[]
[]
[]
[]
[]
[]
[]
[]
[]
[]
[]
[]
[]
[]
[]
[]
[]
[]
[]
[]
[]
[]
[]
[]
[]
[]
[]
[]
[]
[]
[]
[]
[]
[]
[]
[]
[]
[]
[]
[]
[]
[]
[]
[]
[]
[]
[]
[]
[]
[]
[]
[]
[]
[]
[]
[]
[]
[]
[]
[]
[]
[]
[]
[]
[]
[]
[]
[]
[]
[]
[]
[]
[]
[]
[]
[]
[]
[]
[]
[]
[]
[]
[]
[]
[]
[]
[]
[]
[]
[]
[]
[]
[]
[]
[]
[]
[]
[]
[]
[]
[]
[]
[]
[]
[]
[]
[]
[]
[]
[]
[]
[]
[]
[]
[]
[]
[]
[]
[]
[]
[]
[]
[]
[]
[]
[]
[]
[]
[]
[]
[]
[]
[]
[]
[]
[]
[]
[]
[]
[]
[]
[]
[]
[]
[]
[]
[]
[]
[]
[]
[]
[]
[]
[]
[]
[]
[]
[]
[]
[]
[]
[]
[]
[]
[]
[]
[]
[]
[]
[]
[]
[]
[]
[]
[]
[]
[]
[]
[]
[]
[]
[]
[]
[]
[]
[]
[]
[]
[]
[]
[]
[]
[]
[]
[]
[]
[]
[]
[]
[]
[]
[]
[]
[]
[]
[]
[]
[]
[]
[]
[]
[]
[]
[]
[]
[]
[]
[]
[]
[]
[]
[]
[]
[]
[]
[]
[]
[]
[]
[]
[]
[]
[]
[]
[]
[]
[]
[]
[]
[]
[]
[]
[]
[]
[]
[]
[]
[]
[]
[]
[]
[]
[]
[]
[]
[]
[]
[]
[]
[]
[]
[]
[]
[]
[]
[]
[]
[]
[]
[]
[]
[]
[]
[]
[]
[]
[]
[]
[]
[]
[]
[]
[]
[]
[]
[]
[]
[]
[]
[]
[]
[]
[]
[]
[]
[]
[]
[]
[]
[]
[]
[]
[]
[]
[]
[]
[]
[]
[]
[]
[]
[]
[]
[]
[]
[]
[]
[]
[]
[]
[]
[]
[]
[]
[]
[]
[]
[]
[]
[]
[]
[]
[]
[]
[]
[]
[]
[]
[]
[]
[]
[]
[]
[]
[]
[]
[]
[]
[]
[]
[]
[]
[]
[]
[]
[]
[]
[]
[]
[]
[]
[]
[]
[]
[]
[]
[]
[]
[]
[]
[]
[]
[]
[]
[]
[]
[]
[]
[]
[]
[]
[]
[]
[]
[]
[]
[]
[]
[]
[]
[]
[]
[]
[]
[]
[]
[]
[]
[]
[]
[]
[]
[]
[]
[]
[]
[]
[]
[]
[]
[]
[]
[]
[]
[]
[]
[]
[]
[]
[]
[]
[]
[]
[]
[]
[]
[]
[]
[]
[]
[]
[]
[]
[]
[]
[]
[]
[]
[]
[]
[]
[]
[]
[]
[]
[]
[]
[]
[]
[]
[]
[]
[]
[]
[]
[]
[]
[]
[]
[]
[]
[]
[]
[]
[]
[]
[]
[]
[]
[]
[]
[]
[]
[]
[]
[]
[]
[]
[]
[]
[]
[]
[]
[]
[]
[]
[]
[]
[]
[]
[]
[]
[]
[]
[]
[]
[]
[]
[]
[]
[]
[]
[]
[]
[]
[]
[]
[]
[]
[]
[]
[]
[]
[]
[]
[]
[]
[]
[]
[]
[]
[]
[]
[]
[]
[]
[]
[]
[]
[]
[]
[]
[]
[]
[]
[]
[]
[]
[]
[]
[]
[]
[]
[]
[]
[]
[]
[]
[]
[]
[]
[]
[]
[]
[]
[]
[]
[]
[]
[]
[]
[]
[]
[]
[]
[]
[]
[]
[]
[]
[]
[]
[]
[]
[]
[]
[]
[]
[]
[]
[]
[]
[]
[]
[]
[]
[]
[]
[]
[]
[]
[]
[]
[]
[]
[]
[]
[]
[]
[]
[]
[]
[]
[]
[]
[]
[]
[]
[]
[]
[]
[]
[]
[]
[]
[]
[]
[]
[]
[]
[]
[]
[]
[]
[]
[]
[]
[]
[]
[]
[]
[]
[]
[]
[]
[]
[]
[]
[]
[]
[]
[]
[]
[]
[]
[]
[]
[]
[]
[]
[]
[]
[]
[]
[]
[]
[]
[]
[]
[]
[]
[]
[]
[]
[]
[]
[]
[]
[]
[]
[]
[]
[]
[]
[]
[]
[]
[]
[]
[]
[]
[]
[]
[]
[]
[]
[]
[]
[]
[]
[]
[]
[]
[]
[]
[]
[]
[]
[]
[]
[]
[]
[]
[]
[]
[]
[]
[]
[]
[]
[]
[]
[]
[]
[]
[]
[]
[]
[]
[]
[]
[]
[]
[]
[]
[]
[]
[]
[]
[]
[]
[]
[]
[]
[]
[]
[]
[]
[]
[]
[]
[]
[]
[]
[]
[]
[]
[]
[]
[]
[]
[]
[]
[]
[]
[]
[]
[]
[]
[]
[]
[]
[]
[]
[]
[]
[]
[]
[]
[]
[]
[]
[]
[]
[]
[]
[]
[]
[]
[]
[]
[]
[]
[]
[]
[]
[]
[]
[]
[]
[]
[]
[]
[]
[]
[]
[]
[]
[]
[]
[]
[]
[]
[]
[]
[]
[]
[]
[]
[]
[]
[]
[]
[]
[]
[]
[]
[]
[]
[]
[]
[]
[]
[]
[]
[]
[]
[]
[]
[]
[]
[]
[]
[]
[]
[]
[]
[]
[]
[]
[]
[]
[]
[]
[]
[]
[]
[]
[]
[]
[]
[]
[]
[]
[]
[]
[]
[]
[]
[]
[]
[]
[]
[]
[]
[]
[]
[]
[]
[]
[]
[]
[]
[]
[]
[]
[]
[]
[]
[]
[]
[]
[]
[]
[]
[]
[]
[]
[]
[]
[]
[]
[]
[]
[]
[]
[]
[]
[]
[]
[]
[]
[]
[]
[]
[]
[]
[]
[]
[]
[]
[]
[]
[]
[]
[]
[]
[]
[]
[]
[]
[]
[]
[]
[]
[]
[]
[]
[]
[]
[]
[]
[]
[]
[]
[]
[]
[]
[]
[]
[]
[]
[]
[]
[]
[]
[]
[]
[]
[]
[]
[]
[]
[]
[]
[]
[]
[]
[]
[]
[]
[]
[]
[]
[]
[]
[]
[]
[]
[]
[]
[]
[]
[]
[]
[]
[]
[]
[]
[]
[]
[]
[]
[]
[]
[]
[]
[]
[]
[]
[]
[]
[]
[]
[]
[]
[]
[]
[]
[]
[]
[]
[]
[]
[]
[]
[]
[]
[]
[]
[]
[]
[]
[]
[]
[]
[]
[]
[]
[]
[]
[]
[]
[]
[]
[]
[]
[]
[]
[]
[]
[]
[]
[]
[]
[]
[]
[]
[]
[]
[]
[]
[]
[]
[]
[]
[]
[]
[]
[]
[]
[]
[]
[]
[]
[]
[]
[]
[]
[]
[]
[]
[]
[]
[]
[]
[]
[]
[]
[]
[]
[]
[]
[]
[]
[]
[]
[]
[]
[]
[]
[]
[]
[]
[]
[]
[]
[]
[]
[]
[]
[]
[]
[]
[]
[]
[]
[]
[]
[]
[]
[]
[]
[]
[]
[]
[]
[]
[]
[]
[]
[]
[]
[]
[]
[]
[]
[]
[]
[]
[]
[]
[]
[]
[]
[]
[]
[]
[]
[]
[]
[]
[]
[]
[]
[]
[]
[]
[]
[]
[]
[]
[]
[]
[]
[]
[]
[]
[]
[]
[]
[]
[]
[]
[]
[]
[]
[]
[]
[]
[]
[]
[]
[]
[]
[]
[]
[]
[]
[]
[]
[]
[]
[]
[]
[]
[]
[]
[]
[]
[]
[]
[]
[]
[]
[]
[]
[]
[]
[]
[]
[]
[]
[]
[]
[]
[]
[]
[]
[]
[]
[]
[]
[]
[]
[]
[]
[]
[]
[]
[]
[]
[]
[]
[]
[]
[]
[]
[]
[]
[]
[]
[]
[]
[]
[]
[]
[]
[]
[]
[]
[]
[]
[]
[]
[]
[]
[]
[]
[]
[]
[]
[]
[]
[]
[]
[]
[]
[]
[]
[]
[]
[]
[]
[]
[]
[]
[]
[]
[]
[]
[]
[]
[]
[]
[]
[]
[]
[]
[]
[]
[]
[]
[]
[]
[]
[]
[]
[]
[]
[]
[]
[]
[]
[]
[]
[]
[]
[]
[]
[]
[]
[]
[]
[]
[]
[]
[]
[]
[]
[]
[]
[]
[]
[]
[]
[]
[]
[]
[]
[]
[]
[]
[]
[]
[]
[]
[]
[]
[]
[]
[]
[]
[]
[]
[]
[]
[]
[]
[]
[]
[]
[]
[]
[]
[]
[]
[]
[]
[]
[]
[]
[]
[]
[]
[]
[]
[]
[]
[]
[]
[]
[]
[]
[]
[]
[]
[]
[]
[]
[]
[]
[]
[]
[]
[]
[]
[]
[]
[]
[]
[]
[]
[]
[]
[]
[]
[]
[]
[]
[]
[]
[]
[]
[]
[]
[]
[]
[]
[]
[]
[]
[]
[]
[]
[]
[]
[]
[]
[]
[]
[]
[]
[]
[]
[]
[]
[]
[]
[]
[]
[]
[]
[]
[]
[]
[]
[]
[]
[]
[]
[]
[]
[]
[]
[]
[]
[]
[]
[]
[]
[]
[]
[]
[]
[]
[]
[]
[]
[]
[]
[]
[]
[]
[]
[]
[]
[]
[]
[]
[]
[]
[]
[]
[]
[]
[]
[]
[]
[]
[]
[]
[]
[]
[]
[]
[]
[]
[]
[]
[]
[]
[]
[]
[]
[]
[]
[]
[]
[]
[]
[]
[]
[]
[]
[]
[]
[]
[]
[]
[]
[]
[]
[]
[]
[]
[]
[]
[]
[]
[]
[]
[]
[]
[]
[]
[]
[]
[]
[]
[]
[]
[]
[]
[]
[]
[]
[]
[]
[]
[]
[]
[]
[]
[]
[]
[]
[]
[]
[]
[]
[]
[]
[]
[]
[]
[]
[]
[]
[]
[]
[]
[]
[]
[]
[]
[]
[]
[]
[]
[]
[]
[]
[]
[]
[]
[]
[]
[]
[]
[]
[]
[]
[]
[]
[]
[]
[]
[]
[]
[]
[]
[]
[]
[]
[]
[]
[]
[]
[]
[]
[]
[]
[]
[]
[]
[]
[]
[]
[]
[]
[]
[]
[]
[]
[]
[]
[]
[null,null,"2015-12-31","Couvert",823,null,null,null,null,null,null,null,null,null,null,null,null,null,null,null,null,null,11,70.400000000000006]

{"sheet":"Base","index":2,"n_rows":87,"n_cols":9,"rows_kept":87,"cut":false,"hidden":false,"merged":[]}
[1,2,3,4,5,6,7,8,9]
["Code","Vol 1","Temps 1","Vol 2","Temps 2","Vol 3","Temps 3","Vol 4","Temps 4"]
[801,null,null,null,null,"xxxxxxxxxx","xxxxxxxxxx","xxxxxxxxxx","xxxxxxxxxx"]
[804,null,null,"xxxxxxxxxx","xxxxxxxxxx","xxxxxxxxxx","xxxxxxxxxx","xxxxxxxxxx","xxxxxxxxxx"]
[805,null,null,"xxxxxxxxxx","xxxxxxxxxx","xxxxxxxxxx","xxxxxxxxxx","xxxxxxxxxx","xxxxxxxxxx"]
[806,null,null,"xxxxxxxxxx","xxxxxxxxxx","xxxxxxxxxx","xxxxxxxxxx","xxxxxxxxxx","xxxxxxxxxx"]
[5000,null,null,null,null,"xxxxxxxxxx","xxxxxxxxxx","xxxxxxxxxx","xxxxxxxxxx"]
[807,null,null,"xxxxxxxxxx","xxxxxxxxxx","xxxxxxxxxx","xxxxxxxxxx","xxxxxxxxxx","xxxxxxxxxx"]
[808,null,null,"xxxxxxxxxx","xxxxxxxxxx","xxxxxxxxxx","xxxxxxxxxx","xxxxxxxxxx","xxxxxxxxxx"]
[6000,null,null,null,null,"xxxxxxxxxx","xxxxxxxxxx","xxxxxxxxxx","xxxxxxxxxx"]
[809,"xxxxxxxxxx","xxxxxxxxxx",null,null,"xxxxxxxxxx","xxxxxxxxxx","xxxxxxxxxx","xxxxxxxxxx"]
[810,"xxxxxxxxxx","xxxxxxxxxx",null,null,"xxxxxxxxxx","xxxxxxxxxx","xxxxxxxxxx","xxxxxxxxxx"]
[4000,null,null,null,null,"xxxxxxxxxx","xxxxxxxxxx","xxxxxxxxxx","xxxxxxxxxx"]
[811,null,null,"xxxxxxxxxx","xxxxxxxxxx","xxxxxxxxxx","xxxxxxxxxx","xxxxxxxxxx","xxxxxxxxxx"]
[812,null,null,"xxxxxxxxxx","xxxxxxxxxx","xxxxxxxxxx","xxxxxxxxxx","xxxxxxxxxx","xxxxxxxxxx"]
[813,null,null,"xxxxxxxxxx","xxxxxxxxxx","xxxxxxxxxx","xxxxxxxxxx","xxxxxxxxxx","xxxxxxxxxx"]
[814,"xxxxxxxxxx","xxxxxxxxxx","xxxxxxxxxx","xxxxxxxxxx","xxxxxxxxxx","xxxxxxxxxx","xxxxxxxxxx","xxxxxxxxxx"]
[816,null,null,null,null,null,null,"xxxxxxxxxx","xxxxxxxxxx"]
[817,"xxxxxxxxxx","xxxxxxxxxx",null,null,"xxxxxxxxxx","xxxxxxxxxx","xxxxxxxxxx","xxxxxxxxxx"]
[1000,null,null,null,null,"xxxxxxxxxx","xxxxxxxxxx","xxxxxxxxxx","xxxxxxxxxx"]
[818,null,null,"xxxxxxxxxx","xxxxxxxxxx","xxxxxxxxxx","xxxxxxxxxx","xxxxxxxxxx","xxxxxxxxxx"]
[819,"xxxxxxxxxx","xxxxxxxxxx","xxxxxxxxxx","xxxxxxxxxx","xxxxxxxxxx","xxxxxxxxxx","xxxxxxxxxx","xxxxxxxxxx"]
[820,null,null,"xxxxxxxxxx","xxxxxxxxxx","xxxxxxxxxx","xxxxxxxxxx","xxxxxxxxxx","xxxxxxxxxx"]
[821,null,null,null,null,"xxxxxxxxxx","xxxxxxxxxx","xxxxxxxxxx","xxxxxxxxxx"]
[881,null,null,"xxxxxxxxxx","xxxxxxxxxx","xxxxxxxxxx","xxxxxxxxxx","xxxxxxxxxx","xxxxxxxxxx"]
[823,null,null,"xxxxxxxxxx","xxxxxxxxxx","xxxxxxxxxx","xxxxxxxxxx","xxxxxxxxxx","xxxxxxxxxx"]
[824,null,null,"xxxxxxxxxx","xxxxxxxxxx","xxxxxxxxxx","xxxxxxxxxx","xxxxxxxxxx","xxxxxxxxxx"]
[825,null,null,null,null,"xxxxxxxxxx","xxxxxxxxxx","xxxxxxxxxx","xxxxxxxxxx"]
[826,null,null,"xxxxxxxxxx","xxxxxxxxxx","xxxxxxxxxx","xxxxxxxxxx","xxxxxxxxxx","xxxxxxxxxx"]
[828,null,null,"xxxxxxxxxx","xxxxxxxxxx","xxxxxxxxxx","xxxxxxxxxx","xxxxxxxxxx","xxxxxxxxxx"]
[829,null,null,"xxxxxxxxxx","xxxxxxxxxx","xxxxxxxxxx","xxxxxxxxxx","xxxxxxxxxx","xxxxxxxxxx"]
[831,null,null,"xxxxxxxxxx","xxxxxxxxxx","xxxxxxxxxx","xxxxxxxxxx","xxxxxxxxxx","xxxxxxxxxx"]
[832,null,null,"xxxxxxxxxx","xxxxxxxxxx","xxxxxxxxxx","xxxxxxxxxx","xxxxxxxxxx","xxxxxxxxxx"]
[833,null,null,"xxxxxxxxxx","xxxxxxxxxx","xxxxxxxxxx","xxxxxxxxxx","xxxxxxxxxx","xxxxxxxxxx"]
[834,null,null,"xxxxxxxxxx","xxxxxxxxxx","xxxxxxxxxx","xxxxxxxxxx","xxxxxxxxxx","xxxxxxxxxx"]
[2000,null,null,null,null,null,null,"xxxxxxxxxx","xxxxxxxxxx"]
[835,null,null,"xxxxxxxxxx","xxxxxxxxxx","xxxxxxxxxx","xxxxxxxxxx","xxxxxxxxxx","xxxxxxxxxx"]
[836,null,null,"xxxxxxxxxx","xxxxxxxxxx","xxxxxxxxxx","xxxxxxxxxx","xxxxxxxxxx","xxxxxxxxxx"]
[837,null,null,"xxxxxxxxxx","xxxxxxxxxx","xxxxxxxxxx","xxxxxxxxxx","xxxxxxxxxx","xxxxxxxxxx"]
[838,null,null,"xxxxxxxxxx","xxxxxxxxxx","xxxxxxxxxx","xxxxxxxxxx","xxxxxxxxxx","xxxxxxxxxx"]
[840,"xxxxxxxxxx","xxxxxxxxxx","xxxxxxxxxx","xxxxxxxxxx","xxxxxxxxxx","xxxxxxxxxx","xxxxxxxxxx","xxxxxxxxxx"]
[839,null,null,null,null,"xxxxxxxxxx","xxxxxxxxxx","xxxxxxxxxx","xxxxxxxxxx"]
[841,"xxxxxxxxxx","xxxxxxxxxx",null,null,"xxxxxxxxxx","xxxxxxxxxx","xxxxxxxxxx","xxxxxxxxxx"]
[822,null,null,"xxxxxxxxxx","xxxxxxxxxx","xxxxxxxxxx","xxxxxxxxxx","xxxxxxxxxx","xxxxxxxxxx"]
[9000,null,null,null,null,"xxxxxxxxxx","xxxxxxxxxx","xxxxxxxxxx","xxxxxxxxxx"]
[842,null,null,"xxxxxxxxxx","xxxxxxxxxx","xxxxxxxxxx","xxxxxxxxxx","xxxxxxxxxx","xxxxxxxxxx"]
[844,"xxxxxxxxxx","xxxxxxxxxx",null,null,"xxxxxxxxxx","xxxxxxxxxx","xxxxxxxxxx","xxxxxxxxxx"]
[845,null,null,"xxxxxxxxxx","xxxxxxxxxx","xxxxxxxxxx","xxxxxxxxxx","xxxxxxxxxx","xxxxxxxxxx"]
[846,null,null,"xxxxxxxxxx","xxxxxxxxxx","xxxxxxxxxx","xxxxxxxxxx","xxxxxxxxxx","xxxxxxxxxx"]
[847,null,null,null,null,"xxxxxxxxxx","xxxxxxxxxx","xxxxxxxxxx","xxxxxxxxxx"]
[848,null,null,null,null,"xxxxxxxxxx","xxxxxxxxxx","xxxxxxxxxx","xxxxxxxxxx"]
[849,null,null,null,null,"xxxxxxxxxx","xxxxxxxxxx","xxxxxxxxxx","xxxxxxxxxx"]
[850,null,null,"xxxxxxxxxx","xxxxxxxxxx","xxxxxxxxxx","xxxxxxxxxx","xxxxxxxxxx","xxxxxxxxxx"]
[851,null,null,null,null,"xxxxxxxxxx","xxxxxxxxxx","xxxxxxxxxx","xxxxxxxxxx"]
[852,null,null,"xxxxxxxxxx","xxxxxxxxxx","xxxxxxxxxx","xxxxxxxxxx","xxxxxxxxxx","xxxxxxxxxx"]
[853,null,null,null,null,"xxxxxxxxxx","xxxxxxxxxx","xxxxxxxxxx","xxxxxxxxxx"]
[855,null,null,null,null,"xxxxxxxxxx","xxxxxxxxxx","xxxxxxxxxx","xxxxxxxxxx"]
[854,null,null,"xxxxxxxxxx","xxxxxxxxxx","xxxxxxxxxx","xxxxxxxxxx","xxxxxxxxxx","xxxxxxxxxx"]
[856,null,null,null,null,"xxxxxxxxxx","xxxxxxxxxx","xxxxxxxxxx","xxxxxxxxxx"]
[7000,null,null,null,null,"xxxxxxxxxx","xxxxxxxxxx","xxxxxxxxxx","xxxxxxxxxx"]
[857,"xxxxxxxxxx","xxxxxxxxxx","xxxxxxxxxx","xxxxxxxxxx","xxxxxxxxxx","xxxxxxxxxx","xxxxxxxxxx","xxxxxxxxxx"]
[858,"xxxxxxxxxx","xxxxxxxxxx","xxxxxxxxxx","xxxxxxxxxx","xxxxxxxxxx","xxxxxxxxxx","xxxxxxxxxx","xxxxxxxxxx"]
[859,null,null,"xxxxxxxxxx","xxxxxxxxxx","xxxxxxxxxx","xxxxxxxxxx","xxxxxxxxxx","xxxxxxxxxx"]
[815,null,null,null,null,"xxxxxxxxxx","xxxxxxxxxx","xxxxxxxxxx","xxxxxxxxxx"]
[860,null,null,null,null,"xxxxxxxxxx","xxxxxxxxxx","xxxxxxxxxx","xxxxxxxxxx"]
[861,"xxxxxxxxxx","xxxxxxxxxx",null,null,"xxxxxxxxxx","xxxxxxxxxx","xxxxxxxxxx","xxxxxxxxxx"]
[3000,null,null,null,null,"xxxxxxxxxx","xxxxxxxxxx","xxxxxxxxxx","xxxxxxxxxx"]
[862,null,null,"xxxxxxxxxx","xxxxxxxxxx","xxxxxxxxxx","xxxxxxxxxx","xxxxxxxxxx","xxxxxxxxxx"]
[863,null,null,"xxxxxxxxxx","xxxxxxxxxx","xxxxxxxxxx","xxxxxxxxxx","xxxxxxxxxx","xxxxxxxxxx"]
[864,null,null,"xxxxxxxxxx","xxxxxxxxxx","xxxxxxxxxx","xxxxxxxxxx","xxxxxxxxxx","xxxxxxxxxx"]
[865,null,null,"xxxxxxxxxx","xxxxxxxxxx","xxxxxxxxxx","xxxxxxxxxx","xxxxxxxxxx","xxxxxxxxxx"]
[868,null,null,null,null,"xxxxxxxxxx","xxxxxxxxxx","xxxxxxxxxx","xxxxxxxxxx"]
[869,"xxxxxxxxxx","xxxxxxxxxx","xxxxxxxxxx","xxxxxxxxxx","xxxxxxxxxx","xxxxxxxxxx","xxxxxxxxxx","xxxxxxxxxx"]
[870,null,null,null,null,"xxxxxxxxxx","xxxxxxxxxx","xxxxxxxxxx","xxxxxxxxxx"]
[866,null,null,"xxxxxxxxxx","xxxxxxxxxx","xxxxxxxxxx","xxxxxxxxxx","xxxxxxxxxx","xxxxxxxxxx"]
[867,null,null,"xxxxxxxxxx","xxxxxxxxxx","xxxxxxxxxx","xxxxxxxxxx","xxxxxxxxxx","xxxxxxxxxx"]
[871,null,null,"xxxxxxxxxx","xxxxxxxxxx","xxxxxxxxxx","xxxxxxxxxx","xxxxxxxxxx","xxxxxxxxxx"]
[872,null,null,null,null,null,null,"xxxxxxxxxx","xxxxxxxxxx"]
[873,null,null,"xxxxxxxxxx","xxxxxxxxxx","xxxxxxxxxx","xxxxxxxxxx","xxxxxxxxxx","xxxxxxxxxx"]
[874,null,null,"xxxxxxxxxx","xxxxxxxxxx","xxxxxxxxxx","xxxxxxxxxx","xxxxxxxxxx","xxxxxxxxxx"]
[875,null,null,"xxxxxxxxxx","xxxxxxxxxx","xxxxxxxxxx","xxxxxxxxxx","xxxxxxxxxx","xxxxxxxxxx"]
[876,null,null,null,null,"xxxxxxxxxx","xxxxxxxxxx","xxxxxxxxxx","xxxxxxxxxx"]
[877,null,null,null,null,"xxxxxxxxxx","xxxxxxxxxx","xxxxxxxxxx","xxxxxxxxxx"]
[882,null,null,"xxxxxxxxxx","xxxxxxxxxx","xxxxxxxxxx","xxxxxxxxxx","xxxxxxxxxx","xxxxxxxxxx"]
[878,null,null,"xxxxxxxxxx","xxxxxxxxxx","xxxxxxxxxx","xxxxxxxxxx","xxxxxxxxxx","xxxxxxxxxx"]
[879]
[880,null,null,null,null,"xxxxxxxxxx","xxxxxxxxxx","xxxxxxxxxx","xxxxxxxxxx"]