{"text_format":"1","workbook":"xlsx","n_sheets":3,"sheets":["Jaugeage","BDDG","Base"],"not_rendered":{"charts":0,"images":0,"macros":1,"external_links":0,"defined_names":11,"comments":0,"pivot_tables":0},"unopened":[],"bounds":{"document_bytes":16777216,"sheet_cells":100000,"rows_first":2000,"rows_last":500,"rows_between":2000,"halvings":0,"cell_chars":16384,"cell_head_chars":4096},"cells_cut":0,"cells_raw":0,"read":"whole","date_system":"1900"}

{"sheet":"Jaugeage","index":0,"n_rows":40,"n_cols":32,"rows_kept":40,"cut":false,"hidden":false,"merged":[]}
["Date","Météo","Code","peche","pomme","prune","citron","poire","kiwi","truc1","Vol 1","Temps 1","M3 /J 1","truc2","Vol 2","Temps 2","M3 /J 2","truc3","Vol 3","Temps 3","M3 /J 3","truc4","Vol 4","Temps 4","M3 /J 4","Seuil alerte","Total général M3 /jrs","Mois","Année","Différence en M3/J entre 2 saisies ","Observations","5,3 Sec"]
["2013-10-15",null,856,{"$f":"IF(ISNA(VLOOKUP(C2,BDDG!$C$2:$H$47,2,FALSE)),\"\",VLOOKUP(C2,BDDG!$C$2:$H$47,2,FALSE))","v":0},{"$f":"IF(ISNA(VLOOKUP(C2,BDDG!$C$3:$P$49,3,FALSE)),\"\",VLOOKUP(C2,BDDG!$C$3:$P$49,3,FALSE))","v":"pates"},{"$f":"IF(ISNA(VLOOKUP(C2,BDDG!$C$3:$P$49,4,FALSE)),\"\",VLOOKUP(C2,BDDG!$C$3:$P$49,4,FALSE))","v":106},{"$f":"IF(ISNA(VLOOKUP(C2,BDDG!$C$2:$H$47,5,FALSE)),\"\",VLOOKUP(C2,BDDG!$C$2:$H$47,5,FALSE))","v":"noisettes"},{"$f":"IF(ISNA(VLOOKUP(C2,BDDG!$C$2:$H$47,6,FALSE)),\"\",VLOOKUP(C2,BDDG!$C$2:$H$47,6,FALSE))","v":"iris"},{"$f":"IF(ISERROR(VLOOKUP(C2,BDDG!$C$2:$I$47,7,FALSE)),\"\",VLOOKUP(C2,BDDG!$C$2:$I$47,7,FALSE))","v":2},{"$f":"IF(ISERROR(VLOOKUP(C2,BDDG!$C$2:$W$6,8,FALSE)),\"\",VLOOKUP(C2,BDDG!$C$2:$W$6,8,FALSE))","v":"iris1"},10,57.5,{"$f":" IF(ISERROR(K2/L2*86.4),\"xxxxxxxxxx\",K2/L2*86.4)","v":15.026086956521739},{"$f":"IF(ISERROR(VLOOKUP(C2,BDDG!$C$2:$W$6,11,FALSE)),\"\",VLOOKUP(C2,BDDG!$C$2:$W$6,11,FALSE))","v":"iris2"},10,7.5,{"$f":" IF(ISERROR(O2/P2*86.4),\"xxxxxxxxxx\",O2/P2*86.4)","v":115.2},{"$f":"IF(ISERROR(VLOOKUP(C2,BDDG!$C$2:$W$6,14,FALSE)),\"\",VLOOKUP(C2,BDDG!$C$2:$W$6,14,FALSE))","v":"xxxxxxxxxxxxxxxxxxxxxxxxxxxxxxxxxxxx"},"xxxxxxxxxx",{"$f":" IF(ISERROR(R2/S2*86.4),\"xxxxxxxxxx\",R2/S2*86.4)","v":"xxxxxxxxxx"},{"$f":" IF(ISERROR(S2/T2*86.4),\"xxxxxxxxxx\",S2/T2*86.4)","v":"xxxxxxxxxx"},{"$f":"IF(ISERROR(VLOOKUP(C2,BDDG!$C$2:$W$6,17,FALSE)),\"\",VLOOKUP(C2,BDDG!$C$2:$W$6,17,FALSE))","v":"xxxxxxxxxxxxxxxxxxxxxxxx"},"xxxxxxxxxx",{"$f":" IF(ISERROR(V2/W2*86.4),\"xxxxxxxxxx\",V2/W2*86.4)","v":"xxxxxxxxxx"},{"$f":" IF(ISERROR(W2/X2*86.4),\"xxxxxxxxxx\",W2/X2*86.4)","v":"xxxxxxxxxx"},{"$f":"IF(ISERROR(VLOOKUP(C2,BDDG!$C$2:$W$6,20,FALSE)),\"\",VLOOKUP(C2,BDDG!$C$2:$W$6,20,FALSE))","v":"xxxxxxxxxx"},{"$f":"IF(ISERROR(SUM(M2,Q2,U2)),\"\",SUM(M2,Q2,U2))","v":130.22608695652175},{"$f":"MONTH(A:A)","v":10},{"$f":"YEAR(A:A)","v":2013},{"$f":"IFERROR((INDEX($AA$2:AA2,MATCH(H2&MAX(IF($H$1:H1=H2,$A$1:A1)),$H$2:H2&$A$2:A2,0))-AA2)*-1,\"\")","v":""},{"$f":"IF(ISERROR(VLOOKUP(C2,BDDG!$C$2:$W$6,21,FALSE)),\"\",VLOOKUP(C2,BDDG!$C$2:$W$6,21,FALSE))","v":0}]
["2013-12-20",null,823,{"$f":"IF(ISNA(VLOOKUP(C3,BDDG!$C$2:$H$47,2,FALSE)),\"\",VLOOKUP(C3,BDDG!$C$2:$H$47,2,FALSE))","v":0},{"$f":"IF(ISNA(VLOOKUP(C3,BDDG!$C$3:$P$49,3,FALSE)),\"\",VLOOKUP(C3,BDDG!$C$3:$P$49,3,FALSE))","v":"frites"},{"$f":"IF(ISNA(VLOOKUP(C3,BDDG!$C$3:$P$49,4,FALSE)),\"\",VLOOKUP(C3,BDDG!$C$3:$P$49,4,FALSE))","v":104},{"$f":"IF(ISNA(VLOOKUP(C3,BDDG!$C$2:$H$47,5,FALSE)),\"\",VLOOKUP(C3,BDDG!$C$2:$H$47,5,FALSE))","v":"noix"},{"$f":"IF(ISNA(VLOOKUP(C3,BDDG!$C$2:$H$47,6,FALSE)),\"\",VLOOKUP(C3,BDDG!$C$2:$H$47,6,FALSE))","v":"rose"},{"$f":"IF(ISERROR(VLOOKUP(C3,BDDG!$C$2:$I$47,7,FALSE)),\"\",VLOOKUP(C3,BDDG!$C$2:$I$47,7,FALSE))","v":1},{"$f":"IF(ISERROR(VLOOKUP(C3,BDDG!$C$2:$W$6,8,FALSE)),\"\",VLOOKUP(C3,BDDG!$C$2:$W$6,8,FALSE))","v":"rose1"},2,13,{"$f":" IF(ISERROR(K3/L3*86.4),\"xxxxxxxxxx\",K3/L3*86.4)","v":13.292307692307693},{"$f":"IF(ISERROR(VLOOKUP(C3,BDDG!$C$2:$W$6,11,FALSE)),\"\",VLOOKUP(C3,BDDG!$C$2:$W$6,11,FALSE))","v":"xxxxxxxxxxxxxxxxxxxxxxxxxxxxxxxxxxxxxxxxxxxxxxx"},"xxxxxxxxxx",{"$f":" IF(ISERROR(N3/O3*86.4),\"xxxxxxxxxx\",N3/O3*86.4)","v":"xxxxxxxxxx"},{"$f":" IF(ISERROR(O3/P3*86.4),\"xxxxxxxxxx\",O3/P3*86.4)","v":"xxxxxxxxxx"},{"$f":"IF(ISERROR(VLOOKUP(C3,BDDG!$C$2:$W$6,14,FALSE)),\"\",VLOOKUP(C3,BDDG!$C$2:$W$6,14,FALSE))","v":"xxxxxxxxxxxxxxxxxxxxxxxxxxxxxxxxxxxx"},"xxxxxxxxxx",{"$f":" IF(ISERROR(R3/S3*86.4),\"xxxxxxxxxx\",R3/S3*86.4)","v":"xxxxxxxxxx"},{"$f":" IF(ISERROR(S3/T3*86.4),\"xxxxxxxxxx\",S3/T3*86.4)","v":"xxxxxxxxxx"},{"$f":"IF(ISERROR(VLOOKUP(C3,BDDG!$C$2:$W$6,17,FALSE)),\"\",VLOOKUP(C3,BDDG!$C$2:$W$6,17,FALSE))","v":"xxxxxxxxxxxxxxxxxxxxxxxx"},"xxxxxxxxxx",{"$f":" IF(ISERROR(V3/W3*86.4),\"xxxxxxxxxx\",V3/W3*86.4)","v":"xxxxxxxxxx"},{"$f":" IF(ISERROR(W3/X3*86.4),\"xxxxxxxxxx\",W3/X3*86.4)","v":"xxxxxxxxxx"},{"$f":"IF(ISERROR(VLOOKUP(C3,BDDG!$C$2:$W$6,20,FALSE)),\"\",VLOOKUP(C3,BDDG!$C$2:$W$6,20,FALSE))","v":3},{"$f":"IF(ISERROR(SUM(M3,Q3,U3)),\"\",SUM(M3,Q3,U3))","v":13.292307692307693},{"$f":"MONTH(A:A)","v":12},{"$f":"YEAR(A:A)","v":2013},{"$f":"IFERROR((INDEX($AA$2:AA3,MATCH(H3&MAX(IF($H$1:H2=H3,$A$1:A2)),$H$2:H3&$A$2:A3,0))-AA3)*-1,\"\")","v":""},{"$f":"IF(ISERROR(VLOOKUP(C3,BDDG!$C$2:$W$6,21,FALSE)),\"\",VLOOKUP(C3,BDDG!$C$2:$W$6,21,FALSE))","v":0}]
["2014-03-12",null,823,{"$f":"IF(ISNA(VLOOKUP(C4,BDDG!$C$2:$H$47,2,FALSE)),\"\",VLOOKUP(C4,BDDG!$C$2:$H$47,2,FALSE))","v":0},{"$f":"IF(ISNA(VLOOKUP(C4,BDDG!$C$3:$P$49,3,FALSE)),\"\",VLOOKUP(C4,BDDG!$C$3:$P$49,3,FALSE))","v":"frites"},{"$f":"IF(ISNA(VLOOKUP(C4,BDDG!$C$3:$P$49,4,FALSE)),\"\",VLOOKUP(C4,BDDG!$C$3:$P$49,4,FALSE))","v":104},{"$f":"IF(ISNA(VLOOKUP(C4,BDDG!$C$2:$H$47,5,FALSE)),\"\",VLOOKUP(C4,BDDG!$C$2:$H$47,5,FALSE))","v":"noix"},{"$f":"IF(ISNA(VLOOKUP(C4,BDDG!$C$2:$H$47,6,FALSE)),\"\",VLOOKUP(C4,BDDG!$C$2:$H$47,6,FALSE))","v":"rose"},{"$f":"IF(ISERROR(VLOOKUP(C4,BDDG!$C$2:$I$47,7,FALSE)),\"\",VLOOKUP(C4,BDDG!$C$2:$I$47,7,FALSE))","v":1},{"$f":"IF(ISERROR(VLOOKUP(C4,BDDG!$C$2:$W$6,8,FALSE)),\"\",VLOOKUP(C4,BDDG!$C$2:$W$6,8,FALSE))","v":"rose1"},10,11,{"$f":" IF(ISERROR(K4/L4*86.4),\"xxxxxxxxxx\",K4/L4*86.4)","v":78.545454545454547},{"$f":"IF(ISERROR(VLOOKUP(C4,BDDG!$C$2:$W$6,11,FALSE)),\"\",VLOOKUP(C4,BDDG!$C$2:$W$6,11,FALSE))","v":"xxxxxxxxxxxxxxxxxxxxxxxxxxxxxxxxxxxxxxxxxxxxxxx"},"xxxxxxxxxx",{"$f":" IF(ISERROR(N4/O4*86.4),\"xxxxxxxxxx\",N4/O4*86.4)","v":"xxxxxxxxxx"},{"$f":" IF(ISERROR(O4/P4*86.4),\"xxxxxxxxxx\",O4/P4*86.4)","v":"xxxxxxxxxx"},{"$f":"IF(ISERROR(VLOOKUP(C4,BDDG!$C$2:$W$6,14,FALSE)),\"\",VLOOKUP(C4,BDDG!$C$2:$W$6,14,FALSE))","v":"xxxxxxxxxxxxxxxxxxxxxxxxxxxxxxxxxxxx"},"xxxxxxxxxx",{"$f":" IF(ISERROR(R4/S4*86.4),\"xxxxxxxxxx\",R4/S4*86.4)","v":"xxxxxxxxxx"},{"$f":" IF(ISERROR(S4/T4*86.4),\"xxxxxxxxxx\",S4/T4*86.4)","v":"xxxxxxxxxx"},{"$f":"IF(ISERROR(VLOOKUP(C4,BDDG!$C$2:$W$6,17,FALSE)),\"\",VLOOKUP(C4,BDDG!$C$2:$W$6,17,FALSE))","v":"xxxxxxxxxxxxxxxxxxxxxxxx"},"xxxxxxxxxx",{"$f":" IF(ISERROR(V4/W4*86.4),\"xxxxxxxxxx\",V4/W4*86.4)","v":"xxxxxxxxxx"},{"$f":" IF(ISERROR(W4/X4*86.4),\"xxxxxxxxxx\",W4/X4*86.4)","v":"xxxxxxxxxx"},{"$f":"IF(ISERROR(VLOOKUP(C4,BDDG!$C$2:$W$6,20,FALSE)),\"\",VLOOKUP(C4,BDDG!$C$2:$W$6,20,FALSE))","v":3},{"$f":"IF(ISERROR(SUM(M4,Q4,U4)),\"\",SUM(M4,Q4,U4))","v":78.545454545454547},{"$f":"MONTH(A:A)","v":3},{"$f":"YEAR(A:A)","v":2014},{"$f":"IFERROR((INDEX($AA$2:AA4,MATCH(H4&MAX(IF($H$1:H3=H4,$A$1:A3)),$H$2:H4&$A$2:A4,0))-AA4)*-1,\"\")","v":65.253146853146859},{"$f":"IF(ISERROR(VLOOKUP(C4,BDDG!$C$2:$W$6,21,FALSE)),\"\",VLOOKUP(C4,BDDG!$C$2:$W$6,21,FALSE))","v":0}]
["2014-04-10",null,856,{"$f":"IF(ISNA(VLOOKUP(C5,BDDG!$C$2:$H$47,2,FALSE)),\"\",VLOOKUP(C5,BDDG!$C$2:$H$47,2,FALSE))","v":0},{"$f":"IF(ISNA(VLOOKUP(C5,BDDG!$C$3:$P$49,3,FALSE)),\"\",VLOOKUP(C5,BDDG!$C$3:$P$49,3,FALSE))","v":"pates"},{"$f":"IF(ISNA(VLOOKUP(C5,BDDG!$C$3:$P$49,4,FALSE)),\"\",VLOOKUP(C5,BDDG!$C$3:$P$49,4,FALSE))","v":106},{"$f":"IF(ISNA(VLOOKUP(C5,BDDG!$C$2:$H$47,5,FALSE)),\"\",VLOOKUP(C5,BDDG!$C$2:$H$47,5,FALSE))","v":"noisettes"},{"$f":"IF(ISNA(VLOOKUP(C5,BDDG!$C$2:$H$47,6,FALSE)),\"\",VLOOKUP(C5,BDDG!$C$2:$H$47,6,FALSE))","v":"iris"},{"$f":"IF(ISERROR(VLOOKUP(C5,BDDG!$C$2:$I$47,7,FALSE)),\"\",VLOOKUP(C5,BDDG!$C$2:$I$47,7,FALSE))","v":2},{"$f":"IF(ISERROR(VLOOKUP(C5,BDDG!$C$2:$W$6,8,FALSE)),\"\",VLOOKUP(C5,BDDG!$C$2:$W$6,8,FALSE))","v":"iris1"},10,28,{"$f":" IF(ISERROR(K5/L5*86.4),\"xxxxxxxxxx\",K5/L5*86.4)","v":30.857142857142861},{"$f":"IF(ISERROR(VLOOKUP(C5,BDDG!$C$2:$W$6,11,FALSE)),\"\",VLOOKUP(C5,BDDG!$C$2:$W$6,11,FALSE))","v":"iris2"},10,2,{"$f":" IF(ISERROR(O5/P5*86.4),\"xxxxxxxxxx\",O5/P5*86.4)","v":432},{"$f":"IF(ISERROR(VLOOKUP(C5,BDDG!$C$2:$W$6,14,FALSE)),\"\",VLOOKUP(C5,BDDG!$C$2:$W$6,14,FALSE))","v":"xxxxxxxxxxxxxxxxxxxxxxxxxxxxxxxxxxxx"},"xxxxxxxxxx",{"$f":" IF(ISERROR(R5/S5*86.4),\"xxxxxxxxxx\",R5/S5*86.4)","v":"xxxxxxxxxx"},{"$f":" IF(ISERROR(S5/T5*86.4),\"xxxxxxxxxx\",S5/T5*86.4)","v":"xxxxxxxxxx"},{"$f":"IF(ISERROR(VLOOKUP(C5,BDDG!$C$2:$W$6,17,FALSE)),\"\",VLOOKUP(C5,BDDG!$C$2:$W$6,17,FALSE))","v":"xxxxxxxxxxxxxxxxxxxxxxxx"},"xxxxxxxxxx",{"$f":" IF(ISERROR(V5/W5*86.4),\"xxxxxxxxxx\",V5/W5*86.4)","v":"xxxxxxxxxx"},{"$f":" IF(ISERROR(W5/X5*86.4),\"xxxxxxxxxx\",W5/X5*86.4)","v":"xxxxxxxxxx"},{"$f":"IF(ISERROR(VLOOKUP(C5,BDDG!$C$2:$W$6,20,FALSE)),\"\",VLOOKUP(C5,BDDG!$C$2:$W$6,20,FALSE))","v":"xxxxxxxxxx"},{"$f":"IF(ISERROR(SUM(M5,Q5,U5)),\"\",SUM(M5,Q5,U5))","v":462.85714285714289},{"$f":"MONTH(A:A)","v":4},{"$f":"YEAR(A:A)","v":2014},{"$f":"IFERROR((INDEX($AA$2:AA5,MATCH(H5&MAX(IF($H$1:H4=H5,$A$1:A4)),$H$2:H5&$A$2:A5,0))-AA5)*-1,\"\")","v":332.63105590062116},{"$f":"IF(ISERROR(VLOOKUP(C5,BDDG!$C$2:$W$6,21,FALSE)),\"\",VLOOKUP(C5,BDDG!$C$2:$W$6,21,FALSE))","v":0}]
["2014-06-03",null,823,{"$f":"IF(ISNA(VLOOKUP(C6,BDDG!$C$2:$H$47,2,FALSE)),\"\",VLOOKUP(C6,BDDG!$C$2:$H$47,2,FALSE))","v":0},{"$f":"IF(ISNA(VLOOKUP(C6,BDDG!$C$3:$P$49,3,FALSE)),\"\",VLOOKUP(C6,BDDG!$C$3:$P$49,3,FALSE))","v":"frites"},{"$f":"IF(ISNA(VLOOKUP(C6,BDDG!$C$3:$P$49,4,FALSE)),\"\",VLOOKUP(C6,BDDG!$C$3:$P$49,4,FALSE))","v":104},{"$f":"IF(ISNA(VLOOKUP(C6,BDDG!$C$2:$H$47,5,FALSE)),\"\",VLOOKUP(C6,BDDG!$C$2:$H$47,5,FALSE))","v":"noix"},{"$f":"IF(ISNA(VLOOKUP(C6,BDDG!$C$2:$H$47,6,FALSE)),\"\",VLOOKUP(C6,BDDG!$C$2:$H$47,6,FALSE))","v":"rose"},{"$f":"IF(ISERROR(VLOOKUP(C6,BDDG!$C$2:$I$47,7,FALSE)),\"\",VLOOKUP(C6,BDDG!$C$2:$I$47,7,FALSE))","v":1},{"$f":"IF(ISERROR(VLOOKUP(C6,BDDG!$C$2:$W$6,8,FALSE)),\"\",VLOOKUP(C6,BDDG!$C$2:$W$6,8,FALSE))","v":"rose1"},10,29,{"$f":" IF(ISERROR(K6/L6*86.4),\"xxxxxxxxxx\",K6/L6*86.4)","v":29.793103448275865},{"$f":"IF(ISERROR(VLOOKUP(C6,BDDG!$C$2:$W$6,11,FALSE)),\"\",VLOOKUP(C6,BDDG!$C$2:$W$6,11,FALSE))","v":"xxxxxxxxxxxxxxxxxxxxxxxxxxxxxxxxxxxxxxxxxxxxxxx"},"xxxxxxxxxx",{"$f":" IF(ISERROR(N6/O6*86.4),\"xxxxxxxxxx\",N6/O6*86.4)","v":"xxxxxxxxxx"},{"$f":" IF(ISERROR(O6/P6*86.4),\"xxxxxxxxxx\",O6/P6*86.4)","v":"xxxxxxxxxx"},{"$f":"IF(ISERROR(VLOOKUP(C6,BDDG!$C$2:$W$6,14,FALSE)),\"\",VLOOKUP(C6,BDDG!$C$2:$W$6,14,FALSE))","v":"xxxxxxxxxxxxxxxxxxxxxxxxxxxxxxxxxxxx"},"xxxxxxxxxx",{"$f":" IF(ISERROR(R6/S6*86.4),\"xxxxxxxxxx\",R6/S6*86.4)","v":"xxxxxxxxxx"},{"$f":" IF(ISERROR(S6/T6*86.4),\"xxxxxxxxxx\",S6/T6*86.4)","v":"xxxxxxxxxx"},{"$f":"IF(ISERROR(VLOOKUP(C6,BDDG!$C$2:$W$6,17,FALSE)),\"\",VLOOKUP(C6,BDDG!$C$2:$W$6,17,FALSE))","v":"xxxxxxxxxxxxxxxxxxxxxxxx"},"xxxxxxxxxx",{"$f":" IF(ISERROR(V6/W6*86.4),\"xxxxxxxxxx\",V6/W6*86.4)","v":"xxxxxxxxxx"},{"$f":" IF(ISERROR(W6/X6*86.4),\"xxxxxxxxxx\",W6/X6*86.4)","v":"xxxxxxxxxx"},{"$f":"IF(ISERROR(VLOOKUP(C6,BDDG!$C$2:$W$6,20,FALSE)),\"\",VLOOKUP(C6,BDDG!$C$2:$W$6,20,FALSE))","v":3},{"$f":"IF(ISERROR(SUM(M6,Q6,U6)),\"\",SUM(M6,Q6,U6))","v":29.793103448275865},{"$f":"MONTH(A:A)","v":6},{"$f":"YEAR(A:A)","v":2014},{"$f":"IFERROR((INDEX($AA$2:AA6,MATCH(H6&MAX(IF($H$1:H5=H6,$A$1:A5)),$H$2:H6&$A$2:A6,0))-AA6)*-1,\"\")","v":-48.752351097178682},{"$f":"IF(ISERROR(VLOOKUP(C6,BDDG!$C$2:$W$6,21,FALSE)),\"\",VLOOKUP(C6,BDDG!$C$2:$W$6,21,FALSE))","v":0}]
["2014-06-04",null,856,{"$f":"IF(ISNA(VLOOKUP(C7,BDDG!$C$2:$H$47,2,FALSE)),\"\",VLOOKUP(C7,BDDG!$C$2:$H$47,2,FALSE))","v":0},{"$f":"IF(ISNA(VLOOKUP(C7,BDDG!$C$3:$P$49,3,FALSE)),\"\",VLOOKUP(C7,BDDG!$C$3:$P$49,3,FALSE))","v":"pates"},{"$f":"IF(ISNA(VLOOKUP(C7,BDDG!$C$3:$P$49,4,FALSE)),\"\",VLOOKUP(C7,BDDG!$C$3:$P$49,4,FALSE))","v":106},{"$f":"IF(ISNA(VLOOKUP(C7,BDDG!$C$2:$H$47,5,FALSE)),\"\",VLOOKUP(C7,BDDG!$C$2:$H$47,5,FALSE))","v":"noisettes"},{"$f":"IF(ISNA(VLOOKUP(C7,BDDG!$C$2:$H$47,6,FALSE)),\"\",VLOOKUP(C7,BDDG!$C$2:$H$47,6,FALSE))","v":"iris"},{"$f":"IF(ISERROR(VLOOKUP(C7,BDDG!$C$2:$I$47,7,FALSE)),\"\",VLOOKUP(C7,BDDG!$C$2:$I$47,7,FALSE))","v":2},{"$f":"IF(ISERROR(VLOOKUP(C7,BDDG!$C$2:$W$6,8,FALSE)),\"\",VLOOKUP(C7,BDDG!$C$2:$W$6,8,FALSE))","v":"iris1"},10,55,{"$f":" IF(ISERROR(K7/L7*86.4),\"xxxxxxxxxx\",K7/L7*86.4)","v":15.709090909090911},{"$f":"IF(ISERROR(VLOOKUP(C7,BDDG!$C$2:$W$6,11,FALSE)),\"\",VLOOKUP(C7,BDDG!$C$2:$W$6,11,FALSE))","v":"iris2"},10,4.5,{"$f":" IF(ISERROR(O7/P7*86.4),\"xxxxxxxxxx\",O7/P7*86.4)","v":192.00000000000003},{"$f":"IF(ISERROR(VLOOKUP(C7,BDDG!$C$2:$W$6,14,FALSE)),\"\",VLOOKUP(C7,BDDG!$C$2:$W$6,14,FALSE))","v":"xxxxxxxxxxxxxxxxxxxxxxxxxxxxxxxxxxxx"},"xxxxxxxxxx",{"$f":" IF(ISERROR(R7/S7*86.4),\"xxxxxxxxxx\",R7/S7*86.4)","v":"xxxxxxxxxx"},{"$f":" IF(ISERROR(S7/T7*86.4),\"xxxxxxxxxx\",S7/T7*86.4)","v":"xxxxxxxxxx"},{"$f":"IF(ISERROR(VLOOKUP(C7,BDDG!$C$2:$W$6,17,FALSE)),\"\",VLOOKUP(C7,BDDG!$C$2:$W$6,17,FALSE))","v":"xxxxxxxxxxxxxxxxxxxxxxxx"},"xxxxxxxxxx",{"$f":" IF(ISERROR(V7/W7*86.4),\"xxxxxxxxxx\",V7/W7*86.4)","v":"xxxxxxxxxx"},{"$f":" IF(ISERROR(W7/X7*86.4),\"xxxxxxxxxx\",W7/X7*86.4)","v":"xxxxxxxxxx"},{"$f":"IF(ISERROR(VLOOKUP(C7,BDDG!$C$2:$W$6,20,FALSE)),\"\",VLOOKUP(C7,BDDG!$C$2:$W$6,20,FALSE))","v":"xxxxxxxxxx"},{"$f":"IF(ISERROR(SUM(M7,Q7,U7)),\"\",SUM(M7,Q7,U7))","v":207.70909090909095},{"$f":"MONTH(A:A)","v":6},{"$f":"YEAR(A:A)","v":2014},{"$f":"IFERROR((INDEX($AA$2:AA7,MATCH(H7&MAX(IF($H$1:H6=H7,$A$1:A6)),$H$2:H7&$A$2:A7,0))-AA7)*-1,\"\")","v":-255.14805194805194},{"$f":"IF(ISERROR(VLOOKUP(C7,BDDG!$C$2:$W$6,21,FALSE)),\"\",VLOOKUP(C7,BDDG!$C$2:$W$6,21,FALSE))","v":0}]
["2014-07-08",null,823,{"$f":"IF(ISNA(VLOOKUP(C8,BDDG!$C$2:$H$47,2,FALSE)),\"\",VLOOKUP(C8,BDDG!$C$2:$H$47,2,FALSE))","v":0},{"$f":"IF(ISNA(VLOOKUP(C8,BDDG!$C$3:$P$49,3,FALSE)),\"\",VLOOKUP(C8,BDDG!$C$3:$P$49,3,FALSE))","v":"frites"},{"$f":"IF(ISNA(VLOOKUP(C8,BDDG!$C$3:$P$49,4,FALSE)),\"\",VLOOKUP(C8,BDDG!$C$3:$P$49,4,FALSE))","v":104},{"$f":"IF(ISNA(VLOOKUP(C8,BDDG!$C$2:$H$47,5,FALSE)),\"\",VLOOKUP(C8,BDDG!$C$2:$H$47,5,FALSE))","v":"noix"},{"$f":"IF(ISNA(VLOOKUP(C8,BDDG!$C$2:$H$47,6,FALSE)),\"\",VLOOKUP(C8,BDDG!$C$2:$H$47,6,FALSE))","v":"rose"},{"$f":"IF(ISERROR(VLOOKUP(C8,BDDG!$C$2:$I$47,7,FALSE)),\"\",VLOOKUP(C8,BDDG!$C$2:$I$47,7,FALSE))","v":1},{"$f":"IF(ISERROR(VLOOKUP(C8,BDDG!$C$2:$W$6,8,FALSE)),\"\",VLOOKUP(C8,BDDG!$C$2:$W$6,8,FALSE))","v":"rose1"},10,18.7,{"$f":" IF(ISERROR(K8/L8*86.4),\"xxxxxxxxxx\",K8/L8*86.4)","v":46.20320855614974},{"$f":"IF(ISERROR(VLOOKUP(C8,BDDG!$C$2:$W$6,11,FALSE)),\"\",VLOOKUP(C8,BDDG!$C$2:$W$6,11,FALSE))","v":"xxxxxxxxxxxxxxxxxxxxxxxxxxxxxxxxxxxxxxxxxxxxxxx"},"xxxxxxxxxx",{"$f":" IF(ISERROR(N8/O8*86.4),\"xxxxxxxxxx\",N8/O8*86.4)","v":"xxxxxxxxxx"},{"$f":" IF(ISERROR(O8/P8*86.4),\"xxxxxxxxxx\",O8/P8*86.4)","v":"xxxxxxxxxx"},{"$f":"IF(ISERROR(VLOOKUP(C8,BDDG!$C$2:$W$6,14,FALSE)),\"\",VLOOKUP(C8,BDDG!$C$2:$W$6,14,FALSE))","v":"xxxxxxxxxxxxxxxxxxxxxxxxxxxxxxxxxxxx"},"xxxxxxxxxx",{"$f":" IF(ISERROR(R8/S8*86.4),\"xxxxxxxxxx\",R8/S8*86.4)","v":"xxxxxxxxxx"},{"$f":" IF(ISERROR(S8/T8*86.4),\"xxxxxxxxxx\",S8/T8*86.4)","v":"xxxxxxxxxx"},{"$f":"IF(ISERROR(VLOOKUP(C8,BDDG!$C$2:$W$6,17,FALSE)),\"\",VLOOKUP(C8,BDDG!$C$2:$W$6,17,FALSE))","v":"xxxxxxxxxxxxxxxxxxxxxxxx"},"xxxxxxxxxx",{"$f":" IF(ISERROR(V8/W8*86.4),\"xxxxxxxxxx\",V8/W8*86.4)","v":"xxxxxxxxxx"},{"$f":" IF(ISERROR(W8/X8*86.4),\"xxxxxxxxxx\",W8/X8*86.4)","v":"xxxxxxxxxx"},{"$f":"IF(ISERROR(VLOOKUP(C8,BDDG!$C$2:$W$6,20,FALSE)),\"\",VLOOKUP(C8,BDDG!$C$2:$W$6,20,FALSE))","v":3},{"$f":"IF(ISERROR(SUM(M8,Q8,U8)),\"\",SUM(M8,Q8,U8))","v":46.20320855614974},{"$f":"MONTH(A:A)","v":7},{"$f":"YEAR(A:A)","v":2014},{"$f":"IFERROR((INDEX($AA$2:AA8,MATCH(H8&MAX(IF($H$1:H7=H8,$A$1:A7)),$H$2:H8&$A$2:A8,0))-AA8)*-1,\"\")","v":16.410105107873875},{"$f":"IF(ISERROR(VLOOKUP(C8,BDDG!$C$2:$W$6,21,FALSE)),\"\",VLOOKUP(C8,BDDG!$C$2:$W$6,21,FALSE))","v":0}]
["2014-11-12",null,823,{"$f":"IF(ISNA(VLOOKUP(C9,BDDG!$C$2:$H$47,2,FALSE)),\"\",VLOOKUP(C9,BDDG!$C$2:$H$47,2,FALSE))","v":0},{"$f":"IF(ISNA(VLOOKUP(C9,BDDG!$C$3:$P$49,3,FALSE)),\"\",VLOOKUP(C9,BDDG!$C$3:$P$49,3,FALSE))","v":"frites"},{"$f":"IF(ISNA(VLOOKUP(C9,BDDG!$C$3:$P$49,4,FALSE)),\"\",VLOOKUP(C9,BDDG!$C$3:$P$49,4,FALSE))","v":104},{"$f":"IF(ISNA(VLOOKUP(C9,BDDG!$C$2:$H$47,5,FALSE)),\"\",VLOOKUP(C9,BDDG!$C$2:$H$47,5,FALSE))","v":"noix"},{"$f":"IF(ISNA(VLOOKUP(C9,BDDG!$C$2:$H$47,6,FALSE)),\"\",VLOOKUP(C9,BDDG!$C$2:$H$47,6,FALSE))","v":"rose"},{"$f":"IF(ISERROR(VLOOKUP(C9,BDDG!$C$2:$I$47,7,FALSE)),\"\",VLOOKUP(C9,BDDG!$C$2:$I$47,7,FALSE))","v":1},{"$f":"IF(ISERROR(VLOOKUP(C9,BDDG!$C$2:$W$6,8,FALSE)),\"\",VLOOKUP(C9,BDDG!$C$2:$W$6,8,FALSE))","v":"rose1"},10,30,{"$f":" IF(ISERROR(K9/L9*86.4),\"xxxxxxxxxx\",K9/L9*86.4)","v":28.8},{"$f":"IF(ISERROR(VLOOKUP(C9,BDDG!$C$2:$W$6,11,FALSE)),\"\",VLOOKUP(C9,BDDG!$C$2:$W$6,11,FALSE))","v":"xxxxxxxxxxxxxxxxxxxxxxxxxxxxxxxxxxxxxxxxxxxxxxx"},"xxxxxxxxxx",{"$f":" IF(ISERROR(N9/O9*86.4),\"xxxxxxxxxx\",N9/O9*86.4)","v":"xxxxxxxxxx"},{"$f":" IF(ISERROR(O9/P9*86.4),\"xxxxxxxxxx\",O9/P9*86.4)","v":"xxxxxxxxxx"},{"$f":"IF(ISERROR(VLOOKUP(C9,BDDG!$C$2:$W$6,14,FALSE)),\"\",VLOOKUP(C9,BDDG!$C$2:$W$6,14,FALSE))","v":"xxxxxxxxxxxxxxxxxxxxxxxxxxxxxxxxxxxx"},"xxxxxxxxxx",{"$f":" IF(ISERROR(R9/S9*86.4),\"xxxxxxxxxx\",R9/S9*86.4)","v":"xxxxxxxxxx"},{"$f":" IF(ISERROR(S9/T9*86.4),\"xxxxxxxxxx\",S9/T9*86.4)","v":"xxxxxxxxxx"},{"$f":"IF(ISERROR(VLOOKUP(C9,BDDG!$C$2:$W$6,17,FALSE)),\"\",VLOOKUP(C9,BDDG!$C$2:$W$6,17,FALSE))","v":"xxxxxxxxxxxxxxxxxxxxxxxx"},"xxxxxxxxxx",{"$f":" IF(ISERROR(V9/W9*86.4),\"xxxxxxxxxx\",V9/W9*86.4)","v":"xxxxxxxxxx"},{"$f":" IF(ISERROR(W9/X9*86.4),\"xxxxxxxxxx\",W9/X9*86.4)","v":"xxxxxxxxxx"},{"$f":"IF(ISERROR(VLOOKUP(C9,BDDG!$C$2:$W$6,20,FALSE)),\"\",VLOOKUP(C9,BDDG!$C$2:$W$6,20,FALSE))","v":3},{"$f":"IF(ISERROR(SUM(M9,Q9,U9)),\"\",SUM(M9,Q9,U9))","v":28.8},{"$f":"MONTH(A:A)","v":11},{"$f":"YEAR(A:A)","v":2014},{"$f":"IFERROR((INDEX($AA$2:AA9,MATCH(H9&MAX(IF($H$1:H8=H9,$A$1:A8)),$H$2:H9&$A$2:A9,0))-AA9)*-1,\"\")","v":-17.403208556149739},{"$f":"IF(ISERROR(VLOOKUP(C9,BDDG!$C$2:$W$6,21,FALSE)),\"\",VLOOKUP(C9,BDDG!$C$2:$W$6,21,FALSE))","v":0}]
["2014-12-19",null,823,{"$f":"IF(ISNA(VLOOKUP(C10,BDDG!$C$2:$H$47,2,FALSE)),\"\",VLOOKUP(C10,BDDG!$C$2:$H$47,2,FALSE))","v":0},{"$f":"IF(ISNA(VLOOKUP(C10,BDDG!$C$3:$P$49,3,FALSE)),\"\",VLOOKUP(C10,BDDG!$C$3:$P$49,3,FALSE))","v":"frites"},{"$f":"IF(ISNA(VLOOKUP(C10,BDDG!$C$3:$P$49,4,FALSE)),\"\",VLOOKUP(C10,BDDG!$C$3:$P$49,4,FALSE))","v":104},{"$f":"IF(ISNA(VLOOKUP(C10,BDDG!$C$2:$H$47,5,FALSE)),\"\",VLOOKUP(C10,BDDG!$C$2:$H$47,5,FALSE))","v":"noix"},{"$f":"IF(ISNA(VLOOKUP(C10,BDDG!$C$2:$H$47,6,FALSE)),\"\",VLOOKUP(C10,BDDG!$C$2:$H$47,6,FALSE))","v":"rose"},{"$f":"IF(ISERROR(VLOOKUP(C10,BDDG!$C$2:$I$47,7,FALSE)),\"\",VLOOKUP(C10,BDDG!$C$2:$I$47,7,FALSE))","v":1},{"$f":"IF(ISERROR(VLOOKUP(C10,BDDG!$C$2:$W$6,8,FALSE)),\"\",VLOOKUP(C10,BDDG!$C$2:$W$6,8,FALSE))","v":"rose1"},10,7,{"$f":" IF(ISERROR(K10/L10*86.4),\"xxxxxxxxxx\",K10/L10*86.4)","v":123.42857142857144},{"$f":"IF(ISERROR(VLOOKUP(C10,BDDG!$C$2:$W$6,11,FALSE)),\"\",VLOOKUP(C10,BDDG!$C$2:$W$6,11,FALSE))","v":"xxxxxxxxxxxxxxxxxxxxxxxxxxxxxxxxxxxxxxxxxxxxxxx"},"xxxxxxxxxx",{"$f":" IF(ISERROR(N10/O10*86.4),\"xxxxxxxxxx\",N10/O10*86.4)","v":"xxxxxxxxxx"},{"$f":" IF(ISERROR(O10/P10*86.4),\"xxxxxxxxxx\",O10/P10*86.4)","v":"xxxxxxxxxx"},{"$f":"IF(ISERROR(VLOOKUP(C10,BDDG!$C$2:$W$6,14,FALSE)),\"\",VLOOKUP(C10,BDDG!$C$2:$W$6,14,FALSE))","v":"xxxxxxxxxxxxxxxxxxxxxxxxxxxxxxxxxxxx"},"xxxxxxxxxx",{"$f":" IF(ISERROR(R10/S10*86.4),\"xxxxxxxxxx\",R10/S10*86.4)","v":"xxxxxxxxxx"},{"$f":" IF(ISERROR(S10/T10*86.4),\"xxxxxxxxxx\",S10/T10*86.4)","v":"xxxxxxxxxx"},{"$f":"IF(ISERROR(VLOOKUP(C10,BDDG!$C$2:$W$6,17,FALSE)),\"\",VLOOKUP(C10,BDDG!$C$2:$W$6,17,FALSE))","v":"xxxxxxxxxxxxxxxxxxxxxxxx"},"xxxxxxxxxx",{"$f":" IF(ISERROR(V10/W10*86.4),\"xxxxxxxxxx\",V10/W10*86.4)","v":"xxxxxxxxxx"},{"$f":" IF(ISERROR(W10/X10*86.4),\"xxxxxxxxxx\",W10/X10*86.4)","v":"xxxxxxxxxx"},{"$f":"IF(ISERROR(VLOOKUP(C10,BDDG!$C$2:$W$6,20,FALSE)),\"\",VLOOKUP(C10,BDDG!$C$2:$W$6,20,FALSE))","v":3},{"$f":"IF(ISERROR(SUM(M10,Q10,U10)),\"\",SUM(M10,Q10,U10))","v":123.42857142857144},{"$f":"MONTH(A:A)","v":12},{"$f":"YEAR(A:A)","v":2014},{"$f":"IFERROR((INDEX($AA$2:AA10,MATCH(H10&MAX(IF($H$1:H9=H10,$A$1:A9)),$H$2:H10&$A$2:A10,0))-AA10)*-1,\"\")","v":94.628571428571448},{"$f":"IF(ISERROR(VLOOKUP(C10,BDDG!$C$2:$W$6,21,FALSE)),\"\",VLOOKUP(C10,BDDG!$C$2:$W$6,21,FALSE))","v":0}]
{"$rows_left_out":31}
{"sheet":"BDDG","index":1,"n_rows":1611,"n_cols":24,"rows_kept":1611,"cut":false,"hidden":false,"merged":[]}
[null,null,1,2,3,4,5,6,7,8,9,10,11,12,13,14,15,16,17,18,19,20,21]
["Date "," Météo","Code","peche","pomme","prune","citron","poire","kiwi","truc1","Vol 1","Temps 1","truc2","Vol 2","Temps 2","truc3","Vol 3","Temps 3","truc4","Vol 4","Temps 4","Seuil alerte","Observation(s) "]
[null,null,823,0,"frites",104,"noix","rose",1,"rose1",null,null,"xxxxxxxxxxxxxxxxxxxxxxxxxxxxxxxxxxxxxxxxxxxxxxx","xxxxxxxxx","xxxxxxxxx","xxxxxxxxxxxxxxxxxxxxxxxxxxxxxxxxxxxx","xxxxxxxxx","xxxxxxxxx","xxxxxxxxxxxxxxxxxxxxxxxx","xxxxxxxxx","xxxxxxxxx",3]
[null,null,856,0,"pates",106,"noisettes","iris",2,"iris1",null,null,"iris2",null,null,"xxxxxxxxxxxxxxxxxxxxxxxxxxxxxxxxxxxx","xxxxxxxxx","xxxxxxxxx","xxxxxxxxxxxxxxxxxxxxxxxx","xxxxxxxxx","xxxxxxxxx","xxxxxxxxxx"]
[]
[]
[]
[]
[]
[]
{"$rows_left_out":1602}
{"sheet":"Base","index":2,"n_rows":87,"n_cols":9,"rows_kept":87,"cut":false,"hidden":false,"merged":[]}
[1,2,3,4,5,6,7,8,9]
["Code","Vol 1","Temps 1","Vol 2","Temps 2","Vol 3","Temps 3","Vol 4","Temps 4"]
[801,null,null,null,null,"xxxxxxxxxx","xxxxxxxxxx","xxxxxxxxxx","xxxxxxxxxx"]
[804,null,null,"xxxxxxxxxx","xxxxxxxxxx","xxxxxxxxxx","xxxxxxxxxx","xxxxxxxxxx","xxxxxxxxxx"]
[805,null,null,"xxxxxxxxxx","xxxxxxxxxx","xxxxxxxxxx","xxxxxxxxxx","xxxxxxxxxx","xxxxxxxxxx"]
[806,null,null,"xxxxxxxxxx","xxxxxxxxxx","xxxxxxxxxx","xxxxxxxxxx","xxxxxxxxxx","xxxxxxxxxx"]
[5000,null,null,null,null,"xxxxxxxxxx","xxxxxxxxxx","xxxxxxxxxx","xxxxxxxxxx"]
[807,null,null,"xxxxxxxxxx","xxxxxxxxxx","xxxxxxxxxx","xxxxxxxxxx","xxxxxxxxxx","xxxxxxxxxx"]
[808,null,null,"xxxxxxxxxx","xxxxxxxxxx","xxxxxxxxxx","xxxxxxxxxx","xxxxxxxxxx","xxxxxxxxxx"]
[6000,null,null,null,null,"xxxxxxxxxx","xxxxxxxxxx","xxxxxxxxxx","xxxxxxxxxx"]
{"$rows_left_out":77}