{"text_format":"1","workbook":"xlsx","n_sheets":4,"sheets":["Calcul des dates","Jours fériés","calcul des jours grégorien","Mode d'emploi"],"not_rendered":{"charts":0,"images":0,"macros":1,"external_links":0,"defined_names":1,"comments":0,"pivot_tables":0},"unopened":[],"bounds":{"document_bytes":16777216,"sheet_cells":100000,"rows_first":2000,"rows_last":500,"rows_between":2000,"halvings":0,"cell_chars":16384,"cell_head_chars":4096},"cells_cut":0,"cells_raw":0,"read":"whole","date_system":"1900"}

{"sheet":"Calcul des dates","index":0,"n_rows":260,"n_cols":34,"rows_kept":260,"cut":false,"hidden":false,"merged":[]}
["Jour Semaine","Jour Semaine","Jours Ouvrés","-10 JOURS Ouvrés","-15 JOURS Ouvrés",null,null,null,null,null,null,null,null,null,null,null,null,{"$f":"S1+1","v":16},{"$f":"T1+1","v":15},14,13,12,11,10,9,8,7,6,5,4,3,{"$f":"AG1+1","v":2},1]
["Date départ - 1",{"$f":"WEEKDAY(C2,2)","v":6},{"$f":"DATE('Jours fériés'!B1-1,12,31)","v":"2016-12-31"},10,15,null,null,null,null,null,null,null,null,null,null,null,null,{"$f":"R3","v":"2016-12-17"},{"$f":"S3","v":"2016-12-18"},{"$f":"T3","v":"2016-12-19"},{"$f":"U3","v":"2016-12-20"},"2016-12-21","2016-12-22","2016-12-23","2016-12-24","2016-12-25","2016-12-26","2016-12-27","2016-12-28","2016-12-29","2016-12-30","2016-12-31","2017-01-01","2017-01-02"]
[{"$f":"TEXT(C3,\"jjjj\")","v":"lundi"},{"$f":"WEEKDAY(C3,2)","v":1},{"$f":"IF(ISNA(VLOOKUP(IF(WEEKDAY(C2,2)=5,C2+3,C2+1),'Jours fériés'!$B$3:$B$17,1,FALSE)),IF(WEEKDAY(C2,2)=5,C2+3,C2+1),IF(WEEKDAY(IF(WEEKDAY(C2,2)=5,C2+3,C2+1)+1,2)=6,IF(WEEKDAY(C2,2)=5,C2+3,C2+1)+1+2,IF(WEEKDAY(C2,2)=5,C2+3,C2+1)+1))","v":"2017-01-02"},{"$f":"finddate('Jours fériés'!$C$3:$C$17,$C3,D$2)","v":"2016-12-19"},{"$f":"finddate('Jours fériés'!$C$3:$C$17,$C3,E$2)","v":"2016-12-12"},null,null,null,null,null,null,null,{"$f":"N3-1","v":"2016-12-12"},{"$f":"O3-1","v":"2016-12-13"},{"$f":"P3-1","v":"2016-12-14"},{"$f":"Q3-1","v":"2016-12-15"},{"$f":"R3-1","v":"2016-12-16"},{"$f":"S3-1","v":"2016-12-17"},{"$f":"T3-1","v":"2016-12-18"},"2016-12-19","2016-12-20","2016-12-21","2016-12-22","2016-12-23","2016-12-24","2016-12-25","2016-12-26","2016-12-27","2016-12-28","2016-12-29","2016-12-30","2016-12-31",{"$f":"AH3-1","v":"2017-01-01"},{"$f":"C3","v":"2017-01-02"}]
[{"$f":"TEXT(C4,\"jjjj\")","v":"mardi"},{"$f":"WEEKDAY(C4,2)","v":2},{"$f":"IF(ISNA(VLOOKUP(IF(WEEKDAY(C3,2)=5,C3+3,C3+1),'Jours fériés'!$B$3:$B$17,1,FALSE)),IF(WEEKDAY(C3,2)=5,C3+3,C3+1),IF(WEEKDAY(IF(WEEKDAY(C3,2)=5,C3+3,C3+1)+1,2)=6,IF(WEEKDAY(C3,2)=5,C3+3,C3+1)+1+2,IF(WEEKDAY(C3,2)=5,C3+3,C3+1)+1))","v":"2017-01-03"},{"$f":"finddate('Jours fériés'!$C$3:$C$17,$C4,D$2)","v":"2016-12-20"},{"$f":"finddate('Jours fériés'!$C$3:$C$17,$C4,E$2)","v":"2016-12-13"},null,null,null,null,null,null,null,{"$f":"M5","v":"2016-12-14"},"2016-12-15","2016-12-16","2016-12-17","2016-12-18",{"$f":"R5","v":"2016-12-19"},{"$f":"S5","v":"2016-12-20"},{"$f":"T5","v":"2016-12-21"},{"$f":"U5","v":"2016-12-22"},{"$f":"V5","v":"2016-12-23"},{"$f":"W5","v":"2016-12-24"},{"$f":"X5","v":"2016-12-25"},{"$f":"Y5","v":"2016-12-26"},{"$f":"Z5","v":"2016-12-27"},{"$f":"AA5","v":"2016-12-28"},{"$f":"AB5","v":"2016-12-29"},{"$f":"AC5","v":"2016-12-30"},{"$f":"AD5","v":"2016-12-31"},{"$f":"AE5","v":"2017-01-01"},{"$f":"AF5","v":"2017-01-02"},{"$f":"AG5","v":"2017-01-03"},{"$f":"AH5","v":"2017-01-04"}]
["mercredi",3,{"$f":"IF(ISNA(VLOOKUP(IF(WEEKDAY(C4,2)=5,C4+3,C4+1),'Jours fériés'!$B$3:$B$17,1,FALSE)),IF(WEEKDAY(C4,2)=5,C4+3,C4+1),IF(WEEKDAY(IF(WEEKDAY(C4,2)=5,C4+3,C4+1)+1,2)=6,IF(WEEKDAY(C4,2)=5,C4+3,C4+1)+1+2,IF(WEEKDAY(C4,2)=5,C4+3,C4+1)+1))","v":"2017-01-04"},{"$f":"finddate('Jours fériés'!$C$3:$C$17,$C5,D$2)","v":"2016-12-21"},{"$f":"finddate('Jours fériés'!$C$3:$C$17,$C5,E$2)","v":"2016-12-14"},null,null,null,null,null,null,null,{"$f":"N5-1","v":"2016-12-14"},{"$f":"O5-1","v":"2016-12-15"},{"$f":"P5-1","v":"2016-12-16"},{"$f":"Q5-1","v":"2016-12-17"},{"$f":"R5-1","v":"2016-12-18"},{"$f":"S5-1","v":"2016-12-19"},{"$f":"T5-1","v":"2016-12-20"},"2016-12-21","2016-12-22","2016-12-23","2016-12-24","2016-12-25","2016-12-26","2016-12-27","2016-12-28","2016-12-29","2016-12-30","2016-12-31","2017-01-01","2017-01-02",{"$f":"AH5-1","v":"2017-01-03"},{"$f":"C5","v":"2017-01-04"}]
["jeudi",4,{"$f":"IF(ISNA(VLOOKUP(IF(WEEKDAY(C5,2)=5,C5+3,C5+1),'Jours fériés'!$B$3:$B$17,1,FALSE)),IF(WEEKDAY(C5,2)=5,C5+3,C5+1),IF(WEEKDAY(IF(WEEKDAY(C5,2)=5,C5+3,C5+1)+1,2)=6,IF(WEEKDAY(C5,2)=5,C5+3,C5+1)+1+2,IF(WEEKDAY(C5,2)=5,C5+3,C5+1)+1))","v":"2017-01-05"},{"$f":"finddate('Jours fériés'!$C$3:$C$17,$C6,D$2)","v":"2016-12-22"},{"$f":"finddate('Jours fériés'!$C$3:$C$17,$C6,E$2)","v":"2016-12-15"},null,null,null,null,null,null,null,{"$f":"M7","v":"2016-12-16"},"2016-12-17","2016-12-18","2016-12-19","2016-12-20",{"$f":"R7","v":"2016-12-21"},"2016-12-22",{"$f":"T7","v":"2016-12-23"},{"$f":"U7","v":"2016-12-24"},{"$f":"V7","v":"2016-12-25"},{"$f":"W7","v":"2016-12-26"},{"$f":"X7","v":"2016-12-27"},{"$f":"Y7","v":"2016-12-28"},{"$f":"Z7","v":"2016-12-29"},{"$f":"AA7","v":"2016-12-30"},{"$f":"AB7","v":"2016-12-31"},{"$f":"AC7","v":"2017-01-01"},{"$f":"AD7","v":"2017-01-02"},{"$f":"AE7","v":"2017-01-03"},{"$f":"AF7","v":"2017-01-04"},{"$f":"AG7","v":"2017-01-05"},{"$f":"AH7","v":"2017-01-06"}]
["vendredi",5,{"$f":"IF(ISNA(VLOOKUP(IF(WEEKDAY(C6,2)=5,C6+3,C6+1),'Jours fériés'!$B$3:$B$17,1,FALSE)),IF(WEEKDAY(C6,2)=5,C6+3,C6+1),IF(WEEKDAY(IF(WEEKDAY(C6,2)=5,C6+3,C6+1)+1,2)=6,IF(WEEKDAY(C6,2)=5,C6+3,C6+1)+1+2,IF(WEEKDAY(C6,2)=5,C6+3,C6+1)+1))","v":"2017-01-06"},{"$f":"finddate('Jours fériés'!$C$3:$C$17,$C7,D$2)","v":"2016-12-23"},{"$f":"finddate('Jours fériés'!$C$3:$C$17,$C7,E$2)","v":"2016-12-16"},null,null,null,null,null,null,null,{"$f":"N7-1","v":"2016-12-16"},{"$f":"O7-1","v":"2016-12-17"},{"$f":"P7-1","v":"2016-12-18"},{"$f":"Q7-1","v":"2016-12-19"},{"$f":"R7-1","v":"2016-12-20"},{"$f":"S7-1","v":"2016-12-21"},{"$f":"T7-1","v":"2016-12-22"},"2016-12-23","2016-12-24","2016-12-25","2016-12-26","2016-12-27","2016-12-28","2016-12-29","2016-12-30","2016-12-31","2017-01-01","2017-01-02","2017-01-03","2017-01-04","2017-01-05",{"$f":"C7","v":"2017-01-06"}]
["lundi",1,{"$f":"IF(ISNA(VLOOKUP(IF(WEEKDAY(C7,2)=5,C7+3,C7+1),'Jours fériés'!$B$3:$B$17,1,FALSE)),IF(WEEKDAY(C7,2)=5,C7+3,C7+1),IF(WEEKDAY(IF(WEEKDAY(C7,2)=5,C7+3,C7+1)+1,2)=6,IF(WEEKDAY(C7,2)=5,C7+3,C7+1)+1+2,IF(WEEKDAY(C7,2)=5,C7+3,C7+1)+1))","v":"2017-01-09"},{"$f":"finddate('Jours fériés'!$C$3:$C$17,$C8,D$2)","v":"2016-12-26"},{"$f":"finddate('Jours fériés'!$C$3:$C$17,$C8,E$2)","v":"2016-12-19"},null,null,null,null,null,null,null,{"$f":"M9","v":"2016-12-20"},"2016-12-21","2016-12-22","2016-12-23","2016-12-24",{"$f":"R9","v":"2016-12-25"},"2016-12-26",{"$f":"T9","v":"2016-12-27"},{"$f":"U9","v":"2016-12-28"},{"$f":"V9","v":"2016-12-29"},{"$f":"W9","v":"2016-12-30"},{"$f":"X9","v":"2016-12-31"},{"$f":"Y9","v":"2017-01-01"},{"$f":"Z9","v":"2017-01-02"},{"$f":"AA9","v":"2017-01-03"},{"$f":"AB9","v":"2017-01-04"},{"$f":"AC9","v":"2017-01-05"},{"$f":"AD9","v":"2017-01-06"},{"$f":"AE9","v":"2017-01-07"},{"$f":"AF9","v":"2017-01-08"},{"$f":"AG9","v":"2017-01-09"},{"$f":"AH9","v":"2017-01-10"}]
["mardi",2,{"$f":"IF(ISNA(VLOOKUP(IF(WEEKDAY(C8,2)=5,C8+3,C8+1),'Jours fériés'!$B$3:$B$17,1,FALSE)),IF(WEEKDAY(C8,2)=5,C8+3,C8+1),IF(WEEKDAY(IF(WEEKDAY(C8,2)=5,C8+3,C8+1)+1,2)=6,IF(WEEKDAY(C8,2)=5,C8+3,C8+1)+1+2,IF(WEEKDAY(C8,2)=5,C8+3,C8+1)+1))","v":"2017-01-10"},{"$f":"finddate('Jours fériés'!$C$3:$C$17,$C9,D$2)","v":"2016-12-27"},{"$f":"finddate('Jours fériés'!$C$3:$C$17,$C9,E$2)","v":"2016-12-20"},null,null,null,null,null,null,null,{"$f":"N9-1","v":"2016-12-20"},{"$f":"O9-1","v":"2016-12-21"},{"$f":"P9-1","v":"2016-12-22"},{"$f":"Q9-1","v":"2016-12-23"},{"$f":"R9-1","v":"2016-12-24"},{"$f":"S9-1","v":"2016-12-25"},{"$f":"T9-1","v":"2016-12-26"},"2016-12-27","2016-12-28","2016-12-29","2016-12-30","2016-12-31","2017-01-01","2017-01-02","2017-01-03","2017-01-04","2017-01-05","2017-01-06","2017-01-07","2017-01-08","2017-01-09",{"$f":"C9","v":"2017-01-10"}]
["mercredi",3,{"$f":"IF(ISNA(VLOOKUP(IF(WEEKDAY(C9,2)=5,C9+3,C9+1),'Jours fériés'!$B$3:$B$17,1,FALSE)),IF(WEEKDAY(C9,2)=5,C9+3,C9+1),IF(WEEKDAY(IF(WEEKDAY(C9,2)=5,C9+3,C9+1)+1,2)=6,IF(WEEKDAY(C9,2)=5,C9+3,C9+1)+1+2,IF(WEEKDAY(C9,2)=5,C9+3,C9+1)+1))","v":"2017-01-11"},{"$f":"finddate('Jours fériés'!$C$3:$C$17,$C10,D$2)","v":"2016-12-28"},{"$f":"finddate('Jours fériés'!$C$3:$C$17,$C10,E$2)","v":"2016-12-21"},null,null,null,null,null,null,null,{"$f":"M11","v":"2016-12-22"},"2016-12-23","2016-12-24","2016-12-25","2016-12-26",{"$f":"R11","v":"2016-12-27"},"2016-12-28",{"$f":"T11","v":"2016-12-29"},{"$f":"U11","v":"2016-12-30"},{"$f":"V11","v":"2016-12-31"},{"$f":"W11","v":"2017-01-01"},{"$f":"X11","v":"2017-01-02"},{"$f":"Y11","v":"2017-01-03"},{"$f":"Z11","v":"2017-01-04"},{"$f":"AA11","v":"2017-01-05"},{"$f":"AB11","v":"2017-01-06"},{"$f":"AC11","v":"2017-01-07"},{"$f":"AD11","v":"2017-01-08"},{"$f":"AE11","v":"2017-01-09"},{"$f":"AF11","v":"2017-01-10"},{"$f":"AG11","v":"2017-01-11"},{"$f":"AH11","v":"2017-01-12"}]
["jeudi",4,{"$f":"IF(ISNA(VLOOKUP(IF(WEEKDAY(C10,2)=5,C10+3,C10+1),'Jours fériés'!$B$3:$B$17,1,FALSE)),IF(WEEKDAY(C10,2)=5,C10+3,C10+1),IF(WEEKDAY(IF(WEEKDAY(C10,2)=5,C10+3,C10+1)+1,2)=6,IF(WEEKDAY(C10,2)=5,C10+3,C10+1)+1+2,IF(WEEKDAY(C10,2)=5,C10+3,C10+1)+1))","v":"2017-01-12"},{"$f":"finddate('Jours fériés'!$C$3:$C$17,$C11,D$2)","v":"2016-12-29"},{"$f":"finddate('Jours fériés'!$C$3:$C$17,$C11,E$2)","v":"2016-12-22"},null,null,null,null,null,null,null,{"$f":"N11-1","v":"2016-12-22"},{"$f":"O11-1","v":"2016-12-23"},{"$f":"P11-1","v":"2016-12-24"},{"$f":"Q11-1","v":"2016-12-25"},{"$f":"R11-1","v":"2016-12-26"},{"$f":"S11-1","v":"2016-12-27"},{"$f":"T11-1","v":"2016-12-28"},"2016-12-29","2016-12-30","2016-12-31","2017-01-01","2017-01-02","2017-01-03","2017-01-04","2017-01-05","2017-01-06","2017-01-07","2017-01-08","2017-01-09","2017-01-10","2017-01-11",{"$f":"C11","v":"2017-01-12"}]
["vendredi",5,{"$f":"IF(ISNA(VLOOKUP(IF(WEEKDAY(C11,2)=5,C11+3,C11+1),'Jours fériés'!$B$3:$B$17,1,FALSE)),IF(WEEKDAY(C11,2)=5,C11+3,C11+1),IF(WEEKDAY(IF(WEEKDAY(C11,2)=5,C11+3,C11+1)+1,2)=6,IF(WEEKDAY(C11,2)=5,C11+3,C11+1)+1+2,IF(WEEKDAY(C11,2)=5,C11+3,C11+1)+1))","v":"2017-01-13"},{"$f":"finddate('Jours fériés'!$C$3:$C$17,$C12,D$2)","v":"2016-12-30"},{"$f":"finddate('Jours fériés'!$C$3:$C$17,$C12,E$2)","v":"2016-12-23"},null,null,null,null,null,null,null,{"$f":"M13","v":"2016-12-26"},"2016-12-27","2016-12-28","2016-12-29","2016-12-30",{"$f":"R13","v":"2016-12-31"},"2017-01-01",{"$f":"T13","v":"2017-01-02"},{"$f":"U13","v":"2017-01-03"},{"$f":"V13","v":"2017-01-04"},{"$f":"W13","v":"2017-01-05"},{"$f":"X13","v":"2017-01-06"},{"$f":"Y13","v":"2017-01-07"},{"$f":"Z13","v":"2017-01-08"},{"$f":"AA13","v":"2017-01-09"},{"$f":"AB13","v":"2017-01-10"},{"$f":"AC13","v":"2017-01-11"},{"$f":"AD13","v":"2017-01-12"},{"$f":"AE13","v":"2017-01-13"},{"$f":"AF13","v":"2017-01-14"},{"$f":"AG13","v":"2017-01-15"},{"$f":"AH13","v":"2017-01-16"}]
["lundi",1,{"$f":"IF(ISNA(VLOOKUP(IF(WEEKDAY(C12,2)=5,C12+3,C12+1),'Jours fériés'!$B$3:$B$17,1,FALSE)),IF(WEEKDAY(C12,2)=5,C12+3,C12+1),IF(WEEKDAY(IF(WEEKDAY(C12,2)=5,C12+3,C12+1)+1,2)=6,IF(WEEKDAY(C12,2)=5,C12+3,C12+1)+1+2,IF(WEEKDAY(C12,2)=5,C12+3,C12+1)+1))","v":"2017-01-16"},{"$f":"finddate('Jours fériés'!$C$3:$C$17,$C13,D$2)","v":"2017-01-02"},{"$f":"finddate('Jours fériés'!$C$3:$C$17,$C13,E$2)","v":"2016-12-26"},null,null,null,null,null,null,null,{"$f":"N13-1","v":"2016-12-26"},{"$f":"O13-1","v":"2016-12-27"},{"$f":"P13-1","v":"2016-12-28"},{"$f":"Q13-1","v":"2016-12-29"},{"$f":"R13-1","v":"2016-12-30"},{"$f":"S13-1","v":"2016-12-31"},{"$f":"T13-1","v":"2017-01-01"},"2017-01-02","2017-01-03","2017-01-04","2017-01-05","2017-01-06","2017-01-07","2017-01-08","2017-01-09","2017-01-10","2017-01-11","2017-01-12","2017-01-13","2017-01-14","2017-01-15",{"$f":"C13","v":"2017-01-16"}]
["mardi",2,{"$f":"IF(ISNA(VLOOKUP(IF(WEEKDAY(C13,2)=5,C13+3,C13+1),'Jours fériés'!$B$3:$B$17,1,FALSE)),IF(WEEKDAY(C13,2)=5,C13+3,C13+1),IF(WEEKDAY(IF(WEEKDAY(C13,2)=5,C13+3,C13+1)+1,2)=6,IF(WEEKDAY(C13,2)=5,C13+3,C13+1)+1+2,IF(WEEKDAY(C13,2)=5,C13+3,C13+1)+1))","v":"2017-01-17"},{"$f":"finddate('Jours fériés'!$C$3:$C$17,$C14,D$2)","v":"2017-01-03"},{"$f":"finddate('Jours fériés'!$C$3:$C$17,$C14,E$2)","v":"2016-12-27"},null,null,null,null,null,null,null,{"$f":"M15","v":"2016-12-28"},"2016-12-29","2016-12-30","2016-12-31","2017-01-01",{"$f":"R15","v":"2017-01-02"},"2017-01-03",{"$f":"T15","v":"2017-01-04"},{"$f":"U15","v":"2017-01-05"},{"$f":"V15","v":"2017-01-06"},{"$f":"W15","v":"2017-01-07"},{"$f":"X15","v":"2017-01-08"},{"$f":"Y15","v":"2017-01-09"},{"$f":"Z15","v":"2017-01-10"},{"$f":"AA15","v":"2017-01-11"},{"$f":"AB15","v":"2017-01-12"},{"$f":"AC15","v":"2017-01-13"},{"$f":"AD15","v":"2017-01-14"},{"$f":"AE15","v":"2017-01-15"},{"$f":"AF15","v":"2017-01-16"},{"$f":"AG15","v":"2017-01-17"},{"$f":"AH15","v":"2017-01-18"}]
["mercredi",3,{"$f":"IF(ISNA(VLOOKUP(IF(WEEKDAY(C14,2)=5,C14+3,C14+1),'Jours fériés'!$B$3:$B$17,1,FALSE)),IF(WEEKDAY(C14,2)=5,C14+3,C14+1),IF(WEEKDAY(IF(WEEKDAY(C14,2)=5,C14+3,C14+1)+1,2)=6,IF(WEEKDAY(C14,2)=5,C14+3,C14+1)+1+2,IF(WEEKDAY(C14,2)=5,C14+3,C14+1)+1))","v":"2017-01-18"},{"$f":"finddate('Jours fériés'!$C$3:$C$17,$C15,D$2)","v":"2017-01-04"},{"$f":"finddate('Jours fériés'!$C$3:$C$17,$C15,E$2)","v":"2016-12-28"},null,null,null,null,null,null,null,{"$f":"N15-1","v":"2016-12-28"},{"$f":"O15-1","v":"2016-12-29"},{"$f":"P15-1","v":"2016-12-30"},{"$f":"Q15-1","v":"2016-12-31"},{"$f":"R15-1","v":"2017-01-01"},{"$f":"S15-1","v":"2017-01-02"},{"$f":"T15-1","v":"2017-01-03"},"2017-01-04","2017-01-05","2017-01-06","2017-01-07","2017-01-08","2017-01-09","2017-01-10","2017-01-11","2017-01-12","2017-01-13","2017-01-14","2017-01-15","2017-01-16","2017-01-17",{"$f":"C15","v":"2017-01-18"}]
["jeudi",4,{"$f":"IF(ISNA(VLOOKUP(IF(WEEKDAY(C15,2)=5,C15+3,C15+1),'Jours fériés'!$B$3:$B$17,1,FALSE)),IF(WEEKDAY(C15,2)=5,C15+3,C15+1),IF(WEEKDAY(IF(WEEKDAY(C15,2)=5,C15+3,C15+1)+1,2)=6,IF(WEEKDAY(C15,2)=5,C15+3,C15+1)+1+2,IF(WEEKDAY(C15,2)=5,C15+3,C15+1)+1))","v":"2017-01-19"},{"$f":"finddate('Jours fériés'!$C$3:$C$17,$C16,D$2)","v":"2017-01-05"},{"$f":"finddate('Jours fériés'!$C$3:$C$17,$C16,E$2)","v":"2016-12-29"},null,null,null,null,null,null,null,{"$f":"M17","v":"2016-12-30"},"2016-12-31","2017-01-01","2017-01-02","2017-01-03",{"$f":"R17","v":"2017-01-04"},"2017-01-05",{"$f":"T17","v":"2017-01-06"},{"$f":"U17","v":"2017-01-07"},{"$f":"V17","v":"2017-01-08"},{"$f":"W17","v":"2017-01-09"},{"$f":"X17","v":"2017-01-10"},{"$f":"Y17","v":"2017-01-11"},{"$f":"Z17","v":"2017-01-12"},{"$f":"AA17","v":"2017-01-13"},{"$f":"AB17","v":"2017-01-14"},{"$f":"AC17","v":"2017-01-15"},{"$f":"AD17","v":"2017-01-16"},{"$f":"AE17","v":"2017-01-17"},{"$f":"AF17","v":"2017-01-18"},{"$f":"AG17","v":"2017-01-19"},{"$f":"AH17","v":"2017-01-20"}]
["vendredi",5,{"$f":"IF(ISNA(VLOOKUP(IF(WEEKDAY(C16,2)=5,C16+3,C16+1),'Jours fériés'!$B$3:$B$17,1,FALSE)),IF(WEEKDAY(C16,2)=5,C16+3,C16+1),IF(WEEKDAY(IF(WEEKDAY(C16,2)=5,C16+3,C16+1)+1,2)=6,IF(WEEKDAY(C16,2)=5,C16+3,C16+1)+1+2,IF(WEEKDAY(C16,2)=5,C16+3,C16+1)+1))","v":"2017-01-20"},{"$f":"finddate('Jours fériés'!$C$3:$C$17,$C17,D$2)","v":"2017-01-06"},{"$f":"finddate('Jours fériés'!$C$3:$C$17,$C17,E$2)","v":"2016-12-30"},null,null,null,null,null,null,null,{"$f":"N17-1","v":"2016-12-30"},{"$f":"O17-1","v":"2016-12-31"},{"$f":"P17-1","v":"2017-01-01"},{"$f":"Q17-1","v":"2017-01-02"},{"$f":"R17-1","v":"2017-01-03"},{"$f":"S17-1","v":"2017-01-04"},{"$f":"T17-1","v":"2017-01-05"},"2017-01-06","2017-01-07","2017-01-08","2017-01-09","2017-01-10","2017-01-11","2017-01-12","2017-01-13","2017-01-14","2017-01-15","2017-01-16","2017-01-17","2017-01-18","2017-01-19",{"$f":"C17","v":"2017-01-20"}]
["lundi",1,{"$f":"IF(ISNA(VLOOKUP(IF(WEEKDAY(C17,2)=5,C17+3,C17+1),'Jours fériés'!$B$3:$B$17,1,FALSE)),IF(WEEKDAY(C17,2)=5,C17+3,C17+1),IF(WEEKDAY(IF(WEEKDAY(C17,2)=5,C17+3,C17+1)+1,2)=6,IF(WEEKDAY(C17,2)=5,C17+3,C17+1)+1+2,IF(WEEKDAY(C17,2)=5,C17+3,C17+1)+1))","v":"2017-01-23"},{"$f":"finddate('Jours fériés'!$C$3:$C$17,$C18,D$2)","v":"2017-01-09"},{"$f":"finddate('Jours fériés'!$C$3:$C$17,$C18,E$2)","v":"2017-01-02"},null,null,null,null,null,null,null,{"$f":"M19","v":"2017-01-03"},"2017-01-04","2017-01-05","2017-01-06","2017-01-07",{"$f":"R19","v":"2017-01-08"},"2017-01-09",{"$f":"T19","v":"2017-01-10"},{"$f":"U19","v":"2017-01-11"},{"$f":"V19","v":"2017-01-12"},{"$f":"W19","v":"2017-01-13"},{"$f":"X19","v":"2017-01-14"},{"$f":"Y19","v":"2017-01-15"},{"$f":"Z19","v":"2017-01-16"},{"$f":"AA19","v":"2017-01-17"},{"$f":"AB19","v":"2017-01-18"},{"$f":"AC19","v":"2017-01-19"},{"$f":"AD19","v":"2017-01-20"},{"$f":"AE19","v":"2017-01-21"},{"$f":"AF19","v":"2017-01-22"},{"$f":"AG19","v":"2017-01-23"},{"$f":"AH19","v":"2017-01-24"}]
["mardi",2,{"$f":"IF(ISNA(VLOOKUP(IF(WEEKDAY(C18,2)=5,C18+3,C18+1),'Jours fériés'!$B$3:$B$17,1,FALSE)),IF(WEEKDAY(C18,2)=5,C18+3,C18+1),IF(WEEKDAY(IF(WEEKDAY(C18,2)=5,C18+3,C18+1)+1,2)=6,IF(WEEKDAY(C18,2)=5,C18+3,C18+1)+1+2,IF(WEEKDAY(C18,2)=5,C18+3,C18+1)+1))","v":"2017-01-24"},{"$f":"finddate('Jours fériés'!$C$3:$C$17,$C19,D$2)","v":"2017-01-10"},{"$f":"finddate('Jours fériés'!$C$3:$C$17,$C19,E$2)","v":"2017-01-03"},null,null,null,null,null,null,null,{"$f":"N19-1","v":"2017-01-03"},{"$f":"O19-1","v":"2017-01-04"},{"$f":"P19-1","v":"2017-01-05"},{"$f":"Q19-1","v":"2017-01-06"},{"$f":"R19-1","v":"2017-01-07"},{"$f":"S19-1","v":"2017-01-08"},{"$f":"T19-1","v":"2017-01-09"},"2017-01-10","2017-01-11","2017-01-12","2017-01-13","2017-01-14","2017-01-15","2017-01-16","2017-01-17","2017-01-18","2017-01-19","2017-01-20","2017-01-21","2017-01-22","2017-01-23",{"$f":"C19","v":"2017-01-24"}]
["mercredi",3,{"$f":"IF(ISNA(VLOOKUP(IF(WEEKDAY(C19,2)=5,C19+3,C19+1),'Jours fériés'!$B$3:$B$17,1,FALSE)),IF(WEEKDAY(C19,2)=5,C19+3,C19+1),IF(WEEKDAY(IF(WEEKDAY(C19,2)=5,C19+3,C19+1)+1,2)=6,IF(WEEKDAY(C19,2)=5,C19+3,C19+1)+1+2,IF(WEEKDAY(C19,2)=5,C19+3,C19+1)+1))","v":"2017-01-25"},{"$f":"finddate('Jours fériés'!$C$3:$C$17,$C20,D$2)","v":"2017-01-11"},{"$f":"finddate('Jours fériés'!$C$3:$C$17,$C20,E$2)","v":"2017-01-04"},null,null,null,null,null,null,null,{"$f":"M21","v":"2017-01-05"},"2017-01-06","2017-01-07","2017-01-08","2017-01-09",{"$f":"R21","v":"2017-01-10"},"2017-01-11",{"$f":"T21","v":"2017-01-12"},{"$f":"U21","v":"2017-01-13"},{"$f":"V21","v":"2017-01-14"},{"$f":"W21","v":"2017-01-15"},{"$f":"X21","v":"2017-01-16"},{"$f":"Y21","v":"2017-01-17"},{"$f":"Z21","v":"2017-01-18"},{"$f":"AA21","v":"2017-01-19"},{"$f":"AB21","v":"2017-01-20"},{"$f":"AC21","v":"2017-01-21"},{"$f":"AD21","v":"2017-01-22"},{"$f":"AE21","v":"2017-01-23"},{"$f":"AF21","v":"2017-01-24"},{"$f":"AG21","v":"2017-01-25"},{"$f":"AH21","v":"2017-01-26"}]
{"$rows_left_out":241}
{"sheet":"Jours fériés","index":1,"n_rows":19,"n_cols":4,"rows_kept":19,"cut":false,"hidden":false,"merged":[]}
["Année:",2017,"PAYS :","France"]
["Evènements","Date","Jour semaine"]
["Jour de l’An",{"$f":"DATE($B$1,1,1)","v":"2017-01-01"},{"$f":"IF(B3=\"\",\"\",B3)","v":"2017-01-01"}]
["Lundi de Pâques",{"$f":"'calcul des jours grégorien'!C16+1","v":"2017-04-17"},{"$f":"IF(B4=\"\",\"\",B4)","v":"2017-04-17"}]
["Fête du travail",{"$f":"DATE($B$1,5,1)","v":"2017-05-01"},"2017-05-01"]
[{"$f":"IF(D1=\"France\",\"Armistice 40/45\",\"Réservé pour la France\")","v":"Armistice 40/45"},{"$f":"IF(D1=\"France\",DATE($B$1,5,8),\"\")","v":"2017-05-08"},"2017-05-08"]
["Ascension",{"$f":"'calcul des jours grégorien'!C18","v":"2017-05-25"},"2017-05-25"]
["Lundi de la Pentecôte",{"$f":"'calcul des jours grégorien'!C17","v":"2017-06-05"},"2017-06-05"]
["Fête nationale",{"$f":"IF(D1=\"Belgique\",DATE($B$1,7,21),DATE($B$1,7,14))","v":"2017-07-14"},"2017-07-14"]
["Assomption",{"$f":"DATE($B$1,8,15)","v":"2017-08-15"},"2017-08-15"]
["Toussaint",{"$f":"DATE($B$1,11,1)","v":"2017-11-01"},"2017-11-01"]
["Armistice 14/18",{"$f":"DATE($B$1,11,11)","v":"2017-11-11"},"2017-11-11"]
["Noël",{"$f":"DATE($B$1,12,25)","v":"2017-12-25"},"2017-12-25"]
["Jour de remplacement 1",null,""]
["Jour de remplacement 2",null,""]
["Jour de remplacement 3",null,""]
["Jour de remplacement 4",null,""]
["Jours non fériés",null,""]
["Mardi gras",{"$f":"B4-1-47","v":"2017-02-28"},"2017-02-28"]

{"sheet":"calcul des jours grégorien","index":2,"n_rows":18,"n_cols":8,"rows_kept":18,"cut":false,"hidden":false,"merged":[[2,4,3,4],[2,6,3,6],[15,0,15,1],[17,0,17,1],[16,0,16,1],[2,0,3,0],[2,2,3,2]]}
["Date de Pâques grégorienne en ",null,null,{"$f":"'Jours fériés'!B1","v":2017}," (algorithme de Butcher)"]
[]
["Dividende","Valeur","Diviseur","Valeur","Quotient","Valeur","Reste","Valeur"]
[null,"Dividende",null,"Diviseur",null,"Quotient",null,"Reste"]
["Année",{"$f":"D1","v":2017},19,19,null,null,"n",{"$f":"MOD(B5,C5)","v":3}]
["Année",{"$f":"B5","v":2017},100,100,"c",{"$f":"INT(B6/C6)","v":20},"u",{"$f":"MOD(B6,C6)","v":17}]
["c",{"$f":"INT(B5/100)","v":20},4,4,"s",{"$f":"INT(B7/C7)","v":5},"t",{"$f":"MOD(B7,C7)","v":0}]
["c + 8",{"$f":"B7+8","v":28},25,25,"p",{"$f":"INT(B8/C8)","v":1}]
["c - p + 1",{"$f":"B7-F8+1","v":20},3,3,"q",{"$f":"INT(B9/C9)","v":6}]
["19 n + c - s - q + 15",{"$f":"(19*H5)+B7-F7-F9+15","v":81},30,30,null,null,"e",{"$f":"MOD(B10,C10)","v":21}]
["u",{"$f":"H6","v":17},4,4,"b",{"$f":"INT(B11/C11)","v":4},"d",{"$f":"MOD(B11,C11)","v":1}]
["32 + 2 t + 2 b - e - d",{"$f":"32+(2*H7)+(2*F11)-H10-H11","v":18},7,7,null,null,"L",{"$f":"MOD(B12,C12)","v":4}]
["n + 11 e + 22 L",{"$f":"H5+(11*H10)+(22*H12)","v":322},451,451,"h",{"$f":"INT(B13/C13)","v":0}]
["e + L - 7 h +114",{"$f":"H10+H12-(7*F13)+114","v":139},31,31,"m",{"$f":"INT(B14/C14)","v":4},"j",{"$f":"MOD(B14,C14)","v":15}]
[]
["Dimanche de Pâques =",null,{"$f":"DATE(D1,F14,H14+1)","v":"2017-04-16"}]
["Lundi de Pentecôte =",null,{"$f":"C16+49+1","v":"2017-06-05"}]
["Ascension =",null,{"$f":"C16+39","v":"2017-05-25"}]

{"sheet":"Mode d'emploi","index":3,"n_rows":7,"n_cols":2,"rows_kept":7,"cut":false,"hidden":false,"merged":[]}
["MODE D'EMPLOI"]
[1,"Précisez dans l'onglet \"Jours fériés\" :\n-  dans la cellule B1 l'année de la période annuelle désirée (si l'année désirée est 2017 mettre 2017) \n- dans la cellule D1 le pays concerné (Belgique ou France) ceci pour adapter les jours fériés\n- dans les cellules C14 à C17 les jours de congés éventuels de compensation (lorsque le jour fériés tombe un WE - législation belge - France ??) "]
[2,"Le tableur calcule automatiquement dans l'onglet \"Calcul des dates\" :\n- les jours ouvrables de l'année grâce au calcul automatique des jours fériés (algorithme de Butcher - onglet \" calcul des jours grégorien) qui détermine les jours liés à la fête de Pâques)\nLa colonne C contiendra donc uniquement les jours ouvrables\n- grâce à la fonction personnalisée \"=FindDate('Jours fériés'!$C$3:$C$17;$C3;D$2)\", il calcule également le décalage précis de 10 et de 15 jours ouvrés dans les colonnes D et E\nAttention : la fonction doit être introduite comme fonction matricielle (entrée en appuyant en même temps sur CTRL/MAJ/ENTER). Excel ajoutera les { } devant et derrière et prendra en considération la plage des jours fériés se trouvant dans l'onglet \"Jours fériés\""]
[3,"Les colonnes de H à AH ne sont utiles QUE POUR AIDER AU  CONTRÔLE de l'application : ELLES PEUVENT ETRE SUPPRIMEES DES QUE TOUT LE MONDE SERA CERTAIN QUE TOUT FONCTIONNE COMME DESIRE."]
[4,"Si besoin de plus d'explications : posez les questions nécessaires.  Sachez que :\n- la fonction personnalisée est développée dans le module1 VBA.  Elle est documentée pour permettre sa compréhension.  Elle peutêtre appelée par \"Insertion fonction\" Personnalisée.  Un commentaire expliques comment il faut compléter les 3 paramètres : Plage ; Cellule et Cellule2."]
[5,"Le classeur sera beaucoup plus rapide en enlevant les formules des colonnes de contrôle (H à AH) mais je les ai laissées pour te permettre de facilement vérifier.  Regardes par exemple le calcul du 9/5/2017 et tu t'apercevras que le calcul tiens bien compte de 2 jours fériés duant la période précédente."]
[6,"Bon amusement…"]