{"text_format":"1","workbook":"xlsx","n_sheets":34,"sheets":["00 TABLE DES MATIERES","01a INGREDIENTS","01b BOISSONS","01c #PACK","01c EMBALLAGE","01c SANS TRANSFORMATION","02a PASTA  poulet (grd)","02a PASTA poulet (moyen)","02b PASTA mozza (grd)","02b PASTA mozza (moyen)","02c PASTA toscan (grd)","02c PASTA toscan (moyen)","03 MINI TOMATE","03 SALADE ice caesar","03 SALADE ice saumon concombre","04  CEREAL lentilles & boulgour","04 CEREALES riz niçois","05 FOCACCIA HAM & CHEDDAR","05 FOCACCIA parme","05 FOCACCIA POIVRON","05 FOCACCIA tomate mozza","06 CIAB CHEDDAR BACON","07 SAND BAGUETTE THONMAYO","07 SAND FLUTE brie","07 SAND PAIN LAIT cheddar","08 Cheesecake Phil spéculoos","08 FB nature","09 SOUPE CAROTTE","09 SOUPE CHICON","10 JUS cherry chérie ","10 JUS dark side","12 Mélange mout mayo cum","12 PATE FEUILLETEE","15 SF 2 fromages"],"not_rendered":{"charts":0,"images":0,"macros":1,"external_links":1,"defined_names":51,"comments":0,"pivot_tables":0},"unopened":[],"bounds":{"document_bytes":16777216,"sheet_cells":100000,"rows_first":2000,"rows_last":500,"rows_between":2000,"halvings":0,"cell_chars":16384,"cell_head_chars":4096},"cells_cut":0,"cells_raw":0,"read":"whole","date_system":"1900"}

{"sheet":"00 TABLE DES MATIERES","index":0,"n_rows":142,"n_cols":1,"rows_kept":142,"cut":false,"hidden":false,"merged":[]}
["01 MASQUE vierge"]
["01a INGREDIENTS"]
["01b BOISSONS"]
["01c #PACK"]
["01c EMBALLAGE"]
["01c SANS TRANSFORMATION"]
["02a PASTA  poulet (grd)"]
["02a PASTA poulet (moyen)"]
["02b PASTA mozza (grd)"]
["02b PASTA mozza (moyen)"]
["02c PASTA toscan (grd)"]
["02c PASTA toscan (moyen)"]
["03 MINI TOMATE"]
["03 SALADE ice caesar"]
["03 SALADE ice saumon concombre"]
["04  CEREAL lentilles & boulgour"]
["04 CEREALES riz niçois"]
["05 FOCACCIA HAM & CHEDDAR"]
["05 FOCACCIA parme"]
["05 FOCACCIA POIVRON"]
["05 FOCACCIA tomate mozza"]
["06 CIAB CHEDDAR BACON"]
["07 SAND BAGUETTE THONMAYO"]
["07 SAND FLUTE brie"]
["07 SAND PAIN LAIT cheddar"]
["08 Cheesecake Phil spéculoos"]
["08 FB nature"]
["09 SOUPE CAROTTE"]
["09 SOUPE CHICON"]
["10 JUS cherry chérie "]
["10 JUS dark side"]
["12 Mélange mout mayo cum"]
["12 PATE FEUILLETEE"]
["15 SF 2 fromages"]
[]
[]
[]
[]
[]
[]
[]
[]
[]
[]
[]
[]
[]
[]
[]
[]
[]
[]
[]
[]
[]
[]
[]
[]
[]
[]
[]
[]
[]
[]
[]
[]
[]
[]
[]
[]
[]
[]
[]
[]
[]
[]
[]
[]
[]
[]
[]
[]
[]
[]
[]
[]
[]
[]
[]
[]
[]
[]
[]
[]
[]
[]
[]
[]
[]
[]
["08 RIZ AU LAIT nature"]
["08 TARTE BANANOFIE"]
["08 TARTE POM SUCRE"]
["08 YAOURT coulis"]
["08 YAOURT fruits rouges"]
["08 YAOURT miel graine de courge"]
["08 YAOURT muesli choco"]
["08 YAOURT muesli fruits"]
["08 YAOURT nature"]
["09 GASPACHO tomates"]
["09 SOUPE CAROTTE"]
["09 SOUPE CHICON"]
["10 AUTRES bonbons et apéro"]
["10 JUS cherry chérie "]
["10 JUS dark side"]
["10 JUS dingo mango"]
["10 JUS funny kiwi"]
["10 JUS ORANGE"]
["10 JUS sweet lovers"]
["10 JUS wake up"]
["10 SANGRIA"]
["101 JUS de carotte"]
["11 QUICHE COURGETTE"]
["12 Mélange chèvre"]
["12 Mélange fêta"]
["12 Mélange mout mayo cum"]
["12 Mélange sal fêt"]
["12 Mélange tapenade noire"]
["12 Mélange thon mayo"]
["12 PAIN DE VIANDE"]
["12 PATE FEUILLETEE"]
["13 ptit dej"]
["15 SF jambon beurre"]
["15 SF chorizo"]
["15 SF thon mayo"]
["15 SF poulet crudités"]
["15 SF jambon crudités"]
["15 SF tomate mozza"]
["15 SF chèvre épinards"]
["15 SF 2 fromages"]
["zz SANS TRANSFORMATION"]
["zzz EMBALLAGE (2)"]

{"sheet":"01a INGREDIENTS","index":1,"n_rows":554,"n_cols":16,"rows_kept":554,"cut":false,"hidden":false,"merged":[]}
[0]
["0Nom d'aliment","Unité","Prix/kg HT","1 Protéines","2 Lipides","3 Glucides","4 Fibres","FOURNISSEUR","k/cal","% DE PERTE","perte","--\nPOIDS NET","++\nPOIDS BRUT","DATE","QUOI","NEGO A"]
["agar-agar","kg",5,null,null,null,null,"METRO",{"$f":"((D3*4)+(F3*4)+(E3*9))","v":0},{"$f":"K3/M3","v":0},{"$f":"M3-L3","v":0},100,100,"2016-03-03","DIVERS"]
["Ail en poudre","kg",5,168,8,727,null,"METRO",3652,0,0,100,100,"2016-03-03","ASSAISONNEMENT"]
["Ail frais","kg",5,60,1,280,null,"JOSA",1369,0.1,10,90,100,null,"ASSAISONNEMENT"]
["Amandes effilées","kg",5,211,501,69,129,"METRO",5629,0,0,100,100,null,"FRUITS SECS"]
["Amandes émondées","kg",5,211,501,69,129,"METRO",5629,0,0,100,100,null,"FRUITS SECS"]
["Amandes en poudre","kg",5,1,1,1,1,"METRO",17,0,0,100,100,null,"FRUITS SECS"]
["Ananas au sirop del monte","kg",5,4,1,185,7,"METRO",765,0.39285714285714285,220,340,560,"2016-03-03","BOITE FRUITS"]
["Ananas frais","kg",5,6,0,116,13,"JOSA",488,0.6,60,40,100,null,"FRUITS"]
["Anchois à l'huile 1 =4g","kg",5,201,100,0,0,"METRO",1704,0.3,30,70,100,null,"POISSON"]
["Aneth","kg",5,1,1,1,1,"METRO",17,0,0,100,100,"2016-03-03","ASSAISONNEMENT"]
["Artichaud en quart ","kg",5,null,null,null,null,"METRO",0,0.22500000000000001,450,1550,2000,null,"BOITES LEGUMES"]
["ARTIchaud en quart huile d'olive","kg",5,null,null,null,null,"METRO",0,0.2,200,800,1000,null,"SACHET"]
["Aubergines (pour info 1 auberg=400g)","kg",5,10,0,30,25,"JOSA",160,0.2,20,80,100,null,"LEGUMES"]
["Aubergines huile d'olive 1Tranche","pièce",5,null,null,null,null,"CIABATTA MANIA",0,0,0,100,100,null,"PREPARATIONS"]
["Avocats","pièce",5,19,195,18,43,"JOSA",1903,0.5,50,50,100,null,"LEGUMES"]
["Bacon","kg",5,176,236,6,0,"METRO",2852,0.3,30,70,100,null,"CHARCUTERIE"]
["Bacon (lard fumé 2mm) tranché","kg",5,null,null,null,null,"VT FOOD",0,0.3,30,70,100,"2015-04-01","CHARCUTERIE",8.4]
["BAGUETTE PARISIENNE ","pièce",5,null,null,null,null,"FLEUR DE PAIN",0,0,0,100,100,null,"BAGUETTE"]
["BAGUETTE PARISIENNE 1/2","pièce",5,null,null,null,null,"FLEUR DE PAIN",0,0,0,100,100,null,"BAGUETTE"]
["baie de genevrier","kg",5,null,null,null,null,"METRO",0,0,0,100,100,"2016-03-03","ASSAISONNEMENT"]
["Bananes ","kg",5,11,0,196,17,"JOSA",828,0.3,30,70,100,null,"FRUITS"]
["Bananes (1=177g)","pièce",5,11,0,196,17,"JOSA",828,0,0,100,100,null,"FRUITS"]
["Basilic frais (1 brin = 0,005)","unité",5,1,1,1,1,"JOSA",17,0,0,100,100,null,"HERBES"]
["Basilic frais (1bte = 0,040)","Botte",5,1,1,1,1,"JOSA",17,0,0,100,100,null,"HERBES"]
["Basilic sec","kg",5,1,1,1,1,"METRO",17,0,0,100,100,"2016-03-03","ASSAISONNEMENT"]
["Betteraves rouges","kg",5,10,1,10,7,"JOSA",89,0.2,20,80,100,null,"LEGUMES"]
["Beurre","kg",5,6,821,6,0,"LOBET",7437,0,0,100,100,null,"BEURRE"]
["beurre dosette 10g","pièce",5,null,null,null,null,"LOBET",0,0,0,100,100,null,"BEURRE"]
["Beurre par 5k","kg",5,null,null,null,null,"LOBET",0,0,0,100,100,"2015-04-01","BEURRE"]
["Billes crispy chocolat déco gateaux","kg",5,0,0,996,0,"METRO",3984,0,0,100,100,"2016-03-03","SUCRES"]
["Billes déco gateaux","kg",5,0,0,996,0,"METRO",3984,0,0,100,100,"2016-03-03","SUCRES"]
["Biscuit à la cuillère horeca","kg",5,null,null,null,null,"METRO",null,0,0,100,100,null,"SUCRES"]
["Bleu d'auvergne","kg",5,null,null,null,null,"LOBET",{"$f":"((D35*4)+(F35*4)+(E35*9))","v":0},{"$f":"K35/M35","v":0},{"$f":"M35-L35","v":0},100,100,null,"FROMAGE"]
["bonbon type haribo","kg",5,null,null,null,null,"METRO",{"$f":"((D36*4)+(F36*4)+(E36*9))","v":0},0,0,100,100,null,"DIVERS"]
["Bouillon de légumes en pâte 1,5 K","kg",5,null,null,null,null,"METRO",{"$f":"((D37*4)+(F37*4)+(E37*9))","v":0},0,0,100,100,"2016-02-26","ASSAISONNEMENT"]
["Bouillon de POULE en pâte 1,5 K","kg",5,null,null,null,null,null,null,0,0,100,100,null,"ASSAISONNEMENT"]
["Boulgour","kg",5,130,20,610,null,"METRO",{"$f":"((D39*4)+(F39*4)+(E39*9))","v":3140},0,0,100,100,null,"PATES & RIZ & FECULES"]
["Brie de Meaux ","kg",5,226,233,0,0,"LOBET",3001,0,0,100,100,"2015-04-01","FROMAGE"]
["brie METRO","kg",5,null,null,null,null,"METRO",0,0,0,100,100,null,"FROMAGE"]
["Brocolis","kg",5,30,0,20,31,"JOSA",200,0,0,100,100,null,"LEGUMES"]
["cacahuettes","kg",5,null,null,null,null,"METRO",0,0,0,100,100,null,"FRUITS SECS"]
["Cacao en poudre","kg",5,42,25,870,"_","METRO",3873,0,0,100,100,null,"CHOCO / SIROP"]
["café pantera","kg",5,null,null,null,null,"PONTI",0,0,0,100,100,"2015-04-01","CAFE & THE"]
["café pantera 0,007g","pièce",5,null,null,null,null,"PONTI",0,0,0,100,100,"2015-04-01","CAFE & THE"]
["café topping","Litre",5,null,null,null,null,"METRO",null,0,0,100,100,"03/13/16","CHOCO / SIROP"]
["cannelle en baton","kg",5,null,null,null,null,"METRO",{"$f":"((D48*4)+(F48*4)+(E48*9))","v":0},0,0,100,100,"2016-03-03","ASSAISONNEMENT"]
["Cannelle poudre horeca select 450g ","kg",5,40,30,560,244,"METRO",{"$f":"((D49*4)+(F49*4)+(E49*9))","v":2670},0,0,100,100,null,"ASSAISONNEMENT"]
["Capres","kg",5,null,null,null,null,"METRO",{"$f":"((D50*4)+(F50*4)+(E50*9))","v":0},0.375,270,450,720,null,"BOITES LEGUMES"]
["capsule de lait  ind","pièce",5,null,null,null,null,"PONTI",{"$f":"((D51*4)+(F51*4)+(E51*9))","v":0},0,0,100,100,"2016-03-03","LAITAGE"]
["capsule de lait ind Nutroma 7,5g","pièce",5,null,null,null,null,"METRO",null,0,0,100,100,"2016-03-03","LAITAGE"]
["capsule de lait ind Nutroma 9g","pièce",5,null,null,null,null,"METRO",null,0,0,100,100,"2016-03-03","LAITAGE"]
["Caramel topping 1 l imperial","Litre",5,null,null,null,null,"METRO",{"$f":"((D54*4)+(F54*4)+(E54*9))","v":0},0.05,5,95,100,"2016-03-03","CHOCO / SIROP"]
["Cardamome","kg",5,1,1,1,1,"METRO",{"$f":"((D55*4)+(F55*4)+(E55*9))","v":17},0,0,100,100,null,"ASSAISONNEMENT"]
["Carottes","kg",5,4,0,67,32,"JOSA",{"$f":"((D56*4)+(F56*4)+(E56*9))","v":284},0.2,20,80,100,null,"LEGUMES"]
["Carottes épice thai","kg",5,4,0,67,32,"CIABATTA MANIA",{"$f":"((D57*4)+(F57*4)+(E57*9))","v":284},0,0,100,100,null,"PREPARATIONS"]
["carottes rappées josa estimation","kg",5,null,null,null,null,"JOSA"]
["carottes surgelées (sac2,5k)","kg",5,null,null,null,null,"DAVIGEL",{"$f":"((D59*4)+(F59*4)+(E59*9))","v":0},{"$f":"K59/M59","v":0},{"$f":"M59-L59","v":0},100,100,null,"SURGELES"]
["Cassis congelés","kg",5,2,0,65,87,"DAVIGEL",{"$f":"((D60*4)+(F60*4)+(E60*9))","v":268},0,0,100,100,null,"SURGELES"]
["Cassonade (graeffe)","kg",5,0,0,950,0,"METRO",{"$f":"((D61*4)+(F61*4)+(E61*9))","v":3800},0,0,100,100,null,"SUCRES"]
["Céleri branche","kg",5,10,0,20,18,"JOSA",{"$f":"((D62*4)+(F62*4)+(E62*9))","v":120},0.3,30,70,100,null,"LEGUMES"]
["celeri en bocaux","kg",5,null,null,null,null,"METRO",null,0.36764705882352944,250,430,680,null,"BOITE FRUITS"]
["celeri rave","kg",5,null,null,null,null,"JOSA",{"$f":"((D64*4)+(F64*4)+(E64*9))","v":0},0.3,30,70,100,null,"LEGUMES"]
["Céleri vert","kg",5,10,1,33,10,"JOSA",{"$f":"((D65*4)+(F65*4)+(E65*9))","v":181},0.3,30,70,100,null,"LEGUMES"]
["Cerfeuil frais","Botte",5,36,5,62,53,"JOSA",{"$f":"((D66*4)+(F66*4)+(E66*9))","v":437},0.3,30,70,100,null,"HERBES"]
["Cerises en bocaux","kg",5,null,null,null,null,"METRO",null,{"$error":"#DIV/0!"},null,null,null,null,"BOITE FRUITS"]
["Cerneaux de noix","kg",5,150,670,27,67,"METRO",{"$f":"((D68*4)+(F68*4)+(E68*9))","v":6738},0,{"$f":"M68-L68","v":0},100,100,null,"FRUITS SECS"]
["chai tea spiced","pièce",5,null,null,null,null,"DELIDRINCKS",0,0,0,100,100,null,"CAFE & THE"]
["Champignons de paris","kg",5,23,0,4,15,"JOSA",108,0.2,20,80,100,null,"LEGUMES"]
["champignons en boite (soupe)","kg",5,null,null,null,null,"METRO",0,0.5,50,50,100,null,"BOITES LEGUMES"]
["Chantilly bombe 700 ml","Litre",5,null,null,null,null,"METRO",0,0,0,100,100,null,"LAITAGE"]
["Chantilly dose 30g","pièce",5,null,null,null,null,"METRO",0,0,0,100,100,null,"LAITAGE"]
["chapelure 5kg","kg",5,null,null,null,null,"METRO",0,0,0,100,100,"2016-03-03","PATES & RIZ & FECULES"]
["Cheddar tranché","kg",5,259,326,4,0,"LOBET",3986,0,0,100,100,"2015-04-01","FROMAGE"]
["Cheddar tranché (dose : 2,5 demi T =25g)","pièce",5,null,null,null,null,"LOBET",null,0,0,100,100,"2016-04-25","FROMAGE"]
["Cheddar tranché (dose : 3 demi T =30g)","pièce",5,null,null,null,null,"LOBET",null,0,0,100,100,"2016-04-25","FROMAGE"]
["chèvre frais buche 1k","kg",5,156,295,40,"_","LOBET",{"$f":"((D78*4)+(F78*4)+(E78*9))","v":3439},0,0,100,100,"2015-04-01","FROMAGE"]
["chicon","kg",5,null,null,null,null,"JOSA",0,0.2,20,80,100,null,"LEGUMES"]
["chocolat au lait ","kg",5,null,null,null,null,"METRO",0,0,0,100,100,"2016-03-03","CHOCO / SIROP"]
["chocolat au lait ( dose de 35 g)","pièce",5,null,null,null,null,"METRO",0,0,0,100,100,null,"CHOCO / SIROP"]
["chocolat noir ( dose de 35 g)","kg",5,null,null,null,null,"METRO",0,0,0,100,100,null,"CHOCO / SIROP"]
["Chocolat noir pistolles","kg",5,54,309,531,70,"METRO",5121,0,0,100,100,"2016-03-03","CHOCO / SIROP"]
["Chocolat sirop/liquide","Litre",5,null,null,null,null,"METRO",0,0,0,100,100,null,"CHOCO / SIROP"]
["chocolat Topping 1l impérial","Litre",5,null,null,null,null,"METRO",0,0.05,5,95,100,"2016-03-03","CHOCO / SIROP"]
["Chorizo","kg",5,211,421,35,0,"METRO",4773,0,0,100,100,"2016-03-03","CHARCUTERIE"]
["Chorizo SELECTION (125 T au kilo)","kg",5,211,421,35,0,"VT FOOD",4773,0,0,100,100,"2015-03-02","CHARCUTERIE"]
["Chorizo SELECTION LA TRANCHE","kg",5,211,421,35,0,"VT FOOD",4773,0,0,100,100,"2015-03-02","CHARCUTERIE"]
["Choux fleur congelé","kg",5,20,0,22,29,"DAVIGEL",{"$f":"((D89*4)+(F89*4)+(E89*9))","v":168},{"$f":"K89/M89","v":0},{"$f":"M89-L89","v":0},100,100,null,"SURGELES"]
["Ciboule fraiche","botte",5,1,1,1,1,"JOSA",{"$f":"((D90*4)+(F90*4)+(E90*9))","v":17},0.3,30,70,100,null,"HERBES"]
["ciboulette","kg",5,null,null,null,null,"METRO",{"$f":"((D91*4)+(F91*4)+(E91*9))","v":0},0,0,100,100,"2016-03-03","ASSAISONNEMENT"]
["Ciboulette fraiche","Botte",5,1,1,1,1,"JOSA",{"$f":"((D92*4)+(F92*4)+(E92*9))","v":17},0,0,100,100,null,"HERBES"]
["citron (la tranche)","pièce",5,null,null,null,null,null,null,0,0,100,100,null,"FRUITS"]
["citron vert","pièce",5,2.5,2.2999999999999998,14.9,4,"JOSA",{"$f":"((D94*4)+(F94*4)+(E94*9))","v":90.3},0,0,100,100,"2016-03-03","FRUITS"]
["Citrons","pièce",5,8,3,24.5,20,"JOSA",157,0,0,100,100,"2016-03-03","FRUITS"]
["cocolito 1200g/85r/","pièce",5,null,null,null,null,"METRO",0,0,0,100,100,"2016-03-03","LAITAGE"]
["Coeurs de céleri","kg",5,10,1,33,10,"METRO",181,0.3,30,70,100,null,"BOITES LEGUMES"]
["Comté","kg",5,287,298,0,0,"LOBET",3830,0,0,100,100,null,"FROMAGE"]
["Concombre","kg",5,8,0,12,7,"JOSA",80,0.1,10,90,100,null,"LEGUMES"]
["Confiture d'abricots","kg",5,4,2,604,14,"METRO",2450,0,0,100,100,null,"CONFITURE"]
["confiture d'airelles","kg",5,null,null,null,null,"METRO",0,0,0,100,100,null,"CONFITURE"]
["confiture d'oignons","kg",5,null,null,null,null,"METRO",null,0,0,100,100,null,"CONFITURE"]
["Confiture figue au Porto","kg",5,4,2,604,14,"METRO",{"$f":"((D103*4)+(F103*4)+(E103*9))","v":2450},0,0,100,100,null,"CONFITURE"]
["Coppa ( 120 TRANCHES )","kg",5,1,1,1,1,"METRO",17,0,0,100,100,null,"CHARCUTERIE"]
["Coppa ( 120 TRANCHES )","kg",5,1,1,1,1,"METRO",{"$f":"((D105*4)+(F105*4)+(E105*9))","v":17},{"$f":"K105/M105","v":0},{"$f":"M105-L105","v":0},100,100,null,"CHARCUTERIE"]
["Coppa LA TRANCHE","kg",5,1,1,1,1,"METRO",17,0,0,100,100,null,"CHARCUTERIE"]
["Coppa LA TRANCHE","kg",5,1,1,1,1,"METRO",{"$f":"((D107*4)+(F107*4)+(E107*9))","v":17},{"$f":"K107/M107","v":0},{"$f":"M107-L107","v":0},100,100,null,"CHARCUTERIE"]
["coriandre fraiche","botte",5,null,null,null,null,"JOSA",{"$f":"((D108*4)+(F108*4)+(E108*9))","v":0},0.2,20,80,100,null,"HERBES"]
["Coriandre graine","kg",5,1,1,1,1,"METRO",{"$f":"((D109*4)+(F109*4)+(E109*9))","v":17},0,0,100,100,"2016-03-03","ASSAISONNEMENT"]
["cornichon horeca select (bocal =2,300)","kg",5,null,null,null,null,"METRO",null,0.42608695652173911,980,1320,2300,"2016-06-22","ASSAISONNEMENT"]
["cornichon horeca select La Pièce (= 6 grs)","kg",5,null,null,null,null,"METRO",null,0.42608695652173911,980,1320,2300,"2016-06-22","ASSAISONNEMENT"]
["Courgette vapeur 1 Tranche","pièce",5,null,null,null,null,"CIABATTA MANIA",{"$f":"((D112*4)+(F112*4)+(E112*9))","v":0},0,0,100,100,null,"PREPARATIONS"]
["Courgettes","kg",5,12,1,18,11,"JOSA",129,0.1,10,90,100,null,"LEGUMES"]
["Crème de balsamique","Litre",5,1,1,1,1,"METRO",17,0.03,3,97,100,"2016-03-03","ASSAISONNEMENT"]
["Crème fraiche","Litre",5,0,350,1,0,"LOBET",3154,0,0,100,100,"2015-04-01","LAITAGE"]
["Crème liquide","Litre",5,7,250,17,4,"LOBET",2346,0,0,100,100,null,"LAITAGE"]
["Crème liquide DEBIC","Litre",5,7,250,17,4,"METRO",2346,0,0,100,100,null,"LAITAGE"]
["Croûtons (pot)","kg",5,1,1,1,1,"METRO",17,0,0,100,100,null,"PATES & RIZ & FECULES"]
["cumin","kg",5,null,null,null,null,"METRO",0,0,0,100,100,"2016-03-03","ASSAISONNEMENT"]
["cumin en graine","kg",5,null,null,null,null,"METRO",0,0,0,100,100,"2016-03-03","ASSAISONNEMENT"]
["curcuma","kg",5,null,null,null,null,"METRO",0,0,0,100,100,"2016-03-03","ASSAISONNEMENT"]
["Curry 450G","kg",5,1,1,1,1,"METRO",17,0,0,100,100,"2016-03-03","ASSAISONNEMENT"]
["décafé pantera","kg",5,null,null,null,null,"PONTI",0,0,0,100,100,"2015-04-01","CAFE & THE"]
["décafé pantera 0,007g","pièce",5,null,null,null,null,"PONTI",0,0,0,100,100,"2015-04-01","CAFE & THE"]
["Dragées colorées déco gateaux","kg",5,0,0,996,0,"METRO",3984,0,0,100,100,"2016-03-03","SUCRES"]
["Eau de fleur d'oranger","Litre",5,0,0,0,0,"METRO",0,0,0,100,100,"2016-03-03","ASSAISONNEMENT"]
["Echalotes","kg",5,1,1,1,1,"JOSA",17,0.1,10,90,100,null,"CONDIMENTS"]
["écrevisse","kg",5,null,null,null,null,"METRO",null,0,0,100,100,null,"POISSON"]
["Emmental rappé","kg",5,287,285,0,0,"METRO",{"$f":"((D129*4)+(F129*4)+(E129*9))","v":3713},0,0,100,100,null,"FROMAGE"]
["Emmental tranché  (dose : 2,5 demi T =25g)","pièce",5,null,null,null,null,"LOBET",null,0,0,100,100,"2016-04-25","FROMAGE"]
["Emmental tranché  (dose : 3 demi T =30g)","pièce",5,null,null,null,null,"LOBET",null,0,0,100,100,"2016-04-25","FROMAGE"]
["Emmental tranche 1kg","kg",5,null,null,null,null,"LOBET",null,0,0,100,100,"2016-04-25","FROMAGE"]
["Endives","kg",5,10,0,3,15,"JOSA",{"$f":"((D133*4)+(F133*4)+(E133*9))","v":52},0.2,20,80,100,null,"LEGUMES"]
["épice couscous","kg",5,null,null,null,null,"METRO",0,0,0,100,100,"2016-03-03","ASSAISONNEMENT","boite =850g"]
["épice cumin 400g","kg",5,null,null,null,null,"METRO",0,0,0,100,100,"2016-02-26","ASSAISONNEMENT"]
["épice curcuma 500g","kg",5,null,null,null,null,"METRO",0,0,0,100,100,"2016-02-26","ASSAISONNEMENT"]
["épice Italien 200g","kg",5,null,null,null,null,"METRO",0,0,0,100,100,"2016-02-26","ASSAISONNEMENT"]
["épice poulet","kg",5,null,null,null,null,"METRO",0,0,0,100,100,null,"ASSAISONNEMENT"]
["épice Thai 240g","kg",5,null,null,null,null,"METRO",0,{"$f":"K139/M139","v":0},{"$f":"M139-L139","v":0},100,100,"2016-02-26","ASSAISONNEMENT"]
["épices poulet Horeca","kg",5,null,null,null,null,"METRO",0,0,0,100,100,"2016-03-03","ASSAISONNEMENT","boite =850g"]
["Epinards frais","kg",5,19,5,7,13,"JOSA",149,0.2,20,80,100,null,"LEGUMES"]
["estragon","kg",5,null,null,null,null,"METRO",0,0,0,100,100,"2016-03-03","ASSAISONNEMENT"]
["Extrait de café","Litre",5,1,1,1,1,"METRO",17,0,0,100,100,null,"ASSAISONNEMENT"]
["farine fementante","kg",5,null,null,null,null,"METRO",null,0,0,100,100,"2016-03-03","PATES & RIZ & FECULES"]
["Farine t55","kg",5,102,12,673,61,"METRO",{"$f":"((D145*4)+(F145*4)+(E145*9))","v":3208},0,0,100,100,null,"PATES & RIZ & FECULES"]
["Fécule de pomme de terre","kg",5,1,0,810,0,"METRO",3244,0,0,100,100,null,"PATES & RIZ & FECULES"]
["fenouil en graines","kg",5,null,null,null,null,"METRO",0,0,0,100,100,"2016-06-03","ASSAISONNEMENT"]
["Fêta","kg",5,150,221,15,0,"LOBET",2649,0.05,5,95,100,null,"FROMAGE"]
["feuille de gélatine pack 500g","kg",5,876,10,0,0,"METRO",3594,0,0,100,100,"2016-03-03","AUTRES"]
["feuille de menthe","kg",5,null,null,null,null,"METRO",0,0,0,100,100,"2016-03-03","ASSAISONNEMENT"]
["Figue fraiche","pièce",5,null,null,null,null,"JOSA",0,0,0,100,100,null,"FRUITS"]
["flocons d'avoine","kg",5,null,null,null,null,"BIO",null,0,0,100,100,null,"PATES & RIZ & FECULES"]
["flocons d'avoine quaker oats","kg",5,null,null,null,null,"METRO",null,0,0,100,100,null,"PATES & RIZ & FECULES"]
["Fraises","kg",5,7,0,52,13,"JOSA",{"$f":"((D154*4)+(F154*4)+(E154*9))","v":236},0.1,10,90,100,null,"FRUITS"]
["Fraises (la pièce = 0,010g)","pièce",5,7,0,52,13,"JOSA",236,0.1,10,90,100,null,"FRUITS"]
["Framboises","kg",5,10,0,70,74,"JOSA",320,0,0,100,100,null,"FRUITS"]
["Framboises (la pièce = 0,0042g)","pièce",5,10,0,70,74,"JOSA",320,0,0,100,100,null,"FRUITS"]
["Framboises congelées","kg",5,10,0,70,74,"DAVIGEL",320,0.05,5,95,100,null,"SURGELES"]
["fromage à raclette","kg",5,245,274,3,0,"LOBET",3458,0,0,100,100,null,"FROMAGE"]
["fromage à raclette METRO","kg",5,null,null,null,null,"METRO",0,0,0,100,100,null,"FROMAGE"]
["Fromage blanc gras 3k","kg",5,80,94,51,0,"LOBET",1370,0,0,100,100,"2015-04-02","LAITAGE"]
["fruit sec : Pistaches","kg",5,206,444,93,103,"METRO",5192,0,0,100,100,null,"FRUITS SECS"]
["fruit sec : Pruneaux","kg",5,22,4,450,71,"METRO",1924,0,0,100,100,null,"FRUITS SECS"]
["fruits secs : abricot","kg",5,null,null,null,null,"METRO",null,0,0,100,100,"estim","PATES & RIZ & FECULES"]
["Gélatine en feuille ( 1f=5g)/ 1k = 200f","pièce",5,876,10,0,0,"METRO",{"$f":"((D165*4)+(F165*4)+(E165*9))","v":3594},0,0,100,100,"2016-03-03","AUTRES"]
["gingembre (lamelle sushi)","kg",5,null,null,null,null,"METRO",0,0.5,50,50,100,"2016-03-03","DIVERS"]
["Gingembre sec","kg",5,1,1,1,1,"METRO",17,0,0,100,100,"2016-03-03","ASSAISONNEMENT"]
["glaçon par 5","Unité",5,null,null,null,null,"CIABATTA MANIA",0,0,0,100,100,null,"DIVERS"]
["gorgonzola","kg",5,null,null,null,null,"LOBET",0,0,0,100,100,null,"FROMAGE"]
["gorgonzola piquant","kg",5,null,null,null,null,"LOBET",0,0,0,100,100,null,"FROMAGE"]
["gouda ss croute tranché","kg",5,253,278,0,0,"LOBET",3514,{"$f":"K171/M171","v":0},{"$f":"M171-L171","v":0},100,100,"2016-04-25","FROMAGE"]
["gouda ss croute tranché (dose : 2,5 demi T =25g)","pièce",5,null,null,null,null,"LOBET",null,0,0,100,100,"2016-04-25","FROMAGE"]
["gouda ss croute tranché (dose : 3 demi T =30g)","pièce",5,253,278,0,0,"LOBET",{"$f":"((D173*4)+(F173*4)+(E173*9))","v":3514},0,0,100,100,"2016-04-25","FROMAGE"]
["graines : Pignons de pins","kg",5,1,1,1,1,"METRO",17,0,0,100,100,null,"FRUITS SECS"]
["Graines de courge","kg",5,244,456,152,53,"METRO",5688,0,0,100,100,null,"FRUITS SECS"]
["Graines de sésame","kg",5,228,535,19,30,"METRO",5803,0,0,100,100,null,"FRUITS SECS"]
["Gros sel","kg",5,1,1,1,1,"METRO",17,0,0,100,100,"2016-03-03","ASSAISONNEMENT"]
["Groseilles congelées","kg",5,10,0,50,82,"DAVIGEL",240,0.05,5,95,100,null,"SURGELES"]
["haricot blanc","kg",5,null,null,null,null,"METRO",0,0,0,100,100,null,"PATES & RIZ & FECULES"]
["herbe de provence","kg",5,null,null,null,null,"METRO",0,0,0,100,100,"2016-03-03","ASSAISONNEMENT"]
["houmous",null,5,null,null,null,null,"METRO",0,0,0,100,100,null,"PESTO"]
["huile de tournesol","Litre",5,null,null,null,null,"METRO",null,0,0,100,100,null,"ASSAISONNEMENT"]
["Huile d'olive","Litre",5,0,998,0,0,"METRO",{"$f":"((D183*4)+(F183*4)+(E183*9))","v":8982},0,0,100,100,null,"ASSAISONNEMENT"]
["Huile d'olive vinaigrette","Litre",5,null,null,null,null,"METRO",null,0,0,100,100,null,"ASSAISONNEMENT"]
["Jambon blanc COST (35T au k)","kg",5,null,null,null,null,"VT FOOD",{"$f":"((D185*4)+(F185*4)+(E185*9))","v":0},0,0,100,100,null,"CHARCUTERIE"]
["Jambon blanc COST / 3/4 Tranche","pièce",5,null,null,null,null,"VT FOOD",0,0,0,100,100,null,"CHARCUTERIE"]
["Jambon blanc COST / La Tranche","pièce",5,null,null,null,null,"VT FOOD",0,0,0,100,100,null,"CHARCUTERIE"]
["Jambon blanc METRO (26T au K)","kg",5,207,29,9,0,"METRO",1125,0,0,100,100,null,"CHARCUTERIE"]
["Jambon blanc METRO la demi tranche","pièce",5,207,29,9,0,"METRO",1125,0,0,100,100,null,"CHARCUTERIE"]
["Jambon blanc METRO la tranche","pièce",5,207,29,9,0,"METRO",1125,0,0,100,100,null,"CHARCUTERIE"]
["Jambon blanc PICNIC (25T au k)","kg",5,null,null,null,null,"VT FOOD",0,0,0,100,100,null,"CHARCUTERIE"]
["Jambon blanc PICNIC / la demi tranche","pièce",5,null,null,null,null,"VT FOOD",0,0,0,100,100,null,"CHARCUTERIE"]
["Jambon blanc PICNIC / La Tranche","pièce",5,null,null,null,null,"VT FOOD",0,0,0,100,100,null,"CHARCUTERIE"]
["Jambon blanc PICNIC/ la demi T + 1quart de T","pièce",5,null,null,null,null,"VT FOOD",0,0,0,100,100,null,"CHARCUTERIE"]
["Jambon blanc SELECTION (26T au K)","kg",5,null,null,null,null,"VT FOOD",0,0,0,100,100,null,"CHARCUTERIE"]
["Jambon blanc SELECTION (26T au K)","kg",5,null,null,null,null,"VT FOOD",{"$f":"((D196*4)+(F196*4)+(E196*9))","v":0},{"$f":"K196/M196","v":0},{"$f":"M196-L196","v":0},100,100,null,"CHARCUTERIE"]
["Jambon blanc SELECTION / La demi Tranche","pièce",5,null,null,null,null,"VT FOOD",0,0,0,100,100,null,"CHARCUTERIE"]
["Jambon blanc SELECTION / La demi Tranche","pièce",5,null,null,null,null,"VT FOOD",{"$f":"((D198*4)+(F198*4)+(E198*9))","v":0},{"$f":"K198/M198","v":0},{"$f":"M198-L198","v":0},100,100,null,"CHARCUTERIE"]
["Jambon blanc SELECTION / La Tranche","pièce",5,null,null,null,null,"VT FOOD",0,0,0,100,100,null,"CHARCUTERIE"]
["Jambon blanc SELECTION / La Tranche","pièce",5,null,null,null,null,"VT FOOD",{"$f":"((D200*4)+(F200*4)+(E200*9))","v":0},{"$f":"K200/M200","v":0},{"$f":"M200-L200","v":0},100,100,null,"CHARCUTERIE"]
["Jambon blanc SELECTION / le quart de Tranche","pièce",5,null,null,null,null,"VT FOOD",0,0,0,100,100,null,"CHARCUTERIE"]
["Jambon blanc SELECTION / le quart de Tranche","pièce",5,null,null,null,null,"VT FOOD",{"$f":"((D202*4)+(F202*4)+(E202*9))","v":0},{"$f":"K202/M202","v":0},{"$f":"M202-L202","v":0},100,100,null,"CHARCUTERIE"]
["jambon de parme / espagnol 60T","kg",5,null,null,null,null,"VT FOOD",0,0,0,100,100,"2016-03-02","CHARCUTERIE"]
["jambon de parme / espagnol 60T","kg",5,null,null,null,null,"VT FOOD",{"$f":"((D204*4)+(F204*4)+(E204*9))","v":0},{"$f":"K204/M204","v":0},{"$f":"M204-L204","v":0},100,100,"2016-03-02","CHARCUTERIE",16.329999999999998]
["jambon de parme / espagnol La Tranche","pièce",5,null,null,null,null,"VT FOOD",0,0,0,100,100,null,"CHARCUTERIE"]
["jambon de parme / espagnol La Tranche","pièce",5,null,null,null,null,"VT FOOD",{"$f":"((D206*4)+(F206*4)+(E206*9))","v":0},{"$f":"K206/M206","v":0},{"$f":"M206-L206","v":0},100,100,null,"CHARCUTERIE"]
["Jambon de Parme METRO","kg",5,248,83,4,0,"METRO",{"$f":"((D207*4)+(F207*4)+(E207*9))","v":1755},{"$f":"K207/M207","v":0},{"$f":"M207-L207","v":0},100,100,null,"CHARCUTERIE"]
["Jambon de Parme METRO la tranche","pièce",5,248,83,4,0,"METRO",{"$f":"((D208*4)+(F208*4)+(E208*9))","v":1755},{"$f":"K208/M208","v":0},{"$f":"M208-L208","v":0},100,100,null,"CHARCUTERIE"]
["Jambon fumé ARROYO (price) 35t /500g","kg",5,null,null,null,null,"VT FOOD",0,0,0,100,100,null,"CHARCUTERIE"]
["Jambon fumé ARROYO (price) la tranche","pièce",5,null,null,null,null,"VT FOOD",0,0,0,100,100,null,"CHARCUTERIE"]
["ketchup heinz 25 ml","unité",5,null,null,null,null,"METRO",{"$f":"((D211*4)+(F211*4)+(E211*9))","v":0},{"$f":"K211/M211","v":0},{"$f":"M211-L211","v":0},100,100,"2016-03-03","SAUCE"]
["Ketchup sans marque","unité",5,null,null,null,null,"METRO",{"$f":"((D212*4)+(F212*4)+(E212*9))","v":0},0,0,100,100,"2016-03-03","SAUCE"]
["kiwi","pièce",5,null,null,null,null,"JOSA",{"$f":"((D213*4)+(F213*4)+(E213*9))","v":0},0,0,100,100,null,"FRUITS"]
["lait concentré boite au kilos","kg",5,null,null,null,null,"METRO",null,0,0,100,100,"2016-03-03","LAITAGE"]
["lait concentré la boite 397g","pièce",5,null,null,null,null,"METRO",null,0,0,100,100,"2016-03-03","LAITAGE"]
["Lait de coco","Litre",5,null,null,null,null,"METRO",{"$f":"((D216*4)+(F216*4)+(E216*9))","v":0},0,0,100,100,null,"LAITAGE"]
["Lait demi-écrémé","Litre",5,33,16,48,0,"LOBET",468,0,0,100,100,null,"LAITAGE"]
["Lait en poudre","kg",5,350,10,500,0,"METRO",3490,0,0,100,100,"2016-03-03","LAITAGE"]
["Lait entier","Litre",5,null,null,null,null,"LOBET",0,0,0,100,100,"2015-04-02","LAITAGE"]
["Lait soja ALPRO","Litre",5,null,null,null,null,"LOBET",0,0,0,100,100,null,"LAITAGE"]
["Laitue","pièce",5,13,0,4,13,"JOSA",68,0.2,20,80,100,null,"SALADE"]
["laurier feuille","kg",5,null,null,null,null,"METRO",0,0,0,100,100,"2016-03-03","ASSAISONNEMENT","boite =35g"]
["Lentilles 5kg","kg",5,280,12,570,null,"METRO",3508,0,0,100,100,"2016-03-03","PATES & RIZ & FECULES"]
["Lentilles rouge","kg",5,230,18,450,null,"METRO",2882,0,0,100,100,"2016-03-03","PATES & RIZ & FECULES"]
["Levure (une dose = 11g)","pièce",5,460,65,400,0,"METRO",4025,0,0,100,100,"2016-03-03","AUTRES"]
["levure bruggman (500g)","kg",5,460,65,400,0,"METRO",null,0,0,100,100,"2016-03-03","AUTRES"]
["Mâche (salade de blé)","kg",5,null,null,null,null,"JOSA",{"$f":"((D227*4)+(F227*4)+(E227*9))","v":0},0.1,10,90,100,null,"LEGUMES"]
["Maïs doux","kg",5,25,14,116,25,"METRO",690,5.0802139037433157E-2,95,1775,1870,"2016-03-03","BOITES LEGUMES"]
["Maïzena","kg",5,0,0,850,5,"METRO",3400,0,0,100,100,"2016-03-03","PATES & RIZ & FECULES"]
["mangue ","pièce",5,16,0,141,14,"JOSA",628,0.5,50,50,100,null,"FRUITS"]
["Marrons ou châtaignes","kg",5,null,null,null,null,"METRO",0,0.3,30,70,100,null,"BOITES LEGUMES"]
["Mascarpone","kg",5,50,422,43,0,"LOBET",4170,0,0,100,100,"2015-04-02","FROMAGE"]
["Mascarpone métro",null,5,null,null,null,null,"METRO",0,0,0,100,100,null,"FROMAGE"]
["Mayonnaise vandemoortele","kg",5,13,811,10,0,"METRO",7391,0.03,3,97,100,"2016-03-03","ASSAISONNEMENT"]
["MB BAG SUMMER","pièce",5,null,null,null,null,"BAKER MA",0,0,0,100,100,"2015-07-01","BAGUETTE"]
["MB BAG SUMMER 1/2 ","pièce",5,null,null,null,null,"BAKER MA",0,0,0,100,100,"2015-07-01","BAGUETTE"]
["MB BAGNAT MULTI","pièce",5,125,20,587,30,"BAKER MA",3028,0,0,100,100,null,"PTIT PAIN"]
["MB BAGUETTE","pièce",5,84,19,580,35,"BAKER MA",2827,0,0,100,100,"2015-04-02","BAGUETTE"]
["MB BAGUETTE 1/2","pièce",5,1,1,1,1,"BAKER MA",17,0,0,100,100,null,"BAGUETTE"]
["MB BAGUETTE 1/2 GRIS","pièce",5,125,20,587,30,"BAKER MA",3028,0,0,100,100,null,"BAGUETTE"]
["MB BAGUETTE 1/2 MULTIGRAINES","pièce",5,1,1,1,1,"BAKER MA",17,0,0,100,100,null,"BAGUETTE"]
["MB BAGUETTE AUX OLIVES","pièce",5,1,1,1,1,"BAKER MA",17,0,0,100,100,null,"BAGUETTE"]
["MB CIABATTA","pièce",5,1,1,1,1,"BAKER MA",17,{"$f":"K243/M243","v":0},{"$f":"M243-L243","v":0},100,100,"2015-04-02","CIABATTA"]
["MB CIABATTA GRIS","pièce",5,null,null,null,null,"BAKER MA",0,0,0,100,100,"2015-04-02","CIABATTA"]
["MB CIABATTA MULTI CEREALES","pièce",5,1,1,1,1,"BAKER MA",17,0,0,100,100,"2015-04-02","CIABATTA"]
["MB CIABATTA OLIVES","pièce",5,1,1,1,1,"BAKER MA",17,0,0,100,100,"2015-04-02","CIABATTA"]
["MB CIABATTA TOMATES","pièce",5,1,1,1,1,"BAKER MA",17,0,0,100,100,"2015-04-02","CIABATTA"]
["MB COUQUE AUX RAISINS","pièce",5,1,1,1,1,"BAKER MA",17,0,0,100,100,"2015-04-02","COUQUES"]
["MB CROISSANT","pièce",5,1,1,1,1,"BAKER MA",17,0,0,100,100,"2015-04-02","COUQUES"]
["MB FLUTE AUX NOIX-RAISINS","pièce",5,1,1,1,1,"BAKER MA",17,0,0,100,100,"2015-04-02","BAGUETTE"]
["MB Flute aux olives","pièce",5,null,null,null,null,"BAKER MA",0,0,0,100,100,null,"BAGUETTE"]
["MB Flute multigraines","pièce",5,null,null,null,null,"BAKER MA",0,0,0,100,100,null,"BAGUETTE"]
["MB FOCCACIA OLIVE GRANDE (350g)","pièce",5,null,null,null,null,"BAKER MA",0,0,0,100,100,null,"FOCACCIA"]
["MB FOCCACIA OLIVE PETITE (170g)","pièce",5,null,null,null,null,"BAKER MA",0,0,0,100,100,null,"FOCACCIA"]
["MB FOCCACIA ORIGAN GRANDE (350g)","pièce",5,null,null,null,null,"BAKER MA",0,0,0,100,100,null,"FOCACCIA"]
["MB FOCCACIA ORIGAN PETITE (170g)","pièce",5,null,null,null,null,"BAKER MA",0,0,0,100,100,null,"FOCACCIA"]
["MB FOCCACIA TOMATE GRANDE (350g)","pièce",5,null,null,null,null,"BAKER MA",0,0,0,100,100,null,"FOCACCIA"]
["MB FOCCACIA TOMATE PETITE  (170g)","pièce",5,null,null,null,null,"BAKER MA",0,0,0,100,100,null,"FOCACCIA"]
["MB GRAND PAIN BLANC 1KG","pièce",5,1,1,1,1,"BAKER MA",{"$f":"((D259*4)+(F259*4)+(E259*9))","v":17},0,0,100,100,null,"GRAND PAIN"]
["MB GRAND PAIN BLANC 2KG","pièce",5,1,1,1,1,"BAKER MA",17,0,0,100,100,null,"GRAND PAIN"]
["MB GRAND PAIN LEVAIN 1 tranche","pièce",5,null,null,null,null,"BAKER MA",0,0,0,100,100,"2015-04-01","GRAND PAIN"]
["MB GRAND PAIN LEVAIN 16 T / 32 parts","pièce",5,null,null,null,null,"BAKER MA",0,0,0,100,100,"2015-04-01","GRAND PAIN"]
["MB GRAND PAIN LEVAIN 600g","pièce",5,null,null,null,null,"BAKER MA",0,0,0,100,100,"2015-04-01","GRAND PAIN"]
["MB GRAND PAIN LEVAIN BIO 2K","pièce",5,null,null,null,null,"BAKER MA",0,0,0,100,100,"2015-04-01","GRAND PAIN"]
["MB GRANDE CIABATTA","pièce",5,1,1,1,1,"BAKER MA",17,0,0,100,100,null,"CIABATTA"]
["MB MINI CIABATTA 80g","pièce",5,1,1,1,1,"BAKER MA",17,0,0,100,100,null,"CIABATTA"]
["MB MINI CIABATTA -moins de 50g","pièce",5,1,1,1,1,"BAKER MA",17,0,0,100,100,null,"CIABATTA"]
["MB Pain au lait LONG 80G","pièce",5,null,null,null,null,"BAKER MA",0,0,0,100,100,"2015-04-01","PAIN LAIT"]
["MB Pain au lait ROND 80G","pièce",5,null,null,null,null,"BAKER MA",0,0,0,100,100,"2015-04-01","PAIN LAIT"]
["MB PAIN BAGNAT","pièce",5,1,1,1,1,"BAKER MA",17,0,0,100,100,null,"PTIT PAIN"]
["MB PAIN CHOCOLAT","pièce",5,1,1,1,1,"BAKER MA",17,0,0,100,100,"2015-04-02","COUQUES"]
["MB PAIN DE MIE BLANC","pièce",5,1,1,1,1,"BAKER MA",17,0,0,100,100,"2015-04-01","PAIN DE MIE"]
["MB PAIN DE MIE BLANC 2 Tranches","pièce",5,1,1,1,1,"BAKER MA",17,0,0,100,100,"2015-04-01","PAIN DE MIE"]
["MB PAIN DE MIE GRIS","pièce",5,1,1,1,1,"BAKER MA",17,0,0,100,100,"2015-04-01","PAIN DE MIE"]
["MB PAIN DE MIE GRIS 2 Tranches","pièce",5,null,null,null,null,"BAKER MA",0,{"$f":"K275/M275","v":0},{"$f":"M275-L275","v":0},100,100,"2015-04-01","PAIN DE MIE"]
["MB PAIN HAMBURGER ROND 120GR","pièce",5,1,1,1,1,"BAKER MA",17,0,0,100,100,null,"PTIT PAIN"]
["MB Pain lait rond","pièce",5,null,null,null,null,"BAKER MA",0,0,0,100,100,null,"PTIT PAIN"]
["MB PETIT PAIN","pièce",5,1,1,1,1,"BAKER MA",17,0,0,100,100,null,"PTIT PAIN"]
["MB PETIT PAIN AUX OLIVES","pièce",5,1,1,1,1,"BAKER MA",17,0,0,100,100,null,"PTIT PAIN"]
["MB PETIT PAIN MULTIGRAINES","pièce",5,1,1,1,1,"BAKER MA",17,0,0,100,100,null,"PTIT PAIN"]
["MB PETITE FLUTE  NOIX-RAISINS","pièce",5,1,1,1,1,"BAKER MA",17,0,0,100,100,null,"PTIT PAIN"]
["MB pistolet","pièce",5,null,null,null,null,"BAKER MA",0,0,0,100,100,null,"PTIT PAIN"]
["MB TURC","pièce",5,1,1,1,1,"BAKER MA",17,0,0,100,100,null,"PAIN TURC"]
["MDO cuisine","h",5,null,null,null,null,"CIABATTA MANIA",0,0,0,100,100,null,"MDO"]
["Mélange chèvre thym","kg",5,null,null,null,null,"CIABATTA MANIA",0,0,0,100,100,null,"préparations"]
["Mélange fêta","kg",5,null,null,null,null,"CIABATTA MANIA",0,0,0,100,100,null,"préparations"]
["Mélange moutarde mayo cumin","kg",5,null,null,null,null,"CIABATTA MANIA",0,0,0,100,100,null,"préparations"]
["Mélange salade fêta","kg",5,null,null,null,null,"CIABATTA MANIA",0,0,0,100,100,null,"préparations"]
["Mélange tapenade noire","kg",5,null,null,null,null,"CIABATTA MANIA",0,0,0,100,100,null,"préparations"]
["Mélange thon mayonnaise","kg",5,null,null,null,null,"CIABATTA MANIA",0,0,0,100,100,null,"préparations"]
["Menthe fraîche (1 botte = 40g)","Botte",5,1,1,1,1,"JOSA",{"$f":"((D291*4)+(F291*4)+(E291*9))","v":17},0.3,30,70,100,null,"HERBES"]
["Menthe fraîche (1 brin = 5g) avec branche","Unité",5,1,1,1,1,"JOSA",17,0.3,30,70,100,null,"HERBES"]
["Menthe sèche (boite = 60G)","kg",5,1,1,1,1,"METRO",17,0,0,100,100,null,"ASSAISONNEMENT","boite = 60g"]
["Miel","kg",5,3,0,800,7,"METRO",3212,0.1,10,90,100,null,"SUCRES"]
["Miel dur","kg",5,3,0,800,7,"METRO",3212,0.1,10,90,100,null,"SUCRES"]
["mini gressin (1 sachet =150g)","kg",5,null,null,null,null,"METRO",0,0,0,100,100,"2016-03-03","PTIT PAIN"]
["Moutarde a l'ancienne horeca","kg",5,59,91,36,10,"METRO",1199,0.03,3,97,100,"2016-03-03","ASSAISONNEMENT"]
["Moutarde DL","kg",5,null,null,null,null,"METRO",0,0.03,3,97,100,"2016-03-03","ASSAISONNEMENT"]
["Moutarde douce horeca","kg",5,null,null,null,null,"METRO",0,0.03,3,97,100,"2016-03-03","ASSAISONNEMENT"]
["Moutarde forte horeca","kg",5,null,null,null,null,"METRO",0,0.03,3,97,100,"2016-03-03","ASSAISONNEMENT"]
["moutarde heinz ind 10ml","unité",5,null,null,null,null,"METRO",0,0,0,100,100,"2016-03-03","SAUCE"]
["moutarde sans marque ind","unité",5,null,null,null,null,"METRO",0,0,0,100,100,"2016-03-03","SAUCE"]
["Mozzarella  galbani (pain de 1kg)","kg",5,229,208,0,0,"LOBET",2788,0,0,100,100,"2015-04-02","FROMAGE"]
["Mozzarella (tranches) metro","kg",5,229,208,0,0,"METRO",2788,0,0,100,100,null,"FROMAGE"]
["Mozzarella filante en julienne Galbani","kg",5,null,null,null,null,"METRO",null,0,null,100,100,"2016-03-03","FROMAGE"]
["Mozzarella filante Galbani","kg",5,null,null,null,null,"LOBET",{"$f":"((D306*4)+(F306*4)+(E306*9))","v":0},0,{"$f":"M306-L306","v":0},100,100,"2016-03-03","FROMAGE"]
["Mozzarella tranchée","kg",5,229,208,0,0,"LOBET",{"$f":"((D307*4)+(F307*4)+(E307*9))","v":2788},{"$f":"K307/M307","v":0},0,100,100,"25/14/16","FROMAGE"]
["Mozzarella tranchée (dose : 3 demi T =30g)","pièce",5,null,null,null,null,"LOBET",null,0,0,100,100,"2016-04-25","FROMAGE"]
["Mozzarella tranchée (dose 2,5 demi T)","pièce",5,null,null,null,null,"LOBET",null,0,0,100,100,"2016-04-25","FROMAGE"]
["muesli choco (1bt=750g )","kg",5,null,null,null,null,"METRO",{"$f":"((D310*4)+(F310*4)+(E310*9))","v":0},0,0,100,100,"2016-03-03","SUCRES"]
["muesli fruit (1bt=750g)","kg",5,null,null,null,null,"METRO",0,0,0,100,100,"2016-03-03","SUCRES"]
["Mures","kg",5,10,10,60,73,"JOSA",370,0,0,100,100,null,"FRUITS"]
["Mures (la pièce)","pièce",5,10,10,60,73,"JOSA",370,0,0,100,100,null,"FRUITS"]
["Mûres La barquette (= xx mures)","pièce",5,null,null,null,null,"JOSA",0,0,0,100,100,null,"FRUITS"]
["muscade moulue","kg",5,null,null,null,null,"METRO",0,0,0,100,100,"2016-03-03","ASSAISONNEMENT"]
["myrtilles","kg",5,null,null,null,null,"JOSA",0,0,0,100,100,null,"FRUITS"]
["myrtilles (la pièces = 2g)","pièce",5,null,null,null,null,"JOSA",0,0,0,100,100,null,"FRUITS"]
["Myrtilles congelées","kg",5,10,0,60,73,"DAVIGEL",280,0.05,5,95,100,null,"SURGELES"]
["Noisettes","kg",5,null,null,null,null,"METRO",null,0,null,500,500,null,"FRUITS SECS"]
["Noix (cerneaux)","kg",5,150,670,27,67,"METRO",{"$f":"((D320*4)+(F320*4)+(E320*9))","v":6738},0,{"$f":"M320-L320","v":0},100,100,null,"FRUITS SECS"]
["noix de cajou","kg",5,null,null,null,null,"METRO",{"$f":"((D321*4)+(F321*4)+(E321*9))","v":0},0,{"$f":"M321-L321","v":0},100,100,null,"FRUITS SECS"]
["Noix de coco","kg",5,null,null,null,null,"METRO",null,0,null,100,100,"2016-04-26","FRUITS SECS"]
["Noix de muscade entière","kg",5,1,1,1,1,"METRO",{"$f":"((D323*4)+(F323*4)+(E323*9))","v":17},0,{"$f":"M323-L323","v":0},100,100,"2016-03-03","ASSAISONNEMENT"]
["Nutella","kg",5,null,null,null,null,"METRO",null,0,null,100,100,null,"CHOCO / SIROP"]
["Oeuf (1oeuf = 0,05)","pièce",5,126,112,8,0,"LOBET",{"$f":"((D325*4)+(F325*4)+(E325*9))","v":1544},0,{"$f":"M325-L325","v":0},100,100,null,"ŒUF"]
["Oeuf (blancs)","Litre",5,105,0,4,0,"LOBET",436,0,0,100,100,null,"ŒUF"]
["Oeuf (blancs) METRO","Litre",5,null,null,null,null,"METRO",0,0,0,100,100,null,"ŒUF"]
["Oeuf (blancs) METRO - 1 blanc =25g","pièce",5,null,null,null,null,"METRO",0,0,0,100,100,null,"ŒUF"]
["Oeuf (dorure)","pièce",5,126,112,8,0,"LOBET",1544,0,0,100,100,null,"ŒUF"]
["Oeuf (entiers)","pièce",5,126,112,8,0,"LOBET",1544,0,0,100,100,null,"ŒUF"]
["Oeuf (entiers) METRO","Litre",5,null,null,null,null,"METRO",0,0,0,100,100,null,"ŒUF"]
["Oeuf (entiers) METRO - 1 oeuf =50g","pièce",5,null,null,null,null,"METRO",0,0,0,100,100,null,"ŒUF"]
["Oeuf (jaunes)","Litre",5,167,319,2,0,"LOBET",3547,0,0,100,100,null,"ŒUF"]
["Oeuf (jaunes) METRO","Litre",5,null,null,null,null,"METRO",0,0,0,100,100,null,"ŒUF"]
["Oeuf (jaunes) METRO- 1 jaune =15,39g","pièce",5,null,null,null,null,"METRO",0,0,0,100,100,null,"ŒUF"]
["Oignon","kg",5,15,0,15,30,"JOSA",120,0.1,10,90,100,null,"CONDIMENTS"]
["oignons frits","kg",5,null,null,null,null,"METRO",null,0,0,100,100,"2016-04-25","CONFITURE"]
["Oignons gros rouge","kg",5,15,0,15,30,"JOSA",{"$f":"((D338*4)+(F338*4)+(E338*9))","v":120},0.1,10,90,100,null,"CONDIMENTS"]
["oignons jeunes","kg",5,null,null,null,null,"JOSA",{"$f":"((D339*4)+(F339*4)+(E339*9))","v":0},{"$f":"K339/M339","v":0.1},10,90,100,null,"LEGUMES"]
["Olives noires dénoyautées","kg",5,13,144,30,40,"METRO",{"$f":"((D340*4)+(F340*4)+(E340*9))","v":1468},0.5,2000,2000,4000,"2016-03-03","BOITES LEGUMES"]
["Olives noires dénoyautées LA PIECE = 3 grs","pièce",5,null,null,null,null,"METRO",null,0.5,2000,2000,4000,null,"BOITES LEGUMES"]
["olives noires entières","kg",5,13,144,30,40,"METRO",null,0.375,1500,2500,4000,"2016-03-03","BOITES LEGUMES"]
["olives verte au poivrons","kg",5,null,null,null,null,"METRO",null,0.34210526315789475,1300,2500,3800,"2016-03-03","BOITES LEGUMES"]
["Olives vertes dénoyautées","kg",5,13,144,30,40,"METRO",{"$f":"((D344*4)+(F344*4)+(E344*9))","v":1468},0.5,2000,2000,4000,"2016-03-03","BOITES LEGUMES"]
["Olives vertes dénoyautées LA PIECE = 3 grs","pièce",5,null,null,null,null,"METRO",null,0.5,2000,2000,4000,null,"BOITES LEGUMES"]
["orange LA PIECE ( une orange = 0,200 k)","pièce",5,9,2.6,83.2,18.2,"JOSA",{"$f":"((D346*4)+(F346*4)+(E346*9))","v":392.2},0,0,100,100,"1900-01-01","FRUITS"]
["Oranges LA CAISSE DE 15kg (= 75 orange)","caisse",5,9,2.6,83.2,18.2,"JOSA",392.2,0,0,100,100,"2016-03-03","FRUITS"]
["Oranges au kilos (1 kilos = 5 oranges)","kg",5,9,2.6,83.2,18.2,"JOSA",392.2,0,0,100,100,"2016-03-03","FRUITS"]
["origan","kg",5,1,1,1,1,"METRO",17,0,0,100,100,"2016-03-03","ASSAISONNEMENT"]
["pain de viande","kg",5,null,null,null,null,"CIABATTA MANIA",0,0,0,100,100,null,"préparations"]
["pamplemousse LA PIECE  (=400g)","pièce",5,null,null,null,null,"JOSA",0,0,0,100,100,null,"FRUITS"]
["pamplemousse au kilos (1 caisse = 15k)","kg",5,null,null,null,null,"JOSA",0,0,0,100,100,null,"FRUITS"]
["Pamplemousses LA CAISSE DE 15Kg","pièce",5,12,0,65,26,"JOSA",308,0,0,100,100,null,"FRUITS"]
["Pancetta (42 TRANCHES au kilos)","Kg",5,null,null,null,null,"METRO",null,0,0,100,100,null,"CHARCUTERIE"]
["Pancetta LA TRANCHE","pièce",5,null,null,null,null,"METRO",null,0,0,100,100,null,"CHARCUTERIE"]
["paprika doux","kg",5,null,null,null,null,"METRO",{"$f":"((D356*4)+(F356*4)+(E356*9))","v":0},0,0,100,100,"2016-03-03","ASSAISONNEMENT"]
["Paprika fort","kg",5,1,1,1,1,"METRO",17,0,0,100,100,"2016-03-03","ASSAISONNEMENT"]
["Parmesan","kg",5,400,290,20,0,"LOBET",4290,0,0,100,100,"2015-04-02","FROMAGE"]
["parmesan metro","kg",5,null,null,null,null,"METRO",0,0,0,100,100,null,"FROMAGE"]
["pate feuilletée","pièce",5,70,390,460,15,"METRO",5630,0,0,100,100,null,"préparations",558]
["Pate fusilli","kg",5,52,11,250,18,"METRO",1307,0,0,100,100,null,"PATES & RIZ & FECULES"]
["Pate linguini","kg",5,52,11,250,18,"METRO",1307,0,0,100,100,null,"PATES & RIZ & FECULES"]
["Pate penne","kg",5,52,11,250,18,"METRO",1307,0,0,100,100,null,"PATES & RIZ & FECULES"]
["pati spray 600 ml","pièce",5,null,null,null,null,"METRO",null,0,0,100,100,null,"DIVERS"]
["pavot","kg",5,null,null,null,null,"METRO",{"$f":"((D365*4)+(F365*4)+(E365*9))","v":0},0,0,100,100,"2016-03-03","ASSAISONNEMENT"]
["Pêches au sirop del monte","kg",5,4,1,169,10,"METRO",{"$f":"((D366*4)+(F366*4)+(E366*9))","v":701},0.3,30,70,100,null,"BOITES LEGUMES"]
["Pecorino","kg",5,null,null,null,null,"LOBET",{"$f":"((D367*4)+(F367*4)+(E367*9))","v":0},0,0,100,100,null,"FROMAGE"]
["Pépites de chocolat","kg",5,54,309,531,70,"METRO",{"$f":"((D368*4)+(F368*4)+(E368*9))","v":5121},0,0,100,100,"03/13/16","CHOCO / SIROP"]
["Pepperoni","kg",5,null,null,null,null,"METRO",{"$f":"((D369*4)+(F369*4)+(E369*9))","v":0},0,0,100,100,null,"CHARCUTERIE"]
["Pepperoni 200 t au kilos","kg",5,null,null,null,null,"METRO",0,0,0,100,100,null,"CHARCUTERIE"]
["Pepperoni la tranche","pièce",5,null,null,null,null,"METRO",null,0,0,100,100,null,"CHARCUTERIE"]
["Pepperoni LA TRANCHE = 2,5 grs","pièce",5,null,null,null,null,"METRO",{"$f":"((D372*4)+(F372*4)+(E372*9))","v":0},{"$f":"K372/M372","v":0},{"$f":"M372-L372","v":0},100,100,null,"CHARCUTERIE"]
["Persil frisé frais","botte",5,40,0,10,91,"JOSA",200,0.2,20,80,100,null,"HERBES"]
["Persil plat frais","Botte",5,40,0,10,91,"JOSA",200,0.2,20,80,100,null,"HERBES"]
["persil sec","kg",5,null,null,null,null,"METRO",0,0,0,100,100,"2016-03-03","ASSAISONNEMENT"]
["Pesto rosso","kg",5,38,331,75,23,"METRO",3431,0.03,3,97,100,null,"ASSAISONNEMENT"]
["Pesto verde","kg",5,null,null,null,null,"VT FOOD",0,0.03,3,97,100,null,"ASSAISONNEMENT"]
["Pesto verde SELECTION","kg",5,38,331,75,23,"METRO",3431,0.03,3,97,100,null,"ASSAISONNEMENT"]
["Petits oignons au vinaigre","kg",5,9,0,48,9,"METRO",228,0.40476190476190477,850,1250,2100,"03/13/16","BOITES LEGUMES"]
["Petits pois (boite) ","kg",5,41,7,111,63,"METRO",671,0.3,750,1750,2500,"03/13/16","BOITES LEGUMES"]
["Philadelphia original","kg",5,80,94,51,0,"LOBET",1370,0,0,100,100,"2015-04-02","FROMAGE"]
["pili pili","kg",5,null,null,null,null,"METRO",0,0,0,100,100,"2016-03-03","ASSAISONNEMENT"]
["piment de cayenne","kg",5,null,null,null,null,"METRO",0,0,0,100,100,"2016-03-03","ASSAISONNEMENT"]
["Piment de Cayenne",null,5,1,1,1,1,"METRO",17,0,0,100,100,null,"ASSAISONNEMENT"]
["pistache vertes pelees","kg",5,null,null,null,null,"METRO",0,0,0,100,100,null,"DIVERS"]
["poireaux","kg",5,null,null,null,null,"JOSA",0,0.2,20,80,100,null,"LEGUMES"]
["poireaux en botte","botte",5,null,null,null,null,"JOSA",0,0.2,20,80,100,null,"LEGUMES"]
["Poires au sirop Del Monte","kg",5,3,1,173,13,"METRO",713,0.44807692307692309,1165,1435,2600,"03/13/16","BOITE FRUITS"]
["Poires fraiches","kg",5,6,0,94,22,"JOSA",400,0.2,20,80,100,null,"FRUITS"]
["pois cassé","kg",5,null,null,null,null,"METRO",0,0,0,100,100,"2016-03-03","PATES & RIZ & FECULES"]
["pois chiche","kg",5,null,null,null,null,"JOSA",0,0.2,20,80,100,null,"LEGUMES"]
["Poivre blanc","kg",5,1,1,1,1,"METRO",17,0,0,100,100,null,"ASSAISONNEMENT"]
["poivre dosette 0,14 g","pièce",5,1,1,1,1,"METRO",17,0,0,100,100,"2016-03-03","ASSAISONNEMENT"]
["Poivre du moulin",null,5,1,1,1,1,"METRO",17,0,0,100,100,null,"ASSAISONNEMENT"]
["poivre noir ","kg",5,null,null,null,null,"METRO",0,0,0,100,100,"2016-03-03","ASSAISONNEMENT"]
["poivron cuit en bocal (perte déduite)","kg",5,null,null,null,null,"METRO",0,0.42424242424242425,700,950,1650,"2016-03-03","BOITES LEGUMES"]
["poivron rouge avila (dose 50g)","pièce",5,null,null,null,null,"METRO",null,{"$error":"#DIV/0!"},null,null,null,null,"BOITES LEGUMES"]
["poivron rouge avila (perte déduite)","kg",5,null,null,null,null,"METRO",null,{"$error":"#DIV/0!"},null,null,null,null,"BOITES LEGUMES"]
["poivron surgelés (sac de 2,5k)","kg",5,null,null,null,null,"DAVIGEL",{"$f":"((D399*4)+(F399*4)+(E399*9))","v":0},0,{"$f":"M399-L399","v":0},100,100,null,"SURGELES"]
["poivrons frais","kg",5,null,null,null,null,"JOSA",{"$f":"((D400*4)+(F400*4)+(E400*9))","v":0},0.15,{"$f":"M400-L400","v":15},85,100,null,"LEGUMES"]
["pomme au sirop 1 demi pomme","pièce",5,null,null,null,null,"METRO",null,0.3,{"$f":"M401-L401","v":30},70,100,"2016-03-03","BOITES LEGUMES"]
["pomme golden Metro","kg",5,null,null,null,null,"METRO",null,{"$error":"#DIV/0!"},null,null,null,null,"FRUITS"]
["pommes au sirop fine star ( 13/17 pièces = boite)","kg",5,null,null,null,null,"METRO",null,0.2982456140350877,{"$f":"M403-L403","v":850},2000,2850,"03/13/16","BOITES LEGUMES"]
["Pommes golden","kg",5,3,0,114,15,"JOSA",{"$f":"((D404*4)+(F404*4)+(E404*9))","v":468},{"$f":"K404/M404","v":0.25},25,75,100,null,"FRUITS"]
["Pommes golden à la pièce","pièce",5,3,0,114,15,"JOSA",468,0.25,25,75,100,null,"FRUITS"]
["Pommes Granny","kg",5,3,0,114,15,"JOSA",468,0.25,25,75,100,null,"FRUITS"]
["Pommes reinette","kg",5,3,0,114,15,"JOSA",468,0.25,25,75,100,null,"FRUITS"]
["Porc veau haché","kg",5,null,null,null,null,"METRO",0,0.25,25,75,100,null,"CHARCUTERIE"]
["Poulet cuit en FILET METRO","kg",5,null,null,null,null,"METRO",0,0,0,100,100,null,"CHARCUTERIE"]
["Poulet cuit en FILET VT FOOD SELECTION","kg",5,null,null,null,null,"VT FOOD",0,0,0,100,100,"2016-03-02","CHARCUTERIE",7.5]
["poulet en filet surgelé DAVIGEL","kg",5,null,null,null,null,"DAVIGEL",0,0,0,100,100,"2016-03-03","CHARCUTERIE","essaie"]
["Poulet frais METRO","kg",5,228,13,0,0,"METRO",1029,0,0,100,100,null,"CHARCUTERIE"]
["Poulet grillé cuit en poche DAVIGEL","kg",5,228,13,0,0,"DAVIGEL",1029,0,0,100,100,null,"CHARCUTERIE"]
["Pousse d'épinards sachets","kg",5,null,null,null,null,"JOSA",0,0,0,100,100,null,"LEGUMES"]
["préparation abricot","kg",5,null,null,null,null,"METRO",0,0,0,100,100,null,"CONFITURE"]
["préparation framboise","kg",5,null,null,null,null,"METRO",0,0,0,100,100,null,"CONFITURE"]
["Provolone","kg",5,256,266,21,0,"LOBET",3502,0.15,15,85,100,null,"FROMAGE"]
["pruneau","kg",5,null,null,null,null,"METRO",0,0,0,100,100,null,"FRUITS SECS"]
["purée de fruit ananas","kg",5,null,null,null,null,"METRO",0,0.05,5,95,100,"2016-03-03","FRUITS PUREES"]
["purée de fruit cassis","kg",5,null,null,null,null,"METRO",0,0.05,5,95,100,"2016-03-03","FRUITS PUREES"]
["purée de fruit cerise","kg",5,null,null,null,null,"METRO",0,0.05,5,95,100,"2016-03-03","FRUITS PUREES"]
["purée de fruit exotique","kg",5,null,null,null,null,"METRO",0,0.05,5,95,100,"2016-03-03","FRUITS PUREES"]
["purée de fruit fraise","kg",5,null,null,null,null,"METRO",0,0.05,5,95,100,"2016-03-03","FRUITS PUREES"]
["purée de fruit framboise","kg",5,null,null,null,null,"METRO",0,0.05,5,95,100,"2016-03-03","FRUITS PUREES"]
["purée de fruit litchi","kg",5,null,null,null,null,"METRO",0,0.05,5,95,100,"2016-03-03","FRUITS PUREES"]
["purée de fruit mangue","kg",5,null,null,null,null,"METRO",0,0.05,5,95,100,"2016-03-03","FRUITS PUREES"]
["purée de fruit passion","kg",5,null,null,null,null,"METRO",0,0.05,5,95,100,"2016-03-03","FRUITS PUREES"]
["purée de fruit pèche blanche","kg",5,null,null,null,null,"METRO",0,0.05,5,95,100,"2016-03-03","FRUITS PUREES"]
["purée de fruit poire","kg",5,null,null,null,null,"METRO",0,0.05,5,95,100,"2016-03-03","FRUITS PUREES"]
["purée de fruit pomme","kg",5,null,null,null,null,"METRO",0,0.05,5,95,100,"2016-03-03","FRUITS PUREES"]
["Quatre épices",null,5,1,1,1,1,"METRO",17,0,0,100,100,null,"ASSAISONNEMENT"]
["quinoa","kg",5,131,58,689,null,"METRO",3802,0,0,100,100,"2016-03-03","PATES & RIZ & FECULES"]
["radis","botte",5,null,null,null,null,"JOSA",0,0.4,40,60,100,null,"LEGUMES"]
["Raisins blancs","kg",5,5,0,139,14,"JOSA",576,0.15,15,85,100,null,"FRUITS"]
["Raisins noirs","kg",5,9,0,118,13,"JOSA",508,0.15,{"$f":"M435-L435","v":15},85,100,null,"FRUITS"]
["Raisins secs","kg",5,34,5,592,40,"METRO",2549,{"$f":"K436/M436","v":0},0,100,100,null,"FRUITS SECS"]
["Rhum","Litre",5,null,null,null,null,null,null,0,0,100,100,null,"ALCOOL"]
["Ricotta ","kg",5,104,103,28,0,"LOBET",{"$f":"((D438*4)+(F438*4)+(E438*9))","v":1455},0,0,100,100,"2015-04-02","FROMAGE"]
["Rigatello ss/croute","kg",5,null,null,null,null,"LOBET",0,0,0,100,100,null,"FROMAGE"]
["Riz Arborio (risotto)","kg",5,80,16,770,31,"METRO",3544,0,0,100,100,"03/13/16","PATES & RIZ & FECULES"]
["Riz au lait metro debic","kg",5,51,52,280,20,"METRO",1792,0,0,100,100,"03/13/16","SUCRES"]
["Riz basmati","kg",5,90,11,760,6,"METRO",3499,0,0,100,100,"03/13/16","PATES & RIZ & FECULES"]
["Riz complet","kg",5,35,20,317,21.6,"METRO",1588,0,0,100,100,"03/13/16","PATES & RIZ & FECULES"]
["Riz dessert","kg",5,75,10,770,10,"METRO",3470,0,0,100,100,"03/13/16","PATES & RIZ & FECULES"]
["Riz Jasmin","kg",5,27,10,311,20,"METRO",1442,0,0,100,100,"03/13/16","PATES & RIZ & FECULES"]
["Riz long","kg",5,73,13,760,10,"METRO",3449,0,0,100,100,"03/13/16","PATES & RIZ & FECULES"]
["romarin","kg",5,null,null,null,null,"METRO",0,0,0,100,100,"2016-03-03","ASSAISONNEMENT"]
["Romarin frais","botte",5,1,1,1,1,"JOSA",17,0.4,40,60,100,null,"HERBES"]
["salade cresson","Botte",5,1,1,1,1,"JOSA",17,0.1,10,90,100,null,"SALADE"]
["salade cressonnette","kg",5,1,1,1,1,"JOSA",17,0.1,10,90,100,null,"SALADE"]
["Salade iceberg (600g)","pièce",5,13,0,4,13,"JOSA",68,0.05,5,95,100,null,"SALADE"]
["salade iceberg 1 dose dwich 20g","pièce",5,null,null,null,null,"JOSA",0,0.05,5,95,100,null,"SALADE"]
["salade iceberg 1 dose dwich 30g","pièce",5,null,null,null,null,"JOSA",0,0.05,5,95,100,null,"SALADE"]
["salade Romaine","pièce",5,1,1,1,1,"JOSA",17,0.2,20,80,100,null,"SALADE"]
["salade roquette 1botte = 0,84 k","Botte",5,13,0,4,13,"JOSA",68,0.1,10,90,100,null,"SALADE"]
["salade roquette botte dose dwich (5g)","pièce",5,13,0,4,13,"JOSA",68,0.1,10,90,100,null,"SALADE"]
["salade roquette lavée","kg",5,13,0,4,13,"METRO",68,0,0,100,100,null,"SALADE"]
["salade Trévise","pièce",5,1,1,1,1,"JOSA",17,0.05,5,95,100,null,"SALADE"]
["Salami (60T dans un kilos)","kg",5,null,null,null,null,"VT FOOD",0,0,0,100,100,null,"CHARCUTERIE"]
["Salami la tranche","pièce",5,null,null,null,null,"VT FOOD",0,0,0,100,100,null,"CHARCUTERIE"]
["sangria","litre",5,null,null,null,null,"METRO",{"$f":"((D461*4)+(F461*4)+(E461*9))","v":0},{"$f":"K461/M461","v":0},{"$f":"M461-L461","v":0},100,100,null,"DIVERS"]
["sangria bon marché","litre",5,null,null,null,null,"METRO",0,0,0,100,100,null,"DIVERS"]
["sauce 1000 island helleman's","Litre",5,null,null,null,null,"METRO",0,0.05,5,95,100,"2016-03-03","SAUCE"]
["sauce caesar helleman's","Litre",5,null,null,null,null,"METRO",0,0.05,5,95,100,"2016-03-03","SAUCE"]
["sauce miel moutarde helleman's","Litre",5,null,null,null,null,"METRO",0,0.05,5,95,100,"2016-03-03","SAUCE"]
["sauce pickles DL","litre",5,null,null,null,null,"METRO",0,0.05,5,95,100,"2016-03-03","SAUCE"]
["sauce salade 30ml","pièce",5,null,null,null,null,"METRO",0,0,0,100,100,"à vérifier","PREPARATIONS"]
["sauce worcestershire heinz","litre",5,null,null,null,null,"METRO",0,0.05,5,95,100,"2016-03-03","SAUCE"]
["sauce yaourt fines helleman's","Litre",5,null,null,null,null,"METRO",0,0.05,5,95,100,"2016-03-03","SAUCE"]
["sauce yaourt helleman's","Litre",5,null,null,null,null,"METRO",0,0.05,5,95,100,"2016-03-03","SAUCE"]
["Sauge","kg",5,null,null,null,null,"METRO",0,0,0,100,100,null,"ASSAISONNEMENT"]
["Sauge fraîche","Botte",5,1,1,1,1,"JOSA",17,0.3,30,70,100,null,"HERBES"]
["Saumon fumé tranché  machine SAVEUR","kg",5,1,1,1,1,"SAVEURS GOURMANDES",17,0.13333333333333333,200,1300,1500,null,"POISSON"]
["Saumon fumé tranché machine METRO","kg",5,null,null,null,null,"METRO",0,0,0,100,100,null,"POISSON"]
["Saumon fumé tranché machine VT FOOD","kg",5,null,null,null,null,"VT FOOD",0,0,0,100,100,null,"POISSON"]
["Sel fin (kg) 5 kg","kg",5,1,1,1,1,"METRO",17,0,0,100,100,"2016-03-03","ASSAISONNEMENT"]
["Sel fin 1 pincée","pincée",5,1,1,1,1,"METRO",17,0,0,100,100,null,"ASSAISONNEMENT"]
["Sel fin dosette 1g","pièce",5,1,1,1,1,"METRO",17,0,0,100,100,"2016-03-03","ASSAISONNEMENT"]
["Semoule couscous","kg",5,106,15,716,24,"METRO",3423,0,0,100,100,"2016-03-03","PATES & RIZ & FECULES"]
["SF Cheddar tranché","kg",5,null,null,null,null,"LOBET",null,0,0,100,100,null,"FROMAGE"]
["SF Cheddar tranché (dose : 2,5 demi T =25g)","pièce",5,null,null,null,null,"LOBET",null,0,0,100,100,null,"FROMAGE"]
["SF Cheddar tranché (dose : 3 demi T =30g)","pièce",5,null,null,null,null,"LOBET",null,0,0,100,100,null,"FROMAGE"]
["SF Cheddar tranché La Tranche","pièce",5,null,null,null,null,"LOBET",null,0,0,100,100,null,"FROMAGE"]
["SF Emmental tranché  (dose : 2,5 demi T =25g)","pièce",5,null,null,null,null,"LOBET",null,0,0,100,100,null,"FROMAGE"]
["SF Emmental tranché  (dose : 3 demi T =30g)","pièce",5,null,null,null,null,"LOBET",null,0,0,100,100,null,"FROMAGE"]
["SF Emmental tranche 1kg","kg",5,null,null,null,null,"LOBET",null,0,0,100,100,null,"FROMAGE"]
["SF FDP BAG GRISE SUMMER 1/2","pièce",5,null,null,null,null,"LOBET",null,0,0,100,100,null,"FROMAGE"]
["SF FDP BAG SUMMER 1/2","pièce",5,null,null,null,null,"LOBET",null,0,0,100,100,null,"FROMAGE"]
["SF gouda ss croute tranché","kg",5,null,null,null,null,"LOBET",null,0,0,100,100,null,"FROMAGE"]
["SF gouda ss croute tranché ( dose : 2 demi T = 20g)","pièce",5,null,null,null,null,"LOBET",null,0,0,100,100,null,"FROMAGE"]
["SF gouda ss croute tranché (dose : 3 demi T =30g)","pièce",5,null,null,null,null,"LOBET",null,0,0,100,100,null,"FROMAGE"]
["SF Mascarpone","kg",5,null,null,null,null,"LOBET",null,0,0,100,100,null,"FROMAGE"]
["SF Mozzarella tranchée","kg",5,null,null,null,null,"LOBET",null,{"$f":"K493/M493","v":0},{"$f":"M493-L493","v":0},100,100,null,"FROMAGE"]
["SF Mozzarella tranchée (dose : 3 demi T =30g)","pièce",5,null,null,null,null,"LOBET",null,0,0,100,100,null,"FROMAGE"]
["SF Mozzarella tranchée (dose 2,5 demi T)","pièce",5,null,null,null,null,"LOBET",null,0,0,100,100,null,"FROMAGE"]
["SF Philadelphia original (1,65K)","kg",5,null,null,null,null,"LOBET",null,0,0,100,100,null,"FROMAGE"]
["SF Ricotta ","kg",5,null,null,null,null,"LOBET",null,0,0,100,100,null,"FROMAGE"]
["ships lays sachet ind nature","pièce",5,null,null,null,null,"METRO",{"$f":"((D498*4)+(F498*4)+(E498*9))","v":0},0,0,100,100,null,"PATES & RIZ & FECULES"]
["sirop de Liège pot 900g","kg",5,null,null,null,null,"METRO",null,0.05,5,95,100,"2016-03-03","CHOCO / SIROP"]
["Son d'avoine","kg",5,null,null,null,null,"BIO",null,0,0,100,100,null,"PATES & RIZ & FECULES"]
["spéculoos miettes","kg",5,null,null,null,null,"METRO",{"$f":"((D501*4)+(F501*4)+(E501*9))","v":0},0,0,100,100,"03/13/16","SUCRES"]
["spéculoos pate à tartiner Lotus","kg",5,null,null,null,null,"METRO",null,0,0,100,100,"03/13/16","SUCRES"]
["spéculoos topping","Litre",5,null,null,null,null,"METRO",{"$f":"((D503*4)+(F503*4)+(E503*9))","v":0},0,0,100,100,"03/13/16","CHOCO / SIROP"]
["sucre en batonnet ind","pièce",5,null,null,null,null,"PONTI",{"$f":"((D504*4)+(F504*4)+(E504*9))","v":0},0,0,100,100,"03/13/16","SUCRES"]
["sucre en dose \"pyramide\" 380*4g","pièce",5,null,null,null,null,"METRO",null,0,0,100,100,"2016-03-03","SUCRES"]
["sucre gélifiant (confiture)","kg",5,null,null,null,null,"METRO",null,0,0,100,100,"03/13/16","SUCRES"]
["Sucre impalpable","kg",5,null,null,null,null,"METRO",null,0,0,100,100,"03/13/16","SUCRES"]
["sucre roux","kg",5,null,null,null,null,"METRO",{"$f":"((D508*4)+(F508*4)+(E508*9))","v":0},0,0,100,100,"03/13/16","SUCRES"]
["Sucre semoule","kg",5,0,0,999,0,"METRO",{"$f":"((D509*4)+(F509*4)+(E509*9))","v":3996},0,0,100,100,"03/13/16","SUCRES"]
["sucre vanillé","kg",5,null,null,null,null,"METRO",null,0,0,100,100,"03/13/16","SUCRES"]
["tabasco","litre",5,null,null,null,null,"METRO",{"$f":"((D511*4)+(F511*4)+(E511*9))","v":0},0,0,100,100,"2016-03-03","SAUCE"]
["taboulé crevette knorr (1 boite = 625g)","kg",5,120,36,700,null,"METRO",null,0,0,100,100,"2016-03-03","PATES & RIZ & FECULES"]
["taboulé crevette knorr 1 boite","pièce",5,null,null,null,null,"METRO",{"$f":"((D513*4)+(F513*4)+(E513*9))","v":0},0,0,100,100,"2016-03-03","PATES & RIZ & FECULES"]
["Tapenade aubergine","kg",5,null,null,null,null,"METRO",{"$f":"((D514*4)+(F514*4)+(E514*9))","v":0},0.02,2,98,100,null,"ASSAISONNEMENT"]
["Tapenade cèpes","kg",5,null,null,null,null,"METRO",{"$f":"((D515*4)+(F515*4)+(E515*9))","v":0},0.02,2,98,100,null,"ASSAISONNEMENT"]
["Tarama","kg",5,null,null,null,null,"METRO",null,0,0,100,100,"2016-03-03","POISSON"]
["Telaggio (galbani)","kg",5,null,null,null,null,"LOBET",{"$f":"((D517*4)+(F517*4)+(E517*9))","v":0},0.3,30,70,100,null,"FROMAGE"]
["Telaggio (santi)","kg",5,null,null,null,null,"LOBET",0,0.3,30,70,100,null,"FROMAGE"]
["thé camomille","pièce",5,null,null,null,null,"METRO",0,0,0,100,100,null,"CAFE & THE"]
["thé tilleuil","pièce",5,null,null,null,null,"METRO",0,0,0,100,100,null,"CAFE & THE"]
["thé vert Jasmin","pièce",5,null,null,null,null,"PALAIS DES THES",0,0,0,100,100,"2015-04-01","CAFE & THE"]
["thé vert sencha","pièce",5,null,null,null,null,"PALAIS DES THES",0,0,0,100,100,"2015-04-01","CAFE & THE"]
["Thon au naturel","kg",5,251,9,0,0,"METRO",1085,3.5714285714285712E-2,50,1350,1400,null,"POISSON"]
["Thym","kg",5,1,1,1,1,"METRO",17,0,0,100,100,null,"ASSAISONNEMENT"]
["tofu","kg",5,null,null,null,null,"METRO",0,{"$f":"K525/M525","v":0},{"$f":"M525-L525","v":0},100,100,"2016-03-03","DIVERS"]
["Tomate cerisette","kg",5,9,0,19,13,"JOSA",112,0,0,100,100,null,"LEGUMES"]
["Tomate fraiche","kg",5,9,0,19,13,"JOSA",112,0.2,20,80,100,null,"LEGUMES"]
["Tomate semi séchées boite de 1,9k","kg",5,null,null,null,null,"METRO",null,0.3,30,70,100,null,"BOITES LEGUMES"]
["Tomates confites SELECTION","kg",5,1,1,1,1,"DAVIGEL",{"$f":"((D529*4)+(F529*4)+(E529*9))","v":17},0.3,30,70,100,null,"BOITES LEGUMES",9.9499999999999993]
["Tomates confites VT FOOD","kg",5,null,null,null,null,"VT FOOD",{"$f":"((D530*4)+(F530*4)+(E530*9))","v":0},0.3,30,70,100,null,"BOITES LEGUMES",8.5]
["Tomates mini assortiments","kg",5,null,null,null,null,"METRO",null,{"$error":"#DIV/0!"},null,null,null,null,"LEGUMES"]
["Tzatziki","kg",5,null,null,null,null,"METRO",null,0,null,100,100,"2016-03-03","DIVERS"]
["Vanille gousse","pièce",5,1,1,1,1,"METRO",{"$f":"((D533*4)+(F533*4)+(E533*9))","v":17},0,{"$f":"M533-L533","v":0},100,100,null,"ASSAISONNEMENT"]
["Vanille liquide","litre",5,1,1,1,1,"METRO",{"$f":"((D534*4)+(F534*4)+(E534*9))","v":17},0,0,100,100,"2016-03-03","ASSAISONNEMENT"]
["Vermicelles chocolat","kg",5,54,155,731,78,"METRO",{"$f":"((D535*4)+(F535*4)+(E535*9))","v":4535},0,0,100,100,"2016-03-03","CHOCO / SIROP"]
["Vinaigre balsamique","Litre",5,4,0,6,0,"METRO",{"$f":"((D536*4)+(F536*4)+(E536*9))","v":40},0,0,100,100,null,"ASSAISONNEMENT"]
["Yaourt 0% nature 5l","Litre",5,null,null,null,null,"LOBET",null,0,0,100,100,"2016-06-12","LAITAGE"]
["Yaourt entier nature 1/2l","Litre",5,1,1,1,1,"LOBET",{"$f":"((D538*4)+(F538*4)+(E538*9))","v":17},0,0,100,100,"2015-04-02","LAITAGE"]
["Yaourt entier nature 5l","litre",5,null,null,null,null,"LOBET",null,0,0,100,100,"2016-06-12","LAITAGE"]
[null,null,null,null,null,null,null,null,{"$f":"((D540*4)+(F540*4)+(E540*9))","v":0}]
[null,null,null,null,null,null,null,null,0]
[null,null,null,null,null,null,null,null,0]
[null,null,null,null,null,null,null,null,0]
[null,null,null,null,null,null,null,null,0]
[null,null,null,null,null,null,null,null,0]
[null,null,null,null,null,null,null,null,0]
[null,null,null,null,null,null,null,null,0]
[null,null,null,null,null,null,null,null,0]
[null,null,null,null,null,null,null,null,0]
[null,null,null,null,null,null,null,null,0]
[null,null,null,null,null,null,null,null,0]
[null,null,null,null,null,null,null,null,0]
[null,null,null,null,null,null,null,null,0]
[null,null,null,null,null,null,null,null,0]

{"sheet":"01b BOISSONS","index":2,"n_rows":43,"n_cols":19,"rows_kept":43,"cut":false,"hidden":false,"merged":[[42,1,42,12]]}
["A LA CARTE","TYPE","UNIT2",null,"ACHAT HT","REMISE","ACHAT HT","COND","ACHAT PU HT","VENTE HT EMPORTE ","VENTE EMPORTE TTC","COEF EMPORTE","marge BRUTE en € EMPORTE","emballage sur place","ACHAT + emball PU HT","VENTE HT","VENTE TTC","COEF","marge BRUTE en €"]
["A LA CARTE","VIN ",25,"VERRE",5,0,{"$f":"+E2-((E2*F2)/100)","v":5},6,{"$f":"G2/H2","v":0.83333333333333337},{"$f":"+K2/1.21","v":1.6528925619834711},2,{"$f":"J2/I2","v":1.9834710743801653},{"$f":"+J2-I2","v":0.81955922865013775},2.8000000000000001E-2,{"$f":"I2+N2","v":0.8613333333333334},{"$f":"+Q2/1.21","v":2.4793388429752068},3,{"$f":"+P2/O2","v":2.8784893687792645},{"$f":"+P2-O2","v":1.6180055096418733}]
["EN SOMMEIL","COCA DANOIS",33,"CANS",11,10,9.9,24,0.41250000000000003,{"$f":"+K3/1.06","v":1.8867924528301885},2,4.5740423098913654,1.4742924528301884,2.8000000000000001E-2,0.44050000000000006,1.6528925619834711,2,3.7523100158535092,1.212392561983471]
["EN SOMMEIL","COCA LIGHT DANOIS",33,"CANS",11,10,9.9,24,0.41250000000000003,{"$f":"+K4/1.06","v":1.8867924528301885},2,4.5740423098913654,1.4742924528301884,2.8000000000000001E-2,0.44050000000000006,1.6528925619834711,2,3.7523100158535092,1.212392561983471]
["EN SOMMEIL","COCA ZERO DANOIS",33,"CANS",11,10,9.9,24,0.41250000000000003,{"$f":"+K5/1.06","v":1.8867924528301885},2,4.5740423098913654,1.4742924528301884,2.8000000000000001E-2,0.44050000000000006,1.6528925619834711,2,3.7523100158535092,1.212392561983471]
["EN SOMMEIL","SPRITE DANOIS",33,"CANS",11,10,9.9,24,0.41250000000000003,{"$f":"+K6/1.06","v":1.8867924528301885},2,4.5740423098913654,1.4742924528301884,2.8000000000000001E-2,0.44050000000000006,1.6528925619834711,2,3.7523100158535092,1.212392561983471]
["A LA CARTE","BELVOIR VERRE",25,"VERRE",5,10,4.5,24,0.1875,{"$f":"+K7/1.06","v":1.8867924528301885},2,10.062893081761006,1.6992924528301885,2.8000000000000001E-2,0.2155,2.4793388429752068,3,11.505052635615808,2.2638388429752068]
["A LA CARTE","PTIT CHARDONNAY",18.7,"VERRE",5,0,5,4,1.25,{"$f":"+K8/1.21","v":1.6528925619834711},2,1.3223140495867769,0.40289256198347112,2.8000000000000001E-2,1.278,2.4793388429752068,3,1.9400147441120554,1.2013388429752068]
["A LA CARTE","PTIT MERLOT",18.7,"VERRE",5,0,5,4,1.25,{"$f":"+K9/1.21","v":1.6528925619834711},2,1.3223140495867769,0.40289256198347112,2.8000000000000001E-2,1.278,2.4793388429752068,3,1.9400147441120554,1.2013388429752068]
["A LA CARTE","BIONINA",33,"CANS",5,10,4.5,24,0.1875,{"$f":"+K10/1.06","v":1.8867924528301885},2,10.062893081761006,1.6992924528301885,2.8000000000000001E-2,0.2155,2.4793388429752068,3,11.505052635615808,2.2638388429752068]
["EN SOMMEIL","FANTA",33,"CANS",12.75,10,11.475,24,0.47812499999999997,{"$f":"+K11/1.06","v":1.8867924528301885},2,3.9462325810827474,1.4086674528301886,2.8000000000000001E-2,0.50612499999999994,1.6528925619834711,2,3.2657793272086368,1.1467675619834712]
["A LA CARTE","ARIZONA",50,"PET",5,10,4.5,6,0.75,{"$f":"+K12/1.06","v":1.8867924528301885},2,2.5157232704402515,1.1367924528301885,2.8000000000000001E-2,0.77800000000000002,2.4793388429752068,3,3.1868108521532221,1.7013388429752068]
["A LA CARTE","MINUT MAID POMME",33,"PET",5,10,4.5,24,0.1875,{"$f":"+K13/1.06","v":1.8867924528301885},2,10.062893081761006,1.6992924528301885,2.8000000000000001E-2,0.2155,2.4793388429752068,3,11.505052635615808,2.2638388429752068]
["A LA CARTE","MAES",33,null,5,0,5,24,0.20833333333333334,{"$f":"+K14/1.21","v":1.6528925619834711},2,7.9338842975206614,1.4445592286501379,2.8000000000000001E-2,0.23633333333333334,2.4793388429752068,3,10.490855470981129,2.2430055096418733]
["EN SOMMEIL","LIPTON ICE TEA",33,"CANS",9.2100000000000009,10,8.2890000000000015,16,0.51806250000000009,{"$f":"+K15/1.06","v":1.8867924528301885},2,3.6420170400872252,1.3687299528301884,2.8000000000000001E-2,0.54606250000000012,1.6528925619834711,2,3.0269292653926443,1.106830061983471]
["A LA CARTE","SAN PE ORANGE",33,"CANS",5,10,4.5,24,0.1875,{"$f":"+K16/1.06","v":1.8867924528301885},2,10.062893081761006,1.6992924528301885,2.8000000000000001E-2,0.2155,2.4793388429752068,3,11.505052635615808,2.2638388429752068]
["EN SOMMEIL","V8",25,"PET",30.88,10,27.791999999999998,24,1.1579999999999999,{"$f":"+K17/1.06","v":3.4905660377358489},3.7,3.0143057320689546,2.332566037735849,2.8000000000000001E-2,1.1859999999999999,3.553719008264463,4.3,2.9963903948266974,2.367719008264463]
["A LA CARTE","HOOGARDEN",33,null,5,0,5,24,0.20833333333333334,{"$f":"+K18/1.21","v":1.6528925619834711},2,7.9338842975206614,1.4445592286501379,2.8000000000000001E-2,0.23633333333333334,2.4793388429752068,3,10.490855470981129,2.2430055096418733]
["EN SOMMEIL","FIREFLY",40,"VERRE",17.02,10,15.318,12,1.2765,{"$f":"+K19/1.06","v":3.8679245283018862},4.0999999999999996,3.0301014714468359,2.5914245283018862,2.8000000000000001E-2,1.3045,3.8842975206611574,4.7,2.9776140442017307,2.5797975206611574]
["A LA CARTE","SPA  REINE BLEU",50,"PET",5,10,4.5,24,0.1875,1.8867924528301885,2,10.062893081761006,1.6992924528301885,2.8000000000000001E-2,0.2155,2.4793388429752068,3,11.505052635615808,2.2638388429752068]
["A LA CARTE","COCA",33,"CANS",5,10,4.5,24,0.1875,1.8867924528301885,2,10.062893081761006,1.6992924528301885,2.8000000000000001E-2,0.2155,2.4793388429752068,3,11.505052635615808,2.2638388429752068]
["EN SOMMEIL","CHARLIES",33,"CANS",19.36,10,17.423999999999999,24,0.72599999999999998,2.1698113207547167,2.2999999999999998,2.9887208274858357,1.4438113207547167,2.8000000000000001E-2,0.754,2.2314049586776861,2.7,2.9594230221189468,1.4774049586776861]
["A LA CARTE","COCA LIGHT",33,"CANS",5,10,4.5,24,0.1875,1.8867924528301885,2,10.062893081761006,1.6992924528301885,2.8000000000000001E-2,0.2155,2.4793388429752068,3,11.505052635615808,2.2638388429752068]
["A LA CARTE","COCA ZERO",33,"CANS",5,10,4.5,24,0.1875,1.8867924528301885,2,10.062893081761006,1.6992924528301885,2.8000000000000001E-2,0.2155,2.4793388429752068,3,11.505052635615808,2.2638388429752068]
["EN SOMMEIL","CAWSTON RHUBARBE",33,"CANS",24.04,10,21.635999999999999,24,0.90149999999999997,2.7358490566037732,2.9,3.0347743279021335,1.8343490566037732,2.8000000000000001E-2,0.92949999999999999,2.7272727272727271,3.3,2.9341288082546821,1.7977727272727271]
["EN SOMMEIL","BELVOIR",25,"CANS",13.9,10,12.51,12,1.0425,3.2075471698113205,3.4,3.0767838559341203,2.1650471698113205,2.8000000000000001E-2,1.0705,3.1404958677685948,3.8,2.9336719923106909,2.0699958677685948]
["A LA CARTE","SPRITE",33,"CANS",5,10,4.5,24,0.1875,1.8867924528301885,2,10.062893081761006,1.6992924528301885,2.8000000000000001E-2,0.2155,2.4793388429752068,3,11.505052635615808,2.2638388429752068]
["EN SOMMEIL","TAO 25CL",25,"CANS",23.31,10,20.978999999999999,24,0.87412499999999993,2.641509433962264,2.8,3.0218898143426447,1.7673844339622642,2.8000000000000001E-2,0.90212499999999995,2.6446280991735538,3.2,2.9315539411650868,1.7425030991735539]
["EN SOMMEIL","BERRY CIE 33CL",33,"TETRA",12.79,10,11.510999999999999,12,0.95924999999999994,2.9245283018867925,3.1,3.0487654958423693,1.9652783018867925,2.8000000000000001E-2,0.98724999999999996,2.8925619834710745,3.5,2.9299184436273231,1.9053119834710746]
["A LA CARTE","BRU 50CL",50,"PET",5,10,4.5,24,0.1875,1.8867924528301885,2,10.062893081761006,1.6992924528301885,2.8000000000000001E-2,0.2155,2.4793388429752068,3,11.505052635615808,2.2638388429752068]
["EN SOMMEIL","CANADA DRY",33,"CANS",15.99,10,14.391,24,0.59962499999999996,1.8867924528301885,2,3.1466207260040671,1.2871674528301886,2.8000000000000001E-2,0.62762499999999999,1.8181818181818183,2.2000000000000002,2.8969238290090713,1.1905568181818182]
["EN SOMMEIL","SWEPPES AGRUM",33,"CANS",15.99,10,14.391,24,0.59962499999999996,1.8867924528301885,2,3.1466207260040671,1.2871674528301886,2.8000000000000001E-2,0.62762499999999999,1.8181818181818183,2.2000000000000002,2.8969238290090713,1.1905568181818182]
["EN SOMMEIL","ORANGINA",33,"CANS",16.809999999999999,10,15.128999999999998,24,0.63037499999999991,1.8867924528301885,2,2.9931270320526493,1.2564174528301886,2.8000000000000001E-2,0.65837499999999993,1.9008264462809916,2.2999999999999998,2.8871485798837924,1.2424514462809917]
["A LA CARTE","SPA BARISART ROUGE",50,"PET",5,10,4.5,24,0.1875,1.8867924528301885,2,10.062893081761006,1.6992924528301885,2.8000000000000001E-2,0.2155,2.4793388429752068,3,11.505052635615808,2.2638388429752068]
["A LA CARTE","LIPTON ICE TEA",33,"CANS",5,10,4.5,24,0.1875,1.8867924528301885,2,10.062893081761006,1.6992924528301885,2.8000000000000001E-2,0.2155,2.4793388429752068,3,11.505052635615808,2.2638388429752068]
["A LA CARTE","CAPRI SUN",20,"TETRA",5,10,4.5,40,0.1125,1.8867924528301885,2,16.771488469601675,1.7742924528301884,0,0.1125,2.4793388429752068,3,22.03856749311295,2.366838842975207]
[null,null,null,null,null,null,null,null,null,null,null,null,null,"Gobelet"]
[]
[null,null,null,"MES BEST "]
[]
[]
[]
[null,"REGLE TVA BOISSONS\n- 6%\n\n-12%\n\n-21%"]

{"sheet":"01c #PACK","index":3,"n_rows":35,"n_cols":8,"rows_kept":35,"cut":false,"hidden":false,"merged":[]}
["#00 quoi","prix remisé","remise","px u ht","qte","pxlot","fournisseur ","REF COMPLEM"]
[0,0]
["#pack BONBON",0.01,null,null,null,null,null,"pot bonbon + couvercle bonbon + sticker rond"]
["#pack CEREALES Sp",0.01,null,null,null,null,null,"DM12+ couvercle DM + fourchette + serviette + sticker rectangle + pain"]
["#pack CEREALES ToGo",0.01,null,null,null,null,null,"DM12 + couvercle DM + fourchette + serviette + sticker rectangle + pain + sac transparent"]
["#pack COOKIE",0.01,null,null,null,null,null,"sachet à cookie"]
["#pack CIAB Sp",0.01,null,null,null,null,null,"serviette + frutella"]
["#pack CIAB ToGo",0.01,null,null,null,null,null,"feuille kraft + serviette + napoléon + élastique"]
["#pack DWICH Sp",0.01,null,null,null,null,null,"feuille 35*40 + serviette"]
["#pack DWICH ToGo",0.01,null,null,null,null,null,"feuille 35*40 + serviette + sac transparent"]
["#pack FONDANT",0.01,null,null,null,null,null,"petit sac à croissant + petite cuillère + serviette"]
["#pack GAUFRE SP",0.01,null,null,null,null,null,"fourchette à gaufre + assiette 15 cm + serviette"]
["#pack JUS",0.01,null,null,null,null,null,"TP12 + couvercle + paille"]
["#pack KFE MEDIUM ToGo",0.01,null,null,null,null,null,"agitateur + couvercle + tasse + rocher coco+ sucre"]
["#pack KFE MEDIUM ToGo",0.01,null,null,null,null,null,"agitateur + tasse + rocher coco + sucre"]
["#pack KFE GRAND ToGo",0.01,null,null,null,null,null,"agitateur + couvercle + tasse + rocher coco + sucre"]
["#pack KFE GRAND SP",0.01,null,null,null,null,null,"agitateur + tasse + rocher coco +sucre"]
["#pack PASTA GRANDE Sp",0.01,null,null,null,null,null,"DM 24 + couvercle DM + fourchette + serviette + stickers rectangle + pain"]
["#pack PASTA GRANDE ToGo",0.01,null,null,null,null,null,"DM24 + couv + fourchette + pain + serviette + sticker rectangle + pain + sac transparent"]
["#pack PASTA MEDIUM Sp",0.01,null,null,null,null,null,"DM16 + couv + fourchette + pain + serviette + sticker rectangle + pain"]
["#pack PASTA MEDIUM ToGo",0.01,null,null,null,null,null,"DM16 + couv + fourchette + pain + serviette + sticker rectangle + pain + sac transparent"]
["#pack SALADE SP",0.01,null,null,null,null,null,"saladier + couvercle + couteau + fourchette + sticker rectangle + pain + serviette + pot sauce + couvercle sauce 60ml"]
["#pack SALADE ToGo",0.01,null,null,null,null,null,"saladier + couvercle + couteau + fourchette + sticker rectangle + pain + serviette + pot sauce + couvercle sauce 60ml + sac transparent"]
["#pack SAUCE 30ml",0.01,null,null,null,null,null,"pot + couvercle sauce 30ml"]
["#pack SAUCE 60 ml",0.01,null,null,null,null,null,"pot + couvercle sauce 60 ml"]
["#pack SNACKS Sp",0.01,null,null,null,null,null,"serviette"]
["#pack SNACKS ToGo",0.01,null,null,null,null,null,"petit sac à croissant"]
["#pack SOUPE ToGo",0.01,null,null,null,null,null,"pot + couvercle + pain + serviette + cuillère à soupe + elastique+sac transparent"]
["#pack SOUPE Sp",0.01,null,null,null,null,null,"pot + pain + serviette + cuillère à soupe"]
["#pack TARTE SP",0.01,null,null,null,null,null,"assiette 15 cm + serviette + cuillère petite"]
["#pack TARTE ToGo",0.01,null,null,null,null,null,"boite à tarte plastique + serviette + cuillère petite "]
["#pack YAOURT",0.01,null,null,null,null,null,"pot et couvercle + petite cuillère + serviette"]
["#pack POT ALU ToGo",0.01,null,null,null,null,null,"pot + petite cuillère +serviette + sac à croissant"]
["#pack POT ALU Sp",0.01,null,null,null,null,null,"pot + petite cuillère +serviette "]
["#pack VIN",0.01,null,null,null,null,null,"verre à vin / ESTIMATION"]

{"sheet":"01c EMBALLAGE","index":4,"n_rows":75,"n_cols":10,"rows_kept":75,"cut":false,"hidden":false,"merged":[]}
["REF","QUOI","QUOIQUOI","CATEGORIE","QTE"]
[null,"Boite à  bonbon","BOITE A BONBON","BONBONS",100,8.75,5,{"$f":"F2-((F2*G2)/100)","v":8.3125},0.01,"CANS"]
[null,"bonbon frutella","bonbon frutella","BONBONS",null,null,null,null,0.01,"METRO"]
[null,"bonbon Napoleon","bonbon Napoleon","BONBONS",null,null,null,null,0.01,"METRO"]
[null,"couvercle boite à bonbon","COUVERCLE BOITE A BONBON","BONBONS",100,4.4000000000000004,5,{"$f":"F5-((F5*G5)/100)","v":4.1800000000000006},0.01,"CANS"]
["CPCBIOPL","couteaux bio \"luxe\" 17cm 100 pcs","COUTEAUX","COUVERTS",100,3.45,5,{"$f":"F6-((F6*G6)/100)","v":3.2775000000000003},0.01,"CANS"]
["CPCRDBIOPL","cuilléres dessert \"luxe\" bio 12,5cm 100pcs","CUILLERE DESSERT","COUVERTS",100,2.2999999999999998,5,{"$f":"F7-((F7*G7)/100)","v":2.1849999999999996},0.01,"CANS"]
["CPCRBIOPL","cuilléres bio \"luxe\" 17cm 100 pcs","CUILLERE SOUPE","COUVERTS",100,3.45,5,{"$f":"F8-((F8*G8)/100)","v":3.2775000000000003},0.01,"CANS"]
["CPFBIOPL","fourchettes bio \"luxe\" 17cm 100 pcs","FOURCHETTE","COUVERTS",100,3.45,5,{"$f":"F9-((F9*G9)/100)","v":3.2775000000000003},0.01,"CANS"]
[null,"fourchette coupante \"gaufre\"","FOURCHETTE COUPANTE","COUVERTS",null,null,null,null,0.01,"METRO"]
[null,"couvercle pot à dessert 5 et 7 oz","couvercle pot à dessert 5 et 7 oz","dessert",null,null,null,null,0.01,"CANS"]
[null,"pot à dessert 5 oz","pot à dessert 5 oz","dessert",null,null,null,null,0.01,"CANS"]
[null,"pot à dessert 7 oz","pot à dessert 7 oz","dessert",null,null,null,null,0.01,"CANS"]
["CPV45PL","film alimentaire en boite ind +cutter 45cmx300m","FILM","DIVERS",1,6.9,5,{"$f":"F14-((F14*G14)/100)","v":6.5550000000000006},0.01,"CANS"]
["CPGLMPL","gants latex medium à usage unique 1x100pc","GANTS","DIVERS",100,4.5,5,4.2750000000000004,0.01,"CANS"]
["CPTO200PAP","rouleaux papier toilette \"mini jumbo\" blanc 2plis","PAPIER WAWA","DIVERS",8,18,5,17.100000000000001,0.01,"CANS"]
["CPE811PAP","papier essui main mini 2plis ouate blanche 200m 1x12pc","PAPIER Z MAIN","DIVERS",12,18,5,17.100000000000001,0.01,"CANS"]
["CPRCT8080PAP","rouleaux caisse therm 80/80/12 5pc","ROULEAU CAISSE","DIVERS",5,5.65,5,5.3675000000000006,0.01,"CANS"]
["CPLG8PL","couvercles tout pots ronds transp \"SOLO\" 50pcs","COUVERCLE DM","DM",50,2.35,5,2.2324999999999999,0.01,"CANS"]
["CPDM12PL","pots ronds transp \"SOLO\" PET 355ml 50pcs","POT DM BOULGOUR","DM",50,4.4000000000000004,5,4.1800000000000006,0.01,"CANS"]
["CPDM8PL","pots ronds transp \"SOLO\" PET 237ml 50pcs","POT DM DESSERT","DM",50,3.6,5,3.42,0.01,"CANS"]
["CPDM24PL","pots ronds transp \"SOLO\" PET 710ml 50pcs","POT DM PASTA GRANDE","DM",50,6.1,5,5.7949999999999999,0.01,"CANS"]
["CPDM16PL","pots ronds transp \"SOLO\" PET 500ml 50pcs","POT DM PASTA MEDIUM","DM",50,5.3,5,5.0350000000000001,0.01,"CANS"]
[null,"assiettes 15cm","ASSIETTE 15CM","EMBAL",null,null,null,null,0.01,"METRO"]
[null,"assiettes 15cm 100pc: 2,50€","ASSIETTE 15CM","EMBAL",100,2.5,5,{"$f":"F25-((F25*G25)/100)","v":2.375},0.01,"CANS"]
[null,"barquette à frite carton","barquette à frite carton","EMBAL",null,null,null,null,0.01,"METRO"]
[null,"boite à tarte plastique","boite à tarte plastique","EMBAL",null,null,null,null,0.01,"CANS"]
[null,"élastique","élastique","EMBAL",null,null,null,null,0.01,"METRO"]
["CPDX3340BRPAP","feuille duplex kraft brun ligné 60gr 32x40cm 15kg","FEUILLE KRAFT","EMBAL",1500,29,5,{"$f":"F29-((F29*G29)/100)","v":27.55},0.01,"CANS"]
["CPPP3540PL","feuilles en polypropylénes 35x40cm 1000 pcs","FEUILLE TRANSPARANTE","EMBAL",1000,16.899999999999999,5,16.055,0.01,"CANS"]
["POT ALU","pot en alu","POT ALU","EMBAL",100,6.56,0,6.56,0.01,"CANS"]
["CROISSANT","sac à croissant grand","SAC A CROISSANT GRAND","EMBAL",1000,15.9,null,15.9,0.01,"CANS"]
["CROISSANT","sac à croissant petit","SAC A CROISSANT PETIT","EMBAL",1000,19.899999999999999,null,19.899999999999999,0.01,"CANS"]
["CPLD48TPL","sacs transparents LDPE 21my 27x48cm 1000pc","SAC TRANSPARENT","EMBAL",1000,26.9,5,25.555,0.01,"CANS"]
["CPSAPP1423PL","sachets polyp 30my fond croisé 145X235mm 100pcs","SACHET COOKIE","EMBAL",100,3.2,5,3.04,0.01,"CANS"]
["CPZIGBPAP","papier bl enchevêtrés 2 plis 4000pcs",null,"EMBAL",4000,29,5,27.55,0.01,"CANS"]
[null,"gobelet à eau","gobelet à eau","gobelet",null,null,null,null,0.01,"CANS"]
[null,"agitateur à café en bois ","AGITATEUR","KFE",null,null,null,null,0.01,"METRO"]
["CP13994BOIS","agitateur à café en bois 14cm \"natural\" 1000pcs","AGITATEUR","KFE",1000,3.9,5,{"$f":"F39-((F39*G39)/100)","v":3.7050000000000001},0.01,"CANS"]
[null,"chocolat au lait dose de 35g","chocolat au lait dose de 35g","KFE",null,null,null,null,0.01,"METRO"]
[null,"chocolat noir dose de 35g","chocolat noir dose de 35g","KFE",null,null,null,null,0.01,"METRO"]
["CPC378XPAP","couv dome pour gob carton bl 250cc 50pc","COUVERCLE KFE LONGO","KFE",50,1.5,5,{"$f":"F42-((F42*G42)/100)","v":1.425},0.01,"CANS"]
["CPC412XPAP","couv dome pour gob carton bl 300cc 50pc","COUVERCLE KFE THE &CHOCOLAT","KFE",50,1.6,5,1.52,0.01,"CANS"]
["CPC374XPAP","couv dome pour gob carton bl 120cc 50pc","COUVERCLE KFE EXPRESSO","KFE",50,0.85,5,0.8075,0.01,"CANS"]
["CP378XPAP","gobelets à café carton blanc 237ML 50pc","GOBELET KFE LONGO","KFE",50,2.2000000000000002,5,2.0900000000000003,0.01,"CANS"]
["CP412XPAP","gobelets à café carton bl 355ML 50pc","GOBELET KFE THE &CHOCOLAT","KFE",50,2.6,5,2.4700000000000002,0.01,"CANS"]
["CPCSLR750PL","couv pour saladier rond CPSLR750AMPL 50pc","COUVERCLE SALADIER","SALADE",50,5.3,5,5.0350000000000001,0.01,"CANS"]
["CPSLR750AMPL","saladier rond cristal 750ml 50pc","SALADIER","SALADE",50,6.9,5,6.5550000000000006,0.01,"CANS"]
[null,"tranche de pain","tranche de pain","SALADE",null,null,null,null,0.01,"MA BAKER"]
["CPPL1PL","couvercles pots à sauce SOLO CPT125PL 100pc","COUVERCLE SAUCE 30ML","SAUCE",100,1.1499999999999999,5,{"$f":"F50-((F50*G50)/100)","v":1.0924999999999998},0.01,"CANS"]
["CPPL2PL","couv plats pots à sauce SOLO 60ml 100pc","COUVERCLE SAUCE 60 ML","SAUCE",100,1.75,5,1.6625000000000001,0.01,"CANS"]
["CPT125PL","pots à sauce SOLO transparent PET 30ml 250pc","SAUCE 30 ML","SAUCE",250,3.65,5,3.4674999999999998,0.01,"CANS"]
["CPT200PL","pots à sauce transparent SOLO 60ml 250pc","SAUCE 60 ML","SAUCE",250,4.5999999999999996,5,4.3699999999999992,0.01,"CANS"]
["CP10230PAP","serviettes 2plis blanc 25x25cm \"tissue\"100pcs","SERVIETTE","SERVIETTE",100,0.9,5,0.85499999999999998,0.01,"CANS"]
["CPVHL16PAP","couv carton bl pour pots SOLO CPHD16PAP 25pc","COUVERCLE A SOUPE","SOUPE",25,2.15,5,2.0425,0.01,"CANS"]
["CPHD16PAP","pots carton bl SOLO micro-ondable 473ml 25pc","POT A SOUPE","SOUPE",25,2.7,5,2.5650000000000004,0.01,"CANS"]
["STICKERS ROND","STICKERS CARRE","STICKERS CARRE","STICKERS",null,null,null,null,0.01,"MAKRO"]
["STICKER RECTANGLE / GALLERY 21 26638","stickers RECTANGLE","STICKERS RECTANGLE","STICKERS",null,null,null,null,0.01,"MAKRO"]
["STICKERS CARRE ","STIKERS ROND","STIKERS ROND","STICKERS",null,null,null,null,0.01,"MAKRO"]
["CPDL662PL","couvercles dome+ouverture SOLO pour CPTP9PL+CPTP12PL 100pc","COUVERCLE DOME PERCE GOBELET JUS","TP",100,2.9,5,{"$f":"F60-((F60*G60)/100)","v":2.7549999999999999},0.01,"CANS"]
["CPDN662PL","couvercles dome SOLO pour CPTP9PL+CPTP12PL 100pc","COUVERCLE DOME POT DESSERT","TP",100,2.9,5,2.7549999999999999,0.01,"CANS"]
["CP662TPPL","couvercles plats SOLO pour CPTP9PL+CPTP12PL 100pc","COUVERCLE PLAT POT DESSERT","TP",100,3.6,5,3.42,0.01,"CANS"]
["CPTP12PL","gobelets milk shake SOLO cristal PET 355ml / 50pc","GOBELET TP12 JUS","TP",50,3.6,5,3.42,0.01,"CANS"]
["CPPLTRPL","pailles transparents larges 25cm 100pc","PAILLE","TP",50,0.95,5,0.90249999999999997,0.01,"CANS"]
["CPTP9PL","coupe à dessert SOLO 270ml 50pc","POT TP9 SALADE DE FRUIT","TP",50,3.6,5,3.42,0.01,"CANS"]
["GANT MENAGER JAUNE","GANT MENAGER JAUNE","GANT MENAGER JAUNE","DIVERS",3,1.36,0,1.36,0.01,"METRO"]
["SANYTOL","SANYTOL","SANYTOL","DIVERS",1,3.43,0,3.43,0.01,"METRO"]
["RAMETTE DE PAPIER ","RAMETTE DE PAPIER ","RAMETTE DE PAPIER ","DIVERS",5,{"$f":"10.62/5","v":2.1239999999999997},0,2.1239999999999997,0.01,"METRO"]
["FEUILLE DE PAPIER","FEUILLE DE PAPIER","FEUILLE DE PAPIER","DIVERS",500,{"$f":"2.2124/500","v":4.4248000000000004E-3},0,4.4248000000000004E-3,0.01,"METRO"]
["RAPE A CAROTTE ","RAPE A CAROTTE ","RAPE A CAROTTE ","DIVERS",1,6.6,0,{"$f":"F70-((F70*G70)/100)","v":6.6},0.01,"METRO"]
[null,null,null,null,null,null,null,null,0.01]
[null,null,null,null,null,null,null,null,0.01]
[null,null,null,null,null,null,null,null,0.01]
[null,null,null,null,null,null,null,null,0.01]
[null,null,null,null,null,null,null,null,0.01]

{"sheet":"01c SANS TRANSFORMATION","index":5,"n_rows":136,"n_cols":27,"rows_kept":136,"cut":false,"hidden":false,"merged":[]}
["à la carte","Fournisseur",null,"TYPE","DATE","Ref","poids","nbre u par carton","ACHAT HT","ACHAT UHT","REMISE","ACHAT UHT remisé","emballage emporté","EMBALLAGE EMPORTE","achat ht  EMBALLAGE EMPORTE","emballage sur place","EMBALLAGE SUR PLACE","achat ht EMBALLAGESUR PLACE","prix pratiqué","TVA EMPORTE","TVA SUR PLACE","ht TO GO","HT sur place","COEFF EMPORTE","COEFF SUR PLACE","marge EMPORTE","marge SUR PLACE"]
["à la carte","DAVIGEL","actif","TARTE NOIX DE PECAN",null,null,null,8,{"$f":"17.9/2","v":8.9499999999999993},{"$f":"I2/H2","v":1.1187499999999999},0,{"$f":"J2-(J2*K2)","v":1.1187499999999999},"TARTE TOGO",0.19800000000000001,{"$f":"+L2+N2","v":1.3167499999999999},"TARTE SP",8.14E-2,{"$f":"+L2+Q2","v":1.2001499999999998},3.5,0.06,0.12,{"$f":"+S2/1.06","v":3.3018867924528301},{"$f":"+S2/1.12","v":3.1249999999999996},{"$f":"+V2/O2","v":2.5076034117735566},{"$f":"+W2/R2","v":2.6038411865183519},{"$f":"+V2-O2","v":1.9851367924528303},{"$f":"+W2-R2","v":1.9248499999999997}]
["en sommeil","DELIDRINCKS","actif","BARRE DE CHOCOLAT LOVE",null,null,null,null,null,1.66,0,1.66,"RIEN",null,{"$f":"+L3+N3","v":1.66},null,null,{"$f":"L3+Q3","v":1.66},6,0.06,0.12,{"$f":"S3/1.06","v":5.6603773584905657},{"$f":"S3/1.21","v":4.9586776859504136},{"$f":"V3/O3","v":3.4098658786087745},{"$f":"W3/R3","v":2.9871552325002493},{"$f":"V3-O3","v":4.0003773584905655},{"$f":"W3-R3","v":3.2986776859504134}]
["en sommeil","INTER DRINKS","inactif","BERRY CIE 33CL",null,null,null,12,12.08,{"$f":"I4/H4","v":1.0066666666666666},0,1.0066666666666666,"DRINCK",0,{"$f":"+L4+N4","v":1.0066666666666666},"GOBELET",2.8000000000000001E-2,{"$f":"+L4+Q4","v":1.0346666666666666},3.7,0.06,0.21,{"$f":"+S4/1.06","v":3.4905660377358489},{"$f":"+S4/1.21","v":3.0578512396694215},{"$f":"+V4/O4","v":3.4674497063601151},{"$f":"+W4/R4","v":2.9553974610207039},{"$f":"+V4-O4","v":2.4838993710691826},{"$f":"+W4-R4","v":2.0231845730027551}]
["en sommeil","sweetness  heaven","inactif","brownie double choco 32/34 pièce",null,null,null,null,null,0.53,0,0.53,null,null,null,null,null,null,2.2000000000000002,null,null,{"$f":" S5-(S5*#REF!)","v":{"$error":"#REF!"}},{"$f":"S5-(S5*#REF!)","v":{"$error":"#REF!"}},null,null,{"$error":"#REF!"},{"$error":"#REF!"}]
["à la carte","DAVIGEL","inactif","GRAND MOELLEUX AU CITRON",null,null,null,8,{"$f":"12/2","v":6},{"$f":"I6/H6","v":0.75},0,0.75,"SNACK TOGO",1.9900000000000001E-2,{"$f":"+L6+N6","v":0.76990000000000003},"SNACK SP",8.8999999999999999E-3,{"$f":"+L6+Q6","v":0.75890000000000002},3.5,0.06,0.12,{"$f":"+S6/1.06","v":3.3018867924528301},{"$f":"+S6/1.12","v":3.1249999999999996},{"$f":"+V6/O6","v":4.2887216423598256},{"$f":"+W6/R6","v":4.1178020819607317},2.5319867924528303,2.3660999999999994]
["à la carte","DAVIGEL","actif","SHORT BREAD",null,null,null,12,11.04,{"$f":"I7/H7","v":0.91999999999999993},0,0.91999999999999993,"SNACK TOGO",1.9900000000000001E-2,0.93989999999999996,"SNACK SP",8.8999999999999999E-3,0.92889999999999995,3.2,0.06,0.12,3.0188679245283021,{"$f":"+S7/1.12","v":2.8571428571428572},3.2119033136805002,3.0758347046429728,2.0789679245283024,1.9282428571428571]
["à la carte","DAVIGEL","actif","CRUMBLE POMME MYRTILLE",null,null,150,12,14.23,{"$f":"+I8/H8","v":1.1858333333333333},0,1.1858333333333333,"CRUMBLE TOGO",5.04E-2,1.2362333333333333,"CRUMBLE SP",3.0499999999999999E-2,1.2163333333333333,3.5,0.06,0.12,3.3018867924528301,{"$f":"+S8/1.12","v":3.1249999999999996},2.6709252237599403,2.5691970402850095,2.0656534591194968,1.9086666666666663]
["à la carte","DAVIGEL","actif","BROWNIE NOIX",null,null,null,30,19.100000000000001,{"$f":"+I9/H9","v":0.63666666666666671},0,0.63666666666666671,"SNACK TOGO",1.9900000000000001E-2,0.65656666666666674,"SNACK SP",8.8999999999999999E-3,0.64556666666666673,2.2000000000000002,0.06,0.12,2.0754716981132075,{"$f":"+S9/1.12","v":1.9642857142857142},3.1610981846675239,3.0427310078262724,1.4189050314465408,1.3187190476190476]
["à la carte","DAVIGEL","actif","CHUNKY BROWNIE",null,null,null,30,22.5,{"$f":"+I10/H10","v":0.75},0,0.75,"SNACK TOGO",1.9900000000000001E-2,0.76990000000000003,"SNACK SP",8.8999999999999999E-3,0.75890000000000002,2.5,0.06,0.12,2.3584905660377355,{"$f":"+S10/1.12","v":2.2321428571428568},3.0633726016855896,2.9412872014005229,1.5885905660377355,1.4732428571428566]
["en sommeil","INTER DRINKS","inactif","CANADA DRY",null,null,null,24,14.53,{"$f":"I11/H11","v":0.6054166666666666},0,0.6054166666666666,"DRINCK",0,0.6054166666666666,"GOBELET",2.8000000000000001E-2,0.63341666666666663,2.2999999999999998,0.06,0.21,2.1698113207547167,{"$f":"+S11/1.21","v":1.9008264462809916},3.5839966757132284,3.0009100585938562,1.56439465408805,1.2674097796143249]
["à la carte","DAVIGEL","actif","MOELLEUX POIRE CARAMEL",null,null,130,18,28.24,{"$f":"+I12/H12","v":1.5688888888888888},0,1.5688888888888888,"CRUMBLE TOGO",5.04E-2,1.6192888888888888,"CRUMBLE SP",3.0499999999999999E-2,1.5993888888888887,4.9000000000000004,0.06,0.12,4.6226415094339623,{"$f":"+S12/1.12","v":4.375},2.8547355207296525,2.7354197783875787,3.0033526205450736,2.775611111111111]
["en sommeil","DELIDRINCKS","actif","CANDY CANNE",null,null,null,null,null,0.68,0,0.68,"RIEN",null,0.68,null,null,{"$f":"L13+Q13","v":0.68},3,0.06,0.12,{"$f":"S13/1.06","v":2.8301886792452828},{"$f":"S13/1.21","v":2.4793388429752068},{"$f":"V13/O13","v":4.1620421753607095},{"$f":"W13/R13","v":3.6460865337870687},{"$f":"V13-O13","v":2.1501886792452827},{"$f":"W13-R13","v":1.7993388429752066}]
["à la carte","DAVIGEL","actif","CRUMBLE FRAISE RHUBARBE",null,null,130,18,29.3,{"$f":"+I14/H14","v":1.6277777777777778},0,1.6277777777777778,"CRUMBLE TOGO",5.04E-2,1.6781777777777778,"CRUMBLE SP",3.0499999999999999E-2,{"$f":"+L14+Q14","v":1.6582777777777777},4.9000000000000004,0.06,0.12,{"$f":"+S14/1.06","v":4.6226415094339623},{"$f":"+S14/1.12","v":4.375},{"$f":"+V14/O14","v":2.7545600773925196},{"$f":"+W14/R14","v":2.6382793393413517},{"$f":"+V14-O14","v":2.9444637316561844},{"$f":"+W14-R14","v":2.7167222222222223}]
["en sommeil","INTER DRINKS","inactif","CAWSTON RHUBARBE",null,null,null,24,22.24,{"$f":"I15/H15","v":0.92666666666666664},0,0.92666666666666664,"DRINCK",0,0.92666666666666664,"GOBELET",2.8000000000000001E-2,{"$f":"+L15+Q15","v":0.95466666666666666},3.6,0.06,0.21,3.3962264150943398,{"$f":"+S15/1.21","v":2.9752066115702482},3.6649925342744676,3.116487372454869,2.469559748427673,2.0205399449035815]
["à la carte","DAVIGEL","actif","MACARON CARAMEL",null,null,null,24,30.11,{"$f":"+I16/H16","v":1.2545833333333334},0,1.2545833333333334,"SNACK TOGO",1.9900000000000001E-2,1.2744833333333334,"CRUMBLE SP",3.0499999999999999E-2,{"$f":"+L16+Q16","v":1.2850833333333334},3.9,0.06,0.12,3.6792452830188678,{"$f":"+S16/1.12","v":3.4821428571428568},2.8868524105340994,2.7096630753981117,2.4047619496855344,2.1970595238095232]
["en sommeil","LOBET","inactif","cheesecake framboise","non",null,null,28,37.305599999999998,{"$f":"+I17/H17","v":1.3323428571428571},null,1.3323428571428571,null,null,null,null,null,null,null,0.06,0.12,0,{"$f":"+S17/1.12","v":0},{"$error":"#DIV/0!"},{"$error":"#DIV/0!"},0,0]
["en sommeil","LOBET","inactif","cheesecake new york","non",null,null,28,35.684199999999997,{"$f":"+I18/H18","v":1.2744357142857141},null,1.2744357142857141,null,null,null,null,null,null,null,0.06,0.12,0,{"$f":"+S18/1.12","v":0},{"$error":"#DIV/0!"},{"$error":"#DIV/0!"},0,0]
["à la carte","DAVIGEL","actif","SABLE FRAISE ",null,null,null,18,24.92,{"$f":"+I19/H19","v":1.3844444444444446},0,1.3844444444444446,"CRUMBLE TOGO",5.04E-2,{"$f":"+L19+N19","v":1.4348444444444446},"CRUMBLE SP",3.0499999999999999E-2,{"$f":"+L19+Q19","v":1.4149444444444446},4.9000000000000004,0.06,0.12,4.6226415094339623,{"$f":"+S19/1.12","v":4.375},3.2217022042579648,3.0919941890140952,3.1877970649895175,2.9600555555555554]
["en sommeil","sweetness  heaven","inactif","chunky environ 32p",null,null,null,null,null,0.9375,0,0.9375,null,null,null,null,null,null,2.5,null,null,{"$f":" S20-(S20*#REF!)","v":{"$error":"#REF!"}},{"$f":"S20-(S20*#REF!)","v":{"$error":"#REF!"}},null,null,{"$error":"#REF!"},{"$error":"#REF!"}]
["en sommeil","DAVIGEL","inactif","clafouti brioché aux abricots",null,null,null,null,null,null,0,0,null,null,null,null,null,null,null,0.06,0.12,{"$f":"+S21/1.06","v":0},{"$f":"+S21/1.12","v":0},{"$f":"+V21/O21","v":{"$error":"#DIV/0!"}},{"$f":"+W21/R21","v":{"$error":"#DIV/0!"}},0,0]
["à la carte","DAVIGEL","inactif","GRAND MOELLEUX AU CHOCOLAT",null,null,null,8,10.85,{"$f":"+I22/H22","v":1.35625},0,1.35625,"SNACK TOGO",1.9900000000000001E-2,{"$f":"+L22+N22","v":1.37615},"SNACK SP",8.8999999999999999E-3,{"$f":"+L22+Q22","v":1.3651499999999999},3.5,0.06,0.12,3.3018867924528301,{"$f":"+S22/1.12","v":3.1249999999999996},{"$f":"+V22/O22","v":2.3993654706629584},{"$f":"+W22/R22","v":2.2891257370984874},1.9257367924528301,1.7598499999999997]
["à la carte","DELIDRINCKS","actif","CHAI TEA",null,null,"15/20 g",58,16.059999999999999,{"$f":"I23/H23","v":0.27689655172413791},0,0.27689655172413791,"GRAND KFE TOGO",0.14230000000000001,{"$f":"+L23+N23","v":0.41919655172413794},"GRAND KFE SP",0.12709999999999999,{"$f":"L23+Q23","v":0.4039965517241379},3.2,0.06,0.21,3.0188679245283021,{"$f":"+S23/1.21","v":2.6446280991735538},{"$f":"V23/O23","v":7.2015571504866251},{"$f":"W23/R23","v":6.5461650300901395},{"$f":"V23-O23","v":2.5996713728041643},{"$f":"W23-R23","v":2.2406315474494161}]
["à la carte","DELIDRINCKS","actif","ICE LATTE",null,null,"15/20 g",79,18.45,{"$f":"I24/H24","v":0.23354430379746835},0,0.23354430379746835,"JUS",0.11409999999999999,{"$f":"+L24+N24","v":0.34764430379746836},"JUS",0.11409999999999999,{"$f":"L24+Q24","v":0.34764430379746836},4,0.06,0.21,3.773584905660377,{"$f":"+S24/1.21","v":3.3057851239669422}]
["à la carte","DELIDRINCKS","actif","LOVE CHOCO",null,null,null,null,null,null,0,0,"GRAND KFE TOGO",0.14230000000000001,{"$f":"+L25+N25","v":0.14230000000000001},"GRAND KFE SP",0.12709999999999999,{"$f":"L25+Q25","v":0.12709999999999999},4.5,0.06,0.21,4.2452830188679247,{"$f":"+S25/1.21","v":3.71900826446281},{"$f":"V25/O25","v":29.833331123456954},{"$f":"W25/R25","v":29.260489885623997},{"$f":"V25-O25","v":4.102983018867925},{"$f":"W25-R25","v":3.59190826446281}]
["à la carte","DELIDRINCKS","actif","LOVE LATTE ",null,null,null,null,null,null,0,0,"GRAND KFE TOGO",0.14230000000000001,0.14230000000000001,"GRAND KFE SP",0.12709999999999999,0.12709999999999999,4.5,0.06,0.21,4.2452830188679247,{"$f":"+S26/1.21","v":3.71900826446281},{"$f":"V26/O26","v":29.833331123456954},{"$f":"W26/R26","v":29.260489885623997},{"$f":"V26-O26","v":4.102983018867925},{"$f":"W26-R26","v":3.59190826446281}]
["à la carte","LOBET","inactif","COOKIE CITRON AVOINE RAISiN","non",963,76,30,16.991199999999999,{"$f":"+I27/H27","v":0.56637333333333328},0,0.56637333333333328,"COOKIE",3.04E-2,{"$f":"+L27+N27","v":0.59677333333333327},"COOKIE",3.04E-2,{"$f":"+L27+Q27","v":0.59677333333333327},2.9,0.06,0.12,2.7358490566037732,{"$f":"+S27/1.12","v":2.589285714285714},{"$f":"+V27/O27","v":4.5844023246186829},{"$f":"+W27/R27","v":4.3388093429426826},{"$f":"+V27-O27","v":2.13907572327044},{"$f":"+W27-R27","v":1.9925123809523808}]
["à la carte","LOBET","inactif","COOKIE TRIPLE CHOCOLAT","non",961,76,30,17.8354,{"$f":"+I28/H28","v":0.59451333333333334},0,0.59451333333333334,"COOKIE",3.04E-2,0.62491333333333332,"COOKIE",3.04E-2,0.62491333333333332,2.9,0.06,0.12,2.7358490566037732,{"$f":"+S28/1.12","v":2.589285714285714},4.3779655684581966,4.1434316987193647,2.11093572327044,1.9643723809523808]
["à la carte","LOBET","inactif","COOKIE CHOCOLAT BLANC FRAMBOISE","non",962,76,30,18.049800000000001,{"$f":"+I29/H29","v":0.60166000000000008},0,0.60166000000000008,"COOKIE",3.04E-2,0.63206000000000007,"COOKIE",3.04E-2,0.63206000000000007,2.9,0.06,0.12,2.7358490566037732,{"$f":"+S29/1.12","v":2.589285714285714},4.3284641594212143,4.0965821508807929,2.1037890566037731,1.9572257142857139]
["à la carte","INTER DRINKS","actif","ARIZONA",null,null,50,6,6.3,{"$f":"I30/H30","v":1.05},0,1.05,"DRINCK",0,1.05,"GOBELET",2.8000000000000001E-2,1.0780000000000001,3.8,0.06,0.21,3.5849056603773581,{"$f":"+S30/1.21","v":3.1404958677685948},3.4141958670260553,2.9132614728836685,2.5349056603773583,2.0624958677685949]
["à la carte","INTER DRINKS","actif","BRU 50CL",null,null,50,24,13.26,{"$f":"I31/H31","v":0.55249999999999999},0,0.55249999999999999,"DRINCK",0,0.55249999999999999,"GOBELET",2.8000000000000001E-2,0.58050000000000002,2,0.06,0.21,1.8867924528301885,{"$f":"+S31/1.21","v":1.6528925619834711},3.4150089643985311,2.8473601412290632,1.3342924528301885,1.0723925619834711]
["à la carte","INTER DRINKS","actif","CAPRI SUN",null,null,null,40,12.5,{"$f":"I32/H32","v":0.3125},0,0.3125,"DRINCK",0,0.3125,"GOBELET",2.8000000000000001E-2,0.34050000000000002,1.5,0.06,0.21,1.4150943396226414,{"$f":"+S32/1.21","v":1.2396694214876034},4.5283018867924527,3.6407325153820951,1.1025943396226414,0.89916942148760337]
["à la carte","INTER DRINKS","actif","COCA",null,null,33,24,12.73,{"$f":"I33/H33","v":0.53041666666666665},0,0.53041666666666665,"DRINCK",0,0.53041666666666665,"GOBELET",2.8000000000000001E-2,0.55841666666666667,2,0.06,0.21,1.8867924528301885,{"$f":"+S33/1.21","v":1.6528925619834711},3.5571892276452886,2.9599628031341072,1.3563757861635217,1.0944758953168043]
["à la carte","LOBET","inactif","COOKIE DOUBLE CHOCOLAT","non",960,76,30,18.143599999999999,{"$f":"+I34/H34","v":0.60478666666666669},0,{"$f":"J34-(J34*K34)","v":0.60478666666666669},"COOKIE",3.04E-2,0.63518666666666668,"COOKIE",3.04E-2,0.63518666666666668,2.9,0.06,0.12,2.7358490566037732,{"$f":"+S34/1.12","v":2.589285714285714},4.3071575651311527,4.076416981284841,2.1006623899371064,1.9540990476190472]
["à la carte","LOBET","actif","PTIT COOKIE DOUBLE CHOCOLAT","ok",9686,55,120,45.050800000000002,{"$f":"+I35/H35","v":0.37542333333333333},0,0.37542333333333333,"COOKIE",3.04E-2,0.40582333333333331,"COOKIE",3.04E-2,0.40582333333333331,2.2000000000000002,0.06,0.12,2.0754716981132075,{"$f":"+S35/1.12","v":1.9642857142857142},5.1142246579707287,4.8402483370080107,1.6696483647798743,1.5584623809523808]
["à la carte","LOBET","actif","PTIT COOKIE CHOCOLAT LAIT","ok",9688,55,120,45.345599999999997,{"$f":"+I36/H36","v":0.37787999999999999},0,0.37787999999999999,"COOKIE",3.04E-2,0.40827999999999998,"COOKIE",3.04E-2,0.40827999999999998,2.2000000000000002,0.06,0.12,2.0754716981132075,{"$f":"+S36/1.12","v":1.9642857142857142},5.0834517931645138,4.8111240185307,1.6671916981132076,1.5560057142857142]
["à la carte","LOBET","actif","PTIT COOKIE CHOCOLAT BLANC","ok",9687,55,120,46.3506,{"$f":"+I37/H37","v":0.38625500000000001},0,0.38625500000000001,"COOKIE",3.04E-2,0.416655,"COOKIE",3.04E-2,0.416655,2.2000000000000002,0.06,0.12,2.0754716981132075,{"$f":"+S37/1.12","v":1.9642857142857142},4.9812715510751282,4.7144177179818172,1.6588166981132075,1.5476307142857142]
["en sommeil","DAVIGEL","inactif","ptit cookie 53g*54",null,null,53,54,28.39,{"$f":"+I38/H38","v":0.52574074074074073},0,0.52574074074074073,"COOKIE",3.04E-2,0.55614074074074071,"COOKIE",3.04E-2,0.55614074074074071,2.2000000000000002,0.06,0.12,2.0754716981132075,{"$f":"+S38/1.12","v":1.9642857142857142},3.731918102868752,3.5319939187864975,1.5193309573724667,1.4081449735449736]
["à la carte","INTER DRINKS","actif","JUS DE POMME",null,null,null,24,19.71,{"$f":"I39/H39","v":0.82125000000000004},0,0.82125000000000004,"DRINCK",0,0.82125000000000004,"GOBELET",2.8000000000000001E-2,0.84925000000000006,2.9,0.06,0.21,2.7358490566037732,{"$f":"+S39/1.21","v":2.3966942148760331},3.3313230521811543,2.8221303678257672,1.9145990566037732,1.547444214876033]
["à la carte","INTER DRINKS","actif","LIPTON ICE TEA",null,null,33,24,14.39,{"$f":"I40/H40","v":0.59958333333333336},0,0.59958333333333336,"DRINCK",0,0.59958333333333336,"GOBELET",2.8000000000000001E-2,0.62758333333333338,2,0.06,0.21,1.8867924528301885,{"$f":"+S40/1.21","v":1.6528925619834711},3.1468393931844698,2.6337419657152639,1.2872091194968551,1.0253092286501377]
["à la carte","INTER DRINKS","actif","SAN PELLEGRINO",null,null,33,24,19.739999999999998,{"$f":"I41/H41","v":0.8224999999999999},0,0.8224999999999999,"DRINCK",0,0.8224999999999999,"GOBELET",2.8000000000000001E-2,0.85049999999999992,null,0.06,0.21,0,{"$f":"+S41/1.21","v":0}]
["en sommeil","DAVIGEL","inactif","Maxi cookie 2 chocolats 75g*34",null,null,75,34,22,{"$f":"+I42/H42","v":0.6470588235294118},0,0.6470588235294118,null,null,null,null,null,null,2.9,0.06,0.12,2.7358490566037732,{"$f":"+S42/1.12","v":2.589285714285714},{"$f":"+V42/O42","v":{"$error":"#DIV/0!"}},{"$f":"+W42/R42","v":{"$error":"#DIV/0!"}},{"$f":"+V42-O42","v":2.7358490566037732},{"$f":"+W42-R42","v":2.589285714285714}]
["en sommeil","DAVIGEL","inactif","maxi cookie 3 chocolats 75g*34",null,null,75,34,22,{"$f":"+I43/H43","v":0.6470588235294118},0,0.6470588235294118,null,null,null,null,null,null,2.9,0.06,0.12,2.7358490566037732,{"$f":"+S43/1.12","v":2.589285714285714},{"$f":"+V43/O43","v":{"$error":"#DIV/0!"}},{"$f":"+W43/R43","v":{"$error":"#DIV/0!"}},2.7358490566037732,2.589285714285714]
["à la carte","INTER DRINKS","actif","SPA  REINE BLEU",null,null,50,24,12.82,{"$f":"I44/H44","v":0.53416666666666668},0,0.53416666666666668,"DRINCK",0,{"$f":"+L44+N44","v":0.53416666666666668},"GOBELET",2.8000000000000001E-2,{"$f":"+L44+Q44","v":0.5621666666666667},2,0.06,0.21,1.8867924528301885,{"$f":"+S44/1.21","v":1.6528925619834711},{"$f":"+V44/O44","v":3.5322167603685277},{"$f":"+W44/R44","v":2.9402180171659729},1.3526257861635218,1.0907258953168044]
["à la carte","INTER DRINKS","actif","SPA BARISART ROUGE",null,null,50,24,14.25,{"$f":"I45/H45","v":0.59375},0,0.59375,"DRINCK",0,{"$f":"+L45+N45","v":0.59375},"GOBELET",2.8000000000000001E-2,{"$f":"+L45+Q45","v":0.62175000000000002},2,0.06,0.21,1.8867924528301885,{"$f":"+S45/1.21","v":1.6528925619834711},{"$f":"+V45/O45","v":3.1777557100297913},{"$f":"+W45/R45","v":2.6584520498326838},1.2930424528301885,1.0311425619834711]
["en sommeil","cook & co","inactif","crumble pomme",null,null,110,18,27.18,{"$f":"I46/H46","v":1.51},0.1,1.359,null,null,null,null,null,null,4.5,null,null,{"$f":" S46-(S46*#REF!)","v":{"$error":"#REF!"}},{"$f":"S46-(S46*#REF!)","v":{"$error":"#REF!"}},null,null,{"$error":"#REF!"},{"$error":"#REF!"}]
["à la carte","JOSA","actif","POMME /BANANE / OU KIWI",null,null,null,null,null,{"$f":"2.24*0.15","v":0.33600000000000002},0,0.33600000000000002,"RIEN",0,{"$f":"+L47+N47","v":0.33600000000000002},"RIEN",0,{"$f":"+L47+Q47","v":0.33600000000000002},1,0.06,0.12,{"$f":"+S47/1.06","v":0.94339622641509424},{"$f":"+S47/1.12","v":0.89285714285714279},{"$f":"+V47/O47","v":2.8077268643306375},{"$f":"+W47/R47","v":2.6573129251700678},0.60739622641509428,0.55685714285714272]
["à la carte","LOBET","inactif","brownie pepite choco","non",9701,76,36,29.774799999999999,{"$f":"+I48/H48","v":0.8270777777777778},0,0.8270777777777778,"SNACK TOGO",1.9900000000000001E-2,{"$f":"+L48+N48","v":0.84697777777777783},"SNACK SP",8.8999999999999999E-3,{"$f":"+L48+Q48","v":0.83597777777777782},2.5,0.06,0.12,{"$f":"+S48/1.06","v":2.3584905660377355},{"$f":"+S48/1.12","v":2.2321428571428568},{"$f":"+V48/O48","v":2.7845955678149261},{"$f":"+W48/R48","v":2.6700983165801468},1.5115127882599577,1.3961650793650788]
["à la carte","LOBET","inactif","COOKIE NC AVOINE CITRON RAISIN","NC",9684,80,90,44.461199999999998,{"$f":"+I49/H49","v":0.4940133333333333},0,0.4940133333333333,"COOKIE",3.04E-2,{"$f":"+L49+N49","v":0.52441333333333329},"COOKIE",3.04E-2,{"$f":"+L49+Q49","v":0.52441333333333329},2.9,0.06,0.12,{"$f":"+S49/1.06","v":2.7358490566037732},{"$f":"+S49/1.12","v":2.589285714285714},{"$f":"+V49/O49","v":5.2169708180641985},{"$f":"+W49/R49","v":4.9374902385250454},2.2114357232704398,2.0648723809523806]
["à la carte","LOBET","inactif","COOKIE NC TRIPLE CHOCOLAT","NC",9682,80,90,46.256799999999998,{"$f":"+I50/H50","v":0.51396444444444445},0,0.51396444444444445,"COOKIE",3.04E-2,{"$f":"+L50+N50","v":0.54436444444444443},"COOKIE",3.04E-2,{"$f":"+L50+Q50","v":0.54436444444444443},2.9,0.06,0.12,{"$f":"+S50/1.06","v":2.7358490566037732},{"$f":"+S50/1.12","v":2.589285714285714},{"$f":"+V50/O50","v":5.0257673595781336},{"$f":"+W50/R50","v":4.7565298224578765},2.1914846121593285,2.0449212698412698]
["en sommeil","CIE DES DESSERTS","inactif","financier pistache framboise 45g*66",null,null,null,66,null,0.69299999999999995,0,0.69299999999999995,null,null,null,null,null,null,2.6,null,null,{"$f":" S51-(S51*#REF!)","v":{"$error":"#REF!"}},{"$f":"S51-(S51*#REF!)","v":{"$error":"#REF!"}},null,null,{"$error":"#REF!"},{"$error":"#REF!"}]
["en sommeil","INTER DRINKS","inactif","FIREFLY",null,null,null,12,16.149999999999999,{"$f":"I52/H52","v":1.3458333333333332},0,1.3458333333333332,"DRINCK",0,{"$f":"+L52+N52","v":1.3458333333333332},"GOBELET",2.8000000000000001E-2,{"$f":"+L52+Q52","v":1.3738333333333332},5,0.06,0.21,{"$f":"+S52/1.06","v":4.7169811320754711},{"$f":"+S52/1.21","v":4.1322314049586781},{"$f":"+V52/O52","v":3.5048776213563877},{"$f":"+W52/R52","v":3.0078112859095074},3.3711477987421379,2.7583980716253449]
["à la carte","LOBET","inactif","COOKIE NC CHOCOLAT BLANC FRAMBOISE","NC",9683,80,90,47.208199999999998,{"$f":"+I53/H53","v":0.52453555555555553},0,0.52453555555555553,"COOKIE",3.04E-2,0.55493555555555552,"COOKIE",3.04E-2,0.55493555555555552,2.9,0.06,0.12,2.7358490566037732,{"$f":"+S53/1.12","v":2.589285714285714},4.9300302156074096,4.6659214540570133,2.1809135010482175,2.0343501587301587]
["à la carte","LOBET","inactif","COOKIE NC CHOCOLAT ","NC",9681,80,90,47.234999999999999,0.52483333333333337,0,0.52483333333333337,"COOKIE",3.04E-2,0.55523333333333336,"COOKIE",3.04E-2,0.55523333333333336,2.9,0.06,0.12,2.7358490566037732,2.589285714285714,4.9273861858745986,4.6634190687741741,2.18061572327044,2.0340523809523807]
["à la carte","LOBET","actif","BIG COOKIE NC CHOCOLAT LAIT","NC",9671,107,40,24.696200000000001,0.61740499999999998,0,0.61740499999999998,"COOKIE",3.04E-2,0.64780499999999996,"COOKIE",3.04E-2,0.64780499999999996,3,0.06,0.12,2.8301886792452828,2.6785714285714284,4.3688898345108216,4.1348421648048852,2.1823836792452829,2.0307664285714284]
["à la carte","LOBET","actif","BIG COOKIE NC CHOCOLAT BLANC","NC",967,107,40,24.8034,0.620085,0,0.620085,"COOKIE",3.04E-2,0.65048499999999998,"COOKIE",3.04E-2,0.65048499999999998,3,0.06,0.12,2.8301886792452828,2.6785714285714284,4.3508899963031933,4.1178066036440937,2.1797036792452831,2.0280864285714282]
["à la carte","LOBET","actif","BIG COOKIE NC DOUBLE CHOC","NC",968,107,40,24.923999999999999,0.62309999999999999,0,0.62309999999999999,"COOKIE",3.04E-2,0.65349999999999997,"COOKIE",3.04E-2,0.65349999999999997,3,0.06,0.12,2.8301886792452828,2.6785714285714284,4.3308166476591934,4.0988086129631656,2.1766886792452826,2.0250714285714286]
["à la carte","LOBET","inactif","PTIT COOKIE CHOCOLAT AU LAIT ","non",965,50,54,25.151800000000001,0.46577407407407412,0,0.46577407407407412,"COOKIE",3.04E-2,0.4961740740740741,"COOKIE",3.04E-2,0.4961740740740741,2.2000000000000002,0.06,0.12,2.0754716981132075,1.9642857142857142,4.182950715404286,3.9588640699361992,1.5792976240391334,1.4681116402116401]
["à la carte","LOBET","inactif","PTIT COOKIE CHOCOLAT BLANC","non",966,50,54,25.151800000000001,0.46577407407407412,0,0.46577407407407412,"COOKIE",3.04E-2,0.4961740740740741,"COOKIE",3.04E-2,0.4961740740740741,2.2000000000000002,0.06,0.12,2.0754716981132075,1.9642857142857142,4.182950715404286,3.9588640699361992,1.5792976240391334,1.4681116402116401]
["à la carte","LOBET","inactif","PTIT COOKIE DOUBLE CHOCOLAT","non",964,50,54,25.232199999999999,0.46726296296296294,0,0.46726296296296294,"COOKIE",3.04E-2,0.49766296296296292,"COOKIE",3.04E-2,0.49766296296296292,2.2000000000000002,0.06,0.12,2.0754716981132075,1.9642857142857142,4.1704363245284704,3.9470200928573025,1.5778087351502446,1.4666227513227512]
["à la carte","LOBET","actif","BIG COOKIE AVOINE RAISIN","ok",9672,103,36,24.6828,0.68563333333333332,0,0.68563333333333332,"COOKIE",3.04E-2,0.7160333333333333,"COOKIE",3.04E-2,0.7160333333333333,3,0.06,0.12,2.8301886792452828,2.6785714285714284,3.9525934722479628,3.7408473933775364,2.1141553459119495,1.9625380952380951]
["à la carte","LOBET","actif","BIG COOKIE DOUBLE CHOCOLAT","non",9673,103,36,25.3126,0.7031277777777778,0,0.7031277777777778,"COOKIE",3.04E-2,0.73352777777777778,"COOKIE",3.04E-2,0.73352777777777778,3,0.06,0.12,2.8301886792452828,2.6785714285714284,3.858325158209194,3.6516291675908441,2.0966609014675051,1.9450436507936506]
["à la carte","LOBET","actif","BIG COOKIE CHOCOLAT BLANC","non",9675,103,36,26.237200000000001,0.72881111111111119,0,0.72881111111111119,"COOKIE",3.04E-2,0.75921111111111117,"COOKIE",3.04E-2,0.75921111111111117,3,0.06,0.12,2.8301886792452828,2.6785714285714284,3.7278019747409656,3.5280982975226993,2.0709775681341718,1.9193603174603173]
["à la carte","LOBET","actif","MUFFIN CARAMEL CHOCOLAT","non",913,113,24,20.810199999999998,0.86709166666666659,0,0.86709166666666659,"SNACK TOGO",1.9900000000000001E-2,0.88699166666666662,"SERVIETTE",8.6E-3,0.87569166666666665,3.5,0.06,0.12,3.3018867924528301,3.1249999999999996,3.7225679975792674,3.5686076720306801,2.4148951257861633,2.249308333333333]
["à la carte","LOBET","actif","MUFFIN FRUITS ROUGES","non",912,113,24,21.279199999999999,0.88663333333333327,0,0.88663333333333327,"SNACK TOGO",1.9900000000000001E-2,0.9065333333333333,"SERVIETTE",8.6E-3,0.89523333333333333,3.5,0.06,0.12,3.3018867924528301,3.1249999999999996,3.6423225391081373,3.4907100569683878,2.3953534591194967,2.2297666666666665]
[null,null,"actif","MACARON CHOCOLAT",null,null,null,24,30.43,1.2679166666666666,0,{"$f":"J66-(J66*K66)","v":1.2679166666666666}]
["à la carte","LOBET","actif","MUFFIN CITRON","ok",911,113,24,21.426600000000001,0.89277499999999999,0,0.89277499999999999,"SNACK TOGO",1.9900000000000001E-2,{"$f":"+L67+N67","v":0.91267500000000001},"SERVIETTE",8.6E-3,{"$f":"+L67+Q67","v":0.90137500000000004},3.5,0.06,0.12,{"$f":"+S67/1.06","v":3.3018867924528301},{"$f":"+S67/1.12","v":3.1249999999999996},{"$f":"+V67/O67","v":3.6178122469146521},{"$f":"+W67/R67","v":3.4669255304396054},{"$f":"+V67-O67","v":2.38921179245283},{"$f":"+W67-R67","v":2.2236249999999993}]
["à la carte","LOBET","actif","MUFFIN POMME CANELLE","non",905,100,32,19.6846,0.61514374999999999,0,0.61514374999999999,"SNACK TOGO",1.9900000000000001E-2,0.63504375000000002,"SERVIETTE",8.6E-3,{"$f":"+L68+Q68","v":0.62374375000000004},3.5,0.06,0.12,3.3018867924528301,{"$f":"+S68/1.12","v":3.1249999999999996},{"$f":"+V68/O68","v":5.1994634896459182},{"$f":"+W68/R68","v":5.0100702411847804},{"$f":"+V68-O68","v":2.6668430424528302},{"$f":"+W68-R68","v":2.5012562499999995}]
["à la carte","LOBET","actif","MUFFIN MYRTILLE","non",903,100,32,18.934200000000001,0.59169375000000002,0,0.59169375000000002,"SNACK TOGO",1.9900000000000001E-2,0.61159375000000005,"SERVIETTE",8.6E-3,{"$f":"+L69+Q69","v":0.60029375000000007},3.5,0.06,0.12,3.3018867924528301,{"$f":"+S69/1.12","v":3.1249999999999996},{"$f":"+V69/O69","v":5.3988236348929819},{"$f":"+W69/R69","v":5.2057846679229947},{"$f":"+V69-O69","v":2.6902930424528302},{"$f":"+W69-R69","v":2.5247062499999995}]
["à la carte","LOBET","actif","MUFFIN VANILLE","non",902,100,32,16.8706,0.52720624999999999,0,0.52720624999999999,"SNACK TOGO",1.9900000000000001E-2,0.54710625000000002,"SERVIETTE",8.6E-3,{"$f":"+L70+Q70","v":0.53580625000000004},3.5,0.06,0.12,3.3018867924528301,{"$f":"+S70/1.12","v":3.1249999999999996},{"$f":"+V70/O70","v":6.0351838284662804},{"$f":"+W70/R70","v":5.8323321163200301},{"$f":"+V70-O70","v":2.75478054245283},{"$f":"+W70-R70","v":2.5891937499999997}]
["à la carte","DELIDRINCKS",null,"MILK SHAKE",null,null,"15/20 g",49,12.99,{"$f":"I71/H71","v":0.26510204081632655},0,0.26510204081632655,"JUS",0.11409999999999999,0.37920204081632652,"JUS",0.11409999999999999,{"$f":"L71+Q71","v":0.37920204081632652},4.8,0.06,0.21,4.5283018867924527,{"$f":"+S71/1.21","v":3.9669421487603307},{"$f":"V71/O71","v":11.941660116185448},{"$f":"W71/R71","v":10.461289027402128},{"$f":"V71-O71","v":4.1490998459761261},{"$f":"W71-R71","v":3.5877401079440041}]
["à la carte","LOBET","actif","MUFFIN DOUBLE CHOCOLAT","non",901,100,32,19.349599999999999,{"$f":"+I72/H72","v":0.60467499999999996},0,0.60467499999999996,"SNACK TOGO",1.9900000000000001E-2,0.62457499999999999,"SERVIETTE",8.6E-3,{"$f":"+L72+Q72","v":0.61327500000000001},3.5,0.06,0.12,3.3018867924528301,{"$f":"+S72/1.12","v":3.1249999999999996},{"$f":"+V72/O72","v":5.2866137652849217},{"$f":"+W72/R72","v":5.0955933308874473},{"$f":"+V72-O72","v":2.67731179245283},{"$f":"+W72-R72","v":2.5117249999999993}]
["en sommeil","DAVIGEL","inactif","muffin double choco 100g*33",null,null,null,33,null,{"$f":"18.17/32","v":0.56781250000000005},0,0.56781250000000005,null,null,null,null,null,null,3,0.06,0.12,2.8301886792452828,{"$f":"+S73/1.12","v":2.6785714285714284},{"$f":"+V73/O73","v":{"$error":"#DIV/0!"}},{"$f":"+W73/R73","v":{"$error":"#DIV/0!"}},2.8301886792452828,2.6785714285714284]
["en sommeil","DAVIGEL","inactif","muffin myrtille 100g*32",null,null,null,32,null,{"$f":"18.17/32","v":0.56781250000000005},0,0.56781250000000005,null,null,null,null,null,null,3,0.06,0.12,2.8301886792452828,{"$f":"+S74/1.12","v":2.6785714285714284},{"$f":"+V74/O74","v":{"$error":"#DIV/0!"}},{"$f":"+W74/R74","v":{"$error":"#DIV/0!"}},2.8301886792452828,2.6785714285714284]
["en sommeil","sweetness  heaven","inactif","muffins",null,null,null,null,null,0.7,0,0.7,null,null,null,null,null,null,3,null,null,{"$f":" S75-(S75*#REF!)","v":{"$error":"#REF!"}},{"$f":"S75-(S75*#REF!)","v":{"$error":"#REF!"}},null,null,{"$error":"#REF!"},{"$error":"#REF!"}]
["en sommeil","LOBET","actif","MUFFIN CITRON","bof",9332,132,20,23.731400000000001,{"$f":"+I76/H76","v":1.1865700000000001},0,1.1865700000000001,"SNACK TOGO",1.9900000000000001E-2,{"$f":"+L76+N76","v":1.2064700000000002},"SERVIETTE",8.6E-3,{"$f":"+L76+Q76","v":1.1951700000000001},3.5,0.06,0.12,{"$f":"+S76/1.06","v":3.3018867924528301},{"$f":"+S76/1.12","v":3.1249999999999996},{"$f":"+V76/O76","v":2.7368163256880234},{"$f":"+W76/R76","v":2.6146907971250948},2.0954167924528297,1.9298299999999995]
["en sommeil","LOBET","actif","MUFFIN TRIPLE CHOCOLAT","non",935,123,20,20.555599999999998,1.0277799999999999,0,1.0277799999999999,"SNACK TOGO",1.9900000000000001E-2,1.0476799999999999,"SERVIETTE",8.6E-3,1.0363799999999999,3.5,0.06,0.12,3.3018867924528301,3.1249999999999996,3.1516176623137127,3.015303267141396,2.2542067924528304,2.0886199999999997]
["en sommeil","LOBET","actif","MUFFIN POMME CARAMEL","ok",934,134,20,20.033000000000001,1.0016500000000002,0,1.0016500000000002,"SNACK TOGO",1.9900000000000001E-2,1.0215500000000002,"SERVIETTE",8.6E-3,1.0102500000000001,3.5,0.06,0.12,3.3018867924528301,3.1249999999999996,3.2322321887845229,3.0932937391734714,2.2803367924528297,2.1147499999999995]
["en sommeil","LOBET","actif","MUFFIN CAPPUCINO ","ok",933,138,20,27.322600000000001,1.3661300000000001,0,1.3661300000000001,"SNACK TOGO",1.9900000000000001E-2,1.3860300000000001,"SERVIETTE",8.6E-3,1.37473,3.5,0.06,0.12,3.3018867924528301,3.1249999999999996,2.382262138952858,2.2731736413695778,1.91585679245283,1.7502699999999995]
["en sommeil","LOBET","actif","MUFFIN MYRTILLE CRUMBLE","ok",9331,124,24,18.5322,0.77217499999999994,0,0.77217499999999994,"SNACK TOGO",1.9900000000000001E-2,0.79207499999999997,"SERVIETTE",8.6E-3,0.780775,3.5,0.06,0.12,3.3018867924528301,3.1249999999999996,4.16865422144725,4.0024334795555694,2.50981179245283,2.3442249999999998]
["en sommeil","LOBET","actif","MUFFIN ABRICOT","ok",9310,133,24,23.4634,0.97764166666666663,0,0.97764166666666663,"SNACK TOGO",1.9900000000000001E-2,0.99754166666666666,"SERVIETTE",8.6E-3,0.98624166666666668,3.5,0.06,0.12,3.3018867924528301,3.1249999999999996,3.310023934625451,3.1685945804358293,2.3043451257861634,2.1387583333333327]
["en sommeil","LOBET","actif","MUFFIN TRIPLE CHOCOLAT","bof",9300,133,24,21.466799999999999,0.89444999999999997,0,0.89444999999999997,"SNACK TOGO",1.9900000000000001E-2,0.91435,"SERVIETTE",8.6E-3,0.90305000000000002,3.5,0.06,0.12,3.3018867924528301,3.1249999999999996,3.611184767816296,3.460494989203255,2.3875367924528303,2.2219499999999996]
["en sommeil","LOBET","actif","MUFFIN MYRTILLE","non",9210,126,24,20.167000000000002,0.84029166666666677,0,0.84029166666666677,"SNACK TOGO",1.9900000000000001E-2,0.8601916666666668,"SERVIETTE",8.6E-3,0.84889166666666682,3.5,0.06,0.12,3.3018867924528301,3.1249999999999996,3.8385477567435511,3.6812706764702985,2.4416951257861634,2.2761083333333327]
["en sommeil","LOBET","actif","MUFFIN FRUITY CARROT","non",936,140,15,17.1386,1.1425733333333334,0,1.1425733333333334,"SNACK TOGO",1.9900000000000001E-2,1.1624733333333335,"SERVIETTE",8.6E-3,1.1511733333333334,3.5,0.06,0.12,3.3018867924528301,3.1249999999999996,2.8403978807710253,2.7146216034654493,2.1394134591194964,1.9738266666666662]
["en sommeil","LOBET","actif","MUFFIN CARAMEL","non",932,137,15,16.4954,1.0996933333333334,0,1.0996933333333334,"SNACK TOGO",1.9900000000000001E-2,1.1195933333333334,"SERVIETTE",8.6E-3,1.1082933333333334,3.5,0.06,0.12,3.3018867924528301,3.1249999999999996,2.9491840422291693,2.8196506340078433,2.1822934591194967,2.016706666666666]
["en sommeil","LOBET","actif","MUFFIN CHOCOLAT","ok",920,123,15,12.2074,0.8138266666666667,0,0.8138266666666667,"SNACK TOGO",1.9900000000000001E-2,0.83372666666666673,"SERVIETTE",8.6E-3,0.82242666666666675,3.5,0.06,0.12,3.3018867924528301,3.1249999999999996,3.9603948445767556,3.7997308777276992,2.4681601257861634,2.3025733333333327]
["à la carte","LOBET","actif","BIG COOKIE CHOCOLAT LAIT","non",9674,103,36,26.2774,0.72992777777777773,0,0.72992777777777773,"COOKIE",3.04E-2,0.76032777777777771,"COOKIE",3.04E-2,0.76032777777777771,3,0.06,0.12,2.8301886792452828,2.6785714285714284,3.7223270830866144,3.5229167036355458,2.0698609014675053,1.9182436507936507]
["à la carte","METRO","actif","CAMOMILLE",null,null,null,10,5,{"$f":"7.321/100","v":7.3209999999999997E-2},0,7.3209999999999997E-2,"HOT DRINK",null,7.3209999999999997E-2,"GRAND KFE",null,7.3209999999999997E-2,2.6,0.06,0.21,2.4528301886792452,{"$f":"+S88/1.21","v":2.1487603305785123},33.504032081399338,29.350639674614293,2.3796201886792452,2.0755503305785123]
["à la carte","METRO","actif","CANDEREL",null,null,null,10,5,{"$f":"+I89/H89","v":0.5},0,0.5,"accompagnement","rien","rien","RIEN","rien","rien","rien","rien","rien","rien","rien","rien","rien","rien","rien"]
["à la carte","METRO","actif","FONDANT CHOCOLAT",null,null,110,10,5,{"$f":"+I90/H90","v":0.5},0,0.5,"SNACK TOGO",1.9900000000000001E-2,{"$f":"+L90+N90","v":0.51990000000000003},"CRUMBLE SP",3.0499999999999999E-2,{"$f":"+L90+Q90","v":0.53049999999999997},3.2,0.06,0.12,{"$f":"+S90/1.06","v":3.0188679245283021},{"$f":"+S90/1.12","v":2.8571428571428572},{"$f":"+V90/O90","v":5.8066318994581687},{"$f":"+W90/R90","v":5.3857546788743775},{"$f":"+V90-O90","v":2.4989679245283023},{"$f":"+W90-R90","v":2.3266428571428572}]
["en sommeil","LOBET","actif","MUFFIN CAPPUCINO CHOCOLAT","non",904,100,32,20.341200000000001,{"$f":"+I91/H91","v":0.63566250000000002},0,0.63566250000000002,"SNACK TOGO",1.9900000000000001E-2,0.65556250000000005,"SERVIETTE",8.6E-3,0.64426250000000007,3.5,0.06,0.12,3.3018867924528301,3.1249999999999996,5.0367231079459698,4.850507363070176,2.6463242924528299,2.4807374999999996]
["à la carte","METRO","actif","GAUFRE CHOCO CHANT",null,null,null,10,5,{"$f":"0.37+0.025+0.3","v":0.69500000000000006},0,0.69500000000000006,"GAUFRE",8.3599999999999994E-2,0.77860000000000007,"GAUFRE",8.3599999999999994E-2,0.77860000000000007,3.5,0.06,0.12,3.3018867924528301,3.1249999999999996,4.2407998875582198,4.0136141792961713,2.5232867924528302,2.3463999999999996]
["à la carte","METRO","actif","GAUFRE DE BRUXELLES",null,null,80,10,5,{"$f":"+I93/H93","v":0.5},0,0.5,"GAUFRE TOGO",8.3599999999999994E-2,0.58360000000000001,"GAUFRE",8.3599999999999994E-2,0.58360000000000001,3,0.06,0.12,2.8301886792452828,2.6785714285714284,4.8495350912359196,4.5897385684911383,2.2465886792452827,2.0949714285714283]
["à la carte","METRO","actif","GAUFRE DE LIEGE",null,null,90,10,5,{"$f":"+I94/H94","v":0.5},0,0.5,"GAUFRE TOGO",8.3599999999999994E-2,0.58360000000000001,"GAUFRE",8.3599999999999994E-2,0.58360000000000001,3,0.06,0.12,2.8301886792452828,2.6785714285714284,4.8495350912359196,4.5897385684911383,2.2465886792452827,2.0949714285714283]
["en sommeil","LOBET","actif","MUFFINS VANILLE CHOCOLAT","non",900,100,32,19.202200000000001,{"$f":"+I95/H95","v":0.60006875000000004},0,0.60006875000000004,"SNACK TOGO",1.9900000000000001E-2,0.61996875000000007,"SERVIETTE",8.6E-3,0.60866875000000009,3.5,0.06,0.12,3.3018867924528301,3.1249999999999996,5.3258923009471522,5.1341554827646387,2.6819180424528302,2.5163312499999995]
["en sommeil","METRO","inactif","ŒUF CHOCO RIOBA",null,null,null,10,5,5.98,0,5.98,"DIVERS",null,null,null,null,null,4.5,0.06,0.12,4.2452830188679247,4.0178571428571423,{"$error":"#DIV/0!"},{"$error":"#DIV/0!"},4.2452830188679247,4.0178571428571423]
["en sommeil","METRO","inactif","ŒUF CHOCO RIOBA 100g",null,null,null,10,5,{"$f":"(J96/2)+0.15","v":3.14},0,3.14,"DIVERS",null,null,null,null,null,3.5,0.06,0.12,3.3018867924528301,3.1249999999999996,{"$error":"#DIV/0!"},{"$error":"#DIV/0!"},3.3018867924528301,3.1249999999999996]
["en sommeil","METRO","inactif","ŒUF CHOCO RIOBA 200g",null,null,null,10,5,{"$f":"((J97*200)/1000)","v":0.628},0,{"$f":"J98-(J98*K98)","v":0.628},"DIVERS",null,null,null,null,null,6,0.06,0.12,5.6603773584905657,5.3571428571428568,{"$error":"#DIV/0!"},{"$error":"#DIV/0!"},5.6603773584905657,5.3571428571428568]
["en sommeil","INTER DRINKS","inactif","ORANGINA",null,null,null,24,15.26,{"$f":"I99/H99","v":0.63583333333333336},0,0.63583333333333336,"DRINCK",0,{"$f":"+L99+N99","v":0.63583333333333336},"GOBELET",2.8000000000000001E-2,{"$f":"+L99+Q99","v":0.66383333333333339},2.2999999999999998,0.06,0.21,2.1698113207547167,{"$f":"+S99/1.21","v":1.9008264462809916},3.4125472934543382,2.8634091583444512,1.5339779874213835,1.2369931129476583]
["en sommeil","CIE DES DESSERTS","inactif","pecan pie carée 90g *40 Gorgeous pecan",null,null,null,40,null,1.3859999999999999,0,1.3859999999999999,null,null,null,null,null,null,4,null,null,{"$f":" S100-(S100*#REF!)","v":{"$error":"#REF!"}},{"$f":"S100-(S100*#REF!)","v":{"$error":"#REF!"}},null,null,{"$error":"#REF!"},{"$error":"#REF!"}]
["en sommeil","ART ET GOUT","inactif","petit pot de crème (pistache praliné,,,",null,null,null,null,null,1,0,1,null,null,null,null,null,null,3.5,null,null,{"$f":" S101-(S101*#REF!)","v":{"$error":"#REF!"}},{"$f":"S101-(S101*#REF!)","v":{"$error":"#REF!"}},null,null,{"$error":"#REF!"},{"$error":"#REF!"}]
["à la carte","METRO","actif","HOOGARDEEN",null,null,null,10,5,0.72,0,0.72,"DRINCK",0,{"$f":"+L102+N102","v":0.72},"GOBELET",2.8000000000000001E-2,{"$f":"+L102+Q102","v":0.748},2.7,0.21,0.21,{"$f":"+S102/1.21","v":2.2314049586776861},{"$f":"+S102/1.21","v":2.2314049586776861},{"$f":"+V102/O102","v":3.0991735537190084},{"$f":"+W102/R102","v":2.9831617094621472},1.5114049586776861,1.4834049586776861]
["à la carte","METRO","actif","HOT CECEMEL ",null,null,"30G",10,5,{"$f":"+I103/H103","v":0.5},0,0.5,"ICE DRINK",0.14230000000000001,{"$f":"+L103+N103","v":0.64229999999999998},"GRAND KFE",0.127,{"$f":"+L103+Q103","v":0.627},4,0.06,0.21,{"$f":"+S103/1.06","v":3.773584905660377},{"$f":"+S103/1.21","v":3.3057851239669422},{"$f":"+V103/O103","v":5.8751127287254823},{"$f":"+W103/R103","v":5.27238456773037},3.1312849056603769,2.678785123966942]
["à la carte","METRO","actif","MAES",null,null,null,10,5,0.76900000000000002,0,0.76900000000000002,"DRINCK",0,{"$f":"+L104+N104","v":0.76900000000000002},"GOBELET",2.8000000000000001E-2,{"$f":"+L104+Q104","v":0.79700000000000004},2.7,0.21,0.21,{"$f":"+S104/1.21","v":2.2314049586776861},{"$f":"+S104/1.21","v":2.2314049586776861},{"$f":"+V104/O104","v":2.9016969553676022},{"$f":"+W104/R104","v":2.7997552806495434},1.4624049586776859,1.4344049586776859]
["à la carte","METRO","actif","POPPIES CHOCOLAT","2016-04-22",null,1,10,5,{"$f":"+I105/H105","v":0.5},0,0.5,"accompagnement","rien","rien","rien","rien","rien","rien","rien","rien","rien","rien","rien","rien","rien","rien"]
["en sommeil","CIE DES DESSERTS","inactif","sablé figue roties 100g*24",null,null,null,24,null,1.18,0,1.18,null,null,null,null,null,null,4.5,null,null,{"$f":" S106-(S106*#REF!)","v":{"$error":"#REF!"}},{"$f":"S106-(S106*#REF!)","v":{"$error":"#REF!"}},null,null,{"$f":"+V106-O106","v":{"$error":"#REF!"}},{"$f":"+W106-R106","v":{"$error":"#REF!"}}]
["à la carte","METRO","actif","POPPIES COCO","ref stoppée",null,1.2,10,5,{"$f":"+I107/H107","v":0.5},0,0.5,"accompagnement","rien","rien","rien","rien","rien","rien","rien","rien","rien","rien","rien","rien","rien","rien"]
["à la carte","METRO","actif","SHIPS LAYS bicky","2016-03-03",null,"45G",10,5,0.5,0,0.5,"RIEN",0,{"$f":"+L108+N108","v":0.5},"RIEN",0,{"$f":"+L108+Q108","v":0.5},1.6,0.06,0.12,{"$f":"+S108/1.06","v":1.5094339622641511},{"$f":"+S108/1.12","v":1.4285714285714286},{"$f":"+V108/O108","v":3.0188679245283021},{"$f":"+W108/R108","v":2.8571428571428572},{"$f":"+V108-O108","v":1.0094339622641511},{"$f":"+W108-R108","v":0.9285714285714286}]
["en sommeil","LOBET","inactif","scoop&bake banane caramel","non",null,"2k",4,40.1464,10.0366,null,10.0366,null,null,null,null,null,null,null,0.06,0.12,0,0,{"$error":"#DIV/0!"},{"$error":"#DIV/0!"},0,0]
["en sommeil","LOBET","inactif","scoop&bake double choco","non",null,"2k",4,39.114600000000003,9.7786500000000007,null,9.7786500000000007,null,null,null,null,null,null,null,0.06,0.12,0,0,{"$error":"#DIV/0!"},{"$error":"#DIV/0!"},0,0]
["en sommeil","LOBET","inactif","scoop&bake myrtille","non",null,"2k",4,37.2654,9.3163499999999999,null,9.3163499999999999,null,null,null,null,null,null,null,0.06,0.12,0,0,{"$error":"#DIV/0!"},{"$error":"#DIV/0!"},0,0]
["en sommeil","LOBET","inactif","scoop&bake pomme cannelle","non",null,"2k",4,36.9572,9.2393000000000001,null,9.2393000000000001,null,null,null,null,null,null,null,0.06,0.12,0,0,{"$error":"#DIV/0!"},{"$error":"#DIV/0!"},0,0]
["en sommeil","LOBET","inactif","scoop&bake vanille","non",null,"2k",4,32.360999999999997,8.0902499999999993,null,8.0902499999999993,null,null,null,null,null,null,null,0.06,0.12,0,0,{"$error":"#DIV/0!"},{"$error":"#DIV/0!"},0,0]
["en sommeil","DELIDRINCKS","actif","SHIPS KETTLE",null,null,null,null,null,0.52500000000000002,0,0.52500000000000002,"rien",null,{"$f":"+L114+N114","v":0.52500000000000002},null,null,{"$f":"L114+Q114","v":0.52500000000000002},2.5,0.06,0.12,{"$f":"S114/1.06","v":2.3584905660377355},{"$f":"S114/1.21","v":2.0661157024793391},{"$f":"V114/O114","v":4.4923629829290199},{"$f":"W114/R114","v":3.9354584809130264},{"$f":"V114-O114","v":1.8334905660377356},{"$f":"W114-R114","v":1.5411157024793392}]
["à la carte","METRO","actif","SHIPS LAYS NATURE","2016-03-03",null,"45G",10,5,{"$f":"+I115/H115","v":0.5},0,0.5,"RIEN",0,0.5,"RIEN",0,{"$f":"+L115+Q115","v":0.5},1.6,0.06,0.12,{"$f":"+S115/1.06","v":1.5094339622641511},{"$f":"+S115/1.12","v":1.4285714285714286},{"$f":"+V115/O115","v":3.0188679245283021},{"$f":"+W115/R115","v":2.8571428571428572},{"$f":"+V115-O115","v":1.0094339622641511},{"$f":"+W115-R115","v":0.9285714285714286}]
["à la carte","METRO","actif","SHIPS LAYS PAPRIKA","2016-03-03",null,"45G",10,5,{"$f":"+I116/H116","v":0.5},0,0.5,"RIEN",0,0.5,"RIEN",0,0.5,1.6,0.06,0.12,1.5094339622641511,1.4285714285714286,3.0188679245283021,2.8571428571428572,1.0094339622641511,0.9285714285714286]
["à la carte","METRO","actif","SHIPS LAYS sel&poivre","2016-04-26",null,"45G",10,5,{"$f":"+I117/H117","v":0.5},0,0.5,"RIEN",0,0.5,"RIEN",0,0.5,1.6,0.06,0.12,1.5094339622641511,1.4285714285714286,3.0188679245283021,2.8571428571428572,1.0094339622641511,0.9285714285714286]
["à la carte","METRO","actif","SUCETTE",null,null,null,10,5,{"$f":"+I118/H118","v":0.5},0,0.5,"RIEN",0,0.5,"RIEN",0,0.5,0.8,0.06,0.12,0.75471698113207553,0.7142857142857143,1.5094339622641511,1.4285714285714286,0.25471698113207553,0.2142857142857143]
["en sommeil","DAVIGEL","actif","CLAFOUTI GRIOTTES",null,null,null,30,33,{"$f":"+I119/H119","v":1.1000000000000001},0,1.1000000000000001,"CRUMBLE TOGO",5.04E-2,1.1504000000000001,"CRUMBLE SP",3.0499999999999999E-2,1.1305000000000001,4.9000000000000004,0.06,0.12,4.6226415094339623,4.375,4.0182906027763927,3.8699690402476778,3.472241509433962,3.2444999999999999]
["à la carte","METRO","actif","TARTE CHOCOLAT",null,null,null,10,5,{"$f":"5.14/8","v":0.64249999999999996},0,0.64249999999999996,"TARTE TOGO",0.19800000000000001,0.84050000000000002,"TARTE SP",8.14E-2,0.72389999999999999,3.5,0.06,0.12,3.3018867924528301,3.1249999999999996,3.9284792295691018,4.3168945987014773,2.4613867924528301,2.4010999999999996]
["à la carte","METRO","actif","TARTE TATIN","2016-06-12",null,"90G",10,5,{"$f":"5.14/8","v":0.64249999999999996},0,{"$f":"J121-(J121*K121)","v":0.64249999999999996},"TARTE TOGO",0.19800000000000001,0.84050000000000002,"TARTE SP",8.14E-2,{"$f":"+L121+Q121","v":0.72389999999999999},3.5,0.06,0.12,{"$f":"+S121/1.06","v":3.3018867924528301},{"$f":"+S121/1.12","v":3.1249999999999996},{"$f":"+V121/O121","v":3.9284792295691018},{"$f":"+W121/R121","v":4.3168945987014773},{"$f":"+V121-O121","v":2.4613867924528301},{"$f":"+W121-R121","v":2.4010999999999996}]
["à la carte","METRO","actif","TYRELLS",null,null,null,10,5,0.81,0,0.81,"RIEN",0,0.81,"RIEN",0,0.81,3,0.06,0.12,2.8301886792452828,2.6785714285714284,3.4940600978336822,3.3068783068783065,2.0201886792452828,1.8685714285714283]
["à la carte","PALAIS DES THE","actif","Thé mousseline (100p)",null,null,null,null,null,{"$f":"30.21/100","v":0.30210000000000004},0,3.3000000000000002E-2,"HOT DRINK",0.14230000000000001,0.17530000000000001,"GRAND KFE",0.12709999999999999,0.16009999999999999,2.4,0.06,0.21,2.2641509433962264,{"$f":"+S123/1.21","v":1.9834710743801653},12.915863909847269,12.388951120425768,2.0888509433962263,1.8233710743801654]
["en sommeil","INTER DRINKS","inactif","SWEPPES AGRUM",null,null,null,24,14.53,{"$f":"I124/H124","v":0.6054166666666666},0,{"$f":"J124-(J124*K124)","v":0.6054166666666666},"DRINCK",0,0.6054166666666666,"GOBELET",2.8000000000000001E-2,0.63341666666666663,2.2999999999999998,0.06,0.21,2.1698113207547167,{"$f":"+S124/1.21","v":1.9008264462809916},3.5839966757132284,3.0009100585938562,1.56439465408805,1.2674097796143249]
["en sommeil","INTER DRINKS","inactif","TAO 25CL",null,null,null,24,21.6,{"$f":"I125/H125","v":0.9},0,0.9,"DRINCK",0,0.9,"GOBELET",2.8000000000000001E-2,0.92800000000000005,3.4,0.06,0.21,3.2075471698113205,{"$f":"+S125/1.21","v":2.8099173553719008},3.5639412997903559,3.0279281846679962,2.3075471698113206,1.8819173553719009]
["en sommeil","CIE DES DESSERTS","inactif","tarte choco framboise 67g*24",null,null,null,24,null,1.0880000000000001,0,1.0880000000000001,null,null,null,null,null,null,4.4000000000000004,null,null,{"$f":" S126-(S126*#REF!)","v":{"$error":"#REF!"}},{"$f":"S126-(S126*#REF!)","v":{"$error":"#REF!"}},null,null,{"$error":"#REF!"},{"$error":"#REF!"}]
["à la carte","PONTI","actif","CAFE pantera 0,007g / 0,010 G",null,null,1000,{"$f":"+G127/10","v":100},21,{"$f":"+I127/H127","v":0.21},0,0.21,"HOT DRINK",{"$f":"0.0037+0.0285+0.0418+0.074+0.017","v":0.16499999999999998},{"$f":"+L127+N127","v":0.375},"MEDIUM  KFE",{"$f":"0.0037+0.0418+0.074+0.017","v":0.13650000000000001},{"$f":"+L127+Q127","v":0.34650000000000003},2.2000000000000002,0.06,0.21,{"$f":"+S127/1.06","v":2.0754716981132075},{"$f":"+S127/1.21","v":1.8181818181818183},{"$f":"+V127/O127","v":5.5345911949685531},{"$f":"+W127/R127","v":5.2472779745507019},1.7004716981132075,1.4716818181818183]
["à la carte","PONTI","actif","SUCRE DOSETTE ",null,null,null,1000,17,{"$f":"+I128/H128","v":1.7000000000000001E-2},0,1.7000000000000001E-2,"accompagnement","rien","rien","RIEN","rien","rien","rien","rien","rien","rien","rien","rien","rien","rien","rien"]
["en sommeil","CIE DES DESSERTS","inactif","Tartelette abricot 130g",null,null,null,null,null,1.4319999999999999,0,1.4319999999999999,null,null,null,null,null,null,4.9000000000000004,null,null,{"$f":" S129-(S129*#REF!)","v":{"$error":"#REF!"}},{"$f":"S129-(S129*#REF!)","v":{"$error":"#REF!"}},null,null,{"$f":"+V129-O129","v":{"$error":"#REF!"}},{"$f":"+W129-R129","v":{"$error":"#REF!"}}]
["en sommeil","CIE DES DESSERTS","inactif","tartelette citron 90g*24",null,null,null,24,null,{"$f":"1.31-((1.31*10)/100)","v":1.179},0,1.179,null,null,null,null,null,null,4.3,null,null,{"$f":" S130-(S130*#REF!)","v":{"$error":"#REF!"}},{"$f":"S130-(S130*#REF!)","v":{"$error":"#REF!"}},null,null,{"$f":"+V130-O130","v":{"$error":"#REF!"}},{"$f":"+W130-R130","v":{"$error":"#REF!"}}]
["en sommeil","DAVIGEL","inactif","TARTELETTE POMME NORMANDE",null,null,null,null,null,1.1599999999999999,0,1.1599999999999999,null,null,null,null,null,null,4.9000000000000004,0.06,0.12,{"$f":"+S131/1.06","v":4.6226415094339623},{"$f":"+S131/1.12","v":4.375},{"$f":"+V131/O131","v":{"$error":"#DIV/0!"}},{"$f":"+W131/R131","v":{"$error":"#DIV/0!"}},{"$f":"+V131-O131","v":4.6226415094339623},{"$f":"+W131-R131","v":4.375}]
["à la carte","PONTI","actif","CREME DOSETTE",null,null,null,240,13,{"$f":"+I132/H132","v":5.4166666666666669E-2},0,5.4166666666666669E-2,"accompagnement","rien","rien","rien","rien","rien","rien","rien","rien","rien","rien","rien","rien","rien","rien"]
["à la carte","PONTI","actif","DECA pantera  0,007g / 0,010 G",null,null,250,{"$f":"+G133/10","v":25},5.5,{"$f":"+I133/H133","v":0.22},0,0.22,"HOT DRINK",{"$f":"0.0037+0.0285+0.0418+0.074+0.017","v":0.16499999999999998},{"$f":"+L133+N133","v":0.38500000000000001},"MEDIUM  KFE",{"$f":"0.0037+0.0418+0.074+0.017","v":0.13650000000000001},{"$f":"+L133+Q133","v":0.35650000000000004},2.2000000000000002,0.06,0.21,{"$f":"+S133/1.06","v":2.0754716981132075},{"$f":"+S133/1.21","v":1.8181818181818183},{"$f":"+V133/O133","v":5.3908355795148246},{"$f":"+W133/R133","v":5.1000892515619025},{"$f":"+V133-O133","v":1.6904716981132075},{"$f":"+W133-R133","v":1.4616818181818183}]
["en sommeil","ART ET GOUT","inactif","yaourt fruits",null,null,null,null,null,{"$f":"1.91/2","v":0.95499999999999996},0,0.95499999999999996,null,null,null,null,null,null,3.3,null,null,{"$f":" S134-(S134*#REF!)","v":{"$error":"#REF!"}},{"$f":"S134-(S134*#REF!)","v":{"$error":"#REF!"}},null,null,{"$f":"+V134-O134","v":{"$error":"#REF!"}},{"$f":"+W134-R134","v":{"$error":"#REF!"}}]
["en sommeil","ART ET GOUT","inactif","yaourt nature 0%",null,null,null,null,null,{"$f":"1.7/2","v":0.85},0,0.85,null,null,null,null,null,null,3,null,null,{"$f":" S135-(S135*#REF!)","v":{"$error":"#REF!"}},{"$f":"S135-(S135*#REF!)","v":{"$error":"#REF!"}},null,null,{"$error":"#REF!"},{"$error":"#REF!"}]
["à la carte","LOBET","actif","yaourt pur bio 150g",null,null,null,null,null,0.79,0,0.79,null,null,null,null,null,null,2.9,0.06,0.12,{"$f":"+S136/1.06","v":2.7358490566037732},{"$f":"+S136/1.12","v":2.589285714285714},{"$f":"+V136/O136","v":{"$error":"#DIV/0!"}},{"$f":"+W136/R136","v":{"$error":"#DIV/0!"}},{"$f":"+V136-O136","v":2.7358490566037732},{"$f":"+W136-R136","v":2.589285714285714}]

{"sheet":"02a PASTA  poulet (grd)","index":6,"n_rows":72,"n_cols":16,"rows_kept":72,"cut":false,"hidden":false,"merged":[[6,0,6,1],[0,0,0,4],[0,6,0,12],[0,13,0,14],[2,4,2,6],[5,10,6,10],[13,0,13,3],[13,13,13,14],[14,0,14,3],[14,13,14,14],[15,0,15,3],[15,13,15,14],[8,0,8,1],[10,13,10,14],[11,1,11,4],[11,13,11,14],[12,3,12,4],[12,13,12,14],[7,10,8,10],[10,0,10,1],[19,0,19,3],[19,13,19,14],[20,0,20,3],[20,13,20,14],[21,0,21,3],[21,13,21,14],[16,0,16,3],[16,13,16,14],[17,0,17,3],[17,13,17,14],[18,0,18,3],[18,13,18,14],[25,0,25,3],[25,13,25,14],[26,0,26,3],[26,13,26,14],[27,0,27,3],[27,13,27,14],[22,0,22,3],[22,13,22,14],[23,0,23,3],[23,13,23,14],[24,0,24,3],[24,13,24,14],[31,1,31,3],[31,8,31,11],[33,1,33,5],[33,7,33,14],[28,0,28,3],[28,13,28,14],[29,1,29,3],[29,7,29,11],[30,1,30,3],[30,8,30,11],[37,1,37,5],[37,7,37,14],[38,1,38,5],[38,7,38,14],[39,1,39,5],[39,6,39,8],[39,9,39,10],[39,11,39,14],[34,1,34,5],[34,7,34,14],[35,1,35,5],[35,7,35,14],[36,1,36,5],[36,7,36,14],[42,1,42,5],[42,6,42,8],[42,11,42,12],[43,0,43,14],[44,0,44,14],[45,0,45,14],[40,1,40,5],[40,6,40,8],[40,11,40,12],[41,1,41,5],[41,6,41,8],[41,11,41,12],[55,3,55,7],[55,8,55,9],[56,3,56,7],[56,8,56,9],[57,3,57,7],[57,8,57,9],[46,0,46,14],[47,0,47,14],[52,3,52,4],[52,6,52,14],[48,3,48,4],[48,6,48,7],[48,9,48,10],[48,12,48,13],[49,3,49,4],[49,6,49,7],[49,9,49,10],[49,12,49,13],[50,3,50,4],[50,6,50,7],[50,9,50,10],[50,12,50,13],[70,8,70,9],[71,12,71,13],[67,3,67,7],[67,8,67,9],[68,3,68,7],[68,8,68,9],[69,3,69,7],[69,8,69,9],[64,3,64,7],[64,8,64,9],[65,3,65,7],[65,8,65,9],[66,3,66,7],[66,8,66,9],[61,3,61,7],[61,8,61,9],[62,3,62,7],[62,8,62,9],[63,3,63,7],[63,8,63,9],[58,3,58,7],[58,8,58,9],[59,3,59,7],[59,8,59,9],[60,3,60,7],[60,8,60,9]]}
["PASTA GRANDE",null,null,null,null,"  :  ","Fusilli Poulet",null,null,null,null,null,null,"330-340g"]
[]
["RECETTE PREVUE POUR  : ",null,1,null,"Vous la dupliquez pour : ",null,null,2]
[]
["Prix de revient unitaire : ",null,{"$f":"K12","v":1.2450000000000001},null,null,"marge","coef","tva","ht",null,"ttc"]
[null,null,null,null,null,null,null,null,null,null,5.8]
["avec emballage : ",null,{"$f":"C5+C9","v":1.2550000000000001},{"$f":"C5+C11","v":1.2550000000000001},null,{"$f":"I7-C7","v":4.2166981132075465},{"$f":"I7/C7","v":4.3599188153048178},"ES 6",{"$f":"K6/1.06","v":5.4716981132075464},"ToGo"]
[null,null,null,null,null,null,null,null,null,null,5.8]
["Emballage ToGo :",null,{"$f":"G31+G32","v":0.01},{"$f":"C9/C7","v":7.9681274900398405E-3},null,{"$f":"I9-D7","v":3.923571428571428},{"$f":"I9/D7","v":4.126351735913488},"ES 12",{"$f":"K8/1.12","v":5.1785714285714279},"Sp"]
[]
["Emballage Sp  :",null,{"$f":"O31+O32","v":0.01},{"$f":"C11/D7","v":7.9681274900398405E-3},null,"Prix kg/l / unité","Poids brut recette","Unité","% perte","brut 1 part","Cout 1 part","prix de revient","brut à faire","prix de revient"]
[0,"Produits",null,null,null,"ht",null,null,null,null,{"$f":"SUM(K14:K29)","v":1.2450000000000001},{"$f":"K12*H3","v":2.4900000000000002},null,{"$f":"SUM(N14:O29)","v":2.5499999999999998},null,"FOURNISSEUR"]
[]
["Pate fusilli",null,null,null,null,{"$f":"VLOOKUP(A14,PRIXINGRE,3,0)","v":5},8.5000000000000006E-2,{"$f":"IFERROR(VLOOKUP(A14,UNITINGRE,2,0),\"\")","v":"kg"},{"$f":"IFERROR(VLOOKUP(A14,UNITINGRE,10,0),\"\")","v":0},{"$f":"IFERROR((G14/$C$3)+(((G14/$C$3)*I14)),\"\")","v":8.5000000000000006E-2},{"$f":"IFERROR((J14*F14),\"\")","v":0.42500000000000004},null,{"$f":"IFERROR((ROUNDUP((J14*$H$3),2)),\"\")","v":0.17},{"$f":"IFERROR((M14*F14),\"\")","v":0.85000000000000009},null,{"$f":"VLOOKUP(A14,GDEBASE,8,0)","v":"METRO"}]
["Huile d'olive",null,null,null,null,{"$f":"VLOOKUP(A15,PRIXINGRE,3,0)","v":5},0.01,"Litre",0,0.01,{"$f":"IFERROR((J15*F15),\"\")","v":0.05},null,{"$f":"IFERROR((ROUNDUP((J15*$H$3),2)),\"\")","v":0.02},{"$f":"IFERROR((M15*F15),\"\")","v":0.1},null,"METRO"]
["Carottes",null,null,null,null,5,0.06,"kg",0.2,7.1999999999999995E-2,{"$f":"IFERROR((J16*F16),\"\")","v":0.36},null,0.15000000000000002,0.75000000000000011,null,"JOSA"]
["épice Thai 240g",null,null,null,null,5,2E-3,"kg",0,2E-3,{"$f":"IFERROR((J17*F17),\"\")","v":0.01},null,0.01,0.05,null,"METRO"]
["poulet en filet surgelé DAVIGEL",null,null,null,null,5,0.05,"kg",0,0.05,0.25,null,0.1,0.5,null,"DAVIGEL"]
["coriandre fraiche",null,null,null,null,5,2.5000000000000001E-2,"botte",0.2,3.0000000000000002E-2,{"$f":"IFERROR((J19*F19),\"\")","v":0.15000000000000002},null,0.06,0.3,null,"JOSA"]
[null,null,null,null,null,0,null,"","","","",null,"","",null,0]
[null,null,null,null,null,0,null,"","","","",null,"","",null,0]
[null,null,null,null,null,0,null,"","","","",null,"","",null,0]
[null,null,null,null,null,0,null,"","","","",null,"","",null,0]
[null,null,null,null,null,0,null,"","","","",null,"","",null,0]
[null,null,null,null,null,0,null,"","","","",null,"","",null,0]
[null,null,null,null,null,0,null,"","","","",null,"","",null,0]
[null,null,null,null,null,0,null,"","","","",null,"","",null,0]
[null,null,null,null,null,0,null,"","","","",null,"","",null,0]
[null,null,null,null,null,0,null,"","","","",null,"","",null,0]
[null,"Emballage out",null,null,"Qte","price","prix U","Emballage in",null,null,null,null,"Qte","price","prix U"]
[1,"#pack PASTA GRANDE ToGo",null,null,1,{"$f":"VLOOKUP(B31,PRIXE,2,0)","v":0.01},{"$f":"E31*F31","v":0.01},3,"#pack PASTA GRANDE Sp",null,null,null,1,{"$f":"VLOOKUP(I31,PRIXE,2,0)","v":0.01},{"$f":"M31*N31","v":0.01}]
[2,null,null,null,null,{"$f":"VLOOKUP(B32,PRIXE,2,0)","v":0},{"$f":"E32*F32","v":0},4,null,null,null,null,null,{"$f":"VLOOKUP(I32,PRIXE,2,0)","v":0},{"$f":"M32*N32","v":0}]
["Etape de la recette"]
[1,"Faire bouillir une grande quantité d'eau salée",null,null,null,null,11]
[2,"Cuire les pâtes 14 minutes",null,null,null,null,12]
[3,"Egouttez-les et les rincer à l'eau chaude ",null,null,null,null,13]
[4,"Ajoutez 1 cas d'huile d'olive",null,null,null,null,14]
[5,"Cuire les carottes avec des épices thaï au four à mico-ondes",null,null,null,null,15]
[6,"Coupez le poulet en cubes",null,null,null,null,16]
[7,"Assaisonnez d'épices pour poulet ",null,null,null,null,"CALORIES (kcal)",null,null,{"$f":"#REF!","v":{"$error":"#REF!"}},null,"POUR UNE PORTION"]
[8,"Garnir de coriandre(ou de persil)",null,null,null,null,"Protéines (g)",null,null,null,null,"Fibres (g)"]
[9,null,null,null,null,null,"Lipides (g)",null,null,null,null,"AGSaturés (g)"]
[10,null,null,null,null,null,"Glucides (g)"]
["Forme & Dimension : "]
[]
["Cuisson & dressage :"]
[]
["Liste des allergènes  :"]
[null,"GLUTEN",null,"GLUCOSE",null,null,"GRAINES",null,null,"CÉLERI",null,null,"CRUSTACÉS"]
[null,"LACTOSE / DAIRY",null,"ARACHIDE",null,null,"FRUITS À COQUE",null,null,"SULFITES",null,null,"POISSON"]
[null,"OEUF",null,"MOUTARDE",null,null,"SOJA",null,null,"PORC",null,null,"VIANDE"]
[]
[null,"COMMANDE",null,"pour",null,{"$f":"H3","v":2},{"$f":"CONCATENATE(A1, F1,G1)","v":"PASTA GRANDE  :  Fusilli Poulet"}]
[]
[null,"qte","unité","liste",null,null,null,null,"price",null,null,null,"Total"]
[null,{"$f":"M14","v":0.17},{"$f":"H14","v":"kg"},{"$f":"A14","v":"Pate fusilli"},null,null,null,null,{"$f":"F14","v":5},null,null,null,{"$f":"N14","v":0.85000000000000009}]
[null,0.02,"Litre",{"$f":"A15","v":"Huile d'olive"},null,null,null,null,{"$f":"F15","v":5},null,null,null,0.1]
[null,0.15000000000000002,"kg","Carottes",null,null,null,null,5,null,null,null,0.75000000000000011]
[null,0.01,"kg","épice Thai 240g",null,null,null,null,5,null,null,null,0.05]
[null,0.1,"kg","poulet en filet surgelé DAVIGEL",null,null,null,null,5,null,null,null,0.5]
[null,0.06,"botte","coriandre fraiche",null,null,null,null,5,null,null,null,0.3]
[null,"","",0,null,null,null,null,0,null,null,null,""]
[null,"","",0,null,null,null,null,0,null,null,null,""]
[null,"","",0,null,null,null,null,0,null,null,null,""]
[null,"","",0,null,null,null,null,0,null,null,null,""]
[null,"","",0,null,null,null,null,0,null,null,null,""]
[null,"","",0,null,null,null,null,0,null,null,null,""]
[null,"","",0,null,null,null,null,0,null,null,null,""]
[null,"","",0,null,null,null,null,0,null,null,null,""]
[null,"","",0,null,null,null,null,0,null,null,null,""]
[null,"","",{"$f":"B29","v":0},null,null,null,null,0,null,null,null,""]
[null,null,null,null,null,null,null,null,null,null,null,null,{"$f":"SUM(M56:M71)","v":2.5499999999999998}]

{"sheet":"02a PASTA poulet (moyen)","index":7,"n_rows":72,"n_cols":16,"rows_kept":72,"cut":false,"hidden":false,"merged":[[68,3,68,7],[68,8,68,9],[69,3,69,7],[69,8,69,9],[70,8,70,9],[71,12,71,13],[65,3,65,7],[65,8,65,9],[66,3,66,7],[66,8,66,9],[67,3,67,7],[67,8,67,9],[62,3,62,7],[62,8,62,9],[63,3,63,7],[63,8,63,9],[64,3,64,7],[64,8,64,9],[59,3,59,7],[59,8,59,9],[60,3,60,7],[60,8,60,9],[61,3,61,7],[61,8,61,9],[56,3,56,7],[56,8,56,9],[57,3,57,7],[57,8,57,9],[58,3,58,7],[58,8,58,9],[49,0,49,14],[50,0,50,14],[52,3,52,4],[52,6,52,14],[55,3,55,7],[55,8,55,9],[43,0,43,14],[44,0,44,14],[45,0,45,14],[46,0,46,14],[47,0,47,14],[48,0,48,14],[41,1,41,5],[41,6,41,8],[41,11,41,12],[42,1,42,5],[42,6,42,8],[42,11,42,12],[39,1,39,5],[39,6,39,8],[39,9,39,10],[39,11,39,14],[40,1,40,5],[40,6,40,8],[40,11,40,12],[36,1,36,5],[36,7,36,14],[37,1,37,5],[37,7,37,14],[38,1,38,5],[38,7,38,14],[33,1,33,5],[33,7,33,14],[34,1,34,5],[34,7,34,14],[35,1,35,5],[35,7,35,14],[30,1,30,3],[30,8,30,11],[31,1,31,3],[31,8,31,11],[27,0,27,3],[27,13,27,14],[28,0,28,3],[28,13,28,14],[29,1,29,3],[29,7,29,11],[24,0,24,3],[24,13,24,14],[25,0,25,3],[25,13,25,14],[26,0,26,3],[26,13,26,14],[21,0,21,3],[21,13,21,14],[22,0,22,3],[22,13,22,14],[23,0,23,3],[23,13,23,14],[18,0,18,3],[18,13,18,14],[19,0,19,3],[19,13,19,14],[20,0,20,3],[20,13,20,14],[11,1,11,4],[11,13,11,14],[15,0,15,3],[15,13,15,14],[16,0,16,3],[16,13,16,14],[17,0,17,3],[17,13,17,14],[12,3,12,4],[12,13,12,14],[13,0,13,3],[13,13,13,14],[14,0,14,3],[14,13,14,14],[7,10,8,10],[8,0,8,1],[10,0,10,1],[10,13,10,14],[6,0,6,1],[0,0,0,4],[0,6,0,12],[0,13,0,14],[2,4,2,6],[5,10,6,10]]}
["PASTA MEDIUM",null,null,null,null,"  :  ","Fusilli Poulet",null,null,null,null,null,null,"250g"]
[]
["RECETTE PREVUE POUR  : ",null,1,null,"Vous la dupliquez pour : ",null,null,2]
[]
["Prix de revient unitaire : ",null,{"$f":"K12","v":0.98499999999999999},null,null,"marge","coef","tva","ht",null,"ttc"]
[null,null,null,null,null,null,null,null,null,null,4.5]
["avec emballage : ",null,{"$f":"C5+C9","v":0.995},{"$f":"C5+C11","v":0.995},null,{"$f":"I7-C7","v":3.2502830188679246},{"$f":"I7/C7","v":4.2666160993647484},"ES 6",{"$f":"K6/1.06","v":4.2452830188679247},"ToGo"]
[null,null,null,null,null,null,null,null,null,null,4.5]
["Emballage ToGo :",null,{"$f":"G31+G32","v":0.01},{"$f":"C9/C7","v":1.0050251256281407E-2},null,{"$f":"I9-D7","v":3.0228571428571422},{"$f":"I9/D7","v":4.0380473797559215},"ES 12",{"$f":"K8/1.12","v":4.0178571428571423},"Sp"]
[]
["Emballage Sp  :",null,{"$f":"O31+O32","v":0.01},{"$f":"C11/D7","v":1.0050251256281407E-2},null,"Prix kg/l / unité","Poids brut recette","Unité","% perte","brut 1 part","Cout 1 part","prix de revient","brut à faire","prix de revient"]
[0,"Produits",null,null,null,"ht",null,null,null,null,{"$f":"SUM(K14:K29)","v":0.98499999999999999},{"$f":"K12*H3","v":1.97},null,{"$f":"SUM(N14:O29)","v":2.0499999999999998},null,"FOURNISSEUR"]
[]
["Pate fusilli",null,null,null,null,{"$f":"VLOOKUP(A14,PRIXINGRE,3,0)","v":5},0.06,{"$f":"IFERROR(VLOOKUP(A14,UNITINGRE,2,0),\"\")","v":"kg"},{"$f":"IFERROR(VLOOKUP(A14,UNITINGRE,10,0),\"\")","v":0},{"$f":"IFERROR((G14/$C$3)+(((G14/$C$3)*I14)),\"\")","v":0.06},{"$f":"IFERROR((J14*F14),\"\")","v":0.3},null,{"$f":"IFERROR((ROUNDUP((J14*$H$3),2)),\"\")","v":0.12},{"$f":"IFERROR((M14*F14),\"\")","v":0.6},null,{"$f":"VLOOKUP(A14,GDEBASE,8,0)","v":"METRO"}]
["Huile d'olive",null,null,null,null,{"$f":"VLOOKUP(A15,PRIXINGRE,3,0)","v":5},6.0000000000000001E-3,"Litre",0,6.0000000000000001E-3,{"$f":"IFERROR((J15*F15),\"\")","v":0.03},null,{"$f":"IFERROR((ROUNDUP((J15*$H$3),2)),\"\")","v":0.02},{"$f":"IFERROR((M15*F15),\"\")","v":0.1},null,"METRO"]
["Carottes",null,null,null,null,5,0.05,"kg",0.2,6.0000000000000005E-2,{"$f":"IFERROR((J16*F16),\"\")","v":0.30000000000000004},null,0.12,0.6,null,"JOSA"]
["épice Thai 240g",null,null,null,null,5,1E-3,"kg",0,1E-3,{"$f":"IFERROR((J17*F17),\"\")","v":5.0000000000000001E-3},null,0.01,0.05,null,"METRO"]
["poulet en filet surgelé DAVIGEL",null,null,null,null,5,0.04,"kg",0,0.04,0.2,null,0.08,0.4,null,"DAVIGEL"]
["Coriandre fraiche",null,null,null,null,5,2.5000000000000001E-2,"botte",0.2,3.0000000000000002E-2,{"$f":"IFERROR((J19*F19),\"\")","v":0.15000000000000002},null,0.06,0.3,null,"JOSA"]
[null,null,null,null,null,0,null,"","","","",null,"","",null,0]
[null,null,null,null,null,0,null,"","","","",null,"","",null,0]
[null,null,null,null,null,0,null,"","","","",null,"","",null,0]
[null,null,null,null,null,0,null,"","","","",null,"","",null,0]
[null,null,null,null,null,0,null,"","","","",null,"","",null,0]
[null,null,null,null,null,0,null,"","","","",null,"","",null,0]
[null,null,null,null,null,0,null,"","","","",null,"","",null,0]
[null,null,null,null,null,0,null,"","","","",null,"","",null,0]
[null,null,null,null,null,0,null,"","","","",null,"","",null,0]
[null,null,null,null,null,0,null,"","","","",null,"","",null,0]
[null,"Emballage ToGo",null,null,"Qte","price","prix U","Emballage in",null,null,null,null,"Qte","price","prix U"]
[1,"#pack PASTA MEDIUM ToGo",null,null,1,{"$f":"VLOOKUP(B31,PRIXE,2,0)","v":0.01},{"$f":"E31*F31","v":0.01},3,"#pack PASTA MEDIUM Sp",null,null,null,1,{"$f":"VLOOKUP(I31,PRIXE,2,0)","v":0.01},{"$f":"M31*N31","v":0.01}]
[2,null,null,null,1,{"$f":"VLOOKUP(B32,PRIXE,2,0)","v":0},{"$f":"E32*F32","v":0},4,null,null,null,null,1,{"$f":"VLOOKUP(I32,PRIXE,2,0)","v":0},{"$f":"M32*N32","v":0}]
["Etape de la recette"]
[1,"Faire bouillir une grande quantité d'eau salée",null,null,null,null,11]
[2,"Cuire les pâtes 14 minutes",null,null,null,null,12]
[3,"Egouttez-les et les rincer à l'eau chaude ",null,null,null,null,13]
[4,"Ajoutez 1 cas d'huile d'olive",null,null,null,null,14]
[5,"Cuire les carottes avec des épices thaï au four à mico-ondes",null,null,null,null,15]
[6,"Coupez le poulet en cubes",null,null,null,null,16]
[7,"Assaisonnez d'épices pour poulet ",null,null,null,null,"CALORIES (kcal)",null,null,{"$f":"#REF!","v":{"$error":"#REF!"}},null,"POUR UNE PORTION"]
[8,"Garnir de coriandre(ou de persil)",null,null,null,null,"Protéines (g)",null,null,null,{"$f":"J41*4","v":0},"Fibres (g)",null,null,{"$f":"N41*2","v":0}]
[9,null,null,null,null,null,"Lipides (g)",null,null,null,{"$f":"J42*9","v":0},"AGSaturés (g)"]
[10,null,null,null,null,null,"Glucides (g)",null,null,null,{"$f":"J43*4","v":0}]
["Forme & Dimension : "]
[]
["Cuisson & dressage :"]
[]
[]
[]
["Liste des allergènes  :"]
[]
[]
[null,"COMMANDE",null,"pour",null,{"$f":"H3","v":2},{"$f":"CONCATENATE(A1, F1,G1)","v":"PASTA MEDIUM  :  Fusilli Poulet"}]
[]
[null,"qte","unité","liste",null,null,null,null,"price",null,null,null,"Total"]
[null,{"$f":"M14","v":0.12},{"$f":"H14","v":"kg"},{"$f":"A14","v":"Pate fusilli"},null,null,null,null,{"$f":"F14","v":5},null,null,null,{"$f":"N14","v":0.6}]
[null,0.02,"Litre",{"$f":"A15","v":"Huile d'olive"},null,null,null,null,{"$f":"F15","v":5},null,null,null,0.1]
[null,0.12,"kg","Carottes",null,null,null,null,5,null,null,null,0.6]
[null,0.01,"kg","épice Thai 240g",null,null,null,null,5,null,null,null,0.05]
[null,0.08,"kg","poulet en filet surgelé DAVIGEL",null,null,null,null,5,null,null,null,0.4]
[null,0.06,"botte","Coriandre fraiche",null,null,null,null,5,null,null,null,0.3]
[null,"","",0,null,null,null,null,0,null,null,null,""]
[null,"","",0,null,null,null,null,0,null,null,null,""]
[null,"","",0,null,null,null,null,0,null,null,null,""]
[null,"","",0,null,null,null,null,0,null,null,null,""]
[null,"","",0,null,null,null,null,0,null,null,null,""]
[null,"","",0,null,null,null,null,0,null,null,null,""]
[null,"","",0,null,null,null,null,0,null,null,null,""]
[null,"","",0,null,null,null,null,0,null,null,null,""]
[null,"","",0,null,null,null,null,0,null,null,null,""]
[null,"","",{"$f":"B29","v":0},null,null,null,null,0,null,null,null,""]
[null,null,null,null,null,null,null,null,null,null,null,null,{"$f":"SUM(M56:M71)","v":2.0499999999999998}]

{"sheet":"02b PASTA mozza (grd)","index":8,"n_rows":72,"n_cols":16,"rows_kept":72,"cut":false,"hidden":false,"merged":[[70,8,70,9],[71,12,71,13],[67,3,67,7],[67,8,67,9],[68,3,68,7],[68,8,68,9],[69,3,69,7],[69,8,69,9],[64,3,64,7],[64,8,64,9],[65,3,65,7],[65,8,65,9],[66,3,66,7],[66,8,66,9],[61,3,61,7],[61,8,61,9],[62,3,62,7],[62,8,62,9],[63,3,63,7],[63,8,63,9],[58,3,58,7],[58,8,58,9],[59,3,59,7],[59,8,59,9],[60,3,60,7],[60,8,60,9],[55,3,55,7],[55,8,55,9],[56,3,56,7],[56,8,56,9],[57,3,57,7],[57,8,57,9],[46,0,46,14],[47,0,47,14],[48,0,48,14],[49,0,49,14],[50,0,50,14],[52,3,52,4],[52,6,52,14],[42,1,42,5],[42,6,42,8],[42,11,42,12],[43,0,43,14],[44,0,44,14],[45,0,45,14],[40,1,40,5],[40,6,40,8],[40,11,40,12],[41,1,41,5],[41,6,41,8],[41,11,41,12],[37,1,37,5],[37,7,37,14],[38,1,38,5],[38,7,38,14],[39,1,39,5],[39,6,39,8],[39,9,39,10],[39,11,39,14],[34,1,34,5],[34,7,34,14],[35,1,35,5],[35,7,35,14],[36,1,36,5],[36,7,36,14],[30,1,30,3],[30,8,30,11],[31,1,31,3],[31,8,31,11],[33,1,33,5],[33,7,33,14],[27,0,27,3],[27,13,27,14],[28,0,28,3],[28,13,28,14],[29,1,29,3],[29,7,29,11],[24,0,24,3],[24,13,24,14],[25,0,25,3],[25,13,25,14],[26,0,26,3],[26,13,26,14],[21,0,21,3],[21,13,21,14],[22,0,22,3],[22,13,22,14],[23,0,23,3],[23,13,23,14],[19,0,19,3],[19,13,19,14],[20,0,20,3],[20,13,20,14],[15,0,15,3],[15,13,15,14],[16,0,16,3],[16,13,16,14],[17,0,17,3],[17,13,17,14],[12,3,12,4],[12,13,12,14],[13,0,13,3],[13,13,13,14],[7,10,8,10],[10,0,10,1],[14,0,14,3],[14,13,14,14],[18,0,18,3],[18,13,18,14],[6,0,6,1],[0,0,0,4],[0,6,0,12],[0,13,0,14],[2,4,2,6],[5,10,6,10],[11,1,11,4],[11,13,11,14],[8,0,8,1],[10,13,10,14]]}
["PASTA GRANDE",null,null,null,null,"  :  ","Liguine Mozzarella",null,null,null,null,null,null,"330-340g"]
[]
["RECETTE PREVUE POUR  : ",null,1,null,"Vous la dupliquez pour : ",null,null,2]
[]
["Prix de revient unitaire : ",null,{"$f":"K12","v":3.4964000000000004},null,null,"marge","coef","tva","ht",null,"ttc"]
[null,null,null,null,null,null,null,null,null,null,5.8]
["avec emballage : ",null,{"$f":"C5+C9","v":3.5064000000000002},{"$f":"C5+C11","v":3.5064000000000002},null,{"$f":"I7-C7","v":1.9652981132075462},{"$f":"I7/C7","v":1.5604888527285952},"ES 6",{"$f":"K6/1.06","v":5.4716981132075464},"ToGo"]
[null,null,null,null,null,null,null,null,null,null,5.8]
["Emballage ToGo :",null,{"$f":"G31+G32","v":0.01},{"$f":"C9/C7","v":2.8519279032626055E-3},null,{"$f":"I9-D7","v":1.6721714285714278},{"$f":"I9/D7","v":1.4768912356181347},"ES 12",{"$f":"K8/1.12","v":5.1785714285714279},"Sp"]
[]
["Emballage Sp  :",null,{"$f":"O31+O32","v":0.01},{"$f":"C11/D7","v":2.8519279032626055E-3},null,"Prix kg/l / unité","Poids brut recette","Unité","% perte","brut 1 part","Cout 1 part","prix de revient","brut à faire","prix de revient"]
[0,"Produits",null,null,null,"ht",null,null,null,null,{"$f":"SUM(K14:K29)","v":3.4964000000000004},{"$f":"K12*H3","v":6.9928000000000008},null,{"$f":"SUM(N14:O29)","v":7.0500000000000007},null,"FOURNISSEUR"]
[]
["Pate linguini",null,null,null,null,{"$f":"VLOOKUP(A14,PRIXINGRE,3,0)","v":5},8.5000000000000006E-2,{"$f":"IFERROR(VLOOKUP(A14,UNITINGRE,2,0),\"\")","v":"kg"},{"$f":"IFERROR(VLOOKUP(A14,UNITINGRE,10,0),\"\")","v":0},{"$f":"IFERROR((G14/$C$3)+(((G14/$C$3)*I14)),\"\")","v":8.5000000000000006E-2},{"$f":"IFERROR((J14*F14),\"\")","v":0.42500000000000004},null,{"$f":"IFERROR((ROUNDUP((J14*$H$3),2)),\"\")","v":0.17},{"$f":"IFERROR((M14*F14),\"\")","v":0.85000000000000009},null,{"$f":"VLOOKUP(A14,GDEBASE,8,0)","v":"METRO"}]
["Pesto verde",null,null,null,null,5,2.5999999999999999E-2,"kg",0.03,2.6779999999999998E-2,{"$f":"IFERROR((J15*F15),\"\")","v":0.13389999999999999},null,{"$f":"IFERROR((ROUNDUP((J15*$H$3),2)),\"\")","v":6.0000000000000005E-2},{"$f":"IFERROR((M15*F15),\"\")","v":0.30000000000000004},null,"VT FOOD"]
["Mozzarella  galbani (pain de 1kg)",null,null,null,null,5,6.5000000000000002E-2,"kg",0,6.5000000000000002E-2,{"$f":"IFERROR((J16*F16),\"\")","v":0.32500000000000001},null,0.13,0.65,null,"LOBET"]
["Olives noires dénoyautées",null,null,null,null,5,1.4999999999999999E-2,"kg",0.5,2.2499999999999999E-2,{"$f":"IFERROR((J17*F17),\"\")","v":0.11249999999999999},null,0.05,0.25,null,"METRO"]
["Basilic frais (1 brin = 0,005)",null,null,null,null,5,0.5,"unité",0,0.5,2.5,null,1,5,null,"JOSA"]
[null,null,null,null,null,0,null,"","","",{"$f":"IFERROR((J19*F19),\"\")","v":""},null,"","",null,0]
[null,null,null,null,null,0,null,"","","","",null,"","",null,0]
[null,null,null,null,null,0,null,"","","","",null,"","",null,0]
[null,null,null,null,null,0,null,"","","","",null,"","",null,0]
[null,null,null,null,null,0,null,"","","","",null,"","",null,0]
[null,null,null,null,null,0,null,"","","","",null,"","",null,0]
[null,null,null,null,null,0,null,"","","","",null,"","",null,0]
[null,null,null,null,null,0,null,"","","","",null,"","",null,0]
[null,null,null,null,null,0,null,"","","","",null,"","",null,0]
[null,null,null,null,null,0,null,"","","","",null,"","",null,0]
[null,null,null,null,null,0,null,"","","","",null,"","",null,0]
[null,"Emballage out",null,null,"Qte","price","prix U","Emballage in",null,null,null,null,"Qte","price","prix U"]
[1,"#pack PASTA GRANDE ToGo",null,null,1,{"$f":"VLOOKUP(B31,PRIXE,2,0)","v":0.01},{"$f":"E31*F31","v":0.01},3,"#pack PASTA GRANDE Sp",null,null,null,1,{"$f":"VLOOKUP(I31,PRIXE,2,0)","v":0.01},{"$f":"M31*N31","v":0.01}]
[2,0,null,null,1,{"$f":"VLOOKUP(B32,PRIXE,2,0)","v":0},{"$f":"E32*F32","v":0},4,0,null,null,null,null,{"$f":"VLOOKUP(I32,PRIXE,2,0)","v":0},{"$f":"M32*N32","v":0}]
["Etape de la recette"]
[1,"Faire bouillir une grande quantité d'eau salée",null,null,null,null,11]
[2,"Cuire les pâtes",null,null,null,null,12]
[3,"Egouttez-les et les rincer à l'eau chaude",null,null,null,null,13]
[4,"Coupez la mozzarella en cubes ",null,null,null,null,14]
[5,"La mélanger dans un saladier avec 4 olives noires",null,null,null,null,15]
[6,"Ajoutez 1 càc d'huile d'olive",null,null,null,null,16]
[7,"Salez et poivrez",null,null,null,null,"Lipides (g)",null,null,{"$f":"K41+K42+K43+O41","v":0}]
[8,"Parsemez de basilic",null,null,null,null,"Protéines (g)",null,null,null,{"$f":"J41*4","v":0},"Fibres (g)",null,null,{"$f":"N41*2","v":0}]
[9,null,null,null,null,null,"Lipides (g)",null,null,null,{"$f":"J42*9","v":0},"AGSaturés (g)"]
[10,null,null,null,null,null,"Glucides (g)",null,null,null,{"$f":"J43*4","v":0}]
["Forme & Dimension : "]
[]
["Cuisson & dressage :"]
[]
[]
[]
["Liste des allergènes  :"]
[]
[]
[null,"COMMANDE",null,"pour",null,{"$f":"H3","v":2},{"$f":"CONCATENATE(A1, F1,G1)","v":"PASTA GRANDE  :  Liguine Mozzarella"}]
[]
[null,"qte","unité","liste",null,null,null,null,"price",null,null,null,"Total"]
[null,{"$f":"M14","v":0.17},{"$f":"H14","v":"kg"},{"$f":"A14","v":"Pate linguini"},null,null,null,null,{"$f":"F14","v":5},null,null,null,{"$f":"N14","v":0.85000000000000009}]
[null,6.0000000000000005E-2,"kg",{"$f":"A15","v":"Pesto verde"},null,null,null,null,{"$f":"F15","v":5},null,null,null,0.30000000000000004]
[null,0.13,"kg","Mozzarella  galbani (pain de 1kg)",null,null,null,null,5,null,null,null,0.65]
[null,0.05,"kg","Olives noires dénoyautées",null,null,null,null,5,null,null,null,0.25]
[null,1,"unité","Basilic frais (1 brin = 0,005)",null,null,null,null,5,null,null,null,5]
[null,"","",0,null,null,null,null,0,null,null,null,""]
[null,"","",0,null,null,null,null,0,null,null,null,""]
[null,"","",0,null,null,null,null,0,null,null,null,""]
[null,"","",0,null,null,null,null,0,null,null,null,""]
[null,"","",0,null,null,null,null,0,null,null,null,""]
[null,"","",0,null,null,null,null,0,null,null,null,""]
[null,"","",0,null,null,null,null,0,null,null,null,""]
[null,"","",0,null,null,null,null,0,null,null,null,""]
[null,"","",0,null,null,null,null,0,null,null,null,""]
[null,"","",0,null,null,null,null,0,null,null,null,""]
[null,"","",{"$f":"B29","v":0},null,null,null,null,0,null,null,null,""]
[null,null,null,null,null,null,null,null,null,null,null,null,{"$f":"SUM(M56:M71)","v":7.0500000000000007}]

{"sheet":"02b PASTA mozza (moyen)","index":9,"n_rows":72,"n_cols":16,"rows_kept":72,"cut":false,"hidden":false,"merged":[[70,8,70,9],[71,12,71,13],[67,3,67,7],[67,8,67,9],[68,3,68,7],[68,8,68,9],[69,3,69,7],[69,8,69,9],[64,3,64,7],[64,8,64,9],[65,3,65,7],[65,8,65,9],[66,3,66,7],[66,8,66,9],[61,3,61,7],[61,8,61,9],[62,3,62,7],[62,8,62,9],[63,3,63,7],[63,8,63,9],[58,3,58,7],[58,8,58,9],[59,3,59,7],[59,8,59,9],[60,3,60,7],[60,8,60,9],[55,3,55,7],[55,8,55,9],[56,3,56,7],[56,8,56,9],[57,3,57,7],[57,8,57,9],[46,0,46,14],[47,0,47,14],[48,0,48,14],[49,0,49,14],[50,0,50,14],[52,3,52,4],[52,6,52,14],[42,1,42,5],[42,6,42,8],[42,11,42,12],[43,0,43,14],[44,0,44,14],[45,0,45,14],[40,1,40,5],[40,6,40,8],[40,11,40,12],[41,1,41,5],[41,6,41,8],[41,11,41,12],[37,1,37,5],[37,7,37,14],[38,1,38,5],[38,7,38,14],[39,1,39,5],[39,6,39,8],[39,9,39,10],[39,11,39,14],[34,1,34,5],[34,7,34,14],[35,1,35,5],[35,7,35,14],[36,1,36,5],[36,7,36,14],[30,1,30,3],[30,8,30,11],[31,1,31,3],[31,8,31,11],[33,1,33,5],[33,7,33,14],[27,0,27,3],[27,13,27,14],[28,0,28,3],[28,13,28,14],[29,1,29,3],[29,7,29,11],[24,0,24,3],[24,13,24,14],[25,0,25,3],[25,13,25,14],[26,0,26,3],[26,13,26,14],[21,0,21,3],[21,13,21,14],[22,0,22,3],[22,13,22,14],[23,0,23,3],[23,13,23,14],[19,0,19,3],[19,13,19,14],[20,0,20,3],[20,13,20,14],[15,0,15,3],[15,13,15,14],[16,0,16,3],[16,13,16,14],[17,0,17,3],[17,13,17,14],[12,3,12,4],[12,13,12,14],[13,0,13,3],[13,13,13,14],[7,10,8,10],[10,0,10,1],[14,0,14,3],[14,13,14,14],[18,0,18,3],[18,13,18,14],[6,0,6,1],[0,0,0,4],[0,6,0,12],[0,13,0,14],[2,4,2,6],[5,10,6,10],[11,1,11,4],[11,13,11,14],[8,0,8,1],[10,13,10,14]]}
["PASTA MEDIUM",null,null,null,null,"  :  ","Liguine Mozzarella",null,null,null,null,null,null,"250g"]
[]
["RECETTE PREVUE POUR  : ",null,1,null,"Vous la dupliquez pour : ",null,null,2]
[]
["Prix de revient unitaire : ",null,{"$f":"K12","v":3.2073999999999998},null,null,"marge","coef","tva","ht",null,"ttc"]
[null,null,null,null,null,null,null,null,null,null,4.5]
["avec emballage : ",null,{"$f":"C5+C9","v":3.2173999999999996},{"$f":"C5+C11","v":3.2173999999999996},null,{"$f":"I7-C7","v":1.0278830188679251},{"$f":"I7/C7","v":1.3194762910635685},"ES 6",{"$f":"K6/1.06","v":4.2452830188679247},"ToGo"]
[null,null,null,null,null,null,null,null,null,null,4.5]
["Emballage ToGo :",null,{"$f":"G31+G32","v":0.01},{"$f":"C9/C7","v":3.108099707838628E-3},null,{"$f":"I9-D7","v":0.80045714285714276},{"$f":"I9/D7","v":1.2487900611851628},"ES 12",{"$f":"K8/1.12","v":4.0178571428571423},"Sp"]
[]
["Emballage Sp  :",null,{"$f":"O31+O32","v":0.01},{"$f":"C11/D7","v":3.108099707838628E-3},null,"Prix kg/l / unité","Poids brut recette","Unité","% perte","brut 1 part","Cout 1 part","prix de revient","brut à faire","prix de revient"]
[0,"Produits",null,null,null,"ht",null,null,null,null,{"$f":"SUM(K14:K29)","v":3.2073999999999998},{"$f":"K12*H3","v":6.4147999999999996},null,{"$f":"SUM(N14:O29)","v":6.45},null,"FOURNISSEUR"]
[]
["Pate linguini",null,null,null,null,{"$f":"VLOOKUP(A14,PRIXINGRE,3,0)","v":5},0.06,{"$f":"IFERROR(VLOOKUP(A14,UNITINGRE,2,0),\"\")","v":"kg"},{"$f":"IFERROR(VLOOKUP(A14,UNITINGRE,10,0),\"\")","v":0},{"$f":"IFERROR((G14/$C$3)+(((G14/$C$3)*I14)),\"\")","v":0.06},{"$f":"IFERROR((J14*F14),\"\")","v":0.3},null,{"$f":"IFERROR((ROUNDUP((J14*$H$3),2)),\"\")","v":0.12},{"$f":"IFERROR((M14*F14),\"\")","v":0.6},null,{"$f":"VLOOKUP(A14,GDEBASE,8,0)","v":"METRO"}]
["Pesto verde",null,null,null,null,5,1.6E-2,"kg",0.03,1.6480000000000002E-2,{"$f":"IFERROR((J15*F15),\"\")","v":8.2400000000000001E-2},null,{"$f":"IFERROR((ROUNDUP((J15*$H$3),2)),\"\")","v":0.04},{"$f":"IFERROR((M15*F15),\"\")","v":0.2},null,"VT FOOD"]
["Mozzarella  galbani (pain de 1kg)",null,null,null,null,5,0.05,"kg",0,0.05,{"$f":"IFERROR((J16*F16),\"\")","v":0.25},null,0.1,0.5,null,"LOBET"]
["Olives noires dénoyautées",null,null,null,null,5,0.01,"kg",0.5,1.4999999999999999E-2,{"$f":"IFERROR((J17*F17),\"\")","v":7.4999999999999997E-2},null,0.03,0.15,null,"METRO"]
["Basilic frais (1 brin = 0,005)",null,null,null,null,5,0.5,"unité",0,0.5,2.5,null,1,5,null,"JOSA"]
[null,null,null,null,null,0,null,"","","",{"$f":"IFERROR((J19*F19),\"\")","v":""},null,"","",null,0]
[null,null,null,null,null,0,null,"","","","",null,"","",null,0]
[null,null,null,null,null,0,null,"","","","",null,"","",null,0]
[null,null,null,null,null,0,null,"","","","",null,"","",null,0]
[null,null,null,null,null,0,null,"","","","",null,"","",null,0]
[null,null,null,null,null,0,null,"","","","",null,"","",null,0]
[null,null,null,null,null,0,null,"","","","",null,"","",null,0]
[null,null,null,null,null,0,null,"","","","",null,"","",null,0]
[null,null,null,null,null,0,null,"","","","",null,"","",null,0]
[null,null,null,null,null,0,null,"","","","",null,"","",null,0]
[null,null,null,null,null,0,null,"","","","",null,"","",null,0]
[null,"Emballage ToGo",null,null,"Qte","price","prix U","Emballage Sp",null,null,null,null,"Qte","price","prix U"]
[1,"#pack PASTA MEDIUM ToGo",null,null,1,{"$f":"VLOOKUP(B31,PRIXE,2,0)","v":0.01},{"$f":"E31*F31","v":0.01},3,"#pack PASTA MEDIUM Sp",null,null,null,1,{"$f":"VLOOKUP(I31,PRIXE,2,0)","v":0.01},{"$f":"M31*N31","v":0.01}]
[2,null,null,null,1,{"$f":"VLOOKUP(B32,PRIXE,2,0)","v":0},{"$f":"E32*F32","v":0},4,null,null,null,null,1,{"$f":"VLOOKUP(I32,PRIXE,2,0)","v":0},{"$f":"M32*N32","v":0}]
["Etape de la recette"]
[1,"Faire bouillir une grande quantité d'eau salée",null,null,null,null,11]
[2,"Cuire les pâtes",null,null,null,null,12]
[3,"Egouttez-les et les rincer à l'eau chaude",null,null,null,null,13]
[4,"Coupez la mozzarella en cubes ",null,null,null,null,14]
[5,"La mélanger dans un saladier avec 2 olives noires",null,null,null,null,15]
[6,"Ajoutez 1 càc d'huile d'olive",null,null,null,null,16]
[7,"Salez et poivrez",null,null,null,null,"Lipides (g)",null,null,{"$f":"K41+K42+K43+O41","v":0}]
[8,"Parsemez de basilic",null,null,null,null,"Protéines (g)",null,null,null,{"$f":"J41*4","v":0},"Fibres (g)",null,null,{"$f":"N41*2","v":0}]
[9,null,null,null,null,null,"Lipides (g)",null,null,null,{"$f":"J42*9","v":0},"AGSaturés (g)"]
[10,null,null,null,null,null,"Glucides (g)",null,null,null,{"$f":"J43*4","v":0}]
["Forme & Dimension : "]
[]
["Cuisson & dressage :"]
[]
[]
[]
["Liste des allergènes  :"]
[]
[]
[null,"COMMANDE",null,"pour",null,{"$f":"H3","v":2},{"$f":"CONCATENATE(A1, F1,G1)","v":"PASTA MEDIUM  :  Liguine Mozzarella"}]
[]
[null,"qte","unité","liste",null,null,null,null,"price",null,null,null,"Total"]
[null,{"$f":"M14","v":0.12},{"$f":"H14","v":"kg"},{"$f":"A14","v":"Pate linguini"},null,null,null,null,{"$f":"F14","v":5},null,null,null,{"$f":"N14","v":0.6}]
[null,0.04,"kg",{"$f":"A15","v":"Pesto verde"},null,null,null,null,{"$f":"F15","v":5},null,null,null,0.2]
[null,0.1,"kg","Mozzarella  galbani (pain de 1kg)",null,null,null,null,5,null,null,null,0.5]
[null,0.03,"kg","Olives noires dénoyautées",null,null,null,null,5,null,null,null,0.15]
[null,1,"unité","Basilic frais (1 brin = 0,005)",null,null,null,null,5,null,null,null,5]
[null,"","",0,null,null,null,null,0,null,null,null,""]
[null,"","",0,null,null,null,null,0,null,null,null,""]
[null,"","",0,null,null,null,null,0,null,null,null,""]
[null,"","",0,null,null,null,null,0,null,null,null,""]
[null,"","",0,null,null,null,null,0,null,null,null,""]
[null,"","",0,null,null,null,null,0,null,null,null,""]
[null,"","",0,null,null,null,null,0,null,null,null,""]
[null,"","",0,null,null,null,null,0,null,null,null,""]
[null,"","",0,null,null,null,null,0,null,null,null,""]
[null,"","",0,null,null,null,null,0,null,null,null,""]
[null,"","",{"$f":"B29","v":0},null,null,null,null,0,null,null,null,""]
[null,null,null,null,null,null,null,null,null,null,null,null,{"$f":"SUM(M56:M71)","v":6.45}]

{"sheet":"02c PASTA toscan (grd)","index":10,"n_rows":72,"n_cols":16,"rows_kept":72,"cut":false,"hidden":false,"merged":[[70,8,70,9],[71,12,71,13],[67,3,67,7],[67,8,67,9],[68,3,68,7],[68,8,68,9],[69,3,69,7],[69,8,69,9],[64,3,64,7],[64,8,64,9],[65,3,65,7],[65,8,65,9],[66,3,66,7],[66,8,66,9],[61,3,61,7],[61,8,61,9],[62,3,62,7],[62,8,62,9],[63,3,63,7],[63,8,63,9],[58,3,58,7],[58,8,58,9],[59,3,59,7],[59,8,59,9],[60,3,60,7],[60,8,60,9],[55,3,55,7],[55,8,55,9],[56,3,56,7],[56,8,56,9],[57,3,57,7],[57,8,57,9],[46,0,46,14],[47,0,47,14],[48,0,48,14],[49,0,49,14],[50,0,50,14],[52,3,52,4],[52,6,52,14],[42,1,42,5],[42,6,42,8],[42,11,42,12],[43,0,43,14],[44,0,44,14],[45,0,45,14],[40,1,40,5],[40,6,40,8],[40,11,40,12],[41,1,41,5],[41,6,41,8],[41,11,41,12],[37,1,37,5],[37,7,37,14],[38,1,38,5],[38,7,38,14],[39,1,39,5],[39,6,39,8],[39,9,39,10],[39,11,39,14],[34,1,34,5],[34,7,34,14],[35,1,35,5],[35,7,35,14],[36,1,36,5],[36,7,36,14],[30,1,30,3],[30,8,30,11],[31,1,31,3],[31,8,31,11],[33,1,33,5],[33,7,33,14],[27,0,27,3],[27,13,27,14],[28,0,28,3],[28,13,28,14],[29,1,29,3],[29,7,29,11],[24,0,24,3],[24,13,24,14],[25,0,25,3],[25,13,25,14],[26,0,26,3],[26,13,26,14],[21,0,21,3],[21,13,21,14],[22,0,22,3],[22,13,22,14],[23,0,23,3],[23,13,23,14],[19,0,19,3],[19,13,19,14],[20,0,20,3],[20,13,20,14],[15,0,15,3],[15,13,15,14],[16,0,16,3],[16,13,16,14],[17,0,17,3],[17,13,17,14],[12,3,12,4],[12,13,12,14],[13,0,13,3],[13,13,13,14],[7,10,8,10],[10,0,10,1],[14,0,14,3],[14,13,14,14],[18,0,18,3],[18,13,18,14],[6,0,6,1],[0,0,0,4],[0,6,0,12],[0,13,0,14],[2,4,2,6],[5,10,6,10],[11,1,11,4],[11,13,11,14],[8,0,8,1],[10,13,10,14]]}
["PASTA GRANDE",null,null,null,null,"  :  ","penne toscan",null,null,null,null,null,null,"330-340g"]
[]
["RECETTE PREVUE POUR  : ",null,1,null,"Vous la dupliquez pour : ",null,null,2]
[]
["Prix de revient unitaire : ",null,{"$f":"K12","v":6.2569999999999997},null,null,"marge","coef","tva","ht",null,"ttc"]
[null,null,null,null,null,null,null,null,null,null,5.8]
["avec emballage : ",null,{"$f":"C5+C9","v":6.2669999999999995},{"$f":"C5+C11","v":6.2669999999999995},null,{"$f":"I7-C7","v":-0.79530188679245306},{"$f":"I7/C7","v":0.87309687461425667},"ES 6",{"$f":"K6/1.06","v":5.4716981132075464},"ToGo"]
[null,null,null,null,null,null,null,null,null,null,5.8]
["Emballage ToGo :",null,{"$f":"G31+G32","v":0.01},{"$f":"C9/C7","v":1.595659805329504E-3},null,{"$f":"I9-D7","v":-1.0884285714285715},{"$f":"I9/D7","v":0.82632382775992153},"ES 12",{"$f":"K8/1.12","v":5.1785714285714279},"Sp"]
[]
["Emballage Sp  :",null,{"$f":"O31+O32","v":0.01},{"$f":"C11/D7","v":1.595659805329504E-3},null,"Prix kg/l / unité","Poids brut recette","Unité","% perte","brut 1 part","Cout 1 part","prix de revient","brut à faire","prix de revient"]
[0,"Produits",null,null,null,"ht",null,null,null,null,{"$f":"SUM(K14:K29)","v":6.2569999999999997},{"$f":"K12*H3","v":12.513999999999999},null,{"$f":"SUM(N14:O29)","v":12.6},null,"FOURNISSEUR"]
[]
["Pate penne",null,null,null,null,{"$f":"VLOOKUP(A14,PRIXINGRE,3,0)","v":5},0.15,{"$f":"IFERROR(VLOOKUP(A14,UNITINGRE,2,0),\"\")","v":"kg"},{"$f":"IFERROR(VLOOKUP(A14,UNITINGRE,10,0),\"\")","v":0},{"$f":"IFERROR((G14/$C$3)+(((G14/$C$3)*I14)),\"\")","v":0.15},{"$f":"IFERROR((J14*F14),\"\")","v":0.75},null,{"$f":"IFERROR((ROUNDUP((J14*$H$3),2)),\"\")","v":0.3},{"$f":"IFERROR((M14*F14),\"\")","v":1.5},null,{"$f":"VLOOKUP(A14,GDEBASE,8,0)","v":"METRO"}]
["Pesto rosso",null,null,null,null,5,0.03,"kg",0.03,3.09E-2,{"$f":"IFERROR((J15*F15),\"\")","v":0.1545},null,{"$f":"IFERROR((ROUNDUP((J15*$H$3),2)),\"\")","v":6.9999999999999993E-2},{"$f":"IFERROR((M15*F15),\"\")","v":0.35},null,"METRO"]
["Courgettes",null,null,null,null,5,2.5000000000000001E-2,"kg",0.1,2.7500000000000004E-2,{"$f":"IFERROR((J16*F16),\"\")","v":0.13750000000000001},null,6.0000000000000005E-2,0.30000000000000004,null,"JOSA"]
["Aubergines (pour info 1 auberg=400g)",null,null,null,null,5,2.5000000000000001E-2,"kg",0.2,3.0000000000000002E-2,{"$f":"IFERROR((J17*F17),\"\")","v":0.15000000000000002},null,0.06,0.3,null,"JOSA"]
["Tomates confites VT FOOD",null,null,null,null,5,0.01,"kg",0.3,1.3000000000000001E-2,6.5000000000000002E-2,null,0.03,0.15,null,"VT FOOD"]
["Basilic frais (1 brin = 0,005)",null,null,null,null,5,1,"unité",0,1,{"$f":"IFERROR((J19*F19),\"\")","v":5},null,2,10,null,"JOSA"]
[null,null,null,null,null,0,null,"","","","",null,"","",null,0]
[null,null,null,null,null,0,null,"","","","",null,"","",null,0]
[null,null,null,null,null,0,null,"","","","",null,"","",null,0]
[null,null,null,null,null,0,null,"","","","",null,"","",null,0]
[null,null,null,null,null,0,null,"","","","",null,"","",null,0]
[null,null,null,null,null,0,null,"","","","",null,"","",null,0]
[null,null,null,null,null,0,null,"","","","",null,"","",null,0]
[null,null,null,null,null,0,null,"","","","",null,"","",null,0]
[null,null,null,null,null,0,null,"","","","",null,"","",null,0]
[null,null,null,null,null,0,null,"","","","",null,"","",null,0]
[null,"Emballage out",null,null,"Qte","price","prix U","Emballage in",null,null,null,null,"Qte","price","prix U"]
[1,"#pack PASTA GRANDE ToGo",null,null,1,{"$f":"VLOOKUP(B31,PRIXE,2,0)","v":0.01},{"$f":"E31*F31","v":0.01},3,"#pack PASTA GRANDE Sp",null,null,null,1,{"$f":"VLOOKUP(I31,PRIXE,2,0)","v":0.01},{"$f":"M31*N31","v":0.01}]
[2,0,null,null,1,{"$f":"VLOOKUP(B32,PRIXE,2,0)","v":0},{"$f":"E32*F32","v":0},4,0,null,null,null,null,{"$f":"VLOOKUP(I32,PRIXE,2,0)","v":0},{"$f":"M32*N32","v":0}]
["Etape de la recette"]
[1,"Faire bouillir une grande quantité d'eau salée",null,null,null,null,11]
[2,"Cuire les pâtes",null,null,null,null,12]
[3,"Egouttez-les et  les rincer à l'eau chaude",null,null,null,null,13]
[4,"Ajoutez 1 càs rase de pesto rosso",null,null,null,null,14]
[5,"Coupez les courgettes et les aubergines cuites vapeur en tranches",null,null,null,null,15]
[6,"Ajoutez-les",null,null,null,null,16]
[7,"Garnir de 2 tomates confites ",null,null,null,null,"CALORIES (kcal)",null,null,{"$f":"K41+K42+K43+O41","v":0}]
[8,"Parsemez de basilic",null,null,null,null,"Protéines (g)",null,null,null,{"$f":"J41*4","v":0},"Fibres (g)",null,null,{"$f":"N41*2","v":0}]
[9,null,null,null,null,null,"Lipides (g)",null,null,null,{"$f":"J42*9","v":0},"AGSaturés (g)"]
[10,null,null,null,null,null,"Glucides (g)",null,null,null,{"$f":"J43*4","v":0}]
["Forme & Dimension : "]
[]
["Cuisson & dressage :"]
[]
[]
[]
["Liste des allergènes  :"]
[]
[]
[null,"COMMANDE",null,"pour",null,{"$f":"H3","v":2},{"$f":"CONCATENATE(A1, F1,G1)","v":"PASTA GRANDE  :  penne toscan"}]
[]
[null,"qte","unité","liste",null,null,null,null,"price",null,null,null,"Total"]
[null,{"$f":"M14","v":0.3},{"$f":"H14","v":"kg"},{"$f":"A14","v":"Pate penne"},null,null,null,null,{"$f":"F14","v":5},null,null,null,{"$f":"N14","v":1.5}]
[null,6.9999999999999993E-2,"kg",{"$f":"A15","v":"Pesto rosso"},null,null,null,null,{"$f":"F15","v":5},null,null,null,0.35]
[null,6.0000000000000005E-2,"kg","Courgettes",null,null,null,null,5,null,null,null,0.30000000000000004]
[null,0.06,"kg","Aubergines (pour info 1 auberg=400g)",null,null,null,null,5,null,null,null,0.3]
[null,0.03,"kg","Tomates confites VT FOOD",null,null,null,null,5,null,null,null,0.15]
[null,2,"unité","Basilic frais (1 brin = 0,005)",null,null,null,null,5,null,null,null,10]
[null,"","",0,null,null,null,null,0,null,null,null,""]
[null,"","",0,null,null,null,null,0,null,null,null,""]
[null,"","",0,null,null,null,null,0,null,null,null,""]
[null,"","",0,null,null,null,null,0,null,null,null,""]
[null,"","",0,null,null,null,null,0,null,null,null,""]
[null,"","",0,null,null,null,null,0,null,null,null,""]
[null,"","",0,null,null,null,null,0,null,null,null,""]
[null,"","",0,null,null,null,null,0,null,null,null,""]
[null,"","",0,null,null,null,null,0,null,null,null,""]
[null,"","",{"$f":"B29","v":0},null,null,null,null,0,null,null,null,""]
[null,null,null,null,null,null,null,null,null,null,null,null,{"$f":"SUM(M56:M71)","v":12.6}]

{"sheet":"02c PASTA toscan (moyen)","index":11,"n_rows":72,"n_cols":16,"rows_kept":72,"cut":false,"hidden":false,"merged":[[70,8,70,9],[71,12,71,13],[67,3,67,7],[67,8,67,9],[68,3,68,7],[68,8,68,9],[69,3,69,7],[69,8,69,9],[64,3,64,7],[64,8,64,9],[65,3,65,7],[65,8,65,9],[66,3,66,7],[66,8,66,9],[61,3,61,7],[61,8,61,9],[62,3,62,7],[62,8,62,9],[63,3,63,7],[63,8,63,9],[58,3,58,7],[58,8,58,9],[59,3,59,7],[59,8,59,9],[60,3,60,7],[60,8,60,9],[55,3,55,7],[55,8,55,9],[56,3,56,7],[56,8,56,9],[57,3,57,7],[57,8,57,9],[46,0,46,14],[47,0,47,14],[48,0,48,14],[49,0,49,14],[50,0,50,14],[52,3,52,4],[52,6,52,14],[42,1,42,5],[42,6,42,8],[42,11,42,12],[43,0,43,14],[44,0,44,14],[45,0,45,14],[40,1,40,5],[40,6,40,8],[40,11,40,12],[41,1,41,5],[41,6,41,8],[41,11,41,12],[37,1,37,5],[37,7,37,14],[38,1,38,5],[38,7,38,14],[39,1,39,5],[39,6,39,8],[39,9,39,10],[39,11,39,14],[34,1,34,5],[34,7,34,14],[35,1,35,5],[35,7,35,14],[36,1,36,5],[36,7,36,14],[30,1,30,3],[30,8,30,11],[31,1,31,3],[31,8,31,11],[33,1,33,5],[33,7,33,14],[27,0,27,3],[27,13,27,14],[28,0,28,3],[28,13,28,14],[29,1,29,3],[29,7,29,11],[24,0,24,3],[24,13,24,14],[25,0,25,3],[25,13,25,14],[26,0,26,3],[26,13,26,14],[21,0,21,3],[21,13,21,14],[22,0,22,3],[22,13,22,14],[23,0,23,3],[23,13,23,14],[19,0,19,3],[19,13,19,14],[20,0,20,3],[20,13,20,14],[15,0,15,3],[15,13,15,14],[16,0,16,3],[16,13,16,14],[17,0,17,3],[17,13,17,14],[12,3,12,4],[12,13,12,14],[13,0,13,3],[13,13,13,14],[7,10,8,10],[10,0,10,1],[14,0,14,3],[14,13,14,14],[18,0,18,3],[18,13,18,14],[6,0,6,1],[0,0,0,4],[0,6,0,12],[0,13,0,14],[2,4,2,6],[5,10,6,10],[11,1,11,4],[11,13,11,14],[8,0,8,1],[10,13,10,14]]}
["PASTA MEDIUM",null,null,null,null,"  :  ","penne toscan",null,null,null,null,null,null,"250g"]
[]
["RECETTE PREVUE POUR  : ",null,1,null,"Vous la dupliquez pour : ",null,null,2]
[]
["Prix de revient unitaire : ",null,{"$f":"K12","v":5.8622500000000004},null,null,"marge","coef","tva","ht",null,"ttc"]
[null,null,null,null,null,null,null,null,null,null,4.5]
["avec emballage : ",null,{"$f":"C5+C9","v":5.8722500000000002},{"$f":"C5+C11","v":5.8722500000000002},null,{"$f":"I7-C7","v":-1.6269669811320755},{"$f":"I7/C7","v":0.72293976224921019},"ES 6",{"$f":"K6/1.06","v":4.2452830188679247},"ToGo"]
[null,null,null,null,null,null,null,null,null,null,4.5]
["Emballage ToGo :",null,{"$f":"G31+G32","v":0.01},{"$f":"C9/C7","v":1.7029247732981395E-3},null,{"$f":"I9-D7","v":-1.8543928571428578},{"$f":"I9/D7","v":0.68421084641443097},"ES 12",{"$f":"K8/1.12","v":4.0178571428571423},"Sp"]
[]
["Emballage Sp  :",null,{"$f":"O31+O32","v":0.01},{"$f":"C11/D7","v":1.7029247732981395E-3},null,"Prix kg/l / unité","Poids brut recette","Unité","% perte","brut 1 part","Cout 1 part","prix de revient","brut à faire","prix de revient"]
[0,"Produits",null,null,null,"ht",null,null,null,null,{"$f":"SUM(K14:K29)","v":5.8622500000000004},{"$f":"K12*H3","v":11.724500000000001},null,{"$f":"SUM(N14:O29)","v":11.85},null,"FOURNISSEUR"]
[]
["Pate penne",null,null,null,null,{"$f":"VLOOKUP(A14,PRIXINGRE,3,0)","v":5},8.5000000000000006E-2,{"$f":"IFERROR(VLOOKUP(A14,UNITINGRE,2,0),\"\")","v":"kg"},{"$f":"IFERROR(VLOOKUP(A14,UNITINGRE,10,0),\"\")","v":0},{"$f":"IFERROR((G14/$C$3)+(((G14/$C$3)*I14)),\"\")","v":8.5000000000000006E-2},{"$f":"IFERROR((J14*F14),\"\")","v":0.42500000000000004},null,{"$f":"IFERROR((ROUNDUP((J14*$H$3),2)),\"\")","v":0.17},{"$f":"IFERROR((M14*F14),\"\")","v":0.85000000000000009},null,{"$f":"VLOOKUP(A14,GDEBASE,8,0)","v":"METRO"}]
["Pesto rosso",null,null,null,null,5,1.4999999999999999E-2,"kg",0.03,1.545E-2,{"$f":"IFERROR((J15*F15),\"\")","v":7.7249999999999999E-2},null,{"$f":"IFERROR((ROUNDUP((J15*$H$3),2)),\"\")","v":0.04},{"$f":"IFERROR((M15*F15),\"\")","v":0.2},null,"METRO"]
["Courgettes",null,null,null,null,5,0.02,"kg",0.1,2.1999999999999999E-2,{"$f":"IFERROR((J16*F16),\"\")","v":0.10999999999999999},null,0.05,0.25,null,"JOSA"]
["Aubergines (pour info 1 auberg=400g)",null,null,null,null,5,0.02,"kg",0.2,2.4E-2,{"$f":"IFERROR((J17*F17),\"\")","v":0.12},null,0.05,0.25,null,"JOSA"]
["Tomates confites VT FOOD",null,null,null,null,5,0.02,"kg",0.3,2.6000000000000002E-2,0.13,null,6.0000000000000005E-2,0.30000000000000004,null,"VT FOOD"]
["Basilic frais (1 brin = 0,005)",null,null,null,null,5,1,"unité",0,1,{"$f":"IFERROR((J19*F19),\"\")","v":5},null,2,10,null,"JOSA"]
[null,null,null,null,null,0,null,"","","","",null,"","",null,0]
[null,null,null,null,null,0,null,"","","","",null,"","",null,0]
[null,null,null,null,null,0,null,"","","","",null,"","",null,0]
[null,null,null,null,null,0,null,"","","","",null,"","",null,0]
[null,null,null,null,null,0,null,"","","","",null,"","",null,0]
[null,null,null,null,null,0,null,"","","","",null,"","",null,0]
[null,null,null,null,null,0,null,"","","","",null,"","",null,0]
[null,null,null,null,null,0,null,"","","","",null,"","",null,0]
[null,null,null,null,null,0,null,"","","","",null,"","",null,0]
[null,null,null,null,null,0,null,"","","","",null,"","",null,0]
[null,"Emballage ToGo",null,null,"Qte","price","prix U","Emballage Sp",null,null,null,null,"Qte","price","prix U"]
[1,"#pack PASTA MEDIUM ToGo",null,null,1,{"$f":"VLOOKUP(B31,PRIXE,2,0)","v":0.01},{"$f":"E31*F31","v":0.01},3,"#pack PASTA MEDIUM Sp",null,null,null,1,{"$f":"VLOOKUP(I31,PRIXE,2,0)","v":0.01},{"$f":"M31*N31","v":0.01}]
[2,null,null,null,1,{"$f":"VLOOKUP(B32,PRIXE,2,0)","v":0},{"$f":"E32*F32","v":0},4,null,null,null,null,1,{"$f":"VLOOKUP(I32,PRIXE,2,0)","v":0},{"$f":"M32*N32","v":0}]
["Etape de la recette"]
[1,"Faire bouillir une grande quantité d'eau salée",null,null,null,null,11]
[2,"Cuire les pâtes",null,null,null,null,12]
[3,"Egouttez-les et  le srincer à l'eau chaude",null,null,null,null,13]
[4,"Ajoutez 1/2 càs rase de pesto rosso",null,null,null,null,14]
[5,"Coupez les courgettes et les aubergines cuites vapeur en tranches",null,null,null,null,15]
[6,"Ajoutez-les",null,null,null,null,16]
[7,"Garnir de 2 tomates confites ",null,null,null,null,"CALORIES (kcal)",null,null,{"$f":"K41+K42+K43+O41","v":0}]
[8,"Parsemez de basilic",null,null,null,null,"Protéines (g)",null,null,null,{"$f":"J41*4","v":0},"Fibres (g)",null,null,{"$f":"N41*2","v":0}]
[9,null,null,null,null,null,"Lipides (g)",null,null,null,{"$f":"J42*9","v":0},"AGSaturés (g)"]
[10,null,null,null,null,null,"Glucides (g)",null,null,null,{"$f":"J43*4","v":0}]
["Forme & Dimension : "]
[]
["Cuisson & dressage :"]
[]
[]
[]
["Liste des allergènes  :"]
[]
[]
[null,"COMMANDE",null,"pour",null,{"$f":"H3","v":2},{"$f":"CONCATENATE(A1, F1,G1)","v":"PASTA MEDIUM  :  penne toscan"}]
[]
[null,"qte","unité","liste",null,null,null,null,"price",null,null,null,"Total"]
[null,{"$f":"M14","v":0.17},{"$f":"H14","v":"kg"},{"$f":"A14","v":"Pate penne"},null,null,null,null,{"$f":"F14","v":5},null,null,null,{"$f":"N14","v":0.85000000000000009}]
[null,0.04,"kg",{"$f":"A15","v":"Pesto rosso"},null,null,null,null,{"$f":"F15","v":5},null,null,null,0.2]
[null,0.05,"kg","Courgettes",null,null,null,null,5,null,null,null,0.25]
[null,0.05,"kg","Aubergines (pour info 1 auberg=400g)",null,null,null,null,5,null,null,null,0.25]
[null,6.0000000000000005E-2,"kg","Tomates confites VT FOOD",null,null,null,null,5,null,null,null,0.30000000000000004]
[null,2,"unité","Basilic frais (1 brin = 0,005)",null,null,null,null,5,null,null,null,10]
[null,"","",0,null,null,null,null,0,null,null,null,""]
[null,"","",0,null,null,null,null,0,null,null,null,""]
[null,"","",0,null,null,null,null,0,null,null,null,""]
[null,"","",0,null,null,null,null,0,null,null,null,""]
[null,"","",0,null,null,null,null,0,null,null,null,""]
[null,"","",0,null,null,null,null,0,null,null,null,""]
[null,"","",0,null,null,null,null,0,null,null,null,""]
[null,"","",0,null,null,null,null,0,null,null,null,""]
[null,"","",0,null,null,null,null,0,null,null,null,""]
[null,"","",{"$f":"B29","v":0},null,null,null,null,0,null,null,null,""]
[null,null,null,null,null,null,null,null,null,null,null,null,{"$f":"SUM(M56:M71)","v":11.85}]

{"sheet":"03 MINI TOMATE","index":12,"n_rows":72,"n_cols":16,"rows_kept":72,"cut":false,"hidden":false,"merged":[[70,8,70,9],[71,12,71,13],[67,3,67,7],[67,8,67,9],[68,3,68,7],[68,8,68,9],[69,3,69,7],[69,8,69,9],[64,3,64,7],[64,8,64,9],[65,3,65,7],[65,8,65,9],[66,3,66,7],[66,8,66,9],[61,3,61,7],[61,8,61,9],[62,3,62,7],[62,8,62,9],[63,3,63,7],[63,8,63,9],[58,3,58,7],[58,8,58,9],[59,3,59,7],[59,8,59,9],[60,3,60,7],[60,8,60,9],[55,3,55,7],[55,8,55,9],[56,3,56,7],[56,8,56,9],[57,3,57,7],[57,8,57,9],[46,0,46,14],[47,0,47,14],[48,0,48,14],[49,0,49,14],[50,0,50,14],[52,3,52,4],[52,6,52,14],[42,1,42,5],[42,6,42,8],[42,11,42,12],[43,0,43,14],[44,0,44,14],[45,0,45,14],[40,1,40,5],[40,6,40,8],[40,11,40,12],[41,1,41,5],[41,6,41,8],[41,11,41,12],[37,1,37,5],[37,7,37,14],[38,1,38,5],[38,7,38,14],[39,1,39,5],[39,6,39,8],[39,9,39,10],[39,11,39,14],[34,1,34,5],[34,7,34,14],[35,1,35,5],[35,7,35,14],[36,1,36,5],[36,7,36,14],[30,1,30,3],[30,8,30,11],[31,1,31,3],[31,8,31,11],[33,1,33,5],[33,7,33,14],[27,0,27,3],[27,13,27,14],[28,0,28,3],[28,13,28,14],[29,1,29,3],[29,7,29,11],[24,0,24,3],[24,13,24,14],[25,0,25,3],[25,13,25,14],[26,0,26,3],[26,13,26,14],[21,0,21,3],[21,13,21,14],[22,0,22,3],[22,13,22,14],[23,0,23,3],[23,13,23,14],[19,0,19,3],[19,13,19,14],[20,0,20,3],[20,13,20,14],[15,0,15,3],[15,13,15,14],[16,0,16,3],[16,13,16,14],[17,0,17,3],[17,13,17,14],[14,0,14,3],[14,13,14,14],[7,10,8,10],[8,0,8,1],[10,0,10,1],[10,13,10,14],[11,1,11,4],[11,13,11,14],[18,0,18,3],[18,13,18,14],[0,0,0,4],[0,6,0,12],[0,13,0,14],[2,4,2,6],[5,10,6,10],[6,0,6,1],[12,3,12,4],[12,13,12,14],[13,0,13,3],[13,13,13,14]]}
["Salade",null,null,null,null,"  :  ","MINI TOMATE",null,null,null,null,null,null,"150 grs"]
[]
["RECETTE PREVUE POUR  : ",null,1,null,"Vous la dupliquez pour : ",null,null,2]
[]
["Prix de revient unitaire : ",null,{"$f":"K12","v":0.5},null,null,"marge","coef","tva","ht",null,"ttc"]
[null,null,null,null,null,null,null,null,null,null,3.2]
["avec emballage : ",null,{"$f":"C5+C9","v":0.51},{"$f":"C5+C11","v":0.51},null,{"$f":"I7-C7","v":2.5088679245283023},{"$f":"I7/C7","v":5.9193488716241216},"ES 6",{"$f":"K6/1.06","v":3.0188679245283021},"ToGo"]
[null,null,null,null,null,null,null,null,null,null,3.2]
["Emballage ToGo :",null,{"$f":"G31+G32","v":0.01},{"$f":"C9/C7","v":1.9607843137254902E-2},null,{"$f":"I9-D7","v":2.347142857142857},{"$f":"I9/D7","v":5.6022408963585431},"ES 12",{"$f":"K8/1.12","v":2.8571428571428572},"Sp"]
[]
["Emballage Sp  :",null,{"$f":"O31+O32","v":0.01},{"$f":"C11/D7","v":1.9607843137254902E-2},null,"Prix kg/l / unité","Poids brut recette","Unité","% perte","brut 1 part","Cout 1 part","prix de revient","brut à faire","prix de revient"]
[0,"Produits",null,null,null,"ht",null,null,null,null,{"$f":"SUM(K14:K29)","v":0.5},{"$f":"K12*H3","v":1},null,{"$f":"SUM(N14:O29)","v":1},null,"FOURNISSEUR"]
[]
["Tomates mini assortiments",null,null,null,null,{"$f":"VLOOKUP(A14,PRIXINGRE,3,0)","v":5},0.13,{"$f":"IFERROR(VLOOKUP(A14,UNITINGRE,2,0),\"\")","v":"kg"},{"$f":"IFERROR(VLOOKUP(A14,UNITINGRE,10,0),\"\")","v":""},{"$f":"IFERROR((G14/$C$3)+(((G14/$C$3)*I14)),\"\")","v":""},{"$f":"IFERROR((J14*F14),\"\")","v":""},null,{"$f":"IFERROR((ROUNDUP((J14*$H$3),2)),\"\")","v":""},{"$f":"IFERROR((M14*F14),\"\")","v":""},null,{"$f":"VLOOKUP(A14,GDEBASE,8,0)","v":"METRO"}]
["Basilic frais (1bte = 0,040)",null,null,null,null,5,0.1,"Botte",0,0.1,{"$f":"IFERROR((J15*F15),\"\")","v":0.5},null,{"$f":"IFERROR((ROUNDUP((J15*$H$3),2)),\"\")","v":0.2},{"$f":"IFERROR((M15*F15),\"\")","v":1},null,"JOSA"]
[null,null,null,null,null,0,null,"","","",{"$f":"IFERROR((J16*F16),\"\")","v":""},null,"","",null,0]
[null,null,null,null,null,0,null,"","","",{"$f":"IFERROR((J17*F17),\"\")","v":""},null,"","",null,0]
[null,null,null,null,null,0,null,"","","","",null,"","",null,0]
[null,null,null,null,null,0,null,"","","",{"$f":"IFERROR((J19*F19),\"\")","v":""},null,"","",null,0]
[null,null,null,null,null,0,null,"","","","",null,"","",null,0]
[null,null,null,null,null,0,null,"","","","",null,"","",null,0]
[null,null,null,null,null,0,null,"","","","",null,"","",null,0]
[null,null,null,null,null,0,null,"","","","",null,"","",null,0]
[null,null,null,null,null,0,null,"","","","",null,"","",null,0]
[null,null,null,null,null,0,null,"","","","",null,"","",null,0]
[null,null,null,null,null,0,null,"","","","",null,"","",null,0]
[null,null,null,null,null,0,null,"","","","",null,"","",null,0]
[null,null,null,null,null,0,null,"","","","",null,"","",null,0]
[null,null,null,null,null,0,null,"","","","",null,"","",null,0]
[null,"Emballage ToGo",null,null,"Qte","price","prix U","Emballage",null,null,null,null,"Qte","price","prix U"]
[1,"#pack YAOURT",null,null,1,{"$f":"VLOOKUP(B31,PRIXE,2,0)","v":0.01},{"$f":"E31*F31","v":0.01},3,"#pack YAOURT",null,null,null,1,{"$f":"VLOOKUP(I31,PRIXE,2,0)","v":0.01},{"$f":"M31*N31","v":0.01}]
[2,null,null,null,1,{"$f":"VLOOKUP(B32,PRIXE,2,0)","v":0},{"$f":"E32*F32","v":0},4,null,null,null,null,1,{"$f":"VLOOKUP(I32,PRIXE,2,0)","v":0},{"$f":"M32*N32","v":0}]
["Etape de la recette"]
[1,"Bien remplir le saladier d'un mélange d'iceberg et de trévise",null,null,null,null,11]
[2,"Ajoutez le mélange fêta",null,null,null,null,12]
[3,"Coupez 5 tranches de concombre",null,null,null,null,13]
[4,"Ajoutez 5 tomates cerises",null,null,null,null,14]
[5,"Râper la courgette et ajoutez-la",null,null,null,null,15]
[6,null,null,null,null,null,16]
[7,null,null,null,null,null,"CALORIES (kcal)"]
[8,null,null,null,null,null,"Protéines (g)",null,null,null,{"$f":"J41*4","v":0},"Fibres (g)",null,null,{"$f":"N41*2","v":0}]
[9,null,null,null,null,null,"Lipides (g)",null,null,null,{"$f":"J42*9","v":0},"AGSaturés (g)"]
[10,null,null,null,null,null,"Glucides (g)",null,null,null,{"$f":"J43*4","v":0}]
["Forme & Dimension : "]
[]
["Cuisson & dressage :"]
[]
[]
[]
["Liste des allergènes  :"]
[]
[]
[null,"COMMANDE",null,"pour",null,{"$f":"H3","v":2},{"$f":"CONCATENATE(A1, F1,G1)","v":"Salade  :  MINI TOMATE"}]
[]
[null,"qte","unité","liste",null,null,null,null,"price",null,null,null,"Total"]
[null,{"$f":"M14","v":""},{"$f":"H14","v":"kg"},{"$f":"A14","v":"Tomates mini assortiments"},null,null,null,null,{"$f":"F14","v":5},null,null,null,{"$f":"N14","v":""}]
[null,0.2,"Botte",{"$f":"A15","v":"Basilic frais (1bte = 0,040)"},null,null,null,null,{"$f":"F15","v":5},null,null,null,1]
[null,"","",0,null,null,null,null,0,null,null,null,""]
[null,"","",0,null,null,null,null,0,null,null,null,""]
[null,"","",0,null,null,null,null,0,null,null,null,""]
[null,"","",0,null,null,null,null,0,null,null,null,""]
[null,"","",0,null,null,null,null,0,null,null,null,""]
[null,"","",0,null,null,null,null,0,null,null,null,""]
[null,"","",0,null,null,null,null,0,null,null,null,""]
[null,"","",0,null,null,null,null,0,null,null,null,""]
[null,"","",0,null,null,null,null,0,null,null,null,""]
[null,"","",0,null,null,null,null,0,null,null,null,""]
[null,"","",0,null,null,null,null,0,null,null,null,""]
[null,"","",0,null,null,null,null,0,null,null,null,""]
[null,"","",0,null,null,null,null,0,null,null,null,""]
[null,"","",{"$f":"B29","v":0},null,null,null,null,0,null,null,null,""]
[null,null,null,null,null,null,null,null,null,null,null,null,{"$f":"SUM(M56:M71)","v":1}]

{"sheet":"03 SALADE ice caesar","index":13,"n_rows":72,"n_cols":16,"rows_kept":72,"cut":false,"hidden":false,"merged":[[70,8,70,9],[71,12,71,13],[67,3,67,7],[67,8,67,9],[68,3,68,7],[68,8,68,9],[69,3,69,7],[69,8,69,9],[64,3,64,7],[64,8,64,9],[65,3,65,7],[65,8,65,9],[66,3,66,7],[66,8,66,9],[61,3,61,7],[61,8,61,9],[62,3,62,7],[62,8,62,9],[63,3,63,7],[63,8,63,9],[58,3,58,7],[58,8,58,9],[59,3,59,7],[59,8,59,9],[60,3,60,7],[60,8,60,9],[55,3,55,7],[55,8,55,9],[56,3,56,7],[56,8,56,9],[57,3,57,7],[57,8,57,9],[46,0,46,14],[47,0,47,14],[48,0,48,14],[49,0,49,14],[50,0,50,14],[52,3,52,4],[52,6,52,14],[42,1,42,5],[42,6,42,8],[42,11,42,12],[43,0,43,14],[44,0,44,14],[45,0,45,14],[40,1,40,5],[40,6,40,8],[40,11,40,12],[41,1,41,5],[41,6,41,8],[41,11,41,12],[37,1,37,5],[37,7,37,14],[38,1,38,5],[38,7,38,14],[39,1,39,5],[39,6,39,8],[39,9,39,10],[39,11,39,14],[34,1,34,5],[34,7,34,14],[35,1,35,5],[35,7,35,14],[36,1,36,5],[36,7,36,14],[31,1,31,3],[31,8,31,11],[33,1,33,5],[33,7,33,14],[28,0,28,3],[28,13,28,14],[29,1,29,3],[29,7,29,11],[30,1,30,3],[30,8,30,11],[25,0,25,3],[25,13,25,14],[26,0,26,3],[26,13,26,14],[27,0,27,3],[27,13,27,14],[22,0,22,3],[22,13,22,14],[23,0,23,3],[23,13,23,14],[24,0,24,3],[24,13,24,14],[19,0,19,3],[19,13,19,14],[20,0,20,3],[20,13,20,14],[21,0,21,3],[21,13,21,14],[16,0,16,3],[16,13,16,14],[17,0,17,3],[17,13,17,14],[18,0,18,3],[18,13,18,14],[15,0,15,3],[15,13,15,14],[8,0,8,1],[10,13,10,14],[11,1,11,4],[11,13,11,14],[12,3,12,4],[12,13,12,14],[7,10,8,10],[10,0,10,1],[6,0,6,1],[0,0,0,4],[0,6,0,12],[0,13,0,14],[2,4,2,6],[5,10,6,10],[13,0,13,3],[13,13,13,14],[14,0,14,3],[14,13,14,14]]}
["Salade",null,null,null,null,"  :  ","Iceberg poulet",null,null,null,null,null,null,"150 grs"]
[]
["RECETTE PREVUE POUR  : ",null,1,null,"Vous la dupliquez pour : ",null,null,2]
[]
["Prix de revient unitaire : ",null,{"$f":"K12","v":1.5599999999999998},null,null,"marge","coef","tva","ht",null,"ttc"]
[null,null,null,null,null,null,null,null,null,null,6]
["avec emballage : ",null,{"$f":"C5+C9","v":1.5699999999999998},{"$f":"C5+C11","v":1.5699999999999998},null,{"$f":"I7-C7","v":4.0903773584905654},{"$f":"I7/C7","v":3.6053358971277492},"ES 6",{"$f":"K6/1.06","v":5.6603773584905657},"ToGo"]
[null,null,null,null,null,null,null,null,null,null,6]
["Emballage ToGo :",null,{"$f":"G31+G32","v":0.01},{"$f":"C9/C7","v":6.3694267515923579E-3},null,{"$f":"I9-D7","v":3.7871428571428569},{"$f":"I9/D7","v":3.4121929026387625},"ES 12",{"$f":"K8/1.12","v":5.3571428571428568},"Sp"]
[]
["Emballage Sp  :",null,{"$f":"O31+O32","v":0.01},{"$f":"C11/D7","v":6.3694267515923579E-3},null,"Prix kg/l / unité","Poids brut recette","Unité","% perte","brut 1 part","Cout 1 part","prix de revient","brut à faire","prix de revient"]
[0,"Produits",null,null,null,"ht",null,null,null,null,{"$f":"SUM(K14:K29)","v":1.5599999999999998},{"$f":"K12*H3","v":3.1199999999999997},null,{"$f":"SUM(N14:O29)","v":3.2499999999999996},null,"FOURNISSEUR"]
[]
["Salade iceberg (600g)",null,null,null,null,{"$f":"VLOOKUP(A14,PRIXINGRE,3,0)","v":5},0.108,{"$f":"IFERROR(VLOOKUP(A14,UNITINGRE,2,0),\"\")","v":"pièce"},{"$f":"IFERROR(VLOOKUP(A14,UNITINGRE,10,0),\"\")","v":0.05},{"$f":"IFERROR((G14/$C$3)+(((G14/$C$3)*I14)),\"\")","v":0.1134},{"$f":"IFERROR((J14*F14),\"\")","v":0.56699999999999995},null,{"$f":"IFERROR((ROUNDUP((J14*$H$3),2)),\"\")","v":0.23},{"$f":"IFERROR((M14*F14),\"\")","v":1.1500000000000001},null,{"$f":"VLOOKUP(A14,GDEBASE,8,0)","v":"JOSA"}]
["Salade trévise",null,null,null,null,5,1.2E-2,"pièce",0.05,1.26E-2,{"$f":"IFERROR((J15*F15),\"\")","v":6.3E-2},null,{"$f":"IFERROR((ROUNDUP((J15*$H$3),2)),\"\")","v":0.03},{"$f":"IFERROR((M15*F15),\"\")","v":0.15},null,"JOSA"]
["Concombre",null,null,null,null,5,0.04,"kg",0.1,4.3999999999999997E-2,{"$f":"IFERROR((J16*F16),\"\")","v":0.21999999999999997},null,0.09,0.44999999999999996,null,"JOSA"]
["Tomate cerisette",null,null,null,null,5,0.03,"kg",0,0.03,{"$f":"IFERROR((J17*F17),\"\")","v":0.15},null,0.06,0.3,null,"JOSA"]
["Carottes",null,null,null,null,5,0.03,"kg",0.2,3.5999999999999997E-2,0.18,null,0.08,0.4,null,"JOSA"]
["Oignon",null,null,null,null,5,0.01,"kg",0.1,1.0999999999999999E-2,{"$f":"IFERROR((J19*F19),\"\")","v":5.4999999999999993E-2},null,0.03,0.15,null,"JOSA"]
["Parmesan",null,null,null,null,5,1.4999999999999999E-2,"kg",0,1.4999999999999999E-2,7.4999999999999997E-2,null,0.03,0.15,null,"LOBET"]
["Poulet cuit en FILET VT FOOD SELECTION",null,null,null,null,5,0.05,"kg",0,0.05,0.25,null,0.1,0.5,null,"VT FOOD"]
[null,null,null,null,null,0,null,"","","","",null,"","",null,0]
[null,null,null,null,null,0,null,"","","","",null,"","",null,0]
[null,null,null,null,null,0,null,"","","","",null,"","",null,0]
[null,null,null,null,null,0,null,"","","","",null,"","",null,0]
[null,null,null,null,null,0,null,"","","","",null,"","",null,0]
[null,null,null,null,null,0,null,"","","","",null,"","",null,0]
[null,null,null,null,null,0,null,"","","","",null,"","",null,0]
[null,null,null,null,null,0,null,"","","","",null,"","",null,0]
[null,"Emballage ToGo",null,null,"Qte","price","prix U","Emballage",null,null,null,null,"Qte","price","prix U"]
[1,"#pack SALADE ToGo",null,null,1,{"$f":"VLOOKUP(B31,PRIXE,2,0)","v":0.01},{"$f":"E31*F31","v":0.01},3,"#pack SALADE SP",null,null,null,1,{"$f":"VLOOKUP(I31,PRIXE,2,0)","v":0.01},{"$f":"M31*N31","v":0.01}]
[2,null,null,null,null,{"$f":"VLOOKUP(B32,PRIXE,2,0)","v":0},{"$f":"E32*F32","v":0},4,null,null,null,null,null,{"$f":"VLOOKUP(I32,PRIXE,2,0)","v":0},{"$f":"M32*N32","v":0}]
["Etape de la recette"]
[1,"Bien remplir le saladier d'un mélange d'iceberg et de trévise",null,null,null,null,11]
[2,"Coupez 5 tranches de concombre",null,null,null,null,12]
[3,"Ajoutez 5 tomates cerises",null,null,null,null,13]
[4,"Raper les carottes",null,null,null,null,14]
[5,"Suer les oignons à la matière grasse et les ajouter",null,null,null,null,15]
[6,"Parsemez de copeaux de parmesan",null,null,null,null,16]
[7,null,null,null,null,null,"CALORIES (kcal)"]
[8,null,null,null,null,null,"Protéines (g)",null,null,null,null,"Fibres (g)"]
[9,null,null,null,null,null,"Lipides (g)",null,null,null,null,"AGSaturés (g)"]
[10,null,null,null,null,null,"Glucides (g)"]
["Forme & Dimension : "]
[]
["Cuisson & dressage :"]
[]
[]
[]
["Liste des allergènes  :"]
[]
[]
[null,"COMMANDE",null,"pour",null,{"$f":"H3","v":2},{"$f":"CONCATENATE(A1, F1,G1)","v":"Salade  :  Iceberg poulet"}]
[]
[null,"qte","unité","liste",null,null,null,null,"price",null,null,null,"Total"]
[null,{"$f":"M14","v":0.23},{"$f":"H14","v":"pièce"},{"$f":"A14","v":"Salade iceberg (600g)"},null,null,null,null,{"$f":"F14","v":5},null,null,null,{"$f":"N14","v":1.1500000000000001}]
[null,0.03,"pièce",{"$f":"A15","v":"Salade trévise"},null,null,null,null,{"$f":"F15","v":5},null,null,null,0.15]
[null,0.09,"kg","Concombre",null,null,null,null,5,null,null,null,0.44999999999999996]
[null,0.06,"kg","Tomate cerisette",null,null,null,null,5,null,null,null,0.3]
[null,0.08,"kg","Carottes",null,null,null,null,5,null,null,null,0.4]
[null,0.03,"kg","Oignon",null,null,null,null,5,null,null,null,0.15]
[null,0.03,"kg","Parmesan",null,null,null,null,5,null,null,null,0.15]
[null,0.1,"kg","Poulet cuit en FILET VT FOOD SELECTION",null,null,null,null,5,null,null,null,0.5]
[null,"","",0,null,null,null,null,0,null,null,null,""]
[null,"","",0,null,null,null,null,0,null,null,null,""]
[null,"","",0,null,null,null,null,0,null,null,null,""]
[null,"","",0,null,null,null,null,0,null,null,null,""]
[null,"","",0,null,null,null,null,0,null,null,null,""]
[null,"","",0,null,null,null,null,0,null,null,null,""]
[null,"","",0,null,null,null,null,0,null,null,null,""]
[null,"","",{"$f":"B29","v":0},null,null,null,null,0,null,null,null,""]
[null,null,null,null,null,null,null,null,null,null,null,null,{"$f":"SUM(M56:M71)","v":3.2499999999999996}]

{"sheet":"03 SALADE ice saumon concombre","index":14,"n_rows":72,"n_cols":16,"rows_kept":72,"cut":false,"hidden":false,"merged":[[0,0,0,4],[0,6,0,12],[0,13,0,14],[2,4,2,6],[5,10,6,10],[6,0,6,1],[12,3,12,4],[12,13,12,14],[13,0,13,3],[13,13,13,14],[14,0,14,3],[14,13,14,14],[7,10,8,10],[8,0,8,1],[10,0,10,1],[10,13,10,14],[11,1,11,4],[11,13,11,14],[18,0,18,3],[18,13,18,14],[19,0,19,3],[19,13,19,14],[20,0,20,3],[20,13,20,14],[15,0,15,3],[15,13,15,14],[16,0,16,3],[16,13,16,14],[17,0,17,3],[17,13,17,14],[24,0,24,3],[24,13,24,14],[25,0,25,3],[25,13,25,14],[26,0,26,3],[26,13,26,14],[21,0,21,3],[21,13,21,14],[22,0,22,3],[22,13,22,14],[23,0,23,3],[23,13,23,14],[30,1,30,3],[30,8,30,11],[31,1,31,3],[31,8,31,11],[33,1,33,5],[33,7,33,14],[27,0,27,3],[27,13,27,14],[28,0,28,3],[28,13,28,14],[29,1,29,3],[29,7,29,11],[37,1,37,5],[37,7,37,14],[38,1,38,5],[38,7,38,14],[39,1,39,5],[39,6,39,8],[39,9,39,10],[39,11,39,14],[34,1,34,5],[34,7,34,14],[35,1,35,5],[35,7,35,14],[36,1,36,5],[36,7,36,14],[42,1,42,5],[42,6,42,8],[42,11,42,12],[43,0,43,14],[44,0,44,14],[45,0,45,14],[40,1,40,5],[40,6,40,8],[40,11,40,12],[41,1,41,5],[41,6,41,8],[41,11,41,12],[55,3,55,7],[55,8,55,9],[56,3,56,7],[56,8,56,9],[57,3,57,7],[57,8,57,9],[46,0,46,14],[47,0,47,14],[48,0,48,14],[49,0,49,14],[50,0,50,14],[52,3,52,4],[52,6,52,14],[61,3,61,7],[61,8,61,9],[62,3,62,7],[62,8,62,9],[63,3,63,7],[63,8,63,9],[58,3,58,7],[58,8,58,9],[59,3,59,7],[59,8,59,9],[60,3,60,7],[60,8,60,9],[70,8,70,9],[71,12,71,13],[67,3,67,7],[67,8,67,9],[68,3,68,7],[68,8,68,9],[69,3,69,7],[69,8,69,9],[64,3,64,7],[64,8,64,9],[65,3,65,7],[65,8,65,9],[66,3,66,7],[66,8,66,9]]}
["Salade",null,null,null,null,"  :  ","saumon concombre",null,null,null,null,null,null,"150 grs"]
[]
["RECETTE PREVUE POUR  : ",null,1,null,"Vous la dupliquez pour : ",null,null,2]
[]
["Prix de revient unitaire : ",null,{"$f":"K12","v":2.973666666666666},null,null,"marge","coef","tva","ht",null,"ttc"]
[null,null,null,null,null,null,null,null,null,null,6]
["avec emballage : ",null,{"$f":"C5+C9","v":2.9836666666666658},{"$f":"C5+C11","v":2.9836666666666658},null,{"$f":"I7-C7","v":2.6767106918238999},{"$f":"I7/C7","v":1.8971212239382975},"ES 6",{"$f":"K6/1.06","v":5.6603773584905657},"ToGo"]
[null,null,null,null,null,null,null,null,null,null,6]
["Emballage ToGo :",null,{"$f":"G31+G32","v":0.01},{"$f":"C9/C7","v":3.3515808289576593E-3},null,{"$f":"I9-D7","v":2.373476190476191},{"$f":"I9/D7","v":1.795489729798746},"ES 12",{"$f":"K8/1.12","v":5.3571428571428568},"Sp"]
[]
["Emballage Sp  :",null,{"$f":"O31+O32","v":0.01},{"$f":"C11/D7","v":3.3515808289576593E-3},null,"Prix kg/l / unité","Poids brut recette","Unité","% perte","brut 1 part","Cout 1 part","prix de revient","brut à faire","prix de revient"]
[0,"Produits",null,null,null,"ht",null,null,null,null,{"$f":"SUM(K14:K29)","v":2.973666666666666},{"$f":"K12*H3","v":5.947333333333332},null,{"$f":"SUM(N14:O29)","v":6.1000000000000005},null,"FOURNISSEUR"]
[]
["Salade iceberg (600g)",null,null,null,null,{"$f":"VLOOKUP(A14,PRIXINGRE,3,0)","v":5},0.108,{"$f":"IFERROR(VLOOKUP(A14,UNITINGRE,2,0),\"\")","v":"pièce"},{"$f":"IFERROR(VLOOKUP(A14,UNITINGRE,10,0),\"\")","v":0.05},{"$f":"IFERROR((G14/$C$3)+(((G14/$C$3)*I14)),\"\")","v":0.1134},{"$f":"IFERROR((J14*F14),\"\")","v":0.56699999999999995},null,{"$f":"IFERROR((ROUNDUP((J14*$H$3),2)),\"\")","v":0.23},{"$f":"IFERROR((M14*F14),\"\")","v":1.1500000000000001},null,{"$f":"VLOOKUP(A14,GDEBASE,8,0)","v":"JOSA"}]
["Saumon fumé tranché  machine SAVEUR",null,null,null,null,5,0.03,"kg",0.13333333333333333,3.4000000000000002E-2,{"$f":"IFERROR((J15*F15),\"\")","v":0.17},null,{"$f":"IFERROR((ROUNDUP((J15*$H$3),2)),\"\")","v":6.9999999999999993E-2},{"$f":"IFERROR((M15*F15),\"\")","v":0.35},null,"SAVEURS GOURMANDES"]
["Fromage blanc gras 3k",null,null,null,null,5,0.06,"kg",0,0.06,{"$f":"IFERROR((J16*F16),\"\")","v":0.3},null,0.12,0.6,null,"LOBET"]
["Concombre",null,null,null,null,5,0.02,"kg",0.1,2.1999999999999999E-2,{"$f":"IFERROR((J17*F17),\"\")","v":0.10999999999999999},null,0.05,0.25,null,"JOSA"]
["citron vert",null,null,null,null,5,0.16666666666666666,"pièce",0,0.16666666666666666,0.83333333333333326,null,0.34,1.7000000000000002,null,"JOSA"]
["Citrons",null,null,null,null,5,0.16666666666666666,"pièce",0,0.16666666666666666,{"$f":"IFERROR((J19*F19),\"\")","v":0.83333333333333326},null,0.34,1.7000000000000002,null,"JOSA"]
["Huile d'olive",null,null,null,null,5,0.01,"Litre",0,0.01,0.05,null,0.02,0.1,null,"METRO"]
["aneth",null,null,null,null,5,2E-3,"kg",0,2E-3,0.01,null,0.01,0.05,null,"METRO"]
["Tomate cerisette",null,null,null,null,5,0.02,"kg",0,0.02,0.1,null,0.04,0.2,null,"JOSA"]
[null,null,null,null,null,0,null,"","","","",null,"","",null,0]
[null,null,null,null,null,0,null,"","","","",null,"","",null,0]
[null,null,null,null,null,0,null,"","","","",null,"","",null,0]
[null,null,null,null,null,0,null,"","","","",null,"","",null,0]
[null,null,null,null,null,0,null,"","","","",null,"","",null,0]
[null,null,null,null,null,0,null,"","","","",null,"","",null,0]
[null,null,null,null,null,0,null,"","","","",null,"","",null,0]
[null,"Emballage ToGo",null,null,"Qte","price","prix U","Emballage",null,null,null,null,"Qte","price","prix U"]
[1,"#pack SALADE ToGo",null,null,1,{"$f":"VLOOKUP(B31,PRIXE,2,0)","v":0.01},{"$f":"E31*F31","v":0.01},3,"#pack SALADE SP",null,null,null,1,{"$f":"VLOOKUP(I31,PRIXE,2,0)","v":0.01},{"$f":"M31*N31","v":0.01}]
[2,null,null,null,null,{"$f":"VLOOKUP(B32,PRIXE,2,0)","v":0},{"$f":"E32*F32","v":0},4,null,null,null,null,null,{"$f":"VLOOKUP(I32,PRIXE,2,0)","v":0},{"$f":"M32*N32","v":0}]
["Etape de la recette"]
[1,"Bien remplir le saladier d'un mélange d'iceberg et de trévise",null,null,null,null,11]
[2,"Ajoutez le mélange fêta",null,null,null,null,12]
[3,"Coupez 5 tranches de concombre",null,null,null,null,13]
[4,"Ajoutez 5 tomates cerises",null,null,null,null,14]
[5,"Râper la courgette et ajoutez-la",null,null,null,null,15]
[6,null,null,null,null,null,16]
[7,null,null,null,null,null,"CALORIES (kcal)"]
[8,null,null,null,null,null,"Protéines (g)",null,null,null,{"$f":"J41*4","v":0},"Fibres (g)",null,null,{"$f":"N41*2","v":0}]
[9,null,null,null,null,null,"Lipides (g)",null,null,null,{"$f":"J42*9","v":0},"AGSaturés (g)"]
[10,null,null,null,null,null,"Glucides (g)",null,null,null,{"$f":"J43*4","v":0}]
["Forme & Dimension : "]
[]
["Cuisson & dressage :"]
[]
[]
[]
["Liste des allergènes  :"]
[]
[]
[null,"COMMANDE",null,"pour",null,{"$f":"H3","v":2},{"$f":"CONCATENATE(A1, F1,G1)","v":"Salade  :  saumon concombre"}]
[]
[null,"qte","unité","liste",null,null,null,null,"price",null,null,null,"Total"]
[null,{"$f":"M14","v":0.23},{"$f":"H14","v":"pièce"},{"$f":"A14","v":"Salade iceberg (600g)"},null,null,null,null,{"$f":"F14","v":5},null,null,null,{"$f":"N14","v":1.1500000000000001}]
[null,6.9999999999999993E-2,"kg",{"$f":"A15","v":"Saumon fumé tranché  machine SAVEUR"},null,null,null,null,{"$f":"F15","v":5},null,null,null,0.35]
[null,0.12,"kg","Fromage blanc gras 3k",null,null,null,null,5,null,null,null,0.6]
[null,0.05,"kg","Concombre",null,null,null,null,5,null,null,null,0.25]
[null,0.34,"pièce","citron vert",null,null,null,null,5,null,null,null,1.7000000000000002]
[null,0.34,"pièce","Citrons",null,null,null,null,5,null,null,null,1.7000000000000002]
[null,0.02,"Litre","Huile d'olive",null,null,null,null,5,null,null,null,0.1]
[null,0.01,"kg","aneth",null,null,null,null,5,null,null,null,0.05]
[null,0.04,"kg","Tomate cerisette",null,null,null,null,5,null,null,null,0.2]
[null,"","",0,null,null,null,null,0,null,null,null,""]
[null,"","",0,null,null,null,null,0,null,null,null,""]
[null,"","",0,null,null,null,null,0,null,null,null,""]
[null,"","",0,null,null,null,null,0,null,null,null,""]
[null,"","",0,null,null,null,null,0,null,null,null,""]
[null,"","",0,null,null,null,null,0,null,null,null,""]
[null,"","",{"$f":"B29","v":0},null,null,null,null,0,null,null,null,""]
[null,null,null,null,null,null,null,null,null,null,null,null,{"$f":"SUM(M56:M71)","v":6.1000000000000005}]

{"sheet":"04  CEREAL lentilles & boulgour","index":15,"n_rows":76,"n_cols":16,"rows_kept":76,"cut":false,"hidden":false,"merged":[[73,3,73,7],[73,8,73,9],[74,8,74,9],[75,12,75,13],[70,3,70,7],[70,8,70,9],[71,3,71,7],[71,8,71,9],[72,3,72,7],[72,8,72,9],[67,3,67,7],[67,8,67,9],[68,3,68,7],[68,8,68,9],[69,3,69,7],[69,8,69,9],[64,3,64,7],[64,8,64,9],[65,3,65,7],[65,8,65,9],[66,3,66,7],[66,8,66,9],[61,3,61,7],[61,8,61,9],[62,3,62,7],[62,8,62,9],[63,3,63,7],[63,8,63,9],[56,3,56,4],[56,6,56,14],[59,3,59,7],[59,8,59,9],[60,3,60,7],[60,8,60,9],[49,3,49,4],[49,6,49,7],[49,9,49,10],[49,12,49,13],[50,3,50,4],[50,6,50,7],[50,9,50,10],[50,12,50,13],[46,0,46,14],[47,0,47,14],[48,3,48,4],[48,6,48,7],[48,9,48,10],[48,12,48,13],[42,1,42,5],[42,6,42,8],[42,11,42,12],[43,0,43,14],[44,0,44,14],[45,0,45,14],[40,1,40,5],[40,6,40,8],[40,11,40,12],[41,1,41,5],[41,6,41,8],[41,11,41,12],[37,1,37,5],[37,7,37,14],[38,1,38,5],[38,7,38,14],[39,1,39,5],[39,6,39,8],[39,9,39,10],[39,11,39,14],[34,1,34,5],[34,7,34,14],[35,1,35,5],[35,7,35,14],[36,1,36,5],[36,7,36,14],[30,1,30,3],[30,8,30,11],[31,1,31,3],[31,8,31,11],[33,1,33,5],[33,7,33,14],[27,0,27,3],[27,13,27,14],[28,0,28,3],[28,13,28,14],[29,1,29,3],[29,7,29,11],[24,0,24,3],[24,13,24,14],[25,0,25,3],[25,13,25,14],[26,0,26,3],[26,13,26,14],[21,0,21,3],[21,13,21,14],[22,0,22,3],[22,13,22,14],[23,0,23,3],[23,13,23,14],[19,0,19,3],[19,13,19,14],[20,0,20,3],[20,13,20,14],[15,0,15,3],[15,13,15,14],[16,0,16,3],[16,13,16,14],[17,0,17,3],[17,13,17,14],[14,0,14,3],[14,13,14,14],[7,10,8,10],[8,0,8,1],[10,0,10,1],[10,13,10,14],[11,1,11,4],[11,13,11,14],[18,0,18,3],[18,13,18,14],[0,0,0,4],[0,6,0,12],[0,13,0,14],[2,4,2,6],[5,10,6,10],[6,0,6,1],[12,3,12,4],[12,13,12,14],[13,0,13,3],[13,13,13,14]]}
["CEREALES",null,null,null,null,"  :  ","Lentilles et boulgour",null,null,null,null,null,null,"150 grs"]
[]
["RECETTE PREVUE POUR  : ",null,10,null,"Vous la dupliquez pour : ",null,null,2]
[]
["Prix de revient unitaire : ",null,{"$f":"K12","v":1.1849999999999998},null,null,"marge","coef","tva","ht",null,"ttc"]
[null,null,null,null,null,null,null,null,null,null,4.5]
["avec emballage : ",null,{"$f":"C5+C9","v":1.1949999999999998},{"$f":"C5+C11","v":1.1949999999999998},null,{"$f":"I7-C7","v":3.0502830188679249},{"$f":"I7/C7","v":3.5525380911028663},"ES 6",{"$f":"K6/1.06","v":4.2452830188679247},"ToGo"]
[null,null,null,null,null,null,null,null,null,null,4.5]
["Emballage ToGo :",null,{"$f":"G31+G32","v":0.01},{"$f":"C9/C7","v":8.3682008368200847E-3},null,{"$f":"I9-D7","v":2.8228571428571425},{"$f":"I9/D7","v":3.3622235505080695},"ES 12",{"$f":"K8/1.12","v":4.0178571428571423},"Sp"]
[]
["Emballage Sp  :",null,{"$f":"O31+O32","v":0.01},{"$f":"C11/D7","v":8.3682008368200847E-3},null,"Prix kg/l / unité","Poids brut recette","Unité","% perte","brut 1 part","Cout 1 part","prix de revient","brut à faire","prix de revient"]
[0,"Produits",null,null,null,"ht",null,null,null,null,{"$f":"SUM(K14:K29)","v":1.1849999999999998},{"$f":"K12*H3","v":2.3699999999999997},null,{"$f":"SUM(N14:O29)","v":2.5},null,"FOURNISSEUR"]
[]
["Lentilles 5kg",null,null,null,null,{"$f":"VLOOKUP(A14,PRIXINGRE,3,0)","v":5},0.27,{"$f":"IFERROR(VLOOKUP(A14,UNITINGRE,2,0),\"\")","v":"kg"},{"$f":"IFERROR(VLOOKUP(A14,UNITINGRE,10,0),\"\")","v":0},{"$f":"IFERROR((G14/$C$3)+(((G14/$C$3)*I14)),\"\")","v":2.7000000000000003E-2},{"$f":"IFERROR((J14*F14),\"\")","v":0.13500000000000001},null,{"$f":"IFERROR((ROUNDUP((J14*$H$3),2)),\"\")","v":6.0000000000000005E-2},{"$f":"IFERROR((M14*F14),\"\")","v":0.30000000000000004},null,{"$f":"VLOOKUP(A14,GDEBASE,8,0)","v":"METRO"}]
["Boulgour",null,null,null,null,5,0.25,"kg",0,2.5000000000000001E-2,{"$f":"IFERROR((J15*F15),\"\")","v":0.125},null,{"$f":"IFERROR((ROUNDUP((J15*$H$3),2)),\"\")","v":0.05},{"$f":"IFERROR((M15*F15),\"\")","v":0.25},null,"METRO"]
["Courgettes",null,null,null,"1",5,0.7,"kg",0.1,7.6999999999999985E-2,{"$f":"IFERROR((J16*F16),\"\")","v":0.3849999999999999},null,0.16,0.8,null,"JOSA"]
["Aubergines (pour info 1 auberg=400g)",null,null,null,"1",5,0.35,"kg",0.2,4.1999999999999996E-2,{"$f":"IFERROR((J17*F17),\"\")","v":0.20999999999999996},null,0.09,0.44999999999999996,null,"JOSA"]
["coriandre fraiche",null,null,null,null,5,0.5,"botte",0.2,6.0000000000000005E-2,0.30000000000000004,null,0.12,0.6,null,"JOSA"]
["Huile d'olive",null,null,null,null,5,0.06,"Litre",0,6.0000000000000001E-3,{"$f":"IFERROR((J19*F19),\"\")","v":0.03},null,0.02,0.1,null,"METRO"]
[null,null,null,null,null,0,null,"","","","",null,"","",null,0]
[null,null,null,null,null,0,null,"","","","",null,"","",null,0]
[null,null,null,null,null,0,null,"","","","",null,"","",null,0]
[null,null,null,null,null,0,null,"","","","",null,"","",null,0]
[null,null,null,null,null,0,null,"","","","",null,"","",null,0]
[null,null,null,null,null,0,null,"","","","",null,"","",null,0]
[null,null,null,null,null,0,null,"","","","",null,"","",null,0]
[null,null,null,null,null,0,null,"","","","",null,"","",null,0]
[null,null,null,null,null,0,null,"","","","",null,"","",null,0]
[null,null,null,null,null,0,null,"","","","",null,"","",null,0]
[null,"Emballage",null,null,"Qte","price","prix U","Emballage",null,null,null,null,"Qte","price","prix U"]
[1,"#pack CEREALES ToGo",null,null,1,{"$f":"VLOOKUP(B31,PRIXE,2,0)","v":0.01},{"$f":"E31*F31","v":0.01},3,"#pack CEREALES Sp",null,null,null,1,{"$f":"VLOOKUP(I31,PRIXE,2,0)","v":0.01},{"$f":"M31*N31","v":0.01}]
[2,0,null,null,1,{"$f":"VLOOKUP(B32,PRIXE,2,0)","v":0},{"$f":"E32*F32","v":0},4,0,null,null,null,null,{"$f":"VLOOKUP(I32,PRIXE,2,0)","v":0},{"$f":"M32*N32","v":0}]
["Etape de la recette"]
[1,null,null,null,null,null,11]
[2,null,null,null,null,null,12]
[3,null,null,null,null,null,13]
[4,null,null,null,null,null,14]
[5,null,null,null,null,null,15]
[6,null,null,null,null,null,16]
[7,null,null,null,null,null,"CALORIES (kcal)",null,null,{"$f":"K41+K42+K43+O41","v":0}]
[8,null,null,null,null,null,"Protéines (g)",null,null,null,{"$f":"J41*4","v":0},"Fibres (g)",null,null,{"$f":"N41*2","v":0}]
[9,null,null,null,null,null,"Lipides (g)",null,null,null,{"$f":"J42*9","v":0},"AGSaturés (g)"]
[10,null,null,null,null,null,"Glucides (g)",null,null,null,{"$f":"J43*4","v":0}]
["Forme & Dimension : "]
[]
["Cuisson & dressage :"]
[]
["Liste des allergènes  :"]
["x","GLUTEN",null,"GLUCOSE",null,null,"GRAINES",null,null,"CÉLERI",null,null,"CRUSTACÉS"]
[null,"LACTOSE / DAIRY",null,"ARACHIDE",null,null,"FRUITS À COQUE",null,null,"SULFITES",null,null,"POISSON"]
[null,"OEUF",null,"MOUTARDE",null,null,"SOJA",null,null,"PORC",null,null,"VIANDE"]
[]
[]
[]
[]
[]
[null,"COMMANDE",null,"pour",null,{"$f":"H3","v":2},{"$f":"CONCATENATE(A1, F1,G1)","v":"CEREALES  :  Lentilles et boulgour"}]
[]
[null,"qte","unité","liste",null,null,null,null,"price",null,null,null,"Total"]
[null,{"$f":"M14","v":6.0000000000000005E-2},{"$f":"H14","v":"kg"},{"$f":"A14","v":"Lentilles 5kg"},null,null,null,null,{"$f":"F14","v":5},null,null,null,{"$f":"N14","v":0.30000000000000004}]
[null,0.05,"kg",{"$f":"A15","v":"Boulgour"},null,null,null,null,{"$f":"F15","v":5},null,null,null,0.25]
[null,0.16,"kg","Courgettes",null,null,null,null,5,null,null,null,0.8]
[null,0.09,"kg","Aubergines (pour info 1 auberg=400g)",null,null,null,null,5,null,null,null,0.44999999999999996]
[null,0.12,"botte","coriandre fraiche",null,null,null,null,5,null,null,null,0.6]
[null,0.02,"Litre","Huile d'olive",null,null,null,null,5,null,null,null,0.1]
[null,"","",0,null,null,null,null,0,null,null,null,""]
[null,"","",0,null,null,null,null,0,null,null,null,""]
[null,"","",0,null,null,null,null,0,null,null,null,""]
[null,"","",0,null,null,null,null,0,null,null,null,""]
[null,"","",0,null,null,null,null,0,null,null,null,""]
[null,"","",0,null,null,null,null,0,null,null,null,""]
[null,"","",0,null,null,null,null,0,null,null,null,""]
[null,"","",0,null,null,null,null,0,null,null,null,""]
[null,"","",0,null,null,null,null,0,null,null,null,""]
[null,"","",{"$f":"B29","v":0},null,null,null,null,0,null,null,null,""]
[null,null,null,null,null,null,null,null,null,null,null,null,{"$f":"SUM(M60:M75)","v":2.5}]

{"sheet":"04 CEREALES riz niçois","index":16,"n_rows":76,"n_cols":16,"rows_kept":76,"cut":false,"hidden":false,"merged":[[73,3,73,7],[73,8,73,9],[74,8,74,9],[75,12,75,13],[70,3,70,7],[70,8,70,9],[71,3,71,7],[71,8,71,9],[72,3,72,7],[72,8,72,9],[67,3,67,7],[67,8,67,9],[68,3,68,7],[68,8,68,9],[69,3,69,7],[69,8,69,9],[64,3,64,7],[64,8,64,9],[65,3,65,7],[65,8,65,9],[66,3,66,7],[66,8,66,9],[61,3,61,7],[61,8,61,9],[62,3,62,7],[62,8,62,9],[63,3,63,7],[63,8,63,9],[56,3,56,4],[56,6,56,14],[59,3,59,7],[59,8,59,9],[60,3,60,7],[60,8,60,9],[49,3,49,4],[49,6,49,7],[49,9,49,10],[49,12,49,13],[50,3,50,4],[50,6,50,7],[50,9,50,10],[50,12,50,13],[46,0,46,14],[47,0,47,14],[48,3,48,4],[48,6,48,7],[48,9,48,10],[48,12,48,13],[42,1,42,5],[42,6,42,8],[42,11,42,12],[43,0,43,14],[44,0,44,14],[45,0,45,14],[40,1,40,5],[40,6,40,8],[40,11,40,12],[41,1,41,5],[41,6,41,8],[41,11,41,12],[37,1,37,5],[37,7,37,14],[38,1,38,5],[38,7,38,14],[39,1,39,5],[39,6,39,8],[39,9,39,10],[39,11,39,14],[34,1,34,5],[34,7,34,14],[35,1,35,5],[35,7,35,14],[36,1,36,5],[36,7,36,14],[30,1,30,3],[30,8,30,11],[31,1,31,3],[31,8,31,11],[33,1,33,5],[33,7,33,14],[27,0,27,3],[27,13,27,14],[28,0,28,3],[28,13,28,14],[29,1,29,3],[29,7,29,11],[24,0,24,3],[24,13,24,14],[25,0,25,3],[25,13,25,14],[26,0,26,3],[26,13,26,14],[21,0,21,3],[21,13,21,14],[22,0,22,3],[22,13,22,14],[23,0,23,3],[23,13,23,14],[19,0,19,3],[19,13,19,14],[20,0,20,3],[20,13,20,14],[15,0,15,3],[15,13,15,14],[16,0,16,3],[16,13,16,14],[17,0,17,3],[17,13,17,14],[14,0,14,3],[14,13,14,14],[7,10,8,10],[8,0,8,1],[10,0,10,1],[10,13,10,14],[11,1,11,4],[11,13,11,14],[18,0,18,3],[18,13,18,14],[0,0,0,4],[0,6,0,12],[0,13,0,14],[2,4,2,6],[5,10,6,10],[6,0,6,1],[12,3,12,4],[12,13,12,14],[13,0,13,3],[13,13,13,14]]}
["CEREALES",null,null,null,null,"  :  ","RIZ A LA NICOISE",null,null,null,null,null,null,"180 grs"]
[]
["RECETTE PREVUE POUR  : ",null,10,null,"Vous la dupliquez pour : ",null,null,2]
[]
["Prix de revient unitaire : ",null,{"$f":"K12","v":0.10784285714285714},null,null,"marge","coef","tva","ht",null,"ttc"]
[null,null,null,null,null,null,null,null,null,null,4.5]
["avec emballage : ",null,{"$f":"C5+C9","v":0.11784285714285714},{"$f":"C5+C11","v":0.11784285714285714},null,{"$f":"I7-C7","v":4.1274401617250671},{"$f":"I7/C7","v":36.024949850982509},"ES 6",{"$f":"K6/1.06","v":4.2452830188679247},"ToGo"]
[null,null,null,null,null,null,null,null,null,null,4.5]
["Emballage ToGo :",null,{"$f":"G31+G32","v":0.01},{"$f":"C9/C7","v":8.4858770760092142E-2},null,{"$f":"I9-D7","v":3.9000142857142852},{"$f":"I9/D7","v":34.0950418232513},"ES 12",{"$f":"K8/1.12","v":4.0178571428571423},"Sp"]
[]
["Emballage Sp  :",null,{"$f":"O31+O32","v":0.01},{"$f":"C11/D7","v":8.4858770760092142E-2},null,"Prix kg/l / unité","Poids brut recette","Unité","% perte","brut 1 part","Cout 1 part","prix de revient","brut à faire","prix de revient"]
[0,"Produits",null,null,null,"ht",null,null,null,null,{"$f":"SUM(K14:K29)","v":0.10784285714285714},{"$f":"K12*H3","v":0.21568571428571429},null,{"$f":"SUM(N14:O29)","v":0.54999999999999993},null,"FOURNISSEUR"]
[]
["Riz basmati",null,null,null,null,{"$f":"VLOOKUP(A14,PRIXINGRE,3,0)","v":5},3.5999999999999997E-2,{"$f":"IFERROR(VLOOKUP(A14,UNITINGRE,2,0),\"\")","v":"kg"},{"$f":"IFERROR(VLOOKUP(A14,UNITINGRE,10,0),\"\")","v":0},{"$f":"IFERROR((G14/$C$3)+(((G14/$C$3)*I14)),\"\")","v":3.5999999999999999E-3},{"$f":"IFERROR((J14*F14),\"\")","v":1.7999999999999999E-2},null,{"$f":"IFERROR((ROUNDUP((J14*$H$3),2)),\"\")","v":0.01},{"$f":"IFERROR((M14*F14),\"\")","v":0.05},null,{"$f":"VLOOKUP(A14,GDEBASE,8,0)","v":"METRO"}]
["Tomate fraiche",null,null,null,null,5,3.5999999999999997E-2,"kg",0.2,4.3200000000000001E-3,{"$f":"IFERROR((J15*F15),\"\")","v":2.1600000000000001E-2},null,{"$f":"IFERROR((ROUNDUP((J15*$H$3),2)),\"\")","v":0.01},{"$f":"IFERROR((M15*F15),\"\")","v":0.05},null,"JOSA"]
["poivrons frais",null,null,null,null,5,1.4E-2,"kg",0.15,1.6099999999999999E-3,{"$f":"IFERROR((J16*F16),\"\")","v":8.0499999999999999E-3},null,0.01,0.05,null,"JOSA"]
["Oignons gros rouge",null,null,null,null,5,1.4E-2,"kg",0.1,1.5399999999999999E-3,{"$f":"IFERROR((J17*F17),\"\")","v":7.6999999999999994E-3},null,0.01,0.05,null,"JOSA"]
["oignons jeunes",null,null,null,null,5,3.0000000000000001E-3,"kg",0.1,3.3000000000000005E-4,1.6500000000000002E-3,null,0.01,0.05,null,"JOSA"]
["Céleri branche",null,null,null,null,5,0.01,"kg",0.3,1.2999999999999999E-3,{"$f":"IFERROR((J19*F19),\"\")","v":6.4999999999999997E-3},null,0.01,0.05,null,"JOSA"]
["Concombre",null,null,null,null,5,0.02,"kg",0.1,2.2000000000000001E-3,1.1000000000000001E-2,null,0.01,0.05,null,"JOSA"]
["Thon au naturel",null,null,null,null,5,3.5999999999999997E-2,"kg",3.5714285714285712E-2,3.7285714285714283E-3,1.8642857142857142E-2,null,0.01,0.05,null,"METRO"]
["Olives noires dénoyautées",null,null,null,null,5,6.0000000000000001E-3,"kg",0.5,9.0000000000000008E-4,4.5000000000000005E-3,null,0.01,0.05,null,"METRO"]
["Anchois à l'huile 1 =4g",null,null,null,null,5,8.0000000000000002E-3,"kg",0.3,1.0400000000000001E-3,{"$f":"IFERROR((J23*F23),\"\")","v":5.2000000000000006E-3},null,{"$f":"IFERROR((ROUNDUP((J23*$H$3),2)),\"\")","v":0.01},{"$f":"IFERROR((M23*F23),\"\")","v":0.05},null,"METRO"]
["huile d'olive",null,null,null,null,5,0.01,"Litre",0,1E-3,5.0000000000000001E-3,null,0.01,0.05,null,"METRO"]
[null,null,null,null,null,0,null,"","","","",null,"","",null,0]
[null,null,null,null,null,0,null,"","","","",null,"","",null,0]
[null,null,null,null,null,0,null,"","","","",null,"","",null,0]
[null,null,null,null,null,0,null,"","","","",null,"","",null,0]
[null,null,null,null,null,0,null,"","","","",null,"","",null,0]
[null,"Emballage ToGo",null,null,"Qte","price","prix U","Emballage",null,null,null,null,"Qte","price","prix U"]
[1,"#pack CEREALES ToGo",null,null,1,{"$f":"VLOOKUP(B31,PRIXE,2,0)","v":0.01},{"$f":"E31*F31","v":0.01},3,"#pack CEREALES Sp",null,null,null,1,{"$f":"VLOOKUP(I31,PRIXE,2,0)","v":0.01},{"$f":"M31*N31","v":0.01}]
[2,0,null,null,1,{"$f":"VLOOKUP(B32,PRIXE,2,0)","v":0},{"$f":"E32*F32","v":0},4,0,null,null,null,null,{"$f":"VLOOKUP(I32,PRIXE,2,0)","v":0},{"$f":"M32*N32","v":0}]
["Etape de la recette"]
[1,null,null,null,null,null,11]
[2,null,null,null,null,null,12]
[3,null,null,null,null,null,13]
[4,null,null,null,null,null,14]
[5,null,null,null,null,null,15]
[6,null,null,null,null,null,16]
[7,null,null,null,null,null,"CALORIES (kcal)",null,null,{"$f":"K41+K42+K43+O41","v":0}]
[8,null,null,null,null,null,"Protéines (g)",null,null,null,{"$f":"J41*4","v":0},"Fibres (g)",null,null,{"$f":"N41*2","v":0}]
[9,null,null,null,null,null,"Lipides (g)",null,null,null,{"$f":"J42*9","v":0},"AGSaturés (g)"]
[10,null,null,null,null,null,"Glucides (g)",null,null,null,{"$f":"J43*4","v":0}]
["Forme & Dimension : "]
[]
["Cuisson & dressage :"]
[]
["Liste des allergènes  :"]
[null,"GLUTEN",null,"GLUCOSE",null,null,"GRAINES",null,null,"CÉLERI",null,null,"CRUSTACÉS"]
[null,"LACTOSE / DAIRY",null,"ARACHIDE",null,null,"FRUITS À COQUE",null,null,"SULFITES",null,null,"POISSON"]
[null,"OEUF",null,"MOUTARDE",null,null,"SOJA",null,null,"PORC",null,null,"VIANDE"]
[]
[]
[]
[]
[]
[null,"COMMANDE",null,"pour",null,{"$f":"H3","v":2},{"$f":"CONCATENATE(A1, F1,G1)","v":"CEREALES  :  RIZ A LA NICOISE"}]
[]
[null,"qte","unité","liste",null,null,null,null,"price",null,null,null,"Total"]
[null,{"$f":"M14","v":0.01},{"$f":"H14","v":"kg"},{"$f":"A14","v":"Riz basmati"},null,null,null,null,{"$f":"F14","v":5},null,null,null,{"$f":"N14","v":0.05}]
[null,0.01,"kg",{"$f":"A15","v":"Tomate fraiche"},null,null,null,null,{"$f":"F15","v":5},null,null,null,0.05]
[null,0.01,"kg","poivrons frais",null,null,null,null,5,null,null,null,0.05]
[null,0.01,"kg","Oignons gros rouge",null,null,null,null,5,null,null,null,0.05]
[null,0.01,"kg","oignons jeunes",null,null,null,null,5,null,null,null,0.05]
[null,0.01,"kg","Céleri branche",null,null,null,null,5,null,null,null,0.05]
[null,0.01,"kg","Concombre",null,null,null,null,5,null,null,null,0.05]
[null,0.01,"kg","Thon au naturel",null,null,null,null,5,null,null,null,0.05]
[null,0.01,"kg","Olives noires dénoyautées",null,null,null,null,5,null,null,null,0.05]
[null,0.01,"kg","Anchois à l'huile 1 =4g",null,null,null,null,5,null,null,null,0.05]
[null,0.01,"Litre","huile d'olive",null,null,null,null,5,null,null,null,0.05]
[null,"","",0,null,null,null,null,0,null,null,null,""]
[null,"","",0,null,null,null,null,0,null,null,null,""]
[null,"","",0,null,null,null,null,0,null,null,null,""]
[null,"","",0,null,null,null,null,0,null,null,null,""]
[null,"","",{"$f":"B29","v":0},null,null,null,null,0,null,null,null,""]
[null,null,null,null,null,null,null,null,null,null,null,null,{"$f":"SUM(M60:M75)","v":0.54999999999999993}]

{"sheet":"05 FOCACCIA HAM & CHEDDAR","index":17,"n_rows":76,"n_cols":16,"rows_kept":76,"cut":false,"hidden":false,"merged":[[0,0,0,4],[0,6,0,12],[0,13,0,14],[2,4,2,6],[5,10,6,10],[6,0,6,1],[12,3,12,4],[12,13,12,14],[13,0,13,3],[13,13,13,14],[14,0,14,3],[14,13,14,14],[7,10,8,10],[8,0,8,1],[10,0,10,1],[10,13,10,14],[11,1,11,4],[11,13,11,14],[18,0,18,3],[18,13,18,14],[19,0,19,3],[19,13,19,14],[20,0,20,3],[20,13,20,14],[15,0,15,3],[15,13,15,14],[16,0,16,3],[16,13,16,14],[17,0,17,3],[17,13,17,14],[24,0,24,3],[24,13,24,14],[25,0,25,3],[25,13,25,14],[26,0,26,3],[26,13,26,14],[21,0,21,3],[21,13,21,14],[22,0,22,3],[22,13,22,14],[23,0,23,3],[23,13,23,14],[30,1,30,3],[30,8,30,11],[31,1,31,3],[31,8,31,11],[33,1,33,5],[33,7,33,14],[27,0,27,3],[27,13,27,14],[28,0,28,3],[28,13,28,14],[29,1,29,3],[29,7,29,11],[37,1,37,5],[37,7,37,14],[38,1,38,5],[38,7,38,14],[39,1,39,5],[39,6,39,8],[39,9,39,10],[39,11,39,14],[34,1,34,5],[34,7,34,14],[35,1,35,5],[35,7,35,14],[36,1,36,5],[36,7,36,14],[42,1,42,5],[42,6,42,8],[42,11,42,12],[43,0,43,14],[44,0,44,14],[45,0,45,14],[40,1,40,5],[40,6,40,8],[40,11,40,12],[41,1,41,5],[41,6,41,8],[41,11,41,12],[49,3,49,4],[49,6,49,7],[49,9,49,10],[49,12,49,13],[50,3,50,4],[50,6,50,7],[50,9,50,10],[50,12,50,13],[46,0,46,14],[47,0,47,14],[48,3,48,4],[48,6,48,7],[48,9,48,10],[48,12,48,13],[61,3,61,7],[61,8,61,9],[62,3,62,7],[62,8,62,9],[63,3,63,7],[63,8,63,9],[56,3,56,4],[56,6,56,14],[59,3,59,7],[59,8,59,9],[60,3,60,7],[60,8,60,9],[67,3,67,7],[67,8,67,9],[68,3,68,7],[68,8,68,9],[69,3,69,7],[69,8,69,9],[64,3,64,7],[64,8,64,9],[65,3,65,7],[65,8,65,9],[66,3,66,7],[66,8,66,9],[73,3,73,7],[73,8,73,9],[74,8,74,9],[75,12,75,13],[70,3,70,7],[70,8,70,9],[71,3,71,7],[71,8,71,9],[72,3,72,7],[72,8,72,9]]}
["FOCACCIA",null,null,null,null,"  :  ","CHEVRE",null,null,null,null,null,null,"150 grs"]
[]
["RECETTE PREVUE POUR  : ",null,1,null,"Vous la dupliquez pour : ",null,null,2]
[]
["Prix de revient unitaire : ",null,{"$f":"K12","v":19.59},null,null,"marge","coef","tva","ht",null,"ttc"]
[null,null,null,null,null,null,null,null,null,null,6]
["avec emballage : ",null,{"$f":"C5+C9","v":19.600000000000001},{"$f":"C5+C11","v":19.600000000000001},null,{"$f":"I7-C7","v":-13.939622641509436},{"$f":"I7/C7","v":0.28879476318829417},"ES 6",{"$f":"K6/1.06","v":5.6603773584905657},"ToGo"]
[null,null,null,null,null,null,null,null,null,null,6]
["Emballage ToGo :",null,{"$f":"G31+G32","v":0.01},{"$f":"C9/C7","v":5.10204081632653E-4},null,{"$f":"I9-D7","v":-14.242857142857144},{"$f":"I9/D7","v":0.27332361516034981},"ES 12",{"$f":"K8/1.12","v":5.3571428571428568},"Sp"]
[]
["Emballage Sp  :",null,{"$f":"O31+O32","v":0.01},{"$f":"C11/D7","v":5.10204081632653E-4},null,"Prix kg/l / unité","Poids brut recette","Unité","% perte","brut 1 part","Cout 1 part","prix de revient","brut à faire","prix de revient"]
[0,"Produits",null,null,null,"ht",null,null,null,null,{"$f":"SUM(K14:K29)","v":19.59},{"$f":"K12*H3","v":39.18},null,{"$f":"SUM(N14:O29)","v":39.200000000000003},null,"FOURNISSEUR"]
[]
["MB FOCCACIA ORIGAN PETITE (170g)",null,null,null,null,{"$f":"VLOOKUP(A14,PRIXINGRE,3,0)","v":5},1,{"$f":"IFERROR(VLOOKUP(A14,UNITINGRE,2,0),\"\")","v":"pièce"},{"$f":"IFERROR(VLOOKUP(A14,UNITINGRE,10,0),\"\")","v":0},{"$f":"IFERROR((G14/$C$3)+(((G14/$C$3)*I14)),\"\")","v":1},{"$f":"IFERROR((J14*F14),\"\")","v":5},null,{"$f":"IFERROR((ROUNDUP((J14*$H$3),2)),\"\")","v":2},{"$f":"IFERROR((M14*F14),\"\")","v":10},null,{"$f":"VLOOKUP(A14,GDEBASE,8,0)","v":"BAKER MA"}]
["Cheddar tranché (dose : 3 demi T =30g)",null,null,null,null,5,1,"pièce",0,1,{"$f":"IFERROR((J15*F15),\"\")","v":5},null,{"$f":"IFERROR((ROUNDUP((J15*$H$3),2)),\"\")","v":2},{"$f":"IFERROR((M15*F15),\"\")","v":10},null,"LOBET"]
["Jambon blanc SELECTION / La Tranche",null,null,null,null,5,0.75,"pièce",0,0.75,{"$f":"IFERROR((J16*F16),\"\")","v":3.75},null,1.5,7.5,null,"VT FOOD"]
["Mascarpone",null,null,null,null,5,0.02,"kg",0,0.02,{"$f":"IFERROR((J17*F17),\"\")","v":0.1},null,0.04,0.2,null,"LOBET"]
["salade roquette botte dose dwich (5g)",null,null,null,null,5,1,"pièce",0.1,1.1000000000000001,5.5,null,2.2000000000000002,11,null,"JOSA"]
["Tomate fraiche",null,null,null,null,5,0.04,"kg",0.2,4.8000000000000001E-2,{"$f":"IFERROR((J19*F19),\"\")","v":0.24},null,9.9999999999999992E-2,0.49999999999999994,null,"JOSA"]
[null,null,null,null,null,0,null,"","","","",null,"","",null,0]
[null,null,null,null,null,0,null,"","","","",null,"","",null,0]
[null,null,null,null,null,0,null,"","","","",null,"","",null,0]
[null,null,null,null,null,0,null,"","","","",null,"","",null,0]
[null,null,null,null,null,0,null,"","","","",null,"","",null,0]
[null,null,null,null,null,0,null,"","","","",null,"","",null,0]
[null,null,null,null,null,0,null,"","","","",null,"","",null,0]
[null,null,null,null,null,0,null,"","","","",null,"","",null,0]
[null,null,null,null,null,0,null,"","","","",null,"","",null,0]
[null,null,null,null,null,0,null,"","","","",null,"","",null,0]
[null,"Emballage",null,null,"Qte","price","prix U","Emballage",null,null,null,null,"Qte","price","prix U"]
[1,"#pack DWICH ToGo",null,null,1,{"$f":"VLOOKUP(B31,PRIXE,2,0)","v":0.01},{"$f":"E31*F31","v":0.01},3,"#pack DWICH Sp",null,null,null,1,{"$f":"VLOOKUP(I31,PRIXE,2,0)","v":0.01},{"$f":"M31*N31","v":0.01}]
[2,0,null,null,1,{"$f":"VLOOKUP(B32,PRIXE,2,0)","v":0},{"$f":"E32*F32","v":0},4,0,null,null,null,null,{"$f":"VLOOKUP(I32,PRIXE,2,0)","v":0},{"$f":"M32*N32","v":0}]
["Etape de la recette"]
[1,null,null,null,null,null,11]
[2,null,null,null,null,null,12]
[3,null,null,null,null,null,13]
[4,null,null,null,null,null,14]
[5,null,null,null,null,null,15]
[6,null,null,null,null,null,16]
[7,null,null,null,null,null,"CALORIES (kcal)",null,null,{"$f":"K41+K42+K43+O41","v":0}]
[8,null,null,null,null,null,"Protéines (g)",null,null,null,{"$f":"J41*4","v":0},"Fibres (g)",null,null,{"$f":"N41*2","v":0}]
[9,null,null,null,null,null,"Lipides (g)",null,null,null,{"$f":"J42*9","v":0},"AGSaturés (g)"]
[10,null,null,null,null,null,"Glucides (g)",null,null,null,{"$f":"J43*4","v":0}]
["Forme & Dimension : "]
[]
["Cuisson & dressage :"]
[]
["Liste des allergènes  :"]
[null,"GLUTEN",null,"GLUCOSE",null,null,"GRAINES",null,null,"CÉLERI",null,null,"CRUSTACÉS"]
[null,"LACTOSE / DAIRY",null,"ARACHIDE",null,null,"FRUITS À COQUE",null,null,"SULFITES",null,null,"POISSON"]
[null,"OEUF",null,"MOUTARDE",null,null,"SOJA",null,null,"PORC",null,null,"VIANDE"]
[]
[]
[]
[]
[]
[null,"COMMANDE",null,"pour",null,{"$f":"H3","v":2},{"$f":"CONCATENATE(A1, F1,G1)","v":"FOCACCIA  :  CHEVRE"}]
[]
[null,"qte","unité","liste",null,null,null,null,"price",null,null,null,"Total"]
[null,{"$f":"M14","v":2},{"$f":"H14","v":"pièce"},{"$f":"A14","v":"MB FOCCACIA ORIGAN PETITE (170g)"},null,null,null,null,{"$f":"F14","v":5},null,null,null,{"$f":"N14","v":10}]
[null,2,"pièce",{"$f":"A15","v":"Cheddar tranché (dose : 3 demi T =30g)"},null,null,null,null,{"$f":"F15","v":5},null,null,null,10]
[null,1.5,"pièce","Jambon blanc SELECTION / La Tranche",null,null,null,null,5,null,null,null,7.5]
[null,0.04,"kg","Mascarpone",null,null,null,null,5,null,null,null,0.2]
[null,2.2000000000000002,"pièce","salade roquette botte dose dwich (5g)",null,null,null,null,5,null,null,null,11]
[null,9.9999999999999992E-2,"kg","Tomate fraiche",null,null,null,null,5,null,null,null,0.49999999999999994]
[null,"","",0,null,null,null,null,0,null,null,null,""]
[null,"","",0,null,null,null,null,0,null,null,null,""]
[null,"","",0,null,null,null,null,0,null,null,null,""]
[null,"","",0,null,null,null,null,0,null,null,null,""]
[null,"","",0,null,null,null,null,0,null,null,null,""]
[null,"","",0,null,null,null,null,0,null,null,null,""]
[null,"","",0,null,null,null,null,0,null,null,null,""]
[null,"","",0,null,null,null,null,0,null,null,null,""]
[null,"","",0,null,null,null,null,0,null,null,null,""]
[null,"","",{"$f":"B29","v":0},null,null,null,null,0,null,null,null,""]
[null,null,null,null,null,null,null,null,null,null,null,null,{"$f":"SUM(M60:M75)","v":39.200000000000003}]

{"sheet":"05 FOCACCIA parme","index":18,"n_rows":76,"n_cols":16,"rows_kept":76,"cut":false,"hidden":false,"merged":[[73,3,73,7],[73,8,73,9],[74,8,74,9],[75,12,75,13],[70,3,70,7],[70,8,70,9],[71,3,71,7],[71,8,71,9],[72,3,72,7],[72,8,72,9],[67,3,67,7],[67,8,67,9],[68,3,68,7],[68,8,68,9],[69,3,69,7],[69,8,69,9],[64,3,64,7],[64,8,64,9],[65,3,65,7],[65,8,65,9],[66,3,66,7],[66,8,66,9],[61,3,61,7],[61,8,61,9],[62,3,62,7],[62,8,62,9],[63,3,63,7],[63,8,63,9],[56,3,56,4],[56,6,56,14],[59,3,59,7],[59,8,59,9],[60,3,60,7],[60,8,60,9],[49,3,49,4],[49,6,49,7],[49,9,49,10],[49,12,49,13],[50,3,50,4],[50,6,50,7],[50,9,50,10],[50,12,50,13],[46,0,46,14],[47,0,47,14],[48,3,48,4],[48,6,48,7],[48,9,48,10],[48,12,48,13],[42,1,42,5],[42,6,42,8],[42,11,42,12],[43,0,43,14],[44,0,44,14],[45,0,45,14],[40,1,40,5],[40,6,40,8],[40,11,40,12],[41,1,41,5],[41,6,41,8],[41,11,41,12],[37,1,37,5],[37,7,37,14],[38,1,38,5],[38,7,38,14],[39,1,39,5],[39,6,39,8],[39,9,39,10],[39,11,39,14],[34,1,34,5],[34,7,34,14],[35,1,35,5],[35,7,35,14],[36,1,36,5],[36,7,36,14],[30,1,30,3],[30,8,30,11],[31,1,31,3],[31,8,31,11],[33,1,33,5],[33,7,33,14],[27,0,27,3],[27,13,27,14],[28,0,28,3],[28,13,28,14],[29,1,29,3],[29,7,29,11],[24,0,24,3],[24,13,24,14],[25,0,25,3],[25,13,25,14],[26,0,26,3],[26,13,26,14],[21,0,21,3],[21,13,21,14],[22,0,22,3],[22,13,22,14],[23,0,23,3],[23,13,23,14],[19,0,19,3],[19,13,19,14],[20,0,20,3],[20,13,20,14],[15,0,15,3],[15,13,15,14],[16,0,16,3],[16,13,16,14],[17,0,17,3],[17,13,17,14],[14,0,14,3],[14,13,14,14],[7,10,8,10],[8,0,8,1],[10,0,10,1],[10,13,10,14],[11,1,11,4],[11,13,11,14],[18,0,18,3],[18,13,18,14],[0,0,0,4],[0,6,0,12],[0,13,0,14],[2,4,2,6],[5,10,6,10],[6,0,6,1],[12,3,12,4],[12,13,12,14],[13,0,13,3],[13,13,13,14]]}
["FOCACCIA",null,null,null,null,"  :  ","PARME",null,null,null,null,null,null,"150 grs"]
[]
["RECETTE PREVUE POUR  : ",null,1,null,"Vous la dupliquez pour : ",null,null,2]
[]
["Prix de revient unitaire : ",null,{"$f":"K12","v":25.7195},null,null,"marge","coef","tva","ht",null,"ttc"]
[null,null,null,null,null,null,null,null,null,null,6]
["avec emballage : ",null,{"$f":"C5+C9","v":25.729500000000002},{"$f":"C5+C11","v":25.729500000000002},null,{"$f":"I7-C7","v":-20.069122641509438},{"$f":"I7/C7","v":0.21999562208712045},"ES 6",{"$f":"K6/1.06","v":5.6603773584905657},"ToGo"]
[null,null,null,null,null,null,null,null,null,null,6]
["Emballage ToGo :",null,{"$f":"G31+G32","v":0.01},{"$f":"C9/C7","v":3.8865893235391283E-4},null,{"$f":"I9-D7","v":-20.372357142857144},{"$f":"I9/D7","v":0.20821014233245327},"ES 12",{"$f":"K8/1.12","v":5.3571428571428568},"Sp"]
[]
["Emballage Sp  :",null,{"$f":"O31+O32","v":0.01},{"$f":"C11/D7","v":3.8865893235391283E-4},null,"Prix kg/l / unité","Poids brut recette","Unité","% perte","brut 1 part","Cout 1 part","prix de revient","brut à faire","prix de revient"]
[0,"Produits",null,null,null,"ht",null,null,null,null,{"$f":"SUM(K14:K29)","v":25.7195},{"$f":"K12*H3","v":51.439},null,{"$f":"SUM(N14:O29)","v":51.5},null,"FOURNISSEUR"]
[]
["MB FOCCACIA OLIVE PETITE (170g)",null,null,null,null,{"$f":"VLOOKUP(A14,PRIXINGRE,3,0)","v":5},1,{"$f":"IFERROR(VLOOKUP(A14,UNITINGRE,2,0),\"\")","v":"pièce"},{"$f":"IFERROR(VLOOKUP(A14,UNITINGRE,10,0),\"\")","v":0},{"$f":"IFERROR((G14/$C$3)+(((G14/$C$3)*I14)),\"\")","v":1},{"$f":"IFERROR((J14*F14),\"\")","v":5},null,{"$f":"IFERROR((ROUNDUP((J14*$H$3),2)),\"\")","v":2},{"$f":"IFERROR((M14*F14),\"\")","v":10},null,{"$f":"VLOOKUP(A14,GDEBASE,8,0)","v":"BAKER MA"}]
["Pesto verde",null,null,null,null,5,0.03,"kg",0.03,3.09E-2,{"$f":"IFERROR((J15*F15),\"\")","v":0.1545},null,{"$f":"IFERROR((ROUNDUP((J15*$H$3),2)),\"\")","v":6.9999999999999993E-2},{"$f":"IFERROR((M15*F15),\"\")","v":0.35},null,"VT FOOD"]
["Aubergines huile d'olive 1Tranche",null,null,null,null,5,1,"pièce",0,1,{"$f":"IFERROR((J16*F16),\"\")","v":5},null,2,10,null,"CIABATTA MANIA"]
["jambon de parme / espagnol La Tranche",null,null,null,null,5,2,"pièce",0,2,{"$f":"IFERROR((J17*F17),\"\")","v":10},null,4,20,null,"VT FOOD"]
["salade roquette botte dose dwich (5g)",null,null,null,null,5,1,"pièce",0.1,1.1000000000000001,5.5,null,2.2000000000000002,11,null,"JOSA"]
["Tomates confites VT FOOD",null,null,null,null,5,0.01,"kg",0.3,1.3000000000000001E-2,{"$f":"IFERROR((J19*F19),\"\")","v":6.5000000000000002E-2},null,0.03,0.15,null,"VT FOOD"]
[null,null,null,null,null,0,null,"","","","",null,"","",null,0]
[null,null,null,null,null,0,null,"","","","",null,"","",null,0]
[null,null,null,null,null,0,null,"","","","",null,"","",null,0]
[null,null,null,null,null,0,null,"","","","",null,"","",null,0]
[null,null,null,null,null,0,null,"","","","",null,"","",null,0]
[null,null,null,null,null,0,null,"","","","",null,"","",null,0]
[null,null,null,null,null,0,null,"","","","",null,"","",null,0]
[null,null,null,null,null,0,null,"","","","",null,"","",null,0]
[null,null,null,null,null,0,null,"","","","",null,"","",null,0]
[null,null,null,null,null,0,null,"","","","",null,"","",null,0]
[null,"Emballage TOGO",null,null,"Qte","price","prix U","Emballage SUR PLACE",null,null,null,null,"Qte","price","prix U"]
[1,"#pack DWICH ToGo",null,null,1,{"$f":"VLOOKUP(B31,PRIXE,2,0)","v":0.01},{"$f":"E31*F31","v":0.01},3,"#pack DWICH Sp",null,null,null,1,{"$f":"VLOOKUP(I31,PRIXE,2,0)","v":0.01},{"$f":"M31*N31","v":0.01}]
[2,0,null,null,1,{"$f":"VLOOKUP(B32,PRIXE,2,0)","v":0},{"$f":"E32*F32","v":0},4,0,null,null,null,null,{"$f":"VLOOKUP(I32,PRIXE,2,0)","v":0},{"$f":"M32*N32","v":0}]
["Etape de la recette"]
[1,null,null,null,null,null,11]
[2,null,null,null,null,null,12]
[3,null,null,null,null,null,13]
[4,null,null,null,null,null,14]
[5,null,null,null,null,null,15]
[6,null,null,null,null,null,16]
[7,null,null,null,null,null,"CALORIES (kcal)",null,null,{"$f":"K41+K42+K43+O41","v":0}]
[8,null,null,null,null,null,"Protéines (g)",null,null,null,{"$f":"J41*4","v":0},"Fibres (g)",null,null,{"$f":"N41*2","v":0}]
[9,null,null,null,null,null,"Lipides (g)",null,null,null,{"$f":"J42*9","v":0},"AGSaturés (g)"]
[10,null,null,null,null,null,"Glucides (g)",null,null,null,{"$f":"J43*4","v":0}]
["Forme & Dimension : "]
[]
["Cuisson & dressage :"]
[]
["Liste des allergènes  :"]
[null,"GLUTEN",null,"GLUCOSE",null,null,"GRAINES",null,null,"CÉLERI",null,null,"CRUSTACÉS"]
[null,"LACTOSE / DAIRY",null,"ARACHIDE",null,null,"FRUITS À COQUE",null,null,"SULFITES",null,null,"POISSON"]
[null,"OEUF",null,"MOUTARDE",null,null,"SOJA",null,null,"PORC",null,null,"VIANDE"]
[]
[]
[]
[]
[]
[null,"COMMANDE",null,"pour",null,{"$f":"H3","v":2},{"$f":"CONCATENATE(A1, F1,G1)","v":"FOCACCIA  :  PARME"}]
[]
[null,"qte","unité","liste",null,null,null,null,"price",null,null,null,"Total"]
[null,{"$f":"M14","v":2},{"$f":"H14","v":"pièce"},{"$f":"A14","v":"MB FOCCACIA OLIVE PETITE (170g)"},null,null,null,null,{"$f":"F14","v":5},null,null,null,{"$f":"N14","v":10}]
[null,6.9999999999999993E-2,"kg",{"$f":"A15","v":"Pesto verde"},null,null,null,null,{"$f":"F15","v":5},null,null,null,0.35]
[null,2,"pièce","Aubergines huile d'olive 1Tranche",null,null,null,null,5,null,null,null,10]
[null,4,"pièce","jambon de parme / espagnol La Tranche",null,null,null,null,5,null,null,null,20]
[null,2.2000000000000002,"pièce","salade roquette botte dose dwich (5g)",null,null,null,null,5,null,null,null,11]
[null,0.03,"kg","Tomates confites VT FOOD",null,null,null,null,5,null,null,null,0.15]
[null,"","",0,null,null,null,null,0,null,null,null,""]
[null,"","",0,null,null,null,null,0,null,null,null,""]
[null,"","",0,null,null,null,null,0,null,null,null,""]
[null,"","",0,null,null,null,null,0,null,null,null,""]
[null,"","",0,null,null,null,null,0,null,null,null,""]
[null,"","",0,null,null,null,null,0,null,null,null,""]
[null,"","",0,null,null,null,null,0,null,null,null,""]
[null,"","",0,null,null,null,null,0,null,null,null,""]
[null,"","",0,null,null,null,null,0,null,null,null,""]
[null,"","",{"$f":"B29","v":0},null,null,null,null,0,null,null,null,""]
[null,null,null,null,null,null,null,null,null,null,null,null,{"$f":"SUM(M60:M75)","v":51.5}]

{"sheet":"05 FOCACCIA POIVRON","index":19,"n_rows":76,"n_cols":16,"rows_kept":76,"cut":false,"hidden":false,"merged":[[0,0,0,4],[0,6,0,12],[0,13,0,14],[2,4,2,6],[5,10,6,10],[6,0,6,1],[12,3,12,4],[12,13,12,14],[13,0,13,3],[13,13,13,14],[14,0,14,3],[14,13,14,14],[7,10,8,10],[8,0,8,1],[10,0,10,1],[10,13,10,14],[11,1,11,4],[11,13,11,14],[18,0,18,3],[18,13,18,14],[19,0,19,3],[19,13,19,14],[20,0,20,3],[20,13,20,14],[15,0,15,3],[15,13,15,14],[16,0,16,3],[16,13,16,14],[17,0,17,3],[17,13,17,14],[24,0,24,3],[24,13,24,14],[25,0,25,3],[25,13,25,14],[26,0,26,3],[26,13,26,14],[21,0,21,3],[21,13,21,14],[22,0,22,3],[22,13,22,14],[23,0,23,3],[23,13,23,14],[30,1,30,3],[30,8,30,11],[31,1,31,3],[31,8,31,11],[33,1,33,5],[33,7,33,14],[27,0,27,3],[27,13,27,14],[28,0,28,3],[28,13,28,14],[29,1,29,3],[29,7,29,11],[37,1,37,5],[37,7,37,14],[38,1,38,5],[38,7,38,14],[39,1,39,5],[39,6,39,8],[39,9,39,10],[39,11,39,14],[34,1,34,5],[34,7,34,14],[35,1,35,5],[35,7,35,14],[36,1,36,5],[36,7,36,14],[42,1,42,5],[42,6,42,8],[42,11,42,12],[43,0,43,14],[44,0,44,14],[45,0,45,14],[40,1,40,5],[40,6,40,8],[40,11,40,12],[41,1,41,5],[41,6,41,8],[41,11,41,12],[49,3,49,4],[49,6,49,7],[49,9,49,10],[49,12,49,13],[50,3,50,4],[50,6,50,7],[50,9,50,10],[50,12,50,13],[46,0,46,14],[47,0,47,14],[48,3,48,4],[48,6,48,7],[48,9,48,10],[48,12,48,13],[61,3,61,7],[61,8,61,9],[62,3,62,7],[62,8,62,9],[63,3,63,7],[63,8,63,9],[56,3,56,4],[56,6,56,14],[59,3,59,7],[59,8,59,9],[60,3,60,7],[60,8,60,9],[67,3,67,7],[67,8,67,9],[68,3,68,7],[68,8,68,9],[69,3,69,7],[69,8,69,9],[64,3,64,7],[64,8,64,9],[65,3,65,7],[65,8,65,9],[66,3,66,7],[66,8,66,9],[73,3,73,7],[73,8,73,9],[74,8,74,9],[75,12,75,13],[70,3,70,7],[70,8,70,9],[71,3,71,7],[71,8,71,9],[72,3,72,7],[72,8,72,9]]}
["FOCACCIA",null,null,null,null,"  :  ","TOMATE MOZZA",null,null,null,null,null,null,"A VERIFIER"]
[]
["RECETTE PREVUE POUR  : ",null,1,null,"Vous la dupliquez pour : ",null,null,2]
[]
["Prix de revient unitaire : ",null,{"$f":"K12","v":10.15},null,null,"marge","coef","tva","ht",null,"ttc"]
[null,null,null,null,null,null,null,null,null,null,6]
["avec emballage : ",null,{"$f":"C5+C9","v":10.16},{"$f":"C5+C11","v":10.16},null,{"$f":"I7-C7","v":-4.4996226415094345},{"$f":"I7/C7","v":0.55712375575694539},"ES 6",{"$f":"K6/1.06","v":5.6603773584905657},"ToGo"]
[null,null,null,null,null,null,null,null,null,null,6]
["Emballage ToGo :",null,{"$f":"G31+G32","v":0.01},{"$f":"C9/C7","v":9.8425196850393699E-4},null,{"$f":"I9-D7","v":-4.8028571428571434},{"$f":"I9/D7","v":0.52727784026996616},"ES 12",{"$f":"K8/1.12","v":5.3571428571428568},"Sp"]
[]
["Emballage Sp  :",null,{"$f":"O31+O32","v":0.01},{"$f":"C11/D7","v":9.8425196850393699E-4},null,"Prix kg/l / unité","Poids brut recette","Unité","% perte","brut 1 part","Cout 1 part","prix de revient","brut à faire","prix de revient"]
[0,"Produits",null,null,null,"ht",null,null,null,null,{"$f":"SUM(K14:K29)","v":10.15},{"$f":"K12*H3","v":20.3},null,{"$f":"SUM(N14:O29)","v":20.3},null,"FOURNISSEUR"]
[]
["MB FOCCACIA TOMATE PETITE  (170g)",null,null,null,null,{"$f":"VLOOKUP(A14,PRIXINGRE,3,0)","v":5},1,{"$f":"IFERROR(VLOOKUP(A14,UNITINGRE,2,0),\"\")","v":"pièce"},{"$f":"IFERROR(VLOOKUP(A14,UNITINGRE,10,0),\"\")","v":0},{"$f":"IFERROR((G14/$C$3)+(((G14/$C$3)*I14)),\"\")","v":1},{"$f":"IFERROR((J14*F14),\"\")","v":5},null,{"$f":"IFERROR((ROUNDUP((J14*$H$3),2)),\"\")","v":2},{"$f":"IFERROR((M14*F14),\"\")","v":10},null,{"$f":"VLOOKUP(A14,GDEBASE,8,0)","v":"BAKER MA"}]
["Mascarpone",null,null,null,null,5,0.03,"kg",0,0.03,{"$f":"IFERROR((J15*F15),\"\")","v":0.15},null,{"$f":"IFERROR((ROUNDUP((J15*$H$3),2)),\"\")","v":0.06},{"$f":"IFERROR((M15*F15),\"\")","v":0.3},null,"LOBET"]
["poivron rouge avila (dose 50g)",null,null,null,null,5,1,"pièce","","",{"$f":"IFERROR((J16*F16),\"\")","v":""},null,"","",null,"METRO"]
["Aubergines huile d'olive 1Tranche",null,null,null,null,5,1,"pièce",0,1,{"$f":"IFERROR((J17*F17),\"\")","v":5},null,2,10,null,"CIABATTA MANIA"]
[null,null,null,null,null,0,null,"","","","",null,"","",null,0]
[null,null,null,null,null,0,null,"","","",{"$f":"IFERROR((J19*F19),\"\")","v":""},null,"","",null,0]
[null,null,null,null,null,0,null,"","","","",null,"","",null,0]
[null,null,null,null,null,0,null,"","","","",null,"","",null,0]
[null,null,null,null,null,0,null,"","","","",null,"","",null,0]
[null,null,null,null,null,0,null,"","","","",null,"","",null,0]
[null,null,null,null,null,0,null,"","","","",null,"","",null,0]
[null,null,null,null,null,0,null,"","","","",null,"","",null,0]
[null,null,null,null,null,0,null,"","","","",null,"","",null,0]
[null,null,null,null,null,0,null,"","","","",null,"","",null,0]
[null,null,null,null,null,0,null,"","","","",null,"","",null,0]
[null,null,null,null,null,0,null,"","","","",null,"","",null,0]
[null,"Emballage TOGO",null,null,"Qte","price","prix U","Emballage SUR PLACE",null,null,null,null,"Qte","price","prix U"]
[1,"#pack DWICH ToGo",null,null,1,{"$f":"VLOOKUP(B31,PRIXE,2,0)","v":0.01},{"$f":"E31*F31","v":0.01},3,"#pack DWICH Sp",null,null,null,1,{"$f":"VLOOKUP(I31,PRIXE,2,0)","v":0.01},{"$f":"M31*N31","v":0.01}]
[2,0,null,null,1,{"$f":"VLOOKUP(B32,PRIXE,2,0)","v":0},{"$f":"E32*F32","v":0},4,0,null,null,null,null,{"$f":"VLOOKUP(I32,PRIXE,2,0)","v":0},{"$f":"M32*N32","v":0}]
["Etape de la recette"]
[1,null,null,null,null,null,11]
[2,null,null,null,null,null,12]
[3,null,null,null,null,null,13]
[4,null,null,null,null,null,14]
[5,null,null,null,null,null,15]
[6,null,null,null,null,null,16]
[7,null,null,null,null,null,"CALORIES (kcal)",null,null,{"$f":"K41+K42+K43+O41","v":0}]
[8,null,null,null,null,null,"Protéines (g)",null,null,null,{"$f":"J41*4","v":0},"Fibres (g)",null,null,{"$f":"N41*2","v":0}]
[9,null,null,null,null,null,"Lipides (g)",null,null,null,{"$f":"J42*9","v":0},"AGSaturés (g)"]
[10,null,null,null,null,null,"Glucides (g)",null,null,null,{"$f":"J43*4","v":0}]
["Forme & Dimension : "]
[]
["Cuisson & dressage :"]
[]
["Liste des allergènes  :"]
[null,"GLUTEN",null,"GLUCOSE",null,null,"GRAINES",null,null,"CÉLERI",null,null,"CRUSTACÉS"]
[null,"LACTOSE / DAIRY",null,"ARACHIDE",null,null,"FRUITS À COQUE",null,null,"SULFITES",null,null,"POISSON"]
[null,"OEUF",null,"MOUTARDE",null,null,"SOJA",null,null,"PORC",null,null,"VIANDE"]
[]
[]
[]
[]
[]
[null,"COMMANDE",null,"pour",null,{"$f":"H3","v":2},{"$f":"CONCATENATE(A1, F1,G1)","v":"FOCACCIA  :  TOMATE MOZZA"}]
[]
[null,"qte","unité","liste",null,null,null,null,"price",null,null,null,"Total"]
[null,{"$f":"M14","v":2},{"$f":"H14","v":"pièce"},{"$f":"A14","v":"MB FOCCACIA TOMATE PETITE  (170g)"},null,null,null,null,{"$f":"F14","v":5},null,null,null,{"$f":"N14","v":10}]
[null,0.06,"kg",{"$f":"A15","v":"Mascarpone"},null,null,null,null,{"$f":"F15","v":5},null,null,null,0.3]
[null,"","pièce","poivron rouge avila (dose 50g)",null,null,null,null,5,null,null,null,""]
[null,2,"pièce","Aubergines huile d'olive 1Tranche",null,null,null,null,5,null,null,null,10]
[null,"","",0,null,null,null,null,0,null,null,null,""]
[null,"","",0,null,null,null,null,0,null,null,null,""]
[null,"","",0,null,null,null,null,0,null,null,null,""]
[null,"","",0,null,null,null,null,0,null,null,null,""]
[null,"","",0,null,null,null,null,0,null,null,null,""]
[null,"","",0,null,null,null,null,0,null,null,null,""]
[null,"","",0,null,null,null,null,0,null,null,null,""]
[null,"","",0,null,null,null,null,0,null,null,null,""]
[null,"","",0,null,null,null,null,0,null,null,null,""]
[null,"","",0,null,null,null,null,0,null,null,null,""]
[null,"","",0,null,null,null,null,0,null,null,null,""]
[null,"","",{"$f":"B29","v":0},null,null,null,null,0,null,null,null,""]
[null,null,null,null,null,null,null,null,null,null,null,null,{"$f":"SUM(M60:M75)","v":20.3}]

{"sheet":"05 FOCACCIA tomate mozza","index":20,"n_rows":76,"n_cols":16,"rows_kept":76,"cut":false,"hidden":false,"merged":[[73,3,73,7],[73,8,73,9],[74,8,74,9],[75,12,75,13],[70,3,70,7],[70,8,70,9],[71,3,71,7],[71,8,71,9],[72,3,72,7],[72,8,72,9],[67,3,67,7],[67,8,67,9],[68,3,68,7],[68,8,68,9],[69,3,69,7],[69,8,69,9],[64,3,64,7],[64,8,64,9],[65,3,65,7],[65,8,65,9],[66,3,66,7],[66,8,66,9],[61,3,61,7],[61,8,61,9],[62,3,62,7],[62,8,62,9],[63,3,63,7],[63,8,63,9],[56,3,56,4],[56,6,56,14],[59,3,59,7],[59,8,59,9],[60,3,60,7],[60,8,60,9],[49,3,49,4],[49,6,49,7],[49,9,49,10],[49,12,49,13],[50,3,50,4],[50,6,50,7],[50,9,50,10],[50,12,50,13],[46,0,46,14],[47,0,47,14],[48,3,48,4],[48,6,48,7],[48,9,48,10],[48,12,48,13],[42,1,42,5],[42,6,42,8],[42,11,42,12],[43,0,43,14],[44,0,44,14],[45,0,45,14],[40,1,40,5],[40,6,40,8],[40,11,40,12],[41,1,41,5],[41,6,41,8],[41,11,41,12],[37,1,37,5],[37,7,37,14],[38,1,38,5],[38,7,38,14],[39,1,39,5],[39,6,39,8],[39,9,39,10],[39,11,39,14],[34,1,34,5],[34,7,34,14],[35,1,35,5],[35,7,35,14],[36,1,36,5],[36,7,36,14],[30,1,30,3],[30,8,30,11],[31,1,31,3],[31,8,31,11],[33,1,33,5],[33,7,33,14],[27,0,27,3],[27,13,27,14],[28,0,28,3],[28,13,28,14],[29,1,29,3],[29,7,29,11],[24,0,24,3],[24,13,24,14],[25,0,25,3],[25,13,25,14],[26,0,26,3],[26,13,26,14],[21,0,21,3],[21,13,21,14],[22,0,22,3],[22,13,22,14],[23,0,23,3],[23,13,23,14],[19,0,19,3],[19,13,19,14],[20,0,20,3],[20,13,20,14],[15,0,15,3],[15,13,15,14],[16,0,16,3],[16,13,16,14],[17,0,17,3],[17,13,17,14],[14,0,14,3],[14,13,14,14],[7,10,8,10],[8,0,8,1],[10,0,10,1],[10,13,10,14],[11,1,11,4],[11,13,11,14],[18,0,18,3],[18,13,18,14],[0,0,0,4],[0,6,0,12],[0,13,0,14],[2,4,2,6],[5,10,6,10],[6,0,6,1],[12,3,12,4],[12,13,12,14],[13,0,13,3],[13,13,13,14]]}
["FOCACCIA",null,null,null,null,"  :  ","TOMATE MOZZA",null,null,null,null,null,null,"A VERIFIER"]
[]
["RECETTE PREVUE POUR  : ",null,1,null,"Vous la dupliquez pour : ",null,null,2]
[]
["Prix de revient unitaire : ",null,{"$f":"K12","v":11.384499999999999},null,null,"marge","coef","tva","ht",null,"ttc"]
[null,null,null,null,null,null,null,null,null,null,6]
["avec emballage : ",null,{"$f":"C5+C9","v":11.394499999999999},{"$f":"C5+C11","v":11.394499999999999},null,{"$f":"I7-C7","v":-5.7341226415094333},{"$f":"I7/C7","v":0.49676399653258729},"ES 6",{"$f":"K6/1.06","v":5.6603773584905657},"ToGo"]
[null,null,null,null,null,null,null,null,null,null,6]
["Emballage ToGo :",null,{"$f":"G31+G32","v":0.01},{"$f":"C9/C7","v":8.776163938742377E-4},null,{"$f":"I9-D7","v":-6.0373571428571422},{"$f":"I9/D7","v":0.47015163957548445},"ES 12",{"$f":"K8/1.12","v":5.3571428571428568},"Sp"]
[]
["Emballage Sp  :",null,{"$f":"O31+O32","v":0.01},{"$f":"C11/D7","v":8.776163938742377E-4},null,"Prix kg/l / unité","Poids brut recette","Unité","% perte","brut 1 part","Cout 1 part","prix de revient","brut à faire","prix de revient"]
[0,"Produits",null,null,null,"ht",null,null,null,null,{"$f":"SUM(K14:K29)","v":11.384499999999999},{"$f":"K12*H3","v":22.768999999999998},null,{"$f":"SUM(N14:O29)","v":22.85},null,"FOURNISSEUR"]
[]
["MB FOCCACIA OLIVE PETITE (170g)",null,null,null,null,{"$f":"VLOOKUP(A14,PRIXINGRE,3,0)","v":5},1,{"$f":"IFERROR(VLOOKUP(A14,UNITINGRE,2,0),\"\")","v":"pièce"},{"$f":"IFERROR(VLOOKUP(A14,UNITINGRE,10,0),\"\")","v":0},{"$f":"IFERROR((G14/$C$3)+(((G14/$C$3)*I14)),\"\")","v":1},{"$f":"IFERROR((J14*F14),\"\")","v":5},null,{"$f":"IFERROR((ROUNDUP((J14*$H$3),2)),\"\")","v":2},{"$f":"IFERROR((M14*F14),\"\")","v":10},null,{"$f":"VLOOKUP(A14,GDEBASE,8,0)","v":"BAKER MA"}]
["Pesto rosso",null,null,null,null,5,0.03,"kg",0.03,3.09E-2,{"$f":"IFERROR((J15*F15),\"\")","v":0.1545},null,{"$f":"IFERROR((ROUNDUP((J15*$H$3),2)),\"\")","v":6.9999999999999993E-2},{"$f":"IFERROR((M15*F15),\"\")","v":0.35},null,"METRO"]
["Tomate fraiche",null,null,null,null,5,0.08,"kg",0.2,9.6000000000000002E-2,{"$f":"IFERROR((J16*F16),\"\")","v":0.48},null,0.2,1,null,"JOSA"]
["Mozzarella  galbani (pain de 1kg)",null,null,null,null,5,0.05,"kg",0,0.05,{"$f":"IFERROR((J17*F17),\"\")","v":0.25},null,0.1,0.5,null,"LOBET"]
["salade roquette botte dose dwich (5g)",null,null,null,null,5,1,"pièce",0.1,1.1000000000000001,5.5,null,2.2000000000000002,11,null,"JOSA"]
[null,null,null,null,null,0,null,"","","",{"$f":"IFERROR((J19*F19),\"\")","v":""},null,"","",null,0]
[null,null,null,null,null,0,null,"","","","",null,"","",null,0]
[null,null,null,null,null,0,null,"","","","",null,"","",null,0]
[null,null,null,null,null,0,null,"","","","",null,"","",null,0]
[null,null,null,null,null,0,null,"","","","",null,"","",null,0]
[null,null,null,null,null,0,null,"","","","",null,"","",null,0]
[null,null,null,null,null,0,null,"","","","",null,"","",null,0]
[null,null,null,null,null,0,null,"","","","",null,"","",null,0]
[null,null,null,null,null,0,null,"","","","",null,"","",null,0]
[null,null,null,null,null,0,null,"","","","",null,"","",null,0]
[null,null,null,null,null,0,null,"","","","",null,"","",null,0]
[null,"Emballage TOGO",null,null,"Qte","price","prix U","Emballage SUR PLACE",null,null,null,null,"Qte","price","prix U"]
[1,"#pack DWICH ToGo",null,null,1,{"$f":"VLOOKUP(B31,PRIXE,2,0)","v":0.01},{"$f":"E31*F31","v":0.01},3,"#pack DWICH Sp",null,null,null,1,{"$f":"VLOOKUP(I31,PRIXE,2,0)","v":0.01},{"$f":"M31*N31","v":0.01}]
[2,0,null,null,1,{"$f":"VLOOKUP(B32,PRIXE,2,0)","v":0},{"$f":"E32*F32","v":0},4,0,null,null,null,null,{"$f":"VLOOKUP(I32,PRIXE,2,0)","v":0},{"$f":"M32*N32","v":0}]
["Etape de la recette"]
[1,null,null,null,null,null,11]
[2,null,null,null,null,null,12]
[3,null,null,null,null,null,13]
[4,null,null,null,null,null,14]
[5,null,null,null,null,null,15]
[6,null,null,null,null,null,16]
[7,null,null,null,null,null,"CALORIES (kcal)",null,null,{"$f":"K41+K42+K43+O41","v":0}]
[8,null,null,null,null,null,"Protéines (g)",null,null,null,{"$f":"J41*4","v":0},"Fibres (g)",null,null,{"$f":"N41*2","v":0}]
[9,null,null,null,null,null,"Lipides (g)",null,null,null,{"$f":"J42*9","v":0},"AGSaturés (g)"]
[10,null,null,null,null,null,"Glucides (g)",null,null,null,{"$f":"J43*4","v":0}]
["Forme & Dimension : "]
[]
["Cuisson & dressage :"]
[]
["Liste des allergènes  :"]
[null,"GLUTEN",null,"GLUCOSE",null,null,"GRAINES",null,null,"CÉLERI",null,null,"CRUSTACÉS"]
[null,"LACTOSE / DAIRY",null,"ARACHIDE",null,null,"FRUITS À COQUE",null,null,"SULFITES",null,null,"POISSON"]
[null,"OEUF",null,"MOUTARDE",null,null,"SOJA",null,null,"PORC",null,null,"VIANDE"]
[]
[]
[]
[]
[]
[null,"COMMANDE",null,"pour",null,{"$f":"H3","v":2},{"$f":"CONCATENATE(A1, F1,G1)","v":"FOCACCIA  :  TOMATE MOZZA"}]
[]
[null,"qte","unité","liste",null,null,null,null,"price",null,null,null,"Total"]
[null,{"$f":"M14","v":2},{"$f":"H14","v":"pièce"},{"$f":"A14","v":"MB FOCCACIA OLIVE PETITE (170g)"},null,null,null,null,{"$f":"F14","v":5},null,null,null,{"$f":"N14","v":10}]
[null,6.9999999999999993E-2,"kg",{"$f":"A15","v":"Pesto rosso"},null,null,null,null,{"$f":"F15","v":5},null,null,null,0.35]
[null,0.2,"kg","Tomate fraiche",null,null,null,null,5,null,null,null,1]
[null,0.1,"kg","Mozzarella  galbani (pain de 1kg)",null,null,null,null,5,null,null,null,0.5]
[null,2.2000000000000002,"pièce","salade roquette botte dose dwich (5g)",null,null,null,null,5,null,null,null,11]
[null,"","",0,null,null,null,null,0,null,null,null,""]
[null,"","",0,null,null,null,null,0,null,null,null,""]
[null,"","",0,null,null,null,null,0,null,null,null,""]
[null,"","",0,null,null,null,null,0,null,null,null,""]
[null,"","",0,null,null,null,null,0,null,null,null,""]
[null,"","",0,null,null,null,null,0,null,null,null,""]
[null,"","",0,null,null,null,null,0,null,null,null,""]
[null,"","",0,null,null,null,null,0,null,null,null,""]
[null,"","",0,null,null,null,null,0,null,null,null,""]
[null,"","",0,null,null,null,null,0,null,null,null,""]
[null,"","",{"$f":"B29","v":0},null,null,null,null,0,null,null,null,""]
[null,null,null,null,null,null,null,null,null,null,null,null,{"$f":"SUM(M60:M75)","v":22.85}]

{"sheet":"06 CIAB CHEDDAR BACON","index":21,"n_rows":74,"n_cols":16,"rows_kept":74,"cut":false,"hidden":false,"merged":[[6,0,6,1],[0,0,0,4],[0,6,0,12],[0,13,0,14],[2,4,2,6],[5,10,6,10],[13,0,13,3],[13,13,13,14],[14,0,14,3],[14,13,14,14],[15,0,15,3],[15,13,15,14],[8,0,8,1],[10,13,10,14],[11,1,11,4],[11,13,11,14],[12,3,12,4],[12,13,12,14],[7,10,8,10],[10,0,10,1],[19,0,19,3],[19,13,19,14],[20,0,20,3],[20,13,20,14],[21,0,21,3],[21,13,21,14],[16,0,16,3],[16,13,16,14],[17,0,17,3],[17,13,17,14],[18,0,18,3],[18,13,18,14],[25,0,25,3],[25,13,25,14],[26,0,26,3],[26,13,26,14],[27,0,27,3],[27,13,27,14],[22,0,22,3],[22,13,22,14],[23,0,23,3],[23,13,23,14],[24,0,24,3],[24,13,24,14],[31,1,31,3],[31,8,31,11],[33,1,33,5],[33,7,33,14],[28,0,28,3],[28,13,28,14],[29,1,29,3],[29,7,29,11],[30,1,30,3],[30,8,30,11],[48,3,48,4],[48,6,48,7],[48,9,48,10],[48,12,48,13],[34,1,34,5],[34,7,34,14],[35,1,35,5],[35,7,35,14],[36,1,36,5],[36,7,36,14],[39,6,39,8],[39,9,39,10],[39,11,39,14],[37,1,37,5],[37,7,37,14],[38,1,38,5],[38,7,38,14],[39,1,39,5],[47,0,47,14],[40,1,40,5],[41,1,41,5],[42,1,42,5],[40,6,40,8],[40,11,40,12],[41,6,41,8],[41,11,41,12],[42,6,42,8],[42,11,42,12],[43,0,43,14],[44,0,44,14],[45,0,45,14],[46,0,46,14],[73,12,73,13],[69,3,69,7],[69,8,69,9],[70,3,70,7],[70,8,70,9],[71,3,71,7],[71,8,71,9],[66,3,66,7],[66,8,66,9],[67,3,67,7],[67,8,67,9],[68,3,68,7],[68,8,68,9],[72,8,72,9],[64,3,64,7],[64,8,64,9],[65,3,65,7],[65,8,65,9],[60,3,60,7],[60,8,60,9],[61,3,61,7],[61,8,61,9],[62,3,62,7],[62,8,62,9],[49,3,49,4],[50,3,50,4],[49,6,49,7],[50,6,50,7],[49,9,49,10],[50,9,50,10],[49,12,49,13],[50,12,50,13],[63,3,63,7],[63,8,63,9],[57,3,57,7],[57,8,57,9],[58,3,58,7],[58,8,58,9],[59,3,59,7],[59,8,59,9],[51,0,51,14],[52,0,52,14],[54,3,54,4],[54,6,54,14]]}
["CIABATTA",null,null,null,null,"  :  ","Cheddar bacon",null,null,null,null,null,null,"ok"]
[]
["RECETTE PREVUE POUR  : ",null,1,null,"Vous la dupliquez pour : ",null,null,2]
[]
["Prix de revient unitaire : ",null,{"$f":"K12","v":15.445},null,null,"marge","coef","tva","ht",null,"ttc"]
[null,null,null,null,null,null,null,null,null,null,6]
["avec emballage : ",null,{"$f":"C5+C9","v":15.455},{"$f":"C5+C11","v":15.455},null,{"$f":"I7-C7","v":-9.7946226415094344},{"$f":"I7/C7","v":0.36624893940411296},"ES 6",{"$f":"K6/1.06","v":5.6603773584905657},"ToGo"]
[null,null,null,null,null,null,null,null,null,null,6]
["Emballage ToGo :",null,{"$f":"G31+G32","v":0.01},{"$f":"C9/C7","v":6.470397929472663E-4},null,{"$f":"I9-D7","v":-10.097857142857144},{"$f":"I9/D7","v":0.34662846050746404},"ES 12",{"$f":"K8/1.12","v":5.3571428571428568},"Sp"]
[]
["Emballage Sp  :",null,{"$f":"O31+O32","v":0.01},{"$f":"C11/D7","v":6.470397929472663E-4},null,"Prix kg/l / unité","Poids brut recette","Unité","% perte","brut 1 part","Cout 1 part","prix de revient","brut à faire","prix de revient"]
[0,"Produits",null,null,null,"ht",null,null,null,null,{"$f":"SUM(K14:K29)","v":15.445},{"$f":"K12*H3","v":30.89},null,{"$f":"SUM(N14:O29)","v":31},null,"FOURNISSEUR"]
[]
["MB CIABATTA",null,null,null,null,{"$f":"VLOOKUP(A14,PRIXINGRE,3,0)","v":5},1,{"$f":"IFERROR(VLOOKUP(A14,UNITINGRE,2,0),\"\")","v":"pièce"},{"$f":"IFERROR(VLOOKUP(A14,UNITINGRE,10,0),\"\")","v":0},{"$f":"IFERROR((G14/$C$3)+(((G14/$C$3)*I14)),\"\")","v":1},{"$f":"IFERROR((J14*F14),\"\")","v":5},null,{"$f":"IFERROR((ROUNDUP((J14*$H$3),2)),\"\")","v":2},{"$f":"IFERROR((M14*F14),\"\")","v":10},null,{"$f":"VLOOKUP(A14,GDEBASE,8,0)","v":"BAKER MA"}]
["Cheddar tranché (dose : 2,5 demi T =25g)",null,null,null,"3DT",5,1,"pièce",0,1,{"$f":"IFERROR((J15*F15),\"\")","v":5},null,{"$f":"IFERROR((ROUNDUP((J15*$H$3),2)),\"\")","v":2},{"$f":"IFERROR((M15*F15),\"\")","v":10},null,"LOBET"]
["Courgette vapeur 1 Tranche",null,null,null,"1T",5,1,"pièce",0,1,{"$f":"IFERROR((J16*F16),\"\")","v":5},null,2,10,null,"CIABATTA MANIA"]
["Bacon (lard fumé 2mm) tranché",null,null,null,"3T",5,0.04,"kg",0.3,5.2000000000000005E-2,{"$f":"IFERROR((J17*F17),\"\")","v":0.26},null,0.11,0.55000000000000004,null,"VT FOOD"]
["Tomate fraiche",null,null,null,"3T",5,0.03,"kg",0.2,3.5999999999999997E-2,0.18,null,0.08,0.4,null,"JOSA"]
["Origan",null,null,null,null,5,1E-3,"kg",0,1E-3,{"$f":"IFERROR((J19*F19),\"\")","v":5.0000000000000001E-3},null,0.01,0.05,null,"METRO"]
[null,null,null,null,null,0,null,"","","","",null,"","",null,0]
[null,null,null,null,null,0,null,"","","","",null,"","",null,0]
[null,null,null,null,null,0,null,"","","","",null,"","",null,0]
[null,null,null,null,null,0,null,"","","","",null,"","",null,0]
[null,null,null,null,null,0,null,"","","","",null,"","",null,0]
[null,null,null,null,null,0,null,"","","","",null,"","",null,0]
[null,null,null,null,null,0,null,"","","","",null,"","",null,0]
[null,null,null,null,null,0,null,"","","","",null,"","",null,0]
[null,null,null,null,null,0,null,"","","","",null,"","",null,0]
[null,null,null,null,null,0,null,"","","","",null,"","",null,0]
[null,"Emballage TOGO",null,null,"Qte","price","prix U","Emballage SUR PLACE",null,null,null,null,"Qte","price","prix U"]
[1,"#pack CIAB ToGo",null,null,1,{"$f":"VLOOKUP(B31,PRIXE,2,0)","v":0.01},{"$f":"E31*F31","v":0.01},3,"#pack CIAB Sp",null,null,null,1,{"$f":"VLOOKUP(I31,PRIXE,2,0)","v":0.01},{"$f":"M31*N31","v":0.01}]
[2,null,null,null,1,{"$f":"VLOOKUP(B32,PRIXE,2,0)","v":0},{"$f":"E32*F32","v":0},4,null,null,null,null,1,{"$f":"VLOOKUP(I32,PRIXE,2,0)","v":0},{"$f":"M32*N32","v":0}]
["Etape de la recette"]
[1,"Coupez une tranche et 1/2 de cheddar dans la sens de la longueur",null,null,null,null,11]
[2,"Disposez 1 tranche de courgette cuite vapeur",null,null,null,null,12]
[3,"Ajoutez 2-3 tranches de bacon",null,null,null,null,13]
[4,"Garnir de 2 fines rondelles de tomate fraiche ",null,null,null,null,14]
[5,"Parsemez d'origan sec ",null,null,null,null,15]
[6,null,null,null,null,null,16]
[7,null,null,null,null,null,"CALORIES (kcal)"]
[8,null,null,null,null,null,"Protéines (g)",null,null,null,{"$f":"J41*4","v":0},"Fibres (g)",null,null,{"$f":"N41*2","v":0}]
[9,null,null,null,null,null,"Lipides (g)",null,null,null,{"$f":"J42*9","v":0},"AGSaturés (g)"]
[10,null,null,null,null,null,"Glucides (g)",null,null,null,{"$f":"J43*4","v":0}]
["Forme & Dimension : "]
[]
["Cuisson & dressage :"]
[]
[]
[]
["Liste des allergènes  :"]
[]
[]
[]
[]
[null,"COMMANDE",null,"pour",null,{"$f":"H3","v":2},{"$f":"CONCATENATE(A1, F1,G1)","v":"CIABATTA  :  Cheddar bacon"}]
[]
[null,"qte","unité","liste",null,null,null,null,"price",null,null,null,"Total"]
[null,{"$f":"M14","v":2},{"$f":"H14","v":"pièce"},{"$f":"A14","v":"MB CIABATTA"},null,null,null,null,{"$f":"F14","v":5},null,null,null,{"$f":"N14","v":10}]
[null,2,"pièce",{"$f":"A15","v":"Cheddar tranché (dose : 2,5 demi T =25g)"},null,null,null,null,{"$f":"F15","v":5},null,null,null,10]
[null,2,"pièce","Courgette vapeur 1 Tranche",null,null,null,null,5,null,null,null,10]
[null,0.11,"kg","Bacon (lard fumé 2mm) tranché",null,null,null,null,5,null,null,null,0.55000000000000004]
[null,0.08,"kg","Tomate fraiche",null,null,null,null,5,null,null,null,0.4]
[null,0.01,"kg","Origan",null,null,null,null,5,null,null,null,0.05]
[null,"","",0,null,null,null,null,0,null,null,null,""]
[null,"","",0,null,null,null,null,0,null,null,null,""]
[null,"","",0,null,null,null,null,0,null,null,null,""]
[null,"","",0,null,null,null,null,0,null,null,null,""]
[null,"","",0,null,null,null,null,0,null,null,null,""]
[null,"","",0,null,null,null,null,0,null,null,null,""]
[null,"","",0,null,null,null,null,0,null,null,null,""]
[null,"","",0,null,null,null,null,0,null,null,null,""]
[null,"","",0,null,null,null,null,0,null,null,null,""]
[null,"","",{"$f":"B29","v":0},null,null,null,null,0,null,null,null,""]
[null,null,null,null,null,null,null,null,null,null,null,null,{"$f":"SUM(M58:M73)","v":31}]

{"sheet":"07 SAND BAGUETTE THONMAYO","index":22,"n_rows":76,"n_cols":16,"rows_kept":76,"cut":false,"hidden":false,"merged":[[0,0,0,4],[0,6,0,12],[0,13,0,14],[2,4,2,6],[5,10,6,10],[6,0,6,1],[12,3,12,4],[12,13,12,14],[13,0,13,3],[13,13,13,14],[14,0,14,3],[14,13,14,14],[7,10,8,10],[8,0,8,1],[10,0,10,1],[10,13,10,14],[11,1,11,4],[11,13,11,14],[18,0,18,3],[18,13,18,14],[19,0,19,3],[19,13,19,14],[20,0,20,3],[20,13,20,14],[15,0,15,3],[15,13,15,14],[16,0,16,3],[16,13,16,14],[17,0,17,3],[17,13,17,14],[24,0,24,3],[24,13,24,14],[25,0,25,3],[25,13,25,14],[26,0,26,3],[26,13,26,14],[21,0,21,3],[21,13,21,14],[22,0,22,3],[22,13,22,14],[23,0,23,3],[23,13,23,14],[30,1,30,3],[30,8,30,11],[31,1,31,3],[31,8,31,11],[33,1,33,5],[33,7,33,14],[27,0,27,3],[27,13,27,14],[28,0,28,3],[28,13,28,14],[29,1,29,3],[29,7,29,11],[37,1,37,5],[37,7,37,14],[38,1,38,5],[38,7,38,14],[39,1,39,5],[39,6,39,8],[39,9,39,10],[39,11,39,14],[34,1,34,5],[34,7,34,14],[35,1,35,5],[35,7,35,14],[36,1,36,5],[36,7,36,14],[42,1,42,5],[42,6,42,8],[42,11,42,12],[43,0,43,14],[44,0,44,14],[45,0,45,14],[40,1,40,5],[40,6,40,8],[40,11,40,12],[41,1,41,5],[41,6,41,8],[41,11,41,12],[49,3,49,4],[49,6,49,7],[49,9,49,10],[49,12,49,13],[50,3,50,4],[50,6,50,7],[50,9,50,10],[50,12,50,13],[46,0,46,14],[47,0,47,14],[48,3,48,4],[48,6,48,7],[48,9,48,10],[48,12,48,13],[61,3,61,7],[61,8,61,9],[62,3,62,7],[62,8,62,9],[63,3,63,7],[63,8,63,9],[56,3,56,4],[56,6,56,14],[59,3,59,7],[59,8,59,9],[60,3,60,7],[60,8,60,9],[67,3,67,7],[67,8,67,9],[68,3,68,7],[68,8,68,9],[69,3,69,7],[69,8,69,9],[64,3,64,7],[64,8,64,9],[65,3,65,7],[65,8,65,9],[66,3,66,7],[66,8,66,9],[73,3,73,7],[73,8,73,9],[74,8,74,9],[75,12,75,13],[70,3,70,7],[70,8,70,9],[71,3,71,7],[71,8,71,9],[72,3,72,7],[72,8,72,9]]}
["BAGUETTE",null,null,null,null,"  :  ","Thon mayonnaise",null,null,null,null,null,null,"150 grs"]
[]
["RECETTE PREVUE POUR  : ",null,1,null,"Vous la dupliquez pour : ",null,null,2]
[]
["Prix de revient unitaire : ",null,{"$f":"K12","v":5.4},null,null,"marge","coef","tva","ht",null,"ttc"]
[null,null,null,null,null,null,null,null,null,null,4.0999999999999996]
["avec emballage : ",null,{"$f":"C5+C9","v":5.41},{"$f":"C5+C11","v":5.41},null,{"$f":"I7-C7","v":-1.542075471698114},{"$f":"I7/C7","v":0.71495832316116192},"ES 6",{"$f":"K6/1.06","v":3.8679245283018862},"ToGo"]
[null,null,null,null,null,null,null,null,null,null,4.0999999999999996]
["Emballage ToGo :",null,{"$f":"G31+G32","v":0.01},{"$f":"C9/C7","v":1.8484288354898336E-3},null,{"$f":"I9-D7","v":-1.749285714285715},{"$f":"I9/D7","v":0.67665698442038535},"ES 12",{"$f":"K8/1.12","v":3.6607142857142851},"Sp"]
[]
["Emballage Sp  :",null,{"$f":"O31+O32","v":0.01},{"$f":"C11/D7","v":1.8484288354898336E-3},null,"Prix kg/l / unité","Poids brut recette","Unité","% perte","brut 1 part","Cout 1 part","prix de revient","brut à faire","prix de revient"]
[0,"Produits",null,null,null,"ht",null,null,null,null,{"$f":"SUM(K14:K29)","v":5.4},{"$f":"K12*H3","v":10.8},null,{"$f":"SUM(N14:O29)","v":10.8}]
[]
["MB BAGUETTE 1/2",null,null,null,null,{"$f":"VLOOKUP(A14,PRIXINGRE,3,0)","v":5},1,{"$f":"IFERROR(VLOOKUP(A14,UNITINGRE,2,0),\"\")","v":"pièce"},{"$f":"IFERROR(VLOOKUP(A14,UNITINGRE,10,0),\"\")","v":0},{"$f":"IFERROR((G14/$C$3)+(((G14/$C$3)*I14)),\"\")","v":1},{"$f":"IFERROR((J14*F14),\"\")","v":5},null,{"$f":"IFERROR((ROUNDUP((J14*$H$3),2)),\"\")","v":2},{"$f":"IFERROR((M14*F14),\"\")","v":10},null,{"$f":"VLOOKUP(A14,GDEBASE,8,0)","v":"BAKER MA"}]
["Mélange thon mayonnaise",null,null,null,null,5,0.08,"kg",0,0.08,{"$f":"IFERROR((J15*F15),\"\")","v":0.4},null,{"$f":"IFERROR((ROUNDUP((J15*$H$3),2)),\"\")","v":0.16},{"$f":"IFERROR((M15*F15),\"\")","v":0.8},null,"CIABATTA MANIA"]
[null,null,null,null,null,0,null,"","","",{"$f":"IFERROR((J16*F16),\"\")","v":""},null,"","",null,0]
[null,null,null,null,null,0,null,"","","",{"$f":"IFERROR((J17*F17),\"\")","v":""},null,"","",null,0]
[null,null,null,null,null,0,null,"","","","",null,"","",null,0]
[null,null,null,null,null,0,null,"","","",{"$f":"IFERROR((J19*F19),\"\")","v":""},null,"","",null,0]
[null,null,null,null,null,0,null,"","","","",null,"","",null,0]
[null,null,null,null,null,0,null,"","","","",null,"","",null,0]
[null,null,null,null,null,0,null,"","","","",null,"","",null,0]
[null,null,null,null,null,0,null,"","","","",null,"","",null,0]
[null,null,null,null,null,0,null,"","","","",null,"","",null,0]
[null,null,null,null,null,0,null,"","","","",null,"","",null,0]
[null,null,null,null,null,0,null,"","","","",null,"","",null,0]
[null,null,null,null,null,0,null,"","","","",null,"","",null,0]
[null,null,null,null,null,0,null,"","","","",null,"","",null,0]
[null,null,null,null,null,0,null,"","","","",null,"","",null,0]
[null,"Emballage",null,null,"Qte","price","prix U","Emballage",null,null,null,null,"Qte","price","prix U"]
[1,"#pack DWICH ToGo",null,null,1,{"$f":"VLOOKUP(B31,PRIXE,2,0)","v":0.01},{"$f":"E31*F31","v":0.01},3,"#pack DWICH Sp",null,null,null,1,{"$f":"VLOOKUP(I31,PRIXE,2,0)","v":0.01},{"$f":"M31*N31","v":0.01}]
[2,0,null,null,1,{"$f":"VLOOKUP(B32,PRIXE,2,0)","v":0},{"$f":"E32*F32","v":0},4,0,null,null,null,1,{"$f":"VLOOKUP(I32,PRIXE,2,0)","v":0},{"$f":"M32*N32","v":0}]
["Etape de la recette"]
[1,"Tartinez de mascarpone",null,null,null,null,11]
[2,"Disposez 1 tranche de gouda",null,null,null,null,12]
[3,"Ajoutez 1 tranche de jambon blanc",null,null,null,null,13]
[4,"Garnir d'une feuille de salade iceberg",null,null,null,null,14]
[5,null,null,null,null,null,15]
[6,null,null,null,null,null,16]
[7,null,null,null,null,null,"CALORIES (kcal)",null,null,{"$f":"K41+K42+K43+O41","v":0}]
[8,null,null,null,null,null,"Protéines (g)",null,null,null,{"$f":"J41*4","v":0},"Fibres (g)",null,null,{"$f":"N41*2","v":0}]
[9,null,null,null,null,null,"Lipides (g)",null,null,null,{"$f":"J42*9","v":0},"AGSaturés (g)"]
[10,null,null,null,null,null,"Glucides (g)",null,null,null,{"$f":"J43*4","v":0}]
["Forme & Dimension : "]
[]
["Cuisson & dressage :"]
[]
["Liste des allergènes  :"]
["X","GLUTEN",null,"GLUCOSE",null,null,"GRAINES",null,null,"CÉLERI",null,null,"CRUSTACÉS"]
["X","LACTOSE / DAIRY",null,"ARACHIDE",null,null,"FRUITS À COQUE",null,null,"SULFITES",null,null,"POISSON"]
[null,"OEUF",null,"MOUTARDE",null,null,"SOJA",null,null,"PORC",null,"X","VIANDE"]
[]
[]
[]
[]
[]
[null,"COMMANDE",null,"pour",null,{"$f":"H3","v":2},{"$f":"CONCATENATE(A1, F1,G1)","v":"BAGUETTE  :  Thon mayonnaise"}]
[]
[null,"qte","unité","liste",null,null,null,null,"price",null,null,null,"Total"]
[null,{"$f":"M14","v":2},{"$f":"H14","v":"pièce"},{"$f":"A14","v":"MB BAGUETTE 1/2"},null,null,null,null,{"$f":"F14","v":5},null,null,null,{"$f":"N14","v":10}]
[null,0.16,"kg",{"$f":"A15","v":"Mélange thon mayonnaise"},null,null,null,null,{"$f":"F15","v":5},null,null,null,0.8]
[null,"","",0,null,null,null,null,0,null,null,null,""]
[null,"","",0,null,null,null,null,0,null,null,null,""]
[null,"","",0,null,null,null,null,0,null,null,null,""]
[null,"","",0,null,null,null,null,0,null,null,null,""]
[null,"","",0,null,null,null,null,0,null,null,null,""]
[null,"","",0,null,null,null,null,0,null,null,null,""]
[null,"","",0,null,null,null,null,0,null,null,null,""]
[null,"","",0,null,null,null,null,0,null,null,null,""]
[null,"","",0,null,null,null,null,0,null,null,null,""]
[null,"","",0,null,null,null,null,0,null,null,null,""]
[null,"","",0,null,null,null,null,0,null,null,null,""]
[null,"","",0,null,null,null,null,0,null,null,null,""]
[null,"","",0,null,null,null,null,0,null,null,null,""]
[null,"","",{"$f":"B29","v":0},null,null,null,null,0,null,null,null,""]
[null,null,null,null,null,null,null,null,null,null,null,null,{"$f":"SUM(M60:M75)","v":10.8}]

{"sheet":"07 SAND FLUTE brie","index":23,"n_rows":72,"n_cols":16,"rows_kept":72,"cut":false,"hidden":false,"merged":[[6,0,6,1],[0,0,0,4],[0,6,0,12],[0,13,0,14],[2,4,2,6],[5,10,6,10],[12,3,12,4],[12,13,12,14],[13,0,13,3],[13,13,13,14],[14,0,14,3],[14,13,14,14],[11,1,11,4],[11,13,11,14],[8,0,8,1],[10,13,10,14],[7,10,8,10],[10,0,10,1],[18,0,18,3],[18,13,18,14],[19,0,19,3],[19,13,19,14],[20,0,20,3],[20,13,20,14],[15,0,15,3],[15,13,15,14],[16,0,16,3],[16,13,16,14],[17,0,17,3],[17,13,17,14],[24,0,24,3],[24,13,24,14],[25,0,25,3],[25,13,25,14],[26,0,26,3],[26,13,26,14],[21,0,21,3],[21,13,21,14],[22,0,22,3],[22,13,22,14],[23,0,23,3],[23,13,23,14],[30,1,30,3],[30,8,30,11],[31,1,31,3],[31,8,31,11],[33,1,33,5],[33,7,33,14],[27,0,27,3],[27,13,27,14],[28,0,28,3],[28,13,28,14],[29,1,29,3],[29,7,29,11],[37,1,37,5],[37,7,37,14],[38,1,38,5],[38,7,38,14],[39,1,39,5],[39,6,39,8],[39,9,39,10],[39,11,39,14],[34,1,34,5],[34,7,34,14],[35,1,35,5],[35,7,35,14],[36,1,36,5],[36,7,36,14],[42,1,42,5],[42,6,42,8],[42,11,42,12],[43,0,43,14],[44,0,44,14],[45,0,45,14],[40,1,40,5],[40,6,40,8],[40,11,40,12],[41,1,41,5],[41,6,41,8],[41,11,41,12],[55,3,55,7],[55,8,55,9],[56,3,56,7],[56,8,56,9],[57,3,57,7],[57,8,57,9],[46,0,46,14],[47,0,47,14],[52,3,52,4],[52,6,52,14],[48,3,48,4],[48,6,48,7],[48,9,48,10],[48,12,48,13],[49,3,49,4],[49,6,49,7],[49,9,49,10],[49,12,49,13],[50,3,50,4],[50,6,50,7],[50,9,50,10],[50,12,50,13],[70,8,70,9],[71,12,71,13],[67,3,67,7],[67,8,67,9],[68,3,68,7],[68,8,68,9],[69,3,69,7],[69,8,69,9],[64,3,64,7],[64,8,64,9],[65,3,65,7],[65,8,65,9],[66,3,66,7],[66,8,66,9],[61,3,61,7],[61,8,61,9],[62,3,62,7],[62,8,62,9],[63,3,63,7],[63,8,63,9],[58,3,58,7],[58,8,58,9],[59,3,59,7],[59,8,59,9],[60,3,60,7],[60,8,60,9]]}
["Flute noix raisin",null,null,null,null,"  :  ","Brie de Meaux",null,null,null,null,null,null,"150 grs"]
[]
["RECETTE PREVUE POUR  : ",null,1,null,"Vous la dupliquez pour : ",null,null,2]
[]
["Prix de revient unitaire : ",null,{"$f":"K12","v":5.3},null,null,"marge","coef","tva","ht",null,"ttc"]
[null,null,null,null,null,null,null,null,null,null,4]
["avec emballage : ",null,{"$f":"C5+C9","v":5.31},{"$f":"C5+C11","v":5.31},null,{"$f":"I7-C7","v":-1.5364150943396226},{"$f":"I7/C7","v":0.71065629108481676},"ES 6",{"$f":"K6/1.06","v":3.773584905660377},"ToGo"]
[null,null,null,null,null,null,null,null,null,null,4]
["Emballage ToGo :",null,{"$f":"G31+G32","v":0.01},{"$f":"C9/C7","v":1.8832391713747647E-3},null,{"$f":"I9-D7","v":-1.7385714285714284},{"$f":"I9/D7","v":0.67258541834813024},"ES 12",{"$f":"K8/1.12","v":3.5714285714285712},"Sp"]
[]
["Emballage Sp  :",null,{"$f":"O31+O32","v":0.01},{"$f":"C11/D7","v":1.8832391713747647E-3},null,"Prix kg/l / unité","Poids brut recette","Unité","% perte","brut 1 part","Cout 1 part","prix de revient","brut à faire","prix de revient"]
[0,"Produits",null,null,null,"ht",null,null,null,null,{"$f":"SUM(K14:K29)","v":5.3},{"$f":"K12*H3","v":10.6},null,{"$f":"SUM(N14:O29)","v":10.6},null,"FOURNISSEUR"]
[]
["MB FLUTE AUX NOIX-RAISINS",null,null,null,null,{"$f":"VLOOKUP(A14,PRIXINGRE,3,0)","v":5},1,{"$f":"IFERROR(VLOOKUP(A14,UNITINGRE,2,0),\"\")","v":"pièce"},{"$f":"IFERROR(VLOOKUP(A14,UNITINGRE,10,0),\"\")","v":0},{"$f":"IFERROR((G14/$C$3)+(((G14/$C$3)*I14)),\"\")","v":1},{"$f":"IFERROR((J14*F14),\"\")","v":5},null,{"$f":"IFERROR((ROUNDUP((J14*$H$3),2)),\"\")","v":2},{"$f":"IFERROR((M14*F14),\"\")","v":10},null,{"$f":"VLOOKUP(A14,GDEBASE,8,0)","v":"BAKER MA"}]
["Brie de Meaux ",null,null,null,null,5,0.06,"kg",0,0.06,{"$f":"IFERROR((J15*F15),\"\")","v":0.3},null,{"$f":"IFERROR((ROUNDUP((J15*$H$3),2)),\"\")","v":0.12},{"$f":"IFERROR((M15*F15),\"\")","v":0.6},null,"LOBET"]
["roquette botte dose dwich (5g)",null,null,null,null,{"$error":"#N/A"},1,"","","",{"$f":"IFERROR((J16*F16),\"\")","v":""},null,"","",null,{"$error":"#N/A"}]
[null,null,null,null,null,0,null,"","","",{"$f":"IFERROR((J17*F17),\"\")","v":""},null,"","",null,0]
[null,null,null,null,null,0,null,"","","","",null,"","",null,0]
[null,null,null,null,null,0,null,"","","",{"$f":"IFERROR((J19*F19),\"\")","v":""},null,"","",null,0]
[null,null,null,null,null,0,null,"","","","",null,"","",null,0]
[null,null,null,null,null,0,null,"","","","",null,"","",null,0]
[null,null,null,null,null,0,null,"","","","",null,"","",null,0]
[null,null,null,null,null,0,null,"","","","",null,"","",null,0]
[null,null,null,null,null,0,null,"","","","",null,"","",null,0]
[null,null,null,null,null,0,null,"","","","",null,"","",null,0]
[null,null,null,null,null,0,null,"","","","",null,"","",null,0]
[null,null,null,null,null,0,null,"","","","",null,"","",null,0]
[null,null,null,null,null,0,null,"","","","",null,"","",null,0]
[null,null,null,null,null,0,null,"","","","",null,"","",null,0]
[null,"Emballage",null,null,"Qte","price","prix U","Emballage",null,null,null,null,"Qte","price","prix U"]
[1,"#pack DWICH ToGo",null,null,1,{"$f":"VLOOKUP(B31,PRIXE,2,0)","v":0.01},{"$f":"E31*F31","v":0.01},3,"#pack DWICH Sp",null,null,null,1,{"$f":"VLOOKUP(I31,PRIXE,2,0)","v":0.01},{"$f":"M31*N31","v":0.01}]
[2,0,null,null,1,{"$f":"VLOOKUP(B32,PRIXE,2,0)","v":0},{"$f":"E32*F32","v":0},4,0,null,null,null,1,{"$f":"VLOOKUP(I32,PRIXE,2,0)","v":0},{"$f":"M32*N32","v":0}]
["Etape de la recette"]
[1,"Disposez 1 tranche de brie sur la longueur",null,null,null,null,11]
[2,"Garnir de quelques feuilles de roquette",null,null,null,null,12]
[3,null,null,null,null,null,13]
[4,null,null,null,null,null,14]
[5,null,null,null,null,null,15]
[6,null,null,null,null,null,16]
[7,null,null,null,null,null,"CALORIES (kcal)",null,null,{"$f":"K41+K42+K43+O41","v":0}]
[8,null,null,null,null,null,"Protéines (g)",null,null,null,{"$f":"J41*4","v":0},"Fibres (g)",null,null,{"$f":"N41*2","v":0}]
[9,null,null,null,null,null,"Lipides (g)",null,null,null,{"$f":"J42*9","v":0},"AGSaturés (g)"]
[10,null,null,null,null,null,"Glucides (g)",null,null,null,{"$f":"J43*4","v":0}]
["Forme & Dimension : "]
[]
["Cuisson & dressage :"]
[]
["Liste des allergènes  :"]
["X","GLUTEN",null,"GLUCOSE",null,null,"GRAINES",null,null,"CÉLERI",null,null,"CRUSTACÉS"]
["X","LACTOSE / DAIRY",null,"ARACHIDE",null,null,"FRUITS À COQUE",null,null,"SULFITES",null,null,"POISSON"]
[null,"OEUF",null,"MOUTARDE",null,null,"SOJA",null,null,"PORC",null,null,"VIANDE"]
[]
[null,"COMMANDE",null,"pour",null,{"$f":"H3","v":2},{"$f":"CONCATENATE(A1, F1,G1)","v":"Flute noix raisin  :  Brie de Meaux"}]
[]
[null,"qte","unité","liste",null,null,null,null,"price",null,null,null,"Total"]
[null,{"$f":"M14","v":2},{"$f":"H14","v":"pièce"},{"$f":"A14","v":"MB FLUTE AUX NOIX-RAISINS"},null,null,null,null,{"$f":"F14","v":5},null,null,null,{"$f":"N14","v":10}]
[null,0.12,"kg",{"$f":"A15","v":"Brie de Meaux "},null,null,null,null,{"$f":"F15","v":5},null,null,null,0.6]
[null,"","","roquette botte dose dwich (5g)",null,null,null,null,{"$error":"#N/A"},null,null,null,""]
[null,"","",0,null,null,null,null,0,null,null,null,""]
[null,"","",0,null,null,null,null,0,null,null,null,""]
[null,"","",0,null,null,null,null,0,null,null,null,""]
[null,"","",0,null,null,null,null,0,null,null,null,""]
[null,"","",0,null,null,null,null,0,null,null,null,""]
[null,"","",0,null,null,null,null,0,null,null,null,""]
[null,"","",0,null,null,null,null,0,null,null,null,""]
[null,"","",0,null,null,null,null,0,null,null,null,""]
[null,"","",0,null,null,null,null,0,null,null,null,""]
[null,"","",0,null,null,null,null,0,null,null,null,""]
[null,"","",0,null,null,null,null,0,null,null,null,""]
[null,"","",0,null,null,null,null,0,null,null,null,""]
[null,"","",{"$f":"B29","v":0},null,null,null,null,0,null,null,null,""]
[null,null,null,null,null,null,null,null,null,null,null,null,{"$f":"SUM(M56:M71)","v":10.6}]

{"sheet":"07 SAND PAIN LAIT cheddar","index":24,"n_rows":72,"n_cols":16,"rows_kept":72,"cut":false,"hidden":false,"merged":[[69,3,69,7],[69,8,69,9],[70,8,70,9],[71,12,71,13],[66,3,66,7],[66,8,66,9],[67,3,67,7],[67,8,67,9],[68,3,68,7],[68,8,68,9],[63,3,63,7],[63,8,63,9],[64,3,64,7],[64,8,64,9],[65,3,65,7],[65,8,65,9],[60,3,60,7],[60,8,60,9],[61,3,61,7],[61,8,61,9],[62,3,62,7],[62,8,62,9],[57,3,57,7],[57,8,57,9],[58,3,58,7],[58,8,58,9],[59,3,59,7],[59,8,59,9],[52,3,52,4],[52,6,52,14],[55,3,55,7],[55,8,55,9],[56,3,56,7],[56,8,56,9],[49,3,49,4],[49,6,49,7],[49,9,49,10],[49,12,49,13],[50,3,50,4],[50,6,50,7],[50,9,50,10],[50,12,50,13],[46,0,46,14],[47,0,47,14],[48,3,48,4],[48,6,48,7],[48,9,48,10],[48,12,48,13],[42,1,42,5],[42,6,42,8],[42,11,42,12],[43,0,43,14],[44,0,44,14],[45,0,45,14],[40,1,40,5],[40,6,40,8],[40,11,40,12],[41,1,41,5],[41,6,41,8],[41,11,41,12],[37,1,37,5],[37,7,37,14],[38,1,38,5],[38,7,38,14],[39,1,39,5],[39,6,39,8],[39,9,39,10],[39,11,39,14],[34,1,34,5],[34,7,34,14],[35,1,35,5],[35,7,35,14],[36,1,36,5],[36,7,36,14],[30,1,30,3],[30,8,30,11],[31,1,31,3],[31,8,31,11],[33,1,33,5],[33,7,33,14],[27,0,27,3],[27,13,27,14],[28,0,28,3],[28,13,28,14],[29,1,29,3],[29,7,29,11],[24,0,24,3],[24,13,24,14],[25,0,25,3],[25,13,25,14],[26,0,26,3],[26,13,26,14],[21,0,21,3],[21,13,21,14],[22,0,22,3],[22,13,22,14],[23,0,23,3],[23,13,23,14],[19,0,19,3],[19,13,19,14],[20,0,20,3],[20,13,20,14],[15,0,15,3],[15,13,15,14],[16,0,16,3],[16,13,16,14],[17,0,17,3],[17,13,17,14],[14,0,14,3],[14,13,14,14],[7,10,8,10],[8,0,8,1],[10,0,10,1],[10,13,10,14],[11,1,11,4],[11,13,11,14],[18,0,18,3],[18,13,18,14],[0,0,0,4],[0,6,0,12],[0,13,0,14],[2,4,2,6],[5,10,6,10],[6,0,6,1],[12,3,12,4],[12,13,12,14],[13,0,13,3],[13,13,13,14]]}
["Pain au lait rond",null,null,null,null,"  :  ","CHEDDAR",null,null,null,null,null,null,"150 grs"]
[]
["RECETTE PREVUE POUR  : ",null,1,null,"Vous la dupliquez pour : ",null,null,2]
[]
["Prix de revient unitaire : ",null,{"$f":"K12","v":10.45},null,null,"marge","coef","tva","ht",null,"ttc"]
[null,null,null,null,null,null,null,null,null,null,3]
["avec emballage : ",null,{"$f":"C5+C9","v":10.459999999999999},{"$f":"C5+C11","v":10.459999999999999},null,{"$f":"I7-C7","v":-7.6298113207547162},{"$f":"I7/C7","v":0.27057253147660448},"ES 6",{"$f":"K6/1.06","v":2.8301886792452828},"ToGo"]
[null,null,null,null,null,null,null,null,null,null,3]
["Emballage ToGo :",null,{"$f":"G31+G32","v":0.01},{"$f":"C9/C7","v":9.5602294455066929E-4},null,{"$f":"I9-D7","v":-7.7814285714285703},{"$f":"I9/D7","v":0.25607757443321499},"ES 12",{"$f":"K8/1.12","v":2.6785714285714284},"Sp"]
[]
["Emballage Sp  :",null,{"$f":"O31+O32","v":0.01},{"$f":"C11/D7","v":9.5602294455066929E-4},null,"Prix kg/l / unité","Poids brut recette","Unité","% perte","brut 1 part","Cout 1 part","prix de revient","brut à faire","prix de revient"]
[0,"Produits",null,null,null,"ht",null,null,null,null,{"$f":"SUM(K14:K29)","v":10.45},{"$f":"K12*H3","v":20.9},null,{"$f":"SUM(N14:O29)","v":20.9},null,"FOURNISSEUR"]
[]
["MB Pain au lait ROND 80G",null,null,null,null,{"$f":"VLOOKUP(A14,PRIXINGRE,3,0)","v":5},1,{"$f":"IFERROR(VLOOKUP(A14,UNITINGRE,2,0),\"\")","v":"pièce"},{"$f":"IFERROR(VLOOKUP(A14,UNITINGRE,10,0),\"\")","v":0},{"$f":"IFERROR((G14/$C$3)+(((G14/$C$3)*I14)),\"\")","v":1},{"$f":"IFERROR((J14*F14),\"\")","v":5},null,{"$f":"IFERROR((ROUNDUP((J14*$H$3),2)),\"\")","v":2},{"$f":"IFERROR((M14*F14),\"\")","v":10},null,{"$f":"VLOOKUP(A14,GDEBASE,8,0)","v":"BAKER MA"}]
["Mascarpone",null,null,null,null,5,0.02,"kg",0,0.02,{"$f":"IFERROR((J15*F15),\"\")","v":0.1},null,{"$f":"IFERROR((ROUNDUP((J15*$H$3),2)),\"\")","v":0.04},{"$f":"IFERROR((M15*F15),\"\")","v":0.2},null,"LOBET"]
["Cheddar tranché",null,null,null,null,5,0.02,"kg",0,0.02,{"$f":"IFERROR((J16*F16),\"\")","v":0.1},null,0.04,0.2,null,"LOBET"]
["salade iceberg 1 dose dwich 20g",null,null,null,null,5,1,"pièce",0.05,1.05,{"$f":"IFERROR((J17*F17),\"\")","v":5.25},null,2.1,10.5,null,"JOSA"]
[null,null,null,null,null,0,null,"","","","",null,"","",null,0]
[null,null,null,null,null,0,null,"","","",{"$f":"IFERROR((J19*F19),\"\")","v":""},null,"","",null,0]
[null,null,null,null,null,0,null,"","","","",null,"","",null,0]
[null,null,null,null,null,0,null,"","","","",null,"","",null,0]
[null,null,null,null,null,0,null,"","","","",null,"","",null,0]
[null,null,null,null,null,0,null,"","","","",null,"","",null,0]
[null,null,null,null,null,0,null,"","","","",null,"","",null,0]
[null,null,null,null,null,0,null,"","","","",null,"","",null,0]
[null,null,null,null,null,0,null,"","","","",null,"","",null,0]
[null,null,null,null,null,0,null,"","","","",null,"","",null,0]
[null,null,null,null,null,0,null,"","","","",null,"","",null,0]
[null,null,null,null,null,0,null,"","","","",null,"","",null,0]
[null,"Emballage",null,null,"Qte","price","prix U","Emballage",null,null,null,null,"Qte","price","prix U"]
[1,"#pack DWICH ToGo",null,null,1,{"$f":"VLOOKUP(B31,PRIXE,2,0)","v":0.01},{"$f":"E31*F31","v":0.01},3,"#pack DWICH Sp",null,null,null,1,{"$f":"VLOOKUP(I31,PRIXE,2,0)","v":0.01},{"$f":"M31*N31","v":0.01}]
[2,0,null,null,1,{"$f":"VLOOKUP(B32,PRIXE,2,0)","v":0},{"$f":"E32*F32","v":0},4,0,null,null,null,1,{"$f":"VLOOKUP(I32,PRIXE,2,0)","v":0},{"$f":"M32*N32","v":0}]
["Etape de la recette"]
[1,"Tartinez de mascarpone",null,null,null,null,11]
[2,"Disposez le saumon fumé plié",null,null,null,null,12]
[3,"Parsemez d'aneth",null,null,null,null,13]
[4,null,null,null,null,null,14]
[5,null,null,null,null,null,15]
[6,null,null,null,null,null,16]
[7,null,null,null,null,null,"CALORIES (kcal)",null,null,{"$f":"K41+K42+K43+O41","v":0}]
[8,null,null,null,null,null,"Protéines (g)",null,null,null,{"$f":"J41*4","v":0},"Fibres (g)",null,null,{"$f":"N41*2","v":0}]
[9,null,null,null,null,null,"Lipides (g)",null,null,null,{"$f":"J42*9","v":0},"AGSaturés (g)"]
[10,null,null,null,null,null,"Glucides (g)",null,null,null,{"$f":"J43*4","v":0}]
["Forme & Dimension : "]
[]
["Cuisson & dressage :"]
[]
["Liste des allergènes  :"]
[null,"GLUTEN",null,"GLUCOSE",null,null,"GRAINES",null,null,"CÉLERI",null,null,"CRUSTACÉS"]
[null,"LACTOSE / DAIRY",null,"ARACHIDE",null,null,"FRUITS À COQUE",null,null,"SULFITES",null,null,"POISSON"]
[null,"OEUF",null,"MOUTARDE",null,null,"SOJA",null,null,"PORC",null,null,"VIANDE"]
[]
[null,"COMMANDE",null,"pour",null,{"$f":"H3","v":2},{"$f":"CONCATENATE(A1, F1,G1)","v":"Pain au lait rond  :  CHEDDAR"}]
[]
[null,"qte","unité","liste",null,null,null,null,"price",null,null,null,"Total"]
[null,{"$f":"M14","v":2},{"$f":"H14","v":"pièce"},{"$f":"A14","v":"MB Pain au lait ROND 80G"},null,null,null,null,{"$f":"F14","v":5},null,null,null,{"$f":"N14","v":10}]
[null,0.04,"kg",{"$f":"A15","v":"Mascarpone"},null,null,null,null,{"$f":"F15","v":5},null,null,null,0.2]
[null,0.04,"kg","Cheddar tranché",null,null,null,null,5,null,null,null,0.2]
[null,2.1,"pièce","salade iceberg 1 dose dwich 20g",null,null,null,null,5,null,null,null,10.5]
[null,"","",0,null,null,null,null,0,null,null,null,""]
[null,"","",0,null,null,null,null,0,null,null,null,""]
[null,"","",0,null,null,null,null,0,null,null,null,""]
[null,"","",0,null,null,null,null,0,null,null,null,""]
[null,"","",0,null,null,null,null,0,null,null,null,""]
[null,"","",0,null,null,null,null,0,null,null,null,""]
[null,"","",0,null,null,null,null,0,null,null,null,""]
[null,"","",0,null,null,null,null,0,null,null,null,""]
[null,"","",0,null,null,null,null,0,null,null,null,""]
[null,"","",0,null,null,null,null,0,null,null,null,""]
[null,"","",0,null,null,null,null,0,null,null,null,""]
[null,"","",{"$f":"B29","v":0},null,null,null,null,0,null,null,null,""]
[null,null,null,null,null,null,null,null,null,null,null,null,{"$f":"SUM(M56:M71)","v":20.9}]

{"sheet":"08 Cheesecake Phil spéculoos","index":25,"n_rows":72,"n_cols":16,"rows_kept":72,"cut":false,"hidden":false,"merged":[[70,8,70,9],[71,12,71,13],[67,3,67,7],[67,8,67,9],[68,3,68,7],[68,8,68,9],[69,3,69,7],[69,8,69,9],[64,3,64,7],[64,8,64,9],[65,3,65,7],[65,8,65,9],[66,3,66,7],[66,8,66,9],[61,3,61,7],[61,8,61,9],[62,3,62,7],[62,8,62,9],[63,3,63,7],[63,8,63,9],[58,3,58,7],[58,8,58,9],[59,3,59,7],[59,8,59,9],[60,3,60,7],[60,8,60,9],[55,3,55,7],[55,8,55,9],[56,3,56,7],[56,8,56,9],[57,3,57,7],[57,8,57,9],[46,0,46,14],[47,0,47,14],[52,3,52,4],[52,6,52,14],[48,3,48,4],[49,3,49,4],[50,3,50,4],[48,6,48,7],[49,6,49,7],[50,6,50,7],[48,9,48,10],[49,9,49,10],[50,9,50,10],[48,12,48,13],[49,12,49,13],[50,12,50,13],[42,1,42,5],[42,6,42,8],[42,11,42,12],[43,0,43,14],[44,0,44,14],[45,0,45,14],[40,1,40,5],[40,6,40,8],[40,11,40,12],[41,1,41,5],[41,6,41,8],[41,11,41,12],[37,1,37,5],[37,7,37,14],[38,1,38,5],[38,7,38,14],[39,1,39,5],[39,6,39,8],[39,9,39,10],[39,11,39,14],[34,1,34,5],[34,7,34,14],[35,1,35,5],[35,7,35,14],[36,1,36,5],[36,7,36,14],[30,1,30,3],[30,8,30,11],[31,1,31,3],[31,8,31,11],[33,1,33,5],[33,7,33,14],[27,0,27,3],[27,13,27,14],[28,0,28,3],[28,13,28,14],[29,1,29,3],[29,7,29,11],[24,0,24,3],[24,13,24,14],[25,0,25,3],[25,13,25,14],[26,0,26,3],[26,13,26,14],[21,0,21,3],[21,13,21,14],[22,0,22,3],[22,13,22,14],[23,0,23,3],[23,13,23,14],[20,0,20,3],[20,13,20,14],[15,0,15,3],[15,13,15,14],[16,0,16,3],[16,13,16,14],[17,0,17,3],[17,13,17,14],[18,0,18,3],[0,0,0,4],[0,6,0,12],[0,13,0,14],[2,4,2,6],[5,10,6,10],[6,0,6,1],[18,13,18,14],[19,0,19,3],[19,13,19,14],[12,3,12,4],[12,13,12,14],[13,0,13,3],[13,13,13,14],[14,0,14,3],[14,13,14,14],[7,10,8,10],[8,0,8,1],[10,0,10,1],[10,13,10,14],[11,1,11,4],[11,13,11,14]]}
["CHEESECAKE",null,null,null,null,"  :  ","SPECULOOS"]
[]
["RECETTE PREVUE POUR  : ",null,8,null,"Vous la dupliquez pour : ",null,null,2]
[]
["Prix de revient unitaire : ",null,{"$f":"K12","v":2.6999999999999997},null,null,"marge","coef","tva","ht",null,"ttc"]
[null,null,null,null,null,null,null,null,null,null,3.5]
["avec emballage : ",null,{"$f":"C5+C9","v":2.7099999999999995},{"$f":"C5+C11","v":2.7099999999999995},null,{"$f":"I7-C7","v":0.5918867924528306},{"$f":"I7/C7","v":1.2184084104991995},"ES 6",{"$f":"K6/1.06","v":3.3018867924528301},"ToGo"]
[null,null,null,null,null,null,null,null,null,null,3.5]
["Emballage ToGo :",null,{"$f":"G31+G32","v":0.01},{"$f":"C9/C7","v":3.6900369003690045E-3},null,{"$f":"I9-D7","v":0.41500000000000004},{"$f":"I9/D7","v":1.1531365313653137},"ES 12",{"$f":"K8/1.12","v":3.1249999999999996},"Sp"]
[]
["Emballage Sp  :",null,{"$f":"O31+O32","v":0.01},{"$f":"C11/D7","v":3.6900369003690045E-3},null,"Prix kg/l / unité","Poids brut recette","Unité","% perte","brut 1 part","Cout 1 part","prix de revient","brut à faire","prix de revient"]
[0,"Produits",null,null,null,"ht",null,null,null,null,{"$f":"SUM(K14:K29)","v":2.6999999999999997},{"$f":"K12*H3","v":5.3999999999999995},null,{"$f":"SUM(N14:O29)","v":5.4999999999999991},null,"FOURNISSEUR"]
[]
["Philadelphia original",null,null,null,null,{"$f":"VLOOKUP(A14,PRIXINGRE,3,0)","v":5},0.3,{"$f":"IFERROR(VLOOKUP(A14,UNITINGRE,2,0),\"\")","v":"kg"},{"$f":"IFERROR(VLOOKUP(A14,UNITINGRE,10,0),\"\")","v":0},{"$f":"G14/$C$3","v":3.7499999999999999E-2},{"$f":"J14*F14","v":0.1875},null,{"$f":"ROUNDUP((J14*$H$3),2)","v":0.08},{"$f":"M14*F14","v":0.4},null,{"$f":"VLOOKUP(A14,GDEBASE,8,0)","v":"LOBET"}]
["Sucre semoule",null,null,null,null,5,0.15,"kg",0,{"$f":"G15/$C$3","v":1.8749999999999999E-2},{"$f":"J15*F15","v":9.375E-2},null,0.04,0.2,null,"METRO"]
["Oeuf (entiers)",null,null,null,"3",5,3,"pièce",0,0.375,1.875,null,0.75,3.75,null,"LOBET"]
["Fromage blanc gras 3k",null,null,null,null,5,0.4,"kg",0,0.05,0.25,null,0.1,0.5,null,"LOBET"]
["beurre",null,null,null,null,5,0.15,"kg",0,1.8749999999999999E-2,9.375E-2,null,0.04,0.2,null,"LOBET"]
["Crème liquide",null,null,null,null,5,0.03,"Litre",0,3.7499999999999999E-3,1.8749999999999999E-2,null,0.01,0.05,null,"LOBET"]
["farine fementante",null,null,null,null,5,0.04,"kg",0,5.0000000000000001E-3,2.5000000000000001E-2,null,0.01,0.05,null,"METRO"]
["spéculoos miettes",null,null,null,null,5,0.25,"kg",0,3.125E-2,0.15625,null,6.9999999999999993E-2,0.35,null,"METRO"]
[null,null,null,null,null,0,null,"","",0,0,null,0,0,null,0]
[null,null,null,null,null,0,null,"","",0,0,null,0,0,null,0]
[null,null,null,null,null,0,null,"","",0,0,null,0,0,null,0]
[null,null,null,null,null,0,null,"","",0,0,null,0,0,null,0]
[null,null,null,null,null,0,null,"","",0,0,null,0,0,null,0]
[null,null,null,null,null,0,null,"","",0,0,null,0,0,null,0]
[null,null,null,null,null,0,null,"","",0,0,null,0,0,null,0]
[null,null,null,null,null,0,null,"","",0,0,null,0,0,null,0]
[null,"Emballage",null,null,"Qte","price","prix U","Emballage",null,null,null,null,"Qte","price","prix U"]
[1,"#pack TARTE ToGo",null,null,1,{"$f":"VLOOKUP(B31,PRIXE,2,0)","v":0.01},{"$f":"E31*F31","v":0.01},3,"#pack TARTE SP",null,null,null,1,{"$f":"VLOOKUP(I31,PRIXE,2,0)","v":0.01},{"$f":"M31*N31","v":0.01}]
[2,0,null,null,1,{"$f":"VLOOKUP(B32,PRIXE,2,0)","v":0},{"$f":"E32*F32","v":0},4,0,null,null,null,null,{"$f":"VLOOKUP(I32,PRIXE,2,0)","v":0},{"$f":"M32*N32","v":0}]
["Etape de la recette"]
[1,null,null,null,null,null,11]
[2,null,null,null,null,null,12]
[3,null,null,null,null,null,13]
[4,null,null,null,null,null,14]
[5,null,null,null,null,null,15]
[6,null,null,null,null,null,16]
[7,null,null,null,null,null,"CALORIES (kcal)",null,null,{"$f":"K41+K42+K43+O41","v":0}]
[8,null,null,null,null,null,"Protéines (g)",null,null,null,{"$f":"J41*4","v":0},"Fibres (g)",null,null,{"$f":"N41*2","v":0}]
[9,null,null,null,null,null,"Lipides (g)",null,null,null,{"$f":"J42*9","v":0},"AGSaturés (g)"]
[10,null,null,null,null,null,"Glucides (g)",null,null,null,{"$f":"J43*4","v":0}]
["Forme & Dimension : "]
[]
["Cuisson & dressage :"]
[]
[]
[]
["Liste des allergènes  :"]
[]
[]
[null,"COMMANDE",null,"pour",null,{"$f":"H3","v":2},{"$f":"CONCATENATE(A1, F1,G1)","v":"CHEESECAKE  :  SPECULOOS"}]
[]
[null,"qte","unité","liste",null,null,null,null,"price",null,null,null,"Total"]
[null,{"$f":"M14","v":0.08},{"$f":"H14","v":"kg"},{"$f":"A14","v":"Philadelphia original"},null,null,null,null,{"$f":"F14","v":5},null,null,null,{"$f":"N14","v":0.4}]
[null,0.04,"kg",{"$f":"A15","v":"Sucre semoule"},null,null,null,null,{"$f":"F15","v":5},null,null,null,0.2]
[null,0.75,"pièce","Oeuf (entiers)",null,null,null,null,5,null,null,null,3.75]
[null,0.1,"kg","Fromage blanc gras 3k",null,null,null,null,5,null,null,null,0.5]
[null,0.04,"kg","beurre",null,null,null,null,5,null,null,null,0.2]
[null,0.01,"Litre","Crème liquide",null,null,null,null,5,null,null,null,0.05]
[null,0.01,"kg","farine fementante",null,null,null,null,5,null,null,null,0.05]
[null,6.9999999999999993E-2,"kg","spéculoos miettes",null,null,null,null,5,null,null,null,0.35]
[null,0,"",0,null,null,null,null,0,null,null,null,0]
[null,0,"",0,null,null,null,null,0,null,null,null,0]
[null,0,"",0,null,null,null,null,0,null,null,null,0]
[null,0,"",0,null,null,null,null,0,null,null,null,0]
[null,0,"",0,null,null,null,null,0,null,null,null,0]
[null,0,"",0,null,null,null,null,0,null,null,null,0]
[null,0,"",0,null,null,null,null,0,null,null,null,0]
[null,0,"",{"$f":"B29","v":0},null,null,null,null,0,null,null,null,0]
[null,null,null,null,null,null,null,null,null,null,null,null,{"$f":"SUM(M56:M71)","v":5.4999999999999991}]

{"sheet":"08 FB nature","index":26,"n_rows":76,"n_cols":16,"rows_kept":76,"cut":false,"hidden":false,"merged":[[0,0,0,4],[0,6,0,12],[0,13,0,14],[2,4,2,6],[5,10,6,10],[6,0,6,1],[12,3,12,4],[12,13,12,14],[13,0,13,3],[13,13,13,14],[14,0,14,3],[14,13,14,14],[7,10,8,10],[8,0,8,1],[10,0,10,1],[10,13,10,14],[11,1,11,4],[11,13,11,14],[18,0,18,3],[18,13,18,14],[19,0,19,3],[19,13,19,14],[20,0,20,3],[20,13,20,14],[15,0,15,3],[15,13,15,14],[16,0,16,3],[16,13,16,14],[17,0,17,3],[17,13,17,14],[24,0,24,3],[24,13,24,14],[25,0,25,3],[25,13,25,14],[26,0,26,3],[26,13,26,14],[21,0,21,3],[21,13,21,14],[22,0,22,3],[22,13,22,14],[23,0,23,3],[23,13,23,14],[30,1,30,3],[30,8,30,11],[31,1,31,3],[31,8,31,11],[33,1,33,5],[33,7,33,14],[27,0,27,3],[27,13,27,14],[28,0,28,3],[28,13,28,14],[29,1,29,3],[29,7,29,11],[37,1,37,5],[37,7,37,14],[38,1,38,5],[38,7,38,14],[39,1,39,5],[39,6,39,8],[39,9,39,10],[39,11,39,14],[34,1,34,5],[34,7,34,14],[35,1,35,5],[35,7,35,14],[36,1,36,5],[36,7,36,14],[42,1,42,5],[42,6,42,8],[42,11,42,12],[43,0,43,14],[44,0,44,14],[45,0,45,14],[40,1,40,5],[40,6,40,8],[40,11,40,12],[41,1,41,5],[41,6,41,8],[41,11,41,12],[49,3,49,4],[49,6,49,7],[49,9,49,10],[49,12,49,13],[50,3,50,4],[50,6,50,7],[50,9,50,10],[50,12,50,13],[46,0,46,14],[47,0,47,14],[48,3,48,4],[48,6,48,7],[48,9,48,10],[48,12,48,13],[61,3,61,7],[61,8,61,9],[62,3,62,7],[62,8,62,9],[63,3,63,7],[63,8,63,9],[56,3,56,4],[56,6,56,14],[59,3,59,7],[59,8,59,9],[60,3,60,7],[60,8,60,9],[67,3,67,7],[67,8,67,9],[68,3,68,7],[68,8,68,9],[69,3,69,7],[69,8,69,9],[64,3,64,7],[64,8,64,9],[65,3,65,7],[65,8,65,9],[66,3,66,7],[66,8,66,9],[73,3,73,7],[73,8,73,9],[74,8,74,9],[75,12,75,13],[70,3,70,7],[70,8,70,9],[71,3,71,7],[71,8,71,9],[72,3,72,7],[72,8,72,9]]}
["FROMAGE BLANC",null,null,null,null,"  :  ","FRUITS ROUGES",null,null,null,null,null,null,"170 g"]
[]
["RECETTE PREVUE POUR  : ",null,1,null,"Vous la dupliquez pour : ",null,null,2]
[]
["Prix de revient unitaire : ",null,{"$f":"K12","v":0.85000000000000009},null,null,"marge","coef","tva","ht",null,"ttc"]
[null,null,null,null,null,null,null,null,null,null,3]
["avec emballage : ",null,{"$f":"C5+C9","v":0.8600000000000001},{"$f":"C5+C11","v":0.8600000000000001},null,{"$f":"I7-C7","v":1.9701886792452827},{"$f":"I7/C7","v":3.2909170688898635},"ES 6",{"$f":"K6/1.06","v":2.8301886792452828},"ToGo"]
[null,null,null,null,null,null,null,null,null,null,3]
["Emballage ToGo :",null,{"$f":"G31+G32","v":0.01},{"$f":"C9/C7","v":1.1627906976744184E-2},null,{"$f":"I9-D7","v":1.8185714285714283},{"$f":"I9/D7","v":3.1146179401993348},"ES 12",{"$f":"K8/1.12","v":2.6785714285714284},"Sp"]
[]
["Emballage Sp  :",null,{"$f":"O31+O32","v":0.01},{"$f":"C11/D7","v":1.1627906976744184E-2},null,"Prix kg/l / unité","Poids brut recette","Unité","% perte","brut 1 part","Cout 1 part","prix de revient","brut à faire","prix de revient"]
[0,"Produits",null,null,null,"ht",null,null,null,null,{"$f":"SUM(K14:K29)","v":0.85000000000000009},{"$f":"K12*H3","v":1.7000000000000002},null,{"$f":"SUM(N14:O29)","v":1.7000000000000002},null,"FOURNISSEUR"]
[]
["Fromage blanc gras 3k",null,null,null,null,{"$f":"VLOOKUP(A14,PRIXINGRE,3,0)","v":5},0.17,{"$f":"IFERROR(VLOOKUP(A14,UNITINGRE,2,0),\"\")","v":"kg"},{"$f":"IFERROR(VLOOKUP(A14,UNITINGRE,10,0),\"\")","v":0},{"$f":"G14/$C$3","v":0.17},{"$f":"J14*F14","v":0.85000000000000009},null,{"$f":"ROUNDUP((J14*$H$3),2)","v":0.34},{"$f":"M14*F14","v":1.7000000000000002},null,{"$f":"VLOOKUP(A14,GDEBASE,8,0)","v":"LOBET"}]
[null,null,null,null,null,0,null,"","",{"$f":"G15/$C$3","v":0},{"$f":"J15*F15","v":0},null,0,0,null,0]
[null,null,null,null,null,0,null,"","",0,0,null,0,0,null,0]
[null,null,null,null,null,0,null,"","",0,0,null,0,0,null,0]
[null,null,null,null,null,0,null,"","",0,0,null,0,0,null,0]
[null,null,null,null,null,0,null,"","",0,0,null,0,0,null,0]
[null,null,null,null,null,0,null,"","",0,0,null,0,0,null,0]
[null,null,null,null,null,0,null,"","",0,0,null,0,0,null,0]
[null,null,null,null,null,0,null,"","",0,0,null,0,0,null,0]
[null,null,null,null,null,0,null,"","",0,0,null,0,0,null,0]
[null,null,null,null,null,0,null,"","",0,0,null,0,0,null,0]
[null,null,null,null,null,0,null,"","",0,0,null,0,0,null,0]
[null,null,null,null,null,0,null,"","",0,0,null,0,0,null,0]
[null,null,null,null,null,0,null,"","",0,0,null,0,0,null,0]
[null,null,null,null,null,0,null,"","",0,0,null,0,0,null,0]
[null,null,null,null,null,0,null,"","",0,0,null,0,0,null,0]
[null,"Emballage TOGO",null,null,"Qte","price","prix U","Emballage SUR PLACE",null,null,null,null,"Qte","price","prix U"]
[1,"#pack YAOURT",null,null,1,{"$f":"VLOOKUP(B31,PRIXE,2,0)","v":0.01},{"$f":"E31*F31","v":0.01},3,"#pack YAOURT",null,null,null,1,{"$f":"VLOOKUP(I31,PRIXE,2,0)","v":0.01},{"$f":"M31*N31","v":0.01}]
[2,0,null,null,1,{"$f":"VLOOKUP(B32,PRIXE,2,0)","v":0},{"$f":"E32*F32","v":0},4,0,null,null,null,null,{"$f":"VLOOKUP(I32,PRIXE,2,0)","v":0},{"$f":"M32*N32","v":0}]
["Etape de la recette"]
[1,null,null,null,null,null,11]
[2,null,null,null,null,null,12]
[3,null,null,null,null,null,13]
[4,null,null,null,null,null,14]
[5,null,null,null,null,null,15]
[6,null,null,null,null,null,16]
[7,null,null,null,null,null,"CALORIES (kcal)",null,null,{"$f":"K41+K42+K43+O41","v":0}]
[8,null,null,null,null,null,"Protéines (g)",null,null,null,{"$f":"J41*4","v":0},"Fibres (g)",null,null,{"$f":"N41*2","v":0}]
[9,null,null,null,null,null,"Lipides (g)",null,null,null,{"$f":"J42*9","v":0},"AGSaturés (g)"]
[10,null,null,null,null,null,"Glucides (g)",null,null,null,{"$f":"J43*4","v":0}]
["Forme & Dimension : "]
[]
["Cuisson & dressage :"]
[]
["Liste des allergènes  :"]
[null,"GLUTEN",null,"GLUCOSE",null,null,"GRAINES",null,null,"CÉLERI",null,null,"CRUSTACÉS"]
[null,"LACTOSE / DAIRY",null,"ARACHIDE",null,null,"FRUITS À COQUE",null,null,"SULFITES",null,null,"POISSON"]
[null,"OEUF",null,"MOUTARDE",null,null,"SOJA",null,null,"PORC",null,null,"VIANDE"]
[]
[]
[]
[]
[]
[null,"COMMANDE",null,"pour",null,{"$f":"H3","v":2},{"$f":"CONCATENATE(A1, F1,G1)","v":"FROMAGE BLANC  :  FRUITS ROUGES"}]
[]
[null,"qte","unité","liste",null,null,null,null,"price",null,null,null,"Total"]
[null,{"$f":"M14","v":0.34},{"$f":"H14","v":"kg"},{"$f":"A14","v":"Fromage blanc gras 3k"},null,null,null,null,{"$f":"F14","v":5},null,null,null,{"$f":"N14","v":1.7000000000000002}]
[null,0,"",{"$f":"A15","v":0},null,null,null,null,{"$f":"F15","v":0},null,null,null,0]
[null,0,"",0,null,null,null,null,0,null,null,null,0]
[null,0,"",0,null,null,null,null,0,null,null,null,0]
[null,0,"",0,null,null,null,null,0,null,null,null,0]
[null,0,"",0,null,null,null,null,0,null,null,null,0]
[null,0,"",0,null,null,null,null,0,null,null,null,0]
[null,0,"",0,null,null,null,null,0,null,null,null,0]
[null,0,"",0,null,null,null,null,0,null,null,null,0]
[null,0,"",0,null,null,null,null,0,null,null,null,0]
[null,0,"",0,null,null,null,null,0,null,null,null,0]
[null,0,"",0,null,null,null,null,0,null,null,null,0]
[null,0,"",0,null,null,null,null,0,null,null,null,0]
[null,0,"",0,null,null,null,null,0,null,null,null,0]
[null,0,"",0,null,null,null,null,0,null,null,null,0]
[null,0,"",{"$f":"B29","v":0},null,null,null,null,0,null,null,null,0]
[null,null,null,null,null,null,null,null,null,null,null,null,{"$f":"SUM(M60:M75)","v":1.7000000000000002}]

{"sheet":"09 SOUPE CAROTTE","index":27,"n_rows":72,"n_cols":16,"rows_kept":72,"cut":false,"hidden":false,"merged":[[0,0,0,4],[0,6,0,12],[0,13,0,14],[2,4,2,6],[6,0,6,1],[8,0,8,1],[15,0,15,3],[15,13,15,14],[16,0,16,3],[16,13,16,14],[17,0,17,3],[17,13,17,14],[5,10,6,10],[7,10,8,10],[10,0,10,1],[14,0,14,3],[14,13,14,14],[11,1,11,4],[11,13,11,14],[10,13,10,14],[12,3,12,4],[12,13,12,14],[13,0,13,3],[13,13,13,14],[24,0,24,3],[24,13,24,14],[18,0,18,3],[18,13,18,14],[19,0,19,3],[19,13,19,14],[25,0,25,3],[25,13,25,14],[26,0,26,3],[26,13,26,14],[21,0,21,3],[21,13,21,14],[22,0,22,3],[22,13,22,14],[23,0,23,3],[23,13,23,14],[20,0,20,3],[20,13,20,14],[30,1,30,3],[30,8,30,11],[31,1,31,3],[31,8,31,11],[33,1,33,5],[33,7,33,14],[27,0,27,3],[27,13,27,14],[28,0,28,3],[28,13,28,14],[29,1,29,3],[29,7,29,11],[37,1,37,5],[37,7,37,14],[38,1,38,5],[38,7,38,14],[39,1,39,5],[39,6,39,8],[39,9,39,10],[39,11,39,14],[34,1,34,5],[34,7,34,14],[35,1,35,5],[35,7,35,14],[36,1,36,5],[36,7,36,14],[42,1,42,5],[42,6,42,8],[42,11,42,12],[43,0,43,14],[44,0,44,14],[45,0,45,14],[40,1,40,5],[40,6,40,8],[40,11,40,12],[41,1,41,5],[41,6,41,8],[41,11,41,12],[55,3,55,7],[55,8,55,9],[56,3,56,7],[56,8,56,9],[57,3,57,7],[57,8,57,9],[46,0,46,14],[47,0,47,14],[48,0,48,14],[49,0,49,14],[50,0,50,14],[52,3,52,4],[52,6,52,14],[61,3,61,7],[61,8,61,9],[62,3,62,7],[62,8,62,9],[63,3,63,7],[63,8,63,9],[58,3,58,7],[58,8,58,9],[59,3,59,7],[59,8,59,9],[60,3,60,7],[60,8,60,9],[70,8,70,9],[71,12,71,13],[67,3,67,7],[67,8,67,9],[68,3,68,7],[68,8,68,9],[69,3,69,7],[69,8,69,9],[64,3,64,7],[64,8,64,9],[65,3,65,7],[65,8,65,9],[66,3,66,7],[66,8,66,9]]}
["POTAGE",null,null,null,null,"  :  ","CAROTTE"]
[]
["RECETTE PREVUE POUR  : ",null,10,"parts","Vous la dupliquez pour : ",null,null,2]
[]
["Prix de revient unitaire : ",null,{"$f":"K12","v":3.125},null,null,"marge","coef","tva","ht",null,"ttc"]
[null,null,null,null,null,null,null,null,null,null,4]
["avec emballage : ",null,{"$f":"C5+C9","v":3.1349999999999998},{"$f":"C5+C11","v":3.1349999999999998},null,{"$f":"I7-C7","v":0.63858490566037718},{"$f":"I7/C7","v":1.2036953447082543},"ES 6",{"$f":"K6/1.06","v":3.773584905660377},"ToGo"]
[null,null,null,null,null,null,null,null,null,null,4]
["Emballage ToGo :",null,{"$f":"G31+G32","v":0.01},{"$f":"C9/C7","v":3.1897926634768745E-3},null,{"$f":"I9-D7","v":0.43642857142857139},{"$f":"I9/D7","v":1.1392116655274549},"ES 12",{"$f":"K8/1.12","v":3.5714285714285712},"Sp"]
[]
["Emballage Sp  :",null,{"$f":"O31+O32","v":0.01},{"$f":"C11/D7","v":3.1897926634768745E-3},null,"Prix kg/l / unité","Poids brut recette","Unité","% perte","brut 1 part","Cout 1 part","prix de revient","brut à faire","prix de revient"]
[0,"Produits",null,null,null,"ht",null,null,null,null,{"$f":"SUM(K14:K29)","v":3.125},{"$f":"K12*H3","v":6.25},null,{"$f":"SUM(N14:O29)","v":6.25},null,"FOURNISSEUR"]
[]
["Oignon",null,null,null,null,{"$f":"VLOOKUP(A14,PRIXINGRE,3,0)","v":5},0.2,{"$f":"IFERROR(VLOOKUP(A14,UNITINGRE,2,0),\"\")","v":"kg"},{"$f":"IFERROR(VLOOKUP(A14,UNITINGRE,10,0),\"\")","v":0.1},{"$f":"G14/$C$3","v":0.02},{"$f":"J14*F14","v":0.1},null,{"$f":"ROUNDUP((J14*$H$3),2)","v":0.04},{"$f":"M14*F14","v":0.2},null,{"$f":"VLOOKUP(A14,GDEBASE,8,0)","v":"JOSA"}]
["poireaux",null,null,null,null,5,1,"kg",0.2,{"$f":"G15/$C$3","v":0.1},{"$f":"J15*F15","v":0.5},null,0.2,1,null,"JOSA"]
["beurre",null,null,null,null,5,0.05,"kg",0,5.0000000000000001E-3,2.5000000000000001E-2,null,0.01,0.05,null,"LOBET"]
["Céleri branche",null,null,null,null,5,0.5,"kg",0.3,0.05,0.25,null,0.1,0.5,null,"JOSA"]
["Carottes",null,null,null,null,5,2,"kg",0.2,0.2,1,null,0.4,2,null,"JOSA"]
["MB GRAND PAIN LEVAIN 1 tranche",null,null,null,null,5,1,"pièce",0,0.1,0.5,null,0.2,1,null,"BAKER MA"]
["MDO cuisine",null,null,null,null,5,0.5,"h",0,0.05,0.25,null,0.1,0.5,null,"CIABATTA MANIA"]
["beurre dosette 10g",null,null,null,null,5,1,"pièce",0,0.1,0.5,null,0.2,1,null,"LOBET"]
[null,null,null,null,null,0,null,"","",0,0,null,0,0,null,0]
[null,null,null,null,null,0,null,"","",0,0,null,0,0,null,0]
[null,null,null,null,null,0,null,"","",0,0,null,0,0,null,0]
[null,null,null,null,null,0,null,"","",0,0,null,0,0,null,0]
[null,null,null,null,null,0,null,"","",0,0,null,0,0,null,0]
[null,null,null,null,null,0,null,"","",0,0,null,0,0,null,0]
[null,null,null,null,null,0,null,"","",0,0,null,0,0,null,0]
[null,null,null,null,null,0,null,"","",0,0,null,0,0,null,0]
[null,"Emballage TOGO",null,null,"Qte","price","prix U","Emballage SUR PLACE",null,null,null,null,"Qte","price","prix U"]
[1,"#pack SOUPE ToGo",null,null,1,{"$f":"VLOOKUP(B31,PRIXE,2,0)","v":0.01},{"$f":"E31*F31","v":0.01},3,"#pack SOUPE Sp",null,null,null,1,{"$f":"VLOOKUP(I31,PRIXE,2,0)","v":0.01},{"$f":"M31*N31","v":0.01}]
[2,null,null,null,1,{"$f":"VLOOKUP(B32,PRIXE,2,0)","v":0},{"$f":"E32*F32","v":0},4,null,null,null,null,1,{"$f":"VLOOKUP(I32,PRIXE,2,0)","v":0},{"$f":"M32*N32","v":0}]
["Etape de la recette"]
[1,null,null,null,null,null,11]
[2,null,null,null,null,null,12]
[3,null,null,null,null,null,13]
[4,null,null,null,null,null,14]
[5,null,null,null,null,null,15]
[6,null,null,null,null,null,16]
[7,null,null,null,null,null,"CALORIES (kcal)",null,null,{"$f":"K41+K42+K43+O41","v":0}]
[8,null,null,null,null,null,"Protéines (g)",null,null,null,{"$f":"J41*4","v":0},"Fibres (g)",null,null,{"$f":"N41*2","v":0}]
[9,null,null,null,null,null,"Lipides (g)",null,null,null,{"$f":"J42*9","v":0},"AGSaturés (g)"]
[10,null,null,null,null,null,"Glucides (g)",null,null,null,{"$f":"J43*4","v":0}]
["Forme & Dimension : "]
[]
["Cuisson & dressage :"]
[]
[]
[]
["Liste des allergènes  :"]
[]
[]
[null,"COMMANDE",null,"pour",null,{"$f":"H3","v":2},{"$f":"CONCATENATE(A1, F1,G1)","v":"POTAGE  :  CAROTTE"}]
[]
[null,"qte","unité","liste",null,null,null,null,"price",null,null,null,"Total"]
[null,{"$f":"M14","v":0.04},{"$f":"H14","v":"kg"},{"$f":"A14","v":"Oignon"},null,null,null,null,{"$f":"F14","v":5},null,null,null,{"$f":"N14","v":0.2}]
[null,0.2,"kg",{"$f":"A15","v":"poireaux"},null,null,null,null,{"$f":"F15","v":5},null,null,null,1]
[null,0.01,"kg","beurre",null,null,null,null,5,null,null,null,0.05]
[null,0.1,"kg","Céleri branche",null,null,null,null,5,null,null,null,0.5]
[null,0.4,"kg","Carottes",null,null,null,null,5,null,null,null,2]
[null,0.2,"pièce","MB GRAND PAIN LEVAIN 1 tranche",null,null,null,null,5,null,null,null,1]
[null,0.1,"h","MDO cuisine",null,null,null,null,5,null,null,null,0.5]
[null,0.2,"pièce","beurre dosette 10g",null,null,null,null,5,null,null,null,1]
[null,0,"",0,null,null,null,null,0,null,null,null,0]
[null,0,"",0,null,null,null,null,0,null,null,null,0]
[null,0,"",0,null,null,null,null,0,null,null,null,0]
[null,0,"",0,null,null,null,null,0,null,null,null,0]
[null,0,"",0,null,null,null,null,0,null,null,null,0]
[null,0,"",0,null,null,null,null,0,null,null,null,0]
[null,0,"",0,null,null,null,null,0,null,null,null,0]
[null,0,"",{"$f":"B29","v":0},null,null,null,null,0,null,null,null,0]
[null,null,null,null,null,null,null,null,null,null,null,null,{"$f":"SUM(M56:M71)","v":6.25}]

{"sheet":"09 SOUPE CHICON","index":28,"n_rows":72,"n_cols":16,"rows_kept":72,"cut":false,"hidden":false,"merged":[[70,8,70,9],[71,12,71,13],[67,3,67,7],[67,8,67,9],[68,3,68,7],[68,8,68,9],[69,3,69,7],[69,8,69,9],[64,3,64,7],[64,8,64,9],[65,3,65,7],[65,8,65,9],[66,3,66,7],[66,8,66,9],[61,3,61,7],[61,8,61,9],[62,3,62,7],[62,8,62,9],[63,3,63,7],[63,8,63,9],[58,3,58,7],[58,8,58,9],[59,3,59,7],[59,8,59,9],[60,3,60,7],[60,8,60,9],[55,3,55,7],[55,8,55,9],[56,3,56,7],[56,8,56,9],[57,3,57,7],[57,8,57,9],[46,0,46,14],[47,0,47,14],[48,0,48,14],[49,0,49,14],[50,0,50,14],[52,3,52,4],[52,6,52,14],[42,1,42,5],[42,6,42,8],[42,11,42,12],[43,0,43,14],[44,0,44,14],[45,0,45,14],[40,1,40,5],[40,6,40,8],[40,11,40,12],[41,1,41,5],[41,6,41,8],[41,11,41,12],[37,1,37,5],[37,7,37,14],[38,1,38,5],[38,7,38,14],[39,1,39,5],[39,6,39,8],[39,9,39,10],[39,11,39,14],[34,1,34,5],[34,7,34,14],[35,1,35,5],[35,7,35,14],[36,1,36,5],[36,7,36,14],[30,1,30,3],[30,8,30,11],[31,1,31,3],[31,8,31,11],[33,1,33,5],[33,7,33,14],[27,0,27,3],[27,13,27,14],[28,0,28,3],[28,13,28,14],[29,1,29,3],[29,7,29,11],[24,0,24,3],[24,13,24,14],[25,0,25,3],[25,13,25,14],[26,0,26,3],[26,13,26,14],[21,0,21,3],[21,13,21,14],[22,0,22,3],[22,13,22,14],[23,0,23,3],[23,13,23,14],[19,0,19,3],[19,13,19,14],[20,0,20,3],[20,13,20,14],[15,0,15,3],[15,13,15,14],[16,0,16,3],[16,13,16,14],[17,0,17,3],[17,13,17,14],[18,0,18,3],[18,13,18,14],[14,0,14,3],[14,13,14,14],[6,0,6,1],[0,0,0,4],[0,6,0,12],[0,13,0,14],[2,4,2,6],[5,10,6,10],[11,1,11,4],[11,13,11,14],[8,0,8,1],[10,13,10,14],[12,3,12,4],[12,13,12,14],[13,0,13,3],[13,13,13,14],[7,10,8,10],[10,0,10,1]]}
["POTAGE",null,null,null,null,"  :  ","CHICON"]
[]
["RECETTE PREVUE POUR  : ",null,10,"parts","Vous la dupliquez pour : ",null,null,2]
[]
["Prix de revient unitaire : ",null,{"$f":"K12","v":2.9583333333333335},null,null,"marge","coef","tva","ht",null,"ttc"]
[null,null,null,null,null,null,null,null,null,null,4]
["avec emballage : ",null,{"$f":"C5+C9","v":2.9683333333333333},{"$f":"C5+C11","v":2.9683333333333333},null,{"$f":"I7-C7","v":0.8052515723270437},{"$f":"I7/C7","v":1.2712807093746357},"ES 6",{"$f":"K6/1.06","v":3.773584905660377},"ToGo"]
[null,null,null,null,null,null,null,null,null,null,4]
["Emballage ToGo :",null,{"$f":"G31+G32","v":0.01},{"$f":"C9/C7","v":3.368893879842785E-3},null,{"$f":"I9-D7","v":0.60309523809523791},{"$f":"I9/D7","v":1.2031763856581374},"ES 12",{"$f":"K8/1.12","v":3.5714285714285712},"Sp"]
[]
["Emballage Sp  :",null,{"$f":"O31+O32","v":0.01},{"$f":"C11/D7","v":3.368893879842785E-3},null,"Prix kg/l / unité","Poids brut recette","Unité","% perte","brut 1 part","Cout 1 part","prix de revient","brut à faire","prix de revient"]
[0,"Produits",null,null,null,"ht",null,null,null,null,{"$f":"SUM(K14:K29)","v":2.9583333333333335},{"$f":"K12*H3","v":5.916666666666667},null,{"$f":"SUM(N14:O29)","v":5.95},null,"FOURNISSEUR"]
[]
["Oignon",null,null,null,null,{"$f":"VLOOKUP(A14,PRIXINGRE,3,0)","v":5},0.2,{"$f":"IFERROR(VLOOKUP(A14,UNITINGRE,2,0),\"\")","v":"kg"},{"$f":"IFERROR(VLOOKUP(A14,UNITINGRE,10,0),\"\")","v":0.1},{"$f":"G14/$C$3","v":0.02},{"$f":"J14*F14","v":0.1},null,{"$f":"ROUNDUP((J14*$H$3),2)","v":0.04},{"$f":"M14*F14","v":0.2},null,{"$f":"VLOOKUP(A14,GDEBASE,8,0)","v":"JOSA"}]
["poireaux",null,null,null,null,5,1,"kg",0.2,{"$f":"G15/$C$3","v":0.1},{"$f":"J15*F15","v":0.5},null,0.2,1,null,"JOSA"]
["beurre",null,null,null,null,5,0.05,"kg",0,5.0000000000000001E-3,2.5000000000000001E-2,null,0.01,0.05,null,"LOBET"]
["Céleri branche",null,null,null,null,5,0.5,"kg",0.3,0.05,0.25,null,0.1,0.5,null,"JOSA"]
["chicon",null,null,null,null,5,2,"kg",0.2,0.2,1,null,0.4,2,null,"JOSA"]
["MB GRAND PAIN LEVAIN 1 tranche",null,null,null,null,5,1,"pièce",0,0.1,0.5,null,0.2,1,null,"BAKER MA"]
["MDO cuisine",null,null,null,null,5,0.16666666666666666,"h",0,1.6666666666666666E-2,8.3333333333333329E-2,null,0.04,0.2,null,"CIABATTA MANIA"]
["beurre dosette 10g",null,null,null,null,5,1,"pièce",0,0.1,0.5,null,0.2,1,null,"LOBET"]
[null,null,null,null,null,0,null,"","",0,0,null,0,0,null,0]
[null,null,null,null,null,0,null,"","",0,0,null,0,0,null,0]
[null,null,null,null,null,0,null,"","",0,0,null,0,0,null,0]
[null,null,null,null,null,0,null,"","",0,0,null,0,0,null,0]
[null,null,null,null,null,0,null,"","",0,0,null,0,0,null,0]
[null,null,null,null,null,0,null,"","",0,0,null,0,0,null,0]
[null,null,null,null,null,0,null,"","",0,0,null,0,0,null,0]
[null,null,null,null,null,0,null,"","",0,0,null,0,0,null,0]
[null,"Emballage TOGO",null,null,"Qte","price","prix U","Emballage SUR PLACE",null,null,null,null,"Qte","price","prix U"]
[1,"#pack SOUPE ToGo",null,null,1,{"$f":"VLOOKUP(B31,PRIXE,2,0)","v":0.01},{"$f":"E31*F31","v":0.01},3,"#pack SOUPE Sp",null,null,null,1,{"$f":"VLOOKUP(I31,PRIXE,2,0)","v":0.01},{"$f":"M31*N31","v":0.01}]
[2,null,null,null,1,{"$f":"VLOOKUP(B32,PRIXE,2,0)","v":0},{"$f":"E32*F32","v":0},4,null,null,null,null,1,{"$f":"VLOOKUP(I32,PRIXE,2,0)","v":0},{"$f":"M32*N32","v":0}]
["Etape de la recette"]
[1,null,null,null,null,null,11]
[2,null,null,null,null,null,12]
[3,null,null,null,null,null,13]
[4,null,null,null,null,null,14]
[5,null,null,null,null,null,15]
[6,null,null,null,null,null,16]
[7,null,null,null,null,null,"CALORIES (kcal)",null,null,{"$f":"K41+K42+K43+O41","v":0}]
[8,null,null,null,null,null,"Protéines (g)",null,null,null,{"$f":"J41*4","v":0},"Fibres (g)",null,null,{"$f":"N41*2","v":0}]
[9,null,null,null,null,null,"Lipides (g)",null,null,null,{"$f":"J42*9","v":0},"AGSaturés (g)"]
[10,null,null,null,null,null,"Glucides (g)",null,null,null,{"$f":"J43*4","v":0}]
["Forme & Dimension : "]
[]
["Cuisson & dressage :"]
[]
[]
[]
["Liste des allergènes  :"]
[]
[]
[null,"COMMANDE",null,"pour",null,{"$f":"H3","v":2},{"$f":"CONCATENATE(A1, F1,G1)","v":"POTAGE  :  CHICON"}]
[]
[null,"qte","unité","liste",null,null,null,null,"price",null,null,null,"Total"]
[null,{"$f":"M14","v":0.04},{"$f":"H14","v":"kg"},{"$f":"A14","v":"Oignon"},null,null,null,null,{"$f":"F14","v":5},null,null,null,{"$f":"N14","v":0.2}]
[null,0.2,"kg",{"$f":"A15","v":"poireaux"},null,null,null,null,{"$f":"F15","v":5},null,null,null,1]
[null,0.01,"kg","beurre",null,null,null,null,5,null,null,null,0.05]
[null,0.1,"kg","Céleri branche",null,null,null,null,5,null,null,null,0.5]
[null,0.4,"kg","chicon",null,null,null,null,5,null,null,null,2]
[null,0.2,"pièce","MB GRAND PAIN LEVAIN 1 tranche",null,null,null,null,5,null,null,null,1]
[null,0.04,"h","MDO cuisine",null,null,null,null,5,null,null,null,0.2]
[null,0.2,"pièce","beurre dosette 10g",null,null,null,null,5,null,null,null,1]
[null,0,"",0,null,null,null,null,0,null,null,null,0]
[null,0,"",0,null,null,null,null,0,null,null,null,0]
[null,0,"",0,null,null,null,null,0,null,null,null,0]
[null,0,"",0,null,null,null,null,0,null,null,null,0]
[null,0,"",0,null,null,null,null,0,null,null,null,0]
[null,0,"",0,null,null,null,null,0,null,null,null,0]
[null,0,"",0,null,null,null,null,0,null,null,null,0]
[null,0,"",{"$f":"B29","v":0},null,null,null,null,0,null,null,null,0]
[null,null,null,null,null,null,null,null,null,null,null,null,{"$f":"SUM(M56:M71)","v":5.95}]

{"sheet":"10 JUS cherry chérie ","index":29,"n_rows":76,"n_cols":16,"rows_kept":76,"cut":false,"hidden":false,"merged":[[0,0,0,4],[0,6,0,12],[0,13,0,14],[2,4,2,6],[5,10,6,10],[6,0,6,1],[12,3,12,4],[12,13,12,14],[13,0,13,3],[13,13,13,14],[14,0,14,3],[14,13,14,14],[7,10,8,10],[8,0,8,1],[10,0,10,1],[10,13,10,14],[11,1,11,4],[11,13,11,14],[18,0,18,3],[18,13,18,14],[19,0,19,3],[19,13,19,14],[20,0,20,3],[20,13,20,14],[15,0,15,3],[15,13,15,14],[16,0,16,3],[16,13,16,14],[17,0,17,3],[17,13,17,14],[24,0,24,3],[24,13,24,14],[25,0,25,3],[25,13,25,14],[26,0,26,3],[26,13,26,14],[21,0,21,3],[21,13,21,14],[22,0,22,3],[22,13,22,14],[23,0,23,3],[23,13,23,14],[30,1,30,3],[30,8,30,11],[31,1,31,3],[31,8,31,11],[33,1,33,5],[33,7,33,14],[27,0,27,3],[27,13,27,14],[28,0,28,3],[28,13,28,14],[29,1,29,3],[29,7,29,11],[37,1,37,5],[37,7,37,14],[38,1,38,5],[38,7,38,14],[39,1,39,5],[39,6,39,8],[39,9,39,10],[39,11,39,14],[34,1,34,5],[34,7,34,14],[35,1,35,5],[35,7,35,14],[36,1,36,5],[36,7,36,14],[42,1,42,5],[42,6,42,8],[42,11,42,12],[43,0,43,14],[44,0,44,14],[45,0,45,14],[40,1,40,5],[40,6,40,8],[40,11,40,12],[41,1,41,5],[41,6,41,8],[41,11,41,12],[49,3,49,4],[49,6,49,7],[49,9,49,10],[49,12,49,13],[50,3,50,4],[50,6,50,7],[50,9,50,10],[50,12,50,13],[46,0,46,14],[47,0,47,14],[48,3,48,4],[48,6,48,7],[48,9,48,10],[48,12,48,13],[61,3,61,7],[61,8,61,9],[62,3,62,7],[62,8,62,9],[63,3,63,7],[63,8,63,9],[56,3,56,4],[56,6,56,14],[59,3,59,7],[59,8,59,9],[60,3,60,7],[60,8,60,9],[67,3,67,7],[67,8,67,9],[68,3,68,7],[68,8,68,9],[69,3,69,7],[69,8,69,9],[64,3,64,7],[64,8,64,9],[65,3,65,7],[65,8,65,9],[66,3,66,7],[66,8,66,9],[73,3,73,7],[73,8,73,9],[74,8,74,9],[75,12,75,13],[70,3,70,7],[70,8,70,9],[71,3,71,7],[71,8,71,9],[72,3,72,7],[72,8,72,9]]}
["JUS FRAIS",null,null,null,null,"  :  ","cherry chérie",null,null,null,null,null,null,"400 ml"]
[]
["RECETTE PREVUE POUR  : ",null,1,"parts","Vous la dupliquez pour : ",null,null,2]
[]
["Prix de revient unitaire : ",null,{"$f":"K12","v":10},null,null,"marge","coef","tva","ht",null,"ttc"]
[null,null,null,null,null,null,null,null,null,null,3.8]
["avec emballage : ",null,{"$f":"C5+C9","v":10.01},{"$f":"C5+C11","v":10.01},null,{"$f":"I7-C7","v":-6.4250943396226416},{"$f":"I7/C7","v":0.35813243360413172},"ES 6",{"$f":"K6/1.06","v":3.5849056603773581},"ToGo"]
[null,null,null,null,null,null,null,null,null,null,3.8]
["Emballage ToGo :",null,{"$f":"G31+G32","v":0.01},{"$f":"C9/C7","v":9.99000999000999E-4},null,{"$f":"I9-D7","v":-6.6171428571428574},{"$f":"I9/D7","v":0.33894676751819602},"ES 12",{"$f":"K8/1.12","v":3.3928571428571423},"Sp"]
[]
["Emballage Sp  :",null,{"$f":"O31+O32","v":0.01},{"$f":"C11/D7","v":9.99000999000999E-4},null,"Prix kg/l / unité","Poids brut recette","Unité","% perte","brut 1 part","Cout 1 part","prix de revient","brut à faire","prix de revient"]
[0,"Produits",null,null,null,"ht",null,null,null,null,{"$f":"SUM(K14:K29)","v":10},{"$f":"K12*H3","v":20},null,{"$f":"SUM(N14:O29)","v":20},null,"FOURNISSEUR"]
[]
["glaçon par 5",null,null,null,null,{"$f":"VLOOKUP(A14,PRIXINGRE,3,0)","v":5},1,{"$f":"IFERROR(VLOOKUP(A14,UNITINGRE,2,0),\"\")","v":"Unité"},{"$f":"IFERROR(VLOOKUP(A14,UNITINGRE,10,0),\"\")","v":0},{"$f":"G14/$C$3","v":1},{"$f":"J14*F14","v":5},null,{"$f":"ROUNDUP((J14*$H$3),2)","v":2},{"$f":"M14*F14","v":10},null,{"$f":"VLOOKUP(A14,GDEBASE,8,0)","v":"CIABATTA MANIA"}]
["pamplemousse au kilos (1 caisse = 15k)",null,null,null,null,5,0.48,"kg",0,{"$f":"G15/$C$3","v":0.48},{"$f":"J15*F15","v":2.4},null,0.96,4.8,null,"JOSA"]
["Bananes (1=177g)",null,null,null,null,5,0.5,"pièce",0,0.5,2.5,null,1,5,null,"JOSA"]
["purée de fruit cerise",null,null,null,null,5,0.02,"kg",0.05,0.02,0.1,null,0.04,0.2,null,"METRO"]
[null,null,null,null,null,0,null,"","",0,0,null,0,0,null,0]
[null,null,null,null,null,0,null,"","",0,0,null,0,0,null,0]
[null,null,null,null,null,0,null,"","",0,0,null,0,0,null,0]
[null,null,null,null,null,0,null,"","",0,0,null,0,0,null,0]
[null,null,null,null,null,0,null,"","",0,0,null,0,0,null,0]
[null,null,null,null,null,0,null,"","",0,0,null,0,0,null,0]
[null,null,null,null,null,0,null,"","",0,0,null,0,0,null,0]
[null,null,null,null,null,0,null,"","",0,0,null,0,0,null,0]
[null,null,null,null,null,0,null,"","",0,0,null,0,0,null,0]
[null,null,null,null,null,0,null,"","",0,0,null,0,0,null,0]
[null,null,null,null,null,0,null,"","",0,0,null,0,0,null,0]
[null,null,null,null,null,0,null,"","",0,0,null,0,0,null,0]
[null,"Emballage TOGO",null,null,"Qte","price","prix U","Emballage SUR PLACE",null,null,null,null,"Qte","price","prix U"]
[1,"#pack JUS",null,null,1,{"$f":"VLOOKUP(B31,PRIXE,2,0)","v":0.01},{"$f":"E31*F31","v":0.01},3,"#pack JUS",null,null,null,1,{"$f":"VLOOKUP(I31,PRIXE,2,0)","v":0.01},{"$f":"M31*N31","v":0.01}]
[2,0,null,null,1,{"$f":"VLOOKUP(B32,PRIXE,2,0)","v":0},{"$f":"E32*F32","v":0},4,0,null,null,null,null,{"$f":"VLOOKUP(I32,PRIXE,2,0)","v":0},{"$f":"M32*N32","v":0}]
["Etape de la recette"]
[1,null,null,null,null,null,11]
[2,null,null,null,null,null,12]
[3,null,null,null,null,null,13]
[4,null,null,null,null,null,14]
[5,null,null,null,null,null,15]
[6,null,null,null,null,null,16]
[7,null,null,null,null,null,"CALORIES (kcal)",null,null,{"$f":"K41+K42+K43+O41","v":0}]
[8,null,null,null,null,null,"Protéines (g)",null,null,null,{"$f":"J41*4","v":0},"Fibres (g)",null,null,{"$f":"N41*2","v":0}]
[9,null,null,null,null,null,"Lipides (g)",null,null,null,{"$f":"J42*9","v":0},"AGSaturés (g)"]
[10,null,null,null,null,null,"Glucides (g)",null,null,null,{"$f":"J43*4","v":0}]
["Forme & Dimension : "]
[]
["Cuisson & dressage :"]
[]
["Liste des allergènes  :"]
[null,"GLUTEN",null,"GLUCOSE",null,null,"GRAINES",null,null,"CÉLERI",null,null,"CRUSTACÉS"]
[null,"LACTOSE / DAIRY",null,"ARACHIDE",null,null,"FRUITS À COQUE",null,null,"SULFITES",null,null,"POISSON"]
[null,"OEUF",null,"MOUTARDE",null,null,"SOJA",null,null,"PORC",null,null,"VIANDE"]
[]
[]
[]
[]
[]
[null,"COMMANDE",null,"pour",null,{"$f":"H3","v":2},{"$f":"CONCATENATE(A1, F1,G1)","v":"JUS FRAIS  :  cherry chérie"}]
[]
[null,"qte","unité","liste",null,null,null,null,"price",null,null,null,"Total"]
[null,{"$f":"M14","v":2},{"$f":"H14","v":"Unité"},{"$f":"A14","v":"glaçon par 5"},null,null,null,null,{"$f":"F14","v":5},null,null,null,{"$f":"N14","v":10}]
[null,0.96,"kg",{"$f":"A15","v":"pamplemousse au kilos (1 caisse = 15k)"},null,null,null,null,{"$f":"F15","v":5},null,null,null,4.8]
[null,1,"pièce","Bananes (1=177g)",null,null,null,null,5,null,null,null,5]
[null,0.04,"kg","purée de fruit cerise",null,null,null,null,5,null,null,null,0.2]
[null,0,"",0,null,null,null,null,0,null,null,null,0]
[null,0,"",0,null,null,null,null,0,null,null,null,0]
[null,0,"",0,null,null,null,null,0,null,null,null,0]
[null,0,"",0,null,null,null,null,0,null,null,null,0]
[null,0,"",0,null,null,null,null,0,null,null,null,0]
[null,0,"",0,null,null,null,null,0,null,null,null,0]
[null,0,"",0,null,null,null,null,0,null,null,null,0]
[null,0,"",0,null,null,null,null,0,null,null,null,0]
[null,0,"",0,null,null,null,null,0,null,null,null,0]
[null,0,"",0,null,null,null,null,0,null,null,null,0]
[null,0,"",0,null,null,null,null,0,null,null,null,0]
[null,0,"",{"$f":"B29","v":0},null,null,null,null,0,null,null,null,0]
[null,null,null,null,null,null,null,null,null,null,null,null,{"$f":"SUM(M60:M75)","v":20}]

{"sheet":"10 JUS dark side","index":30,"n_rows":76,"n_cols":16,"rows_kept":76,"cut":false,"hidden":false,"merged":[[0,0,0,4],[0,6,0,12],[0,13,0,14],[2,4,2,6],[5,10,6,10],[6,0,6,1],[12,3,12,4],[12,13,12,14],[13,0,13,3],[13,13,13,14],[14,0,14,3],[14,13,14,14],[7,10,8,10],[8,0,8,1],[10,0,10,1],[10,13,10,14],[11,1,11,4],[11,13,11,14],[18,0,18,3],[18,13,18,14],[19,0,19,3],[19,13,19,14],[20,0,20,3],[20,13,20,14],[15,0,15,3],[15,13,15,14],[16,0,16,3],[16,13,16,14],[17,0,17,3],[17,13,17,14],[24,0,24,3],[24,13,24,14],[25,0,25,3],[25,13,25,14],[26,0,26,3],[26,13,26,14],[21,0,21,3],[21,13,21,14],[22,0,22,3],[22,13,22,14],[23,0,23,3],[23,13,23,14],[30,1,30,3],[30,8,30,11],[31,1,31,3],[31,8,31,11],[33,1,33,5],[33,7,33,14],[27,0,27,3],[27,13,27,14],[28,0,28,3],[28,13,28,14],[29,1,29,3],[29,7,29,11],[37,1,37,5],[37,7,37,14],[38,1,38,5],[38,7,38,14],[39,1,39,5],[39,6,39,8],[39,9,39,10],[39,11,39,14],[34,1,34,5],[34,7,34,14],[35,1,35,5],[35,7,35,14],[36,1,36,5],[36,7,36,14],[42,1,42,5],[42,6,42,8],[42,11,42,12],[43,0,43,14],[44,0,44,14],[45,0,45,14],[40,1,40,5],[40,6,40,8],[40,11,40,12],[41,1,41,5],[41,6,41,8],[41,11,41,12],[49,3,49,4],[49,6,49,7],[49,9,49,10],[49,12,49,13],[50,3,50,4],[50,6,50,7],[50,9,50,10],[50,12,50,13],[46,0,46,14],[47,0,47,14],[48,3,48,4],[48,6,48,7],[48,9,48,10],[48,12,48,13],[61,3,61,7],[61,8,61,9],[62,3,62,7],[62,8,62,9],[63,3,63,7],[63,8,63,9],[56,3,56,4],[56,6,56,14],[59,3,59,7],[59,8,59,9],[60,3,60,7],[60,8,60,9],[67,3,67,7],[67,8,67,9],[68,3,68,7],[68,8,68,9],[69,3,69,7],[69,8,69,9],[64,3,64,7],[64,8,64,9],[65,3,65,7],[65,8,65,9],[66,3,66,7],[66,8,66,9],[73,3,73,7],[73,8,73,9],[74,8,74,9],[75,12,75,13],[70,3,70,7],[70,8,70,9],[71,3,71,7],[71,8,71,9],[72,3,72,7],[72,8,72,9]]}
["JUS FRAIS",null,null,null,null,"  :  ","dark side",null,null,null,null,null,null,"400 ml"]
[]
["RECETTE PREVUE POUR  : ",null,1,"parts","Vous la dupliquez pour : ",null,null,2]
[]
["Prix de revient unitaire : ",null,{"$f":"K12","v":{"$error":"#N/A"}},null,null,"marge","coef","tva","ht",null,"ttc"]
[null,null,null,null,null,null,null,null,null,null,3.8]
["avec emballage : ",null,{"$f":"C5+C9","v":{"$error":"#N/A"}},{"$f":"C5+C11","v":{"$error":"#N/A"}},null,{"$f":"I7-C7","v":{"$error":"#N/A"}},{"$f":"I7/C7","v":{"$error":"#N/A"}},"ES 6",{"$f":"K6/1.06","v":3.5849056603773581},"ToGo"]
[null,null,null,null,null,null,null,null,null,null,3.8]
["Emballage ToGo :",null,{"$f":"G31+G32","v":0.01},{"$f":"C9/C7","v":{"$error":"#N/A"}},null,{"$f":"I9-D7","v":{"$error":"#N/A"}},{"$f":"I9/D7","v":{"$error":"#N/A"}},"ES 12",{"$f":"K8/1.12","v":3.3928571428571423},"Sp"]
[]
["Emballage Sp  :",null,{"$f":"O31+O32","v":0.01},{"$f":"C11/D7","v":{"$error":"#N/A"}},null,"Prix kg/l / unité","Poids brut recette","Unité","% perte","brut 1 part","Cout 1 part","prix de revient","brut à faire","prix de revient"]
[0,"Produits",null,null,null,"ht",null,null,null,null,{"$f":"SUM(K14:K29)","v":{"$error":"#N/A"}},{"$f":"K12*H3","v":{"$error":"#N/A"}},null,{"$f":"SUM(N14:O29)","v":{"$error":"#N/A"}},null,"FOURNISSEUR"]
[]
["glaçon par 5",null,null,null,null,{"$f":"VLOOKUP(A14,PRIXINGRE,3,0)","v":5},1,{"$f":"IFERROR(VLOOKUP(A14,UNITINGRE,2,0),\"\")","v":"Unité"},{"$f":"IFERROR(VLOOKUP(A14,UNITINGRE,10,0),\"\")","v":0},{"$f":"G14/$C$3","v":1},{"$f":"J14*F14","v":5},null,{"$f":"ROUNDUP((J14*$H$3),2)","v":2},{"$f":"M14*F14","v":10},null,{"$f":"VLOOKUP(A14,GDEBASE,8,0)","v":"CIABATTA MANIA"}]
["orange à la pièce ( une orange = 0,200 k)",null,null,null,null,{"$error":"#N/A"},2.5,"","",{"$f":"G15/$C$3","v":2.5},{"$f":"J15*F15","v":{"$error":"#N/A"}},null,5,{"$error":"#N/A"},null,{"$error":"#N/A"}]
["Bananes (1=177g)",null,null,null,null,5,0.5,"pièce",0,0.5,2.5,null,1,5,null,"JOSA"]
["purée de fruit cassis",null,null,null,null,5,0.02,"kg",0.05,0.02,0.1,null,0.04,0.2,null,"METRO"]
[null,null,null,null,null,0,null,"","",0,0,null,0,0,null,0]
[null,null,null,null,null,0,null,"","",0,0,null,0,0,null,0]
[null,null,null,null,null,0,null,"","",0,0,null,0,0,null,0]
[null,null,null,null,null,0,null,"","",0,0,null,0,0,null,0]
[null,null,null,null,null,0,null,"","",0,0,null,0,0,null,0]
[null,null,null,null,null,0,null,"","",0,0,null,0,0,null,0]
[null,null,null,null,null,0,null,"","",0,0,null,0,0,null,0]
[null,null,null,null,null,0,null,"","",0,0,null,0,0,null,0]
[null,null,null,null,null,0,null,"","",0,0,null,0,0,null,0]
[null,null,null,null,null,0,null,"","",0,0,null,0,0,null,0]
[null,null,null,null,null,0,null,"","",0,0,null,0,0,null,0]
[null,null,null,null,null,0,null,"","",0,0,null,0,0,null,0]
[null,"Emballage TOGO",null,null,"Qte","price","prix U","Emballage SUR PLACE",null,null,null,null,"Qte","price","prix U"]
[1,"#pack JUS",null,null,1,{"$f":"VLOOKUP(B31,PRIXE,2,0)","v":0.01},{"$f":"E31*F31","v":0.01},3,"#pack JUS",null,null,null,1,{"$f":"VLOOKUP(I31,PRIXE,2,0)","v":0.01},{"$f":"M31*N31","v":0.01}]
[2,0,null,null,1,{"$f":"VLOOKUP(B32,PRIXE,2,0)","v":0},{"$f":"E32*F32","v":0},4,0,null,null,null,null,{"$f":"VLOOKUP(I32,PRIXE,2,0)","v":0},{"$f":"M32*N32","v":0}]
["Etape de la recette"]
[1,null,null,null,null,null,11]
[2,null,null,null,null,null,12]
[3,null,null,null,null,null,13]
[4,null,null,null,null,null,14]
[5,null,null,null,null,null,15]
[6,null,null,null,null,null,16]
[7,null,null,null,null,null,"CALORIES (kcal)",null,null,{"$f":"K41+K42+K43+O41","v":0}]
[8,null,null,null,null,null,"Protéines (g)",null,null,null,{"$f":"J41*4","v":0},"Fibres (g)",null,null,{"$f":"N41*2","v":0}]
[9,null,null,null,null,null,"Lipides (g)",null,null,null,{"$f":"J42*9","v":0},"AGSaturés (g)"]
[10,null,null,null,null,null,"Glucides (g)",null,null,null,{"$f":"J43*4","v":0}]
["Forme & Dimension : "]
[]
["Cuisson & dressage :"]
[]
["Liste des allergènes  :"]
[null,"GLUTEN",null,"GLUCOSE",null,null,"GRAINES",null,null,"CÉLERI",null,null,"CRUSTACÉS"]
[null,"LACTOSE / DAIRY",null,"ARACHIDE",null,null,"FRUITS À COQUE",null,null,"SULFITES",null,null,"POISSON"]
[null,"OEUF",null,"MOUTARDE",null,null,"SOJA",null,null,"PORC",null,null,"VIANDE"]
[]
[]
[]
[]
[]
[null,"COMMANDE",null,"pour",null,{"$f":"H3","v":2},{"$f":"CONCATENATE(A1, F1,G1)","v":"JUS FRAIS  :  dark side"}]
[]
[null,"qte","unité","liste",null,null,null,null,"price",null,null,null,"Total"]
[null,{"$f":"M14","v":2},{"$f":"H14","v":"Unité"},{"$f":"A14","v":"glaçon par 5"},null,null,null,null,{"$f":"F14","v":5},null,null,null,{"$f":"N14","v":10}]
[null,5,"",{"$f":"A15","v":"orange à la pièce ( une orange = 0,200 k)"},null,null,null,null,{"$f":"F15","v":{"$error":"#N/A"}},null,null,null,{"$error":"#N/A"}]
[null,1,"pièce","Bananes (1=177g)",null,null,null,null,5,null,null,null,5]
[null,0.04,"kg","purée de fruit cassis",null,null,null,null,5,null,null,null,0.2]
[null,0,"",0,null,null,null,null,0,null,null,null,0]
[null,0,"",0,null,null,null,null,0,null,null,null,0]
[null,0,"",0,null,null,null,null,0,null,null,null,0]
[null,0,"",0,null,null,null,null,0,null,null,null,0]
[null,0,"",0,null,null,null,null,0,null,null,null,0]
[null,0,"",0,null,null,null,null,0,null,null,null,0]
[null,0,"",0,null,null,null,null,0,null,null,null,0]
[null,0,"",0,null,null,null,null,0,null,null,null,0]
[null,0,"",0,null,null,null,null,0,null,null,null,0]
[null,0,"",0,null,null,null,null,0,null,null,null,0]
[null,0,"",0,null,null,null,null,0,null,null,null,0]
[null,0,"",{"$f":"B29","v":0},null,null,null,null,0,null,null,null,0]
[null,null,null,null,null,null,null,null,null,null,null,null,{"$f":"SUM(M60:M75)","v":{"$error":"#N/A"}}]

{"sheet":"12 Mélange mout mayo cum","index":31,"n_rows":72,"n_cols":16,"rows_kept":72,"cut":false,"hidden":false,"merged":[[6,0,6,1],[0,0,0,4],[0,6,0,12],[0,13,0,14],[2,4,2,6],[13,0,13,3],[13,13,13,14],[14,0,14,3],[14,13,14,14],[15,0,15,3],[15,13,15,14],[10,13,10,14],[11,1,11,4],[11,13,11,14],[12,3,12,4],[12,13,12,14],[19,0,19,3],[19,13,19,14],[20,0,20,3],[20,13,20,14],[21,0,21,3],[21,13,21,14],[16,0,16,3],[16,13,16,14],[17,0,17,3],[17,13,17,14],[18,0,18,3],[18,13,18,14],[25,0,25,3],[25,13,25,14],[26,0,26,3],[26,13,26,14],[27,0,27,3],[27,13,27,14],[22,0,22,3],[22,13,22,14],[23,0,23,3],[23,13,23,14],[24,0,24,3],[24,13,24,14],[31,1,31,3],[31,8,31,11],[33,1,33,5],[33,7,33,14],[28,0,28,3],[28,13,28,14],[29,1,29,3],[29,7,29,11],[30,1,30,3],[30,8,30,11],[37,1,37,5],[37,7,37,14],[38,1,38,5],[38,7,38,14],[39,1,39,5],[39,6,39,8],[39,9,39,10],[39,11,39,14],[34,1,34,5],[34,7,34,14],[35,1,35,5],[35,7,35,14],[36,1,36,5],[36,7,36,14],[42,1,42,5],[42,6,42,8],[42,11,42,12],[43,0,43,14],[44,0,44,14],[45,0,45,14],[40,1,40,5],[40,6,40,8],[40,11,40,12],[41,1,41,5],[41,6,41,8],[41,11,41,12],[55,3,55,7],[55,8,55,9],[56,3,56,7],[56,8,56,9],[57,3,57,7],[57,8,57,9],[46,0,46,14],[47,0,47,14],[48,0,48,14],[49,0,49,14],[50,0,50,14],[52,3,52,4],[52,6,52,14],[61,3,61,7],[61,8,61,9],[62,3,62,7],[62,8,62,9],[63,3,63,7],[63,8,63,9],[58,3,58,7],[58,8,58,9],[59,3,59,7],[59,8,59,9],[60,3,60,7],[60,8,60,9],[70,8,70,9],[71,12,71,13],[67,3,67,7],[67,8,67,9],[68,3,68,7],[68,8,68,9],[69,3,69,7],[69,8,69,9],[64,3,64,7],[64,8,64,9],[65,3,65,7],[65,8,65,9],[66,3,66,7],[66,8,66,9]]}
["Mélange",null,null,null,null,"  :  ","Moutarde mayo cumin",null,null,null,null,null,null,"1 kg"]
[]
["RECETTE PREVUE POUR  : ",null,1,"parts","Vous la dupliquez pour : ",null,null,2]
[]
["Prix de revient unitaire : ",null,{"$f":"K12","v":5.15}]
[]
["avec emballage : ",null,{"$f":"C5+C9","v":5.15},{"$f":"C5+C11","v":5.15}]
[]
[]
[]
[null,null,null,null,null,"Prix kg/l / unité","Poids brut recette","Unité","% perte","brut 1 part","Cout 1 part","prix de revient","brut à faire","prix de revient"]
[0,"Produits",null,null,null,"ht",null,null,null,null,{"$f":"SUM(K14:K29)","v":5.15},{"$f":"K12*H3","v":10.3},null,{"$f":"SUM(N14:O29)","v":10.3},null,"FOURNISSEUR"]
[]
["Moutarde DL",null,null,null,null,{"$f":"VLOOKUP(A14,PRIXINGRE,3,0)","v":5},0.5,{"$f":"IFERROR(VLOOKUP(A14,UNITINGRE,2,0),\"\")","v":"kg"},{"$f":"IFERROR(VLOOKUP(A14,UNITINGRE,10,0),\"\")","v":0.03},{"$f":"G14/$C$3","v":0.5},{"$f":"J14*F14","v":2.5},null,{"$f":"ROUNDUP((J14*$H$3),2)","v":1},{"$f":"M14*F14","v":5},null,{"$f":"VLOOKUP(A14,GDEBASE,8,0)","v":"METRO"}]
["Mayonnaise vandemoortele",null,null,null,null,5,0.5,"kg",0.03,{"$f":"G15/$C$3","v":0.5},{"$f":"J15*F15","v":2.5},null,1,5,null,"METRO"]
["Cumin",null,null,null,null,5,0.03,"kg",0,0.03,0.15,null,0.06,0.3,null,"METRO"]
[null,null,null,null,null,0,null,"","",0,0,null,0,0,null,0]
[null,null,null,null,null,0,null,"","",0,0,null,0,0,null,0]
[null,null,null,null,null,0,null,"","",0,0,null,0,0,null,0]
[null,null,null,null,null,0,null,"","",0,0,null,0,0,null,0]
[null,null,null,null,null,0,null,"","",0,0,null,0,0,null,0]
[null,null,null,null,null,0,null,"","",0,0,null,0,0,null,0]
[null,null,null,null,null,0,null,"","",0,0,null,0,0,null,0]
[null,null,null,null,null,0,null,"","",0,0,null,0,0,null,0]
[null,null,null,null,null,0,null,"","",0,0,null,0,0,null,0]
[null,null,null,null,null,0,null,"","",0,0,null,0,0,null,0]
[null,null,null,null,null,0,null,"","",0,0,null,0,0,null,0]
[null,null,null,null,null,0,null,"","",0,0,null,0,0,null,0]
[null,null,null,null,null,0,null,"","",0,0,null,0,0,null,0]
[null,"Emballage",null,null,"Qte","price","prix U","Emballage",null,null,null,null,"Qte","price","prix U"]
[1,0,null,null,1,{"$f":"VLOOKUP(B31,PRIXE,2,0)","v":0},{"$f":"E31*F31","v":0},3,0,null,null,null,null,{"$f":"VLOOKUP(J31,PRIXE,2,0)","v":0},{"$f":"M31*N31","v":0}]
[2,0,null,null,1,{"$f":"VLOOKUP(B32,PRIXE,2,0)","v":0},{"$f":"E32*F32","v":0},4,0,null,null,null,null,{"$f":"VLOOKUP(J32,PRIXE,2,0)","v":0},{"$f":"M32*N32","v":0}]
["Etape de la recette"]
[1,null,null,null,null,null,11]
[2,null,null,null,null,null,12]
[3,null,null,null,null,null,13]
[4,null,null,null,null,null,14]
[5,null,null,null,null,null,15]
[6,null,null,null,null,null,16]
[7,null,null,null,null,null,"CALORIES (kcal)",null,null,{"$f":"K41+K42+K43+O41","v":0}]
[8,null,null,null,null,null,"Protéines (g)",null,null,null,{"$f":"J41*4","v":0},"Fibres (g)",null,null,{"$f":"N41*2","v":0}]
[9,null,null,null,null,null,"Lipides (g)",null,null,null,{"$f":"J42*9","v":0},"AGSaturés (g)"]
[10,null,null,null,null,null,"Glucides (g)",null,null,null,{"$f":"J43*4","v":0}]
["Forme & Dimension : "]
[]
["Cuisson & dressage :"]
[]
[]
[]
["Liste des allergènes  :"]
[]
[]
[null,"COMMANDE",null,"pour",null,{"$f":"H3","v":2},{"$f":"CONCATENATE(A1, F1,G1)","v":"Mélange  :  Moutarde mayo cumin"}]
[]
[null,"qte","unité","liste",null,null,null,null,"price",null,null,null,"Total"]
[null,{"$f":"M14","v":1},{"$f":"H14","v":"kg"},{"$f":"A14","v":"Moutarde DL"},null,null,null,null,{"$f":"F14","v":5},null,null,null,{"$f":"N14","v":5}]
[null,1,"kg",{"$f":"A15","v":"Mayonnaise vandemoortele"},null,null,null,null,{"$f":"F15","v":5},null,null,null,5]
[null,0.06,"kg","Cumin",null,null,null,null,5,null,null,null,0.3]
[null,0,"",0,null,null,null,null,0,null,null,null,0]
[null,0,"",0,null,null,null,null,0,null,null,null,0]
[null,0,"",0,null,null,null,null,0,null,null,null,0]
[null,0,"",0,null,null,null,null,0,null,null,null,0]
[null,0,"",0,null,null,null,null,0,null,null,null,0]
[null,0,"",0,null,null,null,null,0,null,null,null,0]
[null,0,"",0,null,null,null,null,0,null,null,null,0]
[null,0,"",0,null,null,null,null,0,null,null,null,0]
[null,0,"",0,null,null,null,null,0,null,null,null,0]
[null,0,"",0,null,null,null,null,0,null,null,null,0]
[null,0,"",0,null,null,null,null,0,null,null,null,0]
[null,0,"",0,null,null,null,null,0,null,null,null,0]
[null,0,"",{"$f":"B29","v":0},null,null,null,null,0,null,null,null,0]
[null,null,null,null,null,null,null,null,null,null,null,null,{"$f":"SUM(M56:M71)","v":10.3}]

{"sheet":"12 PATE FEUILLETEE","index":32,"n_rows":72,"n_cols":16,"rows_kept":72,"cut":false,"hidden":false,"merged":[[70,8,70,9],[71,12,71,13],[67,3,67,7],[67,8,67,9],[68,3,68,7],[68,8,68,9],[69,3,69,7],[69,8,69,9],[64,3,64,7],[64,8,64,9],[65,3,65,7],[65,8,65,9],[66,3,66,7],[66,8,66,9],[61,3,61,7],[61,8,61,9],[62,3,62,7],[62,8,62,9],[63,3,63,7],[63,8,63,9],[58,3,58,7],[58,8,58,9],[59,3,59,7],[59,8,59,9],[60,3,60,7],[60,8,60,9],[55,3,55,7],[55,8,55,9],[56,3,56,7],[56,8,56,9],[57,3,57,7],[57,8,57,9],[46,0,46,14],[47,0,47,14],[48,0,48,14],[49,0,49,14],[50,0,50,14],[52,3,52,4],[52,6,52,14],[42,1,42,5],[42,6,42,8],[42,11,42,12],[43,0,43,14],[44,0,44,14],[45,0,45,14],[40,1,40,5],[40,6,40,8],[40,11,40,12],[41,1,41,5],[41,6,41,8],[41,11,41,12],[37,1,37,5],[37,7,37,14],[38,1,38,5],[38,7,38,14],[39,1,39,5],[39,6,39,8],[39,9,39,10],[39,11,39,14],[34,1,34,5],[34,7,34,14],[35,1,35,5],[35,7,35,14],[36,1,36,5],[36,7,36,14],[30,1,30,3],[30,8,30,11],[31,1,31,3],[31,8,31,11],[33,1,33,5],[33,7,33,14],[27,0,27,3],[27,13,27,14],[28,0,28,3],[28,13,28,14],[29,1,29,3],[29,7,29,11],[24,0,24,3],[24,13,24,14],[25,0,25,3],[25,13,25,14],[26,0,26,3],[26,13,26,14],[21,0,21,3],[21,13,21,14],[22,0,22,3],[22,13,22,14],[23,0,23,3],[23,13,23,14],[13,0,13,3],[13,13,13,14],[14,0,14,3],[14,13,14,14],[18,0,18,3],[18,13,18,14],[19,0,19,3],[19,13,19,14],[20,0,20,3],[20,13,20,14],[15,0,15,3],[15,13,15,14],[16,0,16,3],[16,13,16,14],[17,0,17,3],[17,13,17,14],[6,0,6,1],[0,0,0,4],[0,6,0,12],[0,13,0,14],[2,4,2,6],[11,1,11,4],[11,13,11,14],[10,13,10,14],[12,3,12,4],[12,13,12,14]]}
["PATE A TARTE",null,null,null,null,"  :  ","FEUILLETEE",null,null,null,null,null,null,0.38]
[]
["RECETTE PREVUE POUR  : ",null,1,null,"Vous la dupliquez pour : ",null,null,2]
[]
["Prix de revient unitaire : ",null,{"$f":"K12","v":1.5291666666666668}]
[]
["avec emballage : ",null,{"$f":"C5+C9","v":1.5291666666666668},{"$f":"C5+C11","v":1.5291666666666668}]
[]
[]
[]
[null,null,null,null,null,"Prix kg/l / unité","Poids brut recette","Unité","% perte","brut 1 part","Cout 1 part","prix de revient","brut à faire","prix de revient"]
[0,"Produits",null,null,null,"ht",null,null,null,null,{"$f":"SUM(K14:K29)","v":1.5291666666666668},{"$f":"K12*H3","v":3.0583333333333336},null,{"$f":"SUM(N14:O29)","v":3.1},null,"FOURNISSEUR"]
[]
["Farine t55",null,null,null,null,{"$f":"VLOOKUP(A14,PRIXINGRE,3,0)","v":5},0.125,{"$f":"IFERROR(VLOOKUP(A14,UNITINGRE,2,0),\"\")","v":"kg"},{"$f":"IFERROR(VLOOKUP(A14,UNITINGRE,10,0),\"\")","v":0},{"$f":"G14/$C$3","v":0.125},{"$f":"J14*F14","v":0.625},null,{"$f":"ROUNDUP((J14*$H$3),2)","v":0.25},{"$f":"M14*F14","v":1.25},null,{"$f":"VLOOKUP(A14,GDEBASE,8,0)","v":"METRO"}]
["Beurre",null,null,null,null,5,9.5000000000000001E-2,"kg",0,{"$f":"G15/$C$3","v":9.5000000000000001E-2},{"$f":"J15*F15","v":0.47499999999999998},null,0.19,0.95,null,"LOBET"]
["Sel fin (kg) 5 kg",null,null,null,null,5,2.5000000000000001E-3,"kg",0,2.5000000000000001E-3,1.2500000000000001E-2,null,0.01,0.05,null,"METRO"]
["MDO cuisine",null,null,null,null,5,8.3333333333333329E-2,"h",0,8.3333333333333329E-2,0.41666666666666663,null,0.17,0.85000000000000009,null,"CIABATTA MANIA"]
[null,null,null,null,null,0,null,"","",0,0,null,0,0,null,0]
[null,null,null,null,null,0,null,"","",0,0,null,0,0,null,0]
[null,null,null,null,null,0,null,"","",0,0,null,0,0,null,0]
[null,null,null,null,null,0,null,"","",0,0,null,0,0,null,0]
[null,null,null,null,null,0,null,"","",0,0,null,0,0,null,0]
[null,null,null,null,null,0,null,"","",0,0,null,0,0,null,0]
[null,null,null,null,null,0,null,"","",0,0,null,0,0,null,0]
[null,null,null,null,null,0,null,"","",0,0,null,0,0,null,0]
[null,null,null,null,null,0,null,"","",0,0,null,0,0,null,0]
[null,null,null,null,null,0,null,"","",0,0,null,0,0,null,0]
[null,null,null,null,null,0,null,"","",0,0,null,0,0,null,0]
[null,null,null,null,null,0,null,"","",0,0,null,0,0,null,0]
[null,"Emballage",null,null,"Qte","price","prix U","Emballage",null,null,null,null,"Qte","price","prix U"]
[1,0,null,null,1,{"$f":"VLOOKUP(B31,PRIXE,2,0)","v":0},{"$f":"E31*F31","v":0},3,0,null,null,null,null,{"$f":"VLOOKUP(J31,PRIXE,2,0)","v":0},{"$f":"M31*N31","v":0}]
[2,0,null,null,1,{"$f":"VLOOKUP(B32,PRIXE,2,0)","v":0},{"$f":"E32*F32","v":0},4,0,null,null,null,null,{"$f":"VLOOKUP(J32,PRIXE,2,0)","v":0},{"$f":"M32*N32","v":0}]
["Etape de la recette"]
[1,null,null,null,null,null,11]
[2,null,null,null,null,null,12]
[3,null,null,null,null,null,13]
[4,null,null,null,null,null,14]
[5,null,null,null,null,null,15]
[6,null,null,null,null,null,16]
[7,null,null,null,null,null,"CALORIES (kcal)",null,null,{"$f":"K41+K42+K43+O41","v":0}]
[8,null,null,null,null,null,"Protéines (g)",null,null,null,{"$f":"J41*4","v":0},"Fibres (g)",null,null,{"$f":"N41*2","v":0}]
[9,null,null,null,null,null,"Lipides (g)",null,null,null,{"$f":"J42*9","v":0},"AGSaturés (g)"]
[10,null,null,null,null,null,"Glucides (g)",null,null,null,{"$f":"J43*4","v":0}]
["Forme & Dimension : "]
[]
["Cuisson & dressage :"]
[]
[]
[]
["Liste des allergènes  :"]
[]
[]
[null,"COMMANDE",null,"pour",null,{"$f":"H3","v":2},{"$f":"CONCATENATE(A1, F1,G1)","v":"PATE A TARTE  :  FEUILLETEE"}]
[]
[null,"qte","unité","liste",null,null,null,null,"price",null,null,null,"Total"]
[null,{"$f":"M14","v":0.25},{"$f":"H14","v":"kg"},{"$f":"A14","v":"Farine t55"},null,null,null,null,{"$f":"F14","v":5},null,null,null,{"$f":"N14","v":1.25}]
[null,0.19,"kg",{"$f":"A15","v":"Beurre"},null,null,null,null,{"$f":"F15","v":5},null,null,null,0.95]
[null,0.01,"kg","Sel fin (kg) 5 kg",null,null,null,null,5,null,null,null,0.05]
[null,0.17,"h","MDO cuisine",null,null,null,null,5,null,null,null,0.85000000000000009]
[null,0,"",0,null,null,null,null,0,null,null,null,0]
[null,0,"",0,null,null,null,null,0,null,null,null,0]
[null,0,"",0,null,null,null,null,0,null,null,null,0]
[null,0,"",0,null,null,null,null,0,null,null,null,0]
[null,0,"",0,null,null,null,null,0,null,null,null,0]
[null,0,"",0,null,null,null,null,0,null,null,null,0]
[null,0,"",0,null,null,null,null,0,null,null,null,0]
[null,0,"",0,null,null,null,null,0,null,null,null,0]
[null,0,"",0,null,null,null,null,0,null,null,null,0]
[null,0,"",0,null,null,null,null,0,null,null,null,0]
[null,0,"",0,null,null,null,null,0,null,null,null,0]
[null,0,"",{"$f":"B29","v":0},null,null,null,null,0,null,null,null,0]
[null,null,null,null,null,null,null,null,null,null,null,null,{"$f":"SUM(M56:M71)","v":3.1}]

{"sheet":"15 SF 2 fromages","index":33,"n_rows":32,"n_cols":16,"rows_kept":32,"cut":false,"hidden":false,"merged":[[13,0,13,3],[13,13,13,14],[0,0,0,4],[0,6,0,14],[2,4,2,6],[5,10,6,10],[6,0,6,1],[8,0,8,1],[10,13,10,14],[11,1,11,4],[11,13,11,14],[12,3,12,4],[12,13,12,14],[14,0,14,3],[14,13,14,14],[15,0,15,3],[15,13,15,14],[16,0,16,3],[16,13,16,14],[17,0,17,3],[17,13,17,14],[18,0,18,3],[18,13,18,14],[19,0,19,3],[19,13,19,14],[20,0,20,3],[20,13,20,14],[21,0,21,3],[21,13,21,14],[22,0,22,3],[22,13,22,14],[23,0,23,3],[23,13,23,14],[24,0,24,3],[24,13,24,14],[25,0,25,3],[25,13,25,14],[29,1,29,3],[30,1,30,3],[31,1,31,3],[26,0,26,3],[26,13,26,14],[27,0,27,3],[27,13,27,14],[28,0,28,3],[28,13,28,14]]}
["summer BAGUETTE",null,null,null,null,"  :  ","2 FROMAGES",null,null,null,null,null,null,null,null,"150 grs"]
[]
["RECETTE PREVUE POUR  : ",null,1,null,"Vous la dupliquez pour : ",null,null,2]
[]
["Prix de revient unitaire : ",null,{"$f":"K12","v":15.414999999999999},null,null,"marge","coef","tva","ht",null,"ttc"]
[null,null,null,null,null,null,null,null,null,null,3.1269999999999998]
["avec emballage : ",null,{"$f":"C5+C9","v":15.424999999999999},null,null,{"$f":"I7-C7","v":-12.475},{"$f":"I7/C7","v":0.19124797406807131},"ES 6",{"$f":"K6/1.06","v":2.9499999999999997},"ToGo"]
[]
["Emballage ToGo :",null,{"$f":"G31+G32","v":0.01},{"$f":"C9/C7","v":6.4829821717990281E-4}]
[]
[null,null,null,null,null,"Prix kg/l / unité","Poids brut recette","Unité","% perte","brut 1 part","Cout 1 part","prix de revient","brut à faire","prix de revient"]
[0,"Produits",null,null,null,"ht",null,null,null,null,{"$f":"SUM(K14:K29)","v":15.414999999999999},{"$f":"K12*H3","v":30.83},null,{"$f":"SUM(N14:O29)","v":30.849999999999998}]
[]
["SF FDP BAG GRISE SUMMER 1/2",null,null,null,null,{"$f":"VLOOKUP(A14,PRIXINGRE,3,0)","v":5},1,{"$f":"IFERROR(VLOOKUP(A14,UNITINGRE,2,0),\"\")","v":"pièce"},{"$f":"IFERROR(VLOOKUP(A14,UNITINGRE,10,0),\"\")","v":0},{"$f":"IFERROR((G14/$C$3)+(((G14/$C$3)*I14)),\"\")","v":1},{"$f":"IFERROR((J14*F14),\"\")","v":5},null,{"$f":"IFERROR((ROUNDUP((J14*$H$3),2)),\"\")","v":2},{"$f":"IFERROR((M14*F14),\"\")","v":10},null,{"$f":"VLOOKUP(A14,GDEBASE,8,0)","v":"LOBET"}]
["SF Philadelphia original (1,65K)",null,null,null,null,5,0.02,"kg",0,0.02,{"$f":"IFERROR((J15*F15),\"\")","v":0.1},null,{"$f":"IFERROR((ROUNDUP((J15*$H$3),2)),\"\")","v":0.04},{"$f":"IFERROR((M15*F15),\"\")","v":0.2},null,"LOBET"]
["SF Cheddar tranché (dose : 3 demi T =30g)",null,null,null,null,5,1,"pièce",0,1,{"$f":"IFERROR((J16*F16),\"\")","v":5},null,2,10,null,"LOBET"]
["Tomates confites SELECTION",null,null,null,"4",5,0.01,"kg",0.3,1.3000000000000001E-2,{"$f":"IFERROR((J17*F17),\"\")","v":6.5000000000000002E-2},null,0.03,0.15,null,"DAVIGEL"]
["salade iceberg 1 dose dwich 20g",null,null,null,null,5,1,"pièce",0.05,1.05,5.25,null,2.1,10.5,null,"JOSA"]
[null,null,null,null,null,0,null,"","","",{"$f":"IFERROR((J19*F19),\"\")","v":""},null,"","",null,0]
[null,null,null,null,null,0,null,"","","","",null,"","",null,0]
[null,null,null,null,null,0,null,"","","","",null,"","",null,0]
[null,null,null,null,null,0,null,"","","","",null,"","",null,0]
[null,null,null,null,null,0,null,"","","","",null,"","",null,0]
[null,null,null,null,null,0,null,"","","","",null,"","",null,0]
[null,null,null,null,null,0,null,"","","","",null,"","",null,0]
[null,null,null,null,null,0,null,"","","","",null,"","",null,0]
[null,null,null,null,null,0,null,"","","","",null,"","",null,0]
[null,null,null,null,null,0,null,"","","","",null,"","",null,0]
[null,null,null,null,null,0,null,"","","","",null,"","",null,0]
[null,"Emballage",null,null,"Qte","price","prix U"]
[1,"#pack DWICH ToGo",null,null,1,{"$f":"VLOOKUP(B31,PRIXE,2,0)","v":0.01},{"$f":"E31*F31","v":0.01}]
[2,0,null,null,1,{"$f":"VLOOKUP(B32,PRIXE,2,0)","v":0},{"$f":"E32*F32","v":0}]