{"text_format":"1","workbook":"xlsx","n_sheets":3,"sheets":["Base","Edit","Feuil3"],"not_rendered":{"charts":0,"images":0,"macros":0,"external_links":0,"defined_names":1,"comments":0,"pivot_tables":0},"unopened":[],"bounds":{"document_bytes":16777216,"sheet_cells":100000,"rows_first":2000,"rows_last":500,"rows_between":2000,"halvings":0,"cell_chars":16384,"cell_head_chars":4096},"cells_cut":0,"cells_raw":0,"read":"whole","date_system":"1900"}

{"sheet":"Base","index":0,"n_rows":21,"n_cols":11,"rows_kept":21,"cut":false,"hidden":false,"merged":[]}
["N° de client","info_1","info_2","info_3","info_4","info_5","info_6","info_7","info_8","info_9","info_10"]
["client _ 13","AA_13","Peuplier","Toulouse","Janvier","Romara","André","Ect…13","Ect_2…13","Etc_3…13","Etc_4…13"]
["client _ 17","AA_12","Frêne","Montpellier","Décembre","Blanquet","Lucas","Ect…4","Ect_2…1","Etc_3…10","Etc_4…11"]
["client _ 2","AA_14","Châtaignier","Perpignan","Février","Uberto","Anne-Marie","Ect…9","Ect_2…10","Etc_3…3","Etc_4…7"]
["client _ 18","AA_20","Buis","Colmar","Août","Hizarde","Carla","Ect…7","Ect_2…11","Etc_3…18","Etc_4…9"]
["client _ 15","AA_07","Orme","Vezoul","Juillet","Platère","Eric","Ect…18","Ect_2…12","Etc_3…15","Etc_4…14"]
["client _ 19","AA_19","Cocotier","Strasbourg","Juillet","Galibot","Eloide","Ect…6","Ect_2…14","Etc_3…7","Etc_4…15"]
["client _ 1","AA_01","Chêne","Paris","Janvier","Martin","Paul","Ect…12","Ect_2…15","Etc_3…14","Etc_4…18"]
["client _ 14","AA_08","Orne","Vierzon","Août","Morel","Corinne","Ect…10","Ect_2…16","Etc_3…9","Etc_4…4"]
["client _ 4","AA_04","Epicea","Birdeaux","Avril","Abrani","Ewan","Ect…19","Ect_2…17","Etc_3…8","Etc_4…6"]
["client _ 12","AA_02","Bouleau","Marseille","Février","Durand","Renè","Ect…8","Ect_2…18","Etc_3…1","Etc_4…3"]
["client _ 7","AA_06","Pin","Toul","Juin","Teilhol","Patrick","Ect…16","Ect_2…19","Etc_3…11","Etc_4…2"]
["client _ 20","AA_03","Sapin","Lyon","Mars","Xitana","André","Ect…2","Ect_2…2","Etc_3…16","Etc_4…1"]
["client _ 10","AA_18","Palmier","Bellegarde","Juin","Fontanelle","Philippe","Ect…20","Ect_2…20","Etc_3…12","Etc_4…17"]
["client _ 3","AA_17","Séquoia","Gex","Mai","Esmerh","Jean-pierre","Ect…5","Ect_2…3","Etc_3…4","Etc_4…5"]
["client _ 8","AA_10","Pommiers","Brest","Octobre","Kourta","Monique","Ect…3","Ect_2…4","Etc_3…19","Etc_4…20"]
["client _ 11","AA_15","Olivier","Pau","Mars","Humbert","Madeleine","Ect…11","Ect_2…5","Etc_3…20","Etc_4…19"]
["client _ 6","AA_09","Acacuia","Limoges","Septembre","Paquite","Chrystel","Ect…14","Ect_2…6","Etc_3…5","Etc_4…12"]
["client _ 16","AA_16","Erable","Bourg-en -Bresse","Avril","Carline","Pierrette","Ect…1","Ect_2…7","Etc_3…17","Etc_4…10"]
["client _ 9","AA_11","Pruniers","Nantes","Novembre","Banaci","Léa","Ect…15","Ect_2…8","Etc_3…2","Etc_4…16"]
["client _ 5","AA_05","Méléze","Brunois","Mai","Marcello","Marcel","Ect…17","Ect_2…9","Etc_3…6","Etc_4…8"]

{"sheet":"Edit","index":1,"n_rows":10,"n_cols":11,"rows_kept":10,"cut":false,"hidden":false,"merged":[]}
["N° de client","info_1","info_2","info_3","info_4","info_5","info_6","info_7","info_8","info_9","info_10"]
["client _ 13",{"$f":"IF($A2=\"\",\"\",VLOOKUP($A2,Base!$A:$K,2,0))","v":"AA_13"},{"$f":"IF($A2=\"\",\"\",VLOOKUP($A2,Base!$A:$K,3,0))","v":"Peuplier"},{"$f":"IF($A2=\"\",\"\",VLOOKUP($A2,Base!$A:$K,4,0))","v":"Toulouse"},{"$f":"IF($A2=\"\",\"\",VLOOKUP($A2,Base!$A:$K,5,0))","v":"Janvier"},{"$f":"IF($A2=\"\",\"\",VLOOKUP($A2,Base!$A:$K,6,0))","v":"Romara"},{"$f":"IF($A2=\"\",\"\",VLOOKUP($A2,Base!$A:$K,7,0))","v":"André"},{"$f":"IF($A2=\"\",\"\",VLOOKUP($A2,Base!$A:$K,8,0))","v":"Ect…13"},{"$f":"IF($A2=\"\",\"\",VLOOKUP($A2,Base!$A:$K,9,0))","v":"Ect_2…13"},{"$f":"IF($A2=\"\",\"\",VLOOKUP($A2,Base!$A:$K,10,0))","v":"Etc_3…13"},{"$f":"IF($A2=\"\",\"\",VLOOKUP($A2,Base!$A:$K,11,0))","v":"Etc_4…13"}]
["client _ 17",{"$f":"IF($A3=\"\",\"\",VLOOKUP($A3,Base!$A:$K,2,0))","v":"AA_12"},{"$f":"IF($A3=\"\",\"\",VLOOKUP($A3,Base!$A:$K,3,0))","v":"Frêne"},{"$f":"IF($A3=\"\",\"\",VLOOKUP($A3,Base!$A:$K,4,0))","v":"Montpellier"},{"$f":"IF($A3=\"\",\"\",VLOOKUP($A3,Base!$A:$K,5,0))","v":"Décembre"},{"$f":"IF($A3=\"\",\"\",VLOOKUP($A3,Base!$A:$K,6,0))","v":"Blanquet"},{"$f":"IF($A3=\"\",\"\",VLOOKUP($A3,Base!$A:$K,7,0))","v":"Lucas"},{"$f":"IF($A3=\"\",\"\",VLOOKUP($A3,Base!$A:$K,8,0))","v":"Ect…4"},{"$f":"IF($A3=\"\",\"\",VLOOKUP($A3,Base!$A:$K,9,0))","v":"Ect_2…1"},{"$f":"IF($A3=\"\",\"\",VLOOKUP($A3,Base!$A:$K,10,0))","v":"Etc_3…10"},{"$f":"IF($A3=\"\",\"\",VLOOKUP($A3,Base!$A:$K,11,0))","v":"Etc_4…11"}]
[null,{"$f":"IF($A4=\"\",\"\",VLOOKUP($A4,Base!$A:$K,2,0))","v":""},{"$f":"IF($A4=\"\",\"\",VLOOKUP($A4,Base!$A:$K,3,0))","v":""},{"$f":"IF($A4=\"\",\"\",VLOOKUP($A4,Base!$A:$K,4,0))","v":""},{"$f":"IF($A4=\"\",\"\",VLOOKUP($A4,Base!$A:$K,5,0))","v":""},{"$f":"IF($A4=\"\",\"\",VLOOKUP($A4,Base!$A:$K,6,0))","v":""},{"$f":"IF($A4=\"\",\"\",VLOOKUP($A4,Base!$A:$K,7,0))","v":""},{"$f":"IF($A4=\"\",\"\",VLOOKUP($A4,Base!$A:$K,8,0))","v":""},{"$f":"IF($A4=\"\",\"\",VLOOKUP($A4,Base!$A:$K,9,0))","v":""},{"$f":"IF($A4=\"\",\"\",VLOOKUP($A4,Base!$A:$K,10,0))","v":""},{"$f":"IF($A4=\"\",\"\",VLOOKUP($A4,Base!$A:$K,11,0))","v":""}]
[null,{"$f":"IF($A5=\"\",\"\",VLOOKUP($A5,Base!$A:$K,2,0))","v":""},{"$f":"IF($A5=\"\",\"\",VLOOKUP($A5,Base!$A:$K,3,0))","v":""},{"$f":"IF($A5=\"\",\"\",VLOOKUP($A5,Base!$A:$K,4,0))","v":""},{"$f":"IF($A5=\"\",\"\",VLOOKUP($A5,Base!$A:$K,5,0))","v":""},{"$f":"IF($A5=\"\",\"\",VLOOKUP($A5,Base!$A:$K,6,0))","v":""},{"$f":"IF($A5=\"\",\"\",VLOOKUP($A5,Base!$A:$K,7,0))","v":""},{"$f":"IF($A5=\"\",\"\",VLOOKUP($A5,Base!$A:$K,8,0))","v":""},{"$f":"IF($A5=\"\",\"\",VLOOKUP($A5,Base!$A:$K,9,0))","v":""},{"$f":"IF($A5=\"\",\"\",VLOOKUP($A5,Base!$A:$K,10,0))","v":""},{"$f":"IF($A5=\"\",\"\",VLOOKUP($A5,Base!$A:$K,11,0))","v":""}]
[null,{"$f":"IF($A6=\"\",\"\",VLOOKUP($A6,Base!$A:$K,2,0))","v":""},{"$f":"IF($A6=\"\",\"\",VLOOKUP($A6,Base!$A:$K,3,0))","v":""},{"$f":"IF($A6=\"\",\"\",VLOOKUP($A6,Base!$A:$K,4,0))","v":""},{"$f":"IF($A6=\"\",\"\",VLOOKUP($A6,Base!$A:$K,5,0))","v":""},{"$f":"IF($A6=\"\",\"\",VLOOKUP($A6,Base!$A:$K,6,0))","v":""},{"$f":"IF($A6=\"\",\"\",VLOOKUP($A6,Base!$A:$K,7,0))","v":""},{"$f":"IF($A6=\"\",\"\",VLOOKUP($A6,Base!$A:$K,8,0))","v":""},{"$f":"IF($A6=\"\",\"\",VLOOKUP($A6,Base!$A:$K,9,0))","v":""},{"$f":"IF($A6=\"\",\"\",VLOOKUP($A6,Base!$A:$K,10,0))","v":""},{"$f":"IF($A6=\"\",\"\",VLOOKUP($A6,Base!$A:$K,11,0))","v":""}]
[null,{"$f":"IF($A7=\"\",\"\",VLOOKUP($A7,Base!$A:$K,2,0))","v":""},{"$f":"IF($A7=\"\",\"\",VLOOKUP($A7,Base!$A:$K,3,0))","v":""},{"$f":"IF($A7=\"\",\"\",VLOOKUP($A7,Base!$A:$K,4,0))","v":""},{"$f":"IF($A7=\"\",\"\",VLOOKUP($A7,Base!$A:$K,5,0))","v":""},{"$f":"IF($A7=\"\",\"\",VLOOKUP($A7,Base!$A:$K,6,0))","v":""},{"$f":"IF($A7=\"\",\"\",VLOOKUP($A7,Base!$A:$K,7,0))","v":""},{"$f":"IF($A7=\"\",\"\",VLOOKUP($A7,Base!$A:$K,8,0))","v":""},{"$f":"IF($A7=\"\",\"\",VLOOKUP($A7,Base!$A:$K,9,0))","v":""},{"$f":"IF($A7=\"\",\"\",VLOOKUP($A7,Base!$A:$K,10,0))","v":""},{"$f":"IF($A7=\"\",\"\",VLOOKUP($A7,Base!$A:$K,11,0))","v":""}]
[null,{"$f":"IF($A8=\"\",\"\",VLOOKUP($A8,Base!$A:$K,2,0))","v":""},{"$f":"IF($A8=\"\",\"\",VLOOKUP($A8,Base!$A:$K,3,0))","v":""},{"$f":"IF($A8=\"\",\"\",VLOOKUP($A8,Base!$A:$K,4,0))","v":""},{"$f":"IF($A8=\"\",\"\",VLOOKUP($A8,Base!$A:$K,5,0))","v":""},{"$f":"IF($A8=\"\",\"\",VLOOKUP($A8,Base!$A:$K,6,0))","v":""},{"$f":"IF($A8=\"\",\"\",VLOOKUP($A8,Base!$A:$K,7,0))","v":""},{"$f":"IF($A8=\"\",\"\",VLOOKUP($A8,Base!$A:$K,8,0))","v":""},{"$f":"IF($A8=\"\",\"\",VLOOKUP($A8,Base!$A:$K,9,0))","v":""},{"$f":"IF($A8=\"\",\"\",VLOOKUP($A8,Base!$A:$K,10,0))","v":""},{"$f":"IF($A8=\"\",\"\",VLOOKUP($A8,Base!$A:$K,11,0))","v":""}]
[null,{"$f":"IF($A9=\"\",\"\",VLOOKUP($A9,Base!$A:$K,2,0))","v":""},{"$f":"IF($A9=\"\",\"\",VLOOKUP($A9,Base!$A:$K,3,0))","v":""},{"$f":"IF($A9=\"\",\"\",VLOOKUP($A9,Base!$A:$K,4,0))","v":""},{"$f":"IF($A9=\"\",\"\",VLOOKUP($A9,Base!$A:$K,5,0))","v":""},{"$f":"IF($A9=\"\",\"\",VLOOKUP($A9,Base!$A:$K,6,0))","v":""},{"$f":"IF($A9=\"\",\"\",VLOOKUP($A9,Base!$A:$K,7,0))","v":""},{"$f":"IF($A9=\"\",\"\",VLOOKUP($A9,Base!$A:$K,8,0))","v":""},{"$f":"IF($A9=\"\",\"\",VLOOKUP($A9,Base!$A:$K,9,0))","v":""},{"$f":"IF($A9=\"\",\"\",VLOOKUP($A9,Base!$A:$K,10,0))","v":""},{"$f":"IF($A9=\"\",\"\",VLOOKUP($A9,Base!$A:$K,11,0))","v":""}]
[null,{"$f":"IF($A10=\"\",\"\",VLOOKUP($A10,Base!$A:$K,2,0))","v":""},{"$f":"IF($A10=\"\",\"\",VLOOKUP($A10,Base!$A:$K,3,0))","v":""},{"$f":"IF($A10=\"\",\"\",VLOOKUP($A10,Base!$A:$K,4,0))","v":""},{"$f":"IF($A10=\"\",\"\",VLOOKUP($A10,Base!$A:$K,5,0))","v":""},{"$f":"IF($A10=\"\",\"\",VLOOKUP($A10,Base!$A:$K,6,0))","v":""},{"$f":"IF($A10=\"\",\"\",VLOOKUP($A10,Base!$A:$K,7,0))","v":""},{"$f":"IF($A10=\"\",\"\",VLOOKUP($A10,Base!$A:$K,8,0))","v":""},{"$f":"IF($A10=\"\",\"\",VLOOKUP($A10,Base!$A:$K,9,0))","v":""},{"$f":"IF($A10=\"\",\"\",VLOOKUP($A10,Base!$A:$K,10,0))","v":""},{"$f":"IF($A10=\"\",\"\",VLOOKUP($A10,Base!$A:$K,11,0))","v":""}]

{"sheet":"Feuil3","index":2,"n_rows":0,"n_cols":0,"rows_kept":0,"cut":false,"hidden":false,"merged":[]}