{"text_format":"1","workbook":"xlsx","n_sheets":5,"sheets":["Tableau Tournante","Impression","Feuil1","Tournois 2 contre 2","Tournois 1 contre 1"],"not_rendered":{"charts":0,"images":0,"macros":1,"external_links":0,"defined_names":10,"comments":2,"pivot_tables":0},"unopened":[],"bounds":{"document_bytes":16777216,"sheet_cells":100000,"rows_first":2000,"rows_last":500,"rows_between":2000,"halvings":0,"cell_chars":16384,"cell_head_chars":4096},"cells_cut":0,"cells_raw":0,"read":"whole","date_system":"1900"}

{"sheet":"Tableau Tournante","index":0,"n_rows":167,"n_cols":69,"rows_kept":167,"cut":false,"hidden":false,"merged":[[4,15,4,16],[4,25,4,26],[4,17,4,18],[0,2,0,3],[0,4,0,5],[0,12,0,13],[0,14,0,17],[3,13,3,16],[4,13,4,14],[3,2,3,11],[3,21,3,24],[4,19,4,20],[3,25,3,28],[4,23,4,24],[4,21,4,22],[3,17,3,20],[1,66,1,68],[1,40,1,43],[1,48,1,50],[1,54,1,56],[1,60,1,62],[4,27,4,28]]}
["tableau pétanque tournante d'Alénya ",null,{"$f":"COUNTA(B6:B180)","v":18},null,"joueurs",null,null,null,null,null,null,2,{"$f":"C1/4","v":4.5}]
[]
[]
[null,null,{"$f":"TODAY()","v":"2016-04-21"},null,null,null,null,null,null,null,null,null,null,"T 1",null,null,null,"T 2",null,null,null,"T 3",null,null,null,"T 4"]
[{"$f":"MOD(C1,L1*2)","v":2},{"$f":"IF(MOD(C1,L1)=0,\"\",\"Incompatible !\")","v":""},null,"T1","T2","T3","T4",null,null,null,null,null,null,"équipe",null,"contre",null,"équipe",null,"contre",null,"équipe",null,"contre",null,"équipe",null,"contre"]
[1,"ALAIN",null,"x",null,null,null,null,null,null,null,null,null,9,2,1,10,1,11,15,18,11,5,1,12,16,1,7,4,null,null,null,null,null,null,null,null,null,null,6,{"$f":"O6","v":2},8,15,null,null,null,{"$f":"$AN$6","v":6},{"$f":"$AN$7","v":3},null,{"$f":"$AN$8","v":8},{"$f":"$AN$9","v":7},null,{"$f":"$AO$6","v":2},{"$f":"$AO$7","v":19},null,{"$f":"$AO$8","v":5},{"$f":"$AO$9","v":2},null,{"$f":"$AP$6","v":8},{"$f":"$AP$7","v":15},null,{"$f":"$AP$8","v":7},{"$f":"$AP$9","v":17},null,{"$f":"$AQ$6","v":15},{"$f":"$AQ$7","v":5},null,{"$f":"$AQ$8","v":16},{"$f":"$AQ$9","v":20}]
[2,"FRANCOIS",null,null,null,null,null,null,null,null,null,null,null,3,18,6,8,17,5,8,10,14,16,3,13,14,13,9,17,null,null,null,null,null,null,null,null,null,null,3,19,15,5,null,null,null,{"$f":"LOOKUP(AU6,$A$6:$A$155,$B$6:$B$155)","v":"ANTOINE"},{"$f":"LOOKUP(AV6,$A$6:$A$155,$B$6:$B$155)","v":"SERGE"},null,{"$f":"LOOKUP(AX6,$A$6:$A$155,$B$6:$B$155)","v":"JEAN-MARIE"},{"$f":"LOOKUP(AY6,$A$6:$A$155,$B$6:$B$155)","v":"JEAN"},null,{"$f":"LOOKUP(BA6,$A$6:$A$155,$B$6:$B$155)","v":"FRANCOIS"},{"$f":"LOOKUP(BB6,$A$6:$A$155,$B$6:$B$155)","v":0},null,{"$f":"LOOKUP(BD6,$A$6:$A$155,$B$6:$B$155)","v":"VERO"},{"$f":"LOOKUP(BE6,$A$6:$A$155,$B$6:$B$155)","v":"FRANCOIS"},null,{"$f":"LOOKUP(BG6,$A$6:$A$155,$B$6:$B$155)","v":"JEAN-MARIE"},{"$f":"LOOKUP(BH6,$A$6:$A$155,$B$6:$B$155)","v":"TONI"},null,{"$f":"LOOKUP(BJ6,$A$6:$A$155,$B$6:$B$155)","v":"JEAN"},{"$f":"LOOKUP(BK6,$A$6:$A$155,$B$6:$B$155)","v":"AIME"},null,{"$f":"LOOKUP(BM6,$A$6:$A$155,$B$6:$B$155)","v":"TONI"},{"$f":"LOOKUP(BN6,$A$6:$A$155,$B$6:$B$155)","v":"VERO"},null,{"$f":"LOOKUP(BP6,$A$6:$A$155,$B$6:$B$155)","v":"CYRILLE"},{"$f":"LOOKUP(BQ6,$A$6:$A$155,$B$6:$B$155)","v":0}]
[3,"SERGE",null,null,null,null,null,null,null,null,null,null,null,12,11,7,13,4,3,13,2,8,2,6,15,12,2,8,18,null,null,null,null,null,null,null,null,null,null,8,5,7,16,null,null,null,{"$f":"$AN$10","v":4},{"$f":"$AN$11","v":9},null,{"$f":"$AN$12","v":5},{"$f":"$AN$13","v":10},null,{"$f":"$AO$10","v":16},{"$f":"$AO$11","v":9},null,{"$f":"$AO$12","v":18},{"$f":"$AO$13","v":11},null,{"$f":"$AP$10","v":4},{"$f":"$AP$11","v":14},null,{"$f":"$AP$12","v":6},{"$f":"$AP$13","v":13},null,{"$f":"$AQ$10","v":17},{"$f":"$AQ$11","v":18},null,{"$f":"$AQ$12","v":7},{"$f":"$AQ$13","v":1}]
[4,"YVES",null,null,null,null,null,null,null,null,null,null,null,17,15,4,16,12,7,6,14,18,4,9,10,3,15,10,5,null,null,null,null,null,null,null,null,null,null,7,2,17,20,null,null,null,{"$f":"LOOKUP(AU8,$A$6:$A$155,$B$6:$B$155)","v":"YVES"},{"$f":"LOOKUP(AV8,$A$6:$A$155,$B$6:$B$155)","v":"MARIE"},null,{"$f":"LOOKUP(AX8,$A$6:$A$155,$B$6:$B$155)","v":"VERO"},{"$f":"LOOKUP(AY8,$A$6:$A$155,$B$6:$B$155)","v":"MICHEL"},null,{"$f":"LOOKUP(BA8,$A$6:$A$155,$B$6:$B$155)","v":"CYRILLE"},{"$f":"LOOKUP(BB8,$A$6:$A$155,$B$6:$B$155)","v":"MARIE"},null,{"$f":"LOOKUP(BD8,$A$6:$A$155,$B$6:$B$155)","v":"GEORGES"},{"$f":"LOOKUP(BE8,$A$6:$A$155,$B$6:$B$155)","v":"MARC"},null,{"$f":"LOOKUP(BG8,$A$6:$A$155,$B$6:$B$155)","v":"YVES"},{"$f":"LOOKUP(BH8,$A$6:$A$155,$B$6:$B$155)","v":"LUCIEN"},null,{"$f":"LOOKUP(BJ8,$A$6:$A$155,$B$6:$B$155)","v":"ANTOINE"},{"$f":"LOOKUP(BK8,$A$6:$A$155,$B$6:$B$155)","v":"JACQUES"},null,{"$f":"LOOKUP(BM8,$A$6:$A$155,$B$6:$B$155)","v":"AIME"},{"$f":"LOOKUP(BN8,$A$6:$A$155,$B$6:$B$155)","v":"GEORGES"},null,{"$f":"LOOKUP(BP8,$A$6:$A$155,$B$6:$B$155)","v":"JEAN"},{"$f":"LOOKUP(BQ8,$A$6:$A$155,$B$6:$B$155)","v":"ALAIN"}]
[5,"VERO",null,null,null,null,null,null,null,null,null,null,null,null,5,14,null,null,9,16,null,null,17,7,null,null,11,6,null,null,null,null,null,null,null,null,null,null,null,4,16,4,17,null,null,null,{"$f":"$AN$14","v":0},{"$f":"$AN$15","v":0},null,{"$f":"$AN$16","v":0},{"$f":"$AN$17","v":0},null,{"$f":"$AO$14","v":20},{"$f":"$AO$15","v":8},null,{"$f":"$AO$16","v":13},{"$f":"$AO$17","v":3},null,{"$f":"$AP$14","v":9},{"$f":"$AP$15","v":18},null,{"$f":"$AP$16","v":5},{"$f":"$AP$17","v":10},null,{"$f":"$AQ$14","v":10},{"$f":"$AQ$15","v":2},null,{"$f":"$AQ$16","v":6},{"$f":"$AQ$17","v":9}]
[6,"ANTOINE",null,null,null,null,null,null,null,null,null,null,null,null,null,null,null,null,null,null,null,null,null,null,null,null,null,null,null,null,null,null,null,null,null,null,null,null,null,9,9,14,18,null,null,null,{"$f":"LOOKUP(AU10,$A$6:$A$155,$B$6:$B$155)","v":{"$error":"#N/A"}},{"$f":"LOOKUP(AV10,$A$6:$A$155,$B$6:$B$155)","v":{"$error":"#N/A"}},null,{"$f":"LOOKUP(AX10,$A$6:$A$155,$B$6:$B$155)","v":{"$error":"#N/A"}},{"$f":"LOOKUP(AY10,$A$6:$A$155,$B$6:$B$155)","v":{"$error":"#N/A"}},null,{"$f":"LOOKUP(BA10,$A$6:$A$155,$B$6:$B$155)","v":0},{"$f":"LOOKUP(BB10,$A$6:$A$155,$B$6:$B$155)","v":"JEAN-MARIE"},null,{"$f":"LOOKUP(BD10,$A$6:$A$155,$B$6:$B$155)","v":"JACQUES"},{"$f":"LOOKUP(BE10,$A$6:$A$155,$B$6:$B$155)","v":"SERGE"},null,{"$f":"LOOKUP(BG10,$A$6:$A$155,$B$6:$B$155)","v":"MARIE"},{"$f":"LOOKUP(BH10,$A$6:$A$155,$B$6:$B$155)","v":"GEORGES"},null,{"$f":"LOOKUP(BJ10,$A$6:$A$155,$B$6:$B$155)","v":"VERO"},{"$f":"LOOKUP(BK10,$A$6:$A$155,$B$6:$B$155)","v":"MICHEL"},null,{"$f":"LOOKUP(BM10,$A$6:$A$155,$B$6:$B$155)","v":"MICHEL"},{"$f":"LOOKUP(BN10,$A$6:$A$155,$B$6:$B$155)","v":"FRANCOIS"},null,{"$f":"LOOKUP(BP10,$A$6:$A$155,$B$6:$B$155)","v":"ANTOINE"},{"$f":"LOOKUP(BQ10,$A$6:$A$155,$B$6:$B$155)","v":"MARIE"}]
[7,"JEAN",null,null,null,null,null,null,null,null,null,null,null,null,null,null,null,null,null,null,null,null,null,null,null,null,null,null,null,null,null,null,null,null,null,null,null,null,null,5,18,6,7,null,null,null,{"$f":"$AN$18","v":0},{"$f":"$AN$19","v":0},null,{"$f":"$AN$20","v":0},{"$f":"$AN$21","v":0},null,{"$f":"$AO$18","v":12},{"$f":"$AO$19","v":7},null,{"$f":"$AO$20","v":17},{"$f":"$AO$21","v":15},null,{"$f":"$AP$18","v":16},{"$f":"$AP$19","v":12},null,{"$f":"$AP$20","v":19},{"$f":"$AP$21","v":2},null,{"$f":"$AQ$18","v":8},{"$f":"$AQ$19","v":3},null,{"$f":"$AQ$20","v":11},{"$f":"$AQ$21","v":14}]
[8,"JEAN-MARIE",null,null,null,null,null,null,null,null,null,null,null,null,null,null,null,null,null,null,null,null,null,null,null,null,null,null,null,null,null,null,null,null,null,null,null,null,null,10,11,13,1,null,null,null,{"$f":"LOOKUP(AU12,$A$6:$A$155,$B$6:$B$155)","v":{"$error":"#N/A"}},{"$f":"LOOKUP(AV12,$A$6:$A$155,$B$6:$B$155)","v":{"$error":"#N/A"}},null,{"$f":"LOOKUP(AX12,$A$6:$A$155,$B$6:$B$155)","v":{"$error":"#N/A"}},{"$f":"LOOKUP(AY12,$A$6:$A$155,$B$6:$B$155)","v":{"$error":"#N/A"}},null,{"$f":"LOOKUP(BA12,$A$6:$A$155,$B$6:$B$155)","v":"MARCEL"},{"$f":"LOOKUP(BB12,$A$6:$A$155,$B$6:$B$155)","v":"JEAN"},null,{"$f":"LOOKUP(BD12,$A$6:$A$155,$B$6:$B$155)","v":"AIME"},{"$f":"LOOKUP(BE12,$A$6:$A$155,$B$6:$B$155)","v":"TONI"},null,{"$f":"LOOKUP(BG12,$A$6:$A$155,$B$6:$B$155)","v":"CYRILLE"},{"$f":"LOOKUP(BH12,$A$6:$A$155,$B$6:$B$155)","v":"MARCEL"},null,{"$f":"LOOKUP(BJ12,$A$6:$A$155,$B$6:$B$155)","v":0},{"$f":"LOOKUP(BK12,$A$6:$A$155,$B$6:$B$155)","v":"FRANCOIS"},null,{"$f":"LOOKUP(BM12,$A$6:$A$155,$B$6:$B$155)","v":"JEAN-MARIE"},{"$f":"LOOKUP(BN12,$A$6:$A$155,$B$6:$B$155)","v":"SERGE"},null,{"$f":"LOOKUP(BP12,$A$6:$A$155,$B$6:$B$155)","v":"MARC"},{"$f":"LOOKUP(BQ12,$A$6:$A$155,$B$6:$B$155)","v":"LUCIEN"}]
[9,"MARIE",null,null,null,null,null,null,null,null,null,null,null,null,null,null,null,null,null,null,null,null,null,null,null,null,null,null,null,null,null,null,null,null,null,null,null,null,null,null,20,9,10,null,null,null,{"$f":"$AN$22","v":0},{"$f":"$AN$23","v":0},null,{"$f":"$AN$24","v":0},{"$f":"$AN$25","v":0},null,{"$f":"$AO$22","v":1},{"$f":"$AO$23","v":14},null,{"$f":"$AO$24","v":4},{"$f":"$AO$25","v":6},null,{"$f":"$AP$22","v":11},{"$f":"$AP$23","v":3},null,{"$f":"$AP$24","v":1},{"$f":"$AP$25","v":20},null,{"$f":"$AQ$22","v":19},{"$f":"$AQ$23","v":4},null,{"$f":"$AQ$24","v":13},{"$f":"$AQ$25","v":12}]
[10,"MICHEL",null,null,null,null,null,null,null,null,null,null,null,null,null,null,null,null,null,null,null,null,null,null,null,null,null,null,null,null,null,null,null,null,null,null,null,null,null,null,8,18,2,null,null,null,{"$f":"LOOKUP(AU14,$A$6:$A$155,$B$6:$B$155)","v":{"$error":"#N/A"}},{"$f":"LOOKUP(AV14,$A$6:$A$155,$B$6:$B$155)","v":{"$error":"#N/A"}},null,{"$f":"LOOKUP(AX14,$A$6:$A$155,$B$6:$B$155)","v":{"$error":"#N/A"}},{"$f":"LOOKUP(AY14,$A$6:$A$155,$B$6:$B$155)","v":{"$error":"#N/A"}},null,{"$f":"LOOKUP(BA14,$A$6:$A$155,$B$6:$B$155)","v":"ALAIN"},{"$f":"LOOKUP(BB14,$A$6:$A$155,$B$6:$B$155)","v":"LUCIEN"},null,{"$f":"LOOKUP(BD14,$A$6:$A$155,$B$6:$B$155)","v":"YVES"},{"$f":"LOOKUP(BE14,$A$6:$A$155,$B$6:$B$155)","v":"ANTOINE"},null,{"$f":"LOOKUP(BG14,$A$6:$A$155,$B$6:$B$155)","v":"MARC"},{"$f":"LOOKUP(BH14,$A$6:$A$155,$B$6:$B$155)","v":"SERGE"},null,{"$f":"LOOKUP(BJ14,$A$6:$A$155,$B$6:$B$155)","v":"ALAIN"},{"$f":"LOOKUP(BK14,$A$6:$A$155,$B$6:$B$155)","v":0},null,{"$f":"LOOKUP(BM14,$A$6:$A$155,$B$6:$B$155)","v":0},{"$f":"LOOKUP(BN14,$A$6:$A$155,$B$6:$B$155)","v":"YVES"},null,{"$f":"LOOKUP(BP14,$A$6:$A$155,$B$6:$B$155)","v":"JACQUES"},{"$f":"LOOKUP(BQ14,$A$6:$A$155,$B$6:$B$155)","v":"MARCEL"}]
[11,"MARC",null,null,null,null,null,null,null,null,null,null,null,null,null,null,null,null,null,null,null,null,null,null,null,null,null,null,null,null,null,null,null,null,null,null,null,null,null,null,13,5,6,null,null,null,{"$f":"$AN$26","v":0},{"$f":"$AN$27","v":0},null,{"$f":"$AN$28","v":0},{"$f":"$AN$29","v":0},null,{"$f":"$AO$26","v":0},{"$f":"$AO$27","v":0},null,{"$f":"$AO$28","v":0},{"$f":"$AO$29","v":0},null,{"$f":"$AP$26","v":0},{"$f":"$AP$27","v":0},null,{"$f":"$AP$28","v":0},{"$f":"$AP$29","v":0},null,{"$f":"$AQ$26","v":0},{"$f":"$AQ$27","v":0},null,{"$f":"$AQ$28","v":0},{"$f":"$AQ$29","v":0}]
[12,"MARCEL",null,null,null,null,null,null,null,null,null,null,null,null,null,null,null,null,null,null,null,null,null,null,null,null,null,null,null,null,null,null,null,null,null,null,null,null,null,null,3,10,9,null,null,null,{"$f":"LOOKUP(AU16,$A$6:$A$155,$B$6:$B$155)","v":{"$error":"#N/A"}},{"$f":"LOOKUP(AV16,$A$6:$A$155,$B$6:$B$155)","v":{"$error":"#N/A"}},null,{"$f":"LOOKUP(AX16,$A$6:$A$155,$B$6:$B$155)","v":{"$error":"#N/A"}},{"$f":"LOOKUP(AY16,$A$6:$A$155,$B$6:$B$155)","v":{"$error":"#N/A"}},null,{"$f":"LOOKUP(BA16,$A$6:$A$155,$B$6:$B$155)","v":{"$error":"#N/A"}},{"$f":"LOOKUP(BB16,$A$6:$A$155,$B$6:$B$155)","v":{"$error":"#N/A"}},null,{"$f":"LOOKUP(BD16,$A$6:$A$155,$B$6:$B$155)","v":{"$error":"#N/A"}},{"$f":"LOOKUP(BE16,$A$6:$A$155,$B$6:$B$155)","v":{"$error":"#N/A"}},null,{"$f":"LOOKUP(BG16,$A$6:$A$155,$B$6:$B$155)","v":{"$error":"#N/A"}},{"$f":"LOOKUP(BH16,$A$6:$A$155,$B$6:$B$155)","v":{"$error":"#N/A"}},null,{"$f":"LOOKUP(BJ16,$A$6:$A$155,$B$6:$B$155)","v":{"$error":"#N/A"}},{"$f":"LOOKUP(BK16,$A$6:$A$155,$B$6:$B$155)","v":{"$error":"#N/A"}},null,{"$f":"LOOKUP(BM16,$A$6:$A$155,$B$6:$B$155)","v":{"$error":"#N/A"}},{"$f":"LOOKUP(BN16,$A$6:$A$155,$B$6:$B$155)","v":{"$error":"#N/A"}},null,{"$f":"LOOKUP(BP16,$A$6:$A$155,$B$6:$B$155)","v":{"$error":"#N/A"}},{"$f":"LOOKUP(BQ16,$A$6:$A$155,$B$6:$B$155)","v":{"$error":"#N/A"}}]
[13,"JACQUES",null,null,null,null,null,null,null,null,null,null,null,null,null,null,null,null,null,null,null,null,null,null,null,null,null,null,null,null,null,null,null,null,null,null,null,null,null,null,12,16,8,null,null,null,{"$f":"$AN$30","v":0},{"$f":"$AN$31","v":0},null,{"$f":"$AN$32","v":0},{"$f":"$AN$33","v":0},null,{"$f":"$AO$30","v":0},{"$f":"$AO$31","v":0},null,{"$f":"$AO$32","v":0},{"$f":"$AO$33","v":0},null,{"$f":"$AP$30","v":0},{"$f":"$AP$31","v":0},null,{"$f":"$AP$32","v":0},{"$f":"$AP$33","v":0},null,{"$f":"$AQ$30","v":0},{"$f":"$AQ$31","v":0},null,{"$f":"$AQ$32","v":0},{"$f":"$AQ$33","v":0}]
[14,"LUCIEN",null,null,null,null,null,null,null,null,null,null,null,null,null,null,null,null,null,null,null,null,null,null,null,null,null,null,null,null,null,null,null,null,null,null,null,null,null,null,7,12,3,null,null,null,{"$f":"LOOKUP(AU18,$A$6:$A$155,$B$6:$B$155)","v":{"$error":"#N/A"}},{"$f":"LOOKUP(AV18,$A$6:$A$155,$B$6:$B$155)","v":{"$error":"#N/A"}},null,{"$f":"LOOKUP(AX18,$A$6:$A$155,$B$6:$B$155)","v":{"$error":"#N/A"}},{"$f":"LOOKUP(AY18,$A$6:$A$155,$B$6:$B$155)","v":{"$error":"#N/A"}},null,{"$f":"LOOKUP(BA18,$A$6:$A$155,$B$6:$B$155)","v":{"$error":"#N/A"}},{"$f":"LOOKUP(BB18,$A$6:$A$155,$B$6:$B$155)","v":{"$error":"#N/A"}},null,{"$f":"LOOKUP(BD18,$A$6:$A$155,$B$6:$B$155)","v":{"$error":"#N/A"}},{"$f":"LOOKUP(BE18,$A$6:$A$155,$B$6:$B$155)","v":{"$error":"#N/A"}},null,{"$f":"LOOKUP(BG18,$A$6:$A$155,$B$6:$B$155)","v":{"$error":"#N/A"}},{"$f":"LOOKUP(BH18,$A$6:$A$155,$B$6:$B$155)","v":{"$error":"#N/A"}},null,{"$f":"LOOKUP(BJ18,$A$6:$A$155,$B$6:$B$155)","v":{"$error":"#N/A"}},{"$f":"LOOKUP(BK18,$A$6:$A$155,$B$6:$B$155)","v":{"$error":"#N/A"}},null,{"$f":"LOOKUP(BM18,$A$6:$A$155,$B$6:$B$155)","v":{"$error":"#N/A"}},{"$f":"LOOKUP(BN18,$A$6:$A$155,$B$6:$B$155)","v":{"$error":"#N/A"}},null,{"$f":"LOOKUP(BP18,$A$6:$A$155,$B$6:$B$155)","v":{"$error":"#N/A"}},{"$f":"LOOKUP(BQ18,$A$6:$A$155,$B$6:$B$155)","v":{"$error":"#N/A"}}]
[15,"TONI",null,null,null,null,null,null,null,null,null,null,null,null,null,null,null,null,null,null,null,null,null,null,null,null,null,null,null,null,null,null,null,null,null,null,null,null,null,null,17,19,11,null,null,null,{"$f":"$AN$34","v":0},{"$f":"$AN$35","v":0},null,{"$f":"$AN$36","v":0},{"$f":"$AN$37","v":0},null,{"$f":"$AO$34","v":0},{"$f":"$AO$35","v":0},null,{"$f":"$AO$36","v":0},{"$f":"$AO$37","v":0},null,{"$f":"$AP$34","v":0},{"$f":"$AP$35","v":0},null,{"$f":"$AP$36","v":0},{"$f":"$AP$37","v":0},null,{"$f":"$AQ$34","v":0},{"$f":"$AQ$35","v":0},null,{"$f":"$AQ$36","v":0},{"$f":"$AQ$37","v":0}]
[16,"CYRILLE",null,null,null,null,null,null,null,null,null,null,null,null,null,null,null,null,null,null,null,null,null,null,null,null,null,null,null,null,null,null,null,null,null,null,null,null,null,null,15,2,14,null,null,null,{"$f":"LOOKUP(AU20,$A$6:$A$155,$B$6:$B$155)","v":{"$error":"#N/A"}},{"$f":"LOOKUP(AV20,$A$6:$A$155,$B$6:$B$155)","v":{"$error":"#N/A"}},null,{"$f":"LOOKUP(AX20,$A$6:$A$155,$B$6:$B$155)","v":{"$error":"#N/A"}},{"$f":"LOOKUP(AY20,$A$6:$A$155,$B$6:$B$155)","v":{"$error":"#N/A"}},null,{"$f":"LOOKUP(BA20,$A$6:$A$155,$B$6:$B$155)","v":{"$error":"#N/A"}},{"$f":"LOOKUP(BB20,$A$6:$A$155,$B$6:$B$155)","v":{"$error":"#N/A"}},null,{"$f":"LOOKUP(BD20,$A$6:$A$155,$B$6:$B$155)","v":{"$error":"#N/A"}},{"$f":"LOOKUP(BE20,$A$6:$A$155,$B$6:$B$155)","v":{"$error":"#N/A"}},null,{"$f":"LOOKUP(BG20,$A$6:$A$155,$B$6:$B$155)","v":{"$error":"#N/A"}},{"$f":"LOOKUP(BH20,$A$6:$A$155,$B$6:$B$155)","v":{"$error":"#N/A"}},null,{"$f":"LOOKUP(BJ20,$A$6:$A$155,$B$6:$B$155)","v":{"$error":"#N/A"}},{"$f":"LOOKUP(BK20,$A$6:$A$155,$B$6:$B$155)","v":{"$error":"#N/A"}},null,{"$f":"LOOKUP(BM20,$A$6:$A$155,$B$6:$B$155)","v":{"$error":"#N/A"}},{"$f":"LOOKUP(BN20,$A$6:$A$155,$B$6:$B$155)","v":{"$error":"#N/A"}},null,{"$f":"LOOKUP(BP20,$A$6:$A$155,$B$6:$B$155)","v":{"$error":"#N/A"}},{"$f":"LOOKUP(BQ20,$A$6:$A$155,$B$6:$B$155)","v":{"$error":"#N/A"}}]
[17,"AIME",null,null,null,null,null,null,null,null,null,null,null,null,null,null,null,null,null,null,null,null,null,null,null,null,null,null,null,null,null,null,null,null,null,null,null,null,null,null,1,11,19,null,null,null,{"$f":"$AN$38","v":0},{"$f":"$AN$39","v":0},null,{"$f":"$AN$40","v":0},{"$f":"$AN$41","v":0},null,{"$f":"$AO$38","v":0},{"$f":"$AO$39","v":0},null,{"$f":"$AO$40","v":0},{"$f":"$AO$41","v":0},null,{"$f":"$AP$38","v":0},{"$f":"$AP$39","v":0},null,{"$f":"$AP$40","v":0},{"$f":"$AP$41","v":0},null,{"$f":"$AQ$38","v":0},{"$f":"$AQ$39","v":0},null,{"$f":"$AQ$40","v":0},{"$f":"$AQ$41","v":0}]
[18,"GEORGES",null,null,null,null,null,null,null,null,null,null,null,null,null,null,null,null,null,null,null,null,null,null,null,null,null,null,null,null,null,null,null,null,null,null,null,null,null,null,14,3,4,null,null,null,{"$f":"LOOKUP(AU22,$A$6:$A$155,$B$6:$B$155)","v":{"$error":"#N/A"}},{"$f":"LOOKUP(AV22,$A$6:$A$155,$B$6:$B$155)","v":{"$error":"#N/A"}},null,{"$f":"LOOKUP(AX22,$A$6:$A$155,$B$6:$B$155)","v":{"$error":"#N/A"}},{"$f":"LOOKUP(AY22,$A$6:$A$155,$B$6:$B$155)","v":{"$error":"#N/A"}},null,{"$f":"LOOKUP(BA22,$A$6:$A$155,$B$6:$B$155)","v":{"$error":"#N/A"}},{"$f":"LOOKUP(BB22,$A$6:$A$155,$B$6:$B$155)","v":{"$error":"#N/A"}},null,{"$f":"LOOKUP(BD22,$A$6:$A$155,$B$6:$B$155)","v":{"$error":"#N/A"}},{"$f":"LOOKUP(BE22,$A$6:$A$155,$B$6:$B$155)","v":{"$error":"#N/A"}},null,{"$f":"LOOKUP(BG22,$A$6:$A$155,$B$6:$B$155)","v":{"$error":"#N/A"}},{"$f":"LOOKUP(BH22,$A$6:$A$155,$B$6:$B$155)","v":{"$error":"#N/A"}},null,{"$f":"LOOKUP(BJ22,$A$6:$A$155,$B$6:$B$155)","v":{"$error":"#N/A"}},{"$f":"LOOKUP(BK22,$A$6:$A$155,$B$6:$B$155)","v":{"$error":"#N/A"}},null,{"$f":"LOOKUP(BM22,$A$6:$A$155,$B$6:$B$155)","v":{"$error":"#N/A"}},{"$f":"LOOKUP(BN22,$A$6:$A$155,$B$6:$B$155)","v":{"$error":"#N/A"}},null,{"$f":"LOOKUP(BP22,$A$6:$A$155,$B$6:$B$155)","v":{"$error":"#N/A"}},{"$f":"LOOKUP(BQ22,$A$6:$A$155,$B$6:$B$155)","v":{"$error":"#N/A"}}]
[19,null,null,null,null,null,null,null,null,null,null,null,null,null,null,null,null,null,null,null,null,null,null,null,null,null,null,null,null,null,null,null,null,null,null,null,null,null,null,null,4,1,13,null,null,null,{"$f":"$AN$42","v":0},{"$f":"$AN$43","v":0},null,{"$f":"$AN$44","v":0},{"$f":"$AN$45","v":0},null,{"$f":"$AO$42","v":0},{"$f":"$AO$43","v":0},null,{"$f":"$AO$44","v":0},{"$f":"$AO$45","v":0},null,{"$f":"$AP$42","v":0},{"$f":"$AP$43","v":0},null,{"$f":"$AP$44","v":0},{"$f":"$AP$45","v":0},null,{"$f":"$AQ$42","v":0},{"$f":"$AQ$43","v":0},null,{"$f":"$AQ$44","v":0},{"$f":"$AQ$45","v":0}]
[20,null,null,null,null,null,null,null,null,null,null,null,null,null,null,null,null,null,null,null,null,null,null,null,null,null,null,null,null,null,null,null,null,null,null,null,null,null,null,null,6,20,12,null,null,null,{"$f":"LOOKUP(AU24,$A$6:$A$155,$B$6:$B$155)","v":{"$error":"#N/A"}},{"$f":"LOOKUP(AV24,$A$6:$A$155,$B$6:$B$155)","v":{"$error":"#N/A"}},null,{"$f":"LOOKUP(AX24,$A$6:$A$155,$B$6:$B$155)","v":{"$error":"#N/A"}},{"$f":"LOOKUP(AY24,$A$6:$A$155,$B$6:$B$155)","v":{"$error":"#N/A"}},null,{"$f":"LOOKUP(BA24,$A$6:$A$155,$B$6:$B$155)","v":{"$error":"#N/A"}},{"$f":"LOOKUP(BB24,$A$6:$A$155,$B$6:$B$155)","v":{"$error":"#N/A"}},null,{"$f":"LOOKUP(BD24,$A$6:$A$155,$B$6:$B$155)","v":{"$error":"#N/A"}},{"$f":"LOOKUP(BE24,$A$6:$A$155,$B$6:$B$155)","v":{"$error":"#N/A"}},null,{"$f":"LOOKUP(BG24,$A$6:$A$155,$B$6:$B$155)","v":{"$error":"#N/A"}},{"$f":"LOOKUP(BH24,$A$6:$A$155,$B$6:$B$155)","v":{"$error":"#N/A"}},null,{"$f":"LOOKUP(BJ24,$A$6:$A$155,$B$6:$B$155)","v":{"$error":"#N/A"}},{"$f":"LOOKUP(BK24,$A$6:$A$155,$B$6:$B$155)","v":{"$error":"#N/A"}},null,{"$f":"LOOKUP(BM24,$A$6:$A$155,$B$6:$B$155)","v":{"$error":"#N/A"}},{"$f":"LOOKUP(BN24,$A$6:$A$155,$B$6:$B$155)","v":{"$error":"#N/A"}},null,{"$f":"LOOKUP(BP24,$A$6:$A$155,$B$6:$B$155)","v":{"$error":"#N/A"}},{"$f":"LOOKUP(BQ24,$A$6:$A$155,$B$6:$B$155)","v":{"$error":"#N/A"}}]
[21,null,null,null,null,null,null,null,null,null,null,null,null,null,null,null,null,null,null,null,null,null,null,null,null,null,null,null,null,null,null,null,null,null,null,null,null,null,null,null,null,null,null,null,null,null,{"$f":"$AN$46","v":0},{"$f":"$AN$47","v":0},null,{"$f":"$AN$48","v":0},{"$f":"$AN$49","v":0},null,{"$f":"$AO$46","v":0},{"$f":"$AO$47","v":0},null,{"$f":"$AO$48","v":0},{"$f":"$AO$49","v":0},null,{"$f":"$AP$46","v":0},{"$f":"$AP$47","v":0},null,{"$f":"$AP$48","v":0},{"$f":"$AP$49","v":0},null,{"$f":"$AQ$46","v":0},{"$f":"$AQ$47","v":0},null,{"$f":"$AQ$48","v":0},{"$f":"$AQ$49","v":0}]
[22,null,null,null,null,null,null,null,null,null,null,null,null,null,null,null,null,null,null,null,null,null,null,null,null,null,null,null,null,null,null,null,null,null,null,null,null,null,null,null,null,null,null,null,null,null,{"$f":"LOOKUP(AU26,$A$6:$A$155,$B$6:$B$155)","v":{"$error":"#N/A"}},{"$f":"LOOKUP(AV26,$A$6:$A$155,$B$6:$B$155)","v":{"$error":"#N/A"}},null,{"$f":"LOOKUP(AX26,$A$6:$A$155,$B$6:$B$155)","v":{"$error":"#N/A"}},{"$f":"LOOKUP(AY26,$A$6:$A$155,$B$6:$B$155)","v":{"$error":"#N/A"}},null,{"$f":"LOOKUP(BA26,$A$6:$A$155,$B$6:$B$155)","v":{"$error":"#N/A"}},{"$f":"LOOKUP(BB26,$A$6:$A$155,$B$6:$B$155)","v":{"$error":"#N/A"}},null,{"$f":"LOOKUP(BD26,$A$6:$A$155,$B$6:$B$155)","v":{"$error":"#N/A"}},{"$f":"LOOKUP(BE26,$A$6:$A$155,$B$6:$B$155)","v":{"$error":"#N/A"}},null,{"$f":"LOOKUP(BG26,$A$6:$A$155,$B$6:$B$155)","v":{"$error":"#N/A"}},{"$f":"LOOKUP(BH26,$A$6:$A$155,$B$6:$B$155)","v":{"$error":"#N/A"}},null,{"$f":"LOOKUP(BJ26,$A$6:$A$155,$B$6:$B$155)","v":{"$error":"#N/A"}},{"$f":"LOOKUP(BK26,$A$6:$A$155,$B$6:$B$155)","v":{"$error":"#N/A"}},null,{"$f":"LOOKUP(BM26,$A$6:$A$155,$B$6:$B$155)","v":{"$error":"#N/A"}},{"$f":"LOOKUP(BN26,$A$6:$A$155,$B$6:$B$155)","v":{"$error":"#N/A"}},null,{"$f":"LOOKUP(BP26,$A$6:$A$155,$B$6:$B$155)","v":{"$error":"#N/A"}},{"$f":"LOOKUP(BQ26,$A$6:$A$155,$B$6:$B$155)","v":{"$error":"#N/A"}}]
[23,null,null,null,null,null,null,null,null,null,null,null,null,null,null,null,null,null,null,null,null,null,null,null,null,null,null,null,null,null,null,null,null,null,null,null,null,null,null,null,null,null,null,null,null,null,{"$f":"$AN$50","v":0},{"$f":"$AN$51","v":0},null,{"$f":"$AN$52","v":0},{"$f":"$AN$53","v":0},null,{"$f":"$AO$50","v":0},{"$f":"$AO$51","v":0},null,{"$f":"$AO$52","v":0},{"$f":"$AO$53","v":0},null,{"$f":"$AP$50","v":0},{"$f":"$AP$51","v":0},null,{"$f":"$AP$52","v":0},{"$f":"$AP$53","v":0},null,{"$f":"$AQ$50","v":0},{"$f":"$AQ$51","v":0},null,{"$f":"$AQ$52","v":0},{"$f":"$AQ$53","v":0}]
[24,null,null,null,null,null,null,null,null,null,null,null,null,null,null,null,null,null,null,null,null,null,null,null,null,null,null,null,null,null,null,null,null,null,null,null,null,null,null,null,null,null,null,null,null,null,{"$f":"LOOKUP(AU28,$A$6:$A$155,$B$6:$B$155)","v":{"$error":"#N/A"}},{"$f":"LOOKUP(AV28,$A$6:$A$155,$B$6:$B$155)","v":{"$error":"#N/A"}},null,{"$f":"LOOKUP(AX28,$A$6:$A$155,$B$6:$B$155)","v":{"$error":"#N/A"}},{"$f":"LOOKUP(AY28,$A$6:$A$155,$B$6:$B$155)","v":{"$error":"#N/A"}},null,{"$f":"LOOKUP(BA28,$A$6:$A$155,$B$6:$B$155)","v":{"$error":"#N/A"}},{"$f":"LOOKUP(BB28,$A$6:$A$155,$B$6:$B$155)","v":{"$error":"#N/A"}},null,{"$f":"LOOKUP(BD28,$A$6:$A$155,$B$6:$B$155)","v":{"$error":"#N/A"}},{"$f":"LOOKUP(BE28,$A$6:$A$155,$B$6:$B$155)","v":{"$error":"#N/A"}},null,{"$f":"LOOKUP(BG28,$A$6:$A$155,$B$6:$B$155)","v":{"$error":"#N/A"}},{"$f":"LOOKUP(BH28,$A$6:$A$155,$B$6:$B$155)","v":{"$error":"#N/A"}},null,{"$f":"LOOKUP(BJ28,$A$6:$A$155,$B$6:$B$155)","v":{"$error":"#N/A"}},{"$f":"LOOKUP(BK28,$A$6:$A$155,$B$6:$B$155)","v":{"$error":"#N/A"}},null,{"$f":"LOOKUP(BM28,$A$6:$A$155,$B$6:$B$155)","v":{"$error":"#N/A"}},{"$f":"LOOKUP(BN28,$A$6:$A$155,$B$6:$B$155)","v":{"$error":"#N/A"}},null,{"$f":"LOOKUP(BP28,$A$6:$A$155,$B$6:$B$155)","v":{"$error":"#N/A"}},{"$f":"LOOKUP(BQ28,$A$6:$A$155,$B$6:$B$155)","v":{"$error":"#N/A"}}]
[25,null,null,null,null,null,null,null,null,null,null,null,null,null,null,null,null,null,null,null,null,null,null,null,null,null,null,null,null,null,null,null,null,null,null,null,null,null,null,null,null,null,null,null,null,null,{"$f":"$AN$54","v":0},{"$f":"$AN$55","v":0},null,{"$f":"$AN$56","v":0},{"$f":"$AN$57","v":0},null,{"$f":"$AO$54","v":0},{"$f":"$AO$55","v":0},null,{"$f":"$AO$56","v":0},{"$f":"$AO$57","v":0},null,{"$f":"$AP$54","v":0},{"$f":"$AP$55","v":0},null,{"$f":"$AP$56","v":0},{"$f":"$AP$57","v":0},null,{"$f":"$AQ$54","v":0},{"$f":"$AQ$55","v":0},null,{"$f":"$AQ$56","v":0},{"$f":"$AQ$57","v":0}]
[26,null,null,null,null,null,null,null,null,null,null,null,null,null,null,null,null,null,null,null,null,null,null,null,null,null,null,null,null,null,null,null,null,null,null,null,null,null,null,null,null,null,null,null,null,null,{"$f":"LOOKUP(AU30,$A$6:$A$155,$B$6:$B$155)","v":{"$error":"#N/A"}},{"$f":"LOOKUP(AV30,$A$6:$A$155,$B$6:$B$155)","v":{"$error":"#N/A"}},null,{"$f":"LOOKUP(AX30,$A$6:$A$155,$B$6:$B$155)","v":{"$error":"#N/A"}},{"$f":"LOOKUP(AY30,$A$6:$A$155,$B$6:$B$155)","v":{"$error":"#N/A"}},null,{"$f":"LOOKUP(BA30,$A$6:$A$155,$B$6:$B$155)","v":{"$error":"#N/A"}},{"$f":"LOOKUP(BB30,$A$6:$A$155,$B$6:$B$155)","v":{"$error":"#N/A"}},null,{"$f":"LOOKUP(BD30,$A$6:$A$155,$B$6:$B$155)","v":{"$error":"#N/A"}},{"$f":"LOOKUP(BE30,$A$6:$A$155,$B$6:$B$155)","v":{"$error":"#N/A"}},null,{"$f":"LOOKUP(BG30,$A$6:$A$155,$B$6:$B$155)","v":{"$error":"#N/A"}},{"$f":"LOOKUP(BH30,$A$6:$A$155,$B$6:$B$155)","v":{"$error":"#N/A"}},null,{"$f":"LOOKUP(BJ30,$A$6:$A$155,$B$6:$B$155)","v":{"$error":"#N/A"}},{"$f":"LOOKUP(BK30,$A$6:$A$155,$B$6:$B$155)","v":{"$error":"#N/A"}},null,{"$f":"LOOKUP(BM30,$A$6:$A$155,$B$6:$B$155)","v":{"$error":"#N/A"}},{"$f":"LOOKUP(BN30,$A$6:$A$155,$B$6:$B$155)","v":{"$error":"#N/A"}},null,{"$f":"LOOKUP(BP30,$A$6:$A$155,$B$6:$B$155)","v":{"$error":"#N/A"}},{"$f":"LOOKUP(BQ30,$A$6:$A$155,$B$6:$B$155)","v":{"$error":"#N/A"}}]
[27,null,null,null,null,null,null,null,null,null,null,null,null,null,null,null,null,null,null,null,null,null,null,null,null,null,null,null,null,null,null,null,null,null,null,null,null,null,null,null,null,null,null,null,null,null,{"$f":"$AN$58","v":0},{"$f":"$AN$59","v":0},null,{"$f":"$AN$60","v":0},{"$f":"$AN$61","v":0},null,{"$f":"$AO$58","v":0},{"$f":"$AO$59","v":0},null,{"$f":"$AO$60","v":0},{"$f":"$AO$61","v":0},null,{"$f":"$AP$58","v":0},{"$f":"$AP$59","v":0},null,{"$f":"$AP$60","v":0},{"$f":"$AP$61","v":0},null,{"$f":"$AQ$58","v":0},{"$f":"$AQ$59","v":0},null,{"$f":"$AQ$60","v":0},{"$f":"$AQ$61","v":0}]
[28,null,null,null,null,null,null,null,null,null,null,null,null,null,null,null,null,null,null,null,null,null,null,null,null,null,null,null,null,null,null,null,null,null,null,null,null,null,null,null,null,null,null,null,null,null,{"$f":"LOOKUP(AU32,$A$6:$A$155,$B$6:$B$155)","v":{"$error":"#N/A"}},{"$f":"LOOKUP(AV32,$A$6:$A$155,$B$6:$B$155)","v":{"$error":"#N/A"}},null,{"$f":"LOOKUP(AX32,$A$6:$A$155,$B$6:$B$155)","v":{"$error":"#N/A"}},{"$f":"LOOKUP(AY32,$A$6:$A$155,$B$6:$B$155)","v":{"$error":"#N/A"}},null,{"$f":"LOOKUP(BA32,$A$6:$A$155,$B$6:$B$155)","v":{"$error":"#N/A"}},{"$f":"LOOKUP(BB32,$A$6:$A$155,$B$6:$B$155)","v":{"$error":"#N/A"}},null,{"$f":"LOOKUP(BD32,$A$6:$A$155,$B$6:$B$155)","v":{"$error":"#N/A"}},{"$f":"LOOKUP(BE32,$A$6:$A$155,$B$6:$B$155)","v":{"$error":"#N/A"}},null,{"$f":"LOOKUP(BG32,$A$6:$A$155,$B$6:$B$155)","v":{"$error":"#N/A"}},{"$f":"LOOKUP(BH32,$A$6:$A$155,$B$6:$B$155)","v":{"$error":"#N/A"}},null,{"$f":"LOOKUP(BJ32,$A$6:$A$155,$B$6:$B$155)","v":{"$error":"#N/A"}},{"$f":"LOOKUP(BK32,$A$6:$A$155,$B$6:$B$155)","v":{"$error":"#N/A"}},null,{"$f":"LOOKUP(BM32,$A$6:$A$155,$B$6:$B$155)","v":{"$error":"#N/A"}},{"$f":"LOOKUP(BN32,$A$6:$A$155,$B$6:$B$155)","v":{"$error":"#N/A"}},null,{"$f":"LOOKUP(BP32,$A$6:$A$155,$B$6:$B$155)","v":{"$error":"#N/A"}},{"$f":"LOOKUP(BQ32,$A$6:$A$155,$B$6:$B$155)","v":{"$error":"#N/A"}}]
[29,null,null,null,null,null,null,null,null,null,null,null,null,null,null,null,null,null,null,null,null,null,null,null,null,null,null,null,null,null,null,null,null,null,null,null,null,null,null,null,null,null,null,null,null,null,{"$f":"$AN$62","v":0},{"$f":"$AN$63","v":0},null,{"$f":"$AN$64","v":0},{"$f":"$AN$65","v":0},null,{"$f":"$AO$62","v":0},{"$f":"$AO$63","v":0},null,{"$f":"$AO$64","v":0},{"$f":"$AO$65","v":0},null,{"$f":"$AP$62","v":0},{"$f":"$AP$63","v":0},null,{"$f":"$AP$64","v":0},{"$f":"$AP$65","v":0},null,{"$f":"$AQ$62","v":0},{"$f":"$AQ$63","v":0},null,{"$f":"$AQ$64","v":0},{"$f":"$AQ$65","v":0}]
[30,null,null,null,null,null,null,null,null,null,null,null,null,null,null,null,null,null,null,null,null,null,null,null,null,null,null,null,null,null,null,null,null,null,null,null,null,null,null,null,null,null,null,null,null,null,{"$f":"LOOKUP(AU34,$A$6:$A$155,$B$6:$B$155)","v":{"$error":"#N/A"}},{"$f":"LOOKUP(AV34,$A$6:$A$155,$B$6:$B$155)","v":{"$error":"#N/A"}},null,{"$f":"LOOKUP(AX34,$A$6:$A$155,$B$6:$B$155)","v":{"$error":"#N/A"}},{"$f":"LOOKUP(AY34,$A$6:$A$155,$B$6:$B$155)","v":{"$error":"#N/A"}},null,{"$f":"LOOKUP(BA34,$A$6:$A$155,$B$6:$B$155)","v":{"$error":"#N/A"}},{"$f":"LOOKUP(BB34,$A$6:$A$155,$B$6:$B$155)","v":{"$error":"#N/A"}},null,{"$f":"LOOKUP(BD34,$A$6:$A$155,$B$6:$B$155)","v":{"$error":"#N/A"}},{"$f":"LOOKUP(BE34,$A$6:$A$155,$B$6:$B$155)","v":{"$error":"#N/A"}},null,{"$f":"LOOKUP(BG34,$A$6:$A$155,$B$6:$B$155)","v":{"$error":"#N/A"}},{"$f":"LOOKUP(BH34,$A$6:$A$155,$B$6:$B$155)","v":{"$error":"#N/A"}},null,{"$f":"LOOKUP(BJ34,$A$6:$A$155,$B$6:$B$155)","v":{"$error":"#N/A"}},{"$f":"LOOKUP(BK34,$A$6:$A$155,$B$6:$B$155)","v":{"$error":"#N/A"}},null,{"$f":"LOOKUP(BM34,$A$6:$A$155,$B$6:$B$155)","v":{"$error":"#N/A"}},{"$f":"LOOKUP(BN34,$A$6:$A$155,$B$6:$B$155)","v":{"$error":"#N/A"}},null,{"$f":"LOOKUP(BP34,$A$6:$A$155,$B$6:$B$155)","v":{"$error":"#N/A"}},{"$f":"LOOKUP(BQ34,$A$6:$A$155,$B$6:$B$155)","v":{"$error":"#N/A"}}]
[31,null,null,null,null,null,null,null,null,null,null,null,null,null,null,null,null,null,null,null,null,null,null,null,null,null,null,null,null,null,null,null,null,null,null,null,null,null,null,null,null,null,null,null,null,null,{"$f":"$AN$66","v":0},{"$f":"$AN$67","v":0},null,{"$f":"$AN$68","v":0},{"$f":"$AN$69","v":0},null,{"$f":"$AO$66","v":0},{"$f":"$AO$67","v":0},null,{"$f":"$AO$68","v":0},{"$f":"$AO$69","v":0},null,{"$f":"$AP$66","v":0},{"$f":"$AP$67","v":0},null,{"$f":"$AP$68","v":0},{"$f":"$AP$69","v":0},null,{"$f":"$AQ$66","v":0},{"$f":"$AQ$67","v":0},null,{"$f":"$AQ$68","v":0},{"$f":"$AQ$69","v":0}]
[32,null,null,null,null,null,null,null,null,null,null,null,null,null,null,null,null,null,null,null,null,null,null,null,null,null,null,null,null,null,null,null,null,null,null,null,null,null,null,null,null,null,null,null,null,null,{"$f":"LOOKUP(AU36,$A$6:$A$155,$B$6:$B$155)","v":{"$error":"#N/A"}},{"$f":"LOOKUP(AV36,$A$6:$A$155,$B$6:$B$155)","v":{"$error":"#N/A"}},null,{"$f":"LOOKUP(AX36,$A$6:$A$155,$B$6:$B$155)","v":{"$error":"#N/A"}},{"$f":"LOOKUP(AY36,$A$6:$A$155,$B$6:$B$155)","v":{"$error":"#N/A"}},null,{"$f":"LOOKUP(BA36,$A$6:$A$155,$B$6:$B$155)","v":{"$error":"#N/A"}},{"$f":"LOOKUP(BB36,$A$6:$A$155,$B$6:$B$155)","v":{"$error":"#N/A"}},null,{"$f":"LOOKUP(BD36,$A$6:$A$155,$B$6:$B$155)","v":{"$error":"#N/A"}},{"$f":"LOOKUP(BE36,$A$6:$A$155,$B$6:$B$155)","v":{"$error":"#N/A"}},null,{"$f":"LOOKUP(BG36,$A$6:$A$155,$B$6:$B$155)","v":{"$error":"#N/A"}},{"$f":"LOOKUP(BH36,$A$6:$A$155,$B$6:$B$155)","v":{"$error":"#N/A"}},null,{"$f":"LOOKUP(BJ36,$A$6:$A$155,$B$6:$B$155)","v":{"$error":"#N/A"}},{"$f":"LOOKUP(BK36,$A$6:$A$155,$B$6:$B$155)","v":{"$error":"#N/A"}},null,{"$f":"LOOKUP(BM36,$A$6:$A$155,$B$6:$B$155)","v":{"$error":"#N/A"}},{"$f":"LOOKUP(BN36,$A$6:$A$155,$B$6:$B$155)","v":{"$error":"#N/A"}},null,{"$f":"LOOKUP(BP36,$A$6:$A$155,$B$6:$B$155)","v":{"$error":"#N/A"}},{"$f":"LOOKUP(BQ36,$A$6:$A$155,$B$6:$B$155)","v":{"$error":"#N/A"}}]
[33,null,null,null,null,null,null,null,null,null,null,null,null,null,null,null,null,null,null,null,null,null,null,null,null,null,null,null,null,null,null,null,null,null,null,null,null,null,null,null,null,null,null,null,null,null,{"$f":"$AN$70","v":0},{"$f":"$AN$71","v":0},null,{"$f":"$AN$72","v":0},{"$f":"$AN$73","v":0},null,{"$f":"$AO$70","v":0},{"$f":"$AO$71","v":0},null,{"$f":"$AO$72","v":0},{"$f":"$AO$73","v":0},null,{"$f":"$AP$70","v":0},{"$f":"$AP$71","v":0},null,{"$f":"$AP$72","v":0},{"$f":"$AP$73","v":0},null,{"$f":"$AQ$70","v":0},{"$f":"$AQ$71","v":0},null,{"$f":"$AQ$72","v":0},{"$f":"$AQ$73","v":0}]
[34,null,null,null,null,null,null,null,null,null,null,null,null,null,null,null,null,null,null,null,null,null,null,null,null,null,null,null,null,null,null,null,null,null,null,null,null,null,null,null,null,null,null,null,null,null,{"$f":"LOOKUP(AU38,$A$6:$A$155,$B$6:$B$155)","v":{"$error":"#N/A"}},{"$f":"LOOKUP(AV38,$A$6:$A$155,$B$6:$B$155)","v":{"$error":"#N/A"}},null,{"$f":"LOOKUP(AX38,$A$6:$A$155,$B$6:$B$155)","v":{"$error":"#N/A"}},{"$f":"LOOKUP(AY38,$A$6:$A$155,$B$6:$B$155)","v":{"$error":"#N/A"}},null,{"$f":"LOOKUP(BA38,$A$6:$A$155,$B$6:$B$155)","v":{"$error":"#N/A"}},{"$f":"LOOKUP(BB38,$A$6:$A$155,$B$6:$B$155)","v":{"$error":"#N/A"}},null,{"$f":"LOOKUP(BD38,$A$6:$A$155,$B$6:$B$155)","v":{"$error":"#N/A"}},{"$f":"LOOKUP(BE38,$A$6:$A$155,$B$6:$B$155)","v":{"$error":"#N/A"}},null,{"$f":"LOOKUP(BG38,$A$6:$A$155,$B$6:$B$155)","v":{"$error":"#N/A"}},{"$f":"LOOKUP(BH38,$A$6:$A$155,$B$6:$B$155)","v":{"$error":"#N/A"}},null,{"$f":"LOOKUP(BJ38,$A$6:$A$155,$B$6:$B$155)","v":{"$error":"#N/A"}},{"$f":"LOOKUP(BK38,$A$6:$A$155,$B$6:$B$155)","v":{"$error":"#N/A"}},null,{"$f":"LOOKUP(BM38,$A$6:$A$155,$B$6:$B$155)","v":{"$error":"#N/A"}},{"$f":"LOOKUP(BN38,$A$6:$A$155,$B$6:$B$155)","v":{"$error":"#N/A"}},null,{"$f":"LOOKUP(BP38,$A$6:$A$155,$B$6:$B$155)","v":{"$error":"#N/A"}},{"$f":"LOOKUP(BQ38,$A$6:$A$155,$B$6:$B$155)","v":{"$error":"#N/A"}}]
[35,null,null,null,null,null,null,null,null,null,null,null,null,null,null,null,null,null,null,null,null,null,null,null,null,null,null,null,null,null,null,null,null,null,null,null,null,null,null,null,null,null,null,null,null,null,{"$f":"$AN$74","v":0},{"$f":"$AN$75","v":0},null,{"$f":"$AN$76","v":0},{"$f":"$AN$77","v":0},null,{"$f":"$AO$74","v":0},{"$f":"$AO$75","v":0},null,{"$f":"$AO$76","v":0},{"$f":"$AO$77","v":0},null,{"$f":"$AP$74","v":0},{"$f":"$AP$75","v":0},null,{"$f":"$AP$76","v":0},{"$f":"$AP$77","v":0},null,{"$f":"$AQ$74","v":0},{"$f":"$AQ$75","v":0},null,{"$f":"$AQ$76","v":0},{"$f":"$AQ$77","v":0}]
[36,null,null,null,null,null,null,null,null,null,null,null,null,null,null,null,null,null,null,null,null,null,null,null,null,null,null,null,null,null,null,null,null,null,null,null,null,null,null,null,null,null,null,null,null,null,{"$f":"LOOKUP(AU40,$A$6:$A$155,$B$6:$B$155)","v":{"$error":"#N/A"}},{"$f":"LOOKUP(AV40,$A$6:$A$155,$B$6:$B$155)","v":{"$error":"#N/A"}},null,{"$f":"LOOKUP(AX40,$A$6:$A$155,$B$6:$B$155)","v":{"$error":"#N/A"}},{"$f":"LOOKUP(AY40,$A$6:$A$155,$B$6:$B$155)","v":{"$error":"#N/A"}},null,{"$f":"LOOKUP(BA40,$A$6:$A$155,$B$6:$B$155)","v":{"$error":"#N/A"}},{"$f":"LOOKUP(BB40,$A$6:$A$155,$B$6:$B$155)","v":{"$error":"#N/A"}},null,{"$f":"LOOKUP(BD40,$A$6:$A$155,$B$6:$B$155)","v":{"$error":"#N/A"}},{"$f":"LOOKUP(BE40,$A$6:$A$155,$B$6:$B$155)","v":{"$error":"#N/A"}},null,{"$f":"LOOKUP(BG40,$A$6:$A$155,$B$6:$B$155)","v":{"$error":"#N/A"}},{"$f":"LOOKUP(BH40,$A$6:$A$155,$B$6:$B$155)","v":{"$error":"#N/A"}},null,{"$f":"LOOKUP(BJ40,$A$6:$A$155,$B$6:$B$155)","v":{"$error":"#N/A"}},{"$f":"LOOKUP(BK40,$A$6:$A$155,$B$6:$B$155)","v":{"$error":"#N/A"}},null,{"$f":"LOOKUP(BM40,$A$6:$A$155,$B$6:$B$155)","v":{"$error":"#N/A"}},{"$f":"LOOKUP(BN40,$A$6:$A$155,$B$6:$B$155)","v":{"$error":"#N/A"}},null,{"$f":"LOOKUP(BP40,$A$6:$A$155,$B$6:$B$155)","v":{"$error":"#N/A"}},{"$f":"LOOKUP(BQ40,$A$6:$A$155,$B$6:$B$155)","v":{"$error":"#N/A"}}]
[37,null,null,null,null,null,null,null,null,null,null,null,null,null,null,null,null,null,null,null,null,null,null,null,null,null,null,null,null,null,null,null,null,null,null,null,null,null,null,null,null,null,null,null,null,null,{"$f":"$AN$78","v":0},{"$f":"$AN$79","v":0},null,{"$f":"$AN$80","v":0},{"$f":"$AN$81","v":0},null,{"$f":"$AO$78","v":0},{"$f":"$AO$79","v":0},null,{"$f":"$AO$80","v":0},{"$f":"$AO$81","v":0},null,{"$f":"$AP$78","v":0},{"$f":"$AP$79","v":0},null,{"$f":"$AP$80","v":0},{"$f":"$AP$81","v":0},null,{"$f":"$AQ$78","v":0},{"$f":"$AQ$79","v":0},null,{"$f":"$AQ$80","v":0},{"$f":"$AQ$81","v":0}]
[38,null,null,null,null,null,null,null,null,null,null,null,null,null,null,null,null,null,null,null,null,null,null,null,null,null,null,null,null,null,null,null,null,null,null,null,null,null,null,null,null,null,null,null,null,null,{"$f":"LOOKUP(AU42,$A$6:$A$155,$B$6:$B$155)","v":{"$error":"#N/A"}},{"$f":"LOOKUP(AV42,$A$6:$A$155,$B$6:$B$155)","v":{"$error":"#N/A"}},null,{"$f":"LOOKUP(AX42,$A$6:$A$155,$B$6:$B$155)","v":{"$error":"#N/A"}},{"$f":"LOOKUP(AY42,$A$6:$A$155,$B$6:$B$155)","v":{"$error":"#N/A"}},null,{"$f":"LOOKUP(BA42,$A$6:$A$155,$B$6:$B$155)","v":{"$error":"#N/A"}},{"$f":"LOOKUP(BB42,$A$6:$A$155,$B$6:$B$155)","v":{"$error":"#N/A"}},null,{"$f":"LOOKUP(BD42,$A$6:$A$155,$B$6:$B$155)","v":{"$error":"#N/A"}},{"$f":"LOOKUP(BE42,$A$6:$A$155,$B$6:$B$155)","v":{"$error":"#N/A"}},null,{"$f":"LOOKUP(BG42,$A$6:$A$155,$B$6:$B$155)","v":{"$error":"#N/A"}},{"$f":"LOOKUP(BH42,$A$6:$A$155,$B$6:$B$155)","v":{"$error":"#N/A"}},null,{"$f":"LOOKUP(BJ42,$A$6:$A$155,$B$6:$B$155)","v":{"$error":"#N/A"}},{"$f":"LOOKUP(BK42,$A$6:$A$155,$B$6:$B$155)","v":{"$error":"#N/A"}},null,{"$f":"LOOKUP(BM42,$A$6:$A$155,$B$6:$B$155)","v":{"$error":"#N/A"}},{"$f":"LOOKUP(BN42,$A$6:$A$155,$B$6:$B$155)","v":{"$error":"#N/A"}},null,{"$f":"LOOKUP(BP42,$A$6:$A$155,$B$6:$B$155)","v":{"$error":"#N/A"}},{"$f":"LOOKUP(BQ42,$A$6:$A$155,$B$6:$B$155)","v":{"$error":"#N/A"}}]
[39,null,null,null,null,null,null,null,null,null,null,null,null,null,null,null,null,null,null,null,null,null,null,null,null,null,null,null,null,null,null,null,null,null,null,null,null,null,null,null,null,null,null,null,null,null,{"$f":"$AN$82","v":0},{"$f":"$AN$83","v":0},null,{"$f":"$AN$84","v":0},{"$f":"$AN$85","v":0},null,{"$f":"$AO$82","v":0},{"$f":"$AO$83","v":0},null,{"$f":"$AO$84","v":0},{"$f":"$AO$85","v":0},null,{"$f":"$AP$82","v":0},{"$f":"$AP$83","v":0},null,{"$f":"$AP$84","v":0},{"$f":"$AP$85","v":0},null,{"$f":"$AQ$82","v":0},{"$f":"$AQ$83","v":0},null,{"$f":"$AQ$84","v":0},{"$f":"$AQ$85","v":0}]
[40,null,null,null,null,null,null,null,null,null,null,null,null,null,null,null,null,null,null,null,null,null,null,null,null,null,null,null,null,null,null,null,null,null,null,null,null,null,null,null,null,null,null,null,null,null,{"$f":"LOOKUP(AU44,$A$6:$A$155,$B$6:$B$155)","v":{"$error":"#N/A"}},{"$f":"LOOKUP(AV44,$A$6:$A$155,$B$6:$B$155)","v":{"$error":"#N/A"}},null,{"$f":"LOOKUP(AX44,$A$6:$A$155,$B$6:$B$155)","v":{"$error":"#N/A"}},{"$f":"LOOKUP(AY44,$A$6:$A$155,$B$6:$B$155)","v":{"$error":"#N/A"}},null,{"$f":"LOOKUP(BA44,$A$6:$A$155,$B$6:$B$155)","v":{"$error":"#N/A"}},{"$f":"LOOKUP(BB44,$A$6:$A$155,$B$6:$B$155)","v":{"$error":"#N/A"}},null,{"$f":"LOOKUP(BD44,$A$6:$A$155,$B$6:$B$155)","v":{"$error":"#N/A"}},{"$f":"LOOKUP(BE44,$A$6:$A$155,$B$6:$B$155)","v":{"$error":"#N/A"}},null,{"$f":"LOOKUP(BG44,$A$6:$A$155,$B$6:$B$155)","v":{"$error":"#N/A"}},{"$f":"LOOKUP(BH44,$A$6:$A$155,$B$6:$B$155)","v":{"$error":"#N/A"}},null,{"$f":"LOOKUP(BJ44,$A$6:$A$155,$B$6:$B$155)","v":{"$error":"#N/A"}},{"$f":"LOOKUP(BK44,$A$6:$A$155,$B$6:$B$155)","v":{"$error":"#N/A"}},null,{"$f":"LOOKUP(BM44,$A$6:$A$155,$B$6:$B$155)","v":{"$error":"#N/A"}},{"$f":"LOOKUP(BN44,$A$6:$A$155,$B$6:$B$155)","v":{"$error":"#N/A"}},null,{"$f":"LOOKUP(BP44,$A$6:$A$155,$B$6:$B$155)","v":{"$error":"#N/A"}},{"$f":"LOOKUP(BQ44,$A$6:$A$155,$B$6:$B$155)","v":{"$error":"#N/A"}}]
[41,null,null,null,null,null,null,null,null,null,null,null,null,null,null,null,null,null,null,null,null,null,null,null,null,null,null,null,null,null,null,null,null,null,null,null,null,null,null,null,null,null,null,null,null,null,{"$f":"$AN$86","v":0},{"$f":"$AN$87","v":0},null,{"$f":"$AN$88","v":0},{"$f":"$AN$89","v":0},null,{"$f":"$AO$86","v":0},{"$f":"$AO$87","v":0},null,{"$f":"$AO$88","v":0},{"$f":"$AO$89","v":0},null,{"$f":"$AP$86","v":0},{"$f":"$AP$87","v":0},null,{"$f":"$AP$88","v":0},{"$f":"$AP$89","v":0},null,{"$f":"$AQ$86","v":0},{"$f":"$AQ$87","v":0},null,{"$f":"$AQ$88","v":0},{"$f":"$AQ$89","v":0}]
[42,null,null,null,null,null,null,null,null,null,null,null,null,null,null,null,null,null,null,null,null,null,null,null,null,null,null,null,null,null,null,null,null,null,null,null,null,null,null,null,null,null,null,null,null,null,{"$f":"LOOKUP(AU46,$A$6:$A$155,$B$6:$B$155)","v":{"$error":"#N/A"}},{"$f":"LOOKUP(AV46,$A$6:$A$155,$B$6:$B$155)","v":{"$error":"#N/A"}},null,{"$f":"LOOKUP(AX46,$A$6:$A$155,$B$6:$B$155)","v":{"$error":"#N/A"}},{"$f":"LOOKUP(AY46,$A$6:$A$155,$B$6:$B$155)","v":{"$error":"#N/A"}},null,{"$f":"LOOKUP(BA46,$A$6:$A$155,$B$6:$B$155)","v":{"$error":"#N/A"}},{"$f":"LOOKUP(BB46,$A$6:$A$155,$B$6:$B$155)","v":{"$error":"#N/A"}},null,{"$f":"LOOKUP(BD46,$A$6:$A$155,$B$6:$B$155)","v":{"$error":"#N/A"}},{"$f":"LOOKUP(BE46,$A$6:$A$155,$B$6:$B$155)","v":{"$error":"#N/A"}},null,{"$f":"LOOKUP(BG46,$A$6:$A$155,$B$6:$B$155)","v":{"$error":"#N/A"}},{"$f":"LOOKUP(BH46,$A$6:$A$155,$B$6:$B$155)","v":{"$error":"#N/A"}},null,{"$f":"LOOKUP(BJ46,$A$6:$A$155,$B$6:$B$155)","v":{"$error":"#N/A"}},{"$f":"LOOKUP(BK46,$A$6:$A$155,$B$6:$B$155)","v":{"$error":"#N/A"}},null,{"$f":"LOOKUP(BM46,$A$6:$A$155,$B$6:$B$155)","v":{"$error":"#N/A"}},{"$f":"LOOKUP(BN46,$A$6:$A$155,$B$6:$B$155)","v":{"$error":"#N/A"}},null,{"$f":"LOOKUP(BP46,$A$6:$A$155,$B$6:$B$155)","v":{"$error":"#N/A"}},{"$f":"LOOKUP(BQ46,$A$6:$A$155,$B$6:$B$155)","v":{"$error":"#N/A"}}]
[43,null,null,null,null,null,null,null,null,null,null,null,null,null,null,null,null,null,null,null,null,null,null,null,null,null,null,null,null,null,null,null,null,null,null,null,null,null,null,null,null,null,null,null,null,null,{"$f":"$AN$90","v":0},{"$f":"$AN$91","v":0},null,{"$f":"$AN$92","v":0},{"$f":"$AN$93","v":0},null,{"$f":"$AO$90","v":0},{"$f":"$AO$91","v":0},null,{"$f":"$AO$92","v":0},{"$f":"$AO$93","v":0},null,{"$f":"$AP$90","v":0},{"$f":"$AP$91","v":0},null,{"$f":"$AP$92","v":0},{"$f":"$AP$93","v":0},null,{"$f":"$AQ$90","v":0},{"$f":"$AQ$91","v":0},null,{"$f":"$AQ$92","v":0},{"$f":"$AQ$93","v":0}]
[44,null,null,null,null,null,null,null,null,null,null,null,null,null,null,null,null,null,null,null,null,null,null,null,null,null,null,null,null,null,null,null,null,null,null,null,null,null,null,null,null,null,null,null,null,null,{"$f":"LOOKUP(AU48,$A$6:$A$155,$B$6:$B$155)","v":{"$error":"#N/A"}},{"$f":"LOOKUP(AV48,$A$6:$A$155,$B$6:$B$155)","v":{"$error":"#N/A"}},null,{"$f":"LOOKUP(AX48,$A$6:$A$155,$B$6:$B$155)","v":{"$error":"#N/A"}},{"$f":"LOOKUP(AY48,$A$6:$A$155,$B$6:$B$155)","v":{"$error":"#N/A"}},null,{"$f":"LOOKUP(BA48,$A$6:$A$155,$B$6:$B$155)","v":{"$error":"#N/A"}},{"$f":"LOOKUP(BB48,$A$6:$A$155,$B$6:$B$155)","v":{"$error":"#N/A"}},null,{"$f":"LOOKUP(BD48,$A$6:$A$155,$B$6:$B$155)","v":{"$error":"#N/A"}},{"$f":"LOOKUP(BE48,$A$6:$A$155,$B$6:$B$155)","v":{"$error":"#N/A"}},null,{"$f":"LOOKUP(BG48,$A$6:$A$155,$B$6:$B$155)","v":{"$error":"#N/A"}},{"$f":"LOOKUP(BH48,$A$6:$A$155,$B$6:$B$155)","v":{"$error":"#N/A"}},null,{"$f":"LOOKUP(BJ48,$A$6:$A$155,$B$6:$B$155)","v":{"$error":"#N/A"}},{"$f":"LOOKUP(BK48,$A$6:$A$155,$B$6:$B$155)","v":{"$error":"#N/A"}},null,{"$f":"LOOKUP(BM48,$A$6:$A$155,$B$6:$B$155)","v":{"$error":"#N/A"}},{"$f":"LOOKUP(BN48,$A$6:$A$155,$B$6:$B$155)","v":{"$error":"#N/A"}},null,{"$f":"LOOKUP(BP48,$A$6:$A$155,$B$6:$B$155)","v":{"$error":"#N/A"}},{"$f":"LOOKUP(BQ48,$A$6:$A$155,$B$6:$B$155)","v":{"$error":"#N/A"}}]
[45,null,null,null,null,null,null,null,null,null,null,null,null,null,null,null,null,null,null,null,null,null,null,null,null,null,null,null,null,null,null,null,null,null,null,null,null,null,null,null,null,null,null,null,null,null,{"$f":"$AN$94","v":0},{"$f":"$AN$95","v":0},null,{"$f":"$AN$96","v":0},{"$f":"$AN$97","v":0},null,{"$f":"$AO$94","v":0},{"$f":"$AO$95","v":0},null,{"$f":"$AO$96","v":0},{"$f":"$AO$97","v":0},null,{"$f":"$AP$94","v":0},{"$f":"$AP$95","v":0},null,{"$f":"$AP$96","v":0},{"$f":"$AP$97","v":0},null,{"$f":"$AQ$94","v":0},{"$f":"$AQ$95","v":0},null,{"$f":"$AQ$96","v":0},{"$f":"$AQ$97","v":0}]
[46,null,null,null,null,null,null,null,null,null,null,null,null,null,null,null,null,null,null,null,null,null,null,null,null,null,null,null,null,null,null,null,null,null,null,null,null,null,null,null,null,null,null,null,null,null,{"$f":"LOOKUP(AU50,$A$6:$A$155,$B$6:$B$155)","v":{"$error":"#N/A"}},{"$f":"LOOKUP(AV50,$A$6:$A$155,$B$6:$B$155)","v":{"$error":"#N/A"}},null,{"$f":"LOOKUP(AX50,$A$6:$A$155,$B$6:$B$155)","v":{"$error":"#N/A"}},{"$f":"LOOKUP(AY50,$A$6:$A$155,$B$6:$B$155)","v":{"$error":"#N/A"}},null,{"$f":"LOOKUP(BA50,$A$6:$A$155,$B$6:$B$155)","v":{"$error":"#N/A"}},{"$f":"LOOKUP(BB50,$A$6:$A$155,$B$6:$B$155)","v":{"$error":"#N/A"}},null,{"$f":"LOOKUP(BD50,$A$6:$A$155,$B$6:$B$155)","v":{"$error":"#N/A"}},{"$f":"LOOKUP(BE50,$A$6:$A$155,$B$6:$B$155)","v":{"$error":"#N/A"}},null,{"$f":"LOOKUP(BG50,$A$6:$A$155,$B$6:$B$155)","v":{"$error":"#N/A"}},{"$f":"LOOKUP(BH50,$A$6:$A$155,$B$6:$B$155)","v":{"$error":"#N/A"}},null,{"$f":"LOOKUP(BJ50,$A$6:$A$155,$B$6:$B$155)","v":{"$error":"#N/A"}},{"$f":"LOOKUP(BK50,$A$6:$A$155,$B$6:$B$155)","v":{"$error":"#N/A"}},null,{"$f":"LOOKUP(BM50,$A$6:$A$155,$B$6:$B$155)","v":{"$error":"#N/A"}},{"$f":"LOOKUP(BN50,$A$6:$A$155,$B$6:$B$155)","v":{"$error":"#N/A"}},null,{"$f":"LOOKUP(BP50,$A$6:$A$155,$B$6:$B$155)","v":{"$error":"#N/A"}},{"$f":"LOOKUP(BQ50,$A$6:$A$155,$B$6:$B$155)","v":{"$error":"#N/A"}}]
[47,null,null,null,null,null,null,null,null,null,null,null,null,null,null,null,null,null,null,null,null,null,null,null,null,null,null,null,null,null,null,null,null,null,null,null,null,null,null,null,null,null,null,null,null,null,{"$f":"$AN$98","v":0},{"$f":"$AN$99","v":0},null,{"$f":"$AN$100","v":0},{"$f":"$AN$101","v":0},null,{"$f":"$AO$98","v":0},{"$f":"$AO$99","v":0},null,{"$f":"$AO$100","v":0},{"$f":"$AO$101","v":0},null,{"$f":"$AP$98","v":0},{"$f":"$AP$99","v":0},null,{"$f":"$AP$100","v":0},{"$f":"$AP$101","v":0},null,{"$f":"$AQ$98","v":0},{"$f":"$AQ$99","v":0},null,{"$f":"$AQ$100","v":0},{"$f":"$AQ$101","v":0}]
[48,null,null,null,null,null,null,null,null,null,null,null,null,null,null,null,null,null,null,null,null,null,null,null,null,null,null,null,null,null,null,null,null,null,null,null,null,null,null,null,null,null,null,null,null,null,{"$f":"LOOKUP(AU52,$A$6:$A$155,$B$6:$B$155)","v":{"$error":"#N/A"}},{"$f":"LOOKUP(AV52,$A$6:$A$155,$B$6:$B$155)","v":{"$error":"#N/A"}},null,{"$f":"LOOKUP(AX52,$A$6:$A$155,$B$6:$B$155)","v":{"$error":"#N/A"}},{"$f":"LOOKUP(AY52,$A$6:$A$155,$B$6:$B$155)","v":{"$error":"#N/A"}},null,{"$f":"LOOKUP(BA52,$A$6:$A$155,$B$6:$B$155)","v":{"$error":"#N/A"}},{"$f":"LOOKUP(BB52,$A$6:$A$155,$B$6:$B$155)","v":{"$error":"#N/A"}},null,{"$f":"LOOKUP(BD52,$A$6:$A$155,$B$6:$B$155)","v":{"$error":"#N/A"}},{"$f":"LOOKUP(BE52,$A$6:$A$155,$B$6:$B$155)","v":{"$error":"#N/A"}},null,{"$f":"LOOKUP(BG52,$A$6:$A$155,$B$6:$B$155)","v":{"$error":"#N/A"}},{"$f":"LOOKUP(BH52,$A$6:$A$155,$B$6:$B$155)","v":{"$error":"#N/A"}},null,{"$f":"LOOKUP(BJ52,$A$6:$A$155,$B$6:$B$155)","v":{"$error":"#N/A"}},{"$f":"LOOKUP(BK52,$A$6:$A$155,$B$6:$B$155)","v":{"$error":"#N/A"}},null,{"$f":"LOOKUP(BM52,$A$6:$A$155,$B$6:$B$155)","v":{"$error":"#N/A"}},{"$f":"LOOKUP(BN52,$A$6:$A$155,$B$6:$B$155)","v":{"$error":"#N/A"}},null,{"$f":"LOOKUP(BP52,$A$6:$A$155,$B$6:$B$155)","v":{"$error":"#N/A"}},{"$f":"LOOKUP(BQ52,$A$6:$A$155,$B$6:$B$155)","v":{"$error":"#N/A"}}]
[49,null,null,null,null,null,null,null,null,null,null,null,null,null,null,null,null,null,null,null,null,null,null,null,null,null,null,null,null,null,null,null,null,null,null,null,null,null,null,null,null,null,null,null,null,null,{"$f":"$AN$102","v":0},{"$f":"$AN$103","v":0},null,{"$f":"$AN$104","v":0},{"$f":"$AN$105","v":0},null,{"$f":"$AO$102","v":0},{"$f":"$AO$103","v":0},null,{"$f":"$AO$104","v":0},{"$f":"$AO$105","v":0},null,{"$f":"$AP$102","v":0},{"$f":"$AP$103","v":0},null,{"$f":"$AP$104","v":0},{"$f":"$AP$105","v":0},null,{"$f":"$AQ$102","v":0},{"$f":"$AQ$103","v":0},null,{"$f":"$AQ$104","v":0},{"$f":"$AQ$105","v":0}]
[50,null,null,null,null,null,null,null,null,null,null,null,null,null,null,null,null,null,null,null,null,null,null,null,null,null,null,null,null,null,null,null,null,null,null,null,null,null,null,null,null,null,null,null,null,null,{"$f":"LOOKUP(AU54,$A$6:$A$155,$B$6:$B$155)","v":{"$error":"#N/A"}},{"$f":"LOOKUP(AV54,$A$6:$A$155,$B$6:$B$155)","v":{"$error":"#N/A"}},null,{"$f":"LOOKUP(AX54,$A$6:$A$155,$B$6:$B$155)","v":{"$error":"#N/A"}},{"$f":"LOOKUP(AY54,$A$6:$A$155,$B$6:$B$155)","v":{"$error":"#N/A"}},null,{"$f":"LOOKUP(BA54,$A$6:$A$155,$B$6:$B$155)","v":{"$error":"#N/A"}},{"$f":"LOOKUP(BB54,$A$6:$A$155,$B$6:$B$155)","v":{"$error":"#N/A"}},null,{"$f":"LOOKUP(BD54,$A$6:$A$155,$B$6:$B$155)","v":{"$error":"#N/A"}},{"$f":"LOOKUP(BE54,$A$6:$A$155,$B$6:$B$155)","v":{"$error":"#N/A"}},null,{"$f":"LOOKUP(BG54,$A$6:$A$155,$B$6:$B$155)","v":{"$error":"#N/A"}},{"$f":"LOOKUP(BH54,$A$6:$A$155,$B$6:$B$155)","v":{"$error":"#N/A"}},null,{"$f":"LOOKUP(BJ54,$A$6:$A$155,$B$6:$B$155)","v":{"$error":"#N/A"}},{"$f":"LOOKUP(BK54,$A$6:$A$155,$B$6:$B$155)","v":{"$error":"#N/A"}},null,{"$f":"LOOKUP(BM54,$A$6:$A$155,$B$6:$B$155)","v":{"$error":"#N/A"}},{"$f":"LOOKUP(BN54,$A$6:$A$155,$B$6:$B$155)","v":{"$error":"#N/A"}},null,{"$f":"LOOKUP(BP54,$A$6:$A$155,$B$6:$B$155)","v":{"$error":"#N/A"}},{"$f":"LOOKUP(BQ54,$A$6:$A$155,$B$6:$B$155)","v":{"$error":"#N/A"}}]
[51,null,null,null,null,null,null,null,null,null,null,null,null,null,null,null,null,null,null,null,null,null,null,null,null,null,null,null,null,null,null,null,null,null,null,null,null,null,null,null,null,null,null,null,null,null,{"$f":"$AN$106","v":0},{"$f":"$AN$107","v":0},null,{"$f":"$AN$108","v":0},{"$f":"$AN$109","v":0},null,{"$f":"$AO$106","v":0},{"$f":"$AO$107","v":0},null,{"$f":"$AO$108","v":0},{"$f":"$AO$109","v":0},null,{"$f":"$AP$106","v":0},{"$f":"$AP$107","v":0},null,{"$f":"$AP$108","v":0},{"$f":"$AP$109","v":0},null,{"$f":"$AQ$106","v":0},{"$f":"$AQ$107","v":0},null,{"$f":"$AQ$108","v":0},{"$f":"$AQ$109","v":0}]
[52,null,null,null,null,null,null,null,null,null,null,null,null,null,null,null,null,null,null,null,null,null,null,null,null,null,null,null,null,null,null,null,null,null,null,null,null,null,null,null,null,null,null,null,null,null,{"$f":"LOOKUP(AU56,$A$6:$A$155,$B$6:$B$155)","v":{"$error":"#N/A"}},{"$f":"LOOKUP(AV56,$A$6:$A$155,$B$6:$B$155)","v":{"$error":"#N/A"}},null,{"$f":"LOOKUP(AX56,$A$6:$A$155,$B$6:$B$155)","v":{"$error":"#N/A"}},{"$f":"LOOKUP(AY56,$A$6:$A$155,$B$6:$B$155)","v":{"$error":"#N/A"}},null,{"$f":"LOOKUP(BA56,$A$6:$A$155,$B$6:$B$155)","v":{"$error":"#N/A"}},{"$f":"LOOKUP(BB56,$A$6:$A$155,$B$6:$B$155)","v":{"$error":"#N/A"}},null,{"$f":"LOOKUP(BD56,$A$6:$A$155,$B$6:$B$155)","v":{"$error":"#N/A"}},{"$f":"LOOKUP(BE56,$A$6:$A$155,$B$6:$B$155)","v":{"$error":"#N/A"}},null,{"$f":"LOOKUP(BG56,$A$6:$A$155,$B$6:$B$155)","v":{"$error":"#N/A"}},{"$f":"LOOKUP(BH56,$A$6:$A$155,$B$6:$B$155)","v":{"$error":"#N/A"}},null,{"$f":"LOOKUP(BJ56,$A$6:$A$155,$B$6:$B$155)","v":{"$error":"#N/A"}},{"$f":"LOOKUP(BK56,$A$6:$A$155,$B$6:$B$155)","v":{"$error":"#N/A"}},null,{"$f":"LOOKUP(BM56,$A$6:$A$155,$B$6:$B$155)","v":{"$error":"#N/A"}},{"$f":"LOOKUP(BN56,$A$6:$A$155,$B$6:$B$155)","v":{"$error":"#N/A"}},null,{"$f":"LOOKUP(BP56,$A$6:$A$155,$B$6:$B$155)","v":{"$error":"#N/A"}},{"$f":"LOOKUP(BQ56,$A$6:$A$155,$B$6:$B$155)","v":{"$error":"#N/A"}}]
[53,null,null,null,null,null,null,null,null,null,null,null,null,null,null,null,null,null,null,null,null,null,null,null,null,null,null,null,null,null,null,null,null,null,null,null,null,null,null,null,null,null,null,null,null,null,{"$f":"$AN$110","v":0},{"$f":"$AN$111","v":0},null,{"$f":"$AN$112","v":0},{"$f":"$AN$113","v":0},null,{"$f":"$AO$110","v":0},{"$f":"$AO$111","v":0},null,{"$f":"$AO$112","v":0},{"$f":"$AO$113","v":0},null,{"$f":"$AP$110","v":0},{"$f":"$AP$111","v":0},null,{"$f":"$AP$112","v":0},{"$f":"$AP$113","v":0},null,{"$f":"$AQ$110","v":0},{"$f":"$AQ$111","v":0},null,{"$f":"$AQ$112","v":0},{"$f":"$AQ$113","v":0}]
[54,null,null,null,null,null,null,null,null,null,null,null,null,null,null,null,null,null,null,null,null,null,null,null,null,null,null,null,null,null,null,null,null,null,null,null,null,null,null,null,null,null,null,null,null,null,{"$f":"LOOKUP(AU58,$A$6:$A$155,$B$6:$B$155)","v":{"$error":"#N/A"}},{"$f":"LOOKUP(AV58,$A$6:$A$155,$B$6:$B$155)","v":{"$error":"#N/A"}},null,{"$f":"LOOKUP(AX58,$A$6:$A$155,$B$6:$B$155)","v":{"$error":"#N/A"}},{"$f":"LOOKUP(AY58,$A$6:$A$155,$B$6:$B$155)","v":{"$error":"#N/A"}},null,{"$f":"LOOKUP(BA58,$A$6:$A$155,$B$6:$B$155)","v":{"$error":"#N/A"}},{"$f":"LOOKUP(BB58,$A$6:$A$155,$B$6:$B$155)","v":{"$error":"#N/A"}},null,{"$f":"LOOKUP(BD58,$A$6:$A$155,$B$6:$B$155)","v":{"$error":"#N/A"}},{"$f":"LOOKUP(BE58,$A$6:$A$155,$B$6:$B$155)","v":{"$error":"#N/A"}},null,{"$f":"LOOKUP(BG58,$A$6:$A$155,$B$6:$B$155)","v":{"$error":"#N/A"}},{"$f":"LOOKUP(BH58,$A$6:$A$155,$B$6:$B$155)","v":{"$error":"#N/A"}},null,{"$f":"LOOKUP(BJ58,$A$6:$A$155,$B$6:$B$155)","v":{"$error":"#N/A"}},{"$f":"LOOKUP(BK58,$A$6:$A$155,$B$6:$B$155)","v":{"$error":"#N/A"}},null,{"$f":"LOOKUP(BM58,$A$6:$A$155,$B$6:$B$155)","v":{"$error":"#N/A"}},{"$f":"LOOKUP(BN58,$A$6:$A$155,$B$6:$B$155)","v":{"$error":"#N/A"}},null,{"$f":"LOOKUP(BP58,$A$6:$A$155,$B$6:$B$155)","v":{"$error":"#N/A"}},{"$f":"LOOKUP(BQ58,$A$6:$A$155,$B$6:$B$155)","v":{"$error":"#N/A"}}]
[55,null,null,null,null,null,null,null,null,null,null,null,null,null,null,null,null,null,null,null,null,null,null,null,null,null,null,null,null,null,null,null,null,null,null,null,null,null,null,null,null,null,null,null,null,null,{"$f":"$AN$114","v":0},{"$f":"$AN$115","v":0},null,{"$f":"$AN$116","v":0},{"$f":"$AN$117","v":0},null,{"$f":"$AO$114","v":0},{"$f":"$AO$115","v":0},null,{"$f":"$AO$116","v":0},{"$f":"$AO$117","v":0},null,{"$f":"$AP$114","v":0},{"$f":"$AP$115","v":0},null,{"$f":"$AP$116","v":0},{"$f":"$AP$117","v":0},null,{"$f":"$AQ$114","v":0},{"$f":"$AQ$115","v":0},null,{"$f":"$AQ$116","v":0},{"$f":"$AQ$117","v":0}]
[56,null,null,null,null,null,null,null,null,null,null,null,null,null,null,null,null,null,null,null,null,null,null,null,null,null,null,null,null,null,null,null,null,null,null,null,null,null,null,null,null,null,null,null,null,null,{"$f":"LOOKUP(AU60,$A$6:$A$155,$B$6:$B$155)","v":{"$error":"#N/A"}},{"$f":"LOOKUP(AV60,$A$6:$A$155,$B$6:$B$155)","v":{"$error":"#N/A"}},null,{"$f":"LOOKUP(AX60,$A$6:$A$155,$B$6:$B$155)","v":{"$error":"#N/A"}},{"$f":"LOOKUP(AY60,$A$6:$A$155,$B$6:$B$155)","v":{"$error":"#N/A"}},null,{"$f":"LOOKUP(BA60,$A$6:$A$155,$B$6:$B$155)","v":{"$error":"#N/A"}},{"$f":"LOOKUP(BB60,$A$6:$A$155,$B$6:$B$155)","v":{"$error":"#N/A"}},null,{"$f":"LOOKUP(BD60,$A$6:$A$155,$B$6:$B$155)","v":{"$error":"#N/A"}},{"$f":"LOOKUP(BE60,$A$6:$A$155,$B$6:$B$155)","v":{"$error":"#N/A"}},null,{"$f":"LOOKUP(BG60,$A$6:$A$155,$B$6:$B$155)","v":{"$error":"#N/A"}},{"$f":"LOOKUP(BH60,$A$6:$A$155,$B$6:$B$155)","v":{"$error":"#N/A"}},null,{"$f":"LOOKUP(BJ60,$A$6:$A$155,$B$6:$B$155)","v":{"$error":"#N/A"}},{"$f":"LOOKUP(BK60,$A$6:$A$155,$B$6:$B$155)","v":{"$error":"#N/A"}},null,{"$f":"LOOKUP(BM60,$A$6:$A$155,$B$6:$B$155)","v":{"$error":"#N/A"}},{"$f":"LOOKUP(BN60,$A$6:$A$155,$B$6:$B$155)","v":{"$error":"#N/A"}},null,{"$f":"LOOKUP(BP60,$A$6:$A$155,$B$6:$B$155)","v":{"$error":"#N/A"}},{"$f":"LOOKUP(BQ60,$A$6:$A$155,$B$6:$B$155)","v":{"$error":"#N/A"}}]
[57,null,null,null,null,null,null,null,null,null,null,null,null,null,null,null,null,null,null,null,null,null,null,null,null,null,null,null,null,null,null,null,null,null,null,null,null,null,null,null,null,null,null,null,null,null,{"$f":"$AN$118","v":0},{"$f":"$AN$119","v":0},null,{"$f":"$AN$120","v":0},{"$f":"$AN$121","v":0},null,{"$f":"$AO$118","v":0},{"$f":"$AO$119","v":0},null,{"$f":"$AO$120","v":0},{"$f":"$AO$121","v":0},null,{"$f":"$AP$118","v":0},{"$f":"$AP$119","v":0},null,{"$f":"$AP$120","v":0},{"$f":"$AP$121","v":0},null,{"$f":"$AQ$118","v":0},{"$f":"$AQ$119","v":0},null,{"$f":"$AQ$120","v":0},{"$f":"$AQ$121","v":0}]
[58,null,null,null,null,null,null,null,null,null,null,null,null,null,null,null,null,null,null,null,null,null,null,null,null,null,null,null,null,null,null,null,null,null,null,null,null,null,null,null,null,null,null,null,null,null,{"$f":"LOOKUP(AU62,$A$6:$A$155,$B$6:$B$155)","v":{"$error":"#N/A"}},{"$f":"LOOKUP(AV62,$A$6:$A$155,$B$6:$B$155)","v":{"$error":"#N/A"}},null,{"$f":"LOOKUP(AX62,$A$6:$A$155,$B$6:$B$155)","v":{"$error":"#N/A"}},{"$f":"LOOKUP(AY62,$A$6:$A$155,$B$6:$B$155)","v":{"$error":"#N/A"}},null,{"$f":"LOOKUP(BA62,$A$6:$A$155,$B$6:$B$155)","v":{"$error":"#N/A"}},{"$f":"LOOKUP(BB62,$A$6:$A$155,$B$6:$B$155)","v":{"$error":"#N/A"}},null,{"$f":"LOOKUP(BD62,$A$6:$A$155,$B$6:$B$155)","v":{"$error":"#N/A"}},{"$f":"LOOKUP(BE62,$A$6:$A$155,$B$6:$B$155)","v":{"$error":"#N/A"}},null,{"$f":"LOOKUP(BG62,$A$6:$A$155,$B$6:$B$155)","v":{"$error":"#N/A"}},{"$f":"LOOKUP(BH62,$A$6:$A$155,$B$6:$B$155)","v":{"$error":"#N/A"}},null,{"$f":"LOOKUP(BJ62,$A$6:$A$155,$B$6:$B$155)","v":{"$error":"#N/A"}},{"$f":"LOOKUP(BK62,$A$6:$A$155,$B$6:$B$155)","v":{"$error":"#N/A"}},null,{"$f":"LOOKUP(BM62,$A$6:$A$155,$B$6:$B$155)","v":{"$error":"#N/A"}},{"$f":"LOOKUP(BN62,$A$6:$A$155,$B$6:$B$155)","v":{"$error":"#N/A"}},null,{"$f":"LOOKUP(BP62,$A$6:$A$155,$B$6:$B$155)","v":{"$error":"#N/A"}},{"$f":"LOOKUP(BQ62,$A$6:$A$155,$B$6:$B$155)","v":{"$error":"#N/A"}}]
[59,null,null,null,null,null,null,null,null,null,null,null,null,null,null,null,null,null,null,null,null,null,null,null,null,null,null,null,null,null,null,null,null,null,null,null,null,null,null,null,null,null,null,null,null,null,{"$f":"$AN$122","v":0},{"$f":"$AN$123","v":0},null,{"$f":"$AN$124","v":0},{"$f":"$AN$125","v":0},null,{"$f":"$AO$122","v":0},{"$f":"$AO$123","v":0},null,{"$f":"$AO$124","v":0},{"$f":"$AO$125","v":0},null,{"$f":"$AP$122","v":0},{"$f":"$AP$123","v":0},null,{"$f":"$AP$124","v":0},{"$f":"$AP$125","v":0},null,{"$f":"$AQ$122","v":0},{"$f":"$AQ$123","v":0},null,{"$f":"$AQ$124","v":0},{"$f":"$AQ$125","v":0}]
[60,null,null,null,null,null,null,null,null,null,null,null,null,null,null,null,null,null,null,null,null,null,null,null,null,null,null,null,null,null,null,null,null,null,null,null,null,null,null,null,null,null,null,null,null,null,{"$f":"LOOKUP(AU64,$A$6:$A$155,$B$6:$B$155)","v":{"$error":"#N/A"}},{"$f":"LOOKUP(AV64,$A$6:$A$155,$B$6:$B$155)","v":{"$error":"#N/A"}},null,{"$f":"LOOKUP(AX64,$A$6:$A$155,$B$6:$B$155)","v":{"$error":"#N/A"}},{"$f":"LOOKUP(AY64,$A$6:$A$155,$B$6:$B$155)","v":{"$error":"#N/A"}},null,{"$f":"LOOKUP(BA64,$A$6:$A$155,$B$6:$B$155)","v":{"$error":"#N/A"}},{"$f":"LOOKUP(BB64,$A$6:$A$155,$B$6:$B$155)","v":{"$error":"#N/A"}},null,{"$f":"LOOKUP(BD64,$A$6:$A$155,$B$6:$B$155)","v":{"$error":"#N/A"}},{"$f":"LOOKUP(BE64,$A$6:$A$155,$B$6:$B$155)","v":{"$error":"#N/A"}},null,{"$f":"LOOKUP(BG64,$A$6:$A$155,$B$6:$B$155)","v":{"$error":"#N/A"}},{"$f":"LOOKUP(BH64,$A$6:$A$155,$B$6:$B$155)","v":{"$error":"#N/A"}},null,{"$f":"LOOKUP(BJ64,$A$6:$A$155,$B$6:$B$155)","v":{"$error":"#N/A"}},{"$f":"LOOKUP(BK64,$A$6:$A$155,$B$6:$B$155)","v":{"$error":"#N/A"}},null,{"$f":"LOOKUP(BM64,$A$6:$A$155,$B$6:$B$155)","v":{"$error":"#N/A"}},{"$f":"LOOKUP(BN64,$A$6:$A$155,$B$6:$B$155)","v":{"$error":"#N/A"}},null,{"$f":"LOOKUP(BP64,$A$6:$A$155,$B$6:$B$155)","v":{"$error":"#N/A"}},{"$f":"LOOKUP(BQ64,$A$6:$A$155,$B$6:$B$155)","v":{"$error":"#N/A"}}]
[61,null,null,null,null,null,null,null,null,null,null,null,null,null,null,null,null,null,null,null,null,null,null,null,null,null,null,null,null,null,null,null,null,null,null,null,null,null,null,null,null,null,null,null,null,null,{"$f":"$AN$126","v":0},{"$f":"$AN$127","v":0},null,{"$f":"$AN$128","v":0},{"$f":"$AN$129","v":0},null,{"$f":"$AO$126","v":0},{"$f":"$AO$127","v":0},null,{"$f":"$AO$128","v":0},{"$f":"$AO$129","v":0},null,{"$f":"$AP$126","v":0},{"$f":"$AP$127","v":0},null,{"$f":"$AP$128","v":0},{"$f":"$AP$129","v":0},null,{"$f":"$AQ$126","v":0},{"$f":"$AQ$127","v":0},null,{"$f":"$AQ$128","v":0},{"$f":"$AQ$129","v":0}]
[62,null,null,null,null,null,null,null,null,null,null,null,null,null,null,null,null,null,null,null,null,null,null,null,null,null,null,null,null,null,null,null,null,null,null,null,null,null,null,null,null,null,null,null,null,null,{"$f":"LOOKUP(AU66,$A$6:$A$155,$B$6:$B$155)","v":{"$error":"#N/A"}},{"$f":"LOOKUP(AV66,$A$6:$A$155,$B$6:$B$155)","v":{"$error":"#N/A"}},null,{"$f":"LOOKUP(AX66,$A$6:$A$155,$B$6:$B$155)","v":{"$error":"#N/A"}},{"$f":"LOOKUP(AY66,$A$6:$A$155,$B$6:$B$155)","v":{"$error":"#N/A"}},null,{"$f":"LOOKUP(BA66,$A$6:$A$155,$B$6:$B$155)","v":{"$error":"#N/A"}},{"$f":"LOOKUP(BB66,$A$6:$A$155,$B$6:$B$155)","v":{"$error":"#N/A"}},null,{"$f":"LOOKUP(BD66,$A$6:$A$155,$B$6:$B$155)","v":{"$error":"#N/A"}},{"$f":"LOOKUP(BE66,$A$6:$A$155,$B$6:$B$155)","v":{"$error":"#N/A"}},null,{"$f":"LOOKUP(BG66,$A$6:$A$155,$B$6:$B$155)","v":{"$error":"#N/A"}},{"$f":"LOOKUP(BH66,$A$6:$A$155,$B$6:$B$155)","v":{"$error":"#N/A"}},null,{"$f":"LOOKUP(BJ66,$A$6:$A$155,$B$6:$B$155)","v":{"$error":"#N/A"}},{"$f":"LOOKUP(BK66,$A$6:$A$155,$B$6:$B$155)","v":{"$error":"#N/A"}},null,{"$f":"LOOKUP(BM66,$A$6:$A$155,$B$6:$B$155)","v":{"$error":"#N/A"}},{"$f":"LOOKUP(BN66,$A$6:$A$155,$B$6:$B$155)","v":{"$error":"#N/A"}},null,{"$f":"LOOKUP(BP66,$A$6:$A$155,$B$6:$B$155)","v":{"$error":"#N/A"}},{"$f":"LOOKUP(BQ66,$A$6:$A$155,$B$6:$B$155)","v":{"$error":"#N/A"}}]
[63,null,null,null,null,null,null,null,null,null,null,null,null,null,null,null,null,null,null,null,null,null,null,null,null,null,null,null,null,null,null,null,null,null,null,null,null,null,null,null,null,null,null,null,null,null,{"$f":"$AN$130","v":0},{"$f":"$AN$131","v":0},null,{"$f":"$AN$132","v":0},{"$f":"$AN$133","v":0},null,{"$f":"$AO$130","v":0},{"$f":"$AO$131","v":0},null,{"$f":"$AO$132","v":0},{"$f":"$AO$133","v":0},null,{"$f":"$AP$130","v":0},{"$f":"$AP$131","v":0},null,{"$f":"$AP$132","v":0},{"$f":"$AP$133","v":0},null,{"$f":"$AQ$130","v":0},{"$f":"$AQ$131","v":0},null,{"$f":"$AQ$132","v":0},{"$f":"$AQ$133","v":0}]
[64,null,null,null,null,null,null,null,null,null,null,null,null,null,null,null,null,null,null,null,null,null,null,null,null,null,null,null,null,null,null,null,null,null,null,null,null,null,null,null,null,null,null,null,null,null,{"$f":"LOOKUP(AU68,$A$6:$A$155,$B$6:$B$155)","v":{"$error":"#N/A"}},{"$f":"LOOKUP(AV68,$A$6:$A$155,$B$6:$B$155)","v":{"$error":"#N/A"}},null,{"$f":"LOOKUP(AX68,$A$6:$A$155,$B$6:$B$155)","v":{"$error":"#N/A"}},{"$f":"LOOKUP(AY68,$A$6:$A$155,$B$6:$B$155)","v":{"$error":"#N/A"}},null,{"$f":"LOOKUP(BA68,$A$6:$A$155,$B$6:$B$155)","v":{"$error":"#N/A"}},{"$f":"LOOKUP(BB68,$A$6:$A$155,$B$6:$B$155)","v":{"$error":"#N/A"}},null,{"$f":"LOOKUP(BD68,$A$6:$A$155,$B$6:$B$155)","v":{"$error":"#N/A"}},{"$f":"LOOKUP(BE68,$A$6:$A$155,$B$6:$B$155)","v":{"$error":"#N/A"}},null,{"$f":"LOOKUP(BG68,$A$6:$A$155,$B$6:$B$155)","v":{"$error":"#N/A"}},{"$f":"LOOKUP(BH68,$A$6:$A$155,$B$6:$B$155)","v":{"$error":"#N/A"}},null,{"$f":"LOOKUP(BJ68,$A$6:$A$155,$B$6:$B$155)","v":{"$error":"#N/A"}},{"$f":"LOOKUP(BK68,$A$6:$A$155,$B$6:$B$155)","v":{"$error":"#N/A"}},null,{"$f":"LOOKUP(BM68,$A$6:$A$155,$B$6:$B$155)","v":{"$error":"#N/A"}},{"$f":"LOOKUP(BN68,$A$6:$A$155,$B$6:$B$155)","v":{"$error":"#N/A"}},null,{"$f":"LOOKUP(BP68,$A$6:$A$155,$B$6:$B$155)","v":{"$error":"#N/A"}},{"$f":"LOOKUP(BQ68,$A$6:$A$155,$B$6:$B$155)","v":{"$error":"#N/A"}}]
[65,null,null,null,null,null,null,null,null,null,null,null,null,null,null,null,null,null,null,null,null,null,null,null,null,null,null,null,null,null,null,null,null,null,null,null,null,null,null,null,null,null,null,null,null,null,{"$f":"$AN$134","v":0},{"$f":"$AN$135","v":0},null,{"$f":"$AN$136","v":0},{"$f":"$AN$137","v":0},null,{"$f":"$AO$134","v":0},{"$f":"$AO$135","v":0},null,{"$f":"$AO$136","v":0},{"$f":"$AO$137","v":0},null,{"$f":"$AP$134","v":0},{"$f":"$AP$135","v":0},null,{"$f":"$AP$136","v":0},{"$f":"$AP$137","v":0},null,{"$f":"$AQ$134","v":0},{"$f":"$AQ$135","v":0},null,{"$f":"$AQ$136","v":0},{"$f":"$AQ$137","v":0}]
[66,null,null,null,null,null,null,null,null,null,null,null,null,null,null,null,null,null,null,null,null,null,null,null,null,null,null,null,null,null,null,null,null,null,null,null,null,null,null,null,null,null,null,null,null,null,{"$f":"LOOKUP(AU70,$A$6:$A$155,$B$6:$B$155)","v":{"$error":"#N/A"}},{"$f":"LOOKUP(AV70,$A$6:$A$155,$B$6:$B$155)","v":{"$error":"#N/A"}},null,{"$f":"LOOKUP(AX70,$A$6:$A$155,$B$6:$B$155)","v":{"$error":"#N/A"}},{"$f":"LOOKUP(AY70,$A$6:$A$155,$B$6:$B$155)","v":{"$error":"#N/A"}},null,{"$f":"LOOKUP(BA70,$A$6:$A$155,$B$6:$B$155)","v":{"$error":"#N/A"}},{"$f":"LOOKUP(BB70,$A$6:$A$155,$B$6:$B$155)","v":{"$error":"#N/A"}},null,{"$f":"LOOKUP(BD70,$A$6:$A$155,$B$6:$B$155)","v":{"$error":"#N/A"}},{"$f":"LOOKUP(BE70,$A$6:$A$155,$B$6:$B$155)","v":{"$error":"#N/A"}},null,{"$f":"LOOKUP(BG70,$A$6:$A$155,$B$6:$B$155)","v":{"$error":"#N/A"}},{"$f":"LOOKUP(BH70,$A$6:$A$155,$B$6:$B$155)","v":{"$error":"#N/A"}},null,{"$f":"LOOKUP(BJ70,$A$6:$A$155,$B$6:$B$155)","v":{"$error":"#N/A"}},{"$f":"LOOKUP(BK70,$A$6:$A$155,$B$6:$B$155)","v":{"$error":"#N/A"}},null,{"$f":"LOOKUP(BM70,$A$6:$A$155,$B$6:$B$155)","v":{"$error":"#N/A"}},{"$f":"LOOKUP(BN70,$A$6:$A$155,$B$6:$B$155)","v":{"$error":"#N/A"}},null,{"$f":"LOOKUP(BP70,$A$6:$A$155,$B$6:$B$155)","v":{"$error":"#N/A"}},{"$f":"LOOKUP(BQ70,$A$6:$A$155,$B$6:$B$155)","v":{"$error":"#N/A"}}]
[67,null,null,null,null,null,null,null,null,null,null,null,null,null,null,null,null,null,null,null,null,null,null,null,null,null,null,null,null,null,null,null,null,null,null,null,null,null,null,null,null,null,null,null,null,null,{"$f":"$AN$138","v":0},{"$f":"$AN$139","v":0},null,{"$f":"$AN$140","v":0},{"$f":"$AN$141","v":0},null,{"$f":"$AO$138","v":0},{"$f":"$AO$139","v":0},null,{"$f":"$AO$140","v":0},{"$f":"$AO$141","v":0},null,{"$f":"$AP$138","v":0},{"$f":"$AP$139","v":0},null,{"$f":"$AP$140","v":0},{"$f":"$AP$141","v":0},null,{"$f":"$AQ$138","v":0},{"$f":"$AQ$139","v":0},null,{"$f":"$AQ$140","v":0},{"$f":"$AQ$141","v":0}]
[68,null,null,null,null,null,null,null,null,null,null,null,null,null,null,null,null,null,null,null,null,null,null,null,null,null,null,null,null,null,null,null,null,null,null,null,null,null,null,null,null,null,null,null,null,null,{"$f":"LOOKUP(AU72,$A$6:$A$155,$B$6:$B$155)","v":{"$error":"#N/A"}},{"$f":"LOOKUP(AV72,$A$6:$A$155,$B$6:$B$155)","v":{"$error":"#N/A"}},null,{"$f":"LOOKUP(AX72,$A$6:$A$155,$B$6:$B$155)","v":{"$error":"#N/A"}},{"$f":"LOOKUP(AY72,$A$6:$A$155,$B$6:$B$155)","v":{"$error":"#N/A"}},null,{"$f":"LOOKUP(BA72,$A$6:$A$155,$B$6:$B$155)","v":{"$error":"#N/A"}},{"$f":"LOOKUP(BB72,$A$6:$A$155,$B$6:$B$155)","v":{"$error":"#N/A"}},null,{"$f":"LOOKUP(BD72,$A$6:$A$155,$B$6:$B$155)","v":{"$error":"#N/A"}},{"$f":"LOOKUP(BE72,$A$6:$A$155,$B$6:$B$155)","v":{"$error":"#N/A"}},null,{"$f":"LOOKUP(BG72,$A$6:$A$155,$B$6:$B$155)","v":{"$error":"#N/A"}},{"$f":"LOOKUP(BH72,$A$6:$A$155,$B$6:$B$155)","v":{"$error":"#N/A"}},null,{"$f":"LOOKUP(BJ72,$A$6:$A$155,$B$6:$B$155)","v":{"$error":"#N/A"}},{"$f":"LOOKUP(BK72,$A$6:$A$155,$B$6:$B$155)","v":{"$error":"#N/A"}},null,{"$f":"LOOKUP(BM72,$A$6:$A$155,$B$6:$B$155)","v":{"$error":"#N/A"}},{"$f":"LOOKUP(BN72,$A$6:$A$155,$B$6:$B$155)","v":{"$error":"#N/A"}},null,{"$f":"LOOKUP(BP72,$A$6:$A$155,$B$6:$B$155)","v":{"$error":"#N/A"}},{"$f":"LOOKUP(BQ72,$A$6:$A$155,$B$6:$B$155)","v":{"$error":"#N/A"}}]
[69,null,null,null,null,null,null,null,null,null,null,null,null,null,null,null,null,null,null,null,null,null,null,null,null,null,null,null,null,null,null,null,null,null,null,null,null,null,null,null,null,null,null,null,null,null,{"$f":"$AN$142","v":0},{"$f":"$AN$143","v":0},null,{"$f":"$AN$144","v":0},{"$f":"$AN$145","v":0},null,{"$f":"$AO$142","v":0},{"$f":"$AO$143","v":0},null,{"$f":"$AO$144","v":0},{"$f":"$AO$145","v":0},null,{"$f":"$AP$142","v":0},{"$f":"$AP$143","v":0},null,{"$f":"$AP$144","v":0},{"$f":"$AP$145","v":0},null,{"$f":"$AQ$142","v":0},{"$f":"$AQ$143","v":0},null,{"$f":"$AQ$144","v":0},{"$f":"$AQ$145","v":0}]
[70,null,null,null,null,null,null,null,null,null,null,null,null,null,null,null,null,null,null,null,null,null,null,null,null,null,null,null,null,null,null,null,null,null,null,null,null,null,null,null,null,null,null,null,null,null,{"$f":"LOOKUP(AU74,$A$6:$A$155,$B$6:$B$155)","v":{"$error":"#N/A"}},{"$f":"LOOKUP(AV74,$A$6:$A$155,$B$6:$B$155)","v":{"$error":"#N/A"}},null,{"$f":"LOOKUP(AX74,$A$6:$A$155,$B$6:$B$155)","v":{"$error":"#N/A"}},{"$f":"LOOKUP(AY74,$A$6:$A$155,$B$6:$B$155)","v":{"$error":"#N/A"}},null,{"$f":"LOOKUP(BA74,$A$6:$A$155,$B$6:$B$155)","v":{"$error":"#N/A"}},{"$f":"LOOKUP(BB74,$A$6:$A$155,$B$6:$B$155)","v":{"$error":"#N/A"}},null,{"$f":"LOOKUP(BD74,$A$6:$A$155,$B$6:$B$155)","v":{"$error":"#N/A"}},{"$f":"LOOKUP(BE74,$A$6:$A$155,$B$6:$B$155)","v":{"$error":"#N/A"}},null,{"$f":"LOOKUP(BG74,$A$6:$A$155,$B$6:$B$155)","v":{"$error":"#N/A"}},{"$f":"LOOKUP(BH74,$A$6:$A$155,$B$6:$B$155)","v":{"$error":"#N/A"}},null,{"$f":"LOOKUP(BJ74,$A$6:$A$155,$B$6:$B$155)","v":{"$error":"#N/A"}},{"$f":"LOOKUP(BK74,$A$6:$A$155,$B$6:$B$155)","v":{"$error":"#N/A"}},null,{"$f":"LOOKUP(BM74,$A$6:$A$155,$B$6:$B$155)","v":{"$error":"#N/A"}},{"$f":"LOOKUP(BN74,$A$6:$A$155,$B$6:$B$155)","v":{"$error":"#N/A"}},null,{"$f":"LOOKUP(BP74,$A$6:$A$155,$B$6:$B$155)","v":{"$error":"#N/A"}},{"$f":"LOOKUP(BQ74,$A$6:$A$155,$B$6:$B$155)","v":{"$error":"#N/A"}}]
[71,null,null,null,null,null,null,null,null,null,null,null,null,null,null,null,null,null,null,null,null,null,null,null,null,null,null,null,null,null,null,null,null,null,null,null,null,null,null,null,null,null,null,null,null,null,{"$f":"$AN$146","v":0},{"$f":"$AN$147","v":0},null,{"$f":"$AN$148","v":0},{"$f":"$AN$149","v":0},null,{"$f":"$AO$146","v":0},{"$f":"$AO$147","v":0},null,{"$f":"$AO$148","v":0},{"$f":"$AO$149","v":0},null,{"$f":"$AP$146","v":0},{"$f":"$AP$147","v":0},null,{"$f":"$AP$148","v":0},{"$f":"$AP$149","v":0},null,{"$f":"$AQ$146","v":0},{"$f":"$AQ$147","v":0},null,{"$f":"$AQ$148","v":0},{"$f":"$AQ$149","v":0}]
[72,null,null,null,null,null,null,null,null,null,null,null,null,null,null,null,null,null,null,null,null,null,null,null,null,null,null,null,null,null,null,null,null,null,null,null,null,null,null,null,null,null,null,null,null,null,{"$f":"LOOKUP(AU76,$A$6:$A$155,$B$6:$B$155)","v":{"$error":"#N/A"}},{"$f":"LOOKUP(AV76,$A$6:$A$155,$B$6:$B$155)","v":{"$error":"#N/A"}},null,{"$f":"LOOKUP(AX76,$A$6:$A$155,$B$6:$B$155)","v":{"$error":"#N/A"}},{"$f":"LOOKUP(AY76,$A$6:$A$155,$B$6:$B$155)","v":{"$error":"#N/A"}},null,{"$f":"LOOKUP(BA76,$A$6:$A$155,$B$6:$B$155)","v":{"$error":"#N/A"}},{"$f":"LOOKUP(BB76,$A$6:$A$155,$B$6:$B$155)","v":{"$error":"#N/A"}},null,{"$f":"LOOKUP(BD76,$A$6:$A$155,$B$6:$B$155)","v":{"$error":"#N/A"}},{"$f":"LOOKUP(BE76,$A$6:$A$155,$B$6:$B$155)","v":{"$error":"#N/A"}},null,{"$f":"LOOKUP(BG76,$A$6:$A$155,$B$6:$B$155)","v":{"$error":"#N/A"}},{"$f":"LOOKUP(BH76,$A$6:$A$155,$B$6:$B$155)","v":{"$error":"#N/A"}},null,{"$f":"LOOKUP(BJ76,$A$6:$A$155,$B$6:$B$155)","v":{"$error":"#N/A"}},{"$f":"LOOKUP(BK76,$A$6:$A$155,$B$6:$B$155)","v":{"$error":"#N/A"}},null,{"$f":"LOOKUP(BM76,$A$6:$A$155,$B$6:$B$155)","v":{"$error":"#N/A"}},{"$f":"LOOKUP(BN76,$A$6:$A$155,$B$6:$B$155)","v":{"$error":"#N/A"}},null,{"$f":"LOOKUP(BP76,$A$6:$A$155,$B$6:$B$155)","v":{"$error":"#N/A"}},{"$f":"LOOKUP(BQ76,$A$6:$A$155,$B$6:$B$155)","v":{"$error":"#N/A"}}]
[73,null,null,null,null,null,null,null,null,null,null,null,null,null,null,null,null,null,null,null,null,null,null,null,null,null,null,null,null,null,null,null,null,null,null,null,null,null,null,null,null,null,null,null,null,null,{"$f":"$AN$150","v":0},{"$f":"$AN$151","v":0},null,{"$f":"$AN$152","v":0},{"$f":"$AN$153","v":0},null,{"$f":"$AO$150","v":0},{"$f":"$AO$151","v":0},null,{"$f":"$AO$152","v":0},{"$f":"$AO$153","v":0},null,{"$f":"$AP$150","v":0},{"$f":"$AP$151","v":0},null,{"$f":"$AP$152","v":0},{"$f":"$AP$153","v":0},null,{"$f":"$AQ$150","v":0},{"$f":"$AQ$151","v":0},null,{"$f":"$AQ$152","v":0},{"$f":"$AQ$153","v":0}]
[74,null,null,null,null,null,null,null,null,null,null,null,null,null,null,null,null,null,null,null,null,null,null,null,null,null,null,null,null,null,null,null,null,null,null,null,null,null,null,null,null,null,null,null,null,null,{"$f":"LOOKUP(AU78,$A$6:$A$155,$B$6:$B$155)","v":{"$error":"#N/A"}},{"$f":"LOOKUP(AV78,$A$6:$A$155,$B$6:$B$155)","v":{"$error":"#N/A"}},null,{"$f":"LOOKUP(AX78,$A$6:$A$155,$B$6:$B$155)","v":{"$error":"#N/A"}},{"$f":"LOOKUP(AY78,$A$6:$A$155,$B$6:$B$155)","v":{"$error":"#N/A"}},null,{"$f":"LOOKUP(BA78,$A$6:$A$155,$B$6:$B$155)","v":{"$error":"#N/A"}},{"$f":"LOOKUP(BB78,$A$6:$A$155,$B$6:$B$155)","v":{"$error":"#N/A"}},null,{"$f":"LOOKUP(BD78,$A$6:$A$155,$B$6:$B$155)","v":{"$error":"#N/A"}},{"$f":"LOOKUP(BE78,$A$6:$A$155,$B$6:$B$155)","v":{"$error":"#N/A"}},null,{"$f":"LOOKUP(BG78,$A$6:$A$155,$B$6:$B$155)","v":{"$error":"#N/A"}},{"$f":"LOOKUP(BH78,$A$6:$A$155,$B$6:$B$155)","v":{"$error":"#N/A"}},null,{"$f":"LOOKUP(BJ78,$A$6:$A$155,$B$6:$B$155)","v":{"$error":"#N/A"}},{"$f":"LOOKUP(BK78,$A$6:$A$155,$B$6:$B$155)","v":{"$error":"#N/A"}},null,{"$f":"LOOKUP(BM78,$A$6:$A$155,$B$6:$B$155)","v":{"$error":"#N/A"}},{"$f":"LOOKUP(BN78,$A$6:$A$155,$B$6:$B$155)","v":{"$error":"#N/A"}},null,{"$f":"LOOKUP(BP78,$A$6:$A$155,$B$6:$B$155)","v":{"$error":"#N/A"}},{"$f":"LOOKUP(BQ78,$A$6:$A$155,$B$6:$B$155)","v":{"$error":"#N/A"}}]
[75,null,null,null,null,null,null,null,null,null,null,null,null,null,null,null,null,null,null,null,null,null,null,null,null,null,null,null,null,null,null,null,null,null,null,null,null,null,null,null,null,null,null,null,null,null,{"$f":"$AN$154","v":0},{"$f":"$AN$155","v":0},null,null,null,null,{"$f":"$AO$154","v":0},{"$f":"$AO$155","v":0},null,null,null,null,{"$f":"$AP$154","v":0},{"$f":"$AP$155","v":0},null,null,null,null,{"$f":"$AQ$154","v":0},{"$f":"$AQ$155","v":0}]
[76,null,null,null,null,null,null,null,null,null,null,null,null,null,null,null,null,null,null,null,null,null,null,null,null,null,null,null,null,null,null,null,null,null,null,null,null,null,null,null,null,null,null,null,null,null,{"$f":"LOOKUP(AU80,$A$6:$A$155,$B$6:$B$155)","v":{"$error":"#N/A"}},{"$f":"LOOKUP(AV80,$A$6:$A$155,$B$6:$B$155)","v":{"$error":"#N/A"}},null,null,null,null,{"$f":"LOOKUP(BA80,$A$6:$A$155,$B$6:$B$155)","v":{"$error":"#N/A"}},{"$f":"LOOKUP(BB80,$A$6:$A$155,$B$6:$B$155)","v":{"$error":"#N/A"}},null,null,null,null,{"$f":"LOOKUP(BG80,$A$6:$A$155,$B$6:$B$155)","v":{"$error":"#N/A"}},{"$f":"LOOKUP(BH80,$A$6:$A$155,$B$6:$B$155)","v":{"$error":"#N/A"}},null,null,null,null,{"$f":"LOOKUP(BM80,$A$6:$A$155,$B$6:$B$155)","v":{"$error":"#N/A"}},{"$f":"LOOKUP(BN80,$A$6:$A$155,$B$6:$B$155)","v":{"$error":"#N/A"}}]
[77]
[78]
[79]
[80]
[81]
[82]
[83]
[84]
[85]
[86]
[87]
[88]
[89]
[90]
[91]
[92]
[93]
[94]
[95]
[96]
[97]
[98]
[99]
[100]
[101]
[102]
[103]
[104]
[105]
[106]
[107]
[108]
[109]
[110]
[111]
[112]
[113]
[114]
[115]
[116]
[117]
[118]
[119]
[120]
[121]
[122]
[123]
[124]
[125]
[126]
[127]
[128]
[129]
[130]
[131]
[132]
[133]
[134]
[135]
[136]
[137]
[138]
[139]
[140]
[141]
[142]
[143]
[144]
[145]
[146]
[147]
[148]
[149]
[150]
[151]
[152]
[153]
[154]
[155]
[156]
[157]
[158]
[159]
[160]
[161]
[162]

{"sheet":"Impression","index":1,"n_rows":89,"n_cols":25,"rows_kept":89,"cut":false,"hidden":false,"merged":[[0,2,0,6],[0,14,0,18],[5,8,5,9],[5,11,5,12],[5,14,5,15],[5,17,5,18],[5,20,5,21],[5,23,5,24],[1,2,1,6],[1,8,1,12],[1,14,1,18],[1,20,1,24],[5,2,5,3],[5,5,5,6]]}
[null,null,"ALENYA      pétanque ",null,null,null,null,null,{"$f":"'Tableau Tournante'!C1","v":18},"joueurs ",null,null,null,null,{"$f":"TODAY()","v":"2016-04-21"}]
[null,null,"Tour 1",null,null,null,null,null,"Tour 2",null,null,null,null,null,"Tour 3",null,null,null,null,null,"Tour 4"]
[]
[]
[]
[null,null,"EQUIPE",null,null,"CONTRE",null,null,"EQUIPE",null,null,"CONTRE",null,null,"EQUIPE",null,null,"CONTRE",null,null,"EQUIPE",null,null,"CONTRE"]
[]
[null,null,{"$f":"'Tableau Tournante'!N6","v":9},{"$f":"'Tableau Tournante'!O6","v":2},null,{"$f":"'Tableau Tournante'!P6","v":1},{"$f":"'Tableau Tournante'!Q6","v":10},null,{"$f":"'Tableau Tournante'!R6","v":1},{"$f":"'Tableau Tournante'!S6","v":11},null,{"$f":"'Tableau Tournante'!T6","v":15},{"$f":"'Tableau Tournante'!U6","v":18},null,{"$f":"'Tableau Tournante'!V6","v":11},{"$f":"'Tableau Tournante'!W6","v":5},null,{"$f":"'Tableau Tournante'!X6","v":1},{"$f":"'Tableau Tournante'!Y6","v":12},null,{"$f":"'Tableau Tournante'!Z6","v":16},{"$f":"'Tableau Tournante'!AA6","v":1},null,{"$f":"'Tableau Tournante'!AB6","v":7},{"$f":"'Tableau Tournante'!AC6","v":4}]
[null,null,{"$f":"VLOOKUP(C8,'Tableau Tournante'!$A$6:$B$168,2)","v":"MARIE"},{"$f":"VLOOKUP(D8,'Tableau Tournante'!$A$6:$B$168,2)","v":"FRANCOIS"},null,{"$f":"VLOOKUP(F8,'Tableau Tournante'!$A$6:$B$168,2)","v":"ALAIN"},{"$f":"VLOOKUP(G8,'Tableau Tournante'!$A$6:$B$168,2)","v":"MICHEL"},null,{"$f":"VLOOKUP(I8,'Tableau Tournante'!$A$6:$B$168,2)","v":"ALAIN"},{"$f":"VLOOKUP(J8,'Tableau Tournante'!$A$6:$B$168,2)","v":"MARC"},null,{"$f":"VLOOKUP(L8,'Tableau Tournante'!$A$6:$B$168,2)","v":"TONI"},{"$f":"VLOOKUP(M8,'Tableau Tournante'!$A$6:$B$168,2)","v":"GEORGES"},null,{"$f":"VLOOKUP(O8,'Tableau Tournante'!$A$6:$B$168,2)","v":"MARC"},{"$f":"VLOOKUP(P8,'Tableau Tournante'!$A$6:$B$168,2)","v":"VERO"},null,{"$f":"VLOOKUP(R8,'Tableau Tournante'!$A$6:$B$168,2)","v":"ALAIN"},{"$f":"VLOOKUP(S8,'Tableau Tournante'!$A$6:$B$168,2)","v":"MARCEL"},null,{"$f":"VLOOKUP(U8,'Tableau Tournante'!$A$6:$B$168,2)","v":"CYRILLE"},{"$f":"VLOOKUP(V8,'Tableau Tournante'!$A$6:$B$168,2)","v":"ALAIN"},null,{"$f":"VLOOKUP(X8,'Tableau Tournante'!$A$6:$B$168,2)","v":"JEAN"},{"$f":"VLOOKUP(Y8,'Tableau Tournante'!$A$6:$B$168,2)","v":"YVES"}]
[null,null,{"$f":"'Tableau Tournante'!N7","v":3},{"$f":"'Tableau Tournante'!O7","v":18},null,{"$f":"'Tableau Tournante'!P7","v":6},{"$f":"'Tableau Tournante'!Q7","v":8},null,{"$f":"'Tableau Tournante'!R7","v":17},{"$f":"'Tableau Tournante'!S7","v":5},null,{"$f":"'Tableau Tournante'!T7","v":8},{"$f":"'Tableau Tournante'!U7","v":10},null,{"$f":"'Tableau Tournante'!V7","v":14},{"$f":"'Tableau Tournante'!W7","v":16},null,{"$f":"'Tableau Tournante'!X7","v":3},{"$f":"'Tableau Tournante'!Y7","v":13},null,{"$f":"'Tableau Tournante'!Z7","v":14},{"$f":"'Tableau Tournante'!AA7","v":13},null,{"$f":"'Tableau Tournante'!AB7","v":9},{"$f":"'Tableau Tournante'!AC7","v":17}]
[null,null,{"$f":"VLOOKUP(C10,'Tableau Tournante'!$A$6:$B$168,2)","v":"SERGE"},{"$f":"VLOOKUP(D10,'Tableau Tournante'!$A$6:$B$168,2)","v":"GEORGES"},null,{"$f":"VLOOKUP(F10,'Tableau Tournante'!$A$6:$B$168,2)","v":"ANTOINE"},{"$f":"VLOOKUP(G10,'Tableau Tournante'!$A$6:$B$168,2)","v":"JEAN-MARIE"},null,{"$f":"VLOOKUP(I10,'Tableau Tournante'!$A$6:$B$168,2)","v":"AIME"},{"$f":"VLOOKUP(J10,'Tableau Tournante'!$A$6:$B$168,2)","v":"VERO"},null,{"$f":"VLOOKUP(L10,'Tableau Tournante'!$A$6:$B$168,2)","v":"JEAN-MARIE"},{"$f":"VLOOKUP(M10,'Tableau Tournante'!$A$6:$B$168,2)","v":"MICHEL"},null,{"$f":"VLOOKUP(O10,'Tableau Tournante'!$A$6:$B$168,2)","v":"LUCIEN"},{"$f":"VLOOKUP(P10,'Tableau Tournante'!$A$6:$B$168,2)","v":"CYRILLE"},null,{"$f":"VLOOKUP(R10,'Tableau Tournante'!$A$6:$B$168,2)","v":"SERGE"},{"$f":"VLOOKUP(S10,'Tableau Tournante'!$A$6:$B$168,2)","v":"JACQUES"},null,{"$f":"VLOOKUP(U10,'Tableau Tournante'!$A$6:$B$168,2)","v":"LUCIEN"},{"$f":"VLOOKUP(V10,'Tableau Tournante'!$A$6:$B$168,2)","v":"JACQUES"},null,{"$f":"VLOOKUP(X10,'Tableau Tournante'!$A$6:$B$168,2)","v":"MARIE"},{"$f":"VLOOKUP(Y10,'Tableau Tournante'!$A$6:$B$168,2)","v":"AIME"}]
[null,null,{"$f":"'Tableau Tournante'!N8","v":12},{"$f":"'Tableau Tournante'!O8","v":11},null,{"$f":"'Tableau Tournante'!P8","v":7},{"$f":"'Tableau Tournante'!Q8","v":13},null,{"$f":"'Tableau Tournante'!R8","v":4},{"$f":"'Tableau Tournante'!S8","v":3},null,{"$f":"'Tableau Tournante'!T8","v":13},{"$f":"'Tableau Tournante'!U8","v":2},null,{"$f":"'Tableau Tournante'!V8","v":8},{"$f":"'Tableau Tournante'!W8","v":2},null,{"$f":"'Tableau Tournante'!X8","v":6},{"$f":"'Tableau Tournante'!Y8","v":15},null,{"$f":"'Tableau Tournante'!Z8","v":12},{"$f":"'Tableau Tournante'!AA8","v":2},null,{"$f":"'Tableau Tournante'!AB8","v":8},{"$f":"'Tableau Tournante'!AC8","v":18}]
[null,null,{"$f":"VLOOKUP(C12,'Tableau Tournante'!$A$6:$B$168,2)","v":"MARCEL"},{"$f":"VLOOKUP(D12,'Tableau Tournante'!$A$6:$B$168,2)","v":"MARC"},null,{"$f":"VLOOKUP(F12,'Tableau Tournante'!$A$6:$B$168,2)","v":"JEAN"},{"$f":"VLOOKUP(G12,'Tableau Tournante'!$A$6:$B$168,2)","v":"JACQUES"},null,{"$f":"VLOOKUP(I12,'Tableau Tournante'!$A$6:$B$168,2)","v":"YVES"},{"$f":"VLOOKUP(J12,'Tableau Tournante'!$A$6:$B$168,2)","v":"SERGE"},null,{"$f":"VLOOKUP(L12,'Tableau Tournante'!$A$6:$B$168,2)","v":"JACQUES"},{"$f":"VLOOKUP(M12,'Tableau Tournante'!$A$6:$B$168,2)","v":"FRANCOIS"},null,{"$f":"VLOOKUP(O12,'Tableau Tournante'!$A$6:$B$168,2)","v":"JEAN-MARIE"},{"$f":"VLOOKUP(P12,'Tableau Tournante'!$A$6:$B$168,2)","v":"FRANCOIS"},null,{"$f":"VLOOKUP(R12,'Tableau Tournante'!$A$6:$B$168,2)","v":"ANTOINE"},{"$f":"VLOOKUP(S12,'Tableau Tournante'!$A$6:$B$168,2)","v":"TONI"},null,{"$f":"VLOOKUP(U12,'Tableau Tournante'!$A$6:$B$168,2)","v":"MARCEL"},{"$f":"VLOOKUP(V12,'Tableau Tournante'!$A$6:$B$168,2)","v":"FRANCOIS"},null,{"$f":"VLOOKUP(X12,'Tableau Tournante'!$A$6:$B$168,2)","v":"JEAN-MARIE"},{"$f":"VLOOKUP(Y12,'Tableau Tournante'!$A$6:$B$168,2)","v":"GEORGES"}]
[null,null,{"$f":"'Tableau Tournante'!N9","v":17},{"$f":"'Tableau Tournante'!O9","v":15},null,{"$f":"'Tableau Tournante'!P9","v":4},{"$f":"'Tableau Tournante'!Q9","v":16},null,{"$f":"'Tableau Tournante'!R9","v":12},{"$f":"'Tableau Tournante'!S9","v":7},null,{"$f":"'Tableau Tournante'!T9","v":6},{"$f":"'Tableau Tournante'!U9","v":14},null,{"$f":"'Tableau Tournante'!V9","v":18},{"$f":"'Tableau Tournante'!W9","v":4},null,{"$f":"'Tableau Tournante'!X9","v":9},{"$f":"'Tableau Tournante'!Y9","v":10},null,{"$f":"'Tableau Tournante'!Z9","v":3},{"$f":"'Tableau Tournante'!AA9","v":15},null,{"$f":"'Tableau Tournante'!AB9","v":10},{"$f":"'Tableau Tournante'!AC9","v":5}]
[null,null,{"$f":"VLOOKUP(C14,'Tableau Tournante'!$A$6:$B$168,2)","v":"AIME"},{"$f":"VLOOKUP(D14,'Tableau Tournante'!$A$6:$B$168,2)","v":"TONI"},null,{"$f":"VLOOKUP(F14,'Tableau Tournante'!$A$6:$B$168,2)","v":"YVES"},{"$f":"VLOOKUP(G14,'Tableau Tournante'!$A$6:$B$168,2)","v":"CYRILLE"},null,{"$f":"VLOOKUP(I14,'Tableau Tournante'!$A$6:$B$168,2)","v":"MARCEL"},{"$f":"VLOOKUP(J14,'Tableau Tournante'!$A$6:$B$168,2)","v":"JEAN"},null,{"$f":"VLOOKUP(L14,'Tableau Tournante'!$A$6:$B$168,2)","v":"ANTOINE"},{"$f":"VLOOKUP(M14,'Tableau Tournante'!$A$6:$B$168,2)","v":"LUCIEN"},null,{"$f":"VLOOKUP(O14,'Tableau Tournante'!$A$6:$B$168,2)","v":"GEORGES"},{"$f":"VLOOKUP(P14,'Tableau Tournante'!$A$6:$B$168,2)","v":"YVES"},null,{"$f":"VLOOKUP(R14,'Tableau Tournante'!$A$6:$B$168,2)","v":"MARIE"},{"$f":"VLOOKUP(S14,'Tableau Tournante'!$A$6:$B$168,2)","v":"MICHEL"},null,{"$f":"VLOOKUP(U14,'Tableau Tournante'!$A$6:$B$168,2)","v":"SERGE"},{"$f":"VLOOKUP(V14,'Tableau Tournante'!$A$6:$B$168,2)","v":"TONI"},null,{"$f":"VLOOKUP(X14,'Tableau Tournante'!$A$6:$B$168,2)","v":"MICHEL"},{"$f":"VLOOKUP(Y14,'Tableau Tournante'!$A$6:$B$168,2)","v":"VERO"}]
[null,null,{"$f":"'Tableau Tournante'!N10","v":0},{"$f":"'Tableau Tournante'!O10","v":5},null,{"$f":"'Tableau Tournante'!P10","v":14},{"$f":"'Tableau Tournante'!Q10","v":0},null,{"$f":"'Tableau Tournante'!R10","v":0},{"$f":"'Tableau Tournante'!S10","v":9},null,{"$f":"'Tableau Tournante'!T10","v":16},{"$f":"'Tableau Tournante'!U10","v":0},null,{"$f":"'Tableau Tournante'!V10","v":0},{"$f":"'Tableau Tournante'!W10","v":17},null,{"$f":"'Tableau Tournante'!X10","v":7},{"$f":"'Tableau Tournante'!Y10","v":0},null,{"$f":"'Tableau Tournante'!Z10","v":0},{"$f":"'Tableau Tournante'!AA10","v":11},null,{"$f":"'Tableau Tournante'!AB10","v":6},{"$f":"'Tableau Tournante'!AC10","v":0}]
[null,null,{"$f":"VLOOKUP(C16,'Tableau Tournante'!$A$6:$B$168,2)","v":{"$error":"#N/A"}},{"$f":"VLOOKUP(D16,'Tableau Tournante'!$A$6:$B$168,2)","v":"VERO"},null,{"$f":"VLOOKUP(F16,'Tableau Tournante'!$A$6:$B$168,2)","v":"LUCIEN"},{"$f":"VLOOKUP(G16,'Tableau Tournante'!$A$6:$B$168,2)","v":{"$error":"#N/A"}},null,{"$f":"VLOOKUP(I16,'Tableau Tournante'!$A$6:$B$168,2)","v":{"$error":"#N/A"}},{"$f":"VLOOKUP(J16,'Tableau Tournante'!$A$6:$B$168,2)","v":"MARIE"},null,{"$f":"VLOOKUP(L16,'Tableau Tournante'!$A$6:$B$168,2)","v":"CYRILLE"},{"$f":"VLOOKUP(M16,'Tableau Tournante'!$A$6:$B$168,2)","v":{"$error":"#N/A"}},null,{"$f":"VLOOKUP(O16,'Tableau Tournante'!$A$6:$B$168,2)","v":{"$error":"#N/A"}},{"$f":"VLOOKUP(P16,'Tableau Tournante'!$A$6:$B$168,2)","v":"AIME"},null,{"$f":"VLOOKUP(R16,'Tableau Tournante'!$A$6:$B$168,2)","v":"JEAN"},{"$f":"VLOOKUP(S16,'Tableau Tournante'!$A$6:$B$168,2)","v":{"$error":"#N/A"}},null,{"$f":"VLOOKUP(U16,'Tableau Tournante'!$A$6:$B$168,2)","v":{"$error":"#N/A"}},{"$f":"VLOOKUP(V16,'Tableau Tournante'!$A$6:$B$168,2)","v":"MARC"},null,{"$f":"VLOOKUP(X16,'Tableau Tournante'!$A$6:$B$168,2)","v":"ANTOINE"},{"$f":"VLOOKUP(Y16,'Tableau Tournante'!$A$6:$B$168,2)","v":{"$error":"#N/A"}}]
[null,null,{"$f":"'Tableau Tournante'!N11","v":0},{"$f":"'Tableau Tournante'!O11","v":0},null,{"$f":"'Tableau Tournante'!P11","v":0},{"$f":"'Tableau Tournante'!Q11","v":0},null,{"$f":"'Tableau Tournante'!R11","v":0},{"$f":"'Tableau Tournante'!S11","v":0},null,{"$f":"'Tableau Tournante'!T11","v":0},{"$f":"'Tableau Tournante'!U11","v":0},null,{"$f":"'Tableau Tournante'!V11","v":0},{"$f":"'Tableau Tournante'!W11","v":0},null,{"$f":"'Tableau Tournante'!X11","v":0},{"$f":"'Tableau Tournante'!Y11","v":0},null,{"$f":"'Tableau Tournante'!Z11","v":0},{"$f":"'Tableau Tournante'!AA11","v":0},null,{"$f":"'Tableau Tournante'!AB11","v":0},{"$f":"'Tableau Tournante'!AC11","v":0}]
[null,null,{"$f":"VLOOKUP(C18,'Tableau Tournante'!$A$6:$B$168,2)","v":{"$error":"#N/A"}},{"$f":"VLOOKUP(D18,'Tableau Tournante'!$A$6:$B$168,2)","v":{"$error":"#N/A"}},null,{"$f":"VLOOKUP(F18,'Tableau Tournante'!$A$6:$B$168,2)","v":{"$error":"#N/A"}},{"$f":"VLOOKUP(G18,'Tableau Tournante'!$A$6:$B$168,2)","v":{"$error":"#N/A"}},null,{"$f":"VLOOKUP(I18,'Tableau Tournante'!$A$6:$B$168,2)","v":{"$error":"#N/A"}},{"$f":"VLOOKUP(J18,'Tableau Tournante'!$A$6:$B$168,2)","v":{"$error":"#N/A"}},null,{"$f":"VLOOKUP(L18,'Tableau Tournante'!$A$6:$B$168,2)","v":{"$error":"#N/A"}},{"$f":"VLOOKUP(M18,'Tableau Tournante'!$A$6:$B$168,2)","v":{"$error":"#N/A"}},null,{"$f":"VLOOKUP(O18,'Tableau Tournante'!$A$6:$B$168,2)","v":{"$error":"#N/A"}},{"$f":"VLOOKUP(P18,'Tableau Tournante'!$A$6:$B$168,2)","v":{"$error":"#N/A"}},null,{"$f":"VLOOKUP(R18,'Tableau Tournante'!$A$6:$B$168,2)","v":{"$error":"#N/A"}},{"$f":"VLOOKUP(S18,'Tableau Tournante'!$A$6:$B$168,2)","v":{"$error":"#N/A"}},null,{"$f":"VLOOKUP(U18,'Tableau Tournante'!$A$6:$B$168,2)","v":{"$error":"#N/A"}},{"$f":"VLOOKUP(V18,'Tableau Tournante'!$A$6:$B$168,2)","v":{"$error":"#N/A"}},null,{"$f":"VLOOKUP(X18,'Tableau Tournante'!$A$6:$B$168,2)","v":{"$error":"#N/A"}},{"$f":"VLOOKUP(Y18,'Tableau Tournante'!$A$6:$B$168,2)","v":{"$error":"#N/A"}}]
[null,null,{"$f":"'Tableau Tournante'!N12","v":0},{"$f":"'Tableau Tournante'!O12","v":0},null,{"$f":"'Tableau Tournante'!P12","v":0},{"$f":"'Tableau Tournante'!Q12","v":0},null,{"$f":"'Tableau Tournante'!R12","v":0},{"$f":"'Tableau Tournante'!S12","v":0},null,{"$f":"'Tableau Tournante'!T12","v":0},{"$f":"'Tableau Tournante'!U12","v":0},null,{"$f":"'Tableau Tournante'!V12","v":0},{"$f":"'Tableau Tournante'!W12","v":0},null,{"$f":"'Tableau Tournante'!X12","v":0},{"$f":"'Tableau Tournante'!Y12","v":0},null,{"$f":"'Tableau Tournante'!Z12","v":0},{"$f":"'Tableau Tournante'!AA12","v":0},null,{"$f":"'Tableau Tournante'!AB12","v":0},{"$f":"'Tableau Tournante'!AC12","v":0}]
[null,null,{"$f":"VLOOKUP(C20,'Tableau Tournante'!$A$6:$B$168,2)","v":{"$error":"#N/A"}},{"$f":"VLOOKUP(D20,'Tableau Tournante'!$A$6:$B$168,2)","v":{"$error":"#N/A"}},null,{"$f":"VLOOKUP(F20,'Tableau Tournante'!$A$6:$B$168,2)","v":{"$error":"#N/A"}},{"$f":"VLOOKUP(G20,'Tableau Tournante'!$A$6:$B$168,2)","v":{"$error":"#N/A"}},null,{"$f":"VLOOKUP(I20,'Tableau Tournante'!$A$6:$B$168,2)","v":{"$error":"#N/A"}},{"$f":"VLOOKUP(J20,'Tableau Tournante'!$A$6:$B$168,2)","v":{"$error":"#N/A"}},null,{"$f":"VLOOKUP(L20,'Tableau Tournante'!$A$6:$B$168,2)","v":{"$error":"#N/A"}},{"$f":"VLOOKUP(M20,'Tableau Tournante'!$A$6:$B$168,2)","v":{"$error":"#N/A"}},null,{"$f":"VLOOKUP(O20,'Tableau Tournante'!$A$6:$B$168,2)","v":{"$error":"#N/A"}},{"$f":"VLOOKUP(P20,'Tableau Tournante'!$A$6:$B$168,2)","v":{"$error":"#N/A"}},null,{"$f":"VLOOKUP(R20,'Tableau Tournante'!$A$6:$B$168,2)","v":{"$error":"#N/A"}},{"$f":"VLOOKUP(S20,'Tableau Tournante'!$A$6:$B$168,2)","v":{"$error":"#N/A"}},null,{"$f":"VLOOKUP(U20,'Tableau Tournante'!$A$6:$B$168,2)","v":{"$error":"#N/A"}},{"$f":"VLOOKUP(V20,'Tableau Tournante'!$A$6:$B$168,2)","v":{"$error":"#N/A"}},null,{"$f":"VLOOKUP(X20,'Tableau Tournante'!$A$6:$B$168,2)","v":{"$error":"#N/A"}},{"$f":"VLOOKUP(Y20,'Tableau Tournante'!$A$6:$B$168,2)","v":{"$error":"#N/A"}}]
[null,null,{"$f":"'Tableau Tournante'!N13","v":0},{"$f":"'Tableau Tournante'!O13","v":0},null,{"$f":"'Tableau Tournante'!P13","v":0},{"$f":"'Tableau Tournante'!Q13","v":0},null,{"$f":"'Tableau Tournante'!R13","v":0},{"$f":"'Tableau Tournante'!S13","v":0},null,{"$f":"'Tableau Tournante'!T13","v":0},{"$f":"'Tableau Tournante'!U13","v":0},null,{"$f":"'Tableau Tournante'!V13","v":0},{"$f":"'Tableau Tournante'!W13","v":0},null,{"$f":"'Tableau Tournante'!X13","v":0},{"$f":"'Tableau Tournante'!Y13","v":0},null,{"$f":"'Tableau Tournante'!Z13","v":0},{"$f":"'Tableau Tournante'!AA13","v":0},null,{"$f":"'Tableau Tournante'!AB13","v":0},{"$f":"'Tableau Tournante'!AC13","v":0}]
[null,null,{"$f":"VLOOKUP(C22,'Tableau Tournante'!$A$6:$B$168,2)","v":{"$error":"#N/A"}},{"$f":"VLOOKUP(D22,'Tableau Tournante'!$A$6:$B$168,2)","v":{"$error":"#N/A"}},null,{"$f":"VLOOKUP(F22,'Tableau Tournante'!$A$6:$B$168,2)","v":{"$error":"#N/A"}},{"$f":"VLOOKUP(G22,'Tableau Tournante'!$A$6:$B$168,2)","v":{"$error":"#N/A"}},null,{"$f":"VLOOKUP(I22,'Tableau Tournante'!$A$6:$B$168,2)","v":{"$error":"#N/A"}},{"$f":"VLOOKUP(J22,'Tableau Tournante'!$A$6:$B$168,2)","v":{"$error":"#N/A"}},null,{"$f":"VLOOKUP(L22,'Tableau Tournante'!$A$6:$B$168,2)","v":{"$error":"#N/A"}},{"$f":"VLOOKUP(M22,'Tableau Tournante'!$A$6:$B$168,2)","v":{"$error":"#N/A"}},null,{"$f":"VLOOKUP(O22,'Tableau Tournante'!$A$6:$B$168,2)","v":{"$error":"#N/A"}},{"$f":"VLOOKUP(P22,'Tableau Tournante'!$A$6:$B$168,2)","v":{"$error":"#N/A"}},null,{"$f":"VLOOKUP(R22,'Tableau Tournante'!$A$6:$B$168,2)","v":{"$error":"#N/A"}},{"$f":"VLOOKUP(S22,'Tableau Tournante'!$A$6:$B$168,2)","v":{"$error":"#N/A"}},null,{"$f":"VLOOKUP(U22,'Tableau Tournante'!$A$6:$B$168,2)","v":{"$error":"#N/A"}},{"$f":"VLOOKUP(V22,'Tableau Tournante'!$A$6:$B$168,2)","v":{"$error":"#N/A"}},null,{"$f":"VLOOKUP(X22,'Tableau Tournante'!$A$6:$B$168,2)","v":{"$error":"#N/A"}},{"$f":"VLOOKUP(Y22,'Tableau Tournante'!$A$6:$B$168,2)","v":{"$error":"#N/A"}}]
[null,null,{"$f":"'Tableau Tournante'!N14","v":0},{"$f":"'Tableau Tournante'!O14","v":0},null,{"$f":"'Tableau Tournante'!P14","v":0},{"$f":"'Tableau Tournante'!Q14","v":0},null,{"$f":"'Tableau Tournante'!R14","v":0},{"$f":"'Tableau Tournante'!S14","v":0},null,{"$f":"'Tableau Tournante'!T14","v":0},{"$f":"'Tableau Tournante'!U14","v":0},null,{"$f":"'Tableau Tournante'!V14","v":0},{"$f":"'Tableau Tournante'!W14","v":0},null,{"$f":"'Tableau Tournante'!X14","v":0},{"$f":"'Tableau Tournante'!Y14","v":0},null,{"$f":"'Tableau Tournante'!Z14","v":0},{"$f":"'Tableau Tournante'!AA14","v":0},null,{"$f":"'Tableau Tournante'!AB14","v":0},{"$f":"'Tableau Tournante'!AC14","v":0}]
[null,null,{"$f":"VLOOKUP(C24,'Tableau Tournante'!$A$6:$B$168,2)","v":{"$error":"#N/A"}},{"$f":"VLOOKUP(D24,'Tableau Tournante'!$A$6:$B$168,2)","v":{"$error":"#N/A"}},null,{"$f":"VLOOKUP(F24,'Tableau Tournante'!$A$6:$B$168,2)","v":{"$error":"#N/A"}},{"$f":"VLOOKUP(G24,'Tableau Tournante'!$A$6:$B$168,2)","v":{"$error":"#N/A"}},null,{"$f":"VLOOKUP(I24,'Tableau Tournante'!$A$6:$B$168,2)","v":{"$error":"#N/A"}},{"$f":"VLOOKUP(J24,'Tableau Tournante'!$A$6:$B$168,2)","v":{"$error":"#N/A"}},null,{"$f":"VLOOKUP(L24,'Tableau Tournante'!$A$6:$B$168,2)","v":{"$error":"#N/A"}},{"$f":"VLOOKUP(M24,'Tableau Tournante'!$A$6:$B$168,2)","v":{"$error":"#N/A"}},null,{"$f":"VLOOKUP(O24,'Tableau Tournante'!$A$6:$B$168,2)","v":{"$error":"#N/A"}},{"$f":"VLOOKUP(P24,'Tableau Tournante'!$A$6:$B$168,2)","v":{"$error":"#N/A"}},null,{"$f":"VLOOKUP(R24,'Tableau Tournante'!$A$6:$B$168,2)","v":{"$error":"#N/A"}},{"$f":"VLOOKUP(S24,'Tableau Tournante'!$A$6:$B$168,2)","v":{"$error":"#N/A"}},null,{"$f":"VLOOKUP(U24,'Tableau Tournante'!$A$6:$B$168,2)","v":{"$error":"#N/A"}},{"$f":"VLOOKUP(V24,'Tableau Tournante'!$A$6:$B$168,2)","v":{"$error":"#N/A"}},null,{"$f":"VLOOKUP(X24,'Tableau Tournante'!$A$6:$B$168,2)","v":{"$error":"#N/A"}},{"$f":"VLOOKUP(Y24,'Tableau Tournante'!$A$6:$B$168,2)","v":{"$error":"#N/A"}}]
[null,null,{"$f":"'Tableau Tournante'!N15","v":0},{"$f":"'Tableau Tournante'!O15","v":0},null,{"$f":"'Tableau Tournante'!P15","v":0},{"$f":"'Tableau Tournante'!Q15","v":0},null,{"$f":"'Tableau Tournante'!R15","v":0},{"$f":"'Tableau Tournante'!S15","v":0},null,{"$f":"'Tableau Tournante'!T15","v":0},{"$f":"'Tableau Tournante'!U15","v":0},null,{"$f":"'Tableau Tournante'!V15","v":0},{"$f":"'Tableau Tournante'!W15","v":0},null,{"$f":"'Tableau Tournante'!X15","v":0},{"$f":"'Tableau Tournante'!Y15","v":0},null,{"$f":"'Tableau Tournante'!Z15","v":0},{"$f":"'Tableau Tournante'!AA15","v":0},null,{"$f":"'Tableau Tournante'!AB15","v":0},{"$f":"'Tableau Tournante'!AC15","v":0}]
[null,null,{"$f":"VLOOKUP(C26,'Tableau Tournante'!$A$6:$B$168,2)","v":{"$error":"#N/A"}},{"$f":"VLOOKUP(D26,'Tableau Tournante'!$A$6:$B$168,2)","v":{"$error":"#N/A"}},null,{"$f":"VLOOKUP(F26,'Tableau Tournante'!$A$6:$B$168,2)","v":{"$error":"#N/A"}},{"$f":"VLOOKUP(G26,'Tableau Tournante'!$A$6:$B$168,2)","v":{"$error":"#N/A"}},null,{"$f":"VLOOKUP(I26,'Tableau Tournante'!$A$6:$B$168,2)","v":{"$error":"#N/A"}},{"$f":"VLOOKUP(J26,'Tableau Tournante'!$A$6:$B$168,2)","v":{"$error":"#N/A"}},null,{"$f":"VLOOKUP(L26,'Tableau Tournante'!$A$6:$B$168,2)","v":{"$error":"#N/A"}},{"$f":"VLOOKUP(M26,'Tableau Tournante'!$A$6:$B$168,2)","v":{"$error":"#N/A"}},null,{"$f":"VLOOKUP(O26,'Tableau Tournante'!$A$6:$B$168,2)","v":{"$error":"#N/A"}},{"$f":"VLOOKUP(P26,'Tableau Tournante'!$A$6:$B$168,2)","v":{"$error":"#N/A"}},null,{"$f":"VLOOKUP(R26,'Tableau Tournante'!$A$6:$B$168,2)","v":{"$error":"#N/A"}},{"$f":"VLOOKUP(S26,'Tableau Tournante'!$A$6:$B$168,2)","v":{"$error":"#N/A"}},null,{"$f":"VLOOKUP(U26,'Tableau Tournante'!$A$6:$B$168,2)","v":{"$error":"#N/A"}},{"$f":"VLOOKUP(V26,'Tableau Tournante'!$A$6:$B$168,2)","v":{"$error":"#N/A"}},null,{"$f":"VLOOKUP(X26,'Tableau Tournante'!$A$6:$B$168,2)","v":{"$error":"#N/A"}},{"$f":"VLOOKUP(Y26,'Tableau Tournante'!$A$6:$B$168,2)","v":{"$error":"#N/A"}}]
[null,null,{"$f":"'Tableau Tournante'!N16","v":0},{"$f":"'Tableau Tournante'!O16","v":0},null,{"$f":"'Tableau Tournante'!P16","v":0},{"$f":"'Tableau Tournante'!Q16","v":0},null,{"$f":"'Tableau Tournante'!R16","v":0},{"$f":"'Tableau Tournante'!S16","v":0},null,{"$f":"'Tableau Tournante'!T16","v":0},{"$f":"'Tableau Tournante'!U16","v":0},null,{"$f":"'Tableau Tournante'!V16","v":0},{"$f":"'Tableau Tournante'!W16","v":0},null,{"$f":"'Tableau Tournante'!X16","v":0},{"$f":"'Tableau Tournante'!Y16","v":0},null,{"$f":"'Tableau Tournante'!Z16","v":0},{"$f":"'Tableau Tournante'!AA16","v":0},null,{"$f":"'Tableau Tournante'!AB16","v":0},{"$f":"'Tableau Tournante'!AC16","v":0}]
[null,null,{"$f":"VLOOKUP(C28,'Tableau Tournante'!$A$6:$B$168,2)","v":{"$error":"#N/A"}},{"$f":"VLOOKUP(D28,'Tableau Tournante'!$A$6:$B$168,2)","v":{"$error":"#N/A"}},null,{"$f":"VLOOKUP(F28,'Tableau Tournante'!$A$6:$B$168,2)","v":{"$error":"#N/A"}},{"$f":"VLOOKUP(G28,'Tableau Tournante'!$A$6:$B$168,2)","v":{"$error":"#N/A"}},null,{"$f":"VLOOKUP(I28,'Tableau Tournante'!$A$6:$B$168,2)","v":{"$error":"#N/A"}},{"$f":"VLOOKUP(J28,'Tableau Tournante'!$A$6:$B$168,2)","v":{"$error":"#N/A"}},null,{"$f":"VLOOKUP(L28,'Tableau Tournante'!$A$6:$B$168,2)","v":{"$error":"#N/A"}},{"$f":"VLOOKUP(M28,'Tableau Tournante'!$A$6:$B$168,2)","v":{"$error":"#N/A"}},null,{"$f":"VLOOKUP(O28,'Tableau Tournante'!$A$6:$B$168,2)","v":{"$error":"#N/A"}},{"$f":"VLOOKUP(P28,'Tableau Tournante'!$A$6:$B$168,2)","v":{"$error":"#N/A"}},null,{"$f":"VLOOKUP(R28,'Tableau Tournante'!$A$6:$B$168,2)","v":{"$error":"#N/A"}},{"$f":"VLOOKUP(S28,'Tableau Tournante'!$A$6:$B$168,2)","v":{"$error":"#N/A"}},null,{"$f":"VLOOKUP(U28,'Tableau Tournante'!$A$6:$B$168,2)","v":{"$error":"#N/A"}},{"$f":"VLOOKUP(V28,'Tableau Tournante'!$A$6:$B$168,2)","v":{"$error":"#N/A"}},null,{"$f":"VLOOKUP(X28,'Tableau Tournante'!$A$6:$B$168,2)","v":{"$error":"#N/A"}},{"$f":"VLOOKUP(Y28,'Tableau Tournante'!$A$6:$B$168,2)","v":{"$error":"#N/A"}}]
[null,null,{"$f":"'Tableau Tournante'!N17","v":0},{"$f":"'Tableau Tournante'!O17","v":0},null,{"$f":"'Tableau Tournante'!P17","v":0},{"$f":"'Tableau Tournante'!Q17","v":0},null,{"$f":"'Tableau Tournante'!R17","v":0},{"$f":"'Tableau Tournante'!S17","v":0},null,{"$f":"'Tableau Tournante'!T17","v":0},{"$f":"'Tableau Tournante'!U17","v":0},null,{"$f":"'Tableau Tournante'!V17","v":0},{"$f":"'Tableau Tournante'!W17","v":0},null,{"$f":"'Tableau Tournante'!X17","v":0},{"$f":"'Tableau Tournante'!Y17","v":0},null,{"$f":"'Tableau Tournante'!Z17","v":0},{"$f":"'Tableau Tournante'!AA17","v":0},null,{"$f":"'Tableau Tournante'!AB17","v":0},{"$f":"'Tableau Tournante'!AC17","v":0}]
[null,null,{"$f":"VLOOKUP(C30,'Tableau Tournante'!$A$6:$B$168,2)","v":{"$error":"#N/A"}},{"$f":"VLOOKUP(D30,'Tableau Tournante'!$A$6:$B$168,2)","v":{"$error":"#N/A"}},null,{"$f":"VLOOKUP(F30,'Tableau Tournante'!$A$6:$B$168,2)","v":{"$error":"#N/A"}},{"$f":"VLOOKUP(G30,'Tableau Tournante'!$A$6:$B$168,2)","v":{"$error":"#N/A"}},null,{"$f":"VLOOKUP(I30,'Tableau Tournante'!$A$6:$B$168,2)","v":{"$error":"#N/A"}},{"$f":"VLOOKUP(J30,'Tableau Tournante'!$A$6:$B$168,2)","v":{"$error":"#N/A"}},null,{"$f":"VLOOKUP(L30,'Tableau Tournante'!$A$6:$B$168,2)","v":{"$error":"#N/A"}},{"$f":"VLOOKUP(M30,'Tableau Tournante'!$A$6:$B$168,2)","v":{"$error":"#N/A"}},null,{"$f":"VLOOKUP(O30,'Tableau Tournante'!$A$6:$B$168,2)","v":{"$error":"#N/A"}},{"$f":"VLOOKUP(P30,'Tableau Tournante'!$A$6:$B$168,2)","v":{"$error":"#N/A"}},null,{"$f":"VLOOKUP(R30,'Tableau Tournante'!$A$6:$B$168,2)","v":{"$error":"#N/A"}},{"$f":"VLOOKUP(S30,'Tableau Tournante'!$A$6:$B$168,2)","v":{"$error":"#N/A"}},null,{"$f":"VLOOKUP(U30,'Tableau Tournante'!$A$6:$B$168,2)","v":{"$error":"#N/A"}},{"$f":"VLOOKUP(V30,'Tableau Tournante'!$A$6:$B$168,2)","v":{"$error":"#N/A"}},null,{"$f":"VLOOKUP(X30,'Tableau Tournante'!$A$6:$B$168,2)","v":{"$error":"#N/A"}},{"$f":"VLOOKUP(Y30,'Tableau Tournante'!$A$6:$B$168,2)","v":{"$error":"#N/A"}}]
[null,null,{"$f":"'Tableau Tournante'!N18","v":0},{"$f":"'Tableau Tournante'!O18","v":0},null,{"$f":"'Tableau Tournante'!P18","v":0},{"$f":"'Tableau Tournante'!Q18","v":0},null,{"$f":"'Tableau Tournante'!R18","v":0},{"$f":"'Tableau Tournante'!S18","v":0},null,{"$f":"'Tableau Tournante'!T18","v":0},{"$f":"'Tableau Tournante'!U18","v":0},null,{"$f":"'Tableau Tournante'!V18","v":0},{"$f":"'Tableau Tournante'!W18","v":0},null,{"$f":"'Tableau Tournante'!X18","v":0},{"$f":"'Tableau Tournante'!Y18","v":0},null,{"$f":"'Tableau Tournante'!Z18","v":0},{"$f":"'Tableau Tournante'!AA18","v":0},null,{"$f":"'Tableau Tournante'!AB18","v":0},{"$f":"'Tableau Tournante'!AC18","v":0}]
[null,null,{"$f":"VLOOKUP(C32,'Tableau Tournante'!$A$6:$B$168,2)","v":{"$error":"#N/A"}},{"$f":"VLOOKUP(D32,'Tableau Tournante'!$A$6:$B$168,2)","v":{"$error":"#N/A"}},null,{"$f":"VLOOKUP(F32,'Tableau Tournante'!$A$6:$B$168,2)","v":{"$error":"#N/A"}},{"$f":"VLOOKUP(G32,'Tableau Tournante'!$A$6:$B$168,2)","v":{"$error":"#N/A"}},null,{"$f":"VLOOKUP(I32,'Tableau Tournante'!$A$6:$B$168,2)","v":{"$error":"#N/A"}},{"$f":"VLOOKUP(J32,'Tableau Tournante'!$A$6:$B$168,2)","v":{"$error":"#N/A"}},null,{"$f":"VLOOKUP(L32,'Tableau Tournante'!$A$6:$B$168,2)","v":{"$error":"#N/A"}},{"$f":"VLOOKUP(M32,'Tableau Tournante'!$A$6:$B$168,2)","v":{"$error":"#N/A"}},null,{"$f":"VLOOKUP(O32,'Tableau Tournante'!$A$6:$B$168,2)","v":{"$error":"#N/A"}},{"$f":"VLOOKUP(P32,'Tableau Tournante'!$A$6:$B$168,2)","v":{"$error":"#N/A"}},null,{"$f":"VLOOKUP(R32,'Tableau Tournante'!$A$6:$B$168,2)","v":{"$error":"#N/A"}},{"$f":"VLOOKUP(S32,'Tableau Tournante'!$A$6:$B$168,2)","v":{"$error":"#N/A"}},null,{"$f":"VLOOKUP(U32,'Tableau Tournante'!$A$6:$B$168,2)","v":{"$error":"#N/A"}},{"$f":"VLOOKUP(V32,'Tableau Tournante'!$A$6:$B$168,2)","v":{"$error":"#N/A"}},null,{"$f":"VLOOKUP(X32,'Tableau Tournante'!$A$6:$B$168,2)","v":{"$error":"#N/A"}},{"$f":"VLOOKUP(Y32,'Tableau Tournante'!$A$6:$B$168,2)","v":{"$error":"#N/A"}}]
[null,null,{"$f":"'Tableau Tournante'!N19","v":0},{"$f":"'Tableau Tournante'!O19","v":0},null,{"$f":"'Tableau Tournante'!P19","v":0},{"$f":"'Tableau Tournante'!Q19","v":0},null,{"$f":"'Tableau Tournante'!R19","v":0},{"$f":"'Tableau Tournante'!S19","v":0},null,{"$f":"'Tableau Tournante'!T19","v":0},{"$f":"'Tableau Tournante'!U19","v":0},null,{"$f":"'Tableau Tournante'!V19","v":0},{"$f":"'Tableau Tournante'!W19","v":0},null,{"$f":"'Tableau Tournante'!X19","v":0},{"$f":"'Tableau Tournante'!Y19","v":0},null,{"$f":"'Tableau Tournante'!Z19","v":0},{"$f":"'Tableau Tournante'!AA19","v":0},null,{"$f":"'Tableau Tournante'!AB19","v":0},{"$f":"'Tableau Tournante'!AC19","v":0}]
[null,null,{"$f":"VLOOKUP(C34,'Tableau Tournante'!$A$6:$B$168,2)","v":{"$error":"#N/A"}},{"$f":"VLOOKUP(D34,'Tableau Tournante'!$A$6:$B$168,2)","v":{"$error":"#N/A"}},null,{"$f":"VLOOKUP(F34,'Tableau Tournante'!$A$6:$B$168,2)","v":{"$error":"#N/A"}},{"$f":"VLOOKUP(G34,'Tableau Tournante'!$A$6:$B$168,2)","v":{"$error":"#N/A"}},null,{"$f":"VLOOKUP(I34,'Tableau Tournante'!$A$6:$B$168,2)","v":{"$error":"#N/A"}},{"$f":"VLOOKUP(J34,'Tableau Tournante'!$A$6:$B$168,2)","v":{"$error":"#N/A"}},null,{"$f":"VLOOKUP(L34,'Tableau Tournante'!$A$6:$B$168,2)","v":{"$error":"#N/A"}},{"$f":"VLOOKUP(M34,'Tableau Tournante'!$A$6:$B$168,2)","v":{"$error":"#N/A"}},null,{"$f":"VLOOKUP(O34,'Tableau Tournante'!$A$6:$B$168,2)","v":{"$error":"#N/A"}},{"$f":"VLOOKUP(P34,'Tableau Tournante'!$A$6:$B$168,2)","v":{"$error":"#N/A"}},null,{"$f":"VLOOKUP(R34,'Tableau Tournante'!$A$6:$B$168,2)","v":{"$error":"#N/A"}},{"$f":"VLOOKUP(S34,'Tableau Tournante'!$A$6:$B$168,2)","v":{"$error":"#N/A"}},null,{"$f":"VLOOKUP(U34,'Tableau Tournante'!$A$6:$B$168,2)","v":{"$error":"#N/A"}},{"$f":"VLOOKUP(V34,'Tableau Tournante'!$A$6:$B$168,2)","v":{"$error":"#N/A"}},null,{"$f":"VLOOKUP(X34,'Tableau Tournante'!$A$6:$B$168,2)","v":{"$error":"#N/A"}},{"$f":"VLOOKUP(Y34,'Tableau Tournante'!$A$6:$B$168,2)","v":{"$error":"#N/A"}}]
[null,null,{"$f":"'Tableau Tournante'!N20","v":0},{"$f":"'Tableau Tournante'!O20","v":0},null,{"$f":"'Tableau Tournante'!P20","v":0},{"$f":"'Tableau Tournante'!Q20","v":0},null,{"$f":"'Tableau Tournante'!R20","v":0},{"$f":"'Tableau Tournante'!S20","v":0},null,{"$f":"'Tableau Tournante'!T20","v":0},{"$f":"'Tableau Tournante'!U20","v":0},null,{"$f":"'Tableau Tournante'!V20","v":0},{"$f":"'Tableau Tournante'!W20","v":0},null,{"$f":"'Tableau Tournante'!X20","v":0},{"$f":"'Tableau Tournante'!Y20","v":0},null,{"$f":"'Tableau Tournante'!Z20","v":0},{"$f":"'Tableau Tournante'!AA20","v":0},null,{"$f":"'Tableau Tournante'!AB20","v":0},{"$f":"'Tableau Tournante'!AC20","v":0}]
[null,null,{"$f":"VLOOKUP(C36,'Tableau Tournante'!$A$6:$B$168,2)","v":{"$error":"#N/A"}},{"$f":"VLOOKUP(D36,'Tableau Tournante'!$A$6:$B$168,2)","v":{"$error":"#N/A"}},null,{"$f":"VLOOKUP(F36,'Tableau Tournante'!$A$6:$B$168,2)","v":{"$error":"#N/A"}},{"$f":"VLOOKUP(G36,'Tableau Tournante'!$A$6:$B$168,2)","v":{"$error":"#N/A"}},null,{"$f":"VLOOKUP(I36,'Tableau Tournante'!$A$6:$B$168,2)","v":{"$error":"#N/A"}},{"$f":"VLOOKUP(J36,'Tableau Tournante'!$A$6:$B$168,2)","v":{"$error":"#N/A"}},null,{"$f":"VLOOKUP(L36,'Tableau Tournante'!$A$6:$B$168,2)","v":{"$error":"#N/A"}},{"$f":"VLOOKUP(M36,'Tableau Tournante'!$A$6:$B$168,2)","v":{"$error":"#N/A"}},null,{"$f":"VLOOKUP(O36,'Tableau Tournante'!$A$6:$B$168,2)","v":{"$error":"#N/A"}},{"$f":"VLOOKUP(P36,'Tableau Tournante'!$A$6:$B$168,2)","v":{"$error":"#N/A"}},null,{"$f":"VLOOKUP(R36,'Tableau Tournante'!$A$6:$B$168,2)","v":{"$error":"#N/A"}},{"$f":"VLOOKUP(S36,'Tableau Tournante'!$A$6:$B$168,2)","v":{"$error":"#N/A"}},null,{"$f":"VLOOKUP(U36,'Tableau Tournante'!$A$6:$B$168,2)","v":{"$error":"#N/A"}},{"$f":"VLOOKUP(V36,'Tableau Tournante'!$A$6:$B$168,2)","v":{"$error":"#N/A"}},null,{"$f":"VLOOKUP(X36,'Tableau Tournante'!$A$6:$B$168,2)","v":{"$error":"#N/A"}},{"$f":"VLOOKUP(Y36,'Tableau Tournante'!$A$6:$B$168,2)","v":{"$error":"#N/A"}}]
[null,null,{"$f":"'Tableau Tournante'!N21","v":0},{"$f":"'Tableau Tournante'!O21","v":0},null,{"$f":"'Tableau Tournante'!P21","v":0},{"$f":"'Tableau Tournante'!Q21","v":0},null,{"$f":"'Tableau Tournante'!R21","v":0},{"$f":"'Tableau Tournante'!S21","v":0},null,{"$f":"'Tableau Tournante'!T21","v":0},{"$f":"'Tableau Tournante'!U21","v":0},null,{"$f":"'Tableau Tournante'!V21","v":0},{"$f":"'Tableau Tournante'!W21","v":0},null,{"$f":"'Tableau Tournante'!X21","v":0},{"$f":"'Tableau Tournante'!Y21","v":0},null,{"$f":"'Tableau Tournante'!Z21","v":0},{"$f":"'Tableau Tournante'!AA21","v":0},null,{"$f":"'Tableau Tournante'!AB21","v":0},{"$f":"'Tableau Tournante'!AC21","v":0}]
[null,null,{"$f":"VLOOKUP(C38,'Tableau Tournante'!$A$6:$B$168,2)","v":{"$error":"#N/A"}},{"$f":"VLOOKUP(D38,'Tableau Tournante'!$A$6:$B$168,2)","v":{"$error":"#N/A"}},null,{"$f":"VLOOKUP(F38,'Tableau Tournante'!$A$6:$B$168,2)","v":{"$error":"#N/A"}},{"$f":"VLOOKUP(G38,'Tableau Tournante'!$A$6:$B$168,2)","v":{"$error":"#N/A"}},null,{"$f":"VLOOKUP(I38,'Tableau Tournante'!$A$6:$B$168,2)","v":{"$error":"#N/A"}},{"$f":"VLOOKUP(J38,'Tableau Tournante'!$A$6:$B$168,2)","v":{"$error":"#N/A"}},null,{"$f":"VLOOKUP(L38,'Tableau Tournante'!$A$6:$B$168,2)","v":{"$error":"#N/A"}},{"$f":"VLOOKUP(M38,'Tableau Tournante'!$A$6:$B$168,2)","v":{"$error":"#N/A"}},null,{"$f":"VLOOKUP(O38,'Tableau Tournante'!$A$6:$B$168,2)","v":{"$error":"#N/A"}},{"$f":"VLOOKUP(P38,'Tableau Tournante'!$A$6:$B$168,2)","v":{"$error":"#N/A"}},null,{"$f":"VLOOKUP(R38,'Tableau Tournante'!$A$6:$B$168,2)","v":{"$error":"#N/A"}},{"$f":"VLOOKUP(S38,'Tableau Tournante'!$A$6:$B$168,2)","v":{"$error":"#N/A"}},null,{"$f":"VLOOKUP(U38,'Tableau Tournante'!$A$6:$B$168,2)","v":{"$error":"#N/A"}},{"$f":"VLOOKUP(V38,'Tableau Tournante'!$A$6:$B$168,2)","v":{"$error":"#N/A"}},null,{"$f":"VLOOKUP(X38,'Tableau Tournante'!$A$6:$B$168,2)","v":{"$error":"#N/A"}},{"$f":"VLOOKUP(Y38,'Tableau Tournante'!$A$6:$B$168,2)","v":{"$error":"#N/A"}}]
[null,null,{"$f":"'Tableau Tournante'!N22","v":0},{"$f":"'Tableau Tournante'!O22","v":0},null,{"$f":"'Tableau Tournante'!P22","v":0},{"$f":"'Tableau Tournante'!Q22","v":0},null,{"$f":"'Tableau Tournante'!R22","v":0},{"$f":"'Tableau Tournante'!S22","v":0},null,{"$f":"'Tableau Tournante'!T22","v":0},{"$f":"'Tableau Tournante'!U22","v":0},null,{"$f":"'Tableau Tournante'!V22","v":0},{"$f":"'Tableau Tournante'!W22","v":0},null,{"$f":"'Tableau Tournante'!X22","v":0},{"$f":"'Tableau Tournante'!Y22","v":0},null,{"$f":"'Tableau Tournante'!Z22","v":0},{"$f":"'Tableau Tournante'!AA22","v":0},null,{"$f":"'Tableau Tournante'!AB22","v":0},{"$f":"'Tableau Tournante'!AC22","v":0}]
[null,null,{"$f":"VLOOKUP(C40,'Tableau Tournante'!$A$6:$B$168,2)","v":{"$error":"#N/A"}},{"$f":"VLOOKUP(D40,'Tableau Tournante'!$A$6:$B$168,2)","v":{"$error":"#N/A"}},null,{"$f":"VLOOKUP(F40,'Tableau Tournante'!$A$6:$B$168,2)","v":{"$error":"#N/A"}},{"$f":"VLOOKUP(G40,'Tableau Tournante'!$A$6:$B$168,2)","v":{"$error":"#N/A"}},null,{"$f":"VLOOKUP(I40,'Tableau Tournante'!$A$6:$B$168,2)","v":{"$error":"#N/A"}},{"$f":"VLOOKUP(J40,'Tableau Tournante'!$A$6:$B$168,2)","v":{"$error":"#N/A"}},null,{"$f":"VLOOKUP(L40,'Tableau Tournante'!$A$6:$B$168,2)","v":{"$error":"#N/A"}},{"$f":"VLOOKUP(M40,'Tableau Tournante'!$A$6:$B$168,2)","v":{"$error":"#N/A"}},null,{"$f":"VLOOKUP(O40,'Tableau Tournante'!$A$6:$B$168,2)","v":{"$error":"#N/A"}},{"$f":"VLOOKUP(P40,'Tableau Tournante'!$A$6:$B$168,2)","v":{"$error":"#N/A"}},null,{"$f":"VLOOKUP(R40,'Tableau Tournante'!$A$6:$B$168,2)","v":{"$error":"#N/A"}},{"$f":"VLOOKUP(S40,'Tableau Tournante'!$A$6:$B$168,2)","v":{"$error":"#N/A"}},null,{"$f":"VLOOKUP(U40,'Tableau Tournante'!$A$6:$B$168,2)","v":{"$error":"#N/A"}},{"$f":"VLOOKUP(V40,'Tableau Tournante'!$A$6:$B$168,2)","v":{"$error":"#N/A"}},null,{"$f":"VLOOKUP(X40,'Tableau Tournante'!$A$6:$B$168,2)","v":{"$error":"#N/A"}},{"$f":"VLOOKUP(Y40,'Tableau Tournante'!$A$6:$B$168,2)","v":{"$error":"#N/A"}}]
[null,null,{"$f":"'Tableau Tournante'!N23","v":0},{"$f":"'Tableau Tournante'!O23","v":0},null,{"$f":"'Tableau Tournante'!P23","v":0},{"$f":"'Tableau Tournante'!Q23","v":0},null,{"$f":"'Tableau Tournante'!R23","v":0},{"$f":"'Tableau Tournante'!S23","v":0},null,{"$f":"'Tableau Tournante'!T23","v":0},{"$f":"'Tableau Tournante'!U23","v":0},null,{"$f":"'Tableau Tournante'!V23","v":0},{"$f":"'Tableau Tournante'!W23","v":0},null,{"$f":"'Tableau Tournante'!X23","v":0},{"$f":"'Tableau Tournante'!Y23","v":0},null,{"$f":"'Tableau Tournante'!Z23","v":0},{"$f":"'Tableau Tournante'!AA23","v":0},null,{"$f":"'Tableau Tournante'!AB23","v":0},{"$f":"'Tableau Tournante'!AC23","v":0}]
[null,null,{"$f":"VLOOKUP(C42,'Tableau Tournante'!$A$6:$B$168,2)","v":{"$error":"#N/A"}},{"$f":"VLOOKUP(D42,'Tableau Tournante'!$A$6:$B$168,2)","v":{"$error":"#N/A"}},null,{"$f":"VLOOKUP(F42,'Tableau Tournante'!$A$6:$B$168,2)","v":{"$error":"#N/A"}},{"$f":"VLOOKUP(G42,'Tableau Tournante'!$A$6:$B$168,2)","v":{"$error":"#N/A"}},null,{"$f":"VLOOKUP(I42,'Tableau Tournante'!$A$6:$B$168,2)","v":{"$error":"#N/A"}},{"$f":"VLOOKUP(J42,'Tableau Tournante'!$A$6:$B$168,2)","v":{"$error":"#N/A"}},null,{"$f":"VLOOKUP(L42,'Tableau Tournante'!$A$6:$B$168,2)","v":{"$error":"#N/A"}},{"$f":"VLOOKUP(M42,'Tableau Tournante'!$A$6:$B$168,2)","v":{"$error":"#N/A"}},null,{"$f":"VLOOKUP(O42,'Tableau Tournante'!$A$6:$B$168,2)","v":{"$error":"#N/A"}},{"$f":"VLOOKUP(P42,'Tableau Tournante'!$A$6:$B$168,2)","v":{"$error":"#N/A"}},null,{"$f":"VLOOKUP(R42,'Tableau Tournante'!$A$6:$B$168,2)","v":{"$error":"#N/A"}},{"$f":"VLOOKUP(S42,'Tableau Tournante'!$A$6:$B$168,2)","v":{"$error":"#N/A"}},null,{"$f":"VLOOKUP(U42,'Tableau Tournante'!$A$6:$B$168,2)","v":{"$error":"#N/A"}},{"$f":"VLOOKUP(V42,'Tableau Tournante'!$A$6:$B$168,2)","v":{"$error":"#N/A"}},null,{"$f":"VLOOKUP(X42,'Tableau Tournante'!$A$6:$B$168,2)","v":{"$error":"#N/A"}},{"$f":"VLOOKUP(Y42,'Tableau Tournante'!$A$6:$B$168,2)","v":{"$error":"#N/A"}}]
[null,null,{"$f":"'Tableau Tournante'!N24","v":0},{"$f":"'Tableau Tournante'!O24","v":0},null,{"$f":"'Tableau Tournante'!P24","v":0},{"$f":"'Tableau Tournante'!Q24","v":0},null,{"$f":"'Tableau Tournante'!R24","v":0},{"$f":"'Tableau Tournante'!S24","v":0},null,{"$f":"'Tableau Tournante'!T24","v":0},{"$f":"'Tableau Tournante'!U24","v":0},null,{"$f":"'Tableau Tournante'!V24","v":0},{"$f":"'Tableau Tournante'!W24","v":0},null,{"$f":"'Tableau Tournante'!X24","v":0},{"$f":"'Tableau Tournante'!Y24","v":0},null,{"$f":"'Tableau Tournante'!Z24","v":0},{"$f":"'Tableau Tournante'!AA24","v":0},null,{"$f":"'Tableau Tournante'!AB24","v":0},{"$f":"'Tableau Tournante'!AC24","v":0}]
[null,null,{"$f":"VLOOKUP(C44,'Tableau Tournante'!$A$6:$B$168,2)","v":{"$error":"#N/A"}},{"$f":"VLOOKUP(D44,'Tableau Tournante'!$A$6:$B$168,2)","v":{"$error":"#N/A"}},null,{"$f":"VLOOKUP(F44,'Tableau Tournante'!$A$6:$B$168,2)","v":{"$error":"#N/A"}},{"$f":"VLOOKUP(G44,'Tableau Tournante'!$A$6:$B$168,2)","v":{"$error":"#N/A"}},null,{"$f":"VLOOKUP(I44,'Tableau Tournante'!$A$6:$B$168,2)","v":{"$error":"#N/A"}},{"$f":"VLOOKUP(J44,'Tableau Tournante'!$A$6:$B$168,2)","v":{"$error":"#N/A"}},null,{"$f":"VLOOKUP(L44,'Tableau Tournante'!$A$6:$B$168,2)","v":{"$error":"#N/A"}},{"$f":"VLOOKUP(M44,'Tableau Tournante'!$A$6:$B$168,2)","v":{"$error":"#N/A"}},null,{"$f":"VLOOKUP(O44,'Tableau Tournante'!$A$6:$B$168,2)","v":{"$error":"#N/A"}},{"$f":"VLOOKUP(P44,'Tableau Tournante'!$A$6:$B$168,2)","v":{"$error":"#N/A"}},null,{"$f":"VLOOKUP(R44,'Tableau Tournante'!$A$6:$B$168,2)","v":{"$error":"#N/A"}},{"$f":"VLOOKUP(S44,'Tableau Tournante'!$A$6:$B$168,2)","v":{"$error":"#N/A"}},null,{"$f":"VLOOKUP(U44,'Tableau Tournante'!$A$6:$B$168,2)","v":{"$error":"#N/A"}},{"$f":"VLOOKUP(V44,'Tableau Tournante'!$A$6:$B$168,2)","v":{"$error":"#N/A"}},null,{"$f":"VLOOKUP(X44,'Tableau Tournante'!$A$6:$B$168,2)","v":{"$error":"#N/A"}},{"$f":"VLOOKUP(Y44,'Tableau Tournante'!$A$6:$B$168,2)","v":{"$error":"#N/A"}}]
[null,null,{"$f":"'Tableau Tournante'!N25","v":0},{"$f":"'Tableau Tournante'!O25","v":0},null,{"$f":"'Tableau Tournante'!P25","v":0},{"$f":"'Tableau Tournante'!Q25","v":0},null,{"$f":"'Tableau Tournante'!R25","v":0},{"$f":"'Tableau Tournante'!S25","v":0},null,{"$f":"'Tableau Tournante'!T25","v":0},{"$f":"'Tableau Tournante'!U25","v":0},null,{"$f":"'Tableau Tournante'!V25","v":0},{"$f":"'Tableau Tournante'!W25","v":0},null,{"$f":"'Tableau Tournante'!X25","v":0},{"$f":"'Tableau Tournante'!Y25","v":0},null,{"$f":"'Tableau Tournante'!Z25","v":0},{"$f":"'Tableau Tournante'!AA25","v":0},null,{"$f":"'Tableau Tournante'!AB25","v":0},{"$f":"'Tableau Tournante'!AC25","v":0}]
[null,null,{"$f":"VLOOKUP(C46,'Tableau Tournante'!$A$6:$B$168,2)","v":{"$error":"#N/A"}},{"$f":"VLOOKUP(D46,'Tableau Tournante'!$A$6:$B$168,2)","v":{"$error":"#N/A"}},null,{"$f":"VLOOKUP(F46,'Tableau Tournante'!$A$6:$B$168,2)","v":{"$error":"#N/A"}},{"$f":"VLOOKUP(G46,'Tableau Tournante'!$A$6:$B$168,2)","v":{"$error":"#N/A"}},null,{"$f":"VLOOKUP(I46,'Tableau Tournante'!$A$6:$B$168,2)","v":{"$error":"#N/A"}},{"$f":"VLOOKUP(J46,'Tableau Tournante'!$A$6:$B$168,2)","v":{"$error":"#N/A"}},null,{"$f":"VLOOKUP(L46,'Tableau Tournante'!$A$6:$B$168,2)","v":{"$error":"#N/A"}},{"$f":"VLOOKUP(M46,'Tableau Tournante'!$A$6:$B$168,2)","v":{"$error":"#N/A"}},null,{"$f":"VLOOKUP(O46,'Tableau Tournante'!$A$6:$B$168,2)","v":{"$error":"#N/A"}},{"$f":"VLOOKUP(P46,'Tableau Tournante'!$A$6:$B$168,2)","v":{"$error":"#N/A"}},null,{"$f":"VLOOKUP(R46,'Tableau Tournante'!$A$6:$B$168,2)","v":{"$error":"#N/A"}},{"$f":"VLOOKUP(S46,'Tableau Tournante'!$A$6:$B$168,2)","v":{"$error":"#N/A"}},null,{"$f":"VLOOKUP(U46,'Tableau Tournante'!$A$6:$B$168,2)","v":{"$error":"#N/A"}},{"$f":"VLOOKUP(V46,'Tableau Tournante'!$A$6:$B$168,2)","v":{"$error":"#N/A"}},null,{"$f":"VLOOKUP(X46,'Tableau Tournante'!$A$6:$B$168,2)","v":{"$error":"#N/A"}},{"$f":"VLOOKUP(Y46,'Tableau Tournante'!$A$6:$B$168,2)","v":{"$error":"#N/A"}}]
[null,null,{"$f":"'Tableau Tournante'!N26","v":0},{"$f":"'Tableau Tournante'!O26","v":0},null,{"$f":"'Tableau Tournante'!P26","v":0},{"$f":"'Tableau Tournante'!Q26","v":0},null,{"$f":"'Tableau Tournante'!R26","v":0},{"$f":"'Tableau Tournante'!S26","v":0},null,{"$f":"'Tableau Tournante'!T26","v":0},{"$f":"'Tableau Tournante'!U26","v":0},null,{"$f":"'Tableau Tournante'!V26","v":0},{"$f":"'Tableau Tournante'!W26","v":0},null,{"$f":"'Tableau Tournante'!X26","v":0},{"$f":"'Tableau Tournante'!Y26","v":0},null,{"$f":"'Tableau Tournante'!Z26","v":0},{"$f":"'Tableau Tournante'!AA26","v":0},null,{"$f":"'Tableau Tournante'!AB26","v":0},{"$f":"'Tableau Tournante'!AC26","v":0}]
[null,null,{"$f":"VLOOKUP(C48,'Tableau Tournante'!$A$6:$B$168,2)","v":{"$error":"#N/A"}},{"$f":"VLOOKUP(D48,'Tableau Tournante'!$A$6:$B$168,2)","v":{"$error":"#N/A"}},null,{"$f":"VLOOKUP(F48,'Tableau Tournante'!$A$6:$B$168,2)","v":{"$error":"#N/A"}},{"$f":"VLOOKUP(G48,'Tableau Tournante'!$A$6:$B$168,2)","v":{"$error":"#N/A"}},null,{"$f":"VLOOKUP(I48,'Tableau Tournante'!$A$6:$B$168,2)","v":{"$error":"#N/A"}},{"$f":"VLOOKUP(J48,'Tableau Tournante'!$A$6:$B$168,2)","v":{"$error":"#N/A"}},null,{"$f":"VLOOKUP(L48,'Tableau Tournante'!$A$6:$B$168,2)","v":{"$error":"#N/A"}},{"$f":"VLOOKUP(M48,'Tableau Tournante'!$A$6:$B$168,2)","v":{"$error":"#N/A"}},null,{"$f":"VLOOKUP(O48,'Tableau Tournante'!$A$6:$B$168,2)","v":{"$error":"#N/A"}},{"$f":"VLOOKUP(P48,'Tableau Tournante'!$A$6:$B$168,2)","v":{"$error":"#N/A"}},null,{"$f":"VLOOKUP(R48,'Tableau Tournante'!$A$6:$B$168,2)","v":{"$error":"#N/A"}},{"$f":"VLOOKUP(S48,'Tableau Tournante'!$A$6:$B$168,2)","v":{"$error":"#N/A"}},null,{"$f":"VLOOKUP(U48,'Tableau Tournante'!$A$6:$B$168,2)","v":{"$error":"#N/A"}},{"$f":"VLOOKUP(V48,'Tableau Tournante'!$A$6:$B$168,2)","v":{"$error":"#N/A"}},null,{"$f":"VLOOKUP(X48,'Tableau Tournante'!$A$6:$B$168,2)","v":{"$error":"#N/A"}},{"$f":"VLOOKUP(Y48,'Tableau Tournante'!$A$6:$B$168,2)","v":{"$error":"#N/A"}}]
[null,null,{"$f":"'Tableau Tournante'!N27","v":0},{"$f":"'Tableau Tournante'!O27","v":0},null,{"$f":"'Tableau Tournante'!P27","v":0},{"$f":"'Tableau Tournante'!Q27","v":0},null,{"$f":"'Tableau Tournante'!R27","v":0},{"$f":"'Tableau Tournante'!S27","v":0},null,{"$f":"'Tableau Tournante'!T27","v":0},{"$f":"'Tableau Tournante'!U27","v":0},null,{"$f":"'Tableau Tournante'!V27","v":0},{"$f":"'Tableau Tournante'!W27","v":0},null,{"$f":"'Tableau Tournante'!X27","v":0},{"$f":"'Tableau Tournante'!Y27","v":0},null,{"$f":"'Tableau Tournante'!Z27","v":0},{"$f":"'Tableau Tournante'!AA27","v":0},null,{"$f":"'Tableau Tournante'!AB27","v":0},{"$f":"'Tableau Tournante'!AC27","v":0}]
[null,null,{"$f":"VLOOKUP(C50,'Tableau Tournante'!$A$6:$B$168,2)","v":{"$error":"#N/A"}},{"$f":"VLOOKUP(D50,'Tableau Tournante'!$A$6:$B$168,2)","v":{"$error":"#N/A"}},null,{"$f":"VLOOKUP(F50,'Tableau Tournante'!$A$6:$B$168,2)","v":{"$error":"#N/A"}},{"$f":"VLOOKUP(G50,'Tableau Tournante'!$A$6:$B$168,2)","v":{"$error":"#N/A"}},null,{"$f":"VLOOKUP(I50,'Tableau Tournante'!$A$6:$B$168,2)","v":{"$error":"#N/A"}},{"$f":"VLOOKUP(J50,'Tableau Tournante'!$A$6:$B$168,2)","v":{"$error":"#N/A"}},null,{"$f":"VLOOKUP(L50,'Tableau Tournante'!$A$6:$B$168,2)","v":{"$error":"#N/A"}},{"$f":"VLOOKUP(M50,'Tableau Tournante'!$A$6:$B$168,2)","v":{"$error":"#N/A"}},null,{"$f":"VLOOKUP(O50,'Tableau Tournante'!$A$6:$B$168,2)","v":{"$error":"#N/A"}},{"$f":"VLOOKUP(P50,'Tableau Tournante'!$A$6:$B$168,2)","v":{"$error":"#N/A"}},null,{"$f":"VLOOKUP(R50,'Tableau Tournante'!$A$6:$B$168,2)","v":{"$error":"#N/A"}},{"$f":"VLOOKUP(S50,'Tableau Tournante'!$A$6:$B$168,2)","v":{"$error":"#N/A"}},null,{"$f":"VLOOKUP(U50,'Tableau Tournante'!$A$6:$B$168,2)","v":{"$error":"#N/A"}},{"$f":"VLOOKUP(V50,'Tableau Tournante'!$A$6:$B$168,2)","v":{"$error":"#N/A"}},null,{"$f":"VLOOKUP(X50,'Tableau Tournante'!$A$6:$B$168,2)","v":{"$error":"#N/A"}},{"$f":"VLOOKUP(Y50,'Tableau Tournante'!$A$6:$B$168,2)","v":{"$error":"#N/A"}}]
[null,null,{"$f":"'Tableau Tournante'!N28","v":0},{"$f":"'Tableau Tournante'!O28","v":0},null,{"$f":"'Tableau Tournante'!P28","v":0},{"$f":"'Tableau Tournante'!Q28","v":0},null,{"$f":"'Tableau Tournante'!R28","v":0},{"$f":"'Tableau Tournante'!S28","v":0},null,{"$f":"'Tableau Tournante'!T28","v":0},{"$f":"'Tableau Tournante'!U28","v":0},null,{"$f":"'Tableau Tournante'!V28","v":0},{"$f":"'Tableau Tournante'!W28","v":0},null,{"$f":"'Tableau Tournante'!X28","v":0},{"$f":"'Tableau Tournante'!Y28","v":0},null,{"$f":"'Tableau Tournante'!Z28","v":0},{"$f":"'Tableau Tournante'!AA28","v":0},null,{"$f":"'Tableau Tournante'!AB28","v":0},{"$f":"'Tableau Tournante'!AC28","v":0}]
[null,null,{"$f":"VLOOKUP(C52,'Tableau Tournante'!$A$6:$B$168,2)","v":{"$error":"#N/A"}},{"$f":"VLOOKUP(D52,'Tableau Tournante'!$A$6:$B$168,2)","v":{"$error":"#N/A"}},null,{"$f":"VLOOKUP(F52,'Tableau Tournante'!$A$6:$B$168,2)","v":{"$error":"#N/A"}},{"$f":"VLOOKUP(G52,'Tableau Tournante'!$A$6:$B$168,2)","v":{"$error":"#N/A"}},null,{"$f":"VLOOKUP(I52,'Tableau Tournante'!$A$6:$B$168,2)","v":{"$error":"#N/A"}},{"$f":"VLOOKUP(J52,'Tableau Tournante'!$A$6:$B$168,2)","v":{"$error":"#N/A"}},null,{"$f":"VLOOKUP(L52,'Tableau Tournante'!$A$6:$B$168,2)","v":{"$error":"#N/A"}},{"$f":"VLOOKUP(M52,'Tableau Tournante'!$A$6:$B$168,2)","v":{"$error":"#N/A"}},null,{"$f":"VLOOKUP(O52,'Tableau Tournante'!$A$6:$B$168,2)","v":{"$error":"#N/A"}},{"$f":"VLOOKUP(P52,'Tableau Tournante'!$A$6:$B$168,2)","v":{"$error":"#N/A"}},null,{"$f":"VLOOKUP(R52,'Tableau Tournante'!$A$6:$B$168,2)","v":{"$error":"#N/A"}},{"$f":"VLOOKUP(S52,'Tableau Tournante'!$A$6:$B$168,2)","v":{"$error":"#N/A"}},null,{"$f":"VLOOKUP(U52,'Tableau Tournante'!$A$6:$B$168,2)","v":{"$error":"#N/A"}},{"$f":"VLOOKUP(V52,'Tableau Tournante'!$A$6:$B$168,2)","v":{"$error":"#N/A"}},null,{"$f":"VLOOKUP(X52,'Tableau Tournante'!$A$6:$B$168,2)","v":{"$error":"#N/A"}},{"$f":"VLOOKUP(Y52,'Tableau Tournante'!$A$6:$B$168,2)","v":{"$error":"#N/A"}}]
[null,null,{"$f":"'Tableau Tournante'!N29","v":0},{"$f":"'Tableau Tournante'!O29","v":0},null,{"$f":"'Tableau Tournante'!P29","v":0},{"$f":"'Tableau Tournante'!Q29","v":0},null,{"$f":"'Tableau Tournante'!R29","v":0},{"$f":"'Tableau Tournante'!S29","v":0},null,{"$f":"'Tableau Tournante'!T29","v":0},{"$f":"'Tableau Tournante'!U29","v":0},null,{"$f":"'Tableau Tournante'!V29","v":0},{"$f":"'Tableau Tournante'!W29","v":0},null,{"$f":"'Tableau Tournante'!X29","v":0},{"$f":"'Tableau Tournante'!Y29","v":0},null,{"$f":"'Tableau Tournante'!Z29","v":0},{"$f":"'Tableau Tournante'!AA29","v":0},null,{"$f":"'Tableau Tournante'!AB29","v":0},{"$f":"'Tableau Tournante'!AC29","v":0}]
[null,null,{"$f":"VLOOKUP(C54,'Tableau Tournante'!$A$6:$B$168,2)","v":{"$error":"#N/A"}},{"$f":"VLOOKUP(D54,'Tableau Tournante'!$A$6:$B$168,2)","v":{"$error":"#N/A"}},null,{"$f":"VLOOKUP(F54,'Tableau Tournante'!$A$6:$B$168,2)","v":{"$error":"#N/A"}},{"$f":"VLOOKUP(G54,'Tableau Tournante'!$A$6:$B$168,2)","v":{"$error":"#N/A"}},null,{"$f":"VLOOKUP(I54,'Tableau Tournante'!$A$6:$B$168,2)","v":{"$error":"#N/A"}},{"$f":"VLOOKUP(J54,'Tableau Tournante'!$A$6:$B$168,2)","v":{"$error":"#N/A"}},null,{"$f":"VLOOKUP(L54,'Tableau Tournante'!$A$6:$B$168,2)","v":{"$error":"#N/A"}},{"$f":"VLOOKUP(M54,'Tableau Tournante'!$A$6:$B$168,2)","v":{"$error":"#N/A"}},null,{"$f":"VLOOKUP(O54,'Tableau Tournante'!$A$6:$B$168,2)","v":{"$error":"#N/A"}},{"$f":"VLOOKUP(P54,'Tableau Tournante'!$A$6:$B$168,2)","v":{"$error":"#N/A"}},null,{"$f":"VLOOKUP(R54,'Tableau Tournante'!$A$6:$B$168,2)","v":{"$error":"#N/A"}},{"$f":"VLOOKUP(S54,'Tableau Tournante'!$A$6:$B$168,2)","v":{"$error":"#N/A"}},null,{"$f":"VLOOKUP(U54,'Tableau Tournante'!$A$6:$B$168,2)","v":{"$error":"#N/A"}},{"$f":"VLOOKUP(V54,'Tableau Tournante'!$A$6:$B$168,2)","v":{"$error":"#N/A"}},null,{"$f":"VLOOKUP(X54,'Tableau Tournante'!$A$6:$B$168,2)","v":{"$error":"#N/A"}},{"$f":"VLOOKUP(Y54,'Tableau Tournante'!$A$6:$B$168,2)","v":{"$error":"#N/A"}}]
[null,null,{"$f":"'Tableau Tournante'!N30","v":0},{"$f":"'Tableau Tournante'!O30","v":0},null,{"$f":"'Tableau Tournante'!P30","v":0},{"$f":"'Tableau Tournante'!Q30","v":0},null,{"$f":"'Tableau Tournante'!R30","v":0},{"$f":"'Tableau Tournante'!S30","v":0},null,{"$f":"'Tableau Tournante'!T30","v":0},{"$f":"'Tableau Tournante'!U30","v":0},null,{"$f":"'Tableau Tournante'!V30","v":0},{"$f":"'Tableau Tournante'!W30","v":0},null,{"$f":"'Tableau Tournante'!X30","v":0},{"$f":"'Tableau Tournante'!Y30","v":0},null,{"$f":"'Tableau Tournante'!Z30","v":0},{"$f":"'Tableau Tournante'!AA30","v":0},null,{"$f":"'Tableau Tournante'!AB30","v":0},{"$f":"'Tableau Tournante'!AC30","v":0}]
[null,null,{"$f":"VLOOKUP(C56,'Tableau Tournante'!$A$6:$B$168,2)","v":{"$error":"#N/A"}},{"$f":"VLOOKUP(D56,'Tableau Tournante'!$A$6:$B$168,2)","v":{"$error":"#N/A"}},null,{"$f":"VLOOKUP(F56,'Tableau Tournante'!$A$6:$B$168,2)","v":{"$error":"#N/A"}},{"$f":"VLOOKUP(G56,'Tableau Tournante'!$A$6:$B$168,2)","v":{"$error":"#N/A"}},null,{"$f":"VLOOKUP(I56,'Tableau Tournante'!$A$6:$B$168,2)","v":{"$error":"#N/A"}},{"$f":"VLOOKUP(J56,'Tableau Tournante'!$A$6:$B$168,2)","v":{"$error":"#N/A"}},null,{"$f":"VLOOKUP(L56,'Tableau Tournante'!$A$6:$B$168,2)","v":{"$error":"#N/A"}},{"$f":"VLOOKUP(M56,'Tableau Tournante'!$A$6:$B$168,2)","v":{"$error":"#N/A"}},null,{"$f":"VLOOKUP(O56,'Tableau Tournante'!$A$6:$B$168,2)","v":{"$error":"#N/A"}},{"$f":"VLOOKUP(P56,'Tableau Tournante'!$A$6:$B$168,2)","v":{"$error":"#N/A"}},null,{"$f":"VLOOKUP(R56,'Tableau Tournante'!$A$6:$B$168,2)","v":{"$error":"#N/A"}},{"$f":"VLOOKUP(S56,'Tableau Tournante'!$A$6:$B$168,2)","v":{"$error":"#N/A"}},null,{"$f":"VLOOKUP(U56,'Tableau Tournante'!$A$6:$B$168,2)","v":{"$error":"#N/A"}},{"$f":"VLOOKUP(V56,'Tableau Tournante'!$A$6:$B$168,2)","v":{"$error":"#N/A"}},null,{"$f":"VLOOKUP(X56,'Tableau Tournante'!$A$6:$B$168,2)","v":{"$error":"#N/A"}},{"$f":"VLOOKUP(Y56,'Tableau Tournante'!$A$6:$B$168,2)","v":{"$error":"#N/A"}}]
[null,null,{"$f":"'Tableau Tournante'!N31","v":0},{"$f":"'Tableau Tournante'!O31","v":0},null,{"$f":"'Tableau Tournante'!P31","v":0},{"$f":"'Tableau Tournante'!Q31","v":0},null,{"$f":"'Tableau Tournante'!R31","v":0},{"$f":"'Tableau Tournante'!S31","v":0},null,{"$f":"'Tableau Tournante'!T31","v":0},{"$f":"'Tableau Tournante'!U31","v":0},null,{"$f":"'Tableau Tournante'!V31","v":0},{"$f":"'Tableau Tournante'!W31","v":0},null,{"$f":"'Tableau Tournante'!X31","v":0},{"$f":"'Tableau Tournante'!Y31","v":0},null,{"$f":"'Tableau Tournante'!Z31","v":0},{"$f":"'Tableau Tournante'!AA31","v":0},null,{"$f":"'Tableau Tournante'!AB31","v":0},{"$f":"'Tableau Tournante'!AC31","v":0}]
[null,null,{"$f":"VLOOKUP(C58,'Tableau Tournante'!$A$6:$B$168,2)","v":{"$error":"#N/A"}},{"$f":"VLOOKUP(D58,'Tableau Tournante'!$A$6:$B$168,2)","v":{"$error":"#N/A"}},null,{"$f":"VLOOKUP(F58,'Tableau Tournante'!$A$6:$B$168,2)","v":{"$error":"#N/A"}},{"$f":"VLOOKUP(G58,'Tableau Tournante'!$A$6:$B$168,2)","v":{"$error":"#N/A"}},null,{"$f":"VLOOKUP(I58,'Tableau Tournante'!$A$6:$B$168,2)","v":{"$error":"#N/A"}},{"$f":"VLOOKUP(J58,'Tableau Tournante'!$A$6:$B$168,2)","v":{"$error":"#N/A"}},null,{"$f":"VLOOKUP(L58,'Tableau Tournante'!$A$6:$B$168,2)","v":{"$error":"#N/A"}},{"$f":"VLOOKUP(M58,'Tableau Tournante'!$A$6:$B$168,2)","v":{"$error":"#N/A"}},null,{"$f":"VLOOKUP(O58,'Tableau Tournante'!$A$6:$B$168,2)","v":{"$error":"#N/A"}},{"$f":"VLOOKUP(P58,'Tableau Tournante'!$A$6:$B$168,2)","v":{"$error":"#N/A"}},null,{"$f":"VLOOKUP(R58,'Tableau Tournante'!$A$6:$B$168,2)","v":{"$error":"#N/A"}},{"$f":"VLOOKUP(S58,'Tableau Tournante'!$A$6:$B$168,2)","v":{"$error":"#N/A"}},null,{"$f":"VLOOKUP(U58,'Tableau Tournante'!$A$6:$B$168,2)","v":{"$error":"#N/A"}},{"$f":"VLOOKUP(V58,'Tableau Tournante'!$A$6:$B$168,2)","v":{"$error":"#N/A"}},null,{"$f":"VLOOKUP(X58,'Tableau Tournante'!$A$6:$B$168,2)","v":{"$error":"#N/A"}},{"$f":"VLOOKUP(Y58,'Tableau Tournante'!$A$6:$B$168,2)","v":{"$error":"#N/A"}}]
[null,null,{"$f":"'Tableau Tournante'!N32","v":0},{"$f":"'Tableau Tournante'!O32","v":0},null,{"$f":"'Tableau Tournante'!P32","v":0},{"$f":"'Tableau Tournante'!Q32","v":0},null,{"$f":"'Tableau Tournante'!R32","v":0},{"$f":"'Tableau Tournante'!S32","v":0},null,{"$f":"'Tableau Tournante'!T32","v":0},{"$f":"'Tableau Tournante'!U32","v":0},null,{"$f":"'Tableau Tournante'!V32","v":0},{"$f":"'Tableau Tournante'!W32","v":0},null,{"$f":"'Tableau Tournante'!X32","v":0},{"$f":"'Tableau Tournante'!Y32","v":0},null,{"$f":"'Tableau Tournante'!Z32","v":0},{"$f":"'Tableau Tournante'!AA32","v":0},null,{"$f":"'Tableau Tournante'!AB32","v":0},{"$f":"'Tableau Tournante'!AC32","v":0}]
[null,null,{"$f":"VLOOKUP(C60,'Tableau Tournante'!$A$6:$B$168,2)","v":{"$error":"#N/A"}},{"$f":"VLOOKUP(D60,'Tableau Tournante'!$A$6:$B$168,2)","v":{"$error":"#N/A"}},null,{"$f":"VLOOKUP(F60,'Tableau Tournante'!$A$6:$B$168,2)","v":{"$error":"#N/A"}},{"$f":"VLOOKUP(G60,'Tableau Tournante'!$A$6:$B$168,2)","v":{"$error":"#N/A"}},null,{"$f":"VLOOKUP(I60,'Tableau Tournante'!$A$6:$B$168,2)","v":{"$error":"#N/A"}},{"$f":"VLOOKUP(J60,'Tableau Tournante'!$A$6:$B$168,2)","v":{"$error":"#N/A"}},null,{"$f":"VLOOKUP(L60,'Tableau Tournante'!$A$6:$B$168,2)","v":{"$error":"#N/A"}},{"$f":"VLOOKUP(M60,'Tableau Tournante'!$A$6:$B$168,2)","v":{"$error":"#N/A"}},null,{"$f":"VLOOKUP(O60,'Tableau Tournante'!$A$6:$B$168,2)","v":{"$error":"#N/A"}},{"$f":"VLOOKUP(P60,'Tableau Tournante'!$A$6:$B$168,2)","v":{"$error":"#N/A"}},null,{"$f":"VLOOKUP(R60,'Tableau Tournante'!$A$6:$B$168,2)","v":{"$error":"#N/A"}},{"$f":"VLOOKUP(S60,'Tableau Tournante'!$A$6:$B$168,2)","v":{"$error":"#N/A"}},null,{"$f":"VLOOKUP(U60,'Tableau Tournante'!$A$6:$B$168,2)","v":{"$error":"#N/A"}},{"$f":"VLOOKUP(V60,'Tableau Tournante'!$A$6:$B$168,2)","v":{"$error":"#N/A"}},null,{"$f":"VLOOKUP(X60,'Tableau Tournante'!$A$6:$B$168,2)","v":{"$error":"#N/A"}},{"$f":"VLOOKUP(Y60,'Tableau Tournante'!$A$6:$B$168,2)","v":{"$error":"#N/A"}}]
[null,null,{"$f":"'Tableau Tournante'!N33","v":0},{"$f":"'Tableau Tournante'!O33","v":0},null,{"$f":"'Tableau Tournante'!P33","v":0},{"$f":"'Tableau Tournante'!Q33","v":0},null,{"$f":"'Tableau Tournante'!R33","v":0},{"$f":"'Tableau Tournante'!S33","v":0},null,{"$f":"'Tableau Tournante'!T33","v":0},{"$f":"'Tableau Tournante'!U33","v":0},null,{"$f":"'Tableau Tournante'!V33","v":0},{"$f":"'Tableau Tournante'!W33","v":0},null,{"$f":"'Tableau Tournante'!X33","v":0},{"$f":"'Tableau Tournante'!Y33","v":0},null,{"$f":"'Tableau Tournante'!Z33","v":0},{"$f":"'Tableau Tournante'!AA33","v":0},null,{"$f":"'Tableau Tournante'!AB33","v":0},{"$f":"'Tableau Tournante'!AC33","v":0}]
[null,null,{"$f":"VLOOKUP(C62,'Tableau Tournante'!$A$6:$B$168,2)","v":{"$error":"#N/A"}},{"$f":"VLOOKUP(D62,'Tableau Tournante'!$A$6:$B$168,2)","v":{"$error":"#N/A"}},null,{"$f":"VLOOKUP(F62,'Tableau Tournante'!$A$6:$B$168,2)","v":{"$error":"#N/A"}},{"$f":"VLOOKUP(G62,'Tableau Tournante'!$A$6:$B$168,2)","v":{"$error":"#N/A"}},null,{"$f":"VLOOKUP(I62,'Tableau Tournante'!$A$6:$B$168,2)","v":{"$error":"#N/A"}},{"$f":"VLOOKUP(J62,'Tableau Tournante'!$A$6:$B$168,2)","v":{"$error":"#N/A"}},null,{"$f":"VLOOKUP(L62,'Tableau Tournante'!$A$6:$B$168,2)","v":{"$error":"#N/A"}},{"$f":"VLOOKUP(M62,'Tableau Tournante'!$A$6:$B$168,2)","v":{"$error":"#N/A"}},null,{"$f":"VLOOKUP(O62,'Tableau Tournante'!$A$6:$B$168,2)","v":{"$error":"#N/A"}},{"$f":"VLOOKUP(P62,'Tableau Tournante'!$A$6:$B$168,2)","v":{"$error":"#N/A"}},null,{"$f":"VLOOKUP(R62,'Tableau Tournante'!$A$6:$B$168,2)","v":{"$error":"#N/A"}},{"$f":"VLOOKUP(S62,'Tableau Tournante'!$A$6:$B$168,2)","v":{"$error":"#N/A"}},null,{"$f":"VLOOKUP(U62,'Tableau Tournante'!$A$6:$B$168,2)","v":{"$error":"#N/A"}},{"$f":"VLOOKUP(V62,'Tableau Tournante'!$A$6:$B$168,2)","v":{"$error":"#N/A"}},null,{"$f":"VLOOKUP(X62,'Tableau Tournante'!$A$6:$B$168,2)","v":{"$error":"#N/A"}},{"$f":"VLOOKUP(Y62,'Tableau Tournante'!$A$6:$B$168,2)","v":{"$error":"#N/A"}}]
[null,null,{"$f":"'Tableau Tournante'!N34","v":0},{"$f":"'Tableau Tournante'!O34","v":0},null,{"$f":"'Tableau Tournante'!P34","v":0},{"$f":"'Tableau Tournante'!Q34","v":0},null,{"$f":"'Tableau Tournante'!R34","v":0},{"$f":"'Tableau Tournante'!S34","v":0},null,{"$f":"'Tableau Tournante'!T34","v":0},{"$f":"'Tableau Tournante'!U34","v":0},null,{"$f":"'Tableau Tournante'!V34","v":0},{"$f":"'Tableau Tournante'!W34","v":0},null,{"$f":"'Tableau Tournante'!X34","v":0},{"$f":"'Tableau Tournante'!Y34","v":0},null,{"$f":"'Tableau Tournante'!Z34","v":0},{"$f":"'Tableau Tournante'!AA34","v":0},null,{"$f":"'Tableau Tournante'!AB34","v":0},{"$f":"'Tableau Tournante'!AC34","v":0}]
[null,null,{"$f":"VLOOKUP(C64,'Tableau Tournante'!$A$6:$B$168,2)","v":{"$error":"#N/A"}},{"$f":"VLOOKUP(D64,'Tableau Tournante'!$A$6:$B$168,2)","v":{"$error":"#N/A"}},null,{"$f":"VLOOKUP(F64,'Tableau Tournante'!$A$6:$B$168,2)","v":{"$error":"#N/A"}},{"$f":"VLOOKUP(G64,'Tableau Tournante'!$A$6:$B$168,2)","v":{"$error":"#N/A"}},null,{"$f":"VLOOKUP(I64,'Tableau Tournante'!$A$6:$B$168,2)","v":{"$error":"#N/A"}},{"$f":"VLOOKUP(J64,'Tableau Tournante'!$A$6:$B$168,2)","v":{"$error":"#N/A"}},null,{"$f":"VLOOKUP(L64,'Tableau Tournante'!$A$6:$B$168,2)","v":{"$error":"#N/A"}},{"$f":"VLOOKUP(M64,'Tableau Tournante'!$A$6:$B$168,2)","v":{"$error":"#N/A"}},null,{"$f":"VLOOKUP(O64,'Tableau Tournante'!$A$6:$B$168,2)","v":{"$error":"#N/A"}},{"$f":"VLOOKUP(P64,'Tableau Tournante'!$A$6:$B$168,2)","v":{"$error":"#N/A"}},null,{"$f":"VLOOKUP(R64,'Tableau Tournante'!$A$6:$B$168,2)","v":{"$error":"#N/A"}},{"$f":"VLOOKUP(S64,'Tableau Tournante'!$A$6:$B$168,2)","v":{"$error":"#N/A"}},null,{"$f":"VLOOKUP(U64,'Tableau Tournante'!$A$6:$B$168,2)","v":{"$error":"#N/A"}},{"$f":"VLOOKUP(V64,'Tableau Tournante'!$A$6:$B$168,2)","v":{"$error":"#N/A"}},null,{"$f":"VLOOKUP(X64,'Tableau Tournante'!$A$6:$B$168,2)","v":{"$error":"#N/A"}},{"$f":"VLOOKUP(Y64,'Tableau Tournante'!$A$6:$B$168,2)","v":{"$error":"#N/A"}}]
[null,null,{"$f":"'Tableau Tournante'!N35","v":0},{"$f":"'Tableau Tournante'!O35","v":0},null,{"$f":"'Tableau Tournante'!P35","v":0},{"$f":"'Tableau Tournante'!Q35","v":0},null,{"$f":"'Tableau Tournante'!R35","v":0},{"$f":"'Tableau Tournante'!S35","v":0},null,{"$f":"'Tableau Tournante'!T35","v":0},{"$f":"'Tableau Tournante'!U35","v":0},null,{"$f":"'Tableau Tournante'!V35","v":0},{"$f":"'Tableau Tournante'!W35","v":0},null,{"$f":"'Tableau Tournante'!X35","v":0},{"$f":"'Tableau Tournante'!Y35","v":0},null,{"$f":"'Tableau Tournante'!Z35","v":0},{"$f":"'Tableau Tournante'!AA35","v":0},null,{"$f":"'Tableau Tournante'!AB35","v":0},{"$f":"'Tableau Tournante'!AC35","v":0}]
[null,null,{"$f":"VLOOKUP(C66,'Tableau Tournante'!$A$6:$B$168,2)","v":{"$error":"#N/A"}},{"$f":"VLOOKUP(D66,'Tableau Tournante'!$A$6:$B$168,2)","v":{"$error":"#N/A"}},null,{"$f":"VLOOKUP(F66,'Tableau Tournante'!$A$6:$B$168,2)","v":{"$error":"#N/A"}},{"$f":"VLOOKUP(G66,'Tableau Tournante'!$A$6:$B$168,2)","v":{"$error":"#N/A"}},null,{"$f":"VLOOKUP(I66,'Tableau Tournante'!$A$6:$B$168,2)","v":{"$error":"#N/A"}},{"$f":"VLOOKUP(J66,'Tableau Tournante'!$A$6:$B$168,2)","v":{"$error":"#N/A"}},null,{"$f":"VLOOKUP(L66,'Tableau Tournante'!$A$6:$B$168,2)","v":{"$error":"#N/A"}},{"$f":"VLOOKUP(M66,'Tableau Tournante'!$A$6:$B$168,2)","v":{"$error":"#N/A"}},null,{"$f":"VLOOKUP(O66,'Tableau Tournante'!$A$6:$B$168,2)","v":{"$error":"#N/A"}},{"$f":"VLOOKUP(P66,'Tableau Tournante'!$A$6:$B$168,2)","v":{"$error":"#N/A"}},null,{"$f":"VLOOKUP(R66,'Tableau Tournante'!$A$6:$B$168,2)","v":{"$error":"#N/A"}},{"$f":"VLOOKUP(S66,'Tableau Tournante'!$A$6:$B$168,2)","v":{"$error":"#N/A"}},null,{"$f":"VLOOKUP(U66,'Tableau Tournante'!$A$6:$B$168,2)","v":{"$error":"#N/A"}},{"$f":"VLOOKUP(V66,'Tableau Tournante'!$A$6:$B$168,2)","v":{"$error":"#N/A"}},null,{"$f":"VLOOKUP(X66,'Tableau Tournante'!$A$6:$B$168,2)","v":{"$error":"#N/A"}},{"$f":"VLOOKUP(Y66,'Tableau Tournante'!$A$6:$B$168,2)","v":{"$error":"#N/A"}}]
[null,null,{"$f":"'Tableau Tournante'!N36","v":0},{"$f":"'Tableau Tournante'!O36","v":0},null,{"$f":"'Tableau Tournante'!P36","v":0},{"$f":"'Tableau Tournante'!Q36","v":0},null,{"$f":"'Tableau Tournante'!R36","v":0},{"$f":"'Tableau Tournante'!S36","v":0},null,{"$f":"'Tableau Tournante'!T36","v":0},{"$f":"'Tableau Tournante'!U36","v":0},null,{"$f":"'Tableau Tournante'!V36","v":0},{"$f":"'Tableau Tournante'!W36","v":0},null,{"$f":"'Tableau Tournante'!X36","v":0},{"$f":"'Tableau Tournante'!Y36","v":0},null,{"$f":"'Tableau Tournante'!Z36","v":0},{"$f":"'Tableau Tournante'!AA36","v":0},null,{"$f":"'Tableau Tournante'!AB36","v":0},{"$f":"'Tableau Tournante'!AC36","v":0}]
[null,null,{"$f":"VLOOKUP(C68,'Tableau Tournante'!$A$6:$B$168,2)","v":{"$error":"#N/A"}},{"$f":"VLOOKUP(D68,'Tableau Tournante'!$A$6:$B$168,2)","v":{"$error":"#N/A"}},null,{"$f":"VLOOKUP(F68,'Tableau Tournante'!$A$6:$B$168,2)","v":{"$error":"#N/A"}},{"$f":"VLOOKUP(G68,'Tableau Tournante'!$A$6:$B$168,2)","v":{"$error":"#N/A"}},null,{"$f":"VLOOKUP(I68,'Tableau Tournante'!$A$6:$B$168,2)","v":{"$error":"#N/A"}},{"$f":"VLOOKUP(J68,'Tableau Tournante'!$A$6:$B$168,2)","v":{"$error":"#N/A"}},null,{"$f":"VLOOKUP(L68,'Tableau Tournante'!$A$6:$B$168,2)","v":{"$error":"#N/A"}},{"$f":"VLOOKUP(M68,'Tableau Tournante'!$A$6:$B$168,2)","v":{"$error":"#N/A"}},null,{"$f":"VLOOKUP(O68,'Tableau Tournante'!$A$6:$B$168,2)","v":{"$error":"#N/A"}},{"$f":"VLOOKUP(P68,'Tableau Tournante'!$A$6:$B$168,2)","v":{"$error":"#N/A"}},null,{"$f":"VLOOKUP(R68,'Tableau Tournante'!$A$6:$B$168,2)","v":{"$error":"#N/A"}},{"$f":"VLOOKUP(S68,'Tableau Tournante'!$A$6:$B$168,2)","v":{"$error":"#N/A"}},null,{"$f":"VLOOKUP(U68,'Tableau Tournante'!$A$6:$B$168,2)","v":{"$error":"#N/A"}},{"$f":"VLOOKUP(V68,'Tableau Tournante'!$A$6:$B$168,2)","v":{"$error":"#N/A"}},null,{"$f":"VLOOKUP(X68,'Tableau Tournante'!$A$6:$B$168,2)","v":{"$error":"#N/A"}},{"$f":"VLOOKUP(Y68,'Tableau Tournante'!$A$6:$B$168,2)","v":{"$error":"#N/A"}}]
[null,null,{"$f":"'Tableau Tournante'!N37","v":0},{"$f":"'Tableau Tournante'!O37","v":0},null,{"$f":"'Tableau Tournante'!P37","v":0},{"$f":"'Tableau Tournante'!Q37","v":0},null,{"$f":"'Tableau Tournante'!R37","v":0},{"$f":"'Tableau Tournante'!S37","v":0},null,{"$f":"'Tableau Tournante'!T37","v":0},{"$f":"'Tableau Tournante'!U37","v":0},null,{"$f":"'Tableau Tournante'!V37","v":0},{"$f":"'Tableau Tournante'!W37","v":0},null,{"$f":"'Tableau Tournante'!X37","v":0},{"$f":"'Tableau Tournante'!Y37","v":0},null,{"$f":"'Tableau Tournante'!Z37","v":0},{"$f":"'Tableau Tournante'!AA37","v":0},null,{"$f":"'Tableau Tournante'!AB37","v":0},{"$f":"'Tableau Tournante'!AC37","v":0}]
[null,null,{"$f":"VLOOKUP(C70,'Tableau Tournante'!$A$6:$B$168,2)","v":{"$error":"#N/A"}},{"$f":"VLOOKUP(D70,'Tableau Tournante'!$A$6:$B$168,2)","v":{"$error":"#N/A"}},null,{"$f":"VLOOKUP(F70,'Tableau Tournante'!$A$6:$B$168,2)","v":{"$error":"#N/A"}},{"$f":"VLOOKUP(G70,'Tableau Tournante'!$A$6:$B$168,2)","v":{"$error":"#N/A"}},null,{"$f":"VLOOKUP(I70,'Tableau Tournante'!$A$6:$B$168,2)","v":{"$error":"#N/A"}},{"$f":"VLOOKUP(J70,'Tableau Tournante'!$A$6:$B$168,2)","v":{"$error":"#N/A"}},null,{"$f":"VLOOKUP(L70,'Tableau Tournante'!$A$6:$B$168,2)","v":{"$error":"#N/A"}},{"$f":"VLOOKUP(M70,'Tableau Tournante'!$A$6:$B$168,2)","v":{"$error":"#N/A"}},null,{"$f":"VLOOKUP(O70,'Tableau Tournante'!$A$6:$B$168,2)","v":{"$error":"#N/A"}},{"$f":"VLOOKUP(P70,'Tableau Tournante'!$A$6:$B$168,2)","v":{"$error":"#N/A"}},null,{"$f":"VLOOKUP(R70,'Tableau Tournante'!$A$6:$B$168,2)","v":{"$error":"#N/A"}},{"$f":"VLOOKUP(S70,'Tableau Tournante'!$A$6:$B$168,2)","v":{"$error":"#N/A"}},null,{"$f":"VLOOKUP(U70,'Tableau Tournante'!$A$6:$B$168,2)","v":{"$error":"#N/A"}},{"$f":"VLOOKUP(V70,'Tableau Tournante'!$A$6:$B$168,2)","v":{"$error":"#N/A"}},null,{"$f":"VLOOKUP(X70,'Tableau Tournante'!$A$6:$B$168,2)","v":{"$error":"#N/A"}},{"$f":"VLOOKUP(Y70,'Tableau Tournante'!$A$6:$B$168,2)","v":{"$error":"#N/A"}}]
[null,null,{"$f":"'Tableau Tournante'!N38","v":0},{"$f":"'Tableau Tournante'!O38","v":0},null,{"$f":"'Tableau Tournante'!P38","v":0},{"$f":"'Tableau Tournante'!Q38","v":0},null,{"$f":"'Tableau Tournante'!R38","v":0},{"$f":"'Tableau Tournante'!S38","v":0},null,{"$f":"'Tableau Tournante'!T38","v":0},{"$f":"'Tableau Tournante'!U38","v":0},null,{"$f":"'Tableau Tournante'!V38","v":0},{"$f":"'Tableau Tournante'!W38","v":0},null,{"$f":"'Tableau Tournante'!X38","v":0},{"$f":"'Tableau Tournante'!Y38","v":0},null,{"$f":"'Tableau Tournante'!Z38","v":0},{"$f":"'Tableau Tournante'!AA38","v":0},null,{"$f":"'Tableau Tournante'!AB38","v":0},{"$f":"'Tableau Tournante'!AC38","v":0}]
[null,null,{"$f":"VLOOKUP(C72,'Tableau Tournante'!$A$6:$B$168,2)","v":{"$error":"#N/A"}},{"$f":"VLOOKUP(D72,'Tableau Tournante'!$A$6:$B$168,2)","v":{"$error":"#N/A"}},null,{"$f":"VLOOKUP(F72,'Tableau Tournante'!$A$6:$B$168,2)","v":{"$error":"#N/A"}},{"$f":"VLOOKUP(G72,'Tableau Tournante'!$A$6:$B$168,2)","v":{"$error":"#N/A"}},null,{"$f":"VLOOKUP(I72,'Tableau Tournante'!$A$6:$B$168,2)","v":{"$error":"#N/A"}},{"$f":"VLOOKUP(J72,'Tableau Tournante'!$A$6:$B$168,2)","v":{"$error":"#N/A"}},null,{"$f":"VLOOKUP(L72,'Tableau Tournante'!$A$6:$B$168,2)","v":{"$error":"#N/A"}},{"$f":"VLOOKUP(M72,'Tableau Tournante'!$A$6:$B$168,2)","v":{"$error":"#N/A"}},null,{"$f":"VLOOKUP(O72,'Tableau Tournante'!$A$6:$B$168,2)","v":{"$error":"#N/A"}},{"$f":"VLOOKUP(P72,'Tableau Tournante'!$A$6:$B$168,2)","v":{"$error":"#N/A"}},null,{"$f":"VLOOKUP(R72,'Tableau Tournante'!$A$6:$B$168,2)","v":{"$error":"#N/A"}},{"$f":"VLOOKUP(S72,'Tableau Tournante'!$A$6:$B$168,2)","v":{"$error":"#N/A"}},null,{"$f":"VLOOKUP(U72,'Tableau Tournante'!$A$6:$B$168,2)","v":{"$error":"#N/A"}},{"$f":"VLOOKUP(V72,'Tableau Tournante'!$A$6:$B$168,2)","v":{"$error":"#N/A"}},null,{"$f":"VLOOKUP(X72,'Tableau Tournante'!$A$6:$B$168,2)","v":{"$error":"#N/A"}},{"$f":"VLOOKUP(Y72,'Tableau Tournante'!$A$6:$B$168,2)","v":{"$error":"#N/A"}}]
[null,null,{"$f":"'Tableau Tournante'!N39","v":0},{"$f":"'Tableau Tournante'!O39","v":0},null,{"$f":"'Tableau Tournante'!P39","v":0},{"$f":"'Tableau Tournante'!Q39","v":0},null,{"$f":"'Tableau Tournante'!R39","v":0},{"$f":"'Tableau Tournante'!S39","v":0},null,{"$f":"'Tableau Tournante'!T39","v":0},{"$f":"'Tableau Tournante'!U39","v":0},null,{"$f":"'Tableau Tournante'!V39","v":0},{"$f":"'Tableau Tournante'!W39","v":0},null,{"$f":"'Tableau Tournante'!X39","v":0},{"$f":"'Tableau Tournante'!Y39","v":0},null,{"$f":"'Tableau Tournante'!Z39","v":0},{"$f":"'Tableau Tournante'!AA39","v":0},null,{"$f":"'Tableau Tournante'!AB39","v":0},{"$f":"'Tableau Tournante'!AC39","v":0}]
[null,null,{"$f":"VLOOKUP(C74,'Tableau Tournante'!$A$6:$B$168,2)","v":{"$error":"#N/A"}},{"$f":"VLOOKUP(D74,'Tableau Tournante'!$A$6:$B$168,2)","v":{"$error":"#N/A"}},null,{"$f":"VLOOKUP(F74,'Tableau Tournante'!$A$6:$B$168,2)","v":{"$error":"#N/A"}},{"$f":"VLOOKUP(G74,'Tableau Tournante'!$A$6:$B$168,2)","v":{"$error":"#N/A"}},null,{"$f":"VLOOKUP(I74,'Tableau Tournante'!$A$6:$B$168,2)","v":{"$error":"#N/A"}},{"$f":"VLOOKUP(J74,'Tableau Tournante'!$A$6:$B$168,2)","v":{"$error":"#N/A"}},null,{"$f":"VLOOKUP(L74,'Tableau Tournante'!$A$6:$B$168,2)","v":{"$error":"#N/A"}},{"$f":"VLOOKUP(M74,'Tableau Tournante'!$A$6:$B$168,2)","v":{"$error":"#N/A"}},null,{"$f":"VLOOKUP(O74,'Tableau Tournante'!$A$6:$B$168,2)","v":{"$error":"#N/A"}},{"$f":"VLOOKUP(P74,'Tableau Tournante'!$A$6:$B$168,2)","v":{"$error":"#N/A"}},null,{"$f":"VLOOKUP(R74,'Tableau Tournante'!$A$6:$B$168,2)","v":{"$error":"#N/A"}},{"$f":"VLOOKUP(S74,'Tableau Tournante'!$A$6:$B$168,2)","v":{"$error":"#N/A"}},null,{"$f":"VLOOKUP(U74,'Tableau Tournante'!$A$6:$B$168,2)","v":{"$error":"#N/A"}},{"$f":"VLOOKUP(V74,'Tableau Tournante'!$A$6:$B$168,2)","v":{"$error":"#N/A"}},null,{"$f":"VLOOKUP(X74,'Tableau Tournante'!$A$6:$B$168,2)","v":{"$error":"#N/A"}},{"$f":"VLOOKUP(Y74,'Tableau Tournante'!$A$6:$B$168,2)","v":{"$error":"#N/A"}}]
[null,null,{"$f":"'Tableau Tournante'!N40","v":0},{"$f":"'Tableau Tournante'!O40","v":0},null,{"$f":"'Tableau Tournante'!P40","v":0},{"$f":"'Tableau Tournante'!Q40","v":0},null,{"$f":"'Tableau Tournante'!R40","v":0},{"$f":"'Tableau Tournante'!S40","v":0},null,{"$f":"'Tableau Tournante'!T40","v":0},{"$f":"'Tableau Tournante'!U40","v":0},null,{"$f":"'Tableau Tournante'!V40","v":0},{"$f":"'Tableau Tournante'!W40","v":0},null,{"$f":"'Tableau Tournante'!X40","v":0},{"$f":"'Tableau Tournante'!Y40","v":0},null,{"$f":"'Tableau Tournante'!Z40","v":0},{"$f":"'Tableau Tournante'!AA40","v":0},null,{"$f":"'Tableau Tournante'!AB40","v":0},{"$f":"'Tableau Tournante'!AC40","v":0}]
[null,null,{"$f":"VLOOKUP(C76,'Tableau Tournante'!$A$6:$B$168,2)","v":{"$error":"#N/A"}},{"$f":"VLOOKUP(D76,'Tableau Tournante'!$A$6:$B$168,2)","v":{"$error":"#N/A"}},null,{"$f":"VLOOKUP(F76,'Tableau Tournante'!$A$6:$B$168,2)","v":{"$error":"#N/A"}},{"$f":"VLOOKUP(G76,'Tableau Tournante'!$A$6:$B$168,2)","v":{"$error":"#N/A"}},null,{"$f":"VLOOKUP(I76,'Tableau Tournante'!$A$6:$B$168,2)","v":{"$error":"#N/A"}},{"$f":"VLOOKUP(J76,'Tableau Tournante'!$A$6:$B$168,2)","v":{"$error":"#N/A"}},null,{"$f":"VLOOKUP(L76,'Tableau Tournante'!$A$6:$B$168,2)","v":{"$error":"#N/A"}},{"$f":"VLOOKUP(M76,'Tableau Tournante'!$A$6:$B$168,2)","v":{"$error":"#N/A"}},null,{"$f":"VLOOKUP(O76,'Tableau Tournante'!$A$6:$B$168,2)","v":{"$error":"#N/A"}},{"$f":"VLOOKUP(P76,'Tableau Tournante'!$A$6:$B$168,2)","v":{"$error":"#N/A"}},null,{"$f":"VLOOKUP(R76,'Tableau Tournante'!$A$6:$B$168,2)","v":{"$error":"#N/A"}},{"$f":"VLOOKUP(S76,'Tableau Tournante'!$A$6:$B$168,2)","v":{"$error":"#N/A"}},null,{"$f":"VLOOKUP(U76,'Tableau Tournante'!$A$6:$B$168,2)","v":{"$error":"#N/A"}},{"$f":"VLOOKUP(V76,'Tableau Tournante'!$A$6:$B$168,2)","v":{"$error":"#N/A"}},null,{"$f":"VLOOKUP(X76,'Tableau Tournante'!$A$6:$B$168,2)","v":{"$error":"#N/A"}},{"$f":"VLOOKUP(Y76,'Tableau Tournante'!$A$6:$B$168,2)","v":{"$error":"#N/A"}}]
[null,null,{"$f":"'Tableau Tournante'!N41","v":0},{"$f":"'Tableau Tournante'!O41","v":0},null,{"$f":"'Tableau Tournante'!P41","v":0},{"$f":"'Tableau Tournante'!Q41","v":0},null,{"$f":"'Tableau Tournante'!R41","v":0},{"$f":"'Tableau Tournante'!S41","v":0},null,{"$f":"'Tableau Tournante'!T41","v":0},{"$f":"'Tableau Tournante'!U41","v":0},null,{"$f":"'Tableau Tournante'!V41","v":0},{"$f":"'Tableau Tournante'!W41","v":0},null,{"$f":"'Tableau Tournante'!X41","v":0},{"$f":"'Tableau Tournante'!Y41","v":0},null,{"$f":"'Tableau Tournante'!Z41","v":0},{"$f":"'Tableau Tournante'!AA41","v":0},null,{"$f":"'Tableau Tournante'!AB41","v":0},{"$f":"'Tableau Tournante'!AC41","v":0}]
[null,null,{"$f":"VLOOKUP(C78,'Tableau Tournante'!$A$6:$B$168,2)","v":{"$error":"#N/A"}},{"$f":"VLOOKUP(D78,'Tableau Tournante'!$A$6:$B$168,2)","v":{"$error":"#N/A"}},null,{"$f":"VLOOKUP(F78,'Tableau Tournante'!$A$6:$B$168,2)","v":{"$error":"#N/A"}},{"$f":"VLOOKUP(G78,'Tableau Tournante'!$A$6:$B$168,2)","v":{"$error":"#N/A"}},null,{"$f":"VLOOKUP(I78,'Tableau Tournante'!$A$6:$B$168,2)","v":{"$error":"#N/A"}},{"$f":"VLOOKUP(J78,'Tableau Tournante'!$A$6:$B$168,2)","v":{"$error":"#N/A"}},null,{"$f":"VLOOKUP(L78,'Tableau Tournante'!$A$6:$B$168,2)","v":{"$error":"#N/A"}},{"$f":"VLOOKUP(M78,'Tableau Tournante'!$A$6:$B$168,2)","v":{"$error":"#N/A"}},null,{"$f":"VLOOKUP(O78,'Tableau Tournante'!$A$6:$B$168,2)","v":{"$error":"#N/A"}},{"$f":"VLOOKUP(P78,'Tableau Tournante'!$A$6:$B$168,2)","v":{"$error":"#N/A"}},null,{"$f":"VLOOKUP(R78,'Tableau Tournante'!$A$6:$B$168,2)","v":{"$error":"#N/A"}},{"$f":"VLOOKUP(S78,'Tableau Tournante'!$A$6:$B$168,2)","v":{"$error":"#N/A"}},null,{"$f":"VLOOKUP(U78,'Tableau Tournante'!$A$6:$B$168,2)","v":{"$error":"#N/A"}},{"$f":"VLOOKUP(V78,'Tableau Tournante'!$A$6:$B$168,2)","v":{"$error":"#N/A"}},null,{"$f":"VLOOKUP(X78,'Tableau Tournante'!$A$6:$B$168,2)","v":{"$error":"#N/A"}},{"$f":"VLOOKUP(Y78,'Tableau Tournante'!$A$6:$B$168,2)","v":{"$error":"#N/A"}}]
[null,null,{"$f":"'Tableau Tournante'!N42","v":0},{"$f":"'Tableau Tournante'!O42","v":0},null,{"$f":"'Tableau Tournante'!P42","v":0},{"$f":"'Tableau Tournante'!Q42","v":0},null,{"$f":"'Tableau Tournante'!R42","v":0},{"$f":"'Tableau Tournante'!S42","v":0},null,{"$f":"'Tableau Tournante'!T42","v":0},{"$f":"'Tableau Tournante'!U42","v":0},null,{"$f":"'Tableau Tournante'!V42","v":0},{"$f":"'Tableau Tournante'!W42","v":0},null,{"$f":"'Tableau Tournante'!X42","v":0},{"$f":"'Tableau Tournante'!Y42","v":0},null,{"$f":"'Tableau Tournante'!Z42","v":0},{"$f":"'Tableau Tournante'!AA42","v":0},null,{"$f":"'Tableau Tournante'!AB42","v":0},{"$f":"'Tableau Tournante'!AC42","v":0}]
[null,null,{"$f":"VLOOKUP(C80,'Tableau Tournante'!$A$6:$B$168,2)","v":{"$error":"#N/A"}},{"$f":"VLOOKUP(D80,'Tableau Tournante'!$A$6:$B$168,2)","v":{"$error":"#N/A"}},null,{"$f":"VLOOKUP(F80,'Tableau Tournante'!$A$6:$B$168,2)","v":{"$error":"#N/A"}},{"$f":"VLOOKUP(G80,'Tableau Tournante'!$A$6:$B$168,2)","v":{"$error":"#N/A"}},null,{"$f":"VLOOKUP(I80,'Tableau Tournante'!$A$6:$B$168,2)","v":{"$error":"#N/A"}},{"$f":"VLOOKUP(J80,'Tableau Tournante'!$A$6:$B$168,2)","v":{"$error":"#N/A"}},null,{"$f":"VLOOKUP(L80,'Tableau Tournante'!$A$6:$B$168,2)","v":{"$error":"#N/A"}},{"$f":"VLOOKUP(M80,'Tableau Tournante'!$A$6:$B$168,2)","v":{"$error":"#N/A"}},null,{"$f":"VLOOKUP(O80,'Tableau Tournante'!$A$6:$B$168,2)","v":{"$error":"#N/A"}},{"$f":"VLOOKUP(P80,'Tableau Tournante'!$A$6:$B$168,2)","v":{"$error":"#N/A"}},null,{"$f":"VLOOKUP(R80,'Tableau Tournante'!$A$6:$B$168,2)","v":{"$error":"#N/A"}},{"$f":"VLOOKUP(S80,'Tableau Tournante'!$A$6:$B$168,2)","v":{"$error":"#N/A"}},null,{"$f":"VLOOKUP(U80,'Tableau Tournante'!$A$6:$B$168,2)","v":{"$error":"#N/A"}},{"$f":"VLOOKUP(V80,'Tableau Tournante'!$A$6:$B$168,2)","v":{"$error":"#N/A"}},null,{"$f":"VLOOKUP(X80,'Tableau Tournante'!$A$6:$B$168,2)","v":{"$error":"#N/A"}},{"$f":"VLOOKUP(Y80,'Tableau Tournante'!$A$6:$B$168,2)","v":{"$error":"#N/A"}}]
[null,null,{"$f":"'Tableau Tournante'!N43","v":0},{"$f":"'Tableau Tournante'!O43","v":0},null,{"$f":"'Tableau Tournante'!P43","v":0},{"$f":"'Tableau Tournante'!Q43","v":0},null,{"$f":"'Tableau Tournante'!R43","v":0},{"$f":"'Tableau Tournante'!S43","v":0},null,{"$f":"'Tableau Tournante'!T43","v":0},{"$f":"'Tableau Tournante'!U43","v":0},null,{"$f":"'Tableau Tournante'!V43","v":0},{"$f":"'Tableau Tournante'!W43","v":0},null,{"$f":"'Tableau Tournante'!X43","v":0},{"$f":"'Tableau Tournante'!Y43","v":0},null,{"$f":"'Tableau Tournante'!Z43","v":0},{"$f":"'Tableau Tournante'!AA43","v":0},null,{"$f":"'Tableau Tournante'!AB43","v":0},{"$f":"'Tableau Tournante'!AC43","v":0}]
[null,null,{"$f":"VLOOKUP(C82,'Tableau Tournante'!$A$6:$B$168,2)","v":{"$error":"#N/A"}},{"$f":"VLOOKUP(D82,'Tableau Tournante'!$A$6:$B$168,2)","v":{"$error":"#N/A"}},null,{"$f":"VLOOKUP(F82,'Tableau Tournante'!$A$6:$B$168,2)","v":{"$error":"#N/A"}},{"$f":"VLOOKUP(G82,'Tableau Tournante'!$A$6:$B$168,2)","v":{"$error":"#N/A"}},null,{"$f":"VLOOKUP(I82,'Tableau Tournante'!$A$6:$B$168,2)","v":{"$error":"#N/A"}},{"$f":"VLOOKUP(J82,'Tableau Tournante'!$A$6:$B$168,2)","v":{"$error":"#N/A"}},null,{"$f":"VLOOKUP(L82,'Tableau Tournante'!$A$6:$B$168,2)","v":{"$error":"#N/A"}},{"$f":"VLOOKUP(M82,'Tableau Tournante'!$A$6:$B$168,2)","v":{"$error":"#N/A"}},null,{"$f":"VLOOKUP(O82,'Tableau Tournante'!$A$6:$B$168,2)","v":{"$error":"#N/A"}},{"$f":"VLOOKUP(P82,'Tableau Tournante'!$A$6:$B$168,2)","v":{"$error":"#N/A"}},null,{"$f":"VLOOKUP(R82,'Tableau Tournante'!$A$6:$B$168,2)","v":{"$error":"#N/A"}},{"$f":"VLOOKUP(S82,'Tableau Tournante'!$A$6:$B$168,2)","v":{"$error":"#N/A"}},null,{"$f":"VLOOKUP(U82,'Tableau Tournante'!$A$6:$B$168,2)","v":{"$error":"#N/A"}},{"$f":"VLOOKUP(V82,'Tableau Tournante'!$A$6:$B$168,2)","v":{"$error":"#N/A"}},null,{"$f":"VLOOKUP(X82,'Tableau Tournante'!$A$6:$B$168,2)","v":{"$error":"#N/A"}},{"$f":"VLOOKUP(Y82,'Tableau Tournante'!$A$6:$B$168,2)","v":{"$error":"#N/A"}}]
[null,null,{"$f":"'Tableau Tournante'!N44","v":0},{"$f":"'Tableau Tournante'!O44","v":0},null,{"$f":"'Tableau Tournante'!P44","v":0},{"$f":"'Tableau Tournante'!Q44","v":0},null,{"$f":"'Tableau Tournante'!R44","v":0},{"$f":"'Tableau Tournante'!S44","v":0},null,{"$f":"'Tableau Tournante'!T44","v":0},{"$f":"'Tableau Tournante'!U44","v":0},null,{"$f":"'Tableau Tournante'!V44","v":0},{"$f":"'Tableau Tournante'!W44","v":0},null,{"$f":"'Tableau Tournante'!X44","v":0},{"$f":"'Tableau Tournante'!Y44","v":0},null,{"$f":"'Tableau Tournante'!Z44","v":0},{"$f":"'Tableau Tournante'!AA44","v":0},null,{"$f":"'Tableau Tournante'!AB44","v":0},{"$f":"'Tableau Tournante'!AC44","v":0}]
[null,null,{"$f":"VLOOKUP(C84,'Tableau Tournante'!$A$6:$B$168,2)","v":{"$error":"#N/A"}},{"$f":"VLOOKUP(D84,'Tableau Tournante'!$A$6:$B$168,2)","v":{"$error":"#N/A"}},null,{"$f":"VLOOKUP(F84,'Tableau Tournante'!$A$6:$B$168,2)","v":{"$error":"#N/A"}},{"$f":"VLOOKUP(G84,'Tableau Tournante'!$A$6:$B$168,2)","v":{"$error":"#N/A"}},null,{"$f":"VLOOKUP(I84,'Tableau Tournante'!$A$6:$B$168,2)","v":{"$error":"#N/A"}},{"$f":"VLOOKUP(J84,'Tableau Tournante'!$A$6:$B$168,2)","v":{"$error":"#N/A"}},null,{"$f":"VLOOKUP(L84,'Tableau Tournante'!$A$6:$B$168,2)","v":{"$error":"#N/A"}},{"$f":"VLOOKUP(M84,'Tableau Tournante'!$A$6:$B$168,2)","v":{"$error":"#N/A"}},null,{"$f":"VLOOKUP(O84,'Tableau Tournante'!$A$6:$B$168,2)","v":{"$error":"#N/A"}},{"$f":"VLOOKUP(P84,'Tableau Tournante'!$A$6:$B$168,2)","v":{"$error":"#N/A"}},null,{"$f":"VLOOKUP(R84,'Tableau Tournante'!$A$6:$B$168,2)","v":{"$error":"#N/A"}},{"$f":"VLOOKUP(S84,'Tableau Tournante'!$A$6:$B$168,2)","v":{"$error":"#N/A"}},null,{"$f":"VLOOKUP(U84,'Tableau Tournante'!$A$6:$B$168,2)","v":{"$error":"#N/A"}},{"$f":"VLOOKUP(V84,'Tableau Tournante'!$A$6:$B$168,2)","v":{"$error":"#N/A"}},null,{"$f":"VLOOKUP(X84,'Tableau Tournante'!$A$6:$B$168,2)","v":{"$error":"#N/A"}},{"$f":"VLOOKUP(Y84,'Tableau Tournante'!$A$6:$B$168,2)","v":{"$error":"#N/A"}}]
[null,null,{"$f":"'Tableau Tournante'!N45","v":0},{"$f":"'Tableau Tournante'!O45","v":0},null,{"$f":"'Tableau Tournante'!P45","v":0},{"$f":"'Tableau Tournante'!Q45","v":0},null,{"$f":"'Tableau Tournante'!R45","v":0},{"$f":"'Tableau Tournante'!S45","v":0},null,{"$f":"'Tableau Tournante'!T45","v":0},{"$f":"'Tableau Tournante'!U45","v":0},null,{"$f":"'Tableau Tournante'!V45","v":0},{"$f":"'Tableau Tournante'!W45","v":0},null,{"$f":"'Tableau Tournante'!X45","v":0},{"$f":"'Tableau Tournante'!Y45","v":0},null,{"$f":"'Tableau Tournante'!Z45","v":0},{"$f":"'Tableau Tournante'!AA45","v":0},null,{"$f":"'Tableau Tournante'!AB45","v":0},{"$f":"'Tableau Tournante'!AC45","v":0}]
[null,null,{"$f":"VLOOKUP(C86,'Tableau Tournante'!$A$6:$B$168,2)","v":{"$error":"#N/A"}},{"$f":"VLOOKUP(D86,'Tableau Tournante'!$A$6:$B$168,2)","v":{"$error":"#N/A"}},null,{"$f":"VLOOKUP(F86,'Tableau Tournante'!$A$6:$B$168,2)","v":{"$error":"#N/A"}},{"$f":"VLOOKUP(G86,'Tableau Tournante'!$A$6:$B$168,2)","v":{"$error":"#N/A"}},null,{"$f":"VLOOKUP(I86,'Tableau Tournante'!$A$6:$B$168,2)","v":{"$error":"#N/A"}},{"$f":"VLOOKUP(J86,'Tableau Tournante'!$A$6:$B$168,2)","v":{"$error":"#N/A"}},null,{"$f":"VLOOKUP(L86,'Tableau Tournante'!$A$6:$B$168,2)","v":{"$error":"#N/A"}},{"$f":"VLOOKUP(M86,'Tableau Tournante'!$A$6:$B$168,2)","v":{"$error":"#N/A"}},null,{"$f":"VLOOKUP(O86,'Tableau Tournante'!$A$6:$B$168,2)","v":{"$error":"#N/A"}},{"$f":"VLOOKUP(P86,'Tableau Tournante'!$A$6:$B$168,2)","v":{"$error":"#N/A"}},null,{"$f":"VLOOKUP(R86,'Tableau Tournante'!$A$6:$B$168,2)","v":{"$error":"#N/A"}},{"$f":"VLOOKUP(S86,'Tableau Tournante'!$A$6:$B$168,2)","v":{"$error":"#N/A"}},null,{"$f":"VLOOKUP(U86,'Tableau Tournante'!$A$6:$B$168,2)","v":{"$error":"#N/A"}},{"$f":"VLOOKUP(V86,'Tableau Tournante'!$A$6:$B$168,2)","v":{"$error":"#N/A"}},null,{"$f":"VLOOKUP(X86,'Tableau Tournante'!$A$6:$B$168,2)","v":{"$error":"#N/A"}},{"$f":"VLOOKUP(Y86,'Tableau Tournante'!$A$6:$B$168,2)","v":{"$error":"#N/A"}}]
[null,null,{"$f":"'Tableau Tournante'!N46","v":0},{"$f":"'Tableau Tournante'!O46","v":0},null,{"$f":"'Tableau Tournante'!P46","v":0},{"$f":"'Tableau Tournante'!Q46","v":0},null,{"$f":"'Tableau Tournante'!R46","v":0},{"$f":"'Tableau Tournante'!S46","v":0},null,{"$f":"'Tableau Tournante'!T46","v":0},{"$f":"'Tableau Tournante'!U46","v":0},null,{"$f":"'Tableau Tournante'!V46","v":0},{"$f":"'Tableau Tournante'!W46","v":0},null,{"$f":"'Tableau Tournante'!X46","v":0},{"$f":"'Tableau Tournante'!Y46","v":0},null,{"$f":"'Tableau Tournante'!Z46","v":0},{"$f":"'Tableau Tournante'!AA46","v":0},null,{"$f":"'Tableau Tournante'!AB46","v":0},{"$f":"'Tableau Tournante'!AC46","v":0}]
[null,null,{"$f":"VLOOKUP(C88,'Tableau Tournante'!$A$6:$B$168,2)","v":{"$error":"#N/A"}},{"$f":"VLOOKUP(D88,'Tableau Tournante'!$A$6:$B$168,2)","v":{"$error":"#N/A"}},null,{"$f":"VLOOKUP(F88,'Tableau Tournante'!$A$6:$B$168,2)","v":{"$error":"#N/A"}},{"$f":"VLOOKUP(G88,'Tableau Tournante'!$A$6:$B$168,2)","v":{"$error":"#N/A"}},null,{"$f":"VLOOKUP(I88,'Tableau Tournante'!$A$6:$B$168,2)","v":{"$error":"#N/A"}},{"$f":"VLOOKUP(J88,'Tableau Tournante'!$A$6:$B$168,2)","v":{"$error":"#N/A"}},null,{"$f":"VLOOKUP(L88,'Tableau Tournante'!$A$6:$B$168,2)","v":{"$error":"#N/A"}},{"$f":"VLOOKUP(M88,'Tableau Tournante'!$A$6:$B$168,2)","v":{"$error":"#N/A"}},null,{"$f":"VLOOKUP(O88,'Tableau Tournante'!$A$6:$B$168,2)","v":{"$error":"#N/A"}},{"$f":"VLOOKUP(P88,'Tableau Tournante'!$A$6:$B$168,2)","v":{"$error":"#N/A"}},null,{"$f":"VLOOKUP(R88,'Tableau Tournante'!$A$6:$B$168,2)","v":{"$error":"#N/A"}},{"$f":"VLOOKUP(S88,'Tableau Tournante'!$A$6:$B$168,2)","v":{"$error":"#N/A"}},null,{"$f":"VLOOKUP(U88,'Tableau Tournante'!$A$6:$B$168,2)","v":{"$error":"#N/A"}},{"$f":"VLOOKUP(V88,'Tableau Tournante'!$A$6:$B$168,2)","v":{"$error":"#N/A"}},null,{"$f":"VLOOKUP(X88,'Tableau Tournante'!$A$6:$B$168,2)","v":{"$error":"#N/A"}},{"$f":"VLOOKUP(Y88,'Tableau Tournante'!$A$6:$B$168,2)","v":{"$error":"#N/A"}}]

{"sheet":"Feuil1","index":2,"n_rows":0,"n_cols":0,"rows_kept":0,"cut":false,"hidden":false,"merged":[]}

{"sheet":"Tournois 2 contre 2","index":3,"n_rows":192,"n_cols":17,"rows_kept":192,"cut":false,"hidden":true,"merged":[[1,3,1,7],[2,2,2,3]]}
[{"$f":"'Tableau Tournante'!B6","v":"ALAIN"},"Tournois 2 contre 2, et ne se rencontrent ni ne sont partenaires plusieurs fois. Possibilité non activée: clubs "]
[{"$f":"'Tableau Tournante'!B7","v":"FRANCOIS"},{"$f":"C3/4","v":4.5},null,{"$f":"IF(C3<=11,\"Attention 3 manches\",\"\")","v":""}]
[{"$f":"'Tableau Tournante'!B8","v":"SERGE"},null,{"$f":"SUMPRODUCT(--('Tableau Tournante'!B6:B182<>\"\"))","v":18},null,null,3,"manches"]
[{"$f":"'Tableau Tournante'!B9","v":"YVES"}]
[{"$f":"'Tableau Tournante'!B10","v":"VERO"},{"$f":"\"Manche \"&(COLUMN()+2)/4","v":"Manche 1"},null,null,null,{"$f":"\"Manche \"&(COLUMN()+2)/4","v":"Manche 2"},null,null,null,{"$f":"\"Manche \"&(COLUMN()+2)/4","v":"Manche 3"},null,null,null,{"$f":"\"Manche \"&(COLUMN()+2)/4","v":"Manche 4"}]
[{"$f":"'Tableau Tournante'!B11","v":"ANTOINE"},null,"Equipe","Contre",null,null,"Equipe","Contre",null,null,"Equipe","Contre",null,null,"Equipe","Contre"]
[{"$f":"'Tableau Tournante'!B12","v":"JEAN"},11,15,17,8,22,18,2,1,22,20,16,15,22,12,10,6]
[{"$f":"'Tableau Tournante'!B13","v":"JEAN-MARIE"},5,13,1,22,12,14,11,7,10,9,2,11,1,18,14,11]
[{"$f":"'Tableau Tournante'!B14","v":"MARIE"},6,4,16,10,17,15,5,16,4,5,6,7,4,17,13,2]
[{"$f":"'Tableau Tournante'!B15","v":"MICHEL"},20,7,3,9,13,9,3,6,19,13,18,12,15,3,19,21]
[{"$f":"'Tableau Tournante'!B16","v":"MARC"},12,21,18,14,20,21,10,19,1,14,8,3,7,8,20,16]
[{"$f":"'Tableau Tournante'!B17","v":"MARCEL"},null,2,19,null,null,4,8,null,null,17,21,null,null,5,9]
[{"$f":"'Tableau Tournante'!B18","v":"JACQUES"}]
[{"$f":"'Tableau Tournante'!B19","v":"LUCIEN"}]
[{"$f":"'Tableau Tournante'!B20","v":"TONI"}]
[{"$f":"'Tableau Tournante'!B21","v":"CYRILLE"}]
[{"$f":"'Tableau Tournante'!B22","v":"AIME"}]
[{"$f":"'Tableau Tournante'!B23","v":"GEORGES"}]
[{"$f":"'Tableau Tournante'!B24","v":0}]
[{"$f":"'Tableau Tournante'!B25","v":0}]
[{"$f":"'Tableau Tournante'!B26","v":0}]
[{"$f":"'Tableau Tournante'!B27","v":0}]
[{"$f":"'Tableau Tournante'!B28","v":0}]
[{"$f":"'Tableau Tournante'!B29","v":0}]
[{"$f":"'Tableau Tournante'!B30","v":0}]
[{"$f":"'Tableau Tournante'!B31","v":0}]
[{"$f":"'Tableau Tournante'!B32","v":0}]
[{"$f":"'Tableau Tournante'!B33","v":0}]
[{"$f":"'Tableau Tournante'!B34","v":0}]
[{"$f":"'Tableau Tournante'!B35","v":0}]
[{"$f":"'Tableau Tournante'!B36","v":0}]
[{"$f":"'Tableau Tournante'!B37","v":0}]
[{"$f":"'Tableau Tournante'!B38","v":0}]
[{"$f":"'Tableau Tournante'!B39","v":0}]
[{"$f":"'Tableau Tournante'!B40","v":0}]
[{"$f":"'Tableau Tournante'!B41","v":0}]
[{"$f":"'Tableau Tournante'!B42","v":0}]
[{"$f":"'Tableau Tournante'!B43","v":0}]
[{"$f":"'Tableau Tournante'!B44","v":0}]
[{"$f":"'Tableau Tournante'!B45","v":0}]
[{"$f":"'Tableau Tournante'!B46","v":0}]
[{"$f":"'Tableau Tournante'!B47","v":0}]
[{"$f":"'Tableau Tournante'!B48","v":0}]
[{"$f":"'Tableau Tournante'!B49","v":0}]
[{"$f":"'Tableau Tournante'!B50","v":0}]
[{"$f":"'Tableau Tournante'!B51","v":0}]
[{"$f":"'Tableau Tournante'!B52","v":0}]
[{"$f":"'Tableau Tournante'!B53","v":0}]
[{"$f":"'Tableau Tournante'!B54","v":0}]
[{"$f":"'Tableau Tournante'!B55","v":0}]
[{"$f":"'Tableau Tournante'!B56","v":0}]
[{"$f":"'Tableau Tournante'!B57","v":0}]
[{"$f":"'Tableau Tournante'!B58","v":0}]
[{"$f":"'Tableau Tournante'!B59","v":0}]
[{"$f":"'Tableau Tournante'!B60","v":0}]
[{"$f":"'Tableau Tournante'!B61","v":0}]
[{"$f":"'Tableau Tournante'!B62","v":0}]
[{"$f":"'Tableau Tournante'!B63","v":0}]
[{"$f":"'Tableau Tournante'!B64","v":0}]
[{"$f":"'Tableau Tournante'!B65","v":0}]
[{"$f":"'Tableau Tournante'!B66","v":0}]
[{"$f":"'Tableau Tournante'!B67","v":0}]
[{"$f":"'Tableau Tournante'!B68","v":0}]
[{"$f":"'Tableau Tournante'!B69","v":0}]
[{"$f":"'Tableau Tournante'!B70","v":0}]
[{"$f":"'Tableau Tournante'!B71","v":0}]
[{"$f":"'Tableau Tournante'!B72","v":0}]
[{"$f":"'Tableau Tournante'!B73","v":0}]
[{"$f":"'Tableau Tournante'!B74","v":0}]
[{"$f":"'Tableau Tournante'!B75","v":0}]
[{"$f":"'Tableau Tournante'!B76","v":0}]
[{"$f":"'Tableau Tournante'!B77","v":0}]
[{"$f":"'Tableau Tournante'!B78","v":0}]
[{"$f":"'Tableau Tournante'!B79","v":0}]
[{"$f":"'Tableau Tournante'!B80","v":0}]
[{"$f":"'Tableau Tournante'!B81","v":0}]
[{"$f":"'Tableau Tournante'!B82","v":0}]
[{"$f":"'Tableau Tournante'!B83","v":0}]
[{"$f":"'Tableau Tournante'!B84","v":0}]
[{"$f":"'Tableau Tournante'!B85","v":0}]
[{"$f":"'Tableau Tournante'!B86","v":0}]
[{"$f":"'Tableau Tournante'!B87","v":0}]
[{"$f":"'Tableau Tournante'!B88","v":0}]
[{"$f":"'Tableau Tournante'!B89","v":0}]
[{"$f":"'Tableau Tournante'!B90","v":0}]
[{"$f":"'Tableau Tournante'!B91","v":0}]
[{"$f":"'Tableau Tournante'!B92","v":0}]
[{"$f":"'Tableau Tournante'!B93","v":0}]
[{"$f":"'Tableau Tournante'!B94","v":0}]
[{"$f":"'Tableau Tournante'!B95","v":0}]
[{"$f":"'Tableau Tournante'!B96","v":0}]
[{"$f":"'Tableau Tournante'!B97","v":0}]
[{"$f":"'Tableau Tournante'!B98","v":0}]
[{"$f":"'Tableau Tournante'!B99","v":0}]
[{"$f":"'Tableau Tournante'!B100","v":0}]
[{"$f":"'Tableau Tournante'!B101","v":0}]
[{"$f":"'Tableau Tournante'!B102","v":0}]
[{"$f":"'Tableau Tournante'!B103","v":0}]
[{"$f":"'Tableau Tournante'!B104","v":0}]
[{"$f":"'Tableau Tournante'!B105","v":0}]
[{"$f":"'Tableau Tournante'!B106","v":0}]
[{"$f":"'Tableau Tournante'!B107","v":0}]
[{"$f":"'Tableau Tournante'!B108","v":0}]
[{"$f":"'Tableau Tournante'!B109","v":0}]
[{"$f":"'Tableau Tournante'!B110","v":0}]
[{"$f":"'Tableau Tournante'!B111","v":0}]
[{"$f":"'Tableau Tournante'!B112","v":0}]
[{"$f":"'Tableau Tournante'!B113","v":0}]
[{"$f":"'Tableau Tournante'!B114","v":0}]
[{"$f":"'Tableau Tournante'!B115","v":0}]
[{"$f":"'Tableau Tournante'!B116","v":0}]
[{"$f":"'Tableau Tournante'!B117","v":0}]
[{"$f":"'Tableau Tournante'!B118","v":0}]
[{"$f":"'Tableau Tournante'!B119","v":0}]
[{"$f":"'Tableau Tournante'!B120","v":0}]
[{"$f":"'Tableau Tournante'!B121","v":0}]
[{"$f":"'Tableau Tournante'!B122","v":0}]
[{"$f":"'Tableau Tournante'!B123","v":0}]
[{"$f":"'Tableau Tournante'!B124","v":0}]
[{"$f":"'Tableau Tournante'!B125","v":0}]
[{"$f":"'Tableau Tournante'!B126","v":0}]
[{"$f":"'Tableau Tournante'!B127","v":0}]
[{"$f":"'Tableau Tournante'!B128","v":0}]
[{"$f":"'Tableau Tournante'!B129","v":0}]
[{"$f":"'Tableau Tournante'!B130","v":0}]
[{"$f":"'Tableau Tournante'!B131","v":0}]
[{"$f":"'Tableau Tournante'!B132","v":0}]
[{"$f":"'Tableau Tournante'!B133","v":0}]
[{"$f":"'Tableau Tournante'!B134","v":0}]
[{"$f":"'Tableau Tournante'!B135","v":0}]
[{"$f":"'Tableau Tournante'!B136","v":0}]
[{"$f":"'Tableau Tournante'!B137","v":0}]
[{"$f":"'Tableau Tournante'!B138","v":0}]
[{"$f":"'Tableau Tournante'!B139","v":0}]
[{"$f":"'Tableau Tournante'!B140","v":0}]
[{"$f":"'Tableau Tournante'!B141","v":0}]
[{"$f":"'Tableau Tournante'!B142","v":0}]
[{"$f":"'Tableau Tournante'!B143","v":0}]
[{"$f":"'Tableau Tournante'!B144","v":0}]
[{"$f":"'Tableau Tournante'!B145","v":0}]
[{"$f":"'Tableau Tournante'!B146","v":0}]
[{"$f":"'Tableau Tournante'!B147","v":0}]
[{"$f":"'Tableau Tournante'!B148","v":0}]
[{"$f":"'Tableau Tournante'!B149","v":0}]
[{"$f":"'Tableau Tournante'!B150","v":0}]
[{"$f":"'Tableau Tournante'!B151","v":0}]
[{"$f":"'Tableau Tournante'!B152","v":0}]
[{"$f":"'Tableau Tournante'!B153","v":0}]
[{"$f":"'Tableau Tournante'!B154","v":0}]
[{"$f":"'Tableau Tournante'!B155","v":0}]
[{"$f":"'Tableau Tournante'!B156","v":0}]
[{"$f":"'Tableau Tournante'!B157","v":0}]
[{"$f":"'Tableau Tournante'!B158","v":0}]
[{"$f":"'Tableau Tournante'!B159","v":0}]
[{"$f":"'Tableau Tournante'!B160","v":0}]
[{"$f":"'Tableau Tournante'!B161","v":0}]
[{"$f":"'Tableau Tournante'!B162","v":0}]
[{"$f":"'Tableau Tournante'!B163","v":0}]
[{"$f":"'Tableau Tournante'!B164","v":0}]
[{"$f":"'Tableau Tournante'!B165","v":0}]
[{"$f":"'Tableau Tournante'!B166","v":0}]
[{"$f":"'Tableau Tournante'!B167","v":0}]
[{"$f":"'Tableau Tournante'!B168","v":0}]
[{"$f":"'Tableau Tournante'!B169","v":0}]
[{"$f":"'Tableau Tournante'!B170","v":0}]
[{"$f":"'Tableau Tournante'!B171","v":0}]
[{"$f":"'Tableau Tournante'!B172","v":0}]
[{"$f":"'Tableau Tournante'!B173","v":0}]
[{"$f":"'Tableau Tournante'!B174","v":0}]
[{"$f":"'Tableau Tournante'!B175","v":0}]
[{"$f":"'Tableau Tournante'!B176","v":0}]
[{"$f":"'Tableau Tournante'!B177","v":0}]
[{"$f":"'Tableau Tournante'!B178","v":0}]
[{"$f":"'Tableau Tournante'!B179","v":0}]
[{"$f":"'Tableau Tournante'!B180","v":0}]
[{"$f":"'Tableau Tournante'!B181","v":0}]
[{"$f":"'Tableau Tournante'!B182","v":0}]
[{"$f":"'Tableau Tournante'!B183","v":0}]
[{"$f":"'Tableau Tournante'!B184","v":0}]
[{"$f":"'Tableau Tournante'!B185","v":0}]
[{"$f":"'Tableau Tournante'!B186","v":0}]
[{"$f":"'Tableau Tournante'!B187","v":0}]
[{"$f":"'Tableau Tournante'!B188","v":0}]
[{"$f":"'Tableau Tournante'!B189","v":0}]
[{"$f":"'Tableau Tournante'!B190","v":0}]
[{"$f":"'Tableau Tournante'!B191","v":0}]
[{"$f":"'Tableau Tournante'!B192","v":0}]
[{"$f":"'Tableau Tournante'!B193","v":0}]
[{"$f":"'Tableau Tournante'!B194","v":0}]
[{"$f":"'Tableau Tournante'!B195","v":0}]
[{"$f":"'Tableau Tournante'!B196","v":0}]
[{"$f":"'Tableau Tournante'!B197","v":0}]

{"sheet":"Tournois 1 contre 1","index":4,"n_rows":1143,"n_cols":9,"rows_kept":1143,"cut":false,"hidden":false,"merged":[]}
[{"$f":"'Tournois 2 contre 2'!A:A","v":"ALAIN"},"Tournois 1 contre 1, et ne se rencontrent jamais 2 fois."]
[{"$f":"'Tournois 2 contre 2'!A:A","v":"FRANCOIS"}]
[{"$f":"'Tournois 2 contre 2'!A:A","v":"SERGE"},null,{"$f":"'Tableau Tournante'!C1:D1","v":18},"joueurs",null,4,"manches"]
[{"$f":"'Tournois 2 contre 2'!A:A","v":"YVES"}]
[{"$f":"'Tournois 2 contre 2'!A:A","v":"VERO"},12,16,18,3,8,15,6,16]
[{"$f":"'Tournois 2 contre 2'!A:A","v":"ANTOINE"},9,5,7,16,14,7,2,18]
[{"$f":"'Tournois 2 contre 2'!A:A","v":"JEAN"},7,15,12,11,18,4,14,13]
[{"$f":"'Tournois 2 contre 2'!A:A","v":"JEAN-MARIE"},10,1,15,9,11,2,4,12]
[{"$f":"'Tournois 2 contre 2'!A:A","v":"MARIE"},6,18,5,4,12,5,8,11]
[{"$f":"'Tournois 2 contre 2'!A:A","v":"MICHEL"},13,11,17,6,9,13,10,3]
[{"$f":"'Tournois 2 contre 2'!A:A","v":"MARC"},14,17,13,10,1,16,7,5]
[{"$f":"'Tournois 2 contre 2'!A:A","v":"MARCEL"},2,3,14,8,17,10,9,17]
[{"$f":"'Tournois 2 contre 2'!A:A","v":"JACQUES"},4,8,1,2,6,3,15,1]
[{"$f":"'Tournois 2 contre 2'!A:A","v":"LUCIEN"}]
[{"$f":"'Tournois 2 contre 2'!A:A","v":"TONI"}]
[{"$f":"'Tournois 2 contre 2'!A:A","v":"CYRILLE"}]
[{"$f":"'Tournois 2 contre 2'!A:A","v":"AIME"}]
[{"$f":"'Tournois 2 contre 2'!A:A","v":"GEORGES"}]
[{"$f":"'Tournois 2 contre 2'!A:A","v":0}]
[{"$f":"'Tournois 2 contre 2'!A:A","v":0}]
[{"$f":"'Tournois 2 contre 2'!A:A","v":0}]
[{"$f":"'Tournois 2 contre 2'!A:A","v":0}]
[{"$f":"'Tournois 2 contre 2'!A:A","v":0}]
[{"$f":"'Tournois 2 contre 2'!A:A","v":0}]
[{"$f":"'Tournois 2 contre 2'!A:A","v":0}]
[{"$f":"'Tournois 2 contre 2'!A:A","v":0}]
[{"$f":"'Tournois 2 contre 2'!A:A","v":0}]
[{"$f":"'Tournois 2 contre 2'!A:A","v":0}]
[{"$f":"'Tournois 2 contre 2'!A:A","v":0}]
[{"$f":"'Tournois 2 contre 2'!A:A","v":0}]
[{"$f":"'Tournois 2 contre 2'!A:A","v":0}]
[{"$f":"'Tournois 2 contre 2'!A:A","v":0}]
[{"$f":"'Tournois 2 contre 2'!A:A","v":0}]
[{"$f":"'Tournois 2 contre 2'!A:A","v":0}]
[{"$f":"'Tournois 2 contre 2'!A:A","v":0}]
[{"$f":"'Tournois 2 contre 2'!A:A","v":0}]
[{"$f":"'Tournois 2 contre 2'!A:A","v":0}]
[{"$f":"'Tournois 2 contre 2'!A:A","v":0}]
[{"$f":"'Tournois 2 contre 2'!A:A","v":0}]
[{"$f":"'Tournois 2 contre 2'!A:A","v":0}]
[{"$f":"'Tournois 2 contre 2'!A:A","v":0}]
[{"$f":"'Tournois 2 contre 2'!A:A","v":0}]
[{"$f":"'Tournois 2 contre 2'!A:A","v":0}]
[{"$f":"'Tournois 2 contre 2'!A:A","v":0}]
[{"$f":"'Tournois 2 contre 2'!A:A","v":0}]
[{"$f":"'Tournois 2 contre 2'!A:A","v":0}]
[{"$f":"'Tournois 2 contre 2'!A:A","v":0}]
[{"$f":"'Tournois 2 contre 2'!A:A","v":0}]
[{"$f":"'Tournois 2 contre 2'!A:A","v":0}]
[{"$f":"'Tournois 2 contre 2'!A:A","v":0}]
[{"$f":"'Tournois 2 contre 2'!A:A","v":0}]
[{"$f":"'Tournois 2 contre 2'!A:A","v":0}]
[{"$f":"'Tournois 2 contre 2'!A:A","v":0}]
[{"$f":"'Tournois 2 contre 2'!A:A","v":0}]
[{"$f":"'Tournois 2 contre 2'!A:A","v":0}]
[{"$f":"'Tournois 2 contre 2'!A:A","v":0}]
[{"$f":"'Tournois 2 contre 2'!A:A","v":0}]
[{"$f":"'Tournois 2 contre 2'!A:A","v":0}]
[{"$f":"'Tournois 2 contre 2'!A:A","v":0}]
[{"$f":"'Tournois 2 contre 2'!A:A","v":0}]
[{"$f":"'Tournois 2 contre 2'!A:A","v":0}]
[{"$f":"'Tournois 2 contre 2'!A:A","v":0}]
[{"$f":"'Tournois 2 contre 2'!A:A","v":0}]
[{"$f":"'Tournois 2 contre 2'!A:A","v":0}]
[{"$f":"'Tournois 2 contre 2'!A:A","v":0}]
[{"$f":"'Tournois 2 contre 2'!A:A","v":0}]
[{"$f":"'Tournois 2 contre 2'!A:A","v":0}]
[{"$f":"'Tournois 2 contre 2'!A:A","v":0}]
[{"$f":"'Tournois 2 contre 2'!A:A","v":0}]
[{"$f":"'Tournois 2 contre 2'!A:A","v":0}]
[{"$f":"'Tournois 2 contre 2'!A:A","v":0}]
[{"$f":"'Tournois 2 contre 2'!A:A","v":0}]
[{"$f":"'Tournois 2 contre 2'!A:A","v":0}]
[{"$f":"'Tournois 2 contre 2'!A:A","v":0}]
[{"$f":"'Tournois 2 contre 2'!A:A","v":0}]
[{"$f":"'Tournois 2 contre 2'!A:A","v":0}]
[{"$f":"'Tournois 2 contre 2'!A:A","v":0}]
[{"$f":"'Tournois 2 contre 2'!A:A","v":0}]
[{"$f":"'Tournois 2 contre 2'!A:A","v":0}]
[{"$f":"'Tournois 2 contre 2'!A:A","v":0}]
[{"$f":"'Tournois 2 contre 2'!A:A","v":0}]
[{"$f":"'Tournois 2 contre 2'!A:A","v":0}]
[{"$f":"'Tournois 2 contre 2'!A:A","v":0}]
[{"$f":"'Tournois 2 contre 2'!A:A","v":0}]
[{"$f":"'Tournois 2 contre 2'!A:A","v":0}]
[{"$f":"'Tournois 2 contre 2'!A:A","v":0}]
[{"$f":"'Tournois 2 contre 2'!A:A","v":0}]
[{"$f":"'Tournois 2 contre 2'!A:A","v":0}]
[{"$f":"'Tournois 2 contre 2'!A:A","v":0}]
[{"$f":"'Tournois 2 contre 2'!A:A","v":0}]
[{"$f":"'Tournois 2 contre 2'!A:A","v":0}]
[{"$f":"'Tournois 2 contre 2'!A:A","v":0}]
[{"$f":"'Tournois 2 contre 2'!A:A","v":0}]
[{"$f":"'Tournois 2 contre 2'!A:A","v":0}]
[{"$f":"'Tournois 2 contre 2'!A:A","v":0}]
[{"$f":"'Tournois 2 contre 2'!A:A","v":0}]
[{"$f":"'Tournois 2 contre 2'!A:A","v":0}]
[{"$f":"'Tournois 2 contre 2'!A:A","v":0}]
[{"$f":"'Tournois 2 contre 2'!A:A","v":0}]
[{"$f":"'Tournois 2 contre 2'!A:A","v":0}]
[{"$f":"'Tournois 2 contre 2'!A:A","v":0}]
[{"$f":"'Tournois 2 contre 2'!A:A","v":0}]
[{"$f":"'Tournois 2 contre 2'!A:A","v":0}]
[{"$f":"'Tournois 2 contre 2'!A:A","v":0}]
[{"$f":"'Tournois 2 contre 2'!A:A","v":0}]
[{"$f":"'Tournois 2 contre 2'!A:A","v":0}]
[{"$f":"'Tournois 2 contre 2'!A:A","v":0}]
[{"$f":"'Tournois 2 contre 2'!A:A","v":0}]
[{"$f":"'Tournois 2 contre 2'!A:A","v":0}]
[{"$f":"'Tournois 2 contre 2'!A:A","v":0}]
[{"$f":"'Tournois 2 contre 2'!A:A","v":0}]
[{"$f":"'Tournois 2 contre 2'!A:A","v":0}]
[{"$f":"'Tournois 2 contre 2'!A:A","v":0}]
[{"$f":"'Tournois 2 contre 2'!A:A","v":0}]
[{"$f":"'Tournois 2 contre 2'!A:A","v":0}]
[{"$f":"'Tournois 2 contre 2'!A:A","v":0}]
[{"$f":"'Tournois 2 contre 2'!A:A","v":0}]
[{"$f":"'Tournois 2 contre 2'!A:A","v":0}]
[{"$f":"'Tournois 2 contre 2'!A:A","v":0}]
[{"$f":"'Tournois 2 contre 2'!A:A","v":0}]
[{"$f":"'Tournois 2 contre 2'!A:A","v":0}]
[{"$f":"'Tournois 2 contre 2'!A:A","v":0}]
[{"$f":"'Tournois 2 contre 2'!A:A","v":0}]
[{"$f":"'Tournois 2 contre 2'!A:A","v":0}]
[{"$f":"'Tournois 2 contre 2'!A:A","v":0}]
[{"$f":"'Tournois 2 contre 2'!A:A","v":0}]
[{"$f":"'Tournois 2 contre 2'!A:A","v":0}]
[{"$f":"'Tournois 2 contre 2'!A:A","v":0}]
[{"$f":"'Tournois 2 contre 2'!A:A","v":0}]
[{"$f":"'Tournois 2 contre 2'!A:A","v":0}]
[{"$f":"'Tournois 2 contre 2'!A:A","v":0}]
[{"$f":"'Tournois 2 contre 2'!A:A","v":0}]
[{"$f":"'Tournois 2 contre 2'!A:A","v":0}]
[{"$f":"'Tournois 2 contre 2'!A:A","v":0}]
[{"$f":"'Tournois 2 contre 2'!A:A","v":0}]
[{"$f":"'Tournois 2 contre 2'!A:A","v":0}]
[{"$f":"'Tournois 2 contre 2'!A:A","v":0}]
[{"$f":"'Tournois 2 contre 2'!A:A","v":0}]
[{"$f":"'Tournois 2 contre 2'!A:A","v":0}]
[{"$f":"'Tournois 2 contre 2'!A:A","v":0}]
[{"$f":"'Tournois 2 contre 2'!A:A","v":0}]
[{"$f":"'Tournois 2 contre 2'!A:A","v":0}]
[{"$f":"'Tournois 2 contre 2'!A:A","v":0}]
[{"$f":"'Tournois 2 contre 2'!A:A","v":0}]
[{"$f":"'Tournois 2 contre 2'!A:A","v":0}]
[{"$f":"'Tournois 2 contre 2'!A:A","v":0}]
[{"$f":"'Tournois 2 contre 2'!A:A","v":0}]
[{"$f":"'Tournois 2 contre 2'!A:A","v":0}]
[{"$f":"'Tournois 2 contre 2'!A:A","v":0}]
[{"$f":"'Tournois 2 contre 2'!A:A","v":0}]
[{"$f":"'Tournois 2 contre 2'!A:A","v":0}]
[{"$f":"'Tournois 2 contre 2'!A:A","v":0}]
[{"$f":"'Tournois 2 contre 2'!A:A","v":0}]
[{"$f":"'Tournois 2 contre 2'!A:A","v":0}]
[{"$f":"'Tournois 2 contre 2'!A:A","v":0}]
[{"$f":"'Tournois 2 contre 2'!A:A","v":0}]
[{"$f":"'Tournois 2 contre 2'!A:A","v":0}]
[{"$f":"'Tournois 2 contre 2'!A:A","v":0}]
[{"$f":"'Tournois 2 contre 2'!A:A","v":0}]
[{"$f":"'Tournois 2 contre 2'!A:A","v":0}]
[{"$f":"'Tournois 2 contre 2'!A:A","v":0}]
[{"$f":"'Tournois 2 contre 2'!A:A","v":0}]
[{"$f":"'Tournois 2 contre 2'!A:A","v":0}]
[{"$f":"'Tournois 2 contre 2'!A:A","v":0}]
[{"$f":"'Tournois 2 contre 2'!A:A","v":0}]
[{"$f":"'Tournois 2 contre 2'!A:A","v":0}]
[{"$f":"'Tournois 2 contre 2'!A:A","v":0}]
[{"$f":"'Tournois 2 contre 2'!A:A","v":0}]
[{"$f":"'Tournois 2 contre 2'!A:A","v":0}]
[{"$f":"'Tournois 2 contre 2'!A:A","v":0}]
[{"$f":"'Tournois 2 contre 2'!A:A","v":0}]
[{"$f":"'Tournois 2 contre 2'!A:A","v":0}]
[{"$f":"'Tournois 2 contre 2'!A:A","v":0}]
[{"$f":"'Tournois 2 contre 2'!A:A","v":0}]
[{"$f":"'Tournois 2 contre 2'!A:A","v":0}]
[{"$f":"'Tournois 2 contre 2'!A:A","v":0}]
[{"$f":"'Tournois 2 contre 2'!A:A","v":0}]
[{"$f":"'Tournois 2 contre 2'!A:A","v":0}]
[{"$f":"'Tournois 2 contre 2'!A:A","v":0}]
[{"$f":"'Tournois 2 contre 2'!A:A","v":0}]
[{"$f":"'Tournois 2 contre 2'!A:A","v":0}]
[{"$f":"'Tournois 2 contre 2'!A:A","v":0}]
[{"$f":"'Tournois 2 contre 2'!A:A","v":0}]
[{"$f":"'Tournois 2 contre 2'!A:A","v":0}]
[{"$f":"'Tournois 2 contre 2'!A:A","v":0}]
[{"$f":"'Tournois 2 contre 2'!A:A","v":0}]
[{"$f":"'Tournois 2 contre 2'!A:A","v":0}]
[{"$f":"'Tournois 2 contre 2'!A:A","v":0}]
[{"$f":"'Tournois 2 contre 2'!A:A","v":0}]
[{"$f":"'Tournois 2 contre 2'!A:A","v":0}]
[{"$f":"'Tournois 2 contre 2'!A:A","v":0}]
[{"$f":"'Tournois 2 contre 2'!A:A","v":0}]
[{"$f":"'Tournois 2 contre 2'!A:A","v":0}]
[{"$f":"'Tournois 2 contre 2'!A:A","v":0}]
[{"$f":"'Tournois 2 contre 2'!A:A","v":0}]
[{"$f":"'Tournois 2 contre 2'!A:A","v":0}]
[{"$f":"'Tournois 2 contre 2'!A:A","v":0}]
[{"$f":"'Tournois 2 contre 2'!A:A","v":0}]
[{"$f":"'Tournois 2 contre 2'!A:A","v":0}]
[{"$f":"'Tournois 2 contre 2'!A:A","v":0}]
[{"$f":"'Tournois 2 contre 2'!A:A","v":0}]
[{"$f":"'Tournois 2 contre 2'!A:A","v":0}]
[{"$f":"'Tournois 2 contre 2'!A:A","v":0}]
[{"$f":"'Tournois 2 contre 2'!A:A","v":0}]
[{"$f":"'Tournois 2 contre 2'!A:A","v":0}]
[{"$f":"'Tournois 2 contre 2'!A:A","v":0}]
[{"$f":"'Tournois 2 contre 2'!A:A","v":0}]
[{"$f":"'Tournois 2 contre 2'!A:A","v":0}]
[{"$f":"'Tournois 2 contre 2'!A:A","v":0}]
[{"$f":"'Tournois 2 contre 2'!A:A","v":0}]
[{"$f":"'Tournois 2 contre 2'!A:A","v":0}]
[{"$f":"'Tournois 2 contre 2'!A:A","v":0}]
[{"$f":"'Tournois 2 contre 2'!A:A","v":0}]
[{"$f":"'Tournois 2 contre 2'!A:A","v":0}]
[{"$f":"'Tournois 2 contre 2'!A:A","v":0}]
[{"$f":"'Tournois 2 contre 2'!A:A","v":0}]
[{"$f":"'Tournois 2 contre 2'!A:A","v":0}]
[{"$f":"'Tournois 2 contre 2'!A:A","v":0}]
[{"$f":"'Tournois 2 contre 2'!A:A","v":0}]
[{"$f":"'Tournois 2 contre 2'!A:A","v":0}]
[{"$f":"'Tournois 2 contre 2'!A:A","v":0}]
[{"$f":"'Tournois 2 contre 2'!A:A","v":0}]
[{"$f":"'Tournois 2 contre 2'!A:A","v":0}]
[{"$f":"'Tournois 2 contre 2'!A:A","v":0}]
[{"$f":"'Tournois 2 contre 2'!A:A","v":0}]
[{"$f":"'Tournois 2 contre 2'!A:A","v":0}]
[{"$f":"'Tournois 2 contre 2'!A:A","v":0}]
[{"$f":"'Tournois 2 contre 2'!A:A","v":0}]
[{"$f":"'Tournois 2 contre 2'!A:A","v":0}]
[{"$f":"'Tournois 2 contre 2'!A:A","v":0}]
[{"$f":"'Tournois 2 contre 2'!A:A","v":0}]
[{"$f":"'Tournois 2 contre 2'!A:A","v":0}]
[{"$f":"'Tournois 2 contre 2'!A:A","v":0}]
[{"$f":"'Tournois 2 contre 2'!A:A","v":0}]
[{"$f":"'Tournois 2 contre 2'!A:A","v":0}]
[{"$f":"'Tournois 2 contre 2'!A:A","v":0}]
[{"$f":"'Tournois 2 contre 2'!A:A","v":0}]
[{"$f":"'Tournois 2 contre 2'!A:A","v":0}]
[{"$f":"'Tournois 2 contre 2'!A:A","v":0}]
[{"$f":"'Tournois 2 contre 2'!A:A","v":0}]
[{"$f":"'Tournois 2 contre 2'!A:A","v":0}]
[{"$f":"'Tournois 2 contre 2'!A:A","v":0}]
[{"$f":"'Tournois 2 contre 2'!A:A","v":0}]
[{"$f":"'Tournois 2 contre 2'!A:A","v":0}]
[{"$f":"'Tournois 2 contre 2'!A:A","v":0}]
[{"$f":"'Tournois 2 contre 2'!A:A","v":0}]
[{"$f":"'Tournois 2 contre 2'!A:A","v":0}]
[{"$f":"'Tournois 2 contre 2'!A:A","v":0}]
[{"$f":"'Tournois 2 contre 2'!A:A","v":0}]
[{"$f":"'Tournois 2 contre 2'!A:A","v":0}]
[{"$f":"'Tournois 2 contre 2'!A:A","v":0}]
[{"$f":"'Tournois 2 contre 2'!A:A","v":0}]
[{"$f":"'Tournois 2 contre 2'!A:A","v":0}]
[{"$f":"'Tournois 2 contre 2'!A:A","v":0}]
[{"$f":"'Tournois 2 contre 2'!A:A","v":0}]
[{"$f":"'Tournois 2 contre 2'!A:A","v":0}]
[{"$f":"'Tournois 2 contre 2'!A:A","v":0}]
[{"$f":"'Tournois 2 contre 2'!A:A","v":0}]
[{"$f":"'Tournois 2 contre 2'!A:A","v":0}]
[{"$f":"'Tournois 2 contre 2'!A:A","v":0}]
[{"$f":"'Tournois 2 contre 2'!A:A","v":0}]
[{"$f":"'Tournois 2 contre 2'!A:A","v":0}]
[{"$f":"'Tournois 2 contre 2'!A:A","v":0}]
[{"$f":"'Tournois 2 contre 2'!A:A","v":0}]
[{"$f":"'Tournois 2 contre 2'!A:A","v":0}]
[{"$f":"'Tournois 2 contre 2'!A:A","v":0}]
[{"$f":"'Tournois 2 contre 2'!A:A","v":0}]
[{"$f":"'Tournois 2 contre 2'!A:A","v":0}]
[{"$f":"'Tournois 2 contre 2'!A:A","v":0}]
[{"$f":"'Tournois 2 contre 2'!A:A","v":0}]
[{"$f":"'Tournois 2 contre 2'!A:A","v":0}]
[{"$f":"'Tournois 2 contre 2'!A:A","v":0}]
[{"$f":"'Tournois 2 contre 2'!A:A","v":0}]
[{"$f":"'Tournois 2 contre 2'!A:A","v":0}]
[{"$f":"'Tournois 2 contre 2'!A:A","v":0}]
[{"$f":"'Tournois 2 contre 2'!A:A","v":0}]
[{"$f":"'Tournois 2 contre 2'!A:A","v":0}]
[{"$f":"'Tournois 2 contre 2'!A:A","v":0}]
[{"$f":"'Tournois 2 contre 2'!A:A","v":0}]
[{"$f":"'Tournois 2 contre 2'!A:A","v":0}]
[{"$f":"'Tournois 2 contre 2'!A:A","v":0}]
[{"$f":"'Tournois 2 contre 2'!A:A","v":0}]
[{"$f":"'Tournois 2 contre 2'!A:A","v":0}]
[{"$f":"'Tournois 2 contre 2'!A:A","v":0}]
[{"$f":"'Tournois 2 contre 2'!A:A","v":0}]
[{"$f":"'Tournois 2 contre 2'!A:A","v":0}]
[{"$f":"'Tournois 2 contre 2'!A:A","v":0}]
[{"$f":"'Tournois 2 contre 2'!A:A","v":0}]
[{"$f":"'Tournois 2 contre 2'!A:A","v":0}]
[{"$f":"'Tournois 2 contre 2'!A:A","v":0}]
[{"$f":"'Tournois 2 contre 2'!A:A","v":0}]
[{"$f":"'Tournois 2 contre 2'!A:A","v":0}]
[{"$f":"'Tournois 2 contre 2'!A:A","v":0}]
[{"$f":"'Tournois 2 contre 2'!A:A","v":0}]
[{"$f":"'Tournois 2 contre 2'!A:A","v":0}]
[{"$f":"'Tournois 2 contre 2'!A:A","v":0}]
[{"$f":"'Tournois 2 contre 2'!A:A","v":0}]
[{"$f":"'Tournois 2 contre 2'!A:A","v":0}]
[{"$f":"'Tournois 2 contre 2'!A:A","v":0}]
[{"$f":"'Tournois 2 contre 2'!A:A","v":0}]
[{"$f":"'Tournois 2 contre 2'!A:A","v":0}]
[{"$f":"'Tournois 2 contre 2'!A:A","v":0}]
[{"$f":"'Tournois 2 contre 2'!A:A","v":0}]
[{"$f":"'Tournois 2 contre 2'!A:A","v":0}]
[{"$f":"'Tournois 2 contre 2'!A:A","v":0}]
[{"$f":"'Tournois 2 contre 2'!A:A","v":0}]
[{"$f":"'Tournois 2 contre 2'!A:A","v":0}]
[{"$f":"'Tournois 2 contre 2'!A:A","v":0}]
[{"$f":"'Tournois 2 contre 2'!A:A","v":0}]
[{"$f":"'Tournois 2 contre 2'!A:A","v":0}]
[{"$f":"'Tournois 2 contre 2'!A:A","v":0}]
[{"$f":"'Tournois 2 contre 2'!A:A","v":0}]
[{"$f":"'Tournois 2 contre 2'!A:A","v":0}]
[{"$f":"'Tournois 2 contre 2'!A:A","v":0}]
[{"$f":"'Tournois 2 contre 2'!A:A","v":0}]
[{"$f":"'Tournois 2 contre 2'!A:A","v":0}]
[{"$f":"'Tournois 2 contre 2'!A:A","v":0}]
[{"$f":"'Tournois 2 contre 2'!A:A","v":0}]
[{"$f":"'Tournois 2 contre 2'!A:A","v":0}]
[{"$f":"'Tournois 2 contre 2'!A:A","v":0}]
[{"$f":"'Tournois 2 contre 2'!A:A","v":0}]
[{"$f":"'Tournois 2 contre 2'!A:A","v":0}]
[{"$f":"'Tournois 2 contre 2'!A:A","v":0}]
[{"$f":"'Tournois 2 contre 2'!A:A","v":0}]
[{"$f":"'Tournois 2 contre 2'!A:A","v":0}]
[{"$f":"'Tournois 2 contre 2'!A:A","v":0}]
[{"$f":"'Tournois 2 contre 2'!A:A","v":0}]
[{"$f":"'Tournois 2 contre 2'!A:A","v":0}]
[{"$f":"'Tournois 2 contre 2'!A:A","v":0}]
[{"$f":"'Tournois 2 contre 2'!A:A","v":0}]
[{"$f":"'Tournois 2 contre 2'!A:A","v":0}]
[{"$f":"'Tournois 2 contre 2'!A:A","v":0}]
[{"$f":"'Tournois 2 contre 2'!A:A","v":0}]
[{"$f":"'Tournois 2 contre 2'!A:A","v":0}]
[{"$f":"'Tournois 2 contre 2'!A:A","v":0}]
[{"$f":"'Tournois 2 contre 2'!A:A","v":0}]
[{"$f":"'Tournois 2 contre 2'!A:A","v":0}]
[{"$f":"'Tournois 2 contre 2'!A:A","v":0}]
[{"$f":"'Tournois 2 contre 2'!A:A","v":0}]
[{"$f":"'Tournois 2 contre 2'!A:A","v":0}]
[{"$f":"'Tournois 2 contre 2'!A:A","v":0}]
[{"$f":"'Tournois 2 contre 2'!A:A","v":0}]
[{"$f":"'Tournois 2 contre 2'!A:A","v":0}]
[{"$f":"'Tournois 2 contre 2'!A:A","v":0}]
[{"$f":"'Tournois 2 contre 2'!A:A","v":0}]
[{"$f":"'Tournois 2 contre 2'!A:A","v":0}]
[{"$f":"'Tournois 2 contre 2'!A:A","v":0}]
[{"$f":"'Tournois 2 contre 2'!A:A","v":0}]
[{"$f":"'Tournois 2 contre 2'!A:A","v":0}]
[{"$f":"'Tournois 2 contre 2'!A:A","v":0}]
[{"$f":"'Tournois 2 contre 2'!A:A","v":0}]
[{"$f":"'Tournois 2 contre 2'!A:A","v":0}]
[{"$f":"'Tournois 2 contre 2'!A:A","v":0}]
[{"$f":"'Tournois 2 contre 2'!A:A","v":0}]
[{"$f":"'Tournois 2 contre 2'!A:A","v":0}]
[{"$f":"'Tournois 2 contre 2'!A:A","v":0}]
[{"$f":"'Tournois 2 contre 2'!A:A","v":0}]
[{"$f":"'Tournois 2 contre 2'!A:A","v":0}]
[{"$f":"'Tournois 2 contre 2'!A:A","v":0}]
[{"$f":"'Tournois 2 contre 2'!A:A","v":0}]
[{"$f":"'Tournois 2 contre 2'!A:A","v":0}]
[{"$f":"'Tournois 2 contre 2'!A:A","v":0}]
[{"$f":"'Tournois 2 contre 2'!A:A","v":0}]
[{"$f":"'Tournois 2 contre 2'!A:A","v":0}]
[{"$f":"'Tournois 2 contre 2'!A:A","v":0}]
[{"$f":"'Tournois 2 contre 2'!A:A","v":0}]
[{"$f":"'Tournois 2 contre 2'!A:A","v":0}]
[{"$f":"'Tournois 2 contre 2'!A:A","v":0}]
[{"$f":"'Tournois 2 contre 2'!A:A","v":0}]
[{"$f":"'Tournois 2 contre 2'!A:A","v":0}]
[{"$f":"'Tournois 2 contre 2'!A:A","v":0}]
[{"$f":"'Tournois 2 contre 2'!A:A","v":0}]
[{"$f":"'Tournois 2 contre 2'!A:A","v":0}]
[{"$f":"'Tournois 2 contre 2'!A:A","v":0}]
[{"$f":"'Tournois 2 contre 2'!A:A","v":0}]
[{"$f":"'Tournois 2 contre 2'!A:A","v":0}]
[{"$f":"'Tournois 2 contre 2'!A:A","v":0}]
[{"$f":"'Tournois 2 contre 2'!A:A","v":0}]
[{"$f":"'Tournois 2 contre 2'!A:A","v":0}]
[{"$f":"'Tournois 2 contre 2'!A:A","v":0}]
[{"$f":"'Tournois 2 contre 2'!A:A","v":0}]
[{"$f":"'Tournois 2 contre 2'!A:A","v":0}]
[{"$f":"'Tournois 2 contre 2'!A:A","v":0}]
[{"$f":"'Tournois 2 contre 2'!A:A","v":0}]
[{"$f":"'Tournois 2 contre 2'!A:A","v":0}]
[{"$f":"'Tournois 2 contre 2'!A:A","v":0}]
[{"$f":"'Tournois 2 contre 2'!A:A","v":0}]
[{"$f":"'Tournois 2 contre 2'!A:A","v":0}]
[{"$f":"'Tournois 2 contre 2'!A:A","v":0}]
[{"$f":"'Tournois 2 contre 2'!A:A","v":0}]
[{"$f":"'Tournois 2 contre 2'!A:A","v":0}]
[{"$f":"'Tournois 2 contre 2'!A:A","v":0}]
[{"$f":"'Tournois 2 contre 2'!A:A","v":0}]
[{"$f":"'Tournois 2 contre 2'!A:A","v":0}]
[{"$f":"'Tournois 2 contre 2'!A:A","v":0}]
[{"$f":"'Tournois 2 contre 2'!A:A","v":0}]
[{"$f":"'Tournois 2 contre 2'!A:A","v":0}]
[{"$f":"'Tournois 2 contre 2'!A:A","v":0}]
[{"$f":"'Tournois 2 contre 2'!A:A","v":0}]
[{"$f":"'Tournois 2 contre 2'!A:A","v":0}]
[{"$f":"'Tournois 2 contre 2'!A:A","v":0}]
[{"$f":"'Tournois 2 contre 2'!A:A","v":0}]
[{"$f":"'Tournois 2 contre 2'!A:A","v":0}]
[{"$f":"'Tournois 2 contre 2'!A:A","v":0}]
[{"$f":"'Tournois 2 contre 2'!A:A","v":0}]
[{"$f":"'Tournois 2 contre 2'!A:A","v":0}]
[{"$f":"'Tournois 2 contre 2'!A:A","v":0}]
[{"$f":"'Tournois 2 contre 2'!A:A","v":0}]
[{"$f":"'Tournois 2 contre 2'!A:A","v":0}]
[{"$f":"'Tournois 2 contre 2'!A:A","v":0}]
[{"$f":"'Tournois 2 contre 2'!A:A","v":0}]
[{"$f":"'Tournois 2 contre 2'!A:A","v":0}]
[{"$f":"'Tournois 2 contre 2'!A:A","v":0}]
[{"$f":"'Tournois 2 contre 2'!A:A","v":0}]
[{"$f":"'Tournois 2 contre 2'!A:A","v":0}]
[{"$f":"'Tournois 2 contre 2'!A:A","v":0}]
[{"$f":"'Tournois 2 contre 2'!A:A","v":0}]
[{"$f":"'Tournois 2 contre 2'!A:A","v":0}]
[{"$f":"'Tournois 2 contre 2'!A:A","v":0}]
[{"$f":"'Tournois 2 contre 2'!A:A","v":0}]
[{"$f":"'Tournois 2 contre 2'!A:A","v":0}]
[{"$f":"'Tournois 2 contre 2'!A:A","v":0}]
[{"$f":"'Tournois 2 contre 2'!A:A","v":0}]
[{"$f":"'Tournois 2 contre 2'!A:A","v":0}]
[{"$f":"'Tournois 2 contre 2'!A:A","v":0}]
[{"$f":"'Tournois 2 contre 2'!A:A","v":0}]
[{"$f":"'Tournois 2 contre 2'!A:A","v":0}]
[{"$f":"'Tournois 2 contre 2'!A:A","v":0}]
[{"$f":"'Tournois 2 contre 2'!A:A","v":0}]
[{"$f":"'Tournois 2 contre 2'!A:A","v":0}]
[{"$f":"'Tournois 2 contre 2'!A:A","v":0}]
[{"$f":"'Tournois 2 contre 2'!A:A","v":0}]
[{"$f":"'Tournois 2 contre 2'!A:A","v":0}]
[{"$f":"'Tournois 2 contre 2'!A:A","v":0}]
[{"$f":"'Tournois 2 contre 2'!A:A","v":0}]
[{"$f":"'Tournois 2 contre 2'!A:A","v":0}]
[{"$f":"'Tournois 2 contre 2'!A:A","v":0}]
[{"$f":"'Tournois 2 contre 2'!A:A","v":0}]
[{"$f":"'Tournois 2 contre 2'!A:A","v":0}]
[{"$f":"'Tournois 2 contre 2'!A:A","v":0}]
[{"$f":"'Tournois 2 contre 2'!A:A","v":0}]
[{"$f":"'Tournois 2 contre 2'!A:A","v":0}]
[{"$f":"'Tournois 2 contre 2'!A:A","v":0}]
[{"$f":"'Tournois 2 contre 2'!A:A","v":0}]
[{"$f":"'Tournois 2 contre 2'!A:A","v":0}]
[{"$f":"'Tournois 2 contre 2'!A:A","v":0}]
[{"$f":"'Tournois 2 contre 2'!A:A","v":0}]
[{"$f":"'Tournois 2 contre 2'!A:A","v":0}]
[{"$f":"'Tournois 2 contre 2'!A:A","v":0}]
[{"$f":"'Tournois 2 contre 2'!A:A","v":0}]
[{"$f":"'Tournois 2 contre 2'!A:A","v":0}]
[{"$f":"'Tournois 2 contre 2'!A:A","v":0}]
[{"$f":"'Tournois 2 contre 2'!A:A","v":0}]
[{"$f":"'Tournois 2 contre 2'!A:A","v":0}]
[{"$f":"'Tournois 2 contre 2'!A:A","v":0}]
[{"$f":"'Tournois 2 contre 2'!A:A","v":0}]
[{"$f":"'Tournois 2 contre 2'!A:A","v":0}]
[{"$f":"'Tournois 2 contre 2'!A:A","v":0}]
[{"$f":"'Tournois 2 contre 2'!A:A","v":0}]
[{"$f":"'Tournois 2 contre 2'!A:A","v":0}]
[{"$f":"'Tournois 2 contre 2'!A:A","v":0}]
[{"$f":"'Tournois 2 contre 2'!A:A","v":0}]
[{"$f":"'Tournois 2 contre 2'!A:A","v":0}]
[{"$f":"'Tournois 2 contre 2'!A:A","v":0}]
[{"$f":"'Tournois 2 contre 2'!A:A","v":0}]
[{"$f":"'Tournois 2 contre 2'!A:A","v":0}]
[{"$f":"'Tournois 2 contre 2'!A:A","v":0}]
[{"$f":"'Tournois 2 contre 2'!A:A","v":0}]
[{"$f":"'Tournois 2 contre 2'!A:A","v":0}]
[{"$f":"'Tournois 2 contre 2'!A:A","v":0}]
[{"$f":"'Tournois 2 contre 2'!A:A","v":0}]
[{"$f":"'Tournois 2 contre 2'!A:A","v":0}]
[{"$f":"'Tournois 2 contre 2'!A:A","v":0}]
[{"$f":"'Tournois 2 contre 2'!A:A","v":0}]
[{"$f":"'Tournois 2 contre 2'!A:A","v":0}]
[{"$f":"'Tournois 2 contre 2'!A:A","v":0}]
[{"$f":"'Tournois 2 contre 2'!A:A","v":0}]
[{"$f":"'Tournois 2 contre 2'!A:A","v":0}]
[{"$f":"'Tournois 2 contre 2'!A:A","v":0}]
[{"$f":"'Tournois 2 contre 2'!A:A","v":0}]
[{"$f":"'Tournois 2 contre 2'!A:A","v":0}]
[{"$f":"'Tournois 2 contre 2'!A:A","v":0}]
[{"$f":"'Tournois 2 contre 2'!A:A","v":0}]
[{"$f":"'Tournois 2 contre 2'!A:A","v":0}]
[{"$f":"'Tournois 2 contre 2'!A:A","v":0}]
[{"$f":"'Tournois 2 contre 2'!A:A","v":0}]
[{"$f":"'Tournois 2 contre 2'!A:A","v":0}]
[{"$f":"'Tournois 2 contre 2'!A:A","v":0}]
[{"$f":"'Tournois 2 contre 2'!A:A","v":0}]
[{"$f":"'Tournois 2 contre 2'!A:A","v":0}]
[{"$f":"'Tournois 2 contre 2'!A:A","v":0}]
[{"$f":"'Tournois 2 contre 2'!A:A","v":0}]
[{"$f":"'Tournois 2 contre 2'!A:A","v":0}]
[{"$f":"'Tournois 2 contre 2'!A:A","v":0}]
[{"$f":"'Tournois 2 contre 2'!A:A","v":0}]
[{"$f":"'Tournois 2 contre 2'!A:A","v":0}]
[{"$f":"'Tournois 2 contre 2'!A:A","v":0}]
[{"$f":"'Tournois 2 contre 2'!A:A","v":0}]
[{"$f":"'Tournois 2 contre 2'!A:A","v":0}]
[{"$f":"'Tournois 2 contre 2'!A:A","v":0}]
[{"$f":"'Tournois 2 contre 2'!A:A","v":0}]
[{"$f":"'Tournois 2 contre 2'!A:A","v":0}]
[{"$f":"'Tournois 2 contre 2'!A:A","v":0}]
[{"$f":"'Tournois 2 contre 2'!A:A","v":0}]
[{"$f":"'Tournois 2 contre 2'!A:A","v":0}]
[{"$f":"'Tournois 2 contre 2'!A:A","v":0}]
[{"$f":"'Tournois 2 contre 2'!A:A","v":0}]
[{"$f":"'Tournois 2 contre 2'!A:A","v":0}]
[{"$f":"'Tournois 2 contre 2'!A:A","v":0}]
[{"$f":"'Tournois 2 contre 2'!A:A","v":0}]
[{"$f":"'Tournois 2 contre 2'!A:A","v":0}]
[{"$f":"'Tournois 2 contre 2'!A:A","v":0}]
[{"$f":"'Tournois 2 contre 2'!A:A","v":0}]
[{"$f":"'Tournois 2 contre 2'!A:A","v":0}]
[{"$f":"'Tournois 2 contre 2'!A:A","v":0}]
[{"$f":"'Tournois 2 contre 2'!A:A","v":0}]
[{"$f":"'Tournois 2 contre 2'!A:A","v":0}]
[{"$f":"'Tournois 2 contre 2'!A:A","v":0}]
[{"$f":"'Tournois 2 contre 2'!A:A","v":0}]
[{"$f":"'Tournois 2 contre 2'!A:A","v":0}]
[{"$f":"'Tournois 2 contre 2'!A:A","v":0}]
[{"$f":"'Tournois 2 contre 2'!A:A","v":0}]
[{"$f":"'Tournois 2 contre 2'!A:A","v":0}]
[{"$f":"'Tournois 2 contre 2'!A:A","v":0}]
[{"$f":"'Tournois 2 contre 2'!A:A","v":0}]
[{"$f":"'Tournois 2 contre 2'!A:A","v":0}]
[{"$f":"'Tournois 2 contre 2'!A:A","v":0}]
[{"$f":"'Tournois 2 contre 2'!A:A","v":0}]
[{"$f":"'Tournois 2 contre 2'!A:A","v":0}]
[{"$f":"'Tournois 2 contre 2'!A:A","v":0}]
[{"$f":"'Tournois 2 contre 2'!A:A","v":0}]
[{"$f":"'Tournois 2 contre 2'!A:A","v":0}]
[{"$f":"'Tournois 2 contre 2'!A:A","v":0}]
[{"$f":"'Tournois 2 contre 2'!A:A","v":0}]
[{"$f":"'Tournois 2 contre 2'!A:A","v":0}]
[{"$f":"'Tournois 2 contre 2'!A:A","v":0}]
[{"$f":"'Tournois 2 contre 2'!A:A","v":0}]
[{"$f":"'Tournois 2 contre 2'!A:A","v":0}]
[{"$f":"'Tournois 2 contre 2'!A:A","v":0}]
[{"$f":"'Tournois 2 contre 2'!A:A","v":0}]
[{"$f":"'Tournois 2 contre 2'!A:A","v":0}]
[{"$f":"'Tournois 2 contre 2'!A:A","v":0}]
[{"$f":"'Tournois 2 contre 2'!A:A","v":0}]
[{"$f":"'Tournois 2 contre 2'!A:A","v":0}]
[{"$f":"'Tournois 2 contre 2'!A:A","v":0}]
[{"$f":"'Tournois 2 contre 2'!A:A","v":0}]
[{"$f":"'Tournois 2 contre 2'!A:A","v":0}]
[{"$f":"'Tournois 2 contre 2'!A:A","v":0}]
[{"$f":"'Tournois 2 contre 2'!A:A","v":0}]
[{"$f":"'Tournois 2 contre 2'!A:A","v":0}]
[{"$f":"'Tournois 2 contre 2'!A:A","v":0}]
[{"$f":"'Tournois 2 contre 2'!A:A","v":0}]
[{"$f":"'Tournois 2 contre 2'!A:A","v":0}]
[{"$f":"'Tournois 2 contre 2'!A:A","v":0}]
[{"$f":"'Tournois 2 contre 2'!A:A","v":0}]
[{"$f":"'Tournois 2 contre 2'!A:A","v":0}]
[{"$f":"'Tournois 2 contre 2'!A:A","v":0}]
[{"$f":"'Tournois 2 contre 2'!A:A","v":0}]
[{"$f":"'Tournois 2 contre 2'!A:A","v":0}]
[{"$f":"'Tournois 2 contre 2'!A:A","v":0}]
[{"$f":"'Tournois 2 contre 2'!A:A","v":0}]
[{"$f":"'Tournois 2 contre 2'!A:A","v":0}]
[{"$f":"'Tournois 2 contre 2'!A:A","v":0}]
[{"$f":"'Tournois 2 contre 2'!A:A","v":0}]
[{"$f":"'Tournois 2 contre 2'!A:A","v":0}]
[{"$f":"'Tournois 2 contre 2'!A:A","v":0}]
[{"$f":"'Tournois 2 contre 2'!A:A","v":0}]
[{"$f":"'Tournois 2 contre 2'!A:A","v":0}]
[{"$f":"'Tournois 2 contre 2'!A:A","v":0}]
[{"$f":"'Tournois 2 contre 2'!A:A","v":0}]
[{"$f":"'Tournois 2 contre 2'!A:A","v":0}]
[{"$f":"'Tournois 2 contre 2'!A:A","v":0}]
[{"$f":"'Tournois 2 contre 2'!A:A","v":0}]
[{"$f":"'Tournois 2 contre 2'!A:A","v":0}]
[{"$f":"'Tournois 2 contre 2'!A:A","v":0}]
[{"$f":"'Tournois 2 contre 2'!A:A","v":0}]
[{"$f":"'Tournois 2 contre 2'!A:A","v":0}]
[{"$f":"'Tournois 2 contre 2'!A:A","v":0}]
[{"$f":"'Tournois 2 contre 2'!A:A","v":0}]
[{"$f":"'Tournois 2 contre 2'!A:A","v":0}]
[{"$f":"'Tournois 2 contre 2'!A:A","v":0}]
[{"$f":"'Tournois 2 contre 2'!A:A","v":0}]
[{"$f":"'Tournois 2 contre 2'!A:A","v":0}]
[{"$f":"'Tournois 2 contre 2'!A:A","v":0}]
[{"$f":"'Tournois 2 contre 2'!A:A","v":0}]
[{"$f":"'Tournois 2 contre 2'!A:A","v":0}]
[{"$f":"'Tournois 2 contre 2'!A:A","v":0}]
[{"$f":"'Tournois 2 contre 2'!A:A","v":0}]
[{"$f":"'Tournois 2 contre 2'!A:A","v":0}]
[{"$f":"'Tournois 2 contre 2'!A:A","v":0}]
[{"$f":"'Tournois 2 contre 2'!A:A","v":0}]
[{"$f":"'Tournois 2 contre 2'!A:A","v":0}]
[{"$f":"'Tournois 2 contre 2'!A:A","v":0}]
[{"$f":"'Tournois 2 contre 2'!A:A","v":0}]
[{"$f":"'Tournois 2 contre 2'!A:A","v":0}]
[{"$f":"'Tournois 2 contre 2'!A:A","v":0}]
[{"$f":"'Tournois 2 contre 2'!A:A","v":0}]
[{"$f":"'Tournois 2 contre 2'!A:A","v":0}]
[{"$f":"'Tournois 2 contre 2'!A:A","v":0}]
[{"$f":"'Tournois 2 contre 2'!A:A","v":0}]
[{"$f":"'Tournois 2 contre 2'!A:A","v":0}]
[{"$f":"'Tournois 2 contre 2'!A:A","v":0}]
[{"$f":"'Tournois 2 contre 2'!A:A","v":0}]
[{"$f":"'Tournois 2 contre 2'!A:A","v":0}]
[{"$f":"'Tournois 2 contre 2'!A:A","v":0}]
[{"$f":"'Tournois 2 contre 2'!A:A","v":0}]
[{"$f":"'Tournois 2 contre 2'!A:A","v":0}]
[{"$f":"'Tournois 2 contre 2'!A:A","v":0}]
[{"$f":"'Tournois 2 contre 2'!A:A","v":0}]
[{"$f":"'Tournois 2 contre 2'!A:A","v":0}]
[{"$f":"'Tournois 2 contre 2'!A:A","v":0}]
[{"$f":"'Tournois 2 contre 2'!A:A","v":0}]
[{"$f":"'Tournois 2 contre 2'!A:A","v":0}]
[{"$f":"'Tournois 2 contre 2'!A:A","v":0}]
[{"$f":"'Tournois 2 contre 2'!A:A","v":0}]
[{"$f":"'Tournois 2 contre 2'!A:A","v":0}]
[{"$f":"'Tournois 2 contre 2'!A:A","v":0}]
[{"$f":"'Tournois 2 contre 2'!A:A","v":0}]
[{"$f":"'Tournois 2 contre 2'!A:A","v":0}]
[{"$f":"'Tournois 2 contre 2'!A:A","v":0}]
[{"$f":"'Tournois 2 contre 2'!A:A","v":0}]
[{"$f":"'Tournois 2 contre 2'!A:A","v":0}]
[{"$f":"'Tournois 2 contre 2'!A:A","v":0}]
[{"$f":"'Tournois 2 contre 2'!A:A","v":0}]
[{"$f":"'Tournois 2 contre 2'!A:A","v":0}]
[{"$f":"'Tournois 2 contre 2'!A:A","v":0}]
[{"$f":"'Tournois 2 contre 2'!A:A","v":0}]
[{"$f":"'Tournois 2 contre 2'!A:A","v":0}]
[{"$f":"'Tournois 2 contre 2'!A:A","v":0}]
[{"$f":"'Tournois 2 contre 2'!A:A","v":0}]
[{"$f":"'Tournois 2 contre 2'!A:A","v":0}]
[{"$f":"'Tournois 2 contre 2'!A:A","v":0}]
[{"$f":"'Tournois 2 contre 2'!A:A","v":0}]
[{"$f":"'Tournois 2 contre 2'!A:A","v":0}]
[{"$f":"'Tournois 2 contre 2'!A:A","v":0}]
[{"$f":"'Tournois 2 contre 2'!A:A","v":0}]
[{"$f":"'Tournois 2 contre 2'!A:A","v":0}]
[{"$f":"'Tournois 2 contre 2'!A:A","v":0}]
[{"$f":"'Tournois 2 contre 2'!A:A","v":0}]
[{"$f":"'Tournois 2 contre 2'!A:A","v":0}]
[{"$f":"'Tournois 2 contre 2'!A:A","v":0}]
[{"$f":"'Tournois 2 contre 2'!A:A","v":0}]
[{"$f":"'Tournois 2 contre 2'!A:A","v":0}]
[{"$f":"'Tournois 2 contre 2'!A:A","v":0}]
[{"$f":"'Tournois 2 contre 2'!A:A","v":0}]
[{"$f":"'Tournois 2 contre 2'!A:A","v":0}]
[{"$f":"'Tournois 2 contre 2'!A:A","v":0}]
[{"$f":"'Tournois 2 contre 2'!A:A","v":0}]
[{"$f":"'Tournois 2 contre 2'!A:A","v":0}]
[{"$f":"'Tournois 2 contre 2'!A:A","v":0}]
[{"$f":"'Tournois 2 contre 2'!A:A","v":0}]
[{"$f":"'Tournois 2 contre 2'!A:A","v":0}]
[{"$f":"'Tournois 2 contre 2'!A:A","v":0}]
[{"$f":"'Tournois 2 contre 2'!A:A","v":0}]
[{"$f":"'Tournois 2 contre 2'!A:A","v":0}]
[{"$f":"'Tournois 2 contre 2'!A:A","v":0}]
[{"$f":"'Tournois 2 contre 2'!A:A","v":0}]
[{"$f":"'Tournois 2 contre 2'!A:A","v":0}]
[{"$f":"'Tournois 2 contre 2'!A:A","v":0}]
[{"$f":"'Tournois 2 contre 2'!A:A","v":0}]
[{"$f":"'Tournois 2 contre 2'!A:A","v":0}]
[{"$f":"'Tournois 2 contre 2'!A:A","v":0}]
[{"$f":"'Tournois 2 contre 2'!A:A","v":0}]
[{"$f":"'Tournois 2 contre 2'!A:A","v":0}]
[{"$f":"'Tournois 2 contre 2'!A:A","v":0}]
[{"$f":"'Tournois 2 contre 2'!A:A","v":0}]
[{"$f":"'Tournois 2 contre 2'!A:A","v":0}]
[{"$f":"'Tournois 2 contre 2'!A:A","v":0}]
[{"$f":"'Tournois 2 contre 2'!A:A","v":0}]
[{"$f":"'Tournois 2 contre 2'!A:A","v":0}]
[{"$f":"'Tournois 2 contre 2'!A:A","v":0}]
[{"$f":"'Tournois 2 contre 2'!A:A","v":0}]
[{"$f":"'Tournois 2 contre 2'!A:A","v":0}]
[{"$f":"'Tournois 2 contre 2'!A:A","v":0}]
[{"$f":"'Tournois 2 contre 2'!A:A","v":0}]
[{"$f":"'Tournois 2 contre 2'!A:A","v":0}]
[{"$f":"'Tournois 2 contre 2'!A:A","v":0}]
[{"$f":"'Tournois 2 contre 2'!A:A","v":0}]
[{"$f":"'Tournois 2 contre 2'!A:A","v":0}]
[{"$f":"'Tournois 2 contre 2'!A:A","v":0}]
[{"$f":"'Tournois 2 contre 2'!A:A","v":0}]
[{"$f":"'Tournois 2 contre 2'!A:A","v":0}]
[{"$f":"'Tournois 2 contre 2'!A:A","v":0}]
[{"$f":"'Tournois 2 contre 2'!A:A","v":0}]
[{"$f":"'Tournois 2 contre 2'!A:A","v":0}]
[{"$f":"'Tournois 2 contre 2'!A:A","v":0}]
[{"$f":"'Tournois 2 contre 2'!A:A","v":0}]
[{"$f":"'Tournois 2 contre 2'!A:A","v":0}]
[{"$f":"'Tournois 2 contre 2'!A:A","v":0}]
[{"$f":"'Tournois 2 contre 2'!A:A","v":0}]
[{"$f":"'Tournois 2 contre 2'!A:A","v":0}]
[{"$f":"'Tournois 2 contre 2'!A:A","v":0}]
[{"$f":"'Tournois 2 contre 2'!A:A","v":0}]
[{"$f":"'Tournois 2 contre 2'!A:A","v":0}]
[{"$f":"'Tournois 2 contre 2'!A:A","v":0}]
[{"$f":"'Tournois 2 contre 2'!A:A","v":0}]
[{"$f":"'Tournois 2 contre 2'!A:A","v":0}]
[{"$f":"'Tournois 2 contre 2'!A:A","v":0}]
[{"$f":"'Tournois 2 contre 2'!A:A","v":0}]
[{"$f":"'Tournois 2 contre 2'!A:A","v":0}]
[{"$f":"'Tournois 2 contre 2'!A:A","v":0}]
[{"$f":"'Tournois 2 contre 2'!A:A","v":0}]
[{"$f":"'Tournois 2 contre 2'!A:A","v":0}]
[{"$f":"'Tournois 2 contre 2'!A:A","v":0}]
[{"$f":"'Tournois 2 contre 2'!A:A","v":0}]
[{"$f":"'Tournois 2 contre 2'!A:A","v":0}]
[{"$f":"'Tournois 2 contre 2'!A:A","v":0}]
[{"$f":"'Tournois 2 contre 2'!A:A","v":0}]
[{"$f":"'Tournois 2 contre 2'!A:A","v":0}]
[{"$f":"'Tournois 2 contre 2'!A:A","v":0}]
[{"$f":"'Tournois 2 contre 2'!A:A","v":0}]
[{"$f":"'Tournois 2 contre 2'!A:A","v":0}]
[{"$f":"'Tournois 2 contre 2'!A:A","v":0}]
[{"$f":"'Tournois 2 contre 2'!A:A","v":0}]
[{"$f":"'Tournois 2 contre 2'!A:A","v":0}]
[{"$f":"'Tournois 2 contre 2'!A:A","v":0}]
[{"$f":"'Tournois 2 contre 2'!A:A","v":0}]
[{"$f":"'Tournois 2 contre 2'!A:A","v":0}]
[{"$f":"'Tournois 2 contre 2'!A:A","v":0}]
[{"$f":"'Tournois 2 contre 2'!A:A","v":0}]
[{"$f":"'Tournois 2 contre 2'!A:A","v":0}]
[{"$f":"'Tournois 2 contre 2'!A:A","v":0}]
[{"$f":"'Tournois 2 contre 2'!A:A","v":0}]
[{"$f":"'Tournois 2 contre 2'!A:A","v":0}]
[{"$f":"'Tournois 2 contre 2'!A:A","v":0}]
[{"$f":"'Tournois 2 contre 2'!A:A","v":0}]
[{"$f":"'Tournois 2 contre 2'!A:A","v":0}]
[{"$f":"'Tournois 2 contre 2'!A:A","v":0}]
[{"$f":"'Tournois 2 contre 2'!A:A","v":0}]
[{"$f":"'Tournois 2 contre 2'!A:A","v":0}]
[{"$f":"'Tournois 2 contre 2'!A:A","v":0}]
[{"$f":"'Tournois 2 contre 2'!A:A","v":0}]
[{"$f":"'Tournois 2 contre 2'!A:A","v":0}]
[{"$f":"'Tournois 2 contre 2'!A:A","v":0}]
[{"$f":"'Tournois 2 contre 2'!A:A","v":0}]
[{"$f":"'Tournois 2 contre 2'!A:A","v":0}]
[{"$f":"'Tournois 2 contre 2'!A:A","v":0}]
[{"$f":"'Tournois 2 contre 2'!A:A","v":0}]
[{"$f":"'Tournois 2 contre 2'!A:A","v":0}]
[{"$f":"'Tournois 2 contre 2'!A:A","v":0}]
[{"$f":"'Tournois 2 contre 2'!A:A","v":0}]
[{"$f":"'Tournois 2 contre 2'!A:A","v":0}]
[{"$f":"'Tournois 2 contre 2'!A:A","v":0}]
[{"$f":"'Tournois 2 contre 2'!A:A","v":0}]
[{"$f":"'Tournois 2 contre 2'!A:A","v":0}]
[{"$f":"'Tournois 2 contre 2'!A:A","v":0}]
[{"$f":"'Tournois 2 contre 2'!A:A","v":0}]
[{"$f":"'Tournois 2 contre 2'!A:A","v":0}]
[{"$f":"'Tournois 2 contre 2'!A:A","v":0}]
[{"$f":"'Tournois 2 contre 2'!A:A","v":0}]
[{"$f":"'Tournois 2 contre 2'!A:A","v":0}]
[{"$f":"'Tournois 2 contre 2'!A:A","v":0}]
[{"$f":"'Tournois 2 contre 2'!A:A","v":0}]
[{"$f":"'Tournois 2 contre 2'!A:A","v":0}]
[{"$f":"'Tournois 2 contre 2'!A:A","v":0}]
[{"$f":"'Tournois 2 contre 2'!A:A","v":0}]
[{"$f":"'Tournois 2 contre 2'!A:A","v":0}]
[{"$f":"'Tournois 2 contre 2'!A:A","v":0}]
[{"$f":"'Tournois 2 contre 2'!A:A","v":0}]
[{"$f":"'Tournois 2 contre 2'!A:A","v":0}]
[{"$f":"'Tournois 2 contre 2'!A:A","v":0}]
[{"$f":"'Tournois 2 contre 2'!A:A","v":0}]
[{"$f":"'Tournois 2 contre 2'!A:A","v":0}]
[{"$f":"'Tournois 2 contre 2'!A:A","v":0}]
[{"$f":"'Tournois 2 contre 2'!A:A","v":0}]
[{"$f":"'Tournois 2 contre 2'!A:A","v":0}]
[{"$f":"'Tournois 2 contre 2'!A:A","v":0}]
[{"$f":"'Tournois 2 contre 2'!A:A","v":0}]
[{"$f":"'Tournois 2 contre 2'!A:A","v":0}]
[{"$f":"'Tournois 2 contre 2'!A:A","v":0}]
[{"$f":"'Tournois 2 contre 2'!A:A","v":0}]
[{"$f":"'Tournois 2 contre 2'!A:A","v":0}]
[{"$f":"'Tournois 2 contre 2'!A:A","v":0}]
[{"$f":"'Tournois 2 contre 2'!A:A","v":0}]
[{"$f":"'Tournois 2 contre 2'!A:A","v":0}]
[{"$f":"'Tournois 2 contre 2'!A:A","v":0}]
[{"$f":"'Tournois 2 contre 2'!A:A","v":0}]
[{"$f":"'Tournois 2 contre 2'!A:A","v":0}]
[{"$f":"'Tournois 2 contre 2'!A:A","v":0}]
[{"$f":"'Tournois 2 contre 2'!A:A","v":0}]
[{"$f":"'Tournois 2 contre 2'!A:A","v":0}]
[{"$f":"'Tournois 2 contre 2'!A:A","v":0}]
[{"$f":"'Tournois 2 contre 2'!A:A","v":0}]
[{"$f":"'Tournois 2 contre 2'!A:A","v":0}]
[{"$f":"'Tournois 2 contre 2'!A:A","v":0}]
[{"$f":"'Tournois 2 contre 2'!A:A","v":0}]
[{"$f":"'Tournois 2 contre 2'!A:A","v":0}]
[{"$f":"'Tournois 2 contre 2'!A:A","v":0}]
[{"$f":"'Tournois 2 contre 2'!A:A","v":0}]
[{"$f":"'Tournois 2 contre 2'!A:A","v":0}]
[{"$f":"'Tournois 2 contre 2'!A:A","v":0}]
[{"$f":"'Tournois 2 contre 2'!A:A","v":0}]
[{"$f":"'Tournois 2 contre 2'!A:A","v":0}]
[{"$f":"'Tournois 2 contre 2'!A:A","v":0}]
[{"$f":"'Tournois 2 contre 2'!A:A","v":0}]
[{"$f":"'Tournois 2 contre 2'!A:A","v":0}]
[{"$f":"'Tournois 2 contre 2'!A:A","v":0}]
[{"$f":"'Tournois 2 contre 2'!A:A","v":0}]
[{"$f":"'Tournois 2 contre 2'!A:A","v":0}]
[{"$f":"'Tournois 2 contre 2'!A:A","v":0}]
[{"$f":"'Tournois 2 contre 2'!A:A","v":0}]
[{"$f":"'Tournois 2 contre 2'!A:A","v":0}]
[{"$f":"'Tournois 2 contre 2'!A:A","v":0}]
[{"$f":"'Tournois 2 contre 2'!A:A","v":0}]
[{"$f":"'Tournois 2 contre 2'!A:A","v":0}]
[{"$f":"'Tournois 2 contre 2'!A:A","v":0}]
[{"$f":"'Tournois 2 contre 2'!A:A","v":0}]
[{"$f":"'Tournois 2 contre 2'!A:A","v":0}]
[{"$f":"'Tournois 2 contre 2'!A:A","v":0}]
[{"$f":"'Tournois 2 contre 2'!A:A","v":0}]
[{"$f":"'Tournois 2 contre 2'!A:A","v":0}]
[{"$f":"'Tournois 2 contre 2'!A:A","v":0}]
[{"$f":"'Tournois 2 contre 2'!A:A","v":0}]
[{"$f":"'Tournois 2 contre 2'!A:A","v":0}]
[{"$f":"'Tournois 2 contre 2'!A:A","v":0}]
[{"$f":"'Tournois 2 contre 2'!A:A","v":0}]
[{"$f":"'Tournois 2 contre 2'!A:A","v":0}]
[{"$f":"'Tournois 2 contre 2'!A:A","v":0}]
[{"$f":"'Tournois 2 contre 2'!A:A","v":0}]
[{"$f":"'Tournois 2 contre 2'!A:A","v":0}]
[{"$f":"'Tournois 2 contre 2'!A:A","v":0}]
[{"$f":"'Tournois 2 contre 2'!A:A","v":0}]
[{"$f":"'Tournois 2 contre 2'!A:A","v":0}]
[{"$f":"'Tournois 2 contre 2'!A:A","v":0}]
[{"$f":"'Tournois 2 contre 2'!A:A","v":0}]
[{"$f":"'Tournois 2 contre 2'!A:A","v":0}]
[{"$f":"'Tournois 2 contre 2'!A:A","v":0}]
[{"$f":"'Tournois 2 contre 2'!A:A","v":0}]
[{"$f":"'Tournois 2 contre 2'!A:A","v":0}]
[{"$f":"'Tournois 2 contre 2'!A:A","v":0}]
[{"$f":"'Tournois 2 contre 2'!A:A","v":0}]
[{"$f":"'Tournois 2 contre 2'!A:A","v":0}]
[{"$f":"'Tournois 2 contre 2'!A:A","v":0}]
[{"$f":"'Tournois 2 contre 2'!A:A","v":0}]
[{"$f":"'Tournois 2 contre 2'!A:A","v":0}]
[{"$f":"'Tournois 2 contre 2'!A:A","v":0}]
[{"$f":"'Tournois 2 contre 2'!A:A","v":0}]
[{"$f":"'Tournois 2 contre 2'!A:A","v":0}]
[{"$f":"'Tournois 2 contre 2'!A:A","v":0}]
[{"$f":"'Tournois 2 contre 2'!A:A","v":0}]
[{"$f":"'Tournois 2 contre 2'!A:A","v":0}]
[{"$f":"'Tournois 2 contre 2'!A:A","v":0}]
[{"$f":"'Tournois 2 contre 2'!A:A","v":0}]
[{"$f":"'Tournois 2 contre 2'!A:A","v":0}]
[{"$f":"'Tournois 2 contre 2'!A:A","v":0}]
[{"$f":"'Tournois 2 contre 2'!A:A","v":0}]
[{"$f":"'Tournois 2 contre 2'!A:A","v":0}]
[{"$f":"'Tournois 2 contre 2'!A:A","v":0}]
[{"$f":"'Tournois 2 contre 2'!A:A","v":0}]
[{"$f":"'Tournois 2 contre 2'!A:A","v":0}]
[{"$f":"'Tournois 2 contre 2'!A:A","v":0}]
[{"$f":"'Tournois 2 contre 2'!A:A","v":0}]
[{"$f":"'Tournois 2 contre 2'!A:A","v":0}]
[{"$f":"'Tournois 2 contre 2'!A:A","v":0}]
[{"$f":"'Tournois 2 contre 2'!A:A","v":0}]
[{"$f":"'Tournois 2 contre 2'!A:A","v":0}]
[{"$f":"'Tournois 2 contre 2'!A:A","v":0}]
[{"$f":"'Tournois 2 contre 2'!A:A","v":0}]
[{"$f":"'Tournois 2 contre 2'!A:A","v":0}]
[{"$f":"'Tournois 2 contre 2'!A:A","v":0}]
[{"$f":"'Tournois 2 contre 2'!A:A","v":0}]
[{"$f":"'Tournois 2 contre 2'!A:A","v":0}]
[{"$f":"'Tournois 2 contre 2'!A:A","v":0}]
[{"$f":"'Tournois 2 contre 2'!A:A","v":0}]
[{"$f":"'Tournois 2 contre 2'!A:A","v":0}]
[{"$f":"'Tournois 2 contre 2'!A:A","v":0}]
[{"$f":"'Tournois 2 contre 2'!A:A","v":0}]
[{"$f":"'Tournois 2 contre 2'!A:A","v":0}]
[{"$f":"'Tournois 2 contre 2'!A:A","v":0}]
[{"$f":"'Tournois 2 contre 2'!A:A","v":0}]
[{"$f":"'Tournois 2 contre 2'!A:A","v":0}]
[{"$f":"'Tournois 2 contre 2'!A:A","v":0}]
[{"$f":"'Tournois 2 contre 2'!A:A","v":0}]
[{"$f":"'Tournois 2 contre 2'!A:A","v":0}]
[{"$f":"'Tournois 2 contre 2'!A:A","v":0}]
[{"$f":"'Tournois 2 contre 2'!A:A","v":0}]
[{"$f":"'Tournois 2 contre 2'!A:A","v":0}]
[{"$f":"'Tournois 2 contre 2'!A:A","v":0}]
[{"$f":"'Tournois 2 contre 2'!A:A","v":0}]
[{"$f":"'Tournois 2 contre 2'!A:A","v":0}]
[{"$f":"'Tournois 2 contre 2'!A:A","v":0}]
[{"$f":"'Tournois 2 contre 2'!A:A","v":0}]
[{"$f":"'Tournois 2 contre 2'!A:A","v":0}]
[{"$f":"'Tournois 2 contre 2'!A:A","v":0}]
[{"$f":"'Tournois 2 contre 2'!A:A","v":0}]
[{"$f":"'Tournois 2 contre 2'!A:A","v":0}]
[{"$f":"'Tournois 2 contre 2'!A:A","v":0}]
[{"$f":"'Tournois 2 contre 2'!A:A","v":0}]
[{"$f":"'Tournois 2 contre 2'!A:A","v":0}]
[{"$f":"'Tournois 2 contre 2'!A:A","v":0}]
[{"$f":"'Tournois 2 contre 2'!A:A","v":0}]
[{"$f":"'Tournois 2 contre 2'!A:A","v":0}]
[{"$f":"'Tournois 2 contre 2'!A:A","v":0}]
[{"$f":"'Tournois 2 contre 2'!A:A","v":0}]
[{"$f":"'Tournois 2 contre 2'!A:A","v":0}]
[{"$f":"'Tournois 2 contre 2'!A:A","v":0}]
[{"$f":"'Tournois 2 contre 2'!A:A","v":0}]
[{"$f":"'Tournois 2 contre 2'!A:A","v":0}]
[{"$f":"'Tournois 2 contre 2'!A:A","v":0}]
[{"$f":"'Tournois 2 contre 2'!A:A","v":0}]
[{"$f":"'Tournois 2 contre 2'!A:A","v":0}]
[{"$f":"'Tournois 2 contre 2'!A:A","v":0}]
[{"$f":"'Tournois 2 contre 2'!A:A","v":0}]
[{"$f":"'Tournois 2 contre 2'!A:A","v":0}]
[{"$f":"'Tournois 2 contre 2'!A:A","v":0}]
[{"$f":"'Tournois 2 contre 2'!A:A","v":0}]
[{"$f":"'Tournois 2 contre 2'!A:A","v":0}]
[{"$f":"'Tournois 2 contre 2'!A:A","v":0}]
[{"$f":"'Tournois 2 contre 2'!A:A","v":0}]
[{"$f":"'Tournois 2 contre 2'!A:A","v":0}]
[{"$f":"'Tournois 2 contre 2'!A:A","v":0}]
[{"$f":"'Tournois 2 contre 2'!A:A","v":0}]
[{"$f":"'Tournois 2 contre 2'!A:A","v":0}]
[{"$f":"'Tournois 2 contre 2'!A:A","v":0}]
[{"$f":"'Tournois 2 contre 2'!A:A","v":0}]
[{"$f":"'Tournois 2 contre 2'!A:A","v":0}]
[{"$f":"'Tournois 2 contre 2'!A:A","v":0}]
[{"$f":"'Tournois 2 contre 2'!A:A","v":0}]
[{"$f":"'Tournois 2 contre 2'!A:A","v":0}]
[{"$f":"'Tournois 2 contre 2'!A:A","v":0}]
[{"$f":"'Tournois 2 contre 2'!A:A","v":0}]
[{"$f":"'Tournois 2 contre 2'!A:A","v":0}]
[{"$f":"'Tournois 2 contre 2'!A:A","v":0}]
[{"$f":"'Tournois 2 contre 2'!A:A","v":0}]
[{"$f":"'Tournois 2 contre 2'!A:A","v":0}]
[{"$f":"'Tournois 2 contre 2'!A:A","v":0}]
[{"$f":"'Tournois 2 contre 2'!A:A","v":0}]
[{"$f":"'Tournois 2 contre 2'!A:A","v":0}]
[{"$f":"'Tournois 2 contre 2'!A:A","v":0}]
[{"$f":"'Tournois 2 contre 2'!A:A","v":0}]
[{"$f":"'Tournois 2 contre 2'!A:A","v":0}]
[{"$f":"'Tournois 2 contre 2'!A:A","v":0}]
[{"$f":"'Tournois 2 contre 2'!A:A","v":0}]
[{"$f":"'Tournois 2 contre 2'!A:A","v":0}]
[{"$f":"'Tournois 2 contre 2'!A:A","v":0}]
[{"$f":"'Tournois 2 contre 2'!A:A","v":0}]
[{"$f":"'Tournois 2 contre 2'!A:A","v":0}]
[{"$f":"'Tournois 2 contre 2'!A:A","v":0}]
[{"$f":"'Tournois 2 contre 2'!A:A","v":0}]
[{"$f":"'Tournois 2 contre 2'!A:A","v":0}]
[{"$f":"'Tournois 2 contre 2'!A:A","v":0}]
[{"$f":"'Tournois 2 contre 2'!A:A","v":0}]
[{"$f":"'Tournois 2 contre 2'!A:A","v":0}]
[{"$f":"'Tournois 2 contre 2'!A:A","v":0}]
[{"$f":"'Tournois 2 contre 2'!A:A","v":0}]
[{"$f":"'Tournois 2 contre 2'!A:A","v":0}]
[{"$f":"'Tournois 2 contre 2'!A:A","v":0}]
[{"$f":"'Tournois 2 contre 2'!A:A","v":0}]
[{"$f":"'Tournois 2 contre 2'!A:A","v":0}]
[{"$f":"'Tournois 2 contre 2'!A:A","v":0}]
[{"$f":"'Tournois 2 contre 2'!A:A","v":0}]
[{"$f":"'Tournois 2 contre 2'!A:A","v":0}]
[{"$f":"'Tournois 2 contre 2'!A:A","v":0}]
[{"$f":"'Tournois 2 contre 2'!A:A","v":0}]
[{"$f":"'Tournois 2 contre 2'!A:A","v":0}]
[{"$f":"'Tournois 2 contre 2'!A:A","v":0}]
[{"$f":"'Tournois 2 contre 2'!A:A","v":0}]
[{"$f":"'Tournois 2 contre 2'!A:A","v":0}]
[{"$f":"'Tournois 2 contre 2'!A:A","v":0}]
[{"$f":"'Tournois 2 contre 2'!A:A","v":0}]
[{"$f":"'Tournois 2 contre 2'!A:A","v":0}]
[{"$f":"'Tournois 2 contre 2'!A:A","v":0}]
[{"$f":"'Tournois 2 contre 2'!A:A","v":0}]
[{"$f":"'Tournois 2 contre 2'!A:A","v":0}]
[{"$f":"'Tournois 2 contre 2'!A:A","v":0}]
[{"$f":"'Tournois 2 contre 2'!A:A","v":0}]
[{"$f":"'Tournois 2 contre 2'!A:A","v":0}]
[{"$f":"'Tournois 2 contre 2'!A:A","v":0}]
[{"$f":"'Tournois 2 contre 2'!A:A","v":0}]
[{"$f":"'Tournois 2 contre 2'!A:A","v":0}]
[{"$f":"'Tournois 2 contre 2'!A:A","v":0}]
[{"$f":"'Tournois 2 contre 2'!A:A","v":0}]
[{"$f":"'Tournois 2 contre 2'!A:A","v":0}]
[{"$f":"'Tournois 2 contre 2'!A:A","v":0}]
[{"$f":"'Tournois 2 contre 2'!A:A","v":0}]
[{"$f":"'Tournois 2 contre 2'!A:A","v":0}]
[{"$f":"'Tournois 2 contre 2'!A:A","v":0}]
[{"$f":"'Tournois 2 contre 2'!A:A","v":0}]
[{"$f":"'Tournois 2 contre 2'!A:A","v":0}]
[{"$f":"'Tournois 2 contre 2'!A:A","v":0}]
[{"$f":"'Tournois 2 contre 2'!A:A","v":0}]
[{"$f":"'Tournois 2 contre 2'!A:A","v":0}]
[{"$f":"'Tournois 2 contre 2'!A:A","v":0}]
[{"$f":"'Tournois 2 contre 2'!A:A","v":0}]
[{"$f":"'Tournois 2 contre 2'!A:A","v":0}]
[{"$f":"'Tournois 2 contre 2'!A:A","v":0}]
[{"$f":"'Tournois 2 contre 2'!A:A","v":0}]
[{"$f":"'Tournois 2 contre 2'!A:A","v":0}]
[{"$f":"'Tournois 2 contre 2'!A:A","v":0}]
[{"$f":"'Tournois 2 contre 2'!A:A","v":0}]
[{"$f":"'Tournois 2 contre 2'!A:A","v":0}]
[{"$f":"'Tournois 2 contre 2'!A:A","v":0}]
[{"$f":"'Tournois 2 contre 2'!A:A","v":0}]
[{"$f":"'Tournois 2 contre 2'!A:A","v":0}]
[{"$f":"'Tournois 2 contre 2'!A:A","v":0}]
[{"$f":"'Tournois 2 contre 2'!A:A","v":0}]
[{"$f":"'Tournois 2 contre 2'!A:A","v":0}]
[{"$f":"'Tournois 2 contre 2'!A:A","v":0}]
[{"$f":"'Tournois 2 contre 2'!A:A","v":0}]
[{"$f":"'Tournois 2 contre 2'!A:A","v":0}]
[{"$f":"'Tournois 2 contre 2'!A:A","v":0}]
[{"$f":"'Tournois 2 contre 2'!A:A","v":0}]
[{"$f":"'Tournois 2 contre 2'!A:A","v":0}]
[{"$f":"'Tournois 2 contre 2'!A:A","v":0}]
[{"$f":"'Tournois 2 contre 2'!A:A","v":0}]
[{"$f":"'Tournois 2 contre 2'!A:A","v":0}]
[{"$f":"'Tournois 2 contre 2'!A:A","v":0}]
[{"$f":"'Tournois 2 contre 2'!A:A","v":0}]
[{"$f":"'Tournois 2 contre 2'!A:A","v":0}]
[{"$f":"'Tournois 2 contre 2'!A:A","v":0}]
[{"$f":"'Tournois 2 contre 2'!A:A","v":0}]
[{"$f":"'Tournois 2 contre 2'!A:A","v":0}]
[{"$f":"'Tournois 2 contre 2'!A:A","v":0}]
[{"$f":"'Tournois 2 contre 2'!A:A","v":0}]
[{"$f":"'Tournois 2 contre 2'!A:A","v":0}]
[{"$f":"'Tournois 2 contre 2'!A:A","v":0}]
[{"$f":"'Tournois 2 contre 2'!A:A","v":0}]
[{"$f":"'Tournois 2 contre 2'!A:A","v":0}]
[{"$f":"'Tournois 2 contre 2'!A:A","v":0}]
[{"$f":"'Tournois 2 contre 2'!A:A","v":0}]
[{"$f":"'Tournois 2 contre 2'!A:A","v":0}]
[{"$f":"'Tournois 2 contre 2'!A:A","v":0}]
[{"$f":"'Tournois 2 contre 2'!A:A","v":0}]
[{"$f":"'Tournois 2 contre 2'!A:A","v":0}]
[{"$f":"'Tournois 2 contre 2'!A:A","v":0}]
[{"$f":"'Tournois 2 contre 2'!A:A","v":0}]
[{"$f":"'Tournois 2 contre 2'!A:A","v":0}]
[{"$f":"'Tournois 2 contre 2'!A:A","v":0}]
[{"$f":"'Tournois 2 contre 2'!A:A","v":0}]
[{"$f":"'Tournois 2 contre 2'!A:A","v":0}]
[{"$f":"'Tournois 2 contre 2'!A:A","v":0}]
[{"$f":"'Tournois 2 contre 2'!A:A","v":0}]
[{"$f":"'Tournois 2 contre 2'!A:A","v":0}]
[{"$f":"'Tournois 2 contre 2'!A:A","v":0}]
[{"$f":"'Tournois 2 contre 2'!A:A","v":0}]
[{"$f":"'Tournois 2 contre 2'!A:A","v":0}]
[{"$f":"'Tournois 2 contre 2'!A:A","v":0}]
[{"$f":"'Tournois 2 contre 2'!A:A","v":0}]
[{"$f":"'Tournois 2 contre 2'!A:A","v":0}]
[{"$f":"'Tournois 2 contre 2'!A:A","v":0}]
[{"$f":"'Tournois 2 contre 2'!A:A","v":0}]
[{"$f":"'Tournois 2 contre 2'!A:A","v":0}]
[{"$f":"'Tournois 2 contre 2'!A:A","v":0}]
[{"$f":"'Tournois 2 contre 2'!A:A","v":0}]
[{"$f":"'Tournois 2 contre 2'!A:A","v":0}]
[{"$f":"'Tournois 2 contre 2'!A:A","v":0}]
[{"$f":"'Tournois 2 contre 2'!A:A","v":0}]
[{"$f":"'Tournois 2 contre 2'!A:A","v":0}]
[{"$f":"'Tournois 2 contre 2'!A:A","v":0}]
[{"$f":"'Tournois 2 contre 2'!A:A","v":0}]
[{"$f":"'Tournois 2 contre 2'!A:A","v":0}]
[{"$f":"'Tournois 2 contre 2'!A:A","v":0}]
[{"$f":"'Tournois 2 contre 2'!A:A","v":0}]
[{"$f":"'Tournois 2 contre 2'!A:A","v":0}]
[{"$f":"'Tournois 2 contre 2'!A:A","v":0}]
[{"$f":"'Tournois 2 contre 2'!A:A","v":0}]
[{"$f":"'Tournois 2 contre 2'!A:A","v":0}]
[{"$f":"'Tournois 2 contre 2'!A:A","v":0}]
[{"$f":"'Tournois 2 contre 2'!A:A","v":0}]
[{"$f":"'Tournois 2 contre 2'!A:A","v":0}]
[{"$f":"'Tournois 2 contre 2'!A:A","v":0}]
[{"$f":"'Tournois 2 contre 2'!A:A","v":0}]
[{"$f":"'Tournois 2 contre 2'!A:A","v":0}]
[{"$f":"'Tournois 2 contre 2'!A:A","v":0}]
[{"$f":"'Tournois 2 contre 2'!A:A","v":0}]
[{"$f":"'Tournois 2 contre 2'!A:A","v":0}]
[{"$f":"'Tournois 2 contre 2'!A:A","v":0}]
[{"$f":"'Tournois 2 contre 2'!A:A","v":0}]
[{"$f":"'Tournois 2 contre 2'!A:A","v":0}]
[{"$f":"'Tournois 2 contre 2'!A:A","v":0}]
[{"$f":"'Tournois 2 contre 2'!A:A","v":0}]
[{"$f":"'Tournois 2 contre 2'!A:A","v":0}]
[{"$f":"'Tournois 2 contre 2'!A:A","v":0}]
[{"$f":"'Tournois 2 contre 2'!A:A","v":0}]
[{"$f":"'Tournois 2 contre 2'!A:A","v":0}]
[{"$f":"'Tournois 2 contre 2'!A:A","v":0}]
[{"$f":"'Tournois 2 contre 2'!A:A","v":0}]
[{"$f":"'Tournois 2 contre 2'!A:A","v":0}]
[{"$f":"'Tournois 2 contre 2'!A:A","v":0}]
[{"$f":"'Tournois 2 contre 2'!A:A","v":0}]
[{"$f":"'Tournois 2 contre 2'!A:A","v":0}]
[{"$f":"'Tournois 2 contre 2'!A:A","v":0}]
[{"$f":"'Tournois 2 contre 2'!A:A","v":0}]
[{"$f":"'Tournois 2 contre 2'!A:A","v":0}]
[{"$f":"'Tournois 2 contre 2'!A:A","v":0}]
[{"$f":"'Tournois 2 contre 2'!A:A","v":0}]
[{"$f":"'Tournois 2 contre 2'!A:A","v":0}]
[{"$f":"'Tournois 2 contre 2'!A:A","v":0}]
[{"$f":"'Tournois 2 contre 2'!A:A","v":0}]
[{"$f":"'Tournois 2 contre 2'!A:A","v":0}]
[{"$f":"'Tournois 2 contre 2'!A:A","v":0}]
[{"$f":"'Tournois 2 contre 2'!A:A","v":0}]
[{"$f":"'Tournois 2 contre 2'!A:A","v":0}]
[{"$f":"'Tournois 2 contre 2'!A:A","v":0}]
[{"$f":"'Tournois 2 contre 2'!A:A","v":0}]
[{"$f":"'Tournois 2 contre 2'!A:A","v":0}]
[{"$f":"'Tournois 2 contre 2'!A:A","v":0}]
[{"$f":"'Tournois 2 contre 2'!A:A","v":0}]
[{"$f":"'Tournois 2 contre 2'!A:A","v":0}]
[{"$f":"'Tournois 2 contre 2'!A:A","v":0}]
[{"$f":"'Tournois 2 contre 2'!A:A","v":0}]
[{"$f":"'Tournois 2 contre 2'!A:A","v":0}]
[{"$f":"'Tournois 2 contre 2'!A:A","v":0}]
[{"$f":"'Tournois 2 contre 2'!A:A","v":0}]
[{"$f":"'Tournois 2 contre 2'!A:A","v":0}]
[{"$f":"'Tournois 2 contre 2'!A:A","v":0}]
[{"$f":"'Tournois 2 contre 2'!A:A","v":0}]
[{"$f":"'Tournois 2 contre 2'!A:A","v":0}]
[{"$f":"'Tournois 2 contre 2'!A:A","v":0}]
[{"$f":"'Tournois 2 contre 2'!A:A","v":0}]
[{"$f":"'Tournois 2 contre 2'!A:A","v":0}]
[{"$f":"'Tournois 2 contre 2'!A:A","v":0}]
[{"$f":"'Tournois 2 contre 2'!A:A","v":0}]
[{"$f":"'Tournois 2 contre 2'!A:A","v":0}]
[{"$f":"'Tournois 2 contre 2'!A:A","v":0}]
[{"$f":"'Tournois 2 contre 2'!A:A","v":0}]
[{"$f":"'Tournois 2 contre 2'!A:A","v":0}]
[{"$f":"'Tournois 2 contre 2'!A:A","v":0}]
[{"$f":"'Tournois 2 contre 2'!A:A","v":0}]
[{"$f":"'Tournois 2 contre 2'!A:A","v":0}]
[{"$f":"'Tournois 2 contre 2'!A:A","v":0}]
[{"$f":"'Tournois 2 contre 2'!A:A","v":0}]
[{"$f":"'Tournois 2 contre 2'!A:A","v":0}]
[{"$f":"'Tournois 2 contre 2'!A:A","v":0}]
[{"$f":"'Tournois 2 contre 2'!A:A","v":0}]
[{"$f":"'Tournois 2 contre 2'!A:A","v":0}]
[{"$f":"'Tournois 2 contre 2'!A:A","v":0}]
[{"$f":"'Tournois 2 contre 2'!A:A","v":0}]
[{"$f":"'Tournois 2 contre 2'!A:A","v":0}]
[{"$f":"'Tournois 2 contre 2'!A:A","v":0}]
[{"$f":"'Tournois 2 contre 2'!A:A","v":0}]
[{"$f":"'Tournois 2 contre 2'!A:A","v":0}]
[{"$f":"'Tournois 2 contre 2'!A:A","v":0}]
[{"$f":"'Tournois 2 contre 2'!A:A","v":0}]
[{"$f":"'Tournois 2 contre 2'!A:A","v":0}]
[{"$f":"'Tournois 2 contre 2'!A:A","v":0}]
[{"$f":"'Tournois 2 contre 2'!A:A","v":0}]
[{"$f":"'Tournois 2 contre 2'!A:A","v":0}]
[{"$f":"'Tournois 2 contre 2'!A:A","v":0}]
[{"$f":"'Tournois 2 contre 2'!A:A","v":0}]
[{"$f":"'Tournois 2 contre 2'!A:A","v":0}]
[{"$f":"'Tournois 2 contre 2'!A:A","v":0}]
[{"$f":"'Tournois 2 contre 2'!A:A","v":0}]