{"text_format":"1","workbook":"xlsx","n_sheets":5,"sheets":["Tableau Tournante","Impression","Feuil1","Tournois 2 contre 2","Tournois 1 contre 1"],"not_rendered":{"charts":0,"images":0,"macros":1,"external_links":0,"defined_names":10,"comments":2,"pivot_tables":0},"unopened":[],"bounds":{"document_bytes":16777216,"sheet_cells":100000,"rows_first":2000,"rows_last":500,"rows_between":2000,"halvings":0,"cell_chars":16384,"cell_head_chars":4096},"cells_cut":0,"cells_raw":0,"read":"whole","date_system":"1900"}

{"sheet":"Tableau Tournante","index":0,"n_rows":167,"n_cols":69,"rows_kept":167,"cut":false,"hidden":false,"merged":[[4,15,4,16],[4,25,4,26],[4,17,4,18],[0,2,0,3],[0,4,0,5],[0,12,0,13],[0,14,0,17],[3,13,3,16],[4,13,4,14],[3,2,3,11],[3,21,3,24],[4,19,4,20],[3,25,3,28],[4,23,4,24],[4,21,4,22],[3,17,3,20],[1,66,1,68],[1,40,1,43],[1,48,1,50],[1,54,1,56],[1,60,1,62],[4,27,4,28]]}
["tableau pétanque tournante d'Alénya ",null,{"$f":"COUNTA(B6:B180)","v":18},null,"joueurs",null,null,null,null,null,null,2,{"$f":"C1/4","v":4.5}]
[]
[]
[null,null,{"$f":"TODAY()","v":"2016-04-21"},null,null,null,null,null,null,null,null,null,null,"T 1",null,null,null,"T 2",null,null,null,"T 3",null,null,null,"T 4"]
[{"$f":"MOD(C1,L1*2)","v":2},{"$f":"IF(MOD(C1,L1)=0,\"\",\"Incompatible !\")","v":""},null,"T1","T2","T3","T4",null,null,null,null,null,null,"équipe",null,"contre",null,"équipe",null,"contre",null,"équipe",null,"contre",null,"équipe",null,"contre"]
[1,"ALAIN",null,"x",null,null,null,null,null,null,null,null,null,9,2,1,10,1,11,15,18,11,5,1,12,16,1,7,4,null,null,null,null,null,null,null,null,null,null,6,{"$f":"O6","v":2},8,15,null,null,null,{"$f":"$AN$6","v":6},{"$f":"$AN$7","v":3},null,{"$f":"$AN$8","v":8},{"$f":"$AN$9","v":7},null,{"$f":"$AO$6","v":2},{"$f":"$AO$7","v":19},null,{"$f":"$AO$8","v":5},{"$f":"$AO$9","v":2},null,{"$f":"$AP$6","v":8},{"$f":"$AP$7","v":15},null,{"$f":"$AP$8","v":7},{"$f":"$AP$9","v":17},null,{"$f":"$AQ$6","v":15},{"$f":"$AQ$7","v":5},null,{"$f":"$AQ$8","v":16},{"$f":"$AQ$9","v":20}]
[2,"FRANCOIS",null,null,null,null,null,null,null,null,null,null,null,3,18,6,8,17,5,8,10,14,16,3,13,14,13,9,17,null,null,null,null,null,null,null,null,null,null,3,19,15,5,null,null,null,{"$f":"LOOKUP(AU6,$A$6:$A$155,$B$6:$B$155)","v":"ANTOINE"},{"$f":"LOOKUP(AV6,$A$6:$A$155,$B$6:$B$155)","v":"SERGE"},null,{"$f":"LOOKUP(AX6,$A$6:$A$155,$B$6:$B$155)","v":"JEAN-MARIE"},{"$f":"LOOKUP(AY6,$A$6:$A$155,$B$6:$B$155)","v":"JEAN"},null,{"$f":"LOOKUP(BA6,$A$6:$A$155,$B$6:$B$155)","v":"FRANCOIS"},{"$f":"LOOKUP(BB6,$A$6:$A$155,$B$6:$B$155)","v":0},null,{"$f":"LOOKUP(BD6,$A$6:$A$155,$B$6:$B$155)","v":"VERO"},{"$f":"LOOKUP(BE6,$A$6:$A$155,$B$6:$B$155)","v":"FRANCOIS"},null,{"$f":"LOOKUP(BG6,$A$6:$A$155,$B$6:$B$155)","v":"JEAN-MARIE"},{"$f":"LOOKUP(BH6,$A$6:$A$155,$B$6:$B$155)","v":"TONI"},null,{"$f":"LOOKUP(BJ6,$A$6:$A$155,$B$6:$B$155)","v":"JEAN"},{"$f":"LOOKUP(BK6,$A$6:$A$155,$B$6:$B$155)","v":"AIME"},null,{"$f":"LOOKUP(BM6,$A$6:$A$155,$B$6:$B$155)","v":"TONI"},{"$f":"LOOKUP(BN6,$A$6:$A$155,$B$6:$B$155)","v":"VERO"},null,{"$f":"LOOKUP(BP6,$A$6:$A$155,$B$6:$B$155)","v":"CYRILLE"},{"$f":"LOOKUP(BQ6,$A$6:$A$155,$B$6:$B$155)","v":0}]
[3,"SERGE",null,null,null,null,null,null,null,null,null,null,null,12,11,7,13,4,3,13,2,8,2,6,15,12,2,8,18,null,null,null,null,null,null,null,null,null,null,8,5,7,16,null,null,null,{"$f":"$AN$10","v":4},{"$f":"$AN$11","v":9},null,{"$f":"$AN$12","v":5},{"$f":"$AN$13","v":10},null,{"$f":"$AO$10","v":16},{"$f":"$AO$11","v":9},null,{"$f":"$AO$12","v":18},{"$f":"$AO$13","v":11},null,{"$f":"$AP$10","v":4},{"$f":"$AP$11","v":14},null,{"$f":"$AP$12","v":6},{"$f":"$AP$13","v":13},null,{"$f":"$AQ$10","v":17},{"$f":"$AQ$11","v":18},null,{"$f":"$AQ$12","v":7},{"$f":"$AQ$13","v":1}]
[4,"YVES",null,null,null,null,null,null,null,null,null,null,null,17,15,4,16,12,7,6,14,18,4,9,10,3,15,10,5,null,null,null,null,null,null,null,null,null,null,7,2,17,20,null,null,null,{"$f":"LOOKUP(AU8,$A$6:$A$155,$B$6:$B$155)","v":"YVES"},{"$f":"LOOKUP(AV8,$A$6:$A$155,$B$6:$B$155)","v":"MARIE"},null,{"$f":"LOOKUP(AX8,$A$6:$A$155,$B$6:$B$155)","v":"VERO"},{"$f":"LOOKUP(AY8,$A$6:$A$155,$B$6:$B$155)","v":"MICHEL"},null,{"$f":"LOOKUP(BA8,$A$6:$A$155,$B$6:$B$155)","v":"CYRILLE"},{"$f":"LOOKUP(BB8,$A$6:$A$155,$B$6:$B$155)","v":"MARIE"},null,{"$f":"LOOKUP(BD8,$A$6:$A$155,$B$6:$B$155)","v":"GEORGES"},{"$f":"LOOKUP(BE8,$A$6:$A$155,$B$6:$B$155)","v":"MARC"},null,{"$f":"LOOKUP(BG8,$A$6:$A$155,$B$6:$B$155)","v":"YVES"},{"$f":"LOOKUP(BH8,$A$6:$A$155,$B$6:$B$155)","v":"LUCIEN"},null,{"$f":"LOOKUP(BJ8,$A$6:$A$155,$B$6:$B$155)","v":"ANTOINE"},{"$f":"LOOKUP(BK8,$A$6:$A$155,$B$6:$B$155)","v":"JACQUES"},null,{"$f":"LOOKUP(BM8,$A$6:$A$155,$B$6:$B$155)","v":"AIME"},{"$f":"LOOKUP(BN8,$A$6:$A$155,$B$6:$B$155)","v":"GEORGES"},null,{"$f":"LOOKUP(BP8,$A$6:$A$155,$B$6:$B$155)","v":"JEAN"},{"$f":"LOOKUP(BQ8,$A$6:$A$155,$B$6:$B$155)","v":"ALAIN"}]
[5,"VERO",null,null,null,null,null,null,null,null,null,null,null,null,5,14,null,null,9,16,null,null,17,7,null,null,11,6,null,null,null,null,null,null,null,null,null,null,null,4,16,4,17,null,null,null,{"$f":"$AN$14","v":0},{"$f":"$AN$15","v":0},null,{"$f":"$AN$16","v":0},{"$f":"$AN$17","v":0},null,{"$f":"$AO$14","v":20},{"$f":"$AO$15","v":8},null,{"$f":"$AO$16","v":13},{"$f":"$AO$17","v":3},null,{"$f":"$AP$14","v":9},{"$f":"$AP$15","v":18},null,{"$f":"$AP$16","v":5},{"$f":"$AP$17","v":10},null,{"$f":"$AQ$14","v":10},{"$f":"$AQ$15","v":2},null,{"$f":"$AQ$16","v":6},{"$f":"$AQ$17","v":9}]
[6,"ANTOINE",null,null,null,null,null,null,null,null,null,null,null,null,null,null,null,null,null,null,null,null,null,null,null,null,null,null,null,null,null,null,null,null,null,null,null,null,null,9,9,14,18,null,null,null,{"$f":"LOOKUP(AU10,$A$6:$A$155,$B$6:$B$155)","v":{"$error":"#N/A"}},{"$f":"LOOKUP(AV10,$A$6:$A$155,$B$6:$B$155)","v":{"$error":"#N/A"}},null,{"$f":"LOOKUP(AX10,$A$6:$A$155,$B$6:$B$155)","v":{"$error":"#N/A"}},{"$f":"LOOKUP(AY10,$A$6:$A$155,$B$6:$B$155)","v":{"$error":"#N/A"}},null,{"$f":"LOOKUP(BA10,$A$6:$A$155,$B$6:$B$155)","v":0},{"$f":"LOOKUP(BB10,$A$6:$A$155,$B$6:$B$155)","v":"JEAN-MARIE"},null,{"$f":"LOOKUP(BD10,$A$6:$A$155,$B$6:$B$155)","v":"JACQUES"},{"$f":"LOOKUP(BE10,$A$6:$A$155,$B$6:$B$155)","v":"SERGE"},null,{"$f":"LOOKUP(BG10,$A$6:$A$155,$B$6:$B$155)","v":"MARIE"},{"$f":"LOOKUP(BH10,$A$6:$A$155,$B$6:$B$155)","v":"GEORGES"},null,{"$f":"LOOKUP(BJ10,$A$6:$A$155,$B$6:$B$155)","v":"VERO"},{"$f":"LOOKUP(BK10,$A$6:$A$155,$B$6:$B$155)","v":"MICHEL"},null,{"$f":"LOOKUP(BM10,$A$6:$A$155,$B$6:$B$155)","v":"MICHEL"},{"$f":"LOOKUP(BN10,$A$6:$A$155,$B$6:$B$155)","v":"FRANCOIS"},null,{"$f":"LOOKUP(BP10,$A$6:$A$155,$B$6:$B$155)","v":"ANTOINE"},{"$f":"LOOKUP(BQ10,$A$6:$A$155,$B$6:$B$155)","v":"MARIE"}]
[7,"JEAN",null,null,null,null,null,null,null,null,null,null,null,null,null,null,null,null,null,null,null,null,null,null,null,null,null,null,null,null,null,null,null,null,null,null,null,null,null,5,18,6,7,null,null,null,{"$f":"$AN$18","v":0},{"$f":"$AN$19","v":0},null,{"$f":"$AN$20","v":0},{"$f":"$AN$21","v":0},null,{"$f":"$AO$18","v":12},{"$f":"$AO$19","v":7},null,{"$f":"$AO$20","v":17},{"$f":"$AO$21","v":15},null,{"$f":"$AP$18","v":16},{"$f":"$AP$19","v":12},null,{"$f":"$AP$20","v":19},{"$f":"$AP$21","v":2},null,{"$f":"$AQ$18","v":8},{"$f":"$AQ$19","v":3},null,{"$f":"$AQ$20","v":11},{"$f":"$AQ$21","v":14}]
[8,"JEAN-MARIE",null,null,null,null,null,null,null,null,null,null,null,null,null,null,null,null,null,null,null,null,null,null,null,null,null,null,null,null,null,null,null,null,null,null,null,null,null,10,11,13,1,null,null,null,{"$f":"LOOKUP(AU12,$A$6:$A$155,$B$6:$B$155)","v":{"$error":"#N/A"}},{"$f":"LOOKUP(AV12,$A$6:$A$155,$B$6:$B$155)","v":{"$error":"#N/A"}},null,{"$f":"LOOKUP(AX12,$A$6:$A$155,$B$6:$B$155)","v":{"$error":"#N/A"}},{"$f":"LOOKUP(AY12,$A$6:$A$155,$B$6:$B$155)","v":{"$error":"#N/A"}},null,{"$f":"LOOKUP(BA12,$A$6:$A$155,$B$6:$B$155)","v":"MARCEL"},{"$f":"LOOKUP(BB12,$A$6:$A$155,$B$6:$B$155)","v":"JEAN"},null,{"$f":"LOOKUP(BD12,$A$6:$A$155,$B$6:$B$155)","v":"AIME"},{"$f":"LOOKUP(BE12,$A$6:$A$155,$B$6:$B$155)","v":"TONI"},null,{"$f":"LOOKUP(BG12,$A$6:$A$155,$B$6:$B$155)","v":"CYRILLE"},{"$f":"LOOKUP(BH12,$A$6:$A$155,$B$6:$B$155)","v":"MARCEL"},null,{"$f":"LOOKUP(BJ12,$A$6:$A$155,$B$6:$B$155)","v":0},{"$f":"LOOKUP(BK12,$A$6:$A$155,$B$6:$B$155)","v":"FRANCOIS"},null,{"$f":"LOOKUP(BM12,$A$6:$A$155,$B$6:$B$155)","v":"JEAN-MARIE"},{"$f":"LOOKUP(BN12,$A$6:$A$155,$B$6:$B$155)","v":"SERGE"},null,{"$f":"LOOKUP(BP12,$A$6:$A$155,$B$6:$B$155)","v":"MARC"},{"$f":"LOOKUP(BQ12,$A$6:$A$155,$B$6:$B$155)","v":"LUCIEN"}]
[9,"MARIE",null,null,null,null,null,null,null,null,null,null,null,null,null,null,null,null,null,null,null,null,null,null,null,null,null,null,null,null,null,null,null,null,null,null,null,null,null,null,20,9,10,null,null,null,{"$f":"$AN$22","v":0},{"$f":"$AN$23","v":0},null,{"$f":"$AN$24","v":0},{"$f":"$AN$25","v":0},null,{"$f":"$AO$22","v":1},{"$f":"$AO$23","v":14},null,{"$f":"$AO$24","v":4},{"$f":"$AO$25","v":6},null,{"$f":"$AP$22","v":11},{"$f":"$AP$23","v":3},null,{"$f":"$AP$24","v":1},{"$f":"$AP$25","v":20},null,{"$f":"$AQ$22","v":19},{"$f":"$AQ$23","v":4},null,{"$f":"$AQ$24","v":13},{"$f":"$AQ$25","v":12}]
[10,"MICHEL",null,null,null,null,null,null,null,null,null,null,null,null,null,null,null,null,null,null,null,null,null,null,null,null,null,null,null,null,null,null,null,null,null,null,null,null,null,null,8,18,2,null,null,null,{"$f":"LOOKUP(AU14,$A$6:$A$155,$B$6:$B$155)","v":{"$error":"#N/A"}},{"$f":"LOOKUP(AV14,$A$6:$A$155,$B$6:$B$155)","v":{"$error":"#N/A"}},null,{"$f":"LOOKUP(AX14,$A$6:$A$155,$B$6:$B$155)","v":{"$error":"#N/A"}},{"$f":"LOOKUP(AY14,$A$6:$A$155,$B$6:$B$155)","v":{"$error":"#N/A"}},null,{"$f":"LOOKUP(BA14,$A$6:$A$155,$B$6:$B$155)","v":"ALAIN"},{"$f":"LOOKUP(BB14,$A$6:$A$155,$B$6:$B$155)","v":"LUCIEN"},null,{"$f":"LOOKUP(BD14,$A$6:$A$155,$B$6:$B$155)","v":"YVES"},{"$f":"LOOKUP(BE14,$A$6:$A$155,$B$6:$B$155)","v":"ANTOINE"},null,{"$f":"LOOKUP(BG14,$A$6:$A$155,$B$6:$B$155)","v":"MARC"},{"$f":"LOOKUP(BH14,$A$6:$A$155,$B$6:$B$155)","v":"SERGE"},null,{"$f":"LOOKUP(BJ14,$A$6:$A$155,$B$6:$B$155)","v":"ALAIN"},{"$f":"LOOKUP(BK14,$A$6:$A$155,$B$6:$B$155)","v":0},null,{"$f":"LOOKUP(BM14,$A$6:$A$155,$B$6:$B$155)","v":0},{"$f":"LOOKUP(BN14,$A$6:$A$155,$B$6:$B$155)","v":"YVES"},null,{"$f":"LOOKUP(BP14,$A$6:$A$155,$B$6:$B$155)","v":"JACQUES"},{"$f":"LOOKUP(BQ14,$A$6:$A$155,$B$6:$B$155)","v":"MARCEL"}]
{"$rows_left_out":153}
{"sheet":"Impression","index":1,"n_rows":89,"n_cols":25,"rows_kept":89,"cut":false,"hidden":false,"merged":[[0,2,0,6],[0,14,0,18],[5,8,5,9],[5,11,5,12],[5,14,5,15],[5,17,5,18],[5,20,5,21],[5,23,5,24],[1,2,1,6],[1,8,1,12],[1,14,1,18],[1,20,1,24],[5,2,5,3],[5,5,5,6]]}
[null,null,"ALENYA      pétanque ",null,null,null,null,null,{"$f":"'Tableau Tournante'!C1","v":18},"joueurs ",null,null,null,null,{"$f":"TODAY()","v":"2016-04-21"}]
[null,null,"Tour 1",null,null,null,null,null,"Tour 2",null,null,null,null,null,"Tour 3",null,null,null,null,null,"Tour 4"]
[]
[]
[]
[null,null,"EQUIPE",null,null,"CONTRE",null,null,"EQUIPE",null,null,"CONTRE",null,null,"EQUIPE",null,null,"CONTRE",null,null,"EQUIPE",null,null,"CONTRE"]
[]
[null,null,{"$f":"'Tableau Tournante'!N6","v":9},{"$f":"'Tableau Tournante'!O6","v":2},null,{"$f":"'Tableau Tournante'!P6","v":1},{"$f":"'Tableau Tournante'!Q6","v":10},null,{"$f":"'Tableau Tournante'!R6","v":1},{"$f":"'Tableau Tournante'!S6","v":11},null,{"$f":"'Tableau Tournante'!T6","v":15},{"$f":"'Tableau Tournante'!U6","v":18},null,{"$f":"'Tableau Tournante'!V6","v":11},{"$f":"'Tableau Tournante'!W6","v":5},null,{"$f":"'Tableau Tournante'!X6","v":1},{"$f":"'Tableau Tournante'!Y6","v":12},null,{"$f":"'Tableau Tournante'!Z6","v":16},{"$f":"'Tableau Tournante'!AA6","v":1},null,{"$f":"'Tableau Tournante'!AB6","v":7},{"$f":"'Tableau Tournante'!AC6","v":4}]
[null,null,{"$f":"VLOOKUP(C8,'Tableau Tournante'!$A$6:$B$168,2)","v":"MARIE"},{"$f":"VLOOKUP(D8,'Tableau Tournante'!$A$6:$B$168,2)","v":"FRANCOIS"},null,{"$f":"VLOOKUP(F8,'Tableau Tournante'!$A$6:$B$168,2)","v":"ALAIN"},{"$f":"VLOOKUP(G8,'Tableau Tournante'!$A$6:$B$168,2)","v":"MICHEL"},null,{"$f":"VLOOKUP(I8,'Tableau Tournante'!$A$6:$B$168,2)","v":"ALAIN"},{"$f":"VLOOKUP(J8,'Tableau Tournante'!$A$6:$B$168,2)","v":"MARC"},null,{"$f":"VLOOKUP(L8,'Tableau Tournante'!$A$6:$B$168,2)","v":"TONI"},{"$f":"VLOOKUP(M8,'Tableau Tournante'!$A$6:$B$168,2)","v":"GEORGES"},null,{"$f":"VLOOKUP(O8,'Tableau Tournante'!$A$6:$B$168,2)","v":"MARC"},{"$f":"VLOOKUP(P8,'Tableau Tournante'!$A$6:$B$168,2)","v":"VERO"},null,{"$f":"VLOOKUP(R8,'Tableau Tournante'!$A$6:$B$168,2)","v":"ALAIN"},{"$f":"VLOOKUP(S8,'Tableau Tournante'!$A$6:$B$168,2)","v":"MARCEL"},null,{"$f":"VLOOKUP(U8,'Tableau Tournante'!$A$6:$B$168,2)","v":"CYRILLE"},{"$f":"VLOOKUP(V8,'Tableau Tournante'!$A$6:$B$168,2)","v":"ALAIN"},null,{"$f":"VLOOKUP(X8,'Tableau Tournante'!$A$6:$B$168,2)","v":"JEAN"},{"$f":"VLOOKUP(Y8,'Tableau Tournante'!$A$6:$B$168,2)","v":"YVES"}]
[null,null,{"$f":"'Tableau Tournante'!N7","v":3},{"$f":"'Tableau Tournante'!O7","v":18},null,{"$f":"'Tableau Tournante'!P7","v":6},{"$f":"'Tableau Tournante'!Q7","v":8},null,{"$f":"'Tableau Tournante'!R7","v":17},{"$f":"'Tableau Tournante'!S7","v":5},null,{"$f":"'Tableau Tournante'!T7","v":8},{"$f":"'Tableau Tournante'!U7","v":10},null,{"$f":"'Tableau Tournante'!V7","v":14},{"$f":"'Tableau Tournante'!W7","v":16},null,{"$f":"'Tableau Tournante'!X7","v":3},{"$f":"'Tableau Tournante'!Y7","v":13},null,{"$f":"'Tableau Tournante'!Z7","v":14},{"$f":"'Tableau Tournante'!AA7","v":13},null,{"$f":"'Tableau Tournante'!AB7","v":9},{"$f":"'Tableau Tournante'!AC7","v":17}]
[null,null,{"$f":"VLOOKUP(C10,'Tableau Tournante'!$A$6:$B$168,2)","v":"SERGE"},{"$f":"VLOOKUP(D10,'Tableau Tournante'!$A$6:$B$168,2)","v":"GEORGES"},null,{"$f":"VLOOKUP(F10,'Tableau Tournante'!$A$6:$B$168,2)","v":"ANTOINE"},{"$f":"VLOOKUP(G10,'Tableau Tournante'!$A$6:$B$168,2)","v":"JEAN-MARIE"},null,{"$f":"VLOOKUP(I10,'Tableau Tournante'!$A$6:$B$168,2)","v":"AIME"},{"$f":"VLOOKUP(J10,'Tableau Tournante'!$A$6:$B$168,2)","v":"VERO"},null,{"$f":"VLOOKUP(L10,'Tableau Tournante'!$A$6:$B$168,2)","v":"JEAN-MARIE"},{"$f":"VLOOKUP(M10,'Tableau Tournante'!$A$6:$B$168,2)","v":"MICHEL"},null,{"$f":"VLOOKUP(O10,'Tableau Tournante'!$A$6:$B$168,2)","v":"LUCIEN"},{"$f":"VLOOKUP(P10,'Tableau Tournante'!$A$6:$B$168,2)","v":"CYRILLE"},null,{"$f":"VLOOKUP(R10,'Tableau Tournante'!$A$6:$B$168,2)","v":"SERGE"},{"$f":"VLOOKUP(S10,'Tableau Tournante'!$A$6:$B$168,2)","v":"JACQUES"},null,{"$f":"VLOOKUP(U10,'Tableau Tournante'!$A$6:$B$168,2)","v":"LUCIEN"},{"$f":"VLOOKUP(V10,'Tableau Tournante'!$A$6:$B$168,2)","v":"JACQUES"},null,{"$f":"VLOOKUP(X10,'Tableau Tournante'!$A$6:$B$168,2)","v":"MARIE"},{"$f":"VLOOKUP(Y10,'Tableau Tournante'!$A$6:$B$168,2)","v":"AIME"}]
[null,null,{"$f":"'Tableau Tournante'!N8","v":12},{"$f":"'Tableau Tournante'!O8","v":11},null,{"$f":"'Tableau Tournante'!P8","v":7},{"$f":"'Tableau Tournante'!Q8","v":13},null,{"$f":"'Tableau Tournante'!R8","v":4},{"$f":"'Tableau Tournante'!S8","v":3},null,{"$f":"'Tableau Tournante'!T8","v":13},{"$f":"'Tableau Tournante'!U8","v":2},null,{"$f":"'Tableau Tournante'!V8","v":8},{"$f":"'Tableau Tournante'!W8","v":2},null,{"$f":"'Tableau Tournante'!X8","v":6},{"$f":"'Tableau Tournante'!Y8","v":15},null,{"$f":"'Tableau Tournante'!Z8","v":12},{"$f":"'Tableau Tournante'!AA8","v":2},null,{"$f":"'Tableau Tournante'!AB8","v":8},{"$f":"'Tableau Tournante'!AC8","v":18}]
[null,null,{"$f":"VLOOKUP(C12,'Tableau Tournante'!$A$6:$B$168,2)","v":"MARCEL"},{"$f":"VLOOKUP(D12,'Tableau Tournante'!$A$6:$B$168,2)","v":"MARC"},null,{"$f":"VLOOKUP(F12,'Tableau Tournante'!$A$6:$B$168,2)","v":"JEAN"},{"$f":"VLOOKUP(G12,'Tableau Tournante'!$A$6:$B$168,2)","v":"JACQUES"},null,{"$f":"VLOOKUP(I12,'Tableau Tournante'!$A$6:$B$168,2)","v":"YVES"},{"$f":"VLOOKUP(J12,'Tableau Tournante'!$A$6:$B$168,2)","v":"SERGE"},null,{"$f":"VLOOKUP(L12,'Tableau Tournante'!$A$6:$B$168,2)","v":"JACQUES"},{"$f":"VLOOKUP(M12,'Tableau Tournante'!$A$6:$B$168,2)","v":"FRANCOIS"},null,{"$f":"VLOOKUP(O12,'Tableau Tournante'!$A$6:$B$168,2)","v":"JEAN-MARIE"},{"$f":"VLOOKUP(P12,'Tableau Tournante'!$A$6:$B$168,2)","v":"FRANCOIS"},null,{"$f":"VLOOKUP(R12,'Tableau Tournante'!$A$6:$B$168,2)","v":"ANTOINE"},{"$f":"VLOOKUP(S12,'Tableau Tournante'!$A$6:$B$168,2)","v":"TONI"},null,{"$f":"VLOOKUP(U12,'Tableau Tournante'!$A$6:$B$168,2)","v":"MARCEL"},{"$f":"VLOOKUP(V12,'Tableau Tournante'!$A$6:$B$168,2)","v":"FRANCOIS"},null,{"$f":"VLOOKUP(X12,'Tableau Tournante'!$A$6:$B$168,2)","v":"JEAN-MARIE"},{"$f":"VLOOKUP(Y12,'Tableau Tournante'!$A$6:$B$168,2)","v":"GEORGES"}]
[null,null,{"$f":"'Tableau Tournante'!N9","v":17},{"$f":"'Tableau Tournante'!O9","v":15},null,{"$f":"'Tableau Tournante'!P9","v":4},{"$f":"'Tableau Tournante'!Q9","v":16},null,{"$f":"'Tableau Tournante'!R9","v":12},{"$f":"'Tableau Tournante'!S9","v":7},null,{"$f":"'Tableau Tournante'!T9","v":6},{"$f":"'Tableau Tournante'!U9","v":14},null,{"$f":"'Tableau Tournante'!V9","v":18},{"$f":"'Tableau Tournante'!W9","v":4},null,{"$f":"'Tableau Tournante'!X9","v":9},{"$f":"'Tableau Tournante'!Y9","v":10},null,{"$f":"'Tableau Tournante'!Z9","v":3},{"$f":"'Tableau Tournante'!AA9","v":15},null,{"$f":"'Tableau Tournante'!AB9","v":10},{"$f":"'Tableau Tournante'!AC9","v":5}]
[null,null,{"$f":"VLOOKUP(C14,'Tableau Tournante'!$A$6:$B$168,2)","v":"AIME"},{"$f":"VLOOKUP(D14,'Tableau Tournante'!$A$6:$B$168,2)","v":"TONI"},null,{"$f":"VLOOKUP(F14,'Tableau Tournante'!$A$6:$B$168,2)","v":"YVES"},{"$f":"VLOOKUP(G14,'Tableau Tournante'!$A$6:$B$168,2)","v":"CYRILLE"},null,{"$f":"VLOOKUP(I14,'Tableau Tournante'!$A$6:$B$168,2)","v":"MARCEL"},{"$f":"VLOOKUP(J14,'Tableau Tournante'!$A$6:$B$168,2)","v":"JEAN"},null,{"$f":"VLOOKUP(L14,'Tableau Tournante'!$A$6:$B$168,2)","v":"ANTOINE"},{"$f":"VLOOKUP(M14,'Tableau Tournante'!$A$6:$B$168,2)","v":"LUCIEN"},null,{"$f":"VLOOKUP(O14,'Tableau Tournante'!$A$6:$B$168,2)","v":"GEORGES"},{"$f":"VLOOKUP(P14,'Tableau Tournante'!$A$6:$B$168,2)","v":"YVES"},null,{"$f":"VLOOKUP(R14,'Tableau Tournante'!$A$6:$B$168,2)","v":"MARIE"},{"$f":"VLOOKUP(S14,'Tableau Tournante'!$A$6:$B$168,2)","v":"MICHEL"},null,{"$f":"VLOOKUP(U14,'Tableau Tournante'!$A$6:$B$168,2)","v":"SERGE"},{"$f":"VLOOKUP(V14,'Tableau Tournante'!$A$6:$B$168,2)","v":"TONI"},null,{"$f":"VLOOKUP(X14,'Tableau Tournante'!$A$6:$B$168,2)","v":"MICHEL"},{"$f":"VLOOKUP(Y14,'Tableau Tournante'!$A$6:$B$168,2)","v":"VERO"}]
{"$rows_left_out":75}
{"sheet":"Feuil1","index":2,"n_rows":0,"n_cols":0,"rows_kept":0,"cut":false,"hidden":false,"merged":[]}

{"sheet":"Tournois 2 contre 2","index":3,"n_rows":192,"n_cols":17,"rows_kept":192,"cut":false,"hidden":true,"merged":[[1,3,1,7],[2,2,2,3]]}
[{"$f":"'Tableau Tournante'!B6","v":"ALAIN"},"Tournois 2 contre 2, et ne se rencontrent ni ne sont partenaires plusieurs fois. Possibilité non activée: clubs "]
[{"$f":"'Tableau Tournante'!B7","v":"FRANCOIS"},{"$f":"C3/4","v":4.5},null,{"$f":"IF(C3<=11,\"Attention 3 manches\",\"\")","v":""}]
[{"$f":"'Tableau Tournante'!B8","v":"SERGE"},null,{"$f":"SUMPRODUCT(--('Tableau Tournante'!B6:B182<>\"\"))","v":18},null,null,3,"manches"]
[{"$f":"'Tableau Tournante'!B9","v":"YVES"}]
[{"$f":"'Tableau Tournante'!B10","v":"VERO"},{"$f":"\"Manche \"&(COLUMN()+2)/4","v":"Manche 1"},null,null,null,{"$f":"\"Manche \"&(COLUMN()+2)/4","v":"Manche 2"},null,null,null,{"$f":"\"Manche \"&(COLUMN()+2)/4","v":"Manche 3"},null,null,null,{"$f":"\"Manche \"&(COLUMN()+2)/4","v":"Manche 4"}]
[{"$f":"'Tableau Tournante'!B11","v":"ANTOINE"},null,"Equipe","Contre",null,null,"Equipe","Contre",null,null,"Equipe","Contre",null,null,"Equipe","Contre"]
[{"$f":"'Tableau Tournante'!B12","v":"JEAN"},11,15,17,8,22,18,2,1,22,20,16,15,22,12,10,6]
[{"$f":"'Tableau Tournante'!B13","v":"JEAN-MARIE"},5,13,1,22,12,14,11,7,10,9,2,11,1,18,14,11]
[{"$f":"'Tableau Tournante'!B14","v":"MARIE"},6,4,16,10,17,15,5,16,4,5,6,7,4,17,13,2]
[{"$f":"'Tableau Tournante'!B15","v":"MICHEL"},20,7,3,9,13,9,3,6,19,13,18,12,15,3,19,21]
[{"$f":"'Tableau Tournante'!B16","v":"MARC"},12,21,18,14,20,21,10,19,1,14,8,3,7,8,20,16]
[{"$f":"'Tableau Tournante'!B17","v":"MARCEL"},null,2,19,null,null,4,8,null,null,17,21,null,null,5,9]
[{"$f":"'Tableau Tournante'!B18","v":"JACQUES"}]
[{"$f":"'Tableau Tournante'!B19","v":"LUCIEN"}]
[{"$f":"'Tableau Tournante'!B20","v":"TONI"}]
{"$rows_left_out":178}
{"sheet":"Tournois 1 contre 1","index":4,"n_rows":1143,"n_cols":9,"rows_kept":1143,"cut":false,"hidden":false,"merged":[]}
[{"$f":"'Tournois 2 contre 2'!A:A","v":"ALAIN"},"Tournois 1 contre 1, et ne se rencontrent jamais 2 fois."]
[{"$f":"'Tournois 2 contre 2'!A:A","v":"FRANCOIS"}]
[{"$f":"'Tournois 2 contre 2'!A:A","v":"SERGE"},null,{"$f":"'Tableau Tournante'!C1:D1","v":18},"joueurs",null,4,"manches"]
[{"$f":"'Tournois 2 contre 2'!A:A","v":"YVES"}]
[{"$f":"'Tournois 2 contre 2'!A:A","v":"VERO"},12,16,18,3,8,15,6,16]
[{"$f":"'Tournois 2 contre 2'!A:A","v":"ANTOINE"},9,5,7,16,14,7,2,18]
[{"$f":"'Tournois 2 contre 2'!A:A","v":"JEAN"},7,15,12,11,18,4,14,13]
[{"$f":"'Tournois 2 contre 2'!A:A","v":"JEAN-MARIE"},10,1,15,9,11,2,4,12]
[{"$f":"'Tournois 2 contre 2'!A:A","v":"MARIE"},6,18,5,4,12,5,8,11]
[{"$f":"'Tournois 2 contre 2'!A:A","v":"MICHEL"},13,11,17,6,9,13,10,3]
[{"$f":"'Tournois 2 contre 2'!A:A","v":"MARC"},14,17,13,10,1,16,7,5]
[{"$f":"'Tournois 2 contre 2'!A:A","v":"MARCEL"},2,3,14,8,17,10,9,17]
[{"$f":"'Tournois 2 contre 2'!A:A","v":"JACQUES"},4,8,1,2,6,3,15,1]
[{"$f":"'Tournois 2 contre 2'!A:A","v":"LUCIEN"}]
[{"$f":"'Tournois 2 contre 2'!A:A","v":"TONI"}]
{"$rows_left_out":1128}