{"text_format":"1","workbook":"xlsx","n_sheets":4,"sheets":["ACHAT","VENTE","STATISTIQUE","Feuil2"],"not_rendered":{"charts":0,"images":1,"macros":1,"external_links":0,"defined_names":8,"comments":0,"pivot_tables":0},"unopened":[],"bounds":{"document_bytes":16777216,"sheet_cells":100000,"rows_first":2000,"rows_last":500,"rows_between":2000,"halvings":0,"cell_chars":16384,"cell_head_chars":4096},"cells_cut":0,"cells_raw":0,"read":"whole","date_system":"1900"}

{"sheet":"ACHAT","index":0,"n_rows":578,"n_cols":15,"rows_kept":578,"cut":false,"hidden":false,"merged":[[355,1,355,2],[355,4,355,5],[355,8,355,9],[355,11,355,12],[366,1,366,2],[366,4,366,5],[366,8,366,9],[366,11,366,12],[353,0,353,2],[353,3,353,4],[353,7,353,9],[353,10,353,11],[354,0,354,2],[354,3,354,4],[354,7,354,9],[354,10,354,11],[351,0,351,2],[351,3,351,5],[351,7,351,9],[351,10,351,12],[352,0,352,2],[352,3,352,4],[352,7,352,9],[352,10,352,11],[349,0,349,2],[349,3,349,5],[349,7,349,9],[349,10,349,12],[350,0,350,2],[350,3,350,5],[350,7,350,9],[350,10,350,12],[347,0,347,5],[347,7,347,12],[348,0,348,2],[348,3,348,5],[348,7,348,9],[348,10,348,12],[321,1,321,2],[321,4,321,5],[321,8,321,9],[321,11,321,12],[332,1,332,2],[332,4,332,5],[332,8,332,9],[332,11,332,12],[319,0,319,2],[319,3,319,4],[319,7,319,9],[319,10,319,11],[320,0,320,2],[320,3,320,4],[320,7,320,9],[320,10,320,11],[317,0,317,2],[317,3,317,5],[317,7,317,9],[317,10,317,12],[318,0,318,2],[318,3,318,4],[318,7,318,9],[318,10,318,11],[315,0,315,2],[315,3,315,5],[315,7,315,9],[315,10,315,12],[316,0,316,2],[316,3,316,5],[316,7,316,9],[316,10,316,12],[313,0,313,5],[313,7,313,12],[314,0,314,2],[314,3,314,5],[314,7,314,9],[314,10,314,12],[287,1,287,2],[287,4,287,5],[287,8,287,9],[287,11,287,12],[298,1,298,2],[298,4,298,5],[298,8,298,9],[298,11,298,12],[285,0,285,2],[285,3,285,4],[285,7,285,9],[285,10,285,11],[286,0,286,2],[286,3,286,4],[286,7,286,9],[286,10,286,11],[283,0,283,2],[283,3,283,5],[283,7,283,9],[283,10,283,12],[284,0,284,2],[284,3,284,4],[284,7,284,9],[284,10,284,11],[281,0,281,2],[281,3,281,5],[281,7,281,9],[281,10,281,12],[282,0,282,2],[282,3,282,5],[282,7,282,9],[282,10,282,12],[279,0,279,5],[279,7,279,12],[280,0,280,2],[280,3,280,5],[280,7,280,9],[280,10,280,12],[253,1,253,2],[253,4,253,5],[253,8,253,9],[253,11,253,12],[264,1,264,2],[264,4,264,5],[264,8,264,9],[264,11,264,12],[251,0,251,2],[251,3,251,4],[251,7,251,9],[251,10,251,11],[252,0,252,2],[252,3,252,4],[252,7,252,9],[252,10,252,11],[249,0,249,2],[249,3,249,5],[249,7,249,9],[249,10,249,12],[250,0,250,2],[250,3,250,4],[250,7,250,9],[250,10,250,11],[247,0,247,2],[247,3,247,5],[247,7,247,9],[247,10,247,12],[248,0,248,2],[248,3,248,5],[248,7,248,9],[248,10,248,12],[245,0,245,5],[245,7,245,12],[246,0,246,2],[246,3,246,5],[246,7,246,9],[246,10,246,12],[219,1,219,2],[219,4,219,5],[219,8,219,9],[219,11,219,12],[230,1,230,2],[230,4,230,5],[230,8,230,9],[230,11,230,12],[217,0,217,2],[217,3,217,4],[217,7,217,9],[217,10,217,11],[218,0,218,2],[218,3,218,4],[218,7,218,9],[218,10,218,11],[215,0,215,2],[215,3,215,5],[215,7,215,9],[215,10,215,12],[216,0,216,2],[216,3,216,4],[216,7,216,9],[216,10,216,11],[213,0,213,2],[213,3,213,5],[213,7,213,9],[213,10,213,12],[214,0,214,2],[214,3,214,5],[214,7,214,9],[214,10,214,12],[211,0,211,5],[211,7,211,12],[212,0,212,2],[212,3,212,5],[212,7,212,9],[212,10,212,12],[185,1,185,2],[185,4,185,5],[185,8,185,9],[185,11,185,12],[196,1,196,2],[196,4,196,5],[196,8,196,9],[196,11,196,12],[183,0,183,2],[183,3,183,4],[183,7,183,9],[183,10,183,11],[184,0,184,2],[184,3,184,4],[184,7,184,9],[184,10,184,11],[181,0,181,2],[181,3,181,5],[181,7,181,9],[181,10,181,12],[182,0,182,2],[182,3,182,4],[182,7,182,9],[182,10,182,11],[179,0,179,2],[179,3,179,5],[179,7,179,9],[179,10,179,12],[180,0,180,2],[180,3,180,5],[180,7,180,9],[180,10,180,12],[177,0,177,5],[177,7,177,12],[178,0,178,2],[178,3,178,5],[178,7,178,9],[178,10,178,12],[151,1,151,2],[151,4,151,5],[151,8,151,9],[151,11,151,12],[162,1,162,2],[162,4,162,5],[162,8,162,9],[162,11,162,12],[149,0,149,2],[149,3,149,4],[149,7,149,9],[149,10,149,11],[150,0,150,2],[150,3,150,4],[150,7,150,9],[150,10,150,11],[147,0,147,2],[147,3,147,5],[147,7,147,9],[147,10,147,12],[148,0,148,2],[148,3,148,4],[148,7,148,9],[148,10,148,11],[145,0,145,2],[145,3,145,5],[145,7,145,9],[145,10,145,12],[146,0,146,2],[146,3,146,5],[146,7,146,9],[146,10,146,12],[143,0,143,5],[143,7,143,12],[144,0,144,2],[144,3,144,5],[144,7,144,9],[144,10,144,12],[117,1,117,2],[117,4,117,5],[117,8,117,9],[117,11,117,12],[128,1,128,2],[128,4,128,5],[128,8,128,9],[128,11,128,12],[115,0,115,2],[115,3,115,4],[115,7,115,9],[115,10,115,11],[116,0,116,2],[116,3,116,4],[116,7,116,9],[116,10,116,11],[113,0,113,2],[113,3,113,5],[113,7,113,9],[113,10,113,12],[114,0,114,2],[114,3,114,4],[114,7,114,9],[114,10,114,11],[111,0,111,2],[111,3,111,5],[111,7,111,9],[111,10,111,12],[112,0,112,2],[112,3,112,5],[112,7,112,9],[112,10,112,12],[109,0,109,5],[109,7,109,12],[110,0,110,2],[110,3,110,5],[110,7,110,9],[110,10,110,12],[83,1,83,2],[83,4,83,5],[83,8,83,9],[83,11,83,12],[94,1,94,2],[94,4,94,5],[94,8,94,9],[94,11,94,12],[81,0,81,2],[81,3,81,4],[81,7,81,9],[81,10,81,11],[82,0,82,2],[82,3,82,4],[82,7,82,9],[82,10,82,11],[79,0,79,2],[79,3,79,5],[79,7,79,9],[79,10,79,12],[80,0,80,2],[80,3,80,4],[80,7,80,9],[80,10,80,11],[77,0,77,2],[77,3,77,5],[77,7,77,9],[77,10,77,12],[78,0,78,2],[78,3,78,5],[78,7,78,9],[78,10,78,12],[75,0,75,5],[75,7,75,12],[76,0,76,2],[76,3,76,5],[76,7,76,9],[76,10,76,12],[42,10,42,12],[42,7,42,9],[42,3,42,5],[42,0,42,2],[48,7,48,9],[48,0,48,2],[47,7,47,9],[47,0,47,2],[48,10,48,11],[48,3,48,4],[47,10,47,11],[47,3,47,4],[46,10,46,11],[46,7,46,9],[46,3,46,4],[46,0,46,2],[49,11,49,12],[49,8,49,9],[41,7,41,12],[41,0,41,5],[45,10,45,12],[45,7,45,9],[45,3,45,5],[45,0,45,2],[44,10,44,12],[44,7,44,9],[44,3,44,5],[44,0,44,2],[43,10,43,12],[43,7,43,9],[43,3,43,5],[43,0,43,2],[49,4,49,5],[49,1,49,2],[60,1,60,2],[60,4,60,5],[60,8,60,9],[60,11,60,12],[13,0,13,2],[9,0,9,2],[9,3,9,5],[9,10,9,12],[10,3,10,5],[10,10,10,12],[10,0,10,2],[13,3,13,4],[13,10,13,11],[13,7,13,9],[9,7,9,9],[10,7,10,9],[11,7,11,9],[11,10,11,12],[12,3,12,4],[12,10,12,11],[12,7,12,9],[11,3,11,5],[11,0,11,2],[7,0,7,5],[7,7,7,12],[8,3,8,5],[8,10,8,12],[8,7,8,9],[8,0,8,2],[12,0,12,2],[26,1,26,2],[14,0,14,2],[26,4,26,5],[26,8,26,9],[26,11,26,12],[14,3,14,4],[14,7,14,9],[14,10,14,11],[15,1,15,2],[15,4,15,5],[15,8,15,9],[15,11,15,12],[381,0,381,5],[381,7,381,12],[382,0,382,2],[382,3,382,5],[382,7,382,9],[382,10,382,12],[383,0,383,2],[383,3,383,5],[383,7,383,9],[383,10,383,12],[384,0,384,2],[384,3,384,5],[384,7,384,9],[384,10,384,12],[385,0,385,2],[385,3,385,5],[385,7,385,9],[385,10,385,12],[386,0,386,2],[386,3,386,4],[386,7,386,9],[386,10,386,11],[387,0,387,2],[387,3,387,4],[387,7,387,9],[387,10,387,11],[388,0,388,2],[388,3,388,4],[388,7,388,9],[388,10,388,11],[389,1,389,2],[389,4,389,5],[389,8,389,9],[389,11,389,12],[400,1,400,2],[400,4,400,5],[400,8,400,9],[400,11,400,12],[415,0,415,5],[415,7,415,12],[416,0,416,2],[416,3,416,5],[416,7,416,9],[416,10,416,12],[417,0,417,2],[417,3,417,5],[417,7,417,9],[417,10,417,12],[418,0,418,2],[418,3,418,5],[418,7,418,9],[418,10,418,12],[419,0,419,2],[419,3,419,5],[419,7,419,9],[419,10,419,12],[420,0,420,2],[420,3,420,4],[420,7,420,9],[420,10,420,11],[421,0,421,2],[421,3,421,4],[421,7,421,9],[421,10,421,11],[422,0,422,2],[422,3,422,4],[422,7,422,9],[422,10,422,11],[423,1,423,2],[423,4,423,5],[423,8,423,9],[423,11,423,12],[434,1,434,2],[434,4,434,5],[434,8,434,9],[434,11,434,12],[449,0,449,5],[449,7,449,12],[450,0,450,2],[450,3,450,5],[450,7,450,9],[450,10,450,12],[451,0,451,2],[451,3,451,5],[451,7,451,9],[451,10,451,12],[452,0,452,2],[452,3,452,5],[452,7,452,9],[452,10,452,12],[453,0,453,2],[453,3,453,5],[453,7,453,9],[453,10,453,12],[454,0,454,2],[454,3,454,4],[454,7,454,9],[454,10,454,11],[455,0,455,2],[455,3,455,4],[455,7,455,9],[455,10,455,11],[456,0,456,2],[456,3,456,4],[456,7,456,9],[456,10,456,11],[457,1,457,2],[457,4,457,5],[457,8,457,9],[457,11,457,12],[468,1,468,2],[468,4,468,5],[468,8,468,9],[468,11,468,12],[483,0,483,5],[483,7,483,12],[484,0,484,2],[484,3,484,5],[484,7,484,9],[484,10,484,12],[485,0,485,2],[485,3,485,5],[485,7,485,9],[485,10,485,12],[486,0,486,2],[486,3,486,5],[486,7,486,9],[486,10,486,12],[487,0,487,2],[487,3,487,5],[487,7,487,9],[487,10,487,12],[488,0,488,2],[488,3,488,4],[488,7,488,9],[488,10,488,11],[489,0,489,2],[489,3,489,4],[489,7,489,9],[489,10,489,11],[490,0,490,2],[490,3,490,4],[490,7,490,9],[490,10,490,11],[491,1,491,2],[491,4,491,5],[491,8,491,9],[491,11,491,12],[502,1,502,2],[502,4,502,5],[502,8,502,9],[502,11,502,12],[517,0,517,5],[517,7,517,12],[518,0,518,2],[518,3,518,5],[518,7,518,9],[518,10,518,12],[519,0,519,2],[519,3,519,5],[519,7,519,9],[519,10,519,12],[520,0,520,2],[520,3,520,5],[520,7,520,9],[520,10,520,12],[521,0,521,2],[521,3,521,5],[521,7,521,9],[521,10,521,12],[522,0,522,2],[522,3,522,4],[522,7,522,9],[522,10,522,11],[523,0,523,2],[523,3,523,4],[523,7,523,9],[523,10,523,11],[524,0,524,2],[524,3,524,4],[524,7,524,9],[524,10,524,11],[525,1,525,2],[525,4,525,5],[525,8,525,9],[525,11,525,12],[536,1,536,2],[536,4,536,5],[536,8,536,9],[536,11,536,12],[551,0,551,5],[551,7,551,12],[552,0,552,2],[552,3,552,5],[552,7,552,9],[552,10,552,12],[553,0,553,2],[553,3,553,5],[553,7,553,9],[553,10,553,12],[554,0,554,2],[554,3,554,5],[554,7,554,9],[554,10,554,12],[555,0,555,2],[555,3,555,5],[555,7,555,9],[555,10,555,12],[556,0,556,2],[556,3,556,4],[556,7,556,9],[556,10,556,11],[557,0,557,2],[557,3,557,4],[557,7,557,9],[557,10,557,11],[558,0,558,2],[558,3,558,4],[558,7,558,9],[558,10,558,11],[559,1,559,2],[559,4,559,5],[559,8,559,9],[559,11,559,12],[570,1,570,2],[570,4,570,5],[570,8,570,9],[570,11,570,12]]}
[null,null,null,null,null,null,null,null,null,null,null,null,null,null,{"$f":"TODAY()-1","v":"2015-08-17"}]
[]
[]
[]
["BORDEREAU D'ACHAT N°",null,1,null,null,null,null,"BORDEREAU D'ACHAT N°",null,{"$f":"C5","v":1},null,null,null,null,{"$f":"IF(IF(Plage=$O$1,INDIRECT(ADDRESS(ROW(Plage)+14,4)),0)<>0,MATCH(IF(Plage=$O$1,INDIRECT(ADDRESS(ROW(Plage)+14,4)),0),STATISTIQUE!$A$1:$A$20,0),0)","v":0}]
["Agence:","Lmumba",null,"            Pointe-Noire le",null,"2015-08-17",null,"Agence:","Lmumba",null,"            Pointe-Noire le",null,{"$f":"F6","v":"2015-08-17"}]
[]
["INFORMATIONS DU CLIENT",null,null,null,null,null,null,"INFORMATIONS DU CLIENT"]
["NOM (S) :",null,null,"NZAOU",null,null,null,"NOM (S) :",null,null,{"$f":"IF(D9=\"\",\"\",D9)","v":"NZAOU"}]
[" PRENOM (S):",null,null,"KELLY",null,null,null," PRENOM (S):",null,null,{"$f":"IF(D10=\"\",\"\",D10)","v":"KELLY"}]
["ADRESSE et TELEPHONE:",null,null,"06 401 74 19",null,null,null,"ADRESSE et TELEPHONE:",null,null,"06 401 74 19"]
["N° PASSEPORT:",null,null,null,null,null,null,"N° PASSEPORT:",null,null,""]
["Provenance des devises:",null,null,"FRANCE",null,null,null,"Provenance des devises:",null,null,{"$f":"IF(D13=\"\",\"\",D13)","v":"FRANCE"}]
["Motif:",null,null,"TOURISME",null,null,null,"Motif:",null,null,{"$f":"IF(D14=\"\",\"\",D14)","v":"TOURISME"}]
["Devise:",null,null,"EURO",null,null,null,"Devise:",null,null,"EURO"]
["TAUX 1",650,null,"TAUX 2",null,null,null,"TAUX 1",{"$f":"IF(B16=\"\",\"\",B16)","v":650},null,"TAUX 2",{"$f":"IF(E16=\"\",\"\",E16)","v":""}]
[]
[]
["BILLETAGE",null,null,null,null,null,null,"BILLETAGE"]
["Coupures","Quantité","Valeur","Coupures","Quantité","Valeur",null,"Coupures","Quantité","Valeur","Coupures","Quantité","Valeur"]
[10000,null,{"$f":"B21*A21","v":0},100,null,{"$f":"E21*D21","v":0},null,10000,{"$f":"IF(B21=\"\",\"\",B21)","v":""},{"$f":"IF(C21=\"\",\"\",C21)","v":0},100,{"$f":"IF(E21=\"\",\"\",E21)","v":""},{"$f":"IF(F21=\"\",\"\",F21)","v":0}]
[5000,null,{"$f":"B22*A22","v":0},50,null,{"$f":"E22*D22","v":0},null,5000,{"$f":"IF(B22=\"\",\"\",B22)","v":""},{"$f":"IF(C22=\"\",\"\",C22)","v":0},50,{"$f":"IF(E22=\"\",\"\",E22)","v":""},{"$f":"IF(F22=\"\",\"\",F22)","v":0}]
[2000,null,0,20,1,20,null,2000,"",0,20,1,20]
[1000,null,0,10,null,0,null,1000,"",0,10,"",0]
[500,null,0,5,null,0,null,500,"",0,5,"",0]
[200,null,0,1,null,0,null,200,"",0,1,"",0]
["Valeur Totale",{"$f":"IF(D15=\"CFAO\",(C21+C22+C23+C24+C25),IF(D15=\"DOLLARS\",(F21+F22+F23+F24+F25+F26),IF(D15=\"EURO\",(C25+C26+F21+F22+F23+F24+F25),IF(D15=\"LIVRE STERLING\",(F22+F23+F24+F25),\"\"))))","v":20},null,"Net à Payer",{"$f":"IF(D15=\"CFAO\",B27,IF(D15=\"DOLLARS\",(((F21+F22)*E16)+((F23+F24+F25+F26)*B16)),IF(D15=\"EURO\",(((C25+C26+F21+F22)*E16)+((F23+F24+F25)*B16)),IF(D15=\"LIVRE STERLING\",((F22*E16)+((F23+F24+F25)*B16)),\"\"))))","v":13000},null,null,"Valeur Total",{"$f":"IF(B27=\"\",\"\",B27)","v":20},null,"Net à Payer",{"$f":"IF(E27=\"\",\"\",E27)","v":13000}]
[]
["Caissier",null,null,null,null,"Client",null,"Caissier",null,null,null,null,"Client"]
[]
[]
[]
[]
["."]
[]
[]
[]
[]
["BORDEREAU D'ACHAT N°",null,2,null,null,null,null,"BORDEREAU D'ACHAT N°",null,{"$f":"C39","v":2}]
["Agence:","Lmumba",null,"            Pointe-Noire le",null,"2015-08-17",null,"Agence:","Lmumba",null,"            Pointe-Noire le",null,{"$f":"F40","v":"2015-08-17"}]
{"$rows_left_out":539}
{"sheet":"VENTE","index":1,"n_rows":340,"n_cols":13,"rows_kept":340,"cut":false,"hidden":false,"merged":[[49,0,49,2],[49,3,49,5],[49,7,49,9],[49,10,49,12],[60,1,60,2],[60,4,60,5],[60,8,60,9],[60,11,60,12],[46,0,46,2],[46,3,46,4],[46,7,46,9],[46,10,46,11],[47,0,47,2],[47,3,47,4],[47,7,47,9],[47,10,47,11],[48,0,48,2],[48,3,48,4],[48,7,48,9],[48,10,48,11],[43,0,43,2],[43,3,43,5],[43,7,43,9],[43,10,43,12],[44,0,44,2],[44,3,44,5],[44,7,44,9],[44,10,44,12],[45,0,45,2],[45,3,45,5],[45,7,45,9],[45,10,45,12],[26,1,26,2],[26,4,26,5],[26,8,26,9],[26,11,26,12],[15,3,15,5],[15,0,15,2],[41,0,41,5],[41,7,41,12],[42,0,42,2],[42,3,42,5],[42,7,42,9],[42,10,42,12],[13,0,13,2],[13,3,13,4],[13,7,13,9],[13,10,13,11],[14,0,14,2],[14,3,14,4],[14,7,14,9],[14,10,14,11],[15,7,15,9],[15,10,15,12],[10,0,10,2],[10,3,10,5],[10,7,10,9],[10,10,10,12],[11,0,11,2],[11,3,11,5],[11,7,11,9],[11,10,11,12],[12,0,12,2],[12,3,12,4],[12,7,12,9],[12,10,12,11],[7,0,7,5],[7,7,7,12],[8,0,8,2],[8,3,8,5],[8,7,8,9],[8,10,8,12],[9,0,9,2],[9,3,9,5],[9,7,9,9],[9,10,9,12],[77,0,77,2],[77,3,77,5],[77,7,77,9],[77,10,77,12],[78,0,78,2],[78,3,78,5],[78,7,78,9],[78,10,78,12],[75,0,75,5],[75,7,75,12],[76,0,76,2],[76,3,76,5],[76,7,76,9],[76,10,76,12],[81,0,81,2],[81,3,81,4],[81,7,81,9],[81,10,81,11],[82,0,82,2],[82,3,82,4],[82,7,82,9],[82,10,82,11],[79,0,79,2],[79,3,79,5],[79,7,79,9],[79,10,79,12],[80,0,80,2],[80,3,80,4],[80,7,80,9],[80,10,80,11],[109,0,109,5],[109,7,109,12],[110,0,110,2],[110,3,110,5],[110,7,110,9],[110,10,110,12],[83,0,83,2],[83,3,83,5],[83,7,83,9],[83,10,83,12],[94,1,94,2],[94,4,94,5],[94,8,94,9],[94,11,94,12],[113,0,113,2],[113,3,113,5],[113,7,113,9],[113,10,113,12],[114,0,114,2],[114,3,114,4],[114,7,114,9],[114,10,114,11],[111,0,111,2],[111,3,111,5],[111,7,111,9],[111,10,111,12],[112,0,112,2],[112,3,112,5],[112,7,112,9],[112,10,112,12],[117,0,117,2],[117,3,117,5],[117,7,117,9],[117,10,117,12],[128,1,128,2],[128,4,128,5],[128,8,128,9],[128,11,128,12],[115,0,115,2],[115,3,115,4],[115,7,115,9],[115,10,115,11],[116,0,116,2],[116,3,116,4],[116,7,116,9],[116,10,116,11],[145,0,145,2],[145,3,145,5],[145,7,145,9],[145,10,145,12],[146,0,146,2],[146,3,146,5],[146,7,146,9],[146,10,146,12],[143,0,143,5],[143,7,143,12],[144,0,144,2],[144,3,144,5],[144,7,144,9],[144,10,144,12],[149,0,149,2],[149,3,149,4],[149,7,149,9],[149,10,149,11],[150,0,150,2],[150,3,150,4],[150,7,150,9],[150,10,150,11],[147,0,147,2],[147,3,147,5],[147,7,147,9],[147,10,147,12],[148,0,148,2],[148,3,148,4],[148,7,148,9],[148,10,148,11],[177,0,177,5],[177,7,177,12],[178,0,178,2],[178,3,178,5],[178,7,178,9],[178,10,178,12],[151,0,151,2],[151,3,151,5],[151,7,151,9],[151,10,151,12],[162,1,162,2],[162,4,162,5],[162,8,162,9],[162,11,162,12],[181,0,181,2],[181,3,181,5],[181,7,181,9],[181,10,181,12],[182,0,182,2],[182,3,182,4],[182,7,182,9],[182,10,182,11],[179,0,179,2],[179,3,179,5],[179,7,179,9],[179,10,179,12],[180,0,180,2],[180,3,180,5],[180,7,180,9],[180,10,180,12],[185,0,185,2],[185,3,185,5],[185,7,185,9],[185,10,185,12],[196,1,196,2],[196,4,196,5],[196,8,196,9],[196,11,196,12],[183,0,183,2],[183,3,183,4],[183,7,183,9],[183,10,183,11],[184,0,184,2],[184,3,184,4],[184,7,184,9],[184,10,184,11],[213,0,213,2],[213,3,213,5],[213,7,213,9],[213,10,213,12],[214,0,214,2],[214,3,214,5],[214,7,214,9],[214,10,214,12],[211,0,211,5],[211,7,211,12],[212,0,212,2],[212,3,212,5],[212,7,212,9],[212,10,212,12],[217,0,217,2],[217,3,217,4],[217,7,217,9],[217,10,217,11],[218,0,218,2],[218,3,218,4],[218,7,218,9],[218,10,218,11],[215,0,215,2],[215,3,215,5],[215,7,215,9],[215,10,215,12],[216,0,216,2],[216,3,216,4],[216,7,216,9],[216,10,216,11],[245,0,245,5],[245,7,245,12],[246,0,246,2],[246,3,246,5],[246,7,246,9],[246,10,246,12],[219,0,219,2],[219,3,219,5],[219,7,219,9],[219,10,219,12],[230,1,230,2],[230,4,230,5],[230,8,230,9],[230,11,230,12],[249,0,249,2],[249,3,249,5],[249,7,249,9],[249,10,249,12],[250,0,250,2],[250,3,250,4],[250,7,250,9],[250,10,250,11],[247,0,247,2],[247,3,247,5],[247,7,247,9],[247,10,247,12],[248,0,248,2],[248,3,248,5],[248,7,248,9],[248,10,248,12],[253,0,253,2],[253,3,253,5],[253,7,253,9],[253,10,253,12],[264,1,264,2],[264,4,264,5],[264,8,264,9],[264,11,264,12],[251,0,251,2],[251,3,251,4],[251,7,251,9],[251,10,251,11],[252,0,252,2],[252,3,252,4],[252,7,252,9],[252,10,252,11],[281,0,281,2],[281,3,281,5],[281,7,281,9],[281,10,281,12],[282,0,282,2],[282,3,282,5],[282,7,282,9],[282,10,282,12],[279,0,279,5],[279,7,279,12],[280,0,280,2],[280,3,280,5],[280,7,280,9],[280,10,280,12],[285,0,285,2],[285,3,285,4],[285,7,285,9],[285,10,285,11],[286,0,286,2],[286,3,286,4],[286,7,286,9],[286,10,286,11],[283,0,283,2],[283,3,283,5],[283,7,283,9],[283,10,283,12],[284,0,284,2],[284,3,284,4],[284,7,284,9],[284,10,284,11],[313,0,313,5],[313,7,313,12],[314,0,314,2],[314,3,314,5],[314,7,314,9],[314,10,314,12],[287,0,287,2],[287,3,287,5],[287,7,287,9],[287,10,287,12],[298,1,298,2],[298,4,298,5],[298,8,298,9],[298,11,298,12],[317,0,317,2],[317,3,317,5],[317,7,317,9],[317,10,317,12],[318,0,318,2],[318,3,318,4],[318,7,318,9],[318,10,318,11],[315,0,315,2],[315,3,315,5],[315,7,315,9],[315,10,315,12],[316,0,316,2],[316,3,316,5],[316,7,316,9],[316,10,316,12],[321,0,321,2],[321,3,321,5],[321,7,321,9],[321,10,321,12],[332,1,332,2],[332,4,332,5],[332,8,332,9],[332,11,332,12],[319,0,319,2],[319,3,319,4],[319,7,319,9],[319,10,319,11],[320,0,320,2],[320,3,320,4],[320,7,320,9],[320,10,320,11]]}
[]
[]
[]
[]
["BORDEREAU DE VENTE N°",null,1,null,null,null,null,"BORDEREAU DE VENTE N°",null,{"$f":"C5","v":1}]
["Agence:","Lmumba",null,"            Pointe-Noire le",null,"2015-08-17",null,"Agence:","Lmumba",null,"            Pointe-Noire le",null,{"$f":"F6","v":"2015-08-17"}]
[]
["INFORMATIONS DU CLIENT",null,null,null,null,null,null,"INFORMATIONS DU CLIENT"]
["NOM (S) :",null,null,"CAMPISI ",null,null,null,"NOM (S) :",null,null,{"$f":"IF(D9=\"\",\"\",D9)","v":"CAMPISI "}]
[" PRENOM (S):",null,null,"SANTOR ROSARIO",null,null,null," PRENOM (S):",null,null,{"$f":"IF(D10=\"\",\"\",D10)","v":"SANTOR ROSARIO"}]
["ADRESSE et TELEPHONE:",null,null,"05 652 60 86",null,null,null,"ADRESSE et TELEPHONE:",null,null,"05 652 60 86"]
["N° PASSEPORT:",null,null,"YA2328140",null,null,null,"N° PASSEPORT:",null,null,"YA2328140"]
["Destination des devises:",null,null,"ITALIE",null,null,null,"Destination des devises:",null,null,{"$f":"IF(D13=\"\",\"\",D13)","v":"ITALIE"}]
["Motif:",null,null,"Tourisme",null,null,null,"Motif:",null,null,{"$f":"IF(D14=\"\",\"\",D14)","v":"Tourisme"}]
["Devise:",null,null,"DOLLARS",null,null,null,"Devise:",null,null,"DOLLARS"]
["TAUX Moyen de VENTE",null,null,640,null,null,null,"TAUX Moyen de VENTE",null,null,{"$f":"IF(D16=\"\",\"\",D16)","v":640}]
[]
[]
["BILLETAGE",null,null,null,null,null,null,"BILLETAGE"]
["Coupures","Quantité","Valeur","Coupures","Quantité","Valeur",null,"Coupures","Quantité","Valeur","Coupures","Quantité","Valeur"]
[10000,null,{"$f":"B21*A21","v":0},100,5,{"$f":"E21*D21","v":500},null,10000,{"$f":"IF(B21=\"\",\"\",B21)","v":""},{"$f":"IF(C21=\"\",\"\",C21)","v":0},100,{"$f":"IF(E21=\"\",\"\",E21)","v":5},{"$f":"IF(F21=\"\",\"\",F21)","v":500}]
[5000,null,{"$f":"B22*A22","v":0},50,null,{"$f":"E22*D22","v":0},null,5000,{"$f":"IF(B22=\"\",\"\",B22)","v":""},0,50,{"$f":"IF(E22=\"\",\"\",E22)","v":""},0]
[2000,null,0,20,null,0,null,2000,"",0,20,"",0]
[1000,null,0,10,null,0,null,1000,"",0,10,"",0]
[500,null,0,5,1,5,null,500,"",0,5,1,5]
[200,null,0,1,null,0,null,200,"",0,1,"",0]
["Valeur Totale",{"$f":"IF(D15=\"CFAO\",(C21+C22+C23+C24+C25),IF(D15=\"DOLLARS\",(F21+F22+F23+F24+F25+F26),IF(D15=\"EURO\",(C25+C26+F21+F22+F23+F24+F25),IF(D15=\"LIVRE STERLING\",(F22+F23+F24+F25),\"\"))))","v":505},null,"Net à Payer",{"$f":"PRODUCT(D16,B27)","v":323200},null,null,"Valeur Totale",{"$f":"IF(B27=\"\",\"\",B27)","v":505},null,"Net à Payer",{"$f":"IF(E27=\"\",\"\",E27)","v":323200}]
[]
["Caissier ",null,null,null,null,"Client",null,"Caissier",null,null,null,null,"Client"]
[]
[]
[]
[]
["."]
[]
[]
[]
[]
["BORDEREAU DE VENTE N°",null,2,null,null,null,null,"BORDEREAU DE VENTE N°",null,{"$f":"C39","v":2}]
["Agence:","Lmumba",null,"            Pointe-Noire le",null,"2015-08-17",null,"Agence:","Lmumba",null,"            Pointe-Noire le",null,{"$f":"F40","v":"2015-08-17"}]
{"$rows_left_out":301}
{"sheet":"STATISTIQUE","index":2,"n_rows":33,"n_cols":10,"rows_kept":33,"cut":false,"hidden":false,"merged":[[14,3,14,4],[14,5,14,6]]}
[null,null,null,null,null,null,null,null,null,{"$f":"TODAY()-1","v":"2015-08-17"}]
[]
[]
[null,null,null,"STATISTIQUE DES OPERATIONS DE CHANGE"]
[]
[null,null,null,null,null,null,null,"Pointe-Noire, le","2015-08-17"]
["Agence","Lumumba"]
[]
[]
["DEVISE","OUVERTURE","APPRO","VALEUR ACHAT","Montant ACHAT","VALEUR VENTE","Montant VENTE","RAPATRIE","CLOTURE"]
["CFAO",2000,null,{"$f":"SUMPRODUCT((ACHAT!$M$1:$M$100000=$J$1)*(ACHAT!$D$10:$D$100009=$A11)*IF(ISNUMBER(ACHAT!$B$22:$B$100021),ACHAT!$B$22:$B$100021,0))","v":100000},{"$f":"SUMPRODUCT((ACHAT!$M$1:$M$100000=$J$1)*(ACHAT!$D$10:$D$100009=$A11)*IF(ISNUMBER(ACHAT!$E$22:$E$100021),ACHAT!$E$22:$E$100021,0))","v":100000},{"$f":"SUMPRODUCT((VENTE!$M$1:$M$100000=$J$1)*(VENTE!$D$10:$D$100009=$A11)*IF(ISNUMBER(VENTE!$B$22:$B$100021),VENTE!$B$22:$B$100021,0))","v":0},{"$f":"SUMPRODUCT((VENTE!$M$1:$M$100000=$J$1)*(VENTE!$D$10:$D$100009=$A11)*IF(ISNUMBER(VENTE!$E$22:$E$100021),VENTE!$E$22:$E$100021,0))","v":0},null,{"$f":"(B11+C11+D11)-(F11+H11)","v":102000}]
["DOLLARS",918,null,{"$f":"SUMPRODUCT((ACHAT!$M$1:$M$100000=$J$1)*(ACHAT!$D$10:$D$100009=$A12)*IF(ISNUMBER(ACHAT!$B$22:$B$100021),ACHAT!$B$22:$B$100021,0))","v":60},{"$f":"SUMPRODUCT((ACHAT!$M$1:$M$100000=$J$1)*(ACHAT!$D$10:$D$100009=$A12)*IF(ISNUMBER(ACHAT!$E$22:$E$100021),ACHAT!$E$22:$E$100021,0))","v":35000},{"$f":"SUMPRODUCT((VENTE!$M$1:$M$100000=$J$1)*(VENTE!$D$10:$D$100009=$A12)*IF(ISNUMBER(VENTE!$B$22:$B$100021),VENTE!$B$22:$B$100021,0))","v":505},{"$f":"SUMPRODUCT((VENTE!$M$1:$M$100000=$J$1)*(VENTE!$D$10:$D$100009=$A12)*IF(ISNUMBER(VENTE!$E$22:$E$100021),VENTE!$E$22:$E$100021,0))","v":323200},null,{"$f":"(B12+C12+D12)-(F12+H12)","v":473}]
["EURO",7050,null,{"$f":"SUMPRODUCT((ACHAT!$M$1:$M$100000=$J$1)*(ACHAT!$D$10:$D$100009=$A13)*IF(ISNUMBER(ACHAT!$B$22:$B$100021),ACHAT!$B$22:$B$100021,0))","v":1910},{"$f":"SUMPRODUCT((ACHAT!$M$1:$M$100000=$J$1)*(ACHAT!$D$10:$D$100009=$A13)*IF(ISNUMBER(ACHAT!$E$22:$E$100021),ACHAT!$E$22:$E$100021,0))","v":1252300},{"$f":"SUMPRODUCT((VENTE!$M$1:$M$100000=$J$1)*(VENTE!$D$10:$D$100009=$A13)*IF(ISNUMBER(VENTE!$B$22:$B$100021),VENTE!$B$22:$B$100021,0))","v":7540},{"$f":"SUMPRODUCT((VENTE!$M$1:$M$100000=$J$1)*(VENTE!$D$10:$D$100009=$A13)*IF(ISNUMBER(VENTE!$E$22:$E$100021),VENTE!$E$22:$E$100021,0))","v":5218300},null,1420]
["Livre Sterling",30,null,{"$f":"SUMPRODUCT((ACHAT!$M$1:$M$100000=$J$1)*(ACHAT!$D$10:$D$100009=$A14)*IF(ISNUMBER(ACHAT!$B$22:$B$100021),ACHAT!$B$22:$B$100021,0))","v":90},{"$f":"SUMPRODUCT((ACHAT!$M$1:$M$100000=$J$1)*(ACHAT!$D$10:$D$100009=$A14)*IF(ISNUMBER(ACHAT!$E$22:$E$100021),ACHAT!$E$22:$E$100021,0))","v":54000},{"$f":"SUMPRODUCT((VENTE!$M$1:$M$100000=$J$1)*(VENTE!$D$10:$D$100009=$A14)*IF(ISNUMBER(VENTE!$B$22:$B$100021),VENTE!$B$22:$B$100021,0))","v":0},{"$f":"SUMPRODUCT((VENTE!$M$1:$M$100000=$J$1)*(VENTE!$D$10:$D$100009=$A14)*IF(ISNUMBER(VENTE!$E$22:$E$100021),VENTE!$E$22:$E$100021,0))","v":0},null,120]
["XAF",3172870,107500,{"$f":"E14+E13+E12+E11","v":1441300},null,{"$f":"G14+G13+G12+G11","v":5541500},null,2325000,{"$f":"(B15+C15+F15)-(D15+H15)","v":5055570}]
[]
[null,"Chef d'agence",null,null,null,null,null,"Caissier"]
[]
[]
[]
[]
[]
["MOTIFS DE RAPATRIEMENT",null,null,null,null,"PROVENANCE DE L'APPROVISIONNEMENT"]
["_",null,null,null,null,"_"]
["_",null,null,null,null,"_"]
["_",null,null,null,null,"_"]
["_",null,null,null,null,"_"]
["_",null,null,null,null,"_"]
["_",null,null,null,null,"_"]
["_",null,null,null,null,"_"]
[]
[]
["."]

{"sheet":"Feuil2","index":3,"n_rows":154,"n_cols":1,"rows_kept":154,"cut":false,"hidden":false,"merged":[]}
["AFGHANISTAN"]
["AFRIQUE DU SUD"]
["ALBANIE"]
["ABOU DHABI"]
["ALGÉRIE"]
["ALLEMAGNE"]
["ANGLETERRE"]
["ANGOLA"]
["ARABIE SAOUDITE"]
["ARGENTINE"]
["ARMÉNIE"]
["AUSTRALIE"]
["BANGLADESH"]
["BELGIQUE"]
["BÉNIN"]
["BOLIVIE"]
["BOSNIE-HERZÉGOVINE"]
["BOTSWANA"]
["BRÉSIL"]
["BULGARIE"]
["BURKINA FASO"]
["BURUNDI"]
["CAMBODGE"]
["CAMEROUN"]
["CANADA"]
["CAP-VERT"]
["CENTRAFRIQUE"]
["CHILI"]
["CHINE"]
["CHYPRE"]
["COLOMBIE"]
["COMORES"]
["CONGO,RD"]
["CORÉE, RÉPUBLIQUE DE"]
["CORÉE DU NORD"]
["COSTA RICA"]
["CÔTE D’IVOIRE"]
["CROATIE"]
["CUBA"]
["DANEMARK"]
{"$rows_left_out":114}