{"text_format":"1","workbook":"xlsx","n_sheets":10,"sheets":["Histo","En cours","Feuil3","Feuil4","Feuil5","Feuil6","Feuil7","Feuil8","Feuil9","Feuil10"],"not_rendered":{"charts":0,"images":0,"macros":1,"external_links":0,"defined_names":0,"comments":1,"pivot_tables":0},"unopened":[],"bounds":{"document_bytes":16777216,"sheet_cells":100000,"rows_first":2000,"rows_last":500,"rows_between":2000,"halvings":0,"cell_chars":16384,"cell_head_chars":4096},"cells_cut":0,"cells_raw":0,"read":"whole","date_system":"1900"}

{"sheet":"Histo","index":0,"n_rows":10,"n_cols":6,"rows_kept":10,"cut":false,"hidden":false,"merged":[]}
["N° ORDRE","NOM","PRENOM","DATE D'ADHESION","DEMANDE RENOUV.","RENOUVELLEMENT (O ou N)"]
[]
[{"$f":"ROW(A1)","v":1},"ALLIER","Arlette","2013-02-01",{"$f":"D3+300","v":"2013-11-28"},"N"]
[{"$f":"ROW(A2)","v":2},"ALLIER","Jean Claude","2013-03-15",{"$f":"D4+300","v":"2014-01-09"},"O"]
[3,"ANSQUER","Gisèle","2015-01-01","2015-10-28","O"]
[4,"BANCAREL","Claude","2012-01-15","2012-11-10","N"]
[5,"BANCAREL","Gisèle","2012-01-15","2012-11-10","O"]
[6,"XX","Patrick","2013-10-10","2014-08-06","O"]
[7,"YY","Serge","2011-01-01","2011-10-28","N"]
[8,"ZZ","Guy","2012-03-11","2013-01-05","O"]

{"sheet":"En cours","index":1,"n_rows":16,"n_cols":7,"rows_kept":16,"cut":false,"hidden":false,"merged":[]}
["N° ORDRE","NOM","PRENOM","DATE D'ADHESION","DATE RENOUVEL."]
[]
[{"$f":"IF(Histo!$F3=\"O\",Histo!A3,\"\")","v":""},{"$f":"IF(Histo!$F3=\"O\",Histo!B3,\"\")","v":""},{"$f":"IF(Histo!$F3=\"O\",Histo!C3,\"\")","v":""},{"$f":"IF(Histo!$F3=\"O\",Histo!D3,\"\")","v":""},{"$f":"IF(Histo!$F3=\"O\",Histo!E3,\"\")","v":""}]
[{"$f":"IF(Histo!$F4=\"O\",Histo!A4,\"\")","v":2},{"$f":"IF(Histo!$F4=\"O\",Histo!B4,\"\")","v":"ALLIER"},{"$f":"IF(Histo!$F4=\"O\",Histo!C4,\"\")","v":"Jean Claude"},{"$f":"IF(Histo!$F4=\"O\",Histo!D4,\"\")","v":"2013-03-15"},{"$f":"IF(D4<>\"\",D4+365,\"\")","v":"2014-03-15"}]
[{"$f":"IF(Histo!$F5=\"O\",Histo!A5,\"\")","v":3},{"$f":"IF(Histo!$F5=\"O\",Histo!B5,\"\")","v":"ANSQUER"},{"$f":"IF(Histo!$F5=\"O\",Histo!C5,\"\")","v":"Gisèle"},{"$f":"IF(Histo!$F5=\"O\",Histo!D5,\"\")","v":"2015-01-01"},{"$f":"IF(D5<>\"\",D5+365,\"\")","v":"2016-01-01"}]
[{"$f":"IF(Histo!$F7=\"O\",Histo!A7,\"\")","v":5},{"$f":"IF(Histo!$F7=\"O\",Histo!B7,\"\")","v":"BANCAREL"},{"$f":"IF(Histo!$F7=\"O\",Histo!C7,\"\")","v":"Gisèle"},{"$f":"IF(Histo!$F7=\"O\",Histo!D7,\"\")","v":"2012-01-15"},{"$f":"IF(D6<>\"\",D6+365,\"\")","v":"2013-01-14"}]
[{"$f":"IF(Histo!$F8=\"O\",Histo!A8,\"\")","v":6},{"$f":"IF(Histo!$F8=\"O\",Histo!B8,\"\")","v":"XX"},{"$f":"IF(Histo!$F8=\"O\",Histo!C8,\"\")","v":"Patrick"},{"$f":"IF(Histo!$F8=\"O\",Histo!D8,\"\")","v":"2013-10-10"},{"$f":"IF(D7<>\"\",D7+365,\"\")","v":"2014-10-10"}]
[{"$f":"IF(Histo!$F10=\"O\",Histo!A10,\"\")","v":8},{"$f":"IF(Histo!$F10=\"O\",Histo!B10,\"\")","v":"ZZ"},{"$f":"IF(Histo!$F10=\"O\",Histo!C10,\"\")","v":"Guy"},{"$f":"IF(Histo!$F10=\"O\",Histo!D10,\"\")","v":"2012-03-11"},{"$f":"IF(D8<>\"\",D8+365,\"\")","v":"2013-03-11"}]
[{"$f":"IF(Histo!$F9=\"O\",Histo!A9,\"\")","v":""},{"$f":"IF(Histo!$F9=\"O\",Histo!B9,\"\")","v":""},{"$f":"IF(Histo!$F9=\"O\",Histo!C9,\"\")","v":""},{"$f":"IF(Histo!$F9=\"O\",Histo!D9,\"\")","v":""},{"$f":"IF(D9<>\"\",D9+365,\"\")","v":""}]
[{"$f":"IF(Histo!$F11=\"O\",Histo!A11,\"\")","v":""},{"$f":"IF(Histo!$F11=\"O\",Histo!B11,\"\")","v":""},{"$f":"IF(Histo!$F11=\"O\",Histo!C11,\"\")","v":""},{"$f":"IF(Histo!$F11=\"O\",Histo!D11,\"\")","v":""},{"$f":"IF(D10<>\"\",D10+365,\"\")","v":""},null," "]
[{"$f":"IF(Histo!$F12=\"O\",Histo!A12,\"\")","v":""},{"$f":"IF(Histo!$F12=\"O\",Histo!B12,\"\")","v":""},{"$f":"IF(Histo!$F12=\"O\",Histo!C12,\"\")","v":""},{"$f":"IF(Histo!$F12=\"O\",Histo!D12,\"\")","v":""},{"$f":"IF(D11<>\"\",D11+365,\"\")","v":""}]
[{"$f":"IF(Histo!$F13=\"O\",Histo!A13,\"\")","v":""},{"$f":"IF(Histo!$F13=\"O\",Histo!B13,\"\")","v":""},{"$f":"IF(Histo!$F13=\"O\",Histo!C13,\"\")","v":""},{"$f":"IF(Histo!$F13=\"O\",Histo!D13,\"\")","v":""},{"$f":"IF(D12<>\"\",D12+365,\"\")","v":""}]
[{"$f":"IF(Histo!$F14=\"O\",Histo!A14,\"\")","v":""},{"$f":"IF(Histo!$F14=\"O\",Histo!B14,\"\")","v":""},{"$f":"IF(Histo!$F14=\"O\",Histo!C14,\"\")","v":""},{"$f":"IF(Histo!$F14=\"O\",Histo!D14,\"\")","v":""},{"$f":"IF(D13<>\"\",D13+365,\"\")","v":""}]
[{"$f":"IF(Histo!$F15=\"O\",Histo!A15,\"\")","v":""},{"$f":"IF(Histo!$F15=\"O\",Histo!B15,\"\")","v":""},{"$f":"IF(Histo!$F15=\"O\",Histo!C15,\"\")","v":""},{"$f":"IF(Histo!$F15=\"O\",Histo!D15,\"\")","v":""},{"$f":"IF(D14<>\"\",D14+365,\"\")","v":""}]
[{"$f":"IF(Histo!$F16=\"O\",Histo!A16,\"\")","v":""},{"$f":"IF(Histo!$F16=\"O\",Histo!B16,\"\")","v":""},{"$f":"IF(Histo!$F16=\"O\",Histo!C16,\"\")","v":""},{"$f":"IF(Histo!$F16=\"O\",Histo!D16,\"\")","v":""},{"$f":"IF(D15<>\"\",D15+365,\"\")","v":""}]
[{"$f":"IF(Histo!$F17=\"O\",Histo!A17,\"\")","v":""},{"$f":"IF(Histo!$F17=\"O\",Histo!B17,\"\")","v":""},{"$f":"IF(Histo!$F17=\"O\",Histo!C17,\"\")","v":""},{"$f":"IF(Histo!$F17=\"O\",Histo!D17,\"\")","v":""},{"$f":"IF(D16<>\"\",D16+365,\"\")","v":""}]

{"sheet":"Feuil3","index":2,"n_rows":0,"n_cols":0,"rows_kept":0,"cut":false,"hidden":false,"merged":[]}

{"sheet":"Feuil4","index":3,"n_rows":0,"n_cols":0,"rows_kept":0,"cut":false,"hidden":false,"merged":[]}

{"sheet":"Feuil5","index":4,"n_rows":0,"n_cols":0,"rows_kept":0,"cut":false,"hidden":false,"merged":[]}

{"sheet":"Feuil6","index":5,"n_rows":0,"n_cols":0,"rows_kept":0,"cut":false,"hidden":false,"merged":[]}

{"sheet":"Feuil7","index":6,"n_rows":0,"n_cols":0,"rows_kept":0,"cut":false,"hidden":false,"merged":[]}

{"sheet":"Feuil8","index":7,"n_rows":0,"n_cols":0,"rows_kept":0,"cut":false,"hidden":false,"merged":[]}

{"sheet":"Feuil9","index":8,"n_rows":0,"n_cols":0,"rows_kept":0,"cut":false,"hidden":false,"merged":[]}

{"sheet":"Feuil10","index":9,"n_rows":0,"n_cols":0,"rows_kept":0,"cut":false,"hidden":false,"merged":[]}