{"text_format":"1","workbook":"xlsx","n_sheets":3,"sheets":["BdD","Virement","Autres"],"not_rendered":{"charts":0,"images":0,"macros":1,"external_links":0,"defined_names":4,"comments":0,"pivot_tables":0},"unopened":[],"bounds":{"document_bytes":16777216,"sheet_cells":100000,"rows_first":2000,"rows_last":500,"rows_between":2000,"halvings":0,"cell_chars":16384,"cell_head_chars":4096},"cells_cut":0,"cells_raw":0,"read":"whole","date_system":"1900"}

{"sheet":"BdD","index":0,"n_rows":1093,"n_cols":24,"rows_kept":1093,"cut":false,"hidden":false,"merged":[]}
[]
[{"$f":"COUNTIF(B:B,\"Lucas\")","v":7}]
[null,null,null,null,null,null,null,null,null,null,null,null,null,null,null,null,null,null,null,null,null,null,"liste évolutive nommée VIR","liste évolutive nommée AUT"]
[]
[]
[]
[null,null,null,null,null,null,null,null,null,null,null,null,null,null,null,null,null,null,null,null,null,"CODE","Liste Virement","Listes autres"]
["2015-12-03","Virement__AA66","Rejeté",null,null,null,null,null,null,null,null,null,null,null,null,null,null,null,null,null,null,{"$f":"IF(AND(C8=\"Terminé\",COUNTIF(B8,\"*Virement*\")),\"VIR\"&COUNTIF($V$7:V7,\"VIR*\"),IF(COUNTIF(B8,\"*Virement*\"),\"\",IF(COUNTIF($B$8:B8,B8)=1,\"_\"&\"AUTO\"&COUNTIF($V$7:V7,\"*AUTO*\"),\"\")))","v":""},{"$f":"IFERROR(INDEX($B:$B,MATCH(\"VIR\"&ROW()-8,$V:$V,0)),\"\")","v":"Virement__AA78"},{"$f":"IFERROR(INDEX($B:$B,MATCH(\"*AUTO*\"&ROW()-8,$V:$V,0)),\"\")","v":"Lucas"}]
["2015-12-10","Virement__AA39","En cours",null,null,null,null,null,null,null,null,null,null,null,null,null,null,null,null,null,null,{"$f":"IF(AND(C9=\"Terminé\",COUNTIF(B9,\"*Virement*\")),\"VIR\"&COUNTIF($V$7:V8,\"VIR*\"),IF(COUNTIF(B9,\"*Virement*\"),\"\",IF(COUNTIF($B$8:B9,B9)=1,\"_\"&\"AUTO\"&COUNTIF($V$7:V8,\"*AUTO*\"),\"\")))","v":""},{"$f":"IFERROR(INDEX(B:B,MATCH(\"VIR\"&ROW()-8,V:V,0)),\"\")","v":"Virement__AA14"},{"$f":"IFERROR(INDEX($B:$B,MATCH(\"*AUTO*\"&ROW()-8,$V:$V,0)),\"\")","v":"Pierrette"}]
["2015-08-18","Lucas",null,null,null,null,null,null,null,null,null,null,null,null,null,null,null,null,null,null,null,{"$f":"IF(AND(C10=\"Terminé\",COUNTIF(B10,\"*Virement*\")),\"VIR\"&COUNTIF($V$7:V9,\"VIR*\"),IF(COUNTIF(B10,\"*Virement*\"),\"\",IF(COUNTIF($B$8:B10,B10)=1,\"_\"&\"AUTO\"&COUNTIF($V$7:V9,\"*AUTO*\"),\"\")))","v":"_AUTO0"},"Virement__AA63","Eric"]
["2015-09-15","Pierrette",null,null,null,null,null,null,null,null,null,null,null,null,null,null,null,null,null,null,null,{"$f":"IF(AND(C11=\"Terminé\",COUNTIF(B11,\"*Virement*\")),\"VIR\"&COUNTIF($V$7:V10,\"VIR*\"),IF(COUNTIF(B11,\"*Virement*\"),\"\",IF(COUNTIF($B$8:B11,B11)=1,\"_\"&\"AUTO\"&COUNTIF($V$7:V10,\"*AUTO*\"),\"\")))","v":"_AUTO1"},"Virement__AA48","Léa"]
["2015-06-06","Virement__AA78","Terminé",null,null,null,null,null,null,null,null,null,null,null,null,null,null,null,null,null,null,{"$f":"IF(AND(C12=\"Terminé\",COUNTIF(B12,\"*Virement*\")),\"VIR\"&COUNTIF($V$7:V11,\"VIR*\"),IF(COUNTIF(B12,\"*Virement*\"),\"\",IF(COUNTIF($B$8:B12,B12)=1,\"_\"&\"AUTO\"&COUNTIF($V$7:V11,\"*AUTO*\"),\"\")))","v":"VIR0"},"Virement__AA51","Monique"]
["2015-06-29","Eric",null,null,null,null,null,null,null,null,null,null,null,null,null,null,null,null,null,null,null,{"$f":"IF(AND(C13=\"Terminé\",COUNTIF(B13,\"*Virement*\")),\"VIR\"&COUNTIF($V$7:V12,\"VIR*\"),IF(COUNTIF(B13,\"*Virement*\"),\"\",IF(COUNTIF($B$8:B13,B13)=1,\"_\"&\"AUTO\"&COUNTIF($V$7:V12,\"*AUTO*\"),\"\")))","v":"_AUTO2"},"Virement__AA19","Patrick"]
["2015-12-11","Léa",null,null,null,null,null,null,null,null,null,null,null,null,null,null,null,null,null,null,null,{"$f":"IF(AND(C14=\"Terminé\",COUNTIF(B14,\"*Virement*\")),\"VIR\"&COUNTIF($V$7:V13,\"VIR*\"),IF(COUNTIF(B14,\"*Virement*\"),\"\",IF(COUNTIF($B$8:B14,B14)=1,\"_\"&\"AUTO\"&COUNTIF($V$7:V13,\"*AUTO*\"),\"\")))","v":"_AUTO3"},"Virement__AA40","Chrystel"]
["2016-01-19","Monique",null,null,null,null,null,null,null,null,null,null,null,null,null,null,null,null,null,null,null,{"$f":"IF(AND(C15=\"Terminé\",COUNTIF(B15,\"*Virement*\")),\"VIR\"&COUNTIF($V$7:V14,\"VIR*\"),IF(COUNTIF(B15,\"*Virement*\"),\"\",IF(COUNTIF($B$8:B15,B15)=1,\"_\"&\"AUTO\"&COUNTIF($V$7:V14,\"*AUTO*\"),\"\")))","v":"_AUTO4"},"Virement__AA61","Philippe"]
["2015-11-24","Patrick",null,null,null,null,null,null,null,null,null,null,null,null,null,null,null,null,null,null,null,{"$f":"IF(AND(C16=\"Terminé\",COUNTIF(B16,\"*Virement*\")),\"VIR\"&COUNTIF($V$7:V15,\"VIR*\"),IF(COUNTIF(B16,\"*Virement*\"),\"\",IF(COUNTIF($B$8:B16,B16)=1,\"_\"&\"AUTO\"&COUNTIF($V$7:V15,\"*AUTO*\"),\"\")))","v":"_AUTO5"},"Virement__AA32","Eloide"]
["2016-01-26","Pierrette",null,null,null,null,null,null,null,null,null,null,null,null,null,null,null,null,null,null,null,{"$f":"IF(AND(C17=\"Terminé\",COUNTIF(B17,\"*Virement*\")),\"VIR\"&COUNTIF($V$7:V16,\"VIR*\"),IF(COUNTIF(B17,\"*Virement*\"),\"\",IF(COUNTIF($B$8:B17,B17)=1,\"_\"&\"AUTO\"&COUNTIF($V$7:V16,\"*AUTO*\"),\"\")))","v":""},"Virement__AA77","Simone"]
["2015-12-31","Léa",null,null,null,null,null,null,null,null,null,null,null,null,null,null,null,null,null,null,null,{"$f":"IF(AND(C18=\"Terminé\",COUNTIF(B18,\"*Virement*\")),\"VIR\"&COUNTIF($V$7:V17,\"VIR*\"),IF(COUNTIF(B18,\"*Virement*\"),\"\",IF(COUNTIF($B$8:B18,B18)=1,\"_\"&\"AUTO\"&COUNTIF($V$7:V17,\"*AUTO*\"),\"\")))","v":""},"Virement__AA28","André"]
["2015-10-11","Virement__AA43","Rejeté",null,null,null,null,null,null,null,null,null,null,null,null,null,null,null,null,null,null,{"$f":"IF(AND(C19=\"Terminé\",COUNTIF(B19,\"*Virement*\")),\"VIR\"&COUNTIF($V$7:V18,\"VIR*\"),IF(COUNTIF(B19,\"*Virement*\"),\"\",IF(COUNTIF($B$8:B19,B19)=1,\"_\"&\"AUTO\"&COUNTIF($V$7:V18,\"*AUTO*\"),\"\")))","v":""},"Virement__AA70","Francette"]
["2015-11-19","Eric",null,null,null,null,null,null,null,null,null,null,null,null,null,null,null,null,null,null,null,{"$f":"IF(AND(C20=\"Terminé\",COUNTIF(B20,\"*Virement*\")),\"VIR\"&COUNTIF($V$7:V19,\"VIR*\"),IF(COUNTIF(B20,\"*Virement*\"),\"\",IF(COUNTIF($B$8:B20,B20)=1,\"_\"&\"AUTO\"&COUNTIF($V$7:V19,\"*AUTO*\"),\"\")))","v":""},"Virement__AA24","Jean-pierre"]
["2015-07-28","Pierrette",null,null,null,null,null,null,null,null,null,null,null,null,null,null,null,null,null,null,null,{"$f":"IF(AND(C21=\"Terminé\",COUNTIF(B21,\"*Virement*\")),\"VIR\"&COUNTIF($V$7:V20,\"VIR*\"),IF(COUNTIF(B21,\"*Virement*\"),\"\",IF(COUNTIF($B$8:B21,B21)=1,\"_\"&\"AUTO\"&COUNTIF($V$7:V20,\"*AUTO*\"),\"\")))","v":""},"Virement__AA22","Corinne"]
["2016-01-09","Chrystel",null,null,null,null,null,null,null,null,null,null,null,null,null,null,null,null,null,null,null,{"$f":"IF(AND(C22=\"Terminé\",COUNTIF(B22,\"*Virement*\")),\"VIR\"&COUNTIF($V$7:V21,\"VIR*\"),IF(COUNTIF(B22,\"*Virement*\"),\"\",IF(COUNTIF($B$8:B22,B22)=1,\"_\"&\"AUTO\"&COUNTIF($V$7:V21,\"*AUTO*\"),\"\")))","v":"_AUTO6"},"Virement__AA27","Ewan"]
["2015-11-26","Philippe",null,null,null,null,null,null,null,null,null,null,null,null,null,null,null,null,null,null,null,{"$f":"IF(AND(C23=\"Terminé\",COUNTIF(B23,\"*Virement*\")),\"VIR\"&COUNTIF($V$7:V22,\"VIR*\"),IF(COUNTIF(B23,\"*Virement*\"),\"\",IF(COUNTIF($B$8:B23,B23)=1,\"_\"&\"AUTO\"&COUNTIF($V$7:V22,\"*AUTO*\"),\"\")))","v":"_AUTO7"},"Virement__AA20","Renè"]
["2015-09-30","Virement__AA42","Rejeté",null,null,null,null,null,null,null,null,null,null,null,null,null,null,null,null,null,null,{"$f":"IF(AND(C24=\"Terminé\",COUNTIF(B24,\"*Virement*\")),\"VIR\"&COUNTIF($V$7:V23,\"VIR*\"),IF(COUNTIF(B24,\"*Virement*\"),\"\",IF(COUNTIF($B$8:B24,B24)=1,\"_\"&\"AUTO\"&COUNTIF($V$7:V23,\"*AUTO*\"),\"\")))","v":""},"Virement__AA50","Madeleine"]
["2015-12-13","Virement__AA14","Terminé",null,null,null,null,null,null,null,null,null,null,null,null,null,null,null,null,null,null,{"$f":"IF(AND(C25=\"Terminé\",COUNTIF(B25,\"*Virement*\")),\"VIR\"&COUNTIF($V$7:V24,\"VIR*\"),IF(COUNTIF(B25,\"*Virement*\"),\"\",IF(COUNTIF($B$8:B25,B25)=1,\"_\"&\"AUTO\"&COUNTIF($V$7:V24,\"*AUTO*\"),\"\")))","v":"VIR1"},"Virement__AA21","Michel"]
["2015-09-03","Eloide",null,null,null,null,null,null,null,null,null,null,null,null,null,null,null,null,null,null,null,{"$f":"IF(AND(C26=\"Terminé\",COUNTIF(B26,\"*Virement*\")),\"VIR\"&COUNTIF($V$7:V25,\"VIR*\"),IF(COUNTIF(B26,\"*Virement*\"),\"\",IF(COUNTIF($B$8:B26,B26)=1,\"_\"&\"AUTO\"&COUNTIF($V$7:V25,\"*AUTO*\"),\"\")))","v":"_AUTO8"},"Virement__AA31","Jaqueline"]
["2016-01-23","Monique",null,null,null,null,null,null,null,null,null,null,null,null,null,null,null,null,null,null,null,{"$f":"IF(AND(C27=\"Terminé\",COUNTIF(B27,\"*Virement*\")),\"VIR\"&COUNTIF($V$7:V26,\"VIR*\"),IF(COUNTIF(B27,\"*Virement*\"),\"\",IF(COUNTIF($B$8:B27,B27)=1,\"_\"&\"AUTO\"&COUNTIF($V$7:V26,\"*AUTO*\"),\"\")))","v":""},"Virement__AA67","Carla"]
["2015-09-26","Simone",null,null,null,null,null,null,null,null,null,null,null,null,null,null,null,null,null,null,null,{"$f":"IF(AND(C28=\"Terminé\",COUNTIF(B28,\"*Virement*\")),\"VIR\"&COUNTIF($V$7:V27,\"VIR*\"),IF(COUNTIF(B28,\"*Virement*\"),\"\",IF(COUNTIF($B$8:B28,B28)=1,\"_\"&\"AUTO\"&COUNTIF($V$7:V27,\"*AUTO*\"),\"\")))","v":"_AUTO9"},"Virement__AA60","Paul"]
["2015-10-28","André",null,null,null,null,null,null,null,null,null,null,null,null,null,null,null,null,null,null,null,{"$f":"IF(AND(C29=\"Terminé\",COUNTIF(B29,\"*Virement*\")),\"VIR\"&COUNTIF($V$7:V28,\"VIR*\"),IF(COUNTIF(B29,\"*Virement*\"),\"\",IF(COUNTIF($B$8:B29,B29)=1,\"_\"&\"AUTO\"&COUNTIF($V$7:V28,\"*AUTO*\"),\"\")))","v":"_AUTO10"},"Virement__AA55","Rémi"]
["2015-09-02","Virement__AA63","Terminé",null,null,null,null,null,null,null,null,null,null,null,null,null,null,null,null,null,null,{"$f":"IF(AND(C30=\"Terminé\",COUNTIF(B30,\"*Virement*\")),\"VIR\"&COUNTIF($V$7:V29,\"VIR*\"),IF(COUNTIF(B30,\"*Virement*\"),\"\",IF(COUNTIF($B$8:B30,B30)=1,\"_\"&\"AUTO\"&COUNTIF($V$7:V29,\"*AUTO*\"),\"\")))","v":"VIR2"},"Virement__AA23","Anne-Marie"]
["2015-08-22","Virement__AA12","Rejeté",null,null,null,null,null,null,null,null,null,null,null,null,null,null,null,null,null,null,{"$f":"IF(AND(C31=\"Terminé\",COUNTIF(B31,\"*Virement*\")),\"VIR\"&COUNTIF($V$7:V30,\"VIR*\"),IF(COUNTIF(B31,\"*Virement*\"),\"\",IF(COUNTIF($B$8:B31,B31)=1,\"_\"&\"AUTO\"&COUNTIF($V$7:V30,\"*AUTO*\"),\"\")))","v":""},"Virement__AA26","Marcel"]
["2015-11-18","Francette",null,null,null,null,null,null,null,null,null,null,null,null,null,null,null,null,null,null,null,{"$f":"IF(AND(C32=\"Terminé\",COUNTIF(B32,\"*Virement*\")),\"VIR\"&COUNTIF($V$7:V31,\"VIR*\"),IF(COUNTIF(B32,\"*Virement*\"),\"\",IF(COUNTIF($B$8:B32,B32)=1,\"_\"&\"AUTO\"&COUNTIF($V$7:V31,\"*AUTO*\"),\"\")))","v":"_AUTO11"},"Virement__AA36",""]
["2015-07-12","Simone",null,null,null,null,null,null,null,null,null,null,null,null,null,null,null,null,null,null,null,{"$f":"IF(AND(C33=\"Terminé\",COUNTIF(B33,\"*Virement*\")),\"VIR\"&COUNTIF($V$7:V32,\"VIR*\"),IF(COUNTIF(B33,\"*Virement*\"),\"\",IF(COUNTIF($B$8:B33,B33)=1,\"_\"&\"AUTO\"&COUNTIF($V$7:V32,\"*AUTO*\"),\"\")))","v":""},"Virement__AA54",""]
["2016-01-29","Pierrette",null,null,null,null,null,null,null,null,null,null,null,null,null,null,null,null,null,null,null,{"$f":"IF(AND(C34=\"Terminé\",COUNTIF(B34,\"*Virement*\")),\"VIR\"&COUNTIF($V$7:V33,\"VIR*\"),IF(COUNTIF(B34,\"*Virement*\"),\"\",IF(COUNTIF($B$8:B34,B34)=1,\"_\"&\"AUTO\"&COUNTIF($V$7:V33,\"*AUTO*\"),\"\")))","v":""},"Virement__AA08",""]
["2015-07-05","Patrick",null,null,null,null,null,null,null,null,null,null,null,null,null,null,null,null,null,null,null,{"$f":"IF(AND(C35=\"Terminé\",COUNTIF(B35,\"*Virement*\")),\"VIR\"&COUNTIF($V$7:V34,\"VIR*\"),IF(COUNTIF(B35,\"*Virement*\"),\"\",IF(COUNTIF($B$8:B35,B35)=1,\"_\"&\"AUTO\"&COUNTIF($V$7:V34,\"*AUTO*\"),\"\")))","v":""},"Virement__AA65",""]
["2015-05-24","Chrystel",null,null,null,null,null,null,null,null,null,null,null,null,null,null,null,null,null,null,null,{"$f":"IF(AND(C36=\"Terminé\",COUNTIF(B36,\"*Virement*\")),\"VIR\"&COUNTIF($V$7:V35,\"VIR*\"),IF(COUNTIF(B36,\"*Virement*\"),\"\",IF(COUNTIF($B$8:B36,B36)=1,\"_\"&\"AUTO\"&COUNTIF($V$7:V35,\"*AUTO*\"),\"\")))","v":""},"Virement__AA53",""]
["2015-05-23","Virement__AA48","Terminé",null,null,null,null,null,null,null,null,null,null,null,null,null,null,null,null,null,null,{"$f":"IF(AND(C37=\"Terminé\",COUNTIF(B37,\"*Virement*\")),\"VIR\"&COUNTIF($V$7:V36,\"VIR*\"),IF(COUNTIF(B37,\"*Virement*\"),\"\",IF(COUNTIF($B$8:B37,B37)=1,\"_\"&\"AUTO\"&COUNTIF($V$7:V36,\"*AUTO*\"),\"\")))","v":"VIR3"},"Virement__AA59",""]
["2015-09-06","Virement__AA51","Terminé",null,null,null,null,null,null,null,null,null,null,null,null,null,null,null,null,null,null,{"$f":"IF(AND(C38=\"Terminé\",COUNTIF(B38,\"*Virement*\")),\"VIR\"&COUNTIF($V$7:V37,\"VIR*\"),IF(COUNTIF(B38,\"*Virement*\"),\"\",IF(COUNTIF($B$8:B38,B38)=1,\"_\"&\"AUTO\"&COUNTIF($V$7:V37,\"*AUTO*\"),\"\")))","v":"VIR4"},"Virement__AA72",""]
["2015-09-08","Chrystel",null,null,null,null,null,null,null,null,null,null,null,null,null,null,null,null,null,null,null,{"$f":"IF(AND(C39=\"Terminé\",COUNTIF(B39,\"*Virement*\")),\"VIR\"&COUNTIF($V$7:V38,\"VIR*\"),IF(COUNTIF(B39,\"*Virement*\"),\"\",IF(COUNTIF($B$8:B39,B39)=1,\"_\"&\"AUTO\"&COUNTIF($V$7:V38,\"*AUTO*\"),\"\")))","v":""},"Virement__AA35",""]
["2015-08-13","André",null,null,null,null,null,null,null,null,null,null,null,null,null,null,null,null,null,null,null,{"$f":"IF(AND(C40=\"Terminé\",COUNTIF(B40,\"*Virement*\")),\"VIR\"&COUNTIF($V$7:V39,\"VIR*\"),IF(COUNTIF(B40,\"*Virement*\"),\"\",IF(COUNTIF($B$8:B40,B40)=1,\"_\"&\"AUTO\"&COUNTIF($V$7:V39,\"*AUTO*\"),\"\")))","v":""},"Virement__AA30",""]
["2015-06-08","Jean-pierre",null,null,null,null,null,null,null,null,null,null,null,null,null,null,null,null,null,null,null,{"$f":"IF(AND(C41=\"Terminé\",COUNTIF(B41,\"*Virement*\")),\"VIR\"&COUNTIF($V$7:V40,\"VIR*\"),IF(COUNTIF(B41,\"*Virement*\"),\"\",IF(COUNTIF($B$8:B41,B41)=1,\"_\"&\"AUTO\"&COUNTIF($V$7:V40,\"*AUTO*\"),\"\")))","v":"_AUTO12"},"Virement__AA09",""]
["2015-10-12","Virement__AA64","Rejeté",null,null,null,null,null,null,null,null,null,null,null,null,null,null,null,null,null,null,{"$f":"IF(AND(C42=\"Terminé\",COUNTIF(B42,\"*Virement*\")),\"VIR\"&COUNTIF($V$7:V41,\"VIR*\"),IF(COUNTIF(B42,\"*Virement*\"),\"\",IF(COUNTIF($B$8:B42,B42)=1,\"_\"&\"AUTO\"&COUNTIF($V$7:V41,\"*AUTO*\"),\"\")))","v":""},"Virement__AA49",""]
["2015-08-29","Eloide",null,null,null,null,null,null,null,null,null,null,null,null,null,null,null,null,null,null,null,{"$f":"IF(AND(C43=\"Terminé\",COUNTIF(B43,\"*Virement*\")),\"VIR\"&COUNTIF($V$7:V42,\"VIR*\"),IF(COUNTIF(B43,\"*Virement*\"),\"\",IF(COUNTIF($B$8:B43,B43)=1,\"_\"&\"AUTO\"&COUNTIF($V$7:V42,\"*AUTO*\"),\"\")))","v":""},"Virement__AA18",""]
["2015-05-26","Corinne",null,null,null,null,null,null,null,null,null,null,null,null,null,null,null,null,null,null,null,{"$f":"IF(AND(C44=\"Terminé\",COUNTIF(B44,\"*Virement*\")),\"VIR\"&COUNTIF($V$7:V43,\"VIR*\"),IF(COUNTIF(B44,\"*Virement*\"),\"\",IF(COUNTIF($B$8:B44,B44)=1,\"_\"&\"AUTO\"&COUNTIF($V$7:V43,\"*AUTO*\"),\"\")))","v":"_AUTO13"},"Virement__AA03",""]
["2015-07-02","Ewan",null,null,null,null,null,null,null,null,null,null,null,null,null,null,null,null,null,null,null,{"$f":"IF(AND(C45=\"Terminé\",COUNTIF(B45,\"*Virement*\")),\"VIR\"&COUNTIF($V$7:V44,\"VIR*\"),IF(COUNTIF(B45,\"*Virement*\"),\"\",IF(COUNTIF($B$8:B45,B45)=1,\"_\"&\"AUTO\"&COUNTIF($V$7:V44,\"*AUTO*\"),\"\")))","v":"_AUTO14"},"Virement__AA15",""]
["2015-11-17","Pierrette",null,null,null,null,null,null,null,null,null,null,null,null,null,null,null,null,null,null,null,{"$f":"IF(AND(C46=\"Terminé\",COUNTIF(B46,\"*Virement*\")),\"VIR\"&COUNTIF($V$7:V45,\"VIR*\"),IF(COUNTIF(B46,\"*Virement*\"),\"\",IF(COUNTIF($B$8:B46,B46)=1,\"_\"&\"AUTO\"&COUNTIF($V$7:V45,\"*AUTO*\"),\"\")))","v":""},"Virement__AA07",""]
["2015-08-05","Virement__AA71","Rejeté",null,null,null,null,null,null,null,null,null,null,null,null,null,null,null,null,null,null,{"$f":"IF(AND(C47=\"Terminé\",COUNTIF(B47,\"*Virement*\")),\"VIR\"&COUNTIF($V$7:V46,\"VIR*\"),IF(COUNTIF(B47,\"*Virement*\"),\"\",IF(COUNTIF($B$8:B47,B47)=1,\"_\"&\"AUTO\"&COUNTIF($V$7:V46,\"*AUTO*\"),\"\")))","v":""},"",""]
["2015-12-20","Chrystel",null,null,null,null,null,null,null,null,null,null,null,null,null,null,null,null,null,null,null,{"$f":"IF(AND(C48=\"Terminé\",COUNTIF(B48,\"*Virement*\")),\"VIR\"&COUNTIF($V$7:V47,\"VIR*\"),IF(COUNTIF(B48,\"*Virement*\"),\"\",IF(COUNTIF($B$8:B48,B48)=1,\"_\"&\"AUTO\"&COUNTIF($V$7:V47,\"*AUTO*\"),\"\")))","v":""},"",""]
["2015-08-04","Virement__AA19","Terminé",null,null,null,null,null,null,null,null,null,null,null,null,null,null,null,null,null,null,{"$f":"IF(AND(C49=\"Terminé\",COUNTIF(B49,\"*Virement*\")),\"VIR\"&COUNTIF($V$7:V48,\"VIR*\"),IF(COUNTIF(B49,\"*Virement*\"),\"\",IF(COUNTIF($B$8:B49,B49)=1,\"_\"&\"AUTO\"&COUNTIF($V$7:V48,\"*AUTO*\"),\"\")))","v":"VIR5"},"",""]
["2015-10-29","Léa",null,null,null,null,null,null,null,null,null,null,null,null,null,null,null,null,null,null,null,{"$f":"IF(AND(C50=\"Terminé\",COUNTIF(B50,\"*Virement*\")),\"VIR\"&COUNTIF($V$7:V49,\"VIR*\"),IF(COUNTIF(B50,\"*Virement*\"),\"\",IF(COUNTIF($B$8:B50,B50)=1,\"_\"&\"AUTO\"&COUNTIF($V$7:V49,\"*AUTO*\"),\"\")))","v":""},"",""]
["2015-06-25","Virement__AA40","Terminé",null,null,null,null,null,null,null,null,null,null,null,null,null,null,null,null,null,null,{"$f":"IF(AND(C51=\"Terminé\",COUNTIF(B51,\"*Virement*\")),\"VIR\"&COUNTIF($V$7:V50,\"VIR*\"),IF(COUNTIF(B51,\"*Virement*\"),\"\",IF(COUNTIF($B$8:B51,B51)=1,\"_\"&\"AUTO\"&COUNTIF($V$7:V50,\"*AUTO*\"),\"\")))","v":"VIR6"},"",""]
["2015-06-17","Virement__AA61","Terminé",null,null,null,null,null,null,null,null,null,null,null,null,null,null,null,null,null,null,{"$f":"IF(AND(C52=\"Terminé\",COUNTIF(B52,\"*Virement*\")),\"VIR\"&COUNTIF($V$7:V51,\"VIR*\"),IF(COUNTIF(B52,\"*Virement*\"),\"\",IF(COUNTIF($B$8:B52,B52)=1,\"_\"&\"AUTO\"&COUNTIF($V$7:V51,\"*AUTO*\"),\"\")))","v":"VIR7"},"",""]
["2015-07-16","Virement__AA45","En cours",null,null,null,null,null,null,null,null,null,null,null,null,null,null,null,null,null,null,{"$f":"IF(AND(C53=\"Terminé\",COUNTIF(B53,\"*Virement*\")),\"VIR\"&COUNTIF($V$7:V52,\"VIR*\"),IF(COUNTIF(B53,\"*Virement*\"),\"\",IF(COUNTIF($B$8:B53,B53)=1,\"_\"&\"AUTO\"&COUNTIF($V$7:V52,\"*AUTO*\"),\"\")))","v":""},"",""]
["2015-11-03","Renè",null,null,null,null,null,null,null,null,null,null,null,null,null,null,null,null,null,null,null,{"$f":"IF(AND(C54=\"Terminé\",COUNTIF(B54,\"*Virement*\")),\"VIR\"&COUNTIF($V$7:V53,\"VIR*\"),IF(COUNTIF(B54,\"*Virement*\"),\"\",IF(COUNTIF($B$8:B54,B54)=1,\"_\"&\"AUTO\"&COUNTIF($V$7:V53,\"*AUTO*\"),\"\")))","v":"_AUTO15"},"",""]
["2015-06-23","Virement__AA32","Terminé",null,null,null,null,null,null,null,null,null,null,null,null,null,null,null,null,null,null,{"$f":"IF(AND(C55=\"Terminé\",COUNTIF(B55,\"*Virement*\")),\"VIR\"&COUNTIF($V$7:V54,\"VIR*\"),IF(COUNTIF(B55,\"*Virement*\"),\"\",IF(COUNTIF($B$8:B55,B55)=1,\"_\"&\"AUTO\"&COUNTIF($V$7:V54,\"*AUTO*\"),\"\")))","v":"VIR8"},"",""]
["2015-07-25","Virement__AA77","Terminé",null,null,null,null,null,null,null,null,null,null,null,null,null,null,null,null,null,null,{"$f":"IF(AND(C56=\"Terminé\",COUNTIF(B56,\"*Virement*\")),\"VIR\"&COUNTIF($V$7:V55,\"VIR*\"),IF(COUNTIF(B56,\"*Virement*\"),\"\",IF(COUNTIF($B$8:B56,B56)=1,\"_\"&\"AUTO\"&COUNTIF($V$7:V55,\"*AUTO*\"),\"\")))","v":"VIR9"},"",""]
["2015-10-26","Virement__AA38","Rejeté",null,null,null,null,null,null,null,null,null,null,null,null,null,null,null,null,null,null,{"$f":"IF(AND(C57=\"Terminé\",COUNTIF(B57,\"*Virement*\")),\"VIR\"&COUNTIF($V$7:V56,\"VIR*\"),IF(COUNTIF(B57,\"*Virement*\"),\"\",IF(COUNTIF($B$8:B57,B57)=1,\"_\"&\"AUTO\"&COUNTIF($V$7:V56,\"*AUTO*\"),\"\")))","v":""},"",""]
["2015-11-20","Madeleine",null,null,null,null,null,null,null,null,null,null,null,null,null,null,null,null,null,null,null,{"$f":"IF(AND(C58=\"Terminé\",COUNTIF(B58,\"*Virement*\")),\"VIR\"&COUNTIF($V$7:V57,\"VIR*\"),IF(COUNTIF(B58,\"*Virement*\"),\"\",IF(COUNTIF($B$8:B58,B58)=1,\"_\"&\"AUTO\"&COUNTIF($V$7:V57,\"*AUTO*\"),\"\")))","v":"_AUTO16"},"",""]
["2015-11-25","Pierrette",null,null,null,null,null,null,null,null,null,null,null,null,null,null,null,null,null,null,null,{"$f":"IF(AND(C59=\"Terminé\",COUNTIF(B59,\"*Virement*\")),\"VIR\"&COUNTIF($V$7:V58,\"VIR*\"),IF(COUNTIF(B59,\"*Virement*\"),\"\",IF(COUNTIF($B$8:B59,B59)=1,\"_\"&\"AUTO\"&COUNTIF($V$7:V58,\"*AUTO*\"),\"\")))","v":""},"",""]
["2015-07-22","Michel",null,null,null,null,null,null,null,null,null,null,null,null,null,null,null,null,null,null,null,{"$f":"IF(AND(C60=\"Terminé\",COUNTIF(B60,\"*Virement*\")),\"VIR\"&COUNTIF($V$7:V59,\"VIR*\"),IF(COUNTIF(B60,\"*Virement*\"),\"\",IF(COUNTIF($B$8:B60,B60)=1,\"_\"&\"AUTO\"&COUNTIF($V$7:V59,\"*AUTO*\"),\"\")))","v":"_AUTO17"},"",""]
{"$rows_left_out":1034}
{"sheet":"Virement","index":1,"n_rows":10,"n_cols":4,"rows_kept":10,"cut":false,"hidden":false,"merged":[]}
[null,null,null,"B5:B1000 nommé \"date\""]
[null,null,null,"A4:A1000 nommé  \"noms\""]
["Validation (liste = VIR)","Date"]
["Virement__AA66",{"$f":"IFERROR(INDEX(BdD!$A:$A,MATCH(A4,BdD!$B:$B,0)),\"\")","v":"2015-12-03"}]
["Virement__AA43",{"$f":"IFERROR(INDEX(BdD!$A:$A,MATCH(A5,BdD!$B:$B,0)),\"\")","v":"2015-10-11"}]
["Virement__AA48",{"$f":"IFERROR(INDEX(BdD!$A:$A,MATCH(A6,BdD!$B:$B,0)),\"\")","v":"2015-05-23"}]
[null,{"$f":"IFERROR(INDEX(BdD!$A:$A,MATCH(A7,BdD!$B:$B,0)),\"\")","v":""}]
[null,{"$f":"IFERROR(INDEX(BdD!$A:$A,MATCH(A8,BdD!$B:$B,0)),\"\")","v":""}]
[null,{"$f":"IFERROR(INDEX(BdD!$A:$A,MATCH(A9,BdD!$B:$B,0)),\"\")","v":""}]
[null,{"$f":"IFERROR(INDEX(BdD!$A:$A,MATCH(A10,BdD!$B:$B,0)),\"\")","v":""}]

{"sheet":"Autres","index":2,"n_rows":4,"n_cols":3,"rows_kept":4,"cut":false,"hidden":false,"merged":[]}
[null,null,"B5:B1000 nommé \"dates\""]
[null,null,"A5:A1000 nommé  \"noms\""]
[null,null,"la cellule C4 sert à la confirmation de l'enregsitrement"]
[null,{"$f":"IF(A4=\"\",\"\",MAX(IF(BdD!B:B=A4,BdD!A:A)))","v":""},{"$f":"IF($A$4=\"\",\"\",IF(MAX(IF(noms=A4,dates))=B4,\"KO\",\"OK\"))","v":""}]